{"text_format":"1","workbook":"xlsx","n_sheets":3,"sheets":["Liste des factures","Générateur saisie de CA","BDD comptes auxiliaires"],"not_rendered":{"charts":0,"images":0,"macros":1,"external_links":1,"defined_names":2,"comments":1,"pivot_tables":0},"unopened":[],"bounds":{"document_bytes":16777216,"sheet_cells":100000,"rows_first":2000,"rows_last":500,"rows_between":2000,"halvings":0,"cell_chars":16384,"cell_head_chars":4096},"cells_cut":0,"cells_raw":0,"read":"whole","date_system":"1900"}

{"sheet":"Liste des factures","index":0,"n_rows":181,"n_cols":12,"rows_kept":181,"cut":false,"hidden":false,"merged":[[0,0,0,3]]}
["Liste des factures Neuilly",null,null,null,"Année 2017"]
[]
["N°Facture","Document","Client","Période","Date","Montant ","Statut","Mode de paiement","Moyen"]
["1701NE01","- Facture -","CLIENT 1","T1 2017","2017-01-10",1,"Payée","virement"]
["1701NE02","- Facture -","CLIENT 2","2017-01-01","2017-01-01",2,"Payée","Prélèvement"]
["1701NE03","- Facture -","CLIENT 3","2017-01-01","2017-01-01",3,"Payée","Prélèvement"]
["1701NE04","- Facture -","CLIENT 4","T1 2017","T1 2017",4,"Payée","virement"]
["1701NE05","- Facture -","CLIENT 5","T1 2017","T1 2017",5,"Payée","Prélèvement"]
["1701NE06","- Facture -","CLIENT 6","2017-01-01","2017-01-01",6,"Payée","Prélèvement"]
["1701NE07","- Facture -","CLIENT 7","2017-01-01","2017-01-01",7,"Payée","Prélèvement"]
["1701NE08","- Facture -","CLIENT 8","T1 2017","T1 2017",8,"Payée","virement"]
["1701NE09","- Facture -","CLIENT 9","T1 2017","T1 2017",9,"Payée","Prélèvement"]
["1701NE10","- Facture -","CLIENT 10","Année 2017","Année 2017",10,"Payée","chèque"]
["1701NE11","- Facture -","CLIENT 11","2017-01-01","2017-01-01",11,"Payée","Prélèvement"]
["1701NE12","- Facture -","CLIENT 12","2017-03-01","2017-03-01",12,"Payée","Prélèvement"]
["1702NE01","- Facture -","CLIENT 13","2017-02-01","2017-02-10",13,"Payée","Prélèvement"]
["1702NE02","- Facture -","CLIENT 14","2017-02-01","2017-02-10",14,"Payée","Prélèvement"]
["1702NE03","- Facture -","CLIENT 15","2017-02-01","2017-02-10",15,"Payée","Prélèvement"]
["1702NE04","- Facture -","CLIENT 16","2017-02-01","2017-02-10",16,"Payée","Prélèvement"]
["1702NE05","- Facture -","CLIENT 17","2017-02-01","2017-02-10",17,"Payée","Prélèvement"]
["1703NE01","- Facture -","CLIENT 18","2017-03-01","2017-03-10",18,"Payée","Prélèvement"]
["1703NE02","- Facture -","CLIENT 19","2017-03-01","2017-03-10",19,"Payée","Prélèvement"]
["1703NE03","- Facture -","CLIENT 20","2017-03-01","2017-03-10",20,"Payée","Prélèvement"]
["1703NE04","- Facture -","CLIENT 21","2017-03-01","2017-03-10",21,"Payée","Prélèvement"]
["1703NE05","- Facture -","CLIENT 22","2017-03-01","2017-03-10",22,"Payée","Prélèvement"]
["1703NE06","- Facture -","CLIENT 23","2017-03-01","2017-03-10",23,"Payée","Prélèvement"]
["1704NE01","- Facture -","CLIENT 24","T2 2017","2017-04-10",24,"Payée","virement"]
["1704NE02","- Facture -","CLIENT 25","T2 2017","2017-04-10",25,"Payée","virement"]
["1704NE03","- Facture -","CLIENT 26","2017-04-01","2017-04-10",26,"Payée","Prélèvement"]
["1704NE04","- Facture -","CLIENT 27","T2 2017","2017-04-10",27,"Payée","virement"]
["1704NE05","- Facture -","CLIENT 28","2017-04-01","2017-04-10",28,"Payée","Prélèvement"]
["1704NE06","- Facture -","CLIENT 29","T2 2017","2017-04-10",29,"Payée","Prélèvement"]
["1704NE07","- Facture -","CLIENT 30","2017-04-01","2017-04-10",30,"Payée","Prélèvement"]
["1704NE08","- Facture -","CLIENT 31","2017-04-01","2017-04-10",31,"Payée","Prélèvement"]
["1704NE09","- Facture -","CLIENT 32","T2 2017","2017-04-10",32,"Payée","Prélèvement"]
["1704NE10","- Facture -","CLIENT 33","2017-04-01","2017-04-10",33,"Payée","Prélèvement"]
["1704NE11","- Facture -","CLIENT 34","2017-04-01","2017-04-10",34,"Payée","Prélèvement"]
["1704NE12","- Facture -","CLIENT 35","2017-04-01","2017-04-10",35,"Payée","Prélèvement"]
["1705NE01","- Facture -","CLIENT 36","2017-05-01","2017-05-10",36,"Payée","Prélèvement"]
["1705NE02","- Facture -","CLIENT 37","2017-05-01","2017-05-10",37,"Payée",{"$f":"VLOOKUP(C40,$C$4:$H39,6,FALSE)","v":{"$error":"#N/A"}}]
["1705NE03","- Facture -","CLIENT 38","2017-05-01","2017-05-10",38,"Payée",{"$f":"VLOOKUP(C41,$C$4:$H40,6,FALSE)","v":{"$error":"#N/A"}}]
["1705NE04","- Facture -","CLIENT 39","2017-05-01","2017-05-10",39,"Payée",{"$f":"VLOOKUP(C42,$C$4:$H41,6,FALSE)","v":{"$error":"#N/A"}}]
["1705NE05","- Facture -","CLIENT 40","2017-09-01","2017-05-10",40,"Payée","Prélèvement"]
["1705NE06","- Facture -","CLIENT 41","2017-05-01","2017-05-10",41,"Payée",{"$f":"VLOOKUP(C44,$C$4:$H43,6,FALSE)","v":{"$error":"#N/A"}}]
["1705NE07","- Facture -","CLIENT 42","2017-05-01","2017-05-10",42,"Payée",{"$f":"VLOOKUP(C45,$C$4:$H44,6,FALSE)","v":{"$error":"#N/A"}}]
["1705NE08","- Facture -","CLIENT 43","2017-05-01","2017-05-10",43,"Payée",{"$f":"VLOOKUP(C46,$C$4:$H45,6,FALSE)","v":{"$error":"#N/A"}}]
["1705NE09","- Facture -","CLIENT 44","2017-05-01","2017-05-10",44,"Payée",{"$f":"VLOOKUP(C47,$C$4:$H46,6,FALSE)","v":{"$error":"#N/A"}}]
["1706NE01","- Facture -","CLIENT 45","T1 et T2 2017","2017-06-13",45,"envoyée","virement"]
["1706NE02","- Facture -","CLIENT 46","2017-06-01","2017-06-10",46,"Payée",{"$f":"VLOOKUP(C49,$C$4:$H48,6,FALSE)","v":{"$error":"#N/A"}},"PRLVT LE 27/6/17"]
["1706NE03","- Facture -","CLIENT 47","2017-06-01","2017-06-10",47,"Payée",{"$f":"VLOOKUP(C50,$C$4:$H49,6,FALSE)","v":{"$error":"#N/A"}},"PRLVT LE 27/6/17"]
["1706NE04","- Facture -","CLIENT 48","2017-06-01","2017-06-10",48,"Payée",{"$f":"VLOOKUP(C51,$C$4:$H50,6,FALSE)","v":{"$error":"#N/A"}},"PRLVT LE 27/6/17"]
["1706NE05","- Facture -","CLIENT 49","2017-06-01","2017-06-10",49,"Payée",{"$f":"VLOOKUP(C52,$C$4:$H51,6,FALSE)","v":{"$error":"#N/A"}},"PRLVT LE 27/6/17",null,"total a fin avril",{"$f":"SUM(F4:F38)","v":630}]
["1706NE06","- Facture -","CLIENT 50","2017-06-01","2017-06-10",50,"Payée",{"$f":"VLOOKUP(C53,$C$4:$H52,6,FALSE)","v":{"$error":"#N/A"}},"PRLVT LE 27/6/17"]
["1706NE07","- Facture -","CLIENT 51","2017-06-01","2017-06-10",51,"Payée",{"$f":"VLOOKUP(C54,$C$4:$H53,6,FALSE)","v":{"$error":"#N/A"}},"PRLVT LE 27/6/17"]
["1706NE08","- Facture -","CLIENT 52","2017-06-01","2017-06-10",52,"Payée",{"$f":"VLOOKUP(C55,$C$4:$H54,6,FALSE)","v":{"$error":"#N/A"}},"PRLVT LE 27/6/17"]
["1706NE09","- Facture -","CLIENT 53","ACOMPTE 09/17","2017-06-10",53,"Payée","virement","viré le 01/8/17"]
["1706NE10","- Facture -","CLIENT 54","ACOMPTE 09/17","2017-06-10",54,"Payée","Prélèvement","PRLVT LE 27/6/17"]
["1706NE11","- Facture -","CLIENT 55","2017-06-01","2017-06-10",55,"Payée",{"$f":"VLOOKUP(C58,$C$4:$H57,6,FALSE)","v":{"$error":"#N/A"}},"PRLVT LE 27/6/17"]
["1707NE01","- Facture -","CLIENT 56","T3 2017","2017-07-10",56,"Payée",{"$f":"VLOOKUP(C59,$C$4:$H58,6,FALSE)","v":{"$error":"#N/A"}},"viré 3000€ le 31/8/17"]
["1707NE02","- Facture -","CLIENT 57","Acompte Septembre - Octobre 2017","2017-07-10",57,"Payée","chèque","Chèque déposé le 15/7/17"]
["1707NE03","- Facture -","CLIENT 58","T3 2017","2017-07-10",58,"Payée",{"$f":"VLOOKUP(C61,$C$4:$H60,6,FALSE)","v":{"$error":"#N/A"}},"VIRE LE 12/9/17"]
["1707NE04","- Facture -","CLIENT 59","2017-07-01","2017-07-10",59,"Payée",{"$f":"VLOOKUP(C62,$C$4:$H61,6,FALSE)","v":{"$error":"#N/A"}},"PRLVE LE 28/7/17"]
["1707NE05","- Facture -","CLIENT 60","2017-07-01","2017-07-10",60,"Payée",{"$f":"VLOOKUP(C63,$C$4:$H62,6,FALSE)","v":{"$error":"#N/A"}},"PRLVE LE 28/7/17"]
["1707NE06","- Facture -","CLIENT 61","Acompte Août - Septembre 2017","2017-07-10",61,"Payée","Prélèvement","PRLVE LE 28/7/17"]
["1707NE07","- Facture -","CLIENT 62","T3 2017","2017-07-10",62,"Payée",{"$f":"VLOOKUP(C65,$C$4:$H64,6,FALSE)","v":{"$error":"#N/A"}},"viré le 31/8/17"]
["1707NE08","- Facture -","CLIENT 63","Acompte Février 2018","2017-07-10",63,"Payée","Prélèvement","PRLVE LE 28/7/17"]
["1707NE09","- Facture -","CLIENT 64","2017-07-01","2017-07-10",64,"Payée","Prélèvement","PRLVE LE 28/7/17"]
["1707NE10","- Facture -","CLIENT 65","T3 2017","2017-07-10",65,"Payée","Prélèvement","PRLVE LE 28/7/17"]
["1707NE11","- Facture -","CLIENT 66","2017-07-01","2017-07-10",66,"Payée","Prélèvement","PRLVE LE 28/7/17"]
["1707NE12","- Facture -","CLIENT 67","2017-07-01","2017-07-10",67,"Payée","Prélèvement","PRLVE LE 28/7/17"]
["1707NE13","- Facture -","CLIENT 68","2017-07-01","2017-07-10",68,"envoyée",{"$f":"VLOOKUP(C71,$C$4:$H70,6,FALSE)","v":{"$error":"#N/A"}},"rejeté le 28/7-reprélevé le 15/9-rerejeté le 18/9"]
["1707NE14","- Facture -","CLIENT 69","2017-07-01","2017-07-10",69,"Payée","Prélèvement","PRLVE LE 28/7/17"]
["1707NE15","- Facture -","CLIENT 70","T3 2017","2017-07-10",70,"Payée","Prélèvement","PRLVE LE 28/7/17"]
["1707NE16","- Facture -","CLIENT 71","Acompte Octobre - Novembre 2017","2017-07-10",71,"Payée","Prélèvement","PRLVE LE 28/7/17"]
["1707NE17","- Facture -","CLIENT 72","Mai à Juillet 2017","2017-07-10",72,"Payée","Prélèvement","PRLVE LE 28/7/17"]
["1707NE18","- Facture -","CLIENT 73","Mai à Septembre 2017","2017-07-10",73,"Payée","Prélèvement","PRLVE LE 28/7/17"]
["1707NE19","- Facture -","CLIENT 74","Acompte Août - Septembre 2017","2017-07-10",74,"Payée","Prélèvement","PRLVE LE 28/7/17"]
["1707NE20","- Facture -","CLIENT 75","2017-07-01","2017-07-10",75,"Payée","Prélèvement","PRLVE LE 28/7/17"]
["1707NE21","- Facture -","CLIENT 76","Acompte Octobre 2017","2017-07-10",76,"Payée",{"$f":"VLOOKUP(C79,$C$4:$H78,6,FALSE)","v":{"$error":"#N/A"}},"PRLVE LE 28/7/17"]
["1707NE22","- Avoir -","CLIENT 77","Avoir sur 1707NE01 pour annuler SEPT","2017-07-10",77,"Payée",{"$f":"VLOOKUP(C80,$C$4:$H79,6,FALSE)","v":{"$error":"#N/A"}},"viré 3000€ le 31/8/17"]
{"$rows_left_out":102}
{"sheet":"Générateur saisie de CA","index":1,"n_rows":177,"n_cols":17,"rows_kept":177,"cut":false,"hidden":false,"merged":[]}
["Contrepartie auto","Jounal","Compte Général","Compte Auxiliaire","Référence","Libellé","Débit","Crédit","CONCATENER","N°Facture","Document","Client","Période","Date","Montant ","Statut","Mode de paiement"]
[null,"VEN",411000,{"$f":"VLOOKUP(L2,'[1]BDD comptes auxiliaires'!$A$1:$B$171,2,FALSE)","v":{"$error":"#N/A"}},{"$f":"CONCATENATE(M2,I2,J2)","v":" - "},{"$f":"L2","v":0},{"$f":"O2","v":0},null," - "]
["CONTREPARTIE","VEN",706001,null," - ",{"$f":"L3","v":0},null,{"$f":"O3","v":0}," - "]
[null,"VEN",411000,{"$f":"VLOOKUP(L4,'[1]BDD comptes auxiliaires'!$A$1:$B$171,2,FALSE)","v":{"$error":"#N/A"}}," - ",0,{"$f":"O4","v":0},null," - "]
["CONTREPARTIE","VEN",706001,null," - ",0,null,{"$f":"O5","v":0}," - "]
[null,"VEN",411000,{"$f":"VLOOKUP(L6,'[1]BDD comptes auxiliaires'!$A$1:$B$171,2,FALSE)","v":{"$error":"#N/A"}}," - ",0,{"$f":"O6","v":0},null," - "]
["CONTREPARTIE","VEN",706001,null," - ",0,null,{"$f":"O7","v":0}," - "]
[null,"VEN",411000,{"$f":"VLOOKUP(L8,'[1]BDD comptes auxiliaires'!$A$1:$B$171,2,FALSE)","v":{"$error":"#N/A"}}," - ",0,{"$f":"O8","v":0},null," - "]
["CONTREPARTIE","VEN",706001,null," - ",0,null,{"$f":"O9","v":0}," - "]
[null,"VEN",411000,{"$f":"VLOOKUP(L10,'[1]BDD comptes auxiliaires'!$A$1:$B$171,2,FALSE)","v":{"$error":"#N/A"}}," - ",0,{"$f":"O10","v":0},null," - "]
["CONTREPARTIE","VEN",706001,null," - ",0,null,{"$f":"O11","v":0}," - "]
[null,"VEN",411000,{"$f":"VLOOKUP(L12,'[1]BDD comptes auxiliaires'!$A$1:$B$171,2,FALSE)","v":{"$error":"#N/A"}}," - ",0,{"$f":"O12","v":0},null," - "]
["CONTREPARTIE","VEN",706001,null," - ",0,null,{"$f":"O13","v":0}," - "]
[null,"VEN",411000,{"$f":"VLOOKUP(L14,'[1]BDD comptes auxiliaires'!$A$1:$B$171,2,FALSE)","v":{"$error":"#N/A"}}," - ",0,{"$f":"O14","v":0},null," - "]
["CONTREPARTIE","VEN",706001,null," - ",0,null,{"$f":"O15","v":0}," - "]
[null,"VEN",411000,{"$f":"VLOOKUP(L16,'[1]BDD comptes auxiliaires'!$A$1:$B$171,2,FALSE)","v":{"$error":"#N/A"}}," - ",0,{"$f":"O16","v":0},null," - "]
["CONTREPARTIE","VEN",706001,null," - ",0,null,{"$f":"O17","v":0}," - "]
[null,"VEN",411000,{"$f":"VLOOKUP(L18,'[1]BDD comptes auxiliaires'!$A$1:$B$171,2,FALSE)","v":{"$error":"#N/A"}}," - ",0,{"$f":"O18","v":0},null," - "]
["CONTREPARTIE","VEN",706001,null," - ",0,null,{"$f":"O19","v":0}," - "]
[null,"VEN",411000,{"$f":"VLOOKUP(L20,'[1]BDD comptes auxiliaires'!$A$1:$B$171,2,FALSE)","v":{"$error":"#N/A"}}," - ",0,{"$f":"O20","v":0},null," - "]
["CONTREPARTIE","VEN",706001,null," - ",0,null,{"$f":"O21","v":0}," - "]
[null,"VEN",411000,{"$f":"VLOOKUP(L22,'[1]BDD comptes auxiliaires'!$A$1:$B$171,2,FALSE)","v":{"$error":"#N/A"}}," - ",0,{"$f":"O22","v":0},null," - "]
["CONTREPARTIE","VEN",706001,null," - ",0,null,{"$f":"O23","v":0}," - "]
[null,"VEN",411000,{"$f":"VLOOKUP(L24,'[1]BDD comptes auxiliaires'!$A$1:$B$171,2,FALSE)","v":{"$error":"#N/A"}}," - ",0,{"$f":"O24","v":0},null," - "]
["CONTREPARTIE","VEN",706001,null," - ",0,null,{"$f":"O25","v":0}," - "]
[null,"VEN",411000,{"$f":"VLOOKUP(L26,'[1]BDD comptes auxiliaires'!$A$1:$B$171,2,FALSE)","v":{"$error":"#N/A"}}," - ",0,{"$f":"O26","v":0},null," - "]
["CONTREPARTIE","VEN",706001,null," - ",0,null,{"$f":"O27","v":0}," - "]
[null,"VEN",411000,{"$f":"VLOOKUP(L28,'[1]BDD comptes auxiliaires'!$A$1:$B$171,2,FALSE)","v":{"$error":"#N/A"}}," - ",0,{"$f":"O28","v":0},null," - "]
["CONTREPARTIE","VEN",706001,null," - ",0,null,{"$f":"O29","v":0}," - "]
[null,"VEN",411000,{"$f":"VLOOKUP(L30,'[1]BDD comptes auxiliaires'!$A$1:$B$171,2,FALSE)","v":{"$error":"#N/A"}}," - ",0,{"$f":"O30","v":0},null," - "]
["CONTREPARTIE","VEN",706001,null," - ",0,null,{"$f":"O31","v":0}," - "]
[null,"VEN",411000,{"$f":"VLOOKUP(L32,'[1]BDD comptes auxiliaires'!$A$1:$B$171,2,FALSE)","v":{"$error":"#N/A"}}," - ",0,{"$f":"O32","v":0},null," - "]
["CONTREPARTIE","VEN",706001,null," - ",0,null,{"$f":"O33","v":0}," - "]
[null,"VEN",411000,{"$f":"VLOOKUP(L34,'[1]BDD comptes auxiliaires'!$A$1:$B$171,2,FALSE)","v":{"$error":"#N/A"}}," - ",0,{"$f":"O34","v":0},null," - "]
["CONTREPARTIE","VEN",706001,null," - ",0,null,{"$f":"O35","v":0}," - "]
[null,"VEN",411000,{"$f":"VLOOKUP(L36,'[1]BDD comptes auxiliaires'!$A$1:$B$171,2,FALSE)","v":{"$error":"#N/A"}}," - ",0,{"$f":"O36","v":0},null," - "]
["CONTREPARTIE","VEN",706001,null," - ",0,null,{"$f":"O37","v":0}," - "]
[null,"VEN",411000,{"$f":"VLOOKUP(L38,'[1]BDD comptes auxiliaires'!$A$1:$B$171,2,FALSE)","v":{"$error":"#N/A"}}," - ",0,{"$f":"O38","v":0},null," - "]
["CONTREPARTIE","VEN",706001,null," - ",0,null,{"$f":"O39","v":0}," - "]
[null,"VEN",411000,{"$f":"VLOOKUP(L40,'[1]BDD comptes auxiliaires'!$A$1:$B$171,2,FALSE)","v":{"$error":"#N/A"}}," - ",0,{"$f":"O40","v":0},null," - "]
["CONTREPARTIE","VEN",706001,null," - ",0,null,{"$f":"O41","v":0}," - "]
[null,"VEN",411000,{"$f":"VLOOKUP(L42,'[1]BDD comptes auxiliaires'!$A$1:$B$171,2,FALSE)","v":{"$error":"#N/A"}}," - ",0,{"$f":"O42","v":0},null," - "]
["CONTREPARTIE","VEN",706001,null," - ",0,null,{"$f":"O43","v":0}," - "]
[null,"VEN",411000,{"$f":"VLOOKUP(L44,'[1]BDD comptes auxiliaires'!$A$1:$B$171,2,FALSE)","v":{"$error":"#N/A"}}," - ",0,{"$f":"O44","v":0},null," - "]
["CONTREPARTIE","VEN",706001,null," - ",0,null,{"$f":"O45","v":0}," - "]
[null,"VEN",411000,{"$f":"VLOOKUP(L46,'[1]BDD comptes auxiliaires'!$A$1:$B$171,2,FALSE)","v":{"$error":"#N/A"}}," - ",0,{"$f":"O46","v":0},null," - "]
["CONTREPARTIE","VEN",706001,null," - ",0,null,{"$f":"O47","v":0}," - "]
[null,"VEN",411000,{"$f":"VLOOKUP(L48,'[1]BDD comptes auxiliaires'!$A$1:$B$171,2,FALSE)","v":{"$error":"#N/A"}}," - ",0,{"$f":"O48","v":0},null," - "]
["CONTREPARTIE","VEN",706001,null," - ",0,null,{"$f":"O49","v":0}," - "]
[null,"VEN",411000,{"$f":"VLOOKUP(L50,'[1]BDD comptes auxiliaires'!$A$1:$B$171,2,FALSE)","v":{"$error":"#N/A"}}," - ",0,{"$f":"O50","v":0},null," - "]
["CONTREPARTIE","VEN",706001,null," - ",0,null,{"$f":"O51","v":0}," - "]
[null,"VEN",411000,{"$f":"VLOOKUP(L52,'[1]BDD comptes auxiliaires'!$A$1:$B$171,2,FALSE)","v":{"$error":"#N/A"}}," - ",0,{"$f":"O52","v":0},null," - "]
["CONTREPARTIE","VEN",706001,null," - ",0,null,{"$f":"O53","v":0}," - "]
[null,"VEN",411000,{"$f":"VLOOKUP(L54,'[1]BDD comptes auxiliaires'!$A$1:$B$171,2,FALSE)","v":{"$error":"#N/A"}}," - ",0,{"$f":"O54","v":0},null," - "]
["CONTREPARTIE","VEN",706001,null," - ",0,null,{"$f":"O55","v":0}," - "]
[null,"VEN",411000,{"$f":"VLOOKUP(L56,'[1]BDD comptes auxiliaires'!$A$1:$B$171,2,FALSE)","v":{"$error":"#N/A"}}," - ",0,{"$f":"O56","v":0},null," - "]
["CONTREPARTIE","VEN",706001,null," - ",0,null,{"$f":"O57","v":0}," - "]
[null,"VEN",411000,{"$f":"VLOOKUP(L58,'[1]BDD comptes auxiliaires'!$A$1:$B$171,2,FALSE)","v":{"$error":"#N/A"}}," - ",0,{"$f":"O58","v":0},null," - "]
["CONTREPARTIE","VEN",706001,null," - ",0,null,{"$f":"O59","v":0}," - "]
[null,"VEN",411000,{"$f":"VLOOKUP(L60,'[1]BDD comptes auxiliaires'!$A$1:$B$171,2,FALSE)","v":{"$error":"#N/A"}}," - ",0,{"$f":"O60","v":0},null," - "]
["CONTREPARTIE","VEN",706001,null," - ",0,null,{"$f":"O61","v":0}," - "]
[null,"VEN",411000,{"$f":"VLOOKUP(L62,'[1]BDD comptes auxiliaires'!$A$1:$B$171,2,FALSE)","v":{"$error":"#N/A"}}," - ",0,{"$f":"O62","v":0},null," - "]
["CONTREPARTIE","VEN",706001,null," - ",0,null,{"$f":"O63","v":0}," - "]
[null,"VEN",411000,{"$f":"VLOOKUP(L64,'[1]BDD comptes auxiliaires'!$A$1:$B$171,2,FALSE)","v":{"$error":"#N/A"}}," - ",0,{"$f":"O64","v":0},null," - "]
["CONTREPARTIE","VEN",706001,null," - ",0,null,{"$f":"O65","v":0}," - "]
[null,"VEN",411000,{"$f":"VLOOKUP(L66,'[1]BDD comptes auxiliaires'!$A$1:$B$171,2,FALSE)","v":{"$error":"#N/A"}},{"$f":"CONCATENATE(M66,I66,J66)","v":" - "},0,{"$f":"O66","v":0},null," - "]
["CONTREPARTIE","VEN",706001,null," - ",{"$f":"L67","v":0},null,{"$f":"O67","v":0}," - "]
[null,"VEN",411000,{"$f":"VLOOKUP(L68,'[1]BDD comptes auxiliaires'!$A$1:$B$171,2,FALSE)","v":{"$error":"#N/A"}}," - ",0,{"$f":"O68","v":0},null," - "]
["CONTREPARTIE","VEN",706001,null," - ",0,null,{"$f":"O69","v":0}," - "]
[null,"VEN",411000,{"$f":"VLOOKUP(L70,'[1]BDD comptes auxiliaires'!$A$1:$B$171,2,FALSE)","v":{"$error":"#N/A"}}," - ",0,{"$f":"O70","v":0},null," - "]
["CONTREPARTIE","VEN",706001,null," - ",0,null,{"$f":"O71","v":0}," - "]
[null,"VEN",411000,{"$f":"VLOOKUP(L72,'[1]BDD comptes auxiliaires'!$A$1:$B$171,2,FALSE)","v":{"$error":"#N/A"}}," - ",0,{"$f":"O72","v":0},null," - "]
["CONTREPARTIE","VEN",706001,null," - ",0,null,{"$f":"O73","v":0}," - "]
[null,"VEN",411000,{"$f":"VLOOKUP(L74,'[1]BDD comptes auxiliaires'!$A$1:$B$171,2,FALSE)","v":{"$error":"#N/A"}}," - ",0,{"$f":"O74","v":0},null," - "]
["CONTREPARTIE","VEN",706001,null," - ",0,null,{"$f":"O75","v":0}," - "]
[null,"VEN",411000,{"$f":"VLOOKUP(L76,'[1]BDD comptes auxiliaires'!$A$1:$B$171,2,FALSE)","v":{"$error":"#N/A"}}," - ",0,{"$f":"O76","v":0},null," - "]
["CONTREPARTIE","VEN",706001,null," - ",0,null,{"$f":"O77","v":0}," - "]
[null,"VEN",411000,{"$f":"VLOOKUP(L78,'[1]BDD comptes auxiliaires'!$A$1:$B$171,2,FALSE)","v":{"$error":"#N/A"}}," - ",0,{"$f":"O78","v":0},null," - "]
["CONTREPARTIE","VEN",706001,null," - ",0,null,{"$f":"O79","v":0}," - "]
[null,"VEN",411000,{"$f":"VLOOKUP(L80,'[1]BDD comptes auxiliaires'!$A$1:$B$171,2,FALSE)","v":{"$error":"#N/A"}}," - ",0,{"$f":"O80","v":0},null," - "]
{"$rows_left_out":98}
{"sheet":"BDD comptes auxiliaires","index":2,"n_rows":44,"n_cols":6,"rows_kept":44,"cut":false,"hidden":false,"merged":[]}
["Nom","Auxiliaire","Code EAN","Postal","Ville","Nature"]
["ADD UP CONSULTING","CADD00","","","","CLI"]
["AMET","CAMET0","","","","CLI"]
["AQUARELLE","CAQUA0","","","","CLI"]
["Client attente","CATTEN","","","","CLI"]
["Prof Liberal Dr BARON","CBARON","","","","CLI"]
["BEES CONSEIL","CBEES0","","","","CLI"]
["SELARL BIACABE Bernard","CBIAC0","","","","CLI"]
["BJ TEX","CBJT00","","","","CLI"]
["BUSINESS EQUITIES","CBUSI0","","","","CLI"]
["CRECHES DE FRANCE","CCDF00","","","","CLI"]
["CITY ACCESS","CCIT00","","","","CLI"]
["COMPTOIR EUROPEEN ELECTRICITE","CCOMP0","","","","CLI"]
["SAS DDB ARCHITECTURE","CDDBA0","","","","CLI"]
["FHP VILEDA","CFHPVI","","","","CLI"]
["FINDIS SAS","CFIND0","","","","CLI"]
["FISCUIR","CFIS00","","","","CLI"]
["IFM ELECTRONIC","CIFM00","","","","CLI"]
["SARL JONATHAN AMAR","CJONAT","","","","CLI"]
["KALLPA GROUP","CKALL0","","","","CLI"]
["SARL LONGCHAMP","CLONG0","","","","CLI"]
["LES PETITES CANAILLES VINCENNES","CLPC10","","","","CLI"]
["LPCR","CLPCR0","","","","CLI"]
["LA MAISON DE LA CHINE","CMAISO","","","","CLI"]
["MINEFI","CMEF00","","","","CLI"]
["METAP","CMETA0","","","","CLI"]
["SAS MIKA","CMIKA0","","","","CLI"]
["MILLE ET UNE CRECHES","CMIL00","","","","CLI"]
["SARAH MORDOFF","CMOR00","","","","CLI"]
["MOURLAAS JULIEN","CMOU00","","","","CLI"]
["MA PLACE EN CRECHE AMANCE","CMPC00","","","","CLI"]
["NATIXIS ASSET MANAGEMENT","CNATIX","","","","CLI"]
["OMADIS","COMA00","","","","CLI"]
["CLIENTS PARENTS","CPAR00","","","","CLI"]
["Monsieur PASTORE","CPAST0","","","","CLI"]
["ROLAND BERGER","CROLAN","","","","CLI"]
["SALOME","CSALOM","","","","CLI"]
["LPC SAS","CSAS00","","","","CLI"]
["SGH SOLANET","CSGH00","","","","CLI"]
["SI MARKET","CSIM00","","","","CLI"]
["SOFIP","CSOF00","","","","CLI"]
["SPGEC","CSPGEC","","","","CLI"]
["SPVA","CSPVA0","","","","CLI"]
["SQUARE'S GROUP","CSQU00","","","","CLI"]