{"text_format":"1","workbook":"xlsx","n_sheets":8,"sheets":["MENUS","CALCUL EFFECTIFS","QUANTITES TOTAL","FEUILLE FAB","BL","GOÛTERS MERISAIE","BARQUETTES","IMPRESSION BL"],"not_rendered":{"charts":0,"images":0,"macros":1,"external_links":0,"defined_names":5,"comments":0,"pivot_tables":0},"unopened":[],"bounds":{"document_bytes":16777216,"sheet_cells":100000,"rows_first":2000,"rows_last":500,"rows_between":2000,"halvings":0,"cell_chars":16384,"cell_head_chars":4096},"cells_cut":0,"cells_raw":0,"read":"whole","date_system":"1900"}

{"sheet":"MENUS","index":0,"n_rows":51,"n_cols":5,"rows_kept":51,"cut":false,"hidden":false,"merged":[[26,4,27,7]]}
["REPAS DU :","SAMEDI MIDI"]
[]
[null,"NORMAL"]
[null,"TERRINE DE CAMPAGNE"]
[null,"BŒUF BOURGUIGNON"]
[null,"CAROTTES VICHY",null,null,"!!!!RENTRER LE MENU NORMAL!!!!"]
[null,"CAMEMBERT"]
[null,"PÂTISSERIE"]
[null,null,null,null,"!!!!!CELLULE POUR LE POTAGE!!!!!"]
[]
[null,"S.SEL / S.SUCRE / ALLEGE"]
[null,"TOMATE VINAIGRETTE"]
[null,"BŒUF BOURGUIGNON SANS LARDONS"]
[null,{"$f":"B6","v":"CAROTTES VICHY"}]
[null,"YAOURT"]
[null,"POMME"]
[]
[null,"S.SEL"]
[null,{"$f":"B12","v":"TOMATE VINAIGRETTE"}]
[null,{"$f":"B13","v":"BŒUF BOURGUIGNON SANS LARDONS"}]
[null,"CAROTTES VICHY"]
[null,{"$f":"B15","v":"YAOURT"}]
[null,{"$f":"B8","v":"PÂTISSERIE"}]
[]
[null,"S.SUCRE"]
[null,{"$f":"B4","v":"TERRINE DE CAMPAGNE"}]
[null,{"$f":"B5","v":"BŒUF BOURGUIGNON"},null,null,"!!! FAIRE MODIFS SI BESOINS !!!"]
[null,"CAROTTES VICHY"]
[null,"CAMEMBERT"]
[null,{"$f":"B16","v":"POMME"}]
[]
[null,"S.PORC"]
[null,{"$f":"B12","v":"TOMATE VINAIGRETTE"}]
[null,{"$f":"B13","v":"BŒUF BOURGUIGNON SANS LARDONS"}]
[null,"CAROTTES VICHY"]
[null,{"$f":"B7","v":"CAMEMBERT"}]
[null,{"$f":"B8","v":"PÂTISSERIE"}]
[]
[null,"S.VIANDE"]
[null,"TOMATE VINAIGRETTE"]
[null,"BŒUF SANS LARDONS"]
[null,"P.DE TERRE VAPEUR"]
[null,{"$f":"B7","v":"CAMEMBERT"}]
[null,"PÂTISSERIE"]
[]
[null,"REPAS FROIDS"]
[null,{"$f":"B4","v":"TERRINE DE CAMPAGNE"}]
[null,{"$f":"B5","v":"BŒUF BOURGUIGNON"}]
[null,{"$f":"B6","v":"CAROTTES VICHY"}]
[null,"CAMEMBERT"]
[null,"PÂTISSERIE"]

{"sheet":"CALCUL EFFECTIFS","index":1,"n_rows":100,"n_cols":47,"rows_kept":100,"cut":false,"hidden":false,"merged":[[90,32,91,33],[90,34,90,37],[90,38,91,39],[90,40,91,40],[90,41,91,41],[90,17,91,17],[90,25,90,29],[90,30,91,31],[89,6,89,8],[89,9,89,17],[89,25,89,37],[89,38,89,44],[90,13,91,13],[90,14,91,14],[90,15,91,15],[90,16,91,16],[89,18,89,24],[90,18,91,18],[90,19,91,19],[90,20,91,20],[90,21,91,21],[90,22,91,22],[90,23,91,23],[90,24,91,24],[78,32,79,33],[78,34,78,37],[78,38,79,39],[78,40,79,40],[78,41,79,41],[78,17,79,17],[78,25,78,29],[78,30,79,31],[78,13,79,13],[78,16,79,16],[78,14,79,14],[78,15,79,15],[78,18,79,18],[78,19,79,19],[78,20,79,20],[78,21,79,21],[78,22,79,22],[78,23,79,23],[78,24,79,24],[78,11,79,11],[78,12,79,12],[90,4,91,4],[90,5,91,5],[90,6,91,6],[90,7,91,7],[90,8,91,8],[90,9,91,9],[90,10,91,10],[90,11,91,11],[90,12,91,12],[78,4,79,4],[78,5,79,5],[78,6,79,6],[78,7,79,7],[78,8,79,8],[78,9,79,9],[78,10,79,10],[77,25,77,37],[77,38,77,44],[66,32,67,33],[66,34,66,37],[66,38,67,39],[66,40,67,40],[66,41,67,41],[66,17,67,17],[66,25,66,29],[66,30,67,31],[66,42,67,42],[66,43,67,43],[66,44,67,44],[66,18,67,18],[66,19,67,19],[66,20,67,20],[66,21,67,21],[66,22,67,22],[66,23,67,23],[66,24,67,24],[77,18,77,24],[77,6,77,8],[77,9,77,17],[66,13,67,13],[66,8,67,8],[66,9,67,9],[66,10,67,10],[66,11,67,11],[66,12,67,12],[66,16,67,16],[53,6,53,8],[53,9,53,17],[66,4,67,4],[66,5,67,5],[66,6,67,6],[66,7,67,7],[54,4,55,4],[54,5,55,5],[54,6,55,6],[54,7,55,7],[65,6,65,8],[65,9,65,17],[66,14,67,14],[66,15,67,15],[54,17,55,17],[54,14,55,14],[54,15,55,15],[54,16,55,16],[54,13,55,13],[54,9,55,9],[54,10,55,10],[54,11,55,11],[54,12,55,12],[54,8,55,8],[20,6,20,8],[20,9,20,17],[38,6,38,8],[38,9,38,17],[21,30,22,31],[21,32,22,33],[21,34,21,37],[39,34,39,37],[39,13,40,13],[39,14,40,14],[39,15,40,15],[39,16,40,16],[39,17,40,17],[39,25,39,29],[39,30,40,31],[39,32,40,33],[21,25,21,29],[38,18,38,24],[39,18,40,18],[39,19,40,19],[39,20,40,20],[39,21,40,21],[39,22,40,22],[39,23,40,23],[5,38,5,44],[6,8,7,8],[6,9,7,9],[6,10,7,10],[6,11,7,11],[6,12,7,12],[6,13,7,13],[6,14,7,14],[6,15,7,15],[6,16,7,16],[6,17,7,17],[6,43,7,43],[6,44,7,44],[6,32,7,33],[6,34,6,37],[6,38,7,39],[6,30,7,31],[5,18,5,24],[6,18,7,18],[6,19,7,19],[6,20,7,20],[6,21,7,21],[6,22,7,22],[6,25,6,29],[78,45,79,45],[90,45,91,45],[39,40,40,40],[39,41,40,41],[39,42,40,42],[39,43,40,43],[39,44,40,44],[78,42,79,42],[78,43,79,43],[78,44,79,44],[90,42,91,42],[90,43,91,43],[90,44,91,44],[54,43,55,43],[54,44,55,44],[53,38,53,44],[54,42,55,42],[65,38,65,44],[54,38,55,39],[54,40,55,40],[54,41,55,41],[54,45,55,45],[66,45,67,45],[39,5,40,5],[39,6,40,6],[39,7,40,7],[39,8,40,8],[39,9,40,9],[39,10,40,10],[39,11,40,11],[39,12,40,12],[21,9,22,9],[21,10,22,10],[21,11,22,11],[21,12,22,12],[6,45,7,45],[21,45,22,45],[39,45,40,45],[6,42,7,42],[6,40,7,40],[38,38,38,44],[20,25,20,37],[20,38,20,44],[6,41,7,41],[21,44,22,44],[39,38,40,39],[21,38,22,39],[21,40,22,40],[21,41,22,41],[21,42,22,42],[21,43,22,43],[6,3,7,3],[21,3,22,3],[39,3,40,3],[54,3,55,3],[66,3,67,3],[78,3,79,3],[90,3,91,3],[38,25,38,37],[21,4,22,4],[21,5,22,5],[21,6,22,6],[21,7,22,7],[21,8,22,8],[20,18,20,24],[21,18,22,18],[21,19,22,19],[21,20,22,20],[21,21,22,21],[21,22,22,22],[21,23,22,23],[21,24,22,24],[53,18,53,24],[54,18,55,18],[39,4,40,4],[5,6,5,8],[5,9,5,17],[5,25,5,37],[6,4,7,4],[6,5,7,5],[6,6,7,6],[6,7,7,7],[6,23,7,23],[6,24,7,24],[54,19,55,19],[54,20,55,20],[54,21,55,21],[54,22,55,22],[54,23,55,23],[54,24,55,24],[65,18,65,24],[2,12,2,19],[3,12,3,19],[2,20,2,32],[3,20,3,32],[39,24,40,24],[21,16,22,16],[21,17,22,17],[21,13,22,13],[21,14,22,14],[21,15,22,15],[53,25,53,37],[65,25,65,37],[54,32,55,33],[54,34,54,37],[54,25,54,29],[54,30,55,31]]}
[null,{"$f":"MENUS!B1","v":"SAMEDI MIDI"}]
[]
[null,null,null,null,null,null,null,null,null,null,null,null,"REPAS DU :"]
[null,null,null,null,null,null,null,null,null,null,null,null,"FABRIQUE LE :"]
[]
[null,null,null,null,null,null,"MONTR.",null,null,"MONTR.",null,null,null,null,null,null,null,null,"PONTLEVOY",null,null,null,null,null,null,"ROMO"]
[null,null,null,"ESAT","ADMR","ETS","U1","U2","U3","2RA",425,"4RL",2114,"8RA",1005,1015,"10RA","Educ","DA","MI","PI","VI","VA","PERS","IND","FO / FAM",null,null,null,null,"ESAT",null,"FH",null,"IME",null,null,null,null,null,null,null,null,null,null,"H.C"]
[null,null,null,null,null,null,null,null,null,null,null,null,null,null,null,null,null,null,null,null,null,null,null,null,null,"U1","U2","U3","U4","U5",null,null,null,null,"U1","U2","U3","U4",null,null,null,null,null,null,null,"CHIENS"]
[null,null,"NORMAUX",0,null,null,12,11,13,6,4,2]
[null,null,"SANS SEL",0,0,null,null,2,2]
[null,null,"SANS SUCRE",0,0,null,null,null,null,null,4]
[null,null,"HYPO",0,0,null,2,5,1,2,3]
[null,null,"S.PORC",0,null,null,null,6]
[null,null,"S.VIANDE",0,null,null,5,2,1,0,0,0,4,3,2,1,4]
[null,null,"REPAS FROID",0]
[null,null,"TOTAL",0,{"$f":"SUM(E9:E15)","v":0},{"$f":"SUM(F9:F15)","v":0},19,26,17,8,11,2,4,3,2,1,4,0,0,0,0,0,0,0,0,0,0,0,0,0,0,0,0,0,0,0,0,0,0,0,0,0,0,0,0]
[null,null,"CADEAUX",3]
[]
[null,null,null,null,null,null,null,null,null,null,null,null,null,null,null,null,null,null,null,null,null,null,null,null,null,null,null,null,null,null,null,null,null,null,null,null,null,null,null,null,null,null,null,null,null,null,{"$f":"SUM(G16:AS16)","v":97}]
[]
[null,null,null,null,null,null,"MONTR.",null,null,"MONTR.",null,null,null,null,null,null,null,null,"PONTLEVOY",null,null,null,null,null,null,"ROMO"]
[null,null,null,"ESAT","ADMR","ETS","U1","U2","U3","2RA",425,"4RL",2114,"8RA",1005,1015,"10RA","Educ","DA","MI","PI","VI","VA","PERS","IND","FO / FAM",null,null,null,null,"ESAT",null,"FH",null,"IME",null,null,null,null,null,null,null,null,null,null,"H.C"]
[null,null,"ENTREE",null,null,null,null,null,null,null,null,null,null,null,null,null,null,null,null,null,null,null,null,null,null,"U1","U2","U3","U4","U5",null,null,null,null,"U1","U2","U3","U4",null,null,null,null,null,null,null,"CHIENS","TOTAL"]
[null,{"$f":"MENUS!B4","v":"TERRINE DE CAMPAGNE"},"NORMAUX",{"$f":"D9","v":0},{"$f":"$E$9","v":0},{"$f":"$F$9","v":0},{"$f":"G16-G26-G28-G30-G32-G34-G36","v":12},{"$f":"H16-H26-H28-H30-H32-H34-H36","v":11},13,6,8,2,0,0,0,0,0,0,0,0,0,0,0,0,0,0,0,{"$f":"AB16-AB26-AB28-AB30-AB32-AB34-AB36","v":0},0,0,0,0,0,0,0,0,0,0,0,0,0,0,0,0,0,{"$f":"$AT$16-AT28-AT30-AT32-AT36","v":0},{"$f":"SUM(E24:AS24)","v":52}]
[null,"FEUILLE FAB",null,null,null,null,{"$f":"IF(G24>0,G24,$A$3&\"\")","v":12},{"$f":"IF(H24>0,H24,$A$3&\"\")","v":11},13,6,8,2,"","","","","","","","","","","","","","","","","","","","","","","","","","","","","","",{"$f":"IF(AQ24>0,AQ24,$A$3&\"\")","v":""},"","","",52]
[null,{"$f":"MENUS!B19","v":"TOMATE VINAIGRETTE"},"SANS SEL",null,{"$f":"$E$10","v":0},null,{"$f":"IF($B$26=$B$24,0,G10)","v":0},{"$f":"IF($B$26=$B$24,0,H10)","v":2},2,0,0,0,0,0,0,0,0,0,0,0,0,0,0,0,0,0,0,0,0,0,0,0,0,0,0,0,0,0,0,0,0,0,0,0,0,0,4]
[null,"FEUILLE FAB",null,null,null,null,{"$f":"IF(G26>0,G26,$A$3&\"\")","v":""},{"$f":"IF(H26>0,H26,$A$3&\"\")","v":2},2,"","","","","","","","","","","","","","","","","","","","","","","","","","","","","","","","","","","","",null,{"$f":"SUM(E27:AS27)","v":4}]
[null,{"$f":"MENUS!B26","v":"TERRINE DE CAMPAGNE"},"SANS SUCRE",null,{"$f":"$E$11","v":0},null,{"$f":"IF($B$28=$B$24,0,G11)","v":0},{"$f":"IF($B$28=$B$24,0,H11)","v":0},0,0,0,0,0,0,0,0,0,0,0,0,0,0,0,0,0,0,0,0,0,0,0,0,0,0,0,0,0,0,0,0,0,0,0,0,0,{"$f":"IF($B$28=$B$24,0,AT11)","v":0},0]
[null,"FEUILLE FAB",null,null,null,null,{"$f":"IF(G28>0,G28,$A$3&\"\")","v":""},{"$f":"IF(H28>0,H28,$A$3&\"\")","v":""},"","","","","","","","","","","","","","","","","","","","","","","","",{"$f":"IF(AG28>0,AG28,$A$3&\"\")","v":""},"","","","","","","",{"$f":"IF(AO28>0,AO28,$A$3&\"\")","v":""},"","","","",{"$f":"IF(AT28>0,AT28,$A$3&\"\")","v":""},0]
[null,{"$f":"MENUS!B12","v":"TOMATE VINAIGRETTE"},"HYPO",null,{"$f":"$E$12","v":0},null,{"$f":"IF($B$30=$B$24,0,G12)","v":2},{"$f":"IF($B$30=$B$24,0,H12)","v":5},1,2,3,0,0,0,0,0,0,0,0,0,0,0,0,0,0,0,0,0,0,0,0,0,0,0,0,0,0,0,0,0,0,0,0,0,0,{"$f":"IF($B$30=$B$24,0,AT12)","v":0},13]
[null,"FEUILLE FAB",null,null,null,null,{"$f":"IF(G30>0,G30,$A$3&\"\")","v":2},5,1,2,3,"","","","","","","","","","","","","","","","","","","","","","","","","","","","","","","","","","","",13]
[null,{"$f":"MENUS!B33","v":"TOMATE VINAIGRETTE"},"S.PORC",null,null,null,{"$f":"IF($B$32=$B$24,0,G13)","v":0},{"$f":"IF($B$32=$B$24,0,H13)","v":6},0,0,0,0,0,0,0,0,0,0,0,0,0,0,0,0,0,0,0,0,0,0,0,0,0,0,0,0,0,0,0,0,0,0,0,0,0,{"$f":"IF($B$32=$B$24,0,AT13)","v":0},6]
[null,"FEUILLE FAB",null,null,null,null,{"$f":"IF(G32>0,G32,$A$3&\"\")","v":""},{"$f":"IF(H32>0,H32,$A$3&\"\")","v":6},"","","","","","","","","","","","","","","","","","","","","","","","","","","","","","","","","","","","","","",6]
[null,{"$f":"MENUS!B40","v":"TOMATE VINAIGRETTE"},"S.VIANDE",null,null,null,{"$f":"IF($B$34=$B$24,0,G14)","v":5},{"$f":"IF($B$34=$B$24,0,H14)","v":2},1,0,0,0,4,3,2,1,4,0,0,0,0,0,0,0,0,0,0,0,0,0,0,0,0,0,0,0,0,0,0,0,0,0,0,0,0,0,22]
[null,"FEUILLE FAB",null,null,null,null,{"$f":"IF(G34>0,G34,$A$3&\"\")","v":5},{"$f":"IF(H34>0,H34,$A$3&\"\")","v":2},1,"","","",4,3,2,1,4,"","","","","","","","","","","","","","","","","","","","","","","","","","","","","",{"$f":"SUM(E35:AS35)","v":22}]
[null,{"$f":"MENUS!B47","v":"TERRINE DE CAMPAGNE"},"REPAS FROID",{"$f":"D15","v":0},null,null,{"$f":"$G$15","v":0},{"$f":"$H$15","v":0},{"$f":"$I$15","v":0},{"$f":"J15","v":0},0,0,0,0,0,0,0,0,0,0,0,0,0,0,0,0,0,0,0,0,0,0,0,0,0,0,0,0,0,0,0,0,0,0,0,0,0]
[null,null,"TOTAL",null,{"$f":"E24+E26+E28+E30","v":0},{"$f":"F24","v":0},{"$f":"G24+G26+G28+G30+G32+G34+G36","v":19},{"$f":"H24+H26+H28+H30+H32+H34+H36","v":26},17,8,11,2,4,3,2,1,4,0,0,0,0,0,0,0,0,0,0,0,0,0,0,0,0,0,0,0,0,0,0,0,0,0,0,0,0,0,97]
[]
[null,null,null,null,null,null,"MONTR.",null,null,"MONTR.",null,null,null,null,null,null,null,null,"PONTLEVOY",null,null,null,null,null,null,"ROMO"]
[null,null,null,"ESAT","ADMR","ETS","U1","U2","U3","2RA",425,"4RL",2114,"8RA",1005,1015,"10RA","Educ","DA","MI","PI","VI","VA","PERS","IND","FO / FAM",null,null,null,null,"ESAT",null,"FH",null,"IME",null,null,null,null,null,null,null,null,null,null,"H.C"]
[null,null,"ENTREE",null,null,null,null,null,null,null,null,null,null,null,null,null,null,null,null,null,null,null,null,null,null,"U1","U2","U3","U4","U5",null,null,null,null,"U1","U2","U3","U4",null,null,null,null,null,null,null,"CHIENS","TOTAL"]
[null,{"$f":"IF(B49=\"POTAGE\",B49,B24)","v":"TERRINE DE CAMPAGNE"},"NORMAUX",{"$f":"$D$9","v":0},{"$f":"$E$9","v":0},{"$f":"$F$9","v":0},{"$f":"G16-G43-G44-G45-G46-G47-G48","v":12},{"$f":"H16-H43-H44-H45-H46-H47-H48","v":11},13,6,8,2,0,0,0,0,0,0,0,0,0,0,0,0,0,0,0,0,0,0,0,0,0,0,0,0,0,0,0,0,0,0,0,0,0,0,{"$f":"SUM(E42:AS42)","v":52}]
[null,{"$f":"IF(B49=\"POTAGE\",B49,B26)","v":"TOMATE VINAIGRETTE"},"SANS SEL",null,{"$f":"$E$10","v":0},null,{"$f":"IF($B$43=$B$42,0,G10)","v":0},{"$f":"IF($B$43=$B$42,0,H10)","v":2},2,0,0,0,0,0,0,0,0,0,0,0,0,0,0,0,0,0,0,0,0,0,0,0,0,0,0,0,0,0,0,0,0,0,0,0,0,0,4]
[null,{"$f":"IF(B49=\"POTAGE\",B49,B28)","v":"TERRINE DE CAMPAGNE"},"SANS SUCRE",null,{"$f":"$E$11","v":0},null,{"$f":"IF($B$44=$B$42,0,G11)","v":0},{"$f":"IF($B$44=$B$42,0,H11)","v":0},0,0,0,0,0,0,0,0,0,0,0,0,0,0,0,0,0,0,0,0,0,0,0,0,0,0,0,0,0,0,0,0,0,0,0,0,0,0,0]
[null,{"$f":"IF(B49=\"POTAGE\",B49,B30)","v":"TOMATE VINAIGRETTE"},"HYPO",null,{"$f":"$E$12","v":0},null,{"$f":"IF($B$45=$B$42,0,G12)","v":2},5,1,2,3,0,0,0,0,0,0,0,0,0,0,0,0,0,0,0,0,0,0,0,0,0,0,0,0,0,0,0,0,0,0,0,0,0,0,0,13]
[null,{"$f":"IF(B49=\"POTAGE\",B49,B32)","v":"TOMATE VINAIGRETTE"},"S.PORC",null,null,null,{"$f":"IF($B$46=$B$42,0,G13)","v":0},{"$f":"IF($B$46=$B$42,0,H13)","v":6},0,0,0,0,0,0,0,0,0,0,0,0,0,0,0,0,0,0,0,0,0,0,0,0,0,0,0,0,0,0,0,0,0,0,0,0,0,0,6]
[null,{"$f":"IF(B49=\"POTAGE\",B49,B34)","v":"TOMATE VINAIGRETTE"},"S.VIANDE",null,null,null,{"$f":"IF($B$47=$B$42,0,G14)","v":5},{"$f":"IF($B$47=$B$42,0,H14)","v":2},1,0,0,0,4,3,2,1,4,0,0,0,0,0,0,0,0,0,0,0,0,0,0,0,0,0,0,0,0,0,0,0,0,0,0,0,0,0,22]
[null,{"$f":"B36","v":"TERRINE DE CAMPAGNE"},"REPAS FROID",{"$f":"D15","v":0},null,null,{"$f":"G15","v":0},{"$f":"H15","v":0},0,0,0,0,0,0,0,0,0,0,0,0,0,0,0,0,0,0,0,0,0,0,0,0,0,0,0,0,0,0,0,0,0,0,0,0,0,0,0]
[null,{"$f":"IF(MENUS!B9=\"POTAGE\",MENUS!B9,MENUS!B4)","v":"TERRINE DE CAMPAGNE"},"AUTRE",null,null,null,{"$f":"IF($B$49=\"POTAGE\",G42)","v":false},{"$f":"IF($B$49=\"POTAGE\",H42)","v":false},{"$f":"IF($B$49=\"POTAGE\",I42)","v":false},false,false,false,false,false,false,false,false,false,false,false,false,false,false,false,false,false,false,false,false,false,false,false,false,false,false,false,false,false,false,false,{"$f":"IF($B$49=\"POTAGE\",AO42)","v":false},false,false,false,false,{"$f":"IF($B$49=\"POTAGE\",AT42)","v":false},0]
[null,null,"FEUILLE FAB",null,null,null,{"$f":"IF(G49>0,G49,$A$6&\"\")","v":false},{"$f":"IF(H49>0,H49,$A$6&\"\")","v":false},{"$f":"IF(I49>0,I49,$A$6&\"\")","v":false},false,false,false,false,false,false,false,false,false,false,false,false,false,false,false,false,false,false,false,false,false,false,false,false,false,false,false,false,false,false,false,false,false,false,false,false,{"$f":"IF(AT49>0,AT49,$A$6&\"\")","v":false},0]
[null,null,"TOTAL",null,{"$f":"SUM(E42:E48)","v":0},0,19,26,17,8,11,2,4,3,2,1,4,0,0,0,0,0,0,0,0,0,0,0,0,0,0,0,0,0,0,0,0,0,0,0,0,0,0,0,0,{"$f":"SUM(AT42:AT48)","v":0},97]
[]
[]
[null,null,null,null,null,null,"MONTR.",null,null,"MONTR.",null,null,null,null,null,null,null,null,"PONTLEVOY",null,null,null,null,null,null,"ROMO"]
[null,null,null,"ESAT","ADMR","ETS","U1","U2","U3","2RA",425,"4RL",2114,"8RA",1005,1015,"10RA","Educ","DA","MI","PI","VI","VA","PERS","IND","FO / FAM",null,null,null,null,"ESAT",null,"FH",null,"IME",null,null,null,null,null,null,null,null,null,null,"H.C"]
[null,null,"PLAT",null,null,null,null,null,null,null,null,null,null,null,null,null,null,null,null,null,null,null,null,null,null,"U1","U2","U3","U4","U5",null,null,null,null,"U1","U2","U3","U4",null,null,null,null,null,null,null,"CHIENS","TOTAL"]
[null,{"$f":"MENUS!B5","v":"BŒUF BOURGUIGNON"},"NORMAUX",{"$f":"$D$9","v":0},{"$f":"$E$9","v":0},{"$f":"$F$9","v":0},{"$f":"G16-G58-G59-G60-G61-G62-G63","v":12},{"$f":"H16-H58-H59-H60-H61-H62-H63","v":11},13,6,8,2,0,0,0,0,0,0,0,0,0,0,0,0,0,0,0,0,0,0,0,0,0,0,0,0,0,0,0,0,0,0,0,0,0,0,{"$f":"SUM(E57:AS57)","v":52}]
[null,{"$f":"MENUS!B20","v":"BŒUF BOURGUIGNON SANS LARDONS"},"SANS SEL",null,{"$f":"$E$10","v":0},null,{"$f":"IF($B$58=$B$57,0,G10)","v":0},{"$f":"IF($B$58=$B$57,0,H10)","v":2},2,0,0,0,0,0,0,0,0,0,0,0,0,0,0,0,0,0,0,0,0,0,0,0,0,0,0,0,0,0,0,0,0,0,0,0,0,0,4]
[null,{"$f":"MENUS!B27","v":"BŒUF BOURGUIGNON"},"SANS SUCRE",null,{"$f":"$E$11","v":0},null,{"$f":"IF($B$59=$B$57,0,G11)","v":0},{"$f":"IF($B$59=$B$57,0,H11)","v":0},0,0,0,0,0,0,0,0,0,0,0,0,0,0,0,0,0,0,0,0,0,0,0,0,0,0,0,0,0,0,0,0,0,0,0,0,0,0,0]
[null,{"$f":"MENUS!B13","v":"BŒUF BOURGUIGNON SANS LARDONS"},"HYPO",null,{"$f":"$E$12","v":0},null,{"$f":"IF($B$60=$B$57,0,G12)","v":2},{"$f":"IF($B$60=$B$57,0,H12)","v":5},1,2,3,0,0,0,0,0,0,0,0,0,0,0,0,0,0,0,0,0,0,0,0,0,0,0,0,0,0,0,0,0,0,0,0,0,0,0,13]
[null,{"$f":"MENUS!B34","v":"BŒUF BOURGUIGNON SANS LARDONS"},"S.PORC",null,null,null,{"$f":"IF($B$61=$B$57,0,G13)","v":0},{"$f":"IF($B$61=$B$57,0,H13)","v":6},0,0,0,0,0,0,0,0,0,0,0,0,0,0,0,0,0,0,0,0,0,0,0,0,0,0,0,0,0,0,0,0,0,0,0,0,0,0,6]
[null,{"$f":"MENUS!B41","v":"BŒUF SANS LARDONS"},"S.VIANDE",null,null,null,{"$f":"IF($B$62=$B$57,0,G14)","v":5},{"$f":"IF($B$62=$B$57,0,H14)","v":2},1,0,0,0,4,3,2,1,4,0,0,0,0,0,0,0,0,0,0,0,0,0,0,0,0,0,0,0,0,0,0,0,0,0,0,0,0,0,22]
[null,{"$f":"MENUS!B48","v":"BŒUF BOURGUIGNON"},"REPAS FROID",{"$f":"D15","v":0},null,null,{"$f":"G15","v":0},{"$f":"H15","v":0},0,0,0,0,0,0,0,0,0,0,0,0,0,0,0,0,0,0,0,0,0,0,0,0,0,0,0,0,0,0,0,0,0,0,0,0,0,0,0]
[null,null,"TOTAL",null,{"$f":"SUM(E57:E63)","v":0},{"$f":"SUM(F57:F63)","v":0},19,26,17,8,11,2,4,3,2,1,4,0,0,0,0,0,0,0,0,0,0,0,0,0,0,0,0,0,0,0,0,0,0,0,0,0,0,0,0,{"$f":"SUM(AT57:AT63)","v":0},97]
[]
[null,null,null,null,null,null,"MONTR.",null,null,"MONTR.",null,null,null,null,null,null,null,null,"PONTLEVOY",null,null,null,null,null,null,"ROMO"]
[null,null,null,"ESAT","ADMR","ETS","U1","U2","U3","2RA",425,"4RL",2114,"8RA",1005,1015,"10RA","Educ","DA","MI","PI","VI","VA","PERS","IND","FO / FAM",null,null,null,null,"ESAT",null,"FH",null,"IME",null,null,null,null,null,null,null,null,null,null,"H.C"]
[null,null,"LEGUMES",null,null,null,null,null,null,null,null,null,null,null,null,null,null,null,null,null,null,null,null,null,null,"U1","U2","U3","U4","U5",null,null,null,null,"U1","U2","U3","U4",null,null,null,null,null,null,null,"CHIENS","TOTAL"]
[null,{"$f":"MENUS!B6","v":"CAROTTES VICHY"},"NORMAUX",{"$f":"$D$9","v":0},{"$f":"$E$9","v":0},{"$f":"$F$9","v":0},{"$f":"G16-G70-G71-G72-G73-G74-G75","v":14},{"$f":"H16-H70-H71-H72-H73-H74-H75","v":24},16,8,11,2,0,0,0,0,0,0,0,0,0,0,0,0,0,0,0,0,0,0,0,0,0,0,0,0,0,0,0,0,0,0,0,0,0,0,{"$f":"SUM(E69:AS69)","v":75}]
[null,{"$f":"MENUS!B21","v":"CAROTTES VICHY"},"SANS SEL",null,{"$f":"$E$10","v":0},null,{"$f":"IF($B$70=$B$69,0,G10)","v":0},{"$f":"IF($B$70=$B$69,0,H10)","v":0},0,0,0,0,0,0,0,0,0,0,0,0,0,0,0,0,0,0,0,0,0,0,0,0,0,0,0,0,0,0,0,0,0,0,0,0,0,0,0]
[null,{"$f":"MENUS!B28","v":"CAROTTES VICHY"},"SANS SUCRE",null,{"$f":"$E$11","v":0},null,{"$f":"IF($B$71=$B$69,0,G11)","v":0},{"$f":"IF($B$71=$B$69,0,H11)","v":0},0,0,0,0,0,0,0,0,0,0,0,0,0,0,0,0,0,0,0,0,0,0,0,0,0,0,0,0,0,0,0,0,0,0,0,0,0,0,0]
[null,{"$f":"MENUS!B14","v":"CAROTTES VICHY"},"HYPO",null,{"$f":"$E$12","v":0},null,{"$f":"IF($B$72=$B$69,0,G12)","v":0},{"$f":"IF($B$72=$B$69,0,H12)","v":0},0,0,0,0,0,0,0,0,0,0,0,0,0,0,0,0,0,0,0,0,0,0,0,0,0,0,0,0,0,0,0,0,0,0,0,0,0,0,0]
[null,{"$f":"MENUS!B35","v":"CAROTTES VICHY"},"S.PORC",null,null,null,{"$f":"IF($B$73=$B$69,0,G13)","v":0},{"$f":"IF($B$73=$B$69,0,H13)","v":0},0,0,0,0,0,0,0,0,0,0,0,0,0,0,0,0,0,0,0,0,0,0,0,0,0,0,0,0,0,0,0,0,0,0,0,0,0,0,0]
[null,{"$f":"MENUS!B42","v":"P.DE TERRE VAPEUR"},"S.VIANDE",null,null,null,{"$f":"IF($B$74=$B$69,0,G14)","v":5},{"$f":"IF($B$74=$B$69,0,H14)","v":2},1,0,0,0,4,3,2,1,4,0,0,0,0,0,0,0,0,0,0,0,0,0,0,0,0,0,0,0,0,0,0,0,0,0,0,0,0,0,22]
[null,{"$f":"MENUS!B49","v":"CAROTTES VICHY"},"REPAS FROID",{"$f":"D15","v":0},null,null,{"$f":"G15","v":0},0,0,0,0,0,0,0,0,0,0,0,0,0,0,0,0,0,0,0,0,0,0,0,0,0,0,0,0,0,0,0,0,0,0,0,0,0,0,0,0]
[null,null,"TOTAL",null,{"$f":"SUM(E69:E75)","v":0},{"$f":"SUM(F69:F75)","v":0},19,26,17,8,11,2,4,3,2,1,4,0,0,0,0,0,0,0,0,0,0,0,0,0,0,0,0,0,0,0,0,0,0,0,0,0,0,0,0,{"$f":"SUM(AT69:AT75)","v":0},97]
[]
[null,null,null,null,null,null,"MONTR.",null,null,"MONTR.",null,null,null,null,null,null,null,null,"PONTLEVOY",null,null,null,null,null,null,"ROMO"]
[null,null,null,"ESAT","ADMR","ETS","U1","U2","U3","2RA",425,"4RL",2114,"8RA",1005,1015,"10RA","Educ","DA","MI","PI","VI","VA","PERS","IND","FO / FAM",null,null,null,null,"ESAT",null,"FH",null,"IME",null,null,null,null,null,null,null,null,null,null,"H.C"]
[null,null,"FROMAGE",null,null,null,null,null,null,null,null,null,null,null,null,null,null,null,null,null,null,null,null,null,null,"U1","U2","U3","U4","U5",null,null,null,null,"U1","U2","U3","U4",null,null,null,null,null,null,null,"CHIENS","TOTAL"]
[null,{"$f":"MENUS!B7","v":"CAMEMBERT"},"NORMAUX",{"$f":"$D$9","v":0},{"$f":"$E$9","v":0},{"$f":"$F$9","v":0},{"$f":"G16-G82-G83-G84-G85-G86-G87","v":17},{"$f":"H16-H82-H83-H84-H85-H86-H87","v":19},14,6,8,2,4,3,2,1,4,0,0,0,0,0,0,0,0,0,0,0,0,0,0,0,0,0,0,0,0,0,0,0,0,0,0,0,0,0,{"$f":"SUM(E81:AS81)","v":80}]
[null,{"$f":"MENUS!B22","v":"YAOURT"},"SANS SEL",null,{"$f":"$E$10","v":0},null,{"$f":"IF($B$82=$B$81,0,G10)","v":0},{"$f":"IF($B$82=$B$81,0,H10)","v":2},2,0,0,0,0,0,0,0,0,0,0,0,0,0,0,0,0,0,0,0,0,0,0,0,0,0,0,0,0,0,0,0,0,0,0,0,0,0,4]
[null,{"$f":"MENUS!B29","v":"CAMEMBERT"},"SANS SUCRE",null,{"$f":"$E$11","v":0},null,{"$f":"IF($B$83=$B$81,0,G11)","v":0},{"$f":"IF($B$83=$B$81,0,H11)","v":0},0,0,0,0,0,0,0,0,0,0,0,0,0,0,0,0,0,0,0,0,0,0,0,0,0,0,0,0,0,0,0,0,0,0,0,0,0,{"$f":"IF($B$83=$B$81,0,AT11)","v":0},0]
[null,{"$f":"MENUS!B15","v":"YAOURT"},"HYPO",null,{"$f":"$E$12","v":0},null,{"$f":"IF($B$84=$B$81,0,G12)","v":2},{"$f":"IF($B$84=$B$81,0,H12)","v":5},1,2,3,0,0,0,0,0,0,0,0,0,0,0,0,0,0,0,0,0,0,0,0,0,0,0,0,0,0,0,0,0,0,0,0,{"$f":"IF($B$84=$B$81,0,AR12)","v":0},0,{"$f":"IF($B$84=$B$81,0,AT12)","v":0},13]
[null,{"$f":"MENUS!B36","v":"CAMEMBERT"},"S.PORC",null,null,null,{"$f":"IF($B$85=$B$81,0,G13)","v":0},{"$f":"IF($B$85=$B$81,0,H13)","v":0},0,0,0,0,0,0,0,0,0,0,0,0,0,0,0,0,0,0,0,0,0,0,0,0,0,0,0,0,0,0,0,0,0,0,0,0,{"$f":"IF($B$85=$B$81,0,AS13)","v":0},{"$f":"IF($B$85=$B$81,0,AT13)","v":0},0]
[null,{"$f":"MENUS!B43","v":"CAMEMBERT"},"S.VIANDE",null,null,null,{"$f":"IF($B$86=$B$81,0,G14)","v":0},{"$f":"IF($B$86=$B$81,0,H14)","v":0},0,0,0,0,0,0,0,0,0,0,0,0,0,0,0,0,0,0,0,0,0,0,0,0,0,0,0,0,0,0,0,0,0,0,0,0,0,0,0]
[null,{"$f":"MENUS!B50","v":"CAMEMBERT"},"REPAS FROID",{"$f":"D15","v":0},null,null,{"$f":"G15","v":0},0,0,0,0,0,0,0,0,0,0,0,0,0,0,0,0,0,0,0,0,0,0,0,0,0,0,0,0,0,0,0,0,0,0,0,0,0,0,0,0]
[null,null,"TOTAL",null,{"$f":"SUM(E81:E87)","v":0},{"$f":"SUM(F81:F87)","v":0},19,26,17,8,11,2,4,3,2,1,4,0,0,0,0,0,0,0,0,0,0,0,0,0,0,0,0,0,0,0,0,0,0,0,0,0,0,0,0,{"$f":"SUM(AT81:AT87)","v":0},97]
[]
[null,null,null,null,null,null,"MONTR.",null,null,"MONTR.",null,null,null,null,null,null,null,null,"PONTLEVOY",null,null,null,null,null,null,"ROMO"]
[null,null,null,"ESAT","ADMR","ETS","U1","U2","U3","2RA",425,"4RL",2114,"8RA",1005,1015,"10RA","Educ","DA","MI","PI","VI","VA","PERS","IND","FO / FAM",null,null,null,null,"ESAT",null,"FH",null,"IME",null,null,null,null,null,null,null,null,null,null,"H.C"]
[null,null,"DESSERT",null,null,null,null,null,null,null,null,null,null,null,null,null,null,null,null,null,null,null,null,null,null,"U1","U2","U3","U4","U5",null,null,null,null,"U1","U2","U3","U4",null,null,null,null,null,null,null,"CHIENS","TOTAL"]
[null,{"$f":"MENUS!B8","v":"PÂTISSERIE"},"NORMAUX",{"$f":"$D$9","v":0},{"$f":"$E$9","v":0},{"$f":"$F$9","v":0},{"$f":"G16-G94-G95-G96-G97-G98-G99","v":17},{"$f":"H16-H94-H95-H96-H97-H98-H99","v":21},16,6,4,2,4,3,2,1,4,0,0,0,0,0,0,0,0,0,0,0,0,0,0,0,0,0,0,0,0,0,0,0,0,0,0,0,0,0,{"$f":"SUM(E93:AS93)","v":80}]
[null,{"$f":"MENUS!B23","v":"PÂTISSERIE"},"SANS SEL",null,{"$f":"$E$10","v":0},null,{"$f":"IF($B$94=$B$93,0,G10)","v":0},{"$f":"IF($B$94=$B$93,0,H10)","v":0},0,0,0,0,0,0,0,0,0,0,0,0,0,0,0,0,0,0,0,0,0,0,0,0,0,0,0,0,0,0,0,0,0,0,0,0,0,0,0]
[null,{"$f":"MENUS!B30","v":"POMME"},"SANS SUCRE",null,{"$f":"$E$11","v":0},null,{"$f":"IF($B$95=$B$93,0,G11)","v":0},{"$f":"IF($B$95=$B$93,0,H11)","v":0},0,0,4,0,0,0,0,0,0,0,0,0,0,0,0,0,0,0,0,0,0,0,0,0,0,0,0,0,0,0,0,0,0,0,0,0,0,0,4]
[null,{"$f":"MENUS!B16","v":"POMME"},"HYPO",null,{"$f":"$E$12","v":0},null,{"$f":"IF($B$96=$B$93,0,G12)","v":2},{"$f":"IF($B$96=$B$93,0,H12)","v":5},1,2,3,0,0,0,0,0,0,0,0,0,0,0,0,0,0,0,0,0,0,0,0,0,0,0,0,0,0,0,0,0,0,0,0,0,0,0,13]
[null,{"$f":"MENUS!B37","v":"PÂTISSERIE"},"S.PORC",null,null,null,{"$f":"IF($B$97=$B$93,0,G13)","v":0},{"$f":"IF($B$97=$B$93,0,H13)","v":0},0,0,0,0,0,0,0,0,0,0,0,0,0,0,0,0,0,0,0,0,0,0,0,0,0,0,0,0,0,0,0,0,0,0,0,0,0,0,0]
[null,{"$f":"MENUS!B44","v":"PÂTISSERIE"},"S.VIANDE",null,null,null,{"$f":"IF($B$98=$B$93,0,G14)","v":0},{"$f":"IF($B$98=$B$93,0,H14)","v":0},0,0,0,0,0,0,0,0,0,0,0,0,0,0,0,0,0,0,0,0,0,0,0,0,0,0,0,0,0,0,0,0,0,0,0,0,0,0,0]
[null,{"$f":"MENUS!B51","v":"PÂTISSERIE"},"REPAS FROID",{"$f":"D15","v":0},null,null,{"$f":"G15","v":0},0,0,0,0,0,0,0,0,0,0,0,0,0,0,0,0,0,0,0,0,0,0,0,0,0,0,0,0,0,0,0,0,0,0,0,0,0,0,0,0]
[null,null,"TOTAL",null,{"$f":"SUM(E93:E99)","v":0},{"$f":"SUM(F93:F99)","v":0},19,26,17,8,11,2,4,3,2,1,4,0,0,0,0,0,0,0,0,0,0,0,0,0,0,0,0,0,0,0,0,0,0,0,0,0,0,0,0,{"$f":"SUM(AT93:AT99)","v":0},97]

{"sheet":"QUANTITES TOTAL","index":2,"n_rows":44,"n_cols":15,"rows_kept":44,"cut":false,"hidden":true,"merged":[]}
["REPAS DU :","LUNDI MIDI"]
[]
[null,"NORMAL"]
[null,{"$f":"MENUS!B4","v":"TERRINE DE CAMPAGNE"},{"$f":"'FEUILLE FAB'!B12","v":52}]
[null,{"$f":"MENUS!B5","v":"BŒUF BOURGUIGNON"},{"$f":"'FEUILLE FAB'!B13","v":52},null,null,null,null,"NORMAUX","ALLEGE","S.SEL","S.SUCRE","S.PORC","FROIDS","sans sauce","TOTAL"]
[null,{"$f":"MENUS!B6","v":"CAROTTES VICHY"},{"$f":"'FEUILLE FAB'!B14","v":75},null,null,null,{"$f":"B4","v":"TERRINE DE CAMPAGNE"},{"$f":"C4","v":52},{"$f":"IF(B12=B4,C12,0)","v":0},{"$f":"IF(B19=B4,C19,0)","v":0},{"$f":"IF(B26=B4,C26,0)","v":0},{"$f":"IF(B33=B4,C33,0)","v":0},{"$f":"IF(B40=B4,C40,0)","v":0},null,{"$f":"SUM(H6:M6)","v":52}]
[null,{"$f":"MENUS!B7","v":"CAMEMBERT"},{"$f":"'FEUILLE FAB'!B15","v":80},null,null,null,{"$f":"B5","v":"BŒUF BOURGUIGNON"},{"$f":"C5","v":52},{"$f":"IF(B13=B5,C13,0)","v":0},{"$f":"IF(B20=B5,C20,0)","v":0},{"$f":"IF(B27=B5,C27,0)","v":0},{"$f":"IF(B34=B5,C34,0)","v":0},0,{"$f":"'FEUILLE FAB'!B21","v":0},{"$f":"SUM(H7:N7)","v":52}]
[null,{"$f":"MENUS!B8","v":"PÂTISSERIE"},{"$f":"'FEUILLE FAB'!B16","v":80},null,null,null,{"$f":"B6","v":"CAROTTES VICHY"},75,0,0,0,0,0,null,{"$f":"SUM(H8:M8)","v":75}]
[null,{"$f":"MENUS!B9","v":0},{"$f":"'FEUILLE FAB'!B17","v":0},null,null,null,{"$f":"B7","v":"CAMEMBERT"},80,0,0,0,null,0,null,80]
[null,null,null,null,null,null,{"$f":"B8","v":"PÂTISSERIE"},80,0,0,0,null,0,null,80]
[null,"S.SEL / S.SUCRE / ALLEGE",null,null,null,null,{"$f":"IF(B12=B4,$G$1&\"\",B12)","v":"TOMATE VINAIGRETTE"},null,{"$f":"IF(B12=B4,0,C12)","v":13},{"$f":"IF(B19=B4,0,C19)","v":4},{"$f":"IF(B26=B4,0,C26)","v":0},{"$f":"IF(B33<>B12,0,C33)","v":6},null,null,{"$f":"SUM(H11:M11)","v":23}]
[null,{"$f":"MENUS!B12","v":"TOMATE VINAIGRETTE"},{"$f":"'FEUILLE FAB'!B35","v":13},null,null,null,{"$f":"IF(B13=B5,$G$1&\"\",B13)","v":"BŒUF BOURGUIGNON SANS LARDONS"},null,{"$f":"IF(B13=B5,0,C13)","v":13},{"$f":"IF(B20=B5,0,C20)","v":4},{"$f":"IF(B27=B5,0,C27)","v":0},{"$f":"IF(B34<>B13,0,C34)","v":6},null,null,23]
[null,{"$f":"MENUS!B13","v":"BŒUF BOURGUIGNON SANS LARDONS"},{"$f":"'FEUILLE FAB'!B36","v":13},null,null,null,{"$f":"IF(B14=B6,$G$1&\"\",B14)","v":""},null,0,0,0,0,null,null,0]
[null,{"$f":"MENUS!B14","v":"CAROTTES VICHY"},{"$f":"'FEUILLE FAB'!B37","v":0},null,null,null,{"$f":"IF(B15=B7,$G$1&\"\",B15)","v":"YAOURT"},null,13,4,0,null,null,null,17]
[null,{"$f":"MENUS!B15","v":"YAOURT"},{"$f":"'FEUILLE FAB'!B38","v":13},null,null,null,{"$f":"IF(B16=B8,$G$1&\"\",B16)","v":"POMME"},null,13,0,4,null,null,null,17]
[null,{"$f":"MENUS!B16","v":"POMME"},{"$f":"'FEUILLE FAB'!B39","v":13},null,null,null,{"$f":"IF(B33=B12,$G$1&\"\",B33)","v":""},null,null,null,null,{"$f":"IF(B12<>B33,C33,0)","v":0},null,null,0]
[null,null,null,null,null,null,{"$f":"IF(B34=B13,$G$1&\"\",B34)","v":""},null,null,null,null,{"$f":"IF(B13<>B34,C34,0)","v":0},null,null,0]
[null,"S.SEL",null,null,null,null,{"$f":"IF(B35=B14,$G$1&\"\",B35)","v":""},null,null,null,null,0,null,null,0]
[null,{"$f":"MENUS!B19","v":"TOMATE VINAIGRETTE"},{"$f":"'FEUILLE FAB'!B25","v":4},null,null,null,{"$f":"IF(B40=B4,$G$1&\"\",B40)","v":""},null,null,null,null,null,{"$f":"IF(B4=B40,0,C40)","v":0},null,0]
[null,{"$f":"MENUS!B20","v":"BŒUF BOURGUIGNON SANS LARDONS"},{"$f":"'FEUILLE FAB'!B26","v":4},null,null,null,{"$f":"IF(B41=B5,$G$1&\"\",B41)","v":""},null,null,null,null,null,{"$f":"IF(B5=B41,0,C41)","v":0},null,0]
[null,{"$f":"MENUS!B21","v":"CAROTTES VICHY"},{"$f":"'FEUILLE FAB'!B27","v":0},null,null,null,{"$f":"IF(B42=B6,$G$1&\"\",B42)","v":""},null,null,null,null,null,{"$f":"IF(B6=B42,0,C42)","v":0},null,{"$f":"SUMIF(G21,\"=E6\",H21:O21)","v":0}]
[null,{"$f":"MENUS!B22","v":"YAOURT"},{"$f":"'FEUILLE FAB'!B28","v":4},null,null,null,{"$f":"IF(B43=B7,$G$1&\"\",B43)","v":""},null,null,null,null,null,{"$f":"IF(B7=B43,0,C43)","v":0},null,{"$f":"SUM(H22:M22)","v":0}]
[null,{"$f":"MENUS!B23","v":"PÂTISSERIE"},{"$f":"'FEUILLE FAB'!B29","v":0},null,null,null,{"$f":"IF(B44=B8,$G$1&\"\",B44)","v":""},null,null,null,null,null,{"$f":"IF(B8=B44,0,C44)","v":0},null,{"$f":"SUM(H23:M23)","v":0}]
[]
[null,"S.SUCRE"]
[null,{"$f":"MENUS!B26","v":"TERRINE DE CAMPAGNE"},{"$f":"'FEUILLE FAB'!B30","v":0}]
[null,{"$f":"MENUS!B27","v":"BŒUF BOURGUIGNON"},{"$f":"'FEUILLE FAB'!B31","v":0}]
[null,{"$f":"MENUS!B28","v":"CAROTTES VICHY"},{"$f":"'FEUILLE FAB'!B32","v":0}]
[null,{"$f":"MENUS!B29","v":"CAMEMBERT"},{"$f":"'FEUILLE FAB'!B33","v":0}]
[null,{"$f":"MENUS!B30","v":"POMME"},{"$f":"'FEUILLE FAB'!B34","v":4}]
[]
[null,"S.PORC"]
[null,{"$f":"MENUS!B33","v":"TOMATE VINAIGRETTE"},{"$f":"'FEUILLE FAB'!B40","v":6}]
[null,{"$f":"MENUS!B34","v":"BŒUF BOURGUIGNON SANS LARDONS"},{"$f":"'FEUILLE FAB'!B41","v":6}]
[null,{"$f":"MENUS!B35","v":"CAROTTES VICHY"},{"$f":"'FEUILLE FAB'!B42","v":0}]
[null,{"$f":"MENUS!B36","v":"CAMEMBERT"}]
[null,{"$f":"MENUS!B37","v":"PÂTISSERIE"}]
[]
[null,"REPAS FROIDS"]
[null,{"$f":"MENUS!B47","v":"TERRINE DE CAMPAGNE"},{"$f":"'FEUILLE FAB'!B46","v":0}]
[null,{"$f":"MENUS!B48","v":"BŒUF BOURGUIGNON"},{"$f":"'FEUILLE FAB'!B47","v":0}]
[null,{"$f":"MENUS!B49","v":"CAROTTES VICHY"},{"$f":"'FEUILLE FAB'!B48","v":0}]
[null,{"$f":"MENUS!B50","v":"CAMEMBERT"},{"$f":"'FEUILLE FAB'!B49","v":0}]
[null,{"$f":"MENUS!B51","v":"PÂTISSERIE"},{"$f":"'FEUILLE FAB'!B50","v":0}]

{"sheet":"FEUILLE FAB","index":3,"n_rows":64,"n_cols":46,"rows_kept":64,"cut":false,"hidden":false,"merged":[[52,1,52,4],[53,1,53,4],[54,1,54,4],[55,1,55,4],[62,2,62,20],[57,2,57,20],[58,2,58,20],[59,2,59,20],[60,2,60,20],[61,2,61,20],[57,25,57,32],[58,25,58,32],[59,25,59,32],[60,25,60,32],[61,25,61,32],[62,25,62,32],[63,43,63,44],[57,36,57,42],[58,36,58,42],[59,36,59,42],[60,36,60,42],[61,36,61,42],[62,36,62,42],[63,36,63,42],[62,33,62,34],[57,43,57,44],[58,43,58,44],[59,43,59,44],[57,33,57,34],[58,33,58,34],[59,33,59,34],[60,33,60,34],[61,33,61,34],[60,43,60,44],[61,43,61,44],[62,43,62,44],[1,0,2,0],[9,39,9,43],[9,24,9,28],[9,33,9,36],[9,37,9,38],[9,0,10,0],[4,26,4,32],[8,5,8,16],[8,24,8,36],[4,33,4,35],[6,1,6,12],[4,1,4,12],[4,14,4,25],[6,14,6,25],[6,26,6,37],[8,37,8,43],[9,5,9,7],[9,8,9,16],[9,29,9,30],[9,31,9,32],[8,17,8,23],[9,17,9,23]]}
[]
[]
[]
[]
["REPAS DU :",{"$f":"'CALCUL EFFECTIFS'!U3","v":"00:00:00"},null,null,null,null,null,null,null,null,null,null,null,null,"POTAGE OU ENTREE",null,null,null,null,null,null,null,null,null,null,null,{"$f":"A10","v":"SAMEDI MIDI"},null,null,null,null,null,null,{"$f":"'CALCUL EFFECTIFS'!D17","v":3}]
[]
["FABRIQUE LE :",{"$f":"'CALCUL EFFECTIFS'!U4","v":"00:00:00"},null,null,null,null,null,null,null,null,null,null,null,null,"A CONSOMMER JUSQU'AU :",null,null,null,null,null,null,null,null,null,null,null,{"$f":"B7+3","v":"1900-01-03"}]
[]
[null,null,null,null,null,"MONTRICHARD",null,null,null,null,null,null,null,null,null,null,null,"PONTLEVOY",null,null,null,null,null,null,"ROMORANTIN"]
[{"$f":"MENUS!B1","v":"SAMEDI MIDI"},null,null,null,null,"F.OCC",null,null,"FOYER HEB.",null,null,null,null,null,null,null,null,"LA MERISAIE",null,null,null,null,null,null,"FO / FAM",null,null,null,null,"ESAT",null,"FH ",null,"IME"]
[null,"TOTAL","SELF","ADMR","ETS","U1","U2","U3","2RA",425,"4RL",2114,"8RA",1005,1015,"10RA","Educ","DA","MI","PI","VI","VA","PERS","IND","U1","U2","U3","U4","U5","COL","IND","COL","IND","U1","U2","U3","U4",null,null,null,null,null,null,null,"…..","….."]
[{"$f":"IF(B12>0,'CALCUL EFFECTIFS'!B24&\"\",$A$6&\"\")","v":"TERRINE DE CAMPAGNE"},{"$f":"SUM(C12:AT12)","v":52},{"$f":"IF('CALCUL EFFECTIFS'!D24>0,'CALCUL EFFECTIFS'!D24,$A$6&\"\")","v":""},{"$f":"IF('CALCUL EFFECTIFS'!E24>0,'CALCUL EFFECTIFS'!E24,$A$6&\"\")","v":""},{"$f":"IF('CALCUL EFFECTIFS'!F24>0,'CALCUL EFFECTIFS'!F24,$A$6&\"\")","v":""},{"$f":"IF('CALCUL EFFECTIFS'!$B$42=\"POTAGE\",$A$6&\"\",'CALCUL EFFECTIFS'!G25)","v":12},{"$f":"IF('CALCUL EFFECTIFS'!$B$42=\"POTAGE\",$A$6&\"\",'CALCUL EFFECTIFS'!H25)","v":11},{"$f":"IF('CALCUL EFFECTIFS'!$B$42=\"POTAGE\",$A$6&\"\",'CALCUL EFFECTIFS'!I25)","v":13},{"$f":"IF('CALCUL EFFECTIFS'!$B$42=\"POTAGE\",$A$6&\"\",'CALCUL EFFECTIFS'!J25)","v":6},{"$f":"IF('CALCUL EFFECTIFS'!$B$42=\"POTAGE\",$A$6&\"\",'CALCUL EFFECTIFS'!K25)","v":8},{"$f":"IF('CALCUL EFFECTIFS'!$B$42=\"POTAGE\",$A$6&\"\",'CALCUL EFFECTIFS'!L25)","v":2},{"$f":"IF('CALCUL EFFECTIFS'!$B$42=\"POTAGE\",$A$6&\"\",'CALCUL EFFECTIFS'!M25)","v":""},{"$f":"IF('CALCUL EFFECTIFS'!$B$42=\"POTAGE\",$A$6&\"\",'CALCUL EFFECTIFS'!N25)","v":""},{"$f":"IF('CALCUL EFFECTIFS'!$B$42=\"POTAGE\",$A$6&\"\",'CALCUL EFFECTIFS'!O25)","v":""},{"$f":"IF('CALCUL EFFECTIFS'!$B$42=\"POTAGE\",$A$6&\"\",'CALCUL EFFECTIFS'!P25)","v":""},{"$f":"IF('CALCUL EFFECTIFS'!$B$42=\"POTAGE\",$A$6&\"\",'CALCUL EFFECTIFS'!Q25)","v":""},{"$f":"IF('CALCUL EFFECTIFS'!$B$42=\"POTAGE\",$A$6&\"\",'CALCUL EFFECTIFS'!R25)","v":""},{"$f":"IF('CALCUL EFFECTIFS'!$B$42=\"POTAGE\",$A$6&\"\",'CALCUL EFFECTIFS'!S25)","v":""},{"$f":"IF('CALCUL EFFECTIFS'!$B$42=\"POTAGE\",$A$6&\"\",'CALCUL EFFECTIFS'!T25)","v":""},{"$f":"IF('CALCUL EFFECTIFS'!$B$42=\"POTAGE\",$A$6&\"\",'CALCUL EFFECTIFS'!U25)","v":""},{"$f":"IF('CALCUL EFFECTIFS'!$B$42=\"POTAGE\",$A$6&\"\",'CALCUL EFFECTIFS'!V25)","v":""},{"$f":"IF('CALCUL EFFECTIFS'!$B$42=\"POTAGE\",$A$6&\"\",'CALCUL EFFECTIFS'!W25)","v":""},{"$f":"IF('CALCUL EFFECTIFS'!$B$42=\"POTAGE\",$A$6&\"\",'CALCUL EFFECTIFS'!X25)","v":""},{"$f":"IF('CALCUL EFFECTIFS'!$B$42=\"POTAGE\",$A$6&\"\",'CALCUL EFFECTIFS'!Y25)","v":""},{"$f":"IF('CALCUL EFFECTIFS'!$B$42=\"POTAGE\",$A$6&\"\",'CALCUL EFFECTIFS'!Z25)","v":""},{"$f":"IF('CALCUL EFFECTIFS'!$B$42=\"POTAGE\",$A$6&\"\",'CALCUL EFFECTIFS'!AA25)","v":""},{"$f":"IF('CALCUL EFFECTIFS'!$B$42=\"POTAGE\",$A$6&\"\",'CALCUL EFFECTIFS'!AB25)","v":""},{"$f":"IF('CALCUL EFFECTIFS'!$B$42=\"POTAGE\",$A$6&\"\",'CALCUL EFFECTIFS'!AC25)","v":""},{"$f":"IF('CALCUL EFFECTIFS'!$B$42=\"POTAGE\",$A$6&\"\",'CALCUL EFFECTIFS'!AD25)","v":""},{"$f":"IF('CALCUL EFFECTIFS'!$B$42=\"POTAGE\",$A$6&\"\",'CALCUL EFFECTIFS'!AE25)","v":""},{"$f":"IF('CALCUL EFFECTIFS'!$B$42=\"POTAGE\",$A$6&\"\",'CALCUL EFFECTIFS'!AF25)","v":""},{"$f":"IF('CALCUL EFFECTIFS'!$B$42=\"POTAGE\",$A$6&\"\",'CALCUL EFFECTIFS'!AG25)","v":""},{"$f":"IF('CALCUL EFFECTIFS'!$B$42=\"POTAGE\",$A$6&\"\",'CALCUL EFFECTIFS'!AH25)","v":""},{"$f":"IF('CALCUL EFFECTIFS'!$B$42=\"POTAGE\",$A$6&\"\",'CALCUL EFFECTIFS'!AI25)","v":""},{"$f":"IF('CALCUL EFFECTIFS'!$B$42=\"POTAGE\",$A$6&\"\",'CALCUL EFFECTIFS'!AJ25)","v":""},{"$f":"IF('CALCUL EFFECTIFS'!$B$42=\"POTAGE\",$A$6&\"\",'CALCUL EFFECTIFS'!AK25)","v":""},{"$f":"IF('CALCUL EFFECTIFS'!$B$42=\"POTAGE\",$A$6&\"\",'CALCUL EFFECTIFS'!AL25)","v":""},{"$f":"IF('CALCUL EFFECTIFS'!AM24>0,'CALCUL EFFECTIFS'!AM24,$A$6&\"\")","v":""},{"$f":"IF('CALCUL EFFECTIFS'!AN24>0,'CALCUL EFFECTIFS'!AN24,$A$6&\"\")","v":""},{"$f":"IF('CALCUL EFFECTIFS'!$B$42=\"POTAGE\",$A$6&\"\",'CALCUL EFFECTIFS'!AO25)","v":""},{"$f":"IF('CALCUL EFFECTIFS'!$B$42=\"POTAGE\",$A$6&\"\",'CALCUL EFFECTIFS'!AP25)","v":""},{"$f":"IF('CALCUL EFFECTIFS'!$B$42=\"POTAGE\",$A$6&\"\",'CALCUL EFFECTIFS'!AQ25)","v":""},{"$f":"IF('CALCUL EFFECTIFS'!$B$42=\"POTAGE\",$A$6&\"\",'CALCUL EFFECTIFS'!AR25)","v":""},{"$f":"IF('CALCUL EFFECTIFS'!$B$42=\"POTAGE\",$A$6&\"\",'CALCUL EFFECTIFS'!AS25)","v":""},{"$f":"IF('CALCUL EFFECTIFS'!$B$42=\"POTAGE\",$A$6&\"\",'CALCUL EFFECTIFS'!AT25)","v":""}]
[{"$f":"IF(B13>0,'CALCUL EFFECTIFS'!B57&\"\",$A$6&\"\")","v":"BŒUF BOURGUIGNON"},52,{"$f":"IF('CALCUL EFFECTIFS'!D57>0,'CALCUL EFFECTIFS'!D57,$A$6&\"\")","v":""},{"$f":"IF('CALCUL EFFECTIFS'!E57>0,'CALCUL EFFECTIFS'!E57,$A$6&\"\")","v":""},{"$f":"IF('CALCUL EFFECTIFS'!F57>0,'CALCUL EFFECTIFS'!F57,$A$6&\"\")","v":""},{"$f":"IF('CALCUL EFFECTIFS'!G57>0,'CALCUL EFFECTIFS'!G57,$A$6&\"\")","v":12},{"$f":"IF('CALCUL EFFECTIFS'!H57>0,'CALCUL EFFECTIFS'!H57,$A$6&\"\")","v":11},{"$f":"IF('CALCUL EFFECTIFS'!I57>0,'CALCUL EFFECTIFS'!I57,$A$6&\"\")","v":13},{"$f":"IF('CALCUL EFFECTIFS'!J57>0,'CALCUL EFFECTIFS'!J57,$A$6&\"\")","v":6},{"$f":"IF('CALCUL EFFECTIFS'!K57>0,'CALCUL EFFECTIFS'!K57,$A$6&\"\")","v":8},{"$f":"IF('CALCUL EFFECTIFS'!L57>0,'CALCUL EFFECTIFS'!L57,$A$6&\"\")","v":2},{"$f":"IF('CALCUL EFFECTIFS'!M57>0,'CALCUL EFFECTIFS'!M57,$A$6&\"\")","v":""},{"$f":"IF('CALCUL EFFECTIFS'!N57>0,'CALCUL EFFECTIFS'!N57,$A$6&\"\")","v":""},{"$f":"IF('CALCUL EFFECTIFS'!O57>0,'CALCUL EFFECTIFS'!O57,$A$6&\"\")","v":""},{"$f":"IF('CALCUL EFFECTIFS'!P57>0,'CALCUL EFFECTIFS'!P57,$A$6&\"\")","v":""},{"$f":"IF('CALCUL EFFECTIFS'!Q57>0,'CALCUL EFFECTIFS'!Q57,$A$6&\"\")","v":""},{"$f":"IF('CALCUL EFFECTIFS'!R57>0,'CALCUL EFFECTIFS'!R57,$A$6&\"\")","v":""},{"$f":"IF('CALCUL EFFECTIFS'!S57>0,'CALCUL EFFECTIFS'!S57,$A$6&\"\")","v":""},{"$f":"IF('CALCUL EFFECTIFS'!T57>0,'CALCUL EFFECTIFS'!T57,$A$6&\"\")","v":""},{"$f":"IF('CALCUL EFFECTIFS'!U57>0,'CALCUL EFFECTIFS'!U57,$A$6&\"\")","v":""},{"$f":"IF('CALCUL EFFECTIFS'!V57>0,'CALCUL EFFECTIFS'!V57,$A$6&\"\")","v":""},{"$f":"IF('CALCUL EFFECTIFS'!W57>0,'CALCUL EFFECTIFS'!W57,$A$6&\"\")","v":""},{"$f":"IF('CALCUL EFFECTIFS'!X57>0,'CALCUL EFFECTIFS'!X57,$A$6&\"\")","v":""},{"$f":"IF('CALCUL EFFECTIFS'!Y57>0,'CALCUL EFFECTIFS'!Y57,$A$6&\"\")","v":""},{"$f":"IF('CALCUL EFFECTIFS'!Z57>0,'CALCUL EFFECTIFS'!Z57,$A$6&\"\")","v":""},{"$f":"IF('CALCUL EFFECTIFS'!AA57>0,'CALCUL EFFECTIFS'!AA57,$A$6&\"\")","v":""},{"$f":"IF('CALCUL EFFECTIFS'!AB57>0,'CALCUL EFFECTIFS'!AB57,$A$6&\"\")","v":""},{"$f":"IF('CALCUL EFFECTIFS'!AC57>0,'CALCUL EFFECTIFS'!AC57,$A$6&\"\")","v":""},{"$f":"IF('CALCUL EFFECTIFS'!AD57>0,'CALCUL EFFECTIFS'!AD57,$A$6&\"\")","v":""},{"$f":"IF('CALCUL EFFECTIFS'!AE57>0,'CALCUL EFFECTIFS'!AE57,$A$6&\"\")","v":""},{"$f":"IF('CALCUL EFFECTIFS'!AF57>0,'CALCUL EFFECTIFS'!AF57,$A$6&\"\")","v":""},{"$f":"IF('CALCUL EFFECTIFS'!AG57>0,'CALCUL EFFECTIFS'!AG57,$A$6&\"\")","v":""},{"$f":"IF('CALCUL EFFECTIFS'!AH57>0,'CALCUL EFFECTIFS'!AH57,$A$6&\"\")","v":""},{"$f":"IF('CALCUL EFFECTIFS'!AI57>0,'CALCUL EFFECTIFS'!AI57,$A$6&\"\")","v":""},{"$f":"IF('CALCUL EFFECTIFS'!AJ57>0,'CALCUL EFFECTIFS'!AJ57,$A$6&\"\")","v":""},{"$f":"IF('CALCUL EFFECTIFS'!AK57>0,'CALCUL EFFECTIFS'!AK57,$A$6&\"\")","v":""},{"$f":"IF('CALCUL EFFECTIFS'!AL57>0,'CALCUL EFFECTIFS'!AL57,$A$6&\"\")","v":""},{"$f":"IF('CALCUL EFFECTIFS'!AM57>0,'CALCUL EFFECTIFS'!AM57,$A$6&\"\")","v":""},{"$f":"IF('CALCUL EFFECTIFS'!AN57>0,'CALCUL EFFECTIFS'!AN57,$A$6&\"\")","v":""},{"$f":"IF('CALCUL EFFECTIFS'!AO57>0,'CALCUL EFFECTIFS'!AO57,$A$6&\"\")","v":""},{"$f":"IF('CALCUL EFFECTIFS'!AP57>0,'CALCUL EFFECTIFS'!AP57,$A$6&\"\")","v":""},{"$f":"IF('CALCUL EFFECTIFS'!AQ57>0,'CALCUL EFFECTIFS'!AQ57,$A$6&\"\")","v":""},{"$f":"IF('CALCUL EFFECTIFS'!AR57>0,'CALCUL EFFECTIFS'!AR57,$A$6&\"\")","v":""},{"$f":"IF('CALCUL EFFECTIFS'!AS57>0,'CALCUL EFFECTIFS'!AS57,$A$6&\"\")","v":""},{"$f":"IF('CALCUL EFFECTIFS'!AT57>0,'CALCUL EFFECTIFS'!AT57,$A$6&\"\")","v":""}]
[{"$f":"IF(B14>0,'CALCUL EFFECTIFS'!B69&\"\",$A$6&\"\")","v":"CAROTTES VICHY"},75,{"$f":"IF('CALCUL EFFECTIFS'!D69>0,'CALCUL EFFECTIFS'!D69,$A$6&\"\")","v":""},{"$f":"IF('CALCUL EFFECTIFS'!E69>0,'CALCUL EFFECTIFS'!E69,$A$6&\"\")","v":""},{"$f":"IF('CALCUL EFFECTIFS'!F69>0,'CALCUL EFFECTIFS'!F69,$A$6&\"\")","v":""},{"$f":"IF('CALCUL EFFECTIFS'!G69>0,'CALCUL EFFECTIFS'!G69,$A$6&\"\")","v":14},{"$f":"IF('CALCUL EFFECTIFS'!H69>0,'CALCUL EFFECTIFS'!H69,$A$6&\"\")","v":24},{"$f":"IF('CALCUL EFFECTIFS'!I69>0,'CALCUL EFFECTIFS'!I69,$A$6&\"\")","v":16},{"$f":"IF('CALCUL EFFECTIFS'!J69>0,'CALCUL EFFECTIFS'!J69,$A$6&\"\")","v":8},{"$f":"IF('CALCUL EFFECTIFS'!K69>0,'CALCUL EFFECTIFS'!K69,$A$6&\"\")","v":11},{"$f":"IF('CALCUL EFFECTIFS'!L69>0,'CALCUL EFFECTIFS'!L69,$A$6&\"\")","v":2},{"$f":"IF('CALCUL EFFECTIFS'!M69>0,'CALCUL EFFECTIFS'!M69,$A$6&\"\")","v":""},{"$f":"IF('CALCUL EFFECTIFS'!N69>0,'CALCUL EFFECTIFS'!N69,$A$6&\"\")","v":""},{"$f":"IF('CALCUL EFFECTIFS'!O69>0,'CALCUL EFFECTIFS'!O69,$A$6&\"\")","v":""},{"$f":"IF('CALCUL EFFECTIFS'!P69>0,'CALCUL EFFECTIFS'!P69,$A$6&\"\")","v":""},{"$f":"IF('CALCUL EFFECTIFS'!Q69>0,'CALCUL EFFECTIFS'!Q69,$A$6&\"\")","v":""},{"$f":"IF('CALCUL EFFECTIFS'!R69>0,'CALCUL EFFECTIFS'!R69,$A$6&\"\")","v":""},{"$f":"IF('CALCUL EFFECTIFS'!S69>0,'CALCUL EFFECTIFS'!S69,$A$6&\"\")","v":""},{"$f":"IF('CALCUL EFFECTIFS'!T69>0,'CALCUL EFFECTIFS'!T69,$A$6&\"\")","v":""},{"$f":"IF('CALCUL EFFECTIFS'!U69>0,'CALCUL EFFECTIFS'!U69,$A$6&\"\")","v":""},{"$f":"IF('CALCUL EFFECTIFS'!V69>0,'CALCUL EFFECTIFS'!V69,$A$6&\"\")","v":""},{"$f":"IF('CALCUL EFFECTIFS'!W69>0,'CALCUL EFFECTIFS'!W69,$A$6&\"\")","v":""},{"$f":"IF('CALCUL EFFECTIFS'!X69>0,'CALCUL EFFECTIFS'!X69,$A$6&\"\")","v":""},{"$f":"IF('CALCUL EFFECTIFS'!Y69>0,'CALCUL EFFECTIFS'!Y69,$A$6&\"\")","v":""},{"$f":"IF('CALCUL EFFECTIFS'!Z69>0,'CALCUL EFFECTIFS'!Z69,$A$6&\"\")","v":""},{"$f":"IF('CALCUL EFFECTIFS'!AA69>0,'CALCUL EFFECTIFS'!AA69,$A$6&\"\")","v":""},{"$f":"IF('CALCUL EFFECTIFS'!AB69>0,'CALCUL EFFECTIFS'!AB69,$A$6&\"\")","v":""},{"$f":"IF('CALCUL EFFECTIFS'!AC69>0,'CALCUL EFFECTIFS'!AC69,$A$6&\"\")","v":""},{"$f":"IF('CALCUL EFFECTIFS'!AD69>0,'CALCUL EFFECTIFS'!AD69,$A$6&\"\")","v":""},{"$f":"IF('CALCUL EFFECTIFS'!AE69>0,'CALCUL EFFECTIFS'!AE69,$A$6&\"\")","v":""},{"$f":"IF('CALCUL EFFECTIFS'!AF69>0,'CALCUL EFFECTIFS'!AF69,$A$6&\"\")","v":""},{"$f":"IF('CALCUL EFFECTIFS'!AG69>0,'CALCUL EFFECTIFS'!AG69,$A$6&\"\")","v":""},{"$f":"IF('CALCUL EFFECTIFS'!AH69>0,'CALCUL EFFECTIFS'!AH69,$A$6&\"\")","v":""},{"$f":"IF('CALCUL EFFECTIFS'!AI69>0,'CALCUL EFFECTIFS'!AI69,$A$6&\"\")","v":""},{"$f":"IF('CALCUL EFFECTIFS'!AJ69>0,'CALCUL EFFECTIFS'!AJ69,$A$6&\"\")","v":""},{"$f":"IF('CALCUL EFFECTIFS'!AK69>0,'CALCUL EFFECTIFS'!AK69,$A$6&\"\")","v":""},{"$f":"IF('CALCUL EFFECTIFS'!AL69>0,'CALCUL EFFECTIFS'!AL69,$A$6&\"\")","v":""},{"$f":"IF('CALCUL EFFECTIFS'!AM69>0,'CALCUL EFFECTIFS'!AM69,$A$6&\"\")","v":""},{"$f":"IF('CALCUL EFFECTIFS'!AN69>0,'CALCUL EFFECTIFS'!AN69,$A$6&\"\")","v":""},{"$f":"IF('CALCUL EFFECTIFS'!AO69>0,'CALCUL EFFECTIFS'!AO69,$A$6&\"\")","v":""},{"$f":"IF('CALCUL EFFECTIFS'!AP69>0,'CALCUL EFFECTIFS'!AP69,$A$6&\"\")","v":""},{"$f":"IF('CALCUL EFFECTIFS'!AQ69>0,'CALCUL EFFECTIFS'!AQ69,$A$6&\"\")","v":""},{"$f":"IF('CALCUL EFFECTIFS'!AR69>0,'CALCUL EFFECTIFS'!AR69,$A$6&\"\")","v":""},{"$f":"IF('CALCUL EFFECTIFS'!AS69>0,'CALCUL EFFECTIFS'!AS69,$A$6&\"\")","v":""},{"$f":"IF('CALCUL EFFECTIFS'!AT69>0,'CALCUL EFFECTIFS'!AT69,$A$6&\"\")","v":""}]
[{"$f":"IF(B15>0,'CALCUL EFFECTIFS'!B81&\"\",$A$6&\"\")","v":"CAMEMBERT"},80,{"$f":"IF('CALCUL EFFECTIFS'!D81>0,'CALCUL EFFECTIFS'!D81,$A$6&\"\")","v":""},{"$f":"IF('CALCUL EFFECTIFS'!E81>0,'CALCUL EFFECTIFS'!E81,$A$6&\"\")","v":""},{"$f":"IF('CALCUL EFFECTIFS'!F81>0,'CALCUL EFFECTIFS'!F81,$A$6&\"\")","v":""},{"$f":"IF('CALCUL EFFECTIFS'!G81>0,'CALCUL EFFECTIFS'!G81,$A$6&\"\")","v":17},{"$f":"IF('CALCUL EFFECTIFS'!H81>0,'CALCUL EFFECTIFS'!H81,$A$6&\"\")","v":19},{"$f":"IF('CALCUL EFFECTIFS'!I81>0,'CALCUL EFFECTIFS'!I81,$A$6&\"\")","v":14},{"$f":"IF('CALCUL EFFECTIFS'!J81>0,'CALCUL EFFECTIFS'!J81,$A$6&\"\")","v":6},{"$f":"IF('CALCUL EFFECTIFS'!K81>0,'CALCUL EFFECTIFS'!K81,$A$6&\"\")","v":8},{"$f":"IF('CALCUL EFFECTIFS'!L81>0,'CALCUL EFFECTIFS'!L81,$A$6&\"\")","v":2},{"$f":"IF('CALCUL EFFECTIFS'!M81>0,'CALCUL EFFECTIFS'!M81,$A$6&\"\")","v":4},{"$f":"IF('CALCUL EFFECTIFS'!N81>0,'CALCUL EFFECTIFS'!N81,$A$6&\"\")","v":3},{"$f":"IF('CALCUL EFFECTIFS'!O81>0,'CALCUL EFFECTIFS'!O81,$A$6&\"\")","v":2},{"$f":"IF('CALCUL EFFECTIFS'!P81>0,'CALCUL EFFECTIFS'!P81,$A$6&\"\")","v":1},{"$f":"IF('CALCUL EFFECTIFS'!Q81>0,'CALCUL EFFECTIFS'!Q81,$A$6&\"\")","v":4},{"$f":"IF('CALCUL EFFECTIFS'!R81>0,'CALCUL EFFECTIFS'!R81,$A$6&\"\")","v":""},{"$f":"IF('CALCUL EFFECTIFS'!S81>0,'CALCUL EFFECTIFS'!S81,$A$6&\"\")","v":""},{"$f":"IF('CALCUL EFFECTIFS'!T81>0,'CALCUL EFFECTIFS'!T81,$A$6&\"\")","v":""},{"$f":"IF('CALCUL EFFECTIFS'!U81>0,'CALCUL EFFECTIFS'!U81,$A$6&\"\")","v":""},{"$f":"IF('CALCUL EFFECTIFS'!V81>0,'CALCUL EFFECTIFS'!V81,$A$6&\"\")","v":""},{"$f":"IF('CALCUL EFFECTIFS'!W81>0,'CALCUL EFFECTIFS'!W81,$A$6&\"\")","v":""},{"$f":"IF('CALCUL EFFECTIFS'!X81>0,'CALCUL EFFECTIFS'!X81,$A$6&\"\")","v":""},{"$f":"IF('CALCUL EFFECTIFS'!Y81>0,'CALCUL EFFECTIFS'!Y81,$A$6&\"\")","v":""},{"$f":"IF('CALCUL EFFECTIFS'!Z81>0,'CALCUL EFFECTIFS'!Z81,$A$6&\"\")","v":""},{"$f":"IF('CALCUL EFFECTIFS'!AA81>0,'CALCUL EFFECTIFS'!AA81,$A$6&\"\")","v":""},{"$f":"IF('CALCUL EFFECTIFS'!AB81>0,'CALCUL EFFECTIFS'!AB81,$A$6&\"\")","v":""},{"$f":"IF('CALCUL EFFECTIFS'!AC81>0,'CALCUL EFFECTIFS'!AC81,$A$6&\"\")","v":""},{"$f":"IF('CALCUL EFFECTIFS'!AD81>0,'CALCUL EFFECTIFS'!AD81,$A$6&\"\")","v":""},{"$f":"IF('CALCUL EFFECTIFS'!AE81>0,'CALCUL EFFECTIFS'!AE81,$A$6&\"\")","v":""},{"$f":"IF('CALCUL EFFECTIFS'!AF81>0,'CALCUL EFFECTIFS'!AF81,$A$6&\"\")","v":""},{"$f":"IF('CALCUL EFFECTIFS'!AG81>0,'CALCUL EFFECTIFS'!AG81,$A$6&\"\")","v":""},{"$f":"IF('CALCUL EFFECTIFS'!AH81>0,'CALCUL EFFECTIFS'!AH81,$A$6&\"\")","v":""},{"$f":"IF('CALCUL EFFECTIFS'!AI81>0,'CALCUL EFFECTIFS'!AI81,$A$6&\"\")","v":""},{"$f":"IF('CALCUL EFFECTIFS'!AJ81>0,'CALCUL EFFECTIFS'!AJ81,$A$6&\"\")","v":""},{"$f":"IF('CALCUL EFFECTIFS'!AK81>0,'CALCUL EFFECTIFS'!AK81,$A$6&\"\")","v":""},{"$f":"IF('CALCUL EFFECTIFS'!AL81>0,'CALCUL EFFECTIFS'!AL81,$A$6&\"\")","v":""},{"$f":"IF('CALCUL EFFECTIFS'!AM81>0,'CALCUL EFFECTIFS'!AM81,$A$6&\"\")","v":""},{"$f":"IF('CALCUL EFFECTIFS'!AN81>0,'CALCUL EFFECTIFS'!AN81,$A$6&\"\")","v":""},{"$f":"IF('CALCUL EFFECTIFS'!AO81>0,'CALCUL EFFECTIFS'!AO81,$A$6&\"\")","v":""},{"$f":"IF('CALCUL EFFECTIFS'!AP81>0,'CALCUL EFFECTIFS'!AP81,$A$6&\"\")","v":""},{"$f":"IF('CALCUL EFFECTIFS'!AQ81>0,'CALCUL EFFECTIFS'!AQ81,$A$6&\"\")","v":""},{"$f":"IF('CALCUL EFFECTIFS'!AR81>0,'CALCUL EFFECTIFS'!AR81,$A$6&\"\")","v":""},{"$f":"IF('CALCUL EFFECTIFS'!AS81>0,'CALCUL EFFECTIFS'!AS81,$A$6&\"\")","v":""},{"$f":"IF('CALCUL EFFECTIFS'!AT81>0,'CALCUL EFFECTIFS'!AT81,$A$6&\"\")","v":""}]
[{"$f":"IF(B16>0,'CALCUL EFFECTIFS'!B93&\"\",$A$6&\"\")","v":"PÂTISSERIE"},80,{"$f":"IF('CALCUL EFFECTIFS'!D93>0,'CALCUL EFFECTIFS'!D93,$A$6&\"\")","v":""},{"$f":"IF('CALCUL EFFECTIFS'!E93>0,'CALCUL EFFECTIFS'!E93,$A$6&\"\")","v":""},{"$f":"IF('CALCUL EFFECTIFS'!F93>0,'CALCUL EFFECTIFS'!F93,$A$6&\"\")","v":""},{"$f":"IF('CALCUL EFFECTIFS'!G93>0,'CALCUL EFFECTIFS'!G93,$A$6&\"\")","v":17},{"$f":"IF('CALCUL EFFECTIFS'!H93>0,'CALCUL EFFECTIFS'!H93,$A$6&\"\")","v":21},{"$f":"IF('CALCUL EFFECTIFS'!I93>0,'CALCUL EFFECTIFS'!I93,$A$6&\"\")","v":16},{"$f":"IF('CALCUL EFFECTIFS'!J93>0,'CALCUL EFFECTIFS'!J93,$A$6&\"\")","v":6},{"$f":"IF('CALCUL EFFECTIFS'!K93>0,'CALCUL EFFECTIFS'!K93,$A$6&\"\")","v":4},{"$f":"IF('CALCUL EFFECTIFS'!L93>0,'CALCUL EFFECTIFS'!L93,$A$6&\"\")","v":2},{"$f":"IF('CALCUL EFFECTIFS'!M93>0,'CALCUL EFFECTIFS'!M93,$A$6&\"\")","v":4},{"$f":"IF('CALCUL EFFECTIFS'!N93>0,'CALCUL EFFECTIFS'!N93,$A$6&\"\")","v":3},{"$f":"IF('CALCUL EFFECTIFS'!O93>0,'CALCUL EFFECTIFS'!O93,$A$6&\"\")","v":2},{"$f":"IF('CALCUL EFFECTIFS'!P93>0,'CALCUL EFFECTIFS'!P93,$A$6&\"\")","v":1},{"$f":"IF('CALCUL EFFECTIFS'!Q93>0,'CALCUL EFFECTIFS'!Q93,$A$6&\"\")","v":4},{"$f":"IF('CALCUL EFFECTIFS'!R93>0,'CALCUL EFFECTIFS'!R93,$A$6&\"\")","v":""},{"$f":"IF('CALCUL EFFECTIFS'!S93>0,'CALCUL EFFECTIFS'!S93,$A$6&\"\")","v":""},{"$f":"IF('CALCUL EFFECTIFS'!T93>0,'CALCUL EFFECTIFS'!T93,$A$6&\"\")","v":""},{"$f":"IF('CALCUL EFFECTIFS'!U93>0,'CALCUL EFFECTIFS'!U93,$A$6&\"\")","v":""},{"$f":"IF('CALCUL EFFECTIFS'!V93>0,'CALCUL EFFECTIFS'!V93,$A$6&\"\")","v":""},{"$f":"IF('CALCUL EFFECTIFS'!W93>0,'CALCUL EFFECTIFS'!W93,$A$6&\"\")","v":""},{"$f":"IF('CALCUL EFFECTIFS'!X93>0,'CALCUL EFFECTIFS'!X93,$A$6&\"\")","v":""},{"$f":"IF('CALCUL EFFECTIFS'!Y93>0,'CALCUL EFFECTIFS'!Y93,$A$6&\"\")","v":""},{"$f":"IF('CALCUL EFFECTIFS'!Z93>0,'CALCUL EFFECTIFS'!Z93,$A$6&\"\")","v":""},{"$f":"IF('CALCUL EFFECTIFS'!AA93>0,'CALCUL EFFECTIFS'!AA93,$A$6&\"\")","v":""},{"$f":"IF('CALCUL EFFECTIFS'!AB93>0,'CALCUL EFFECTIFS'!AB93,$A$6&\"\")","v":""},{"$f":"IF('CALCUL EFFECTIFS'!AC93>0,'CALCUL EFFECTIFS'!AC93,$A$6&\"\")","v":""},{"$f":"IF('CALCUL EFFECTIFS'!AD93>0,'CALCUL EFFECTIFS'!AD93,$A$6&\"\")","v":""},{"$f":"IF('CALCUL EFFECTIFS'!AE93>0,'CALCUL EFFECTIFS'!AE93,$A$6&\"\")","v":""},{"$f":"IF('CALCUL EFFECTIFS'!AF93>0,'CALCUL EFFECTIFS'!AF93,$A$6&\"\")","v":""},{"$f":"IF('CALCUL EFFECTIFS'!AG93>0,'CALCUL EFFECTIFS'!AG93,$A$6&\"\")","v":""},{"$f":"IF('CALCUL EFFECTIFS'!AH93>0,'CALCUL EFFECTIFS'!AH93,$A$6&\"\")","v":""},{"$f":"IF('CALCUL EFFECTIFS'!AI93>0,'CALCUL EFFECTIFS'!AI93,$A$6&\"\")","v":""},{"$f":"IF('CALCUL EFFECTIFS'!AJ93>0,'CALCUL EFFECTIFS'!AJ93,$A$6&\"\")","v":""},{"$f":"IF('CALCUL EFFECTIFS'!AK93>0,'CALCUL EFFECTIFS'!AK93,$A$6&\"\")","v":""},{"$f":"IF('CALCUL EFFECTIFS'!AL93>0,'CALCUL EFFECTIFS'!AL93,$A$6&\"\")","v":""},{"$f":"IF('CALCUL EFFECTIFS'!AM93>0,'CALCUL EFFECTIFS'!AM93,$A$6&\"\")","v":""},{"$f":"IF('CALCUL EFFECTIFS'!AN93>0,'CALCUL EFFECTIFS'!AN93,$A$6&\"\")","v":""},{"$f":"IF('CALCUL EFFECTIFS'!AO93>0,'CALCUL EFFECTIFS'!AO93,$A$6&\"\")","v":""},{"$f":"IF('CALCUL EFFECTIFS'!AP93>0,'CALCUL EFFECTIFS'!AP93,$A$6&\"\")","v":""},{"$f":"IF('CALCUL EFFECTIFS'!AQ93>0,'CALCUL EFFECTIFS'!AQ93,$A$6&\"\")","v":""},{"$f":"IF('CALCUL EFFECTIFS'!AR93>0,'CALCUL EFFECTIFS'!AR93,$A$6&\"\")","v":""},{"$f":"IF('CALCUL EFFECTIFS'!AS93>0,'CALCUL EFFECTIFS'!AS93,$A$6&\"\")","v":""},{"$f":"IF('CALCUL EFFECTIFS'!AT93>0,'CALCUL EFFECTIFS'!AT93,$A$6&\"\")","v":""}]
[{"$f":"IF(MENUS!B9=\"POTAGE\",'CALCUL EFFECTIFS'!B49,A6&\"\")","v":""},0,null,null,null,{"$f":"IF($A$17=\"POTAGE\",'CALCUL EFFECTIFS'!G50,$A$6&\"\")","v":""},{"$f":"IF($A$17=\"POTAGE\",'CALCUL EFFECTIFS'!H50,$A$6&\"\")","v":""},{"$f":"IF($A$17=\"POTAGE\",'CALCUL EFFECTIFS'!I50,$A$6&\"\")","v":""},{"$f":"IF($A$17=\"POTAGE\",'CALCUL EFFECTIFS'!J50,$A$6&\"\")","v":""},{"$f":"IF($A$17=\"POTAGE\",'CALCUL EFFECTIFS'!K50,$A$6&\"\")","v":""},{"$f":"IF($A$17=\"POTAGE\",'CALCUL EFFECTIFS'!L50,$A$6&\"\")","v":""},{"$f":"IF($A$17=\"POTAGE\",'CALCUL EFFECTIFS'!M50,$A$6&\"\")","v":""},{"$f":"IF($A$17=\"POTAGE\",'CALCUL EFFECTIFS'!N50,$A$6&\"\")","v":""},{"$f":"IF($A$17=\"POTAGE\",'CALCUL EFFECTIFS'!O50,$A$6&\"\")","v":""},{"$f":"IF($A$17=\"POTAGE\",'CALCUL EFFECTIFS'!P50,$A$6&\"\")","v":""},{"$f":"IF($A$17=\"POTAGE\",'CALCUL EFFECTIFS'!Q50,$A$6&\"\")","v":""},{"$f":"IF($A$17=\"POTAGE\",'CALCUL EFFECTIFS'!R50,$A$6&\"\")","v":""},{"$f":"IF($A$17=\"POTAGE\",'CALCUL EFFECTIFS'!S50,$A$6&\"\")","v":""},{"$f":"IF($A$17=\"POTAGE\",'CALCUL EFFECTIFS'!T50,$A$6&\"\")","v":""},{"$f":"IF($A$17=\"POTAGE\",'CALCUL EFFECTIFS'!U50,$A$6&\"\")","v":""},{"$f":"IF($A$17=\"POTAGE\",'CALCUL EFFECTIFS'!V50,$A$6&\"\")","v":""},{"$f":"IF($A$17=\"POTAGE\",'CALCUL EFFECTIFS'!W50,$A$6&\"\")","v":""},{"$f":"IF($A$17=\"POTAGE\",'CALCUL EFFECTIFS'!X50,$A$6&\"\")","v":""},{"$f":"IF($A$17=\"POTAGE\",'CALCUL EFFECTIFS'!Y50,$A$6&\"\")","v":""},{"$f":"IF($A$17=\"POTAGE\",'CALCUL EFFECTIFS'!Z50,$A$6&\"\")","v":""},{"$f":"IF($A$17=\"POTAGE\",'CALCUL EFFECTIFS'!AA50,$A$6&\"\")","v":""},{"$f":"IF($A$17=\"POTAGE\",'CALCUL EFFECTIFS'!AB50,$A$6&\"\")","v":""},{"$f":"IF($A$17=\"POTAGE\",'CALCUL EFFECTIFS'!AC50,$A$6&\"\")","v":""},{"$f":"IF($A$17=\"POTAGE\",'CALCUL EFFECTIFS'!AD50,$A$6&\"\")","v":""},{"$f":"IF($A$17=\"POTAGE\",'CALCUL EFFECTIFS'!AE50,$A$6&\"\")","v":""},{"$f":"IF($A$17=\"POTAGE\",'CALCUL EFFECTIFS'!AF50,$A$6&\"\")","v":""},{"$f":"IF($A$17=\"POTAGE\",'CALCUL EFFECTIFS'!AG50,$A$6&\"\")","v":""},{"$f":"IF($A$17=\"POTAGE\",'CALCUL EFFECTIFS'!AH50,$A$6&\"\")","v":""},{"$f":"IF($A$17=\"POTAGE\",'CALCUL EFFECTIFS'!AI50,$A$6&\"\")","v":""},{"$f":"IF($A$17=\"POTAGE\",'CALCUL EFFECTIFS'!AJ50,$A$6&\"\")","v":""},{"$f":"IF($A$17=\"POTAGE\",'CALCUL EFFECTIFS'!AK50,$A$6&\"\")","v":""},{"$f":"IF($A$17=\"POTAGE\",'CALCUL EFFECTIFS'!AL50,$A$6&\"\")","v":""},{"$f":"IF($A$17=\"POTAGE\",'CALCUL EFFECTIFS'!AM50,$A$6&\"\")","v":""},{"$f":"IF($A$17=\"POTAGE\",'CALCUL EFFECTIFS'!AN50,$A$6&\"\")","v":""},{"$f":"IF($A$17=\"POTAGE\",'CALCUL EFFECTIFS'!AO50,$A$6&\"\")","v":""},{"$f":"IF($A$17=\"POTAGE\",'CALCUL EFFECTIFS'!AP50,$A$6&\"\")","v":""},{"$f":"IF($A$17=\"POTAGE\",'CALCUL EFFECTIFS'!AQ50,$A$6&\"\")","v":""},{"$f":"IF($A$17=\"POTAGE\",'CALCUL EFFECTIFS'!AR50,$A$6&\"\")","v":""},{"$f":"IF($A$17=\"POTAGE\",'CALCUL EFFECTIFS'!AS50,$A$6&\"\")","v":""},{"$f":"IF($A$17=\"POTAGE\",'CALCUL EFFECTIFS'!AT50,$A$6&\"\")","v":""}]
["LEGUMES VERTS REMY",1,null,null,null,1]
["LEGUMES VERTS",1,null,null,null,null,null,1]
["FECULENT",2,null,null,null,1,null,1]
["VIANDE OU POISSON SANS SAUCE",0,null,null,null,null,null,null,null,null,null,null,null,null,null,null,null,null,null,null,null,null,null,null,{"$f":"IF('CALCUL EFFECTIFS'!Z60>0,'CALCUL EFFECTIFS'!Z60,$A$6&\"\")","v":""},{"$f":"IF('CALCUL EFFECTIFS'!AA60>0,'CALCUL EFFECTIFS'!AA60,$A$6&\"\")","v":""},{"$f":"IF('CALCUL EFFECTIFS'!AB60>0,'CALCUL EFFECTIFS'!AB60,$A$6&\"\")","v":""},{"$f":"IF('CALCUL EFFECTIFS'!AC60>0,'CALCUL EFFECTIFS'!AC60,$A$6&\"\")","v":""},{"$f":"IF('CALCUL EFFECTIFS'!AD60>0,'CALCUL EFFECTIFS'!AD60,$A$6&\"\")","v":""}]
[null,0]
[null,0]
[null,0]
[{"$f":"IF(B25>0,'CALCUL EFFECTIFS'!B26&\"\",$A$6&\"\")","v":"TOMATE VINAIGRETTE"},4,null,{"$f":"IF('CALCUL EFFECTIFS'!E26>0,'CALCUL EFFECTIFS'!E26,$A$6&\"\")","v":""},null,{"$f":"IF(MENUS!$B$9=\"POTAGE\",$A$6&\"\",'CALCUL EFFECTIFS'!G27)","v":""},{"$f":"IF(MENUS!$B$9=\"POTAGE\",$A$6&\"\",'CALCUL EFFECTIFS'!H27)","v":2},{"$f":"IF(MENUS!$B$9=\"POTAGE\",$A$6&\"\",'CALCUL EFFECTIFS'!I27)","v":2},{"$f":"IF(MENUS!$B$9=\"POTAGE\",$A$6&\"\",'CALCUL EFFECTIFS'!J27)","v":""},{"$f":"IF(MENUS!$B$9=\"POTAGE\",$A$6&\"\",'CALCUL EFFECTIFS'!K27)","v":""},{"$f":"IF(MENUS!$B$9=\"POTAGE\",$A$6&\"\",'CALCUL EFFECTIFS'!L27)","v":""},{"$f":"IF(MENUS!$B$9=\"POTAGE\",$A$6&\"\",'CALCUL EFFECTIFS'!M27)","v":""},{"$f":"IF(MENUS!$B$9=\"POTAGE\",$A$6&\"\",'CALCUL EFFECTIFS'!N27)","v":""},{"$f":"IF(MENUS!$B$9=\"POTAGE\",$A$6&\"\",'CALCUL EFFECTIFS'!O27)","v":""},{"$f":"IF(MENUS!$B$9=\"POTAGE\",$A$6&\"\",'CALCUL EFFECTIFS'!P27)","v":""},{"$f":"IF(MENUS!$B$9=\"POTAGE\",$A$6&\"\",'CALCUL EFFECTIFS'!Q27)","v":""},{"$f":"IF(MENUS!$B$9=\"POTAGE\",$A$6&\"\",'CALCUL EFFECTIFS'!R27)","v":""},{"$f":"IF(MENUS!$B$9=\"POTAGE\",$A$6&\"\",'CALCUL EFFECTIFS'!S27)","v":""},{"$f":"IF(MENUS!$B$9=\"POTAGE\",$A$6&\"\",'CALCUL EFFECTIFS'!T27)","v":""},{"$f":"IF(MENUS!$B$9=\"POTAGE\",$A$6&\"\",'CALCUL EFFECTIFS'!U27)","v":""},{"$f":"IF(MENUS!$B$9=\"POTAGE\",$A$6&\"\",'CALCUL EFFECTIFS'!V27)","v":""},{"$f":"IF(MENUS!$B$9=\"POTAGE\",$A$6&\"\",'CALCUL EFFECTIFS'!W27)","v":""},{"$f":"IF(MENUS!$B$9=\"POTAGE\",$A$6&\"\",'CALCUL EFFECTIFS'!X27)","v":""},{"$f":"IF(MENUS!$B$9=\"POTAGE\",$A$6&\"\",'CALCUL EFFECTIFS'!Y27)","v":""},{"$f":"IF(MENUS!$B$9=\"POTAGE\",$A$6&\"\",'CALCUL EFFECTIFS'!Z27)","v":""},{"$f":"IF(MENUS!$B$9=\"POTAGE\",$A$6&\"\",'CALCUL EFFECTIFS'!AA27)","v":""},{"$f":"IF(MENUS!$B$9=\"POTAGE\",$A$6&\"\",'CALCUL EFFECTIFS'!AB27)","v":""},{"$f":"IF(MENUS!$B$9=\"POTAGE\",$A$6&\"\",'CALCUL EFFECTIFS'!AC27)","v":""},{"$f":"IF(MENUS!$B$9=\"POTAGE\",$A$6&\"\",'CALCUL EFFECTIFS'!AD27)","v":""},{"$f":"IF(MENUS!$B$9=\"POTAGE\",$A$6&\"\",'CALCUL EFFECTIFS'!AE27)","v":""},{"$f":"IF(MENUS!$B$9=\"POTAGE\",$A$6&\"\",'CALCUL EFFECTIFS'!AF27)","v":""},{"$f":"IF(MENUS!$B$9=\"POTAGE\",$A$6&\"\",'CALCUL EFFECTIFS'!AG27)","v":""},{"$f":"IF(MENUS!$B$9=\"POTAGE\",$A$6&\"\",'CALCUL EFFECTIFS'!AH27)","v":""},{"$f":"IF(MENUS!$B$9=\"POTAGE\",$A$6&\"\",'CALCUL EFFECTIFS'!AI27)","v":""},{"$f":"IF(MENUS!$B$9=\"POTAGE\",$A$6&\"\",'CALCUL EFFECTIFS'!AJ27)","v":""},{"$f":"IF(MENUS!$B$9=\"POTAGE\",$A$6&\"\",'CALCUL EFFECTIFS'!AK27)","v":""},{"$f":"IF(MENUS!$B$9=\"POTAGE\",$A$6&\"\",'CALCUL EFFECTIFS'!AL27)","v":""},{"$f":"IF(MENUS!$B$9=\"POTAGE\",$A$6&\"\",'CALCUL EFFECTIFS'!AM27)","v":""},{"$f":"IF(MENUS!$B$9=\"POTAGE\",$A$6&\"\",'CALCUL EFFECTIFS'!AN27)","v":""},{"$f":"IF(MENUS!$B$9=\"POTAGE\",$A$6&\"\",'CALCUL EFFECTIFS'!AO27)","v":""},{"$f":"IF(MENUS!$B$9=\"POTAGE\",$A$6&\"\",'CALCUL EFFECTIFS'!AP27)","v":""},{"$f":"IF(MENUS!$B$9=\"POTAGE\",$A$6&\"\",'CALCUL EFFECTIFS'!AQ27)","v":""},{"$f":"IF(MENUS!$B$9=\"POTAGE\",$A$6&\"\",'CALCUL EFFECTIFS'!AR27)","v":""},{"$f":"IF(MENUS!$B$9=\"POTAGE\",$A$6&\"\",'CALCUL EFFECTIFS'!AS27)","v":""}]
[{"$f":"IF(B26>0,'CALCUL EFFECTIFS'!B58&\"\",$A$6&\"\")","v":"BŒUF BOURGUIGNON SANS LARDONS"},4,null,{"$f":"IF('CALCUL EFFECTIFS'!E58>0,'CALCUL EFFECTIFS'!E58,$A$6&\"\")","v":""},null,{"$f":"IF('CALCUL EFFECTIFS'!G58>0,'CALCUL EFFECTIFS'!G58,$A$6&\"\")","v":""},{"$f":"IF('CALCUL EFFECTIFS'!H58>0,'CALCUL EFFECTIFS'!H58,$A$6&\"\")","v":2},{"$f":"IF('CALCUL EFFECTIFS'!I58>0,'CALCUL EFFECTIFS'!I58,$A$6&\"\")","v":2},{"$f":"IF('CALCUL EFFECTIFS'!J58>0,'CALCUL EFFECTIFS'!J58,$A$6&\"\")","v":""},{"$f":"IF('CALCUL EFFECTIFS'!K58>0,'CALCUL EFFECTIFS'!K58,$A$6&\"\")","v":""},{"$f":"IF('CALCUL EFFECTIFS'!L58>0,'CALCUL EFFECTIFS'!L58,$A$6&\"\")","v":""},{"$f":"IF('CALCUL EFFECTIFS'!M58>0,'CALCUL EFFECTIFS'!M58,$A$6&\"\")","v":""},{"$f":"IF('CALCUL EFFECTIFS'!N58>0,'CALCUL EFFECTIFS'!N58,$A$6&\"\")","v":""},{"$f":"IF('CALCUL EFFECTIFS'!O58>0,'CALCUL EFFECTIFS'!O58,$A$6&\"\")","v":""},{"$f":"IF('CALCUL EFFECTIFS'!P58>0,'CALCUL EFFECTIFS'!P58,$A$6&\"\")","v":""},{"$f":"IF('CALCUL EFFECTIFS'!Q58>0,'CALCUL EFFECTIFS'!Q58,$A$6&\"\")","v":""},{"$f":"IF('CALCUL EFFECTIFS'!R58>0,'CALCUL EFFECTIFS'!R58,$A$6&\"\")","v":""},{"$f":"IF('CALCUL EFFECTIFS'!S58>0,'CALCUL EFFECTIFS'!S58,$A$6&\"\")","v":""},{"$f":"IF('CALCUL EFFECTIFS'!T58>0,'CALCUL EFFECTIFS'!T58,$A$6&\"\")","v":""},{"$f":"IF('CALCUL EFFECTIFS'!U58>0,'CALCUL EFFECTIFS'!U58,$A$6&\"\")","v":""},{"$f":"IF('CALCUL EFFECTIFS'!V58>0,'CALCUL EFFECTIFS'!V58,$A$6&\"\")","v":""},{"$f":"IF('CALCUL EFFECTIFS'!W58>0,'CALCUL EFFECTIFS'!W58,$A$6&\"\")","v":""},{"$f":"IF('CALCUL EFFECTIFS'!X58>0,'CALCUL EFFECTIFS'!X58,$A$6&\"\")","v":""},{"$f":"IF('CALCUL EFFECTIFS'!Y58>0,'CALCUL EFFECTIFS'!Y58,$A$6&\"\")","v":""},{"$f":"IF('CALCUL EFFECTIFS'!Z58>0,'CALCUL EFFECTIFS'!Z58,$A$6&\"\")","v":""},{"$f":"IF('CALCUL EFFECTIFS'!AA58>0,'CALCUL EFFECTIFS'!AA58,$A$6&\"\")","v":""},{"$f":"IF('CALCUL EFFECTIFS'!AB58>0,'CALCUL EFFECTIFS'!AB58,$A$6&\"\")","v":""},{"$f":"IF('CALCUL EFFECTIFS'!AC58>0,'CALCUL EFFECTIFS'!AC58,$A$6&\"\")","v":""},{"$f":"IF('CALCUL EFFECTIFS'!AD58>0,'CALCUL EFFECTIFS'!AD58,$A$6&\"\")","v":""},{"$f":"IF('CALCUL EFFECTIFS'!AE58>0,'CALCUL EFFECTIFS'!AE58,$A$6&\"\")","v":""},{"$f":"IF('CALCUL EFFECTIFS'!AF58>0,'CALCUL EFFECTIFS'!AF58,$A$6&\"\")","v":""},{"$f":"IF('CALCUL EFFECTIFS'!AG58>0,'CALCUL EFFECTIFS'!AG58,$A$6&\"\")","v":""},{"$f":"IF('CALCUL EFFECTIFS'!AH58>0,'CALCUL EFFECTIFS'!AH58,$A$6&\"\")","v":""},{"$f":"IF('CALCUL EFFECTIFS'!AI58>0,'CALCUL EFFECTIFS'!AI58,$A$6&\"\")","v":""},{"$f":"IF('CALCUL EFFECTIFS'!AJ58>0,'CALCUL EFFECTIFS'!AJ58,$A$6&\"\")","v":""},{"$f":"IF('CALCUL EFFECTIFS'!AK58>0,'CALCUL EFFECTIFS'!AK58,$A$6&\"\")","v":""},{"$f":"IF('CALCUL EFFECTIFS'!AL58>0,'CALCUL EFFECTIFS'!AL58,$A$6&\"\")","v":""},{"$f":"IF('CALCUL EFFECTIFS'!AM58>0,'CALCUL EFFECTIFS'!AM58,$A$6&\"\")","v":""},{"$f":"IF('CALCUL EFFECTIFS'!AN58>0,'CALCUL EFFECTIFS'!AN58,$A$6&\"\")","v":""},{"$f":"IF('CALCUL EFFECTIFS'!AO58>0,'CALCUL EFFECTIFS'!AO58,$A$6&\"\")","v":""},{"$f":"IF('CALCUL EFFECTIFS'!AP58>0,'CALCUL EFFECTIFS'!AP58,$A$6&\"\")","v":""},{"$f":"IF('CALCUL EFFECTIFS'!AQ58>0,'CALCUL EFFECTIFS'!AQ58,$A$6&\"\")","v":""},{"$f":"IF('CALCUL EFFECTIFS'!AR58>0,'CALCUL EFFECTIFS'!AR58,$A$6&\"\")","v":""},{"$f":"IF('CALCUL EFFECTIFS'!AS58>0,'CALCUL EFFECTIFS'!AS58,$A$6&\"\")","v":""}]
[{"$f":"IF(B27>0,'CALCUL EFFECTIFS'!B70&\"\",$A$6&\"\")","v":""},0,null,{"$f":"IF('CALCUL EFFECTIFS'!E70>0,'CALCUL EFFECTIFS'!E70,$A$6&\"\")","v":""},null,{"$f":"IF('CALCUL EFFECTIFS'!G70>0,'CALCUL EFFECTIFS'!G70,$A$6&\"\")","v":""},{"$f":"IF('CALCUL EFFECTIFS'!H70>0,'CALCUL EFFECTIFS'!H70,$A$6&\"\")","v":""},{"$f":"IF('CALCUL EFFECTIFS'!I70>0,'CALCUL EFFECTIFS'!I70,$A$6&\"\")","v":""},{"$f":"IF('CALCUL EFFECTIFS'!J70>0,'CALCUL EFFECTIFS'!J70,$A$6&\"\")","v":""},{"$f":"IF('CALCUL EFFECTIFS'!K70>0,'CALCUL EFFECTIFS'!K70,$A$6&\"\")","v":""},{"$f":"IF('CALCUL EFFECTIFS'!L70>0,'CALCUL EFFECTIFS'!L70,$A$6&\"\")","v":""},{"$f":"IF('CALCUL EFFECTIFS'!M70>0,'CALCUL EFFECTIFS'!M70,$A$6&\"\")","v":""},{"$f":"IF('CALCUL EFFECTIFS'!N70>0,'CALCUL EFFECTIFS'!N70,$A$6&\"\")","v":""},{"$f":"IF('CALCUL EFFECTIFS'!O70>0,'CALCUL EFFECTIFS'!O70,$A$6&\"\")","v":""},{"$f":"IF('CALCUL EFFECTIFS'!P70>0,'CALCUL EFFECTIFS'!P70,$A$6&\"\")","v":""},{"$f":"IF('CALCUL EFFECTIFS'!Q70>0,'CALCUL EFFECTIFS'!Q70,$A$6&\"\")","v":""},{"$f":"IF('CALCUL EFFECTIFS'!R70>0,'CALCUL EFFECTIFS'!R70,$A$6&\"\")","v":""},{"$f":"IF('CALCUL EFFECTIFS'!S70>0,'CALCUL EFFECTIFS'!S70,$A$6&\"\")","v":""},{"$f":"IF('CALCUL EFFECTIFS'!T70>0,'CALCUL EFFECTIFS'!T70,$A$6&\"\")","v":""},{"$f":"IF('CALCUL EFFECTIFS'!U70>0,'CALCUL EFFECTIFS'!U70,$A$6&\"\")","v":""},{"$f":"IF('CALCUL EFFECTIFS'!V70>0,'CALCUL EFFECTIFS'!V70,$A$6&\"\")","v":""},{"$f":"IF('CALCUL EFFECTIFS'!W70>0,'CALCUL EFFECTIFS'!W70,$A$6&\"\")","v":""},{"$f":"IF('CALCUL EFFECTIFS'!X70>0,'CALCUL EFFECTIFS'!X70,$A$6&\"\")","v":""},{"$f":"IF('CALCUL EFFECTIFS'!Y70>0,'CALCUL EFFECTIFS'!Y70,$A$6&\"\")","v":""},{"$f":"IF('CALCUL EFFECTIFS'!Z70>0,'CALCUL EFFECTIFS'!Z70,$A$6&\"\")","v":""},{"$f":"IF('CALCUL EFFECTIFS'!AA70>0,'CALCUL EFFECTIFS'!AA70,$A$6&\"\")","v":""},{"$f":"IF('CALCUL EFFECTIFS'!AB70>0,'CALCUL EFFECTIFS'!AB70,$A$6&\"\")","v":""},{"$f":"IF('CALCUL EFFECTIFS'!AC70>0,'CALCUL EFFECTIFS'!AC70,$A$6&\"\")","v":""},{"$f":"IF('CALCUL EFFECTIFS'!AD70>0,'CALCUL EFFECTIFS'!AD70,$A$6&\"\")","v":""},{"$f":"IF('CALCUL EFFECTIFS'!AE70>0,'CALCUL EFFECTIFS'!AE70,$A$6&\"\")","v":""},{"$f":"IF('CALCUL EFFECTIFS'!AF70>0,'CALCUL EFFECTIFS'!AF70,$A$6&\"\")","v":""},{"$f":"IF('CALCUL EFFECTIFS'!AG70>0,'CALCUL EFFECTIFS'!AG70,$A$6&\"\")","v":""},{"$f":"IF('CALCUL EFFECTIFS'!AH70>0,'CALCUL EFFECTIFS'!AH70,$A$6&\"\")","v":""},{"$f":"IF('CALCUL EFFECTIFS'!AI70>0,'CALCUL EFFECTIFS'!AI70,$A$6&\"\")","v":""},{"$f":"IF('CALCUL EFFECTIFS'!AJ70>0,'CALCUL EFFECTIFS'!AJ70,$A$6&\"\")","v":""},{"$f":"IF('CALCUL EFFECTIFS'!AK70>0,'CALCUL EFFECTIFS'!AK70,$A$6&\"\")","v":""},{"$f":"IF('CALCUL EFFECTIFS'!AL70>0,'CALCUL EFFECTIFS'!AL70,$A$6&\"\")","v":""},{"$f":"IF('CALCUL EFFECTIFS'!AM70>0,'CALCUL EFFECTIFS'!AM70,$A$6&\"\")","v":""},{"$f":"IF('CALCUL EFFECTIFS'!AN70>0,'CALCUL EFFECTIFS'!AN70,$A$6&\"\")","v":""},{"$f":"IF('CALCUL EFFECTIFS'!AO70>0,'CALCUL EFFECTIFS'!AO70,$A$6&\"\")","v":""},{"$f":"IF('CALCUL EFFECTIFS'!AP70>0,'CALCUL EFFECTIFS'!AP70,$A$6&\"\")","v":""},{"$f":"IF('CALCUL EFFECTIFS'!AQ70>0,'CALCUL EFFECTIFS'!AQ70,$A$6&\"\")","v":""},{"$f":"IF('CALCUL EFFECTIFS'!AR70>0,'CALCUL EFFECTIFS'!AR70,$A$6&\"\")","v":""},{"$f":"IF('CALCUL EFFECTIFS'!AS70>0,'CALCUL EFFECTIFS'!AS70,$A$6&\"\")","v":""}]
[{"$f":"IF(B28>0,'CALCUL EFFECTIFS'!B82&\"\",$A$6&\"\")","v":"YAOURT"},4,null,{"$f":"IF('CALCUL EFFECTIFS'!E82>0,'CALCUL EFFECTIFS'!E82,$A$6&\"\")","v":""},null,{"$f":"IF('CALCUL EFFECTIFS'!G82>0,'CALCUL EFFECTIFS'!G82,$A$6&\"\")","v":""},{"$f":"IF('CALCUL EFFECTIFS'!H82>0,'CALCUL EFFECTIFS'!H82,$A$6&\"\")","v":2},{"$f":"IF('CALCUL EFFECTIFS'!I82>0,'CALCUL EFFECTIFS'!I82,$A$6&\"\")","v":2},{"$f":"IF('CALCUL EFFECTIFS'!J82>0,'CALCUL EFFECTIFS'!J82,$A$6&\"\")","v":""},{"$f":"IF('CALCUL EFFECTIFS'!K82>0,'CALCUL EFFECTIFS'!K82,$A$6&\"\")","v":""},{"$f":"IF('CALCUL EFFECTIFS'!L82>0,'CALCUL EFFECTIFS'!L82,$A$6&\"\")","v":""},{"$f":"IF('CALCUL EFFECTIFS'!M82>0,'CALCUL EFFECTIFS'!M82,$A$6&\"\")","v":""},{"$f":"IF('CALCUL EFFECTIFS'!N82>0,'CALCUL EFFECTIFS'!N82,$A$6&\"\")","v":""},{"$f":"IF('CALCUL EFFECTIFS'!O82>0,'CALCUL EFFECTIFS'!O82,$A$6&\"\")","v":""},{"$f":"IF('CALCUL EFFECTIFS'!P82>0,'CALCUL EFFECTIFS'!P82,$A$6&\"\")","v":""},{"$f":"IF('CALCUL EFFECTIFS'!Q82>0,'CALCUL EFFECTIFS'!Q82,$A$6&\"\")","v":""},{"$f":"IF('CALCUL EFFECTIFS'!R82>0,'CALCUL EFFECTIFS'!R82,$A$6&\"\")","v":""},{"$f":"IF('CALCUL EFFECTIFS'!S82>0,'CALCUL EFFECTIFS'!S82,$A$6&\"\")","v":""},{"$f":"IF('CALCUL EFFECTIFS'!T82>0,'CALCUL EFFECTIFS'!T82,$A$6&\"\")","v":""},{"$f":"IF('CALCUL EFFECTIFS'!U82>0,'CALCUL EFFECTIFS'!U82,$A$6&\"\")","v":""},{"$f":"IF('CALCUL EFFECTIFS'!V82>0,'CALCUL EFFECTIFS'!V82,$A$6&\"\")","v":""},{"$f":"IF('CALCUL EFFECTIFS'!W82>0,'CALCUL EFFECTIFS'!W82,$A$6&\"\")","v":""},{"$f":"IF('CALCUL EFFECTIFS'!X82>0,'CALCUL EFFECTIFS'!X82,$A$6&\"\")","v":""},{"$f":"IF('CALCUL EFFECTIFS'!Y82>0,'CALCUL EFFECTIFS'!Y82,$A$6&\"\")","v":""},{"$f":"IF('CALCUL EFFECTIFS'!Z82>0,'CALCUL EFFECTIFS'!Z82,$A$6&\"\")","v":""},{"$f":"IF('CALCUL EFFECTIFS'!AA82>0,'CALCUL EFFECTIFS'!AA82,$A$6&\"\")","v":""},{"$f":"IF('CALCUL EFFECTIFS'!AB82>0,'CALCUL EFFECTIFS'!AB82,$A$6&\"\")","v":""},{"$f":"IF('CALCUL EFFECTIFS'!AC82>0,'CALCUL EFFECTIFS'!AC82,$A$6&\"\")","v":""},{"$f":"IF('CALCUL EFFECTIFS'!AD82>0,'CALCUL EFFECTIFS'!AD82,$A$6&\"\")","v":""},{"$f":"IF('CALCUL EFFECTIFS'!AE82>0,'CALCUL EFFECTIFS'!AE82,$A$6&\"\")","v":""},{"$f":"IF('CALCUL EFFECTIFS'!AF82>0,'CALCUL EFFECTIFS'!AF82,$A$6&\"\")","v":""},{"$f":"IF('CALCUL EFFECTIFS'!AG82>0,'CALCUL EFFECTIFS'!AG82,$A$6&\"\")","v":""},{"$f":"IF('CALCUL EFFECTIFS'!AH82>0,'CALCUL EFFECTIFS'!AH82,$A$6&\"\")","v":""},{"$f":"IF('CALCUL EFFECTIFS'!AI82>0,'CALCUL EFFECTIFS'!AI82,$A$6&\"\")","v":""},{"$f":"IF('CALCUL EFFECTIFS'!AJ82>0,'CALCUL EFFECTIFS'!AJ82,$A$6&\"\")","v":""},{"$f":"IF('CALCUL EFFECTIFS'!AK82>0,'CALCUL EFFECTIFS'!AK82,$A$6&\"\")","v":""},{"$f":"IF('CALCUL EFFECTIFS'!AL82>0,'CALCUL EFFECTIFS'!AL82,$A$6&\"\")","v":""},{"$f":"IF('CALCUL EFFECTIFS'!AM82>0,'CALCUL EFFECTIFS'!AM82,$A$6&\"\")","v":""},{"$f":"IF('CALCUL EFFECTIFS'!AN82>0,'CALCUL EFFECTIFS'!AN82,$A$6&\"\")","v":""},{"$f":"IF('CALCUL EFFECTIFS'!AO82>0,'CALCUL EFFECTIFS'!AO82,$A$6&\"\")","v":""},{"$f":"IF('CALCUL EFFECTIFS'!AP82>0,'CALCUL EFFECTIFS'!AP82,$A$6&\"\")","v":""},{"$f":"IF('CALCUL EFFECTIFS'!AQ82>0,'CALCUL EFFECTIFS'!AQ82,$A$6&\"\")","v":""},{"$f":"IF('CALCUL EFFECTIFS'!AR82>0,'CALCUL EFFECTIFS'!AR82,$A$6&\"\")","v":""},{"$f":"IF('CALCUL EFFECTIFS'!AS82>0,'CALCUL EFFECTIFS'!AS82,$A$6&\"\")","v":""}]
[{"$f":"IF(B29>0,'CALCUL EFFECTIFS'!B94&\"\",$A$6&\"\")","v":""},0,null,{"$f":"IF('CALCUL EFFECTIFS'!E94>0,'CALCUL EFFECTIFS'!E94,$A$6&\"\")","v":""}]
[{"$f":"IF(B30>0,'CALCUL EFFECTIFS'!B28&\"\",$A$6&\"\")","v":""},0,null,{"$f":"IF('CALCUL EFFECTIFS'!E28>0,'CALCUL EFFECTIFS'!E28,$A$6&\"\")","v":""},null,{"$f":"IF(MENUS!$B$9=\"POTAGE\",$A$6&\"\",'CALCUL EFFECTIFS'!G29)","v":""},{"$f":"IF(MENUS!$B$9=\"POTAGE\",$A$6&\"\",'CALCUL EFFECTIFS'!H29)","v":""},{"$f":"IF(MENUS!$B$9=\"POTAGE\",$A$6&\"\",'CALCUL EFFECTIFS'!I29)","v":""},{"$f":"IF(MENUS!$B$9=\"POTAGE\",$A$6&\"\",'CALCUL EFFECTIFS'!J29)","v":""},{"$f":"IF(MENUS!$B$9=\"POTAGE\",$A$6&\"\",'CALCUL EFFECTIFS'!K29)","v":""},{"$f":"IF(MENUS!$B$9=\"POTAGE\",$A$6&\"\",'CALCUL EFFECTIFS'!L29)","v":""},{"$f":"IF(MENUS!$B$9=\"POTAGE\",$A$6&\"\",'CALCUL EFFECTIFS'!M29)","v":""},{"$f":"IF(MENUS!$B$9=\"POTAGE\",$A$6&\"\",'CALCUL EFFECTIFS'!N29)","v":""},{"$f":"IF(MENUS!$B$9=\"POTAGE\",$A$6&\"\",'CALCUL EFFECTIFS'!O29)","v":""},{"$f":"IF(MENUS!$B$9=\"POTAGE\",$A$6&\"\",'CALCUL EFFECTIFS'!P29)","v":""},{"$f":"IF(MENUS!$B$9=\"POTAGE\",$A$6&\"\",'CALCUL EFFECTIFS'!Q29)","v":""},{"$f":"IF(MENUS!$B$9=\"POTAGE\",$A$6&\"\",'CALCUL EFFECTIFS'!R29)","v":""},{"$f":"IF(MENUS!$B$9=\"POTAGE\",$A$6&\"\",'CALCUL EFFECTIFS'!S29)","v":""},{"$f":"IF(MENUS!$B$9=\"POTAGE\",$A$6&\"\",'CALCUL EFFECTIFS'!T29)","v":""},{"$f":"IF(MENUS!$B$9=\"POTAGE\",$A$6&\"\",'CALCUL EFFECTIFS'!U29)","v":""},{"$f":"IF(MENUS!$B$9=\"POTAGE\",$A$6&\"\",'CALCUL EFFECTIFS'!V29)","v":""},{"$f":"IF(MENUS!$B$9=\"POTAGE\",$A$6&\"\",'CALCUL EFFECTIFS'!W29)","v":""},{"$f":"IF(MENUS!$B$9=\"POTAGE\",$A$6&\"\",'CALCUL EFFECTIFS'!X29)","v":""},{"$f":"IF(MENUS!$B$9=\"POTAGE\",$A$6&\"\",'CALCUL EFFECTIFS'!Y29)","v":""},{"$f":"IF(MENUS!$B$9=\"POTAGE\",$A$6&\"\",'CALCUL EFFECTIFS'!Z29)","v":""},{"$f":"IF(MENUS!$B$9=\"POTAGE\",$A$6&\"\",'CALCUL EFFECTIFS'!AA29)","v":""},{"$f":"IF(MENUS!$B$9=\"POTAGE\",$A$6&\"\",'CALCUL EFFECTIFS'!AB29)","v":""},{"$f":"IF(MENUS!$B$9=\"POTAGE\",$A$6&\"\",'CALCUL EFFECTIFS'!AC29)","v":""},{"$f":"IF(MENUS!$B$9=\"POTAGE\",$A$6&\"\",'CALCUL EFFECTIFS'!AD29)","v":""},{"$f":"IF(MENUS!$B$9=\"POTAGE\",$A$6&\"\",'CALCUL EFFECTIFS'!AE29)","v":""},{"$f":"IF(MENUS!$B$9=\"POTAGE\",$A$6&\"\",'CALCUL EFFECTIFS'!AF29)","v":""},{"$f":"IF(MENUS!$B$9=\"POTAGE\",$A$6&\"\",'CALCUL EFFECTIFS'!AG29)","v":""},{"$f":"IF(MENUS!$B$9=\"POTAGE\",$A$6&\"\",'CALCUL EFFECTIFS'!AH29)","v":""},{"$f":"IF(MENUS!$B$9=\"POTAGE\",$A$6&\"\",'CALCUL EFFECTIFS'!AI29)","v":""},{"$f":"IF(MENUS!$B$9=\"POTAGE\",$A$6&\"\",'CALCUL EFFECTIFS'!AJ29)","v":""},{"$f":"IF(MENUS!$B$9=\"POTAGE\",$A$6&\"\",'CALCUL EFFECTIFS'!AK29)","v":""},{"$f":"IF(MENUS!$B$9=\"POTAGE\",$A$6&\"\",'CALCUL EFFECTIFS'!AL29)","v":""},{"$f":"IF(MENUS!$B$9=\"POTAGE\",$A$6&\"\",'CALCUL EFFECTIFS'!AM29)","v":""},{"$f":"IF(MENUS!$B$9=\"POTAGE\",$A$6&\"\",'CALCUL EFFECTIFS'!AN29)","v":""},{"$f":"IF(MENUS!$B$9=\"POTAGE\",$A$6&\"\",'CALCUL EFFECTIFS'!AO29)","v":""},{"$f":"IF(MENUS!$B$9=\"POTAGE\",$A$6&\"\",'CALCUL EFFECTIFS'!AP29)","v":""},{"$f":"IF(MENUS!$B$9=\"POTAGE\",$A$6&\"\",'CALCUL EFFECTIFS'!AQ29)","v":""},{"$f":"IF(MENUS!$B$9=\"POTAGE\",$A$6&\"\",'CALCUL EFFECTIFS'!AR29)","v":""},{"$f":"IF(MENUS!$B$9=\"POTAGE\",$A$6&\"\",'CALCUL EFFECTIFS'!AS29)","v":""}]
[{"$f":"IF(B31>0,'CALCUL EFFECTIFS'!B59&\"\",$A$6&\"\")","v":""},0,null,{"$f":"IF('CALCUL EFFECTIFS'!E59>0,'CALCUL EFFECTIFS'!E59,$A$6&\"\")","v":""},null,{"$f":"IF('CALCUL EFFECTIFS'!G59>0,'CALCUL EFFECTIFS'!G59,$A$6&\"\")","v":""},{"$f":"IF('CALCUL EFFECTIFS'!H59>0,'CALCUL EFFECTIFS'!H59,$A$6&\"\")","v":""},{"$f":"IF('CALCUL EFFECTIFS'!I59>0,'CALCUL EFFECTIFS'!I59,$A$6&\"\")","v":""},{"$f":"IF('CALCUL EFFECTIFS'!J59>0,'CALCUL EFFECTIFS'!J59,$A$6&\"\")","v":""},{"$f":"IF('CALCUL EFFECTIFS'!K59>0,'CALCUL EFFECTIFS'!K59,$A$6&\"\")","v":""},{"$f":"IF('CALCUL EFFECTIFS'!L59>0,'CALCUL EFFECTIFS'!L59,$A$6&\"\")","v":""},{"$f":"IF('CALCUL EFFECTIFS'!M59>0,'CALCUL EFFECTIFS'!M59,$A$6&\"\")","v":""},{"$f":"IF('CALCUL EFFECTIFS'!N59>0,'CALCUL EFFECTIFS'!N59,$A$6&\"\")","v":""},{"$f":"IF('CALCUL EFFECTIFS'!O59>0,'CALCUL EFFECTIFS'!O59,$A$6&\"\")","v":""},{"$f":"IF('CALCUL EFFECTIFS'!P59>0,'CALCUL EFFECTIFS'!P59,$A$6&\"\")","v":""},{"$f":"IF('CALCUL EFFECTIFS'!Q59>0,'CALCUL EFFECTIFS'!Q59,$A$6&\"\")","v":""},{"$f":"IF('CALCUL EFFECTIFS'!R59>0,'CALCUL EFFECTIFS'!R59,$A$6&\"\")","v":""},{"$f":"IF('CALCUL EFFECTIFS'!S59>0,'CALCUL EFFECTIFS'!S59,$A$6&\"\")","v":""},{"$f":"IF('CALCUL EFFECTIFS'!T59>0,'CALCUL EFFECTIFS'!T59,$A$6&\"\")","v":""},{"$f":"IF('CALCUL EFFECTIFS'!U59>0,'CALCUL EFFECTIFS'!U59,$A$6&\"\")","v":""},{"$f":"IF('CALCUL EFFECTIFS'!V59>0,'CALCUL EFFECTIFS'!V59,$A$6&\"\")","v":""},{"$f":"IF('CALCUL EFFECTIFS'!W59>0,'CALCUL EFFECTIFS'!W59,$A$6&\"\")","v":""},{"$f":"IF('CALCUL EFFECTIFS'!X59>0,'CALCUL EFFECTIFS'!X59,$A$6&\"\")","v":""},{"$f":"IF('CALCUL EFFECTIFS'!Y59>0,'CALCUL EFFECTIFS'!Y59,$A$6&\"\")","v":""},{"$f":"IF('CALCUL EFFECTIFS'!Z59>0,'CALCUL EFFECTIFS'!Z59,$A$6&\"\")","v":""},{"$f":"IF('CALCUL EFFECTIFS'!AA59>0,'CALCUL EFFECTIFS'!AA59,$A$6&\"\")","v":""},{"$f":"IF('CALCUL EFFECTIFS'!AB59>0,'CALCUL EFFECTIFS'!AB59,$A$6&\"\")","v":""},{"$f":"IF('CALCUL EFFECTIFS'!AC59>0,'CALCUL EFFECTIFS'!AC59,$A$6&\"\")","v":""},{"$f":"IF('CALCUL EFFECTIFS'!AD59>0,'CALCUL EFFECTIFS'!AD59,$A$6&\"\")","v":""},{"$f":"IF('CALCUL EFFECTIFS'!AE59>0,'CALCUL EFFECTIFS'!AE59,$A$6&\"\")","v":""},{"$f":"IF('CALCUL EFFECTIFS'!AF59>0,'CALCUL EFFECTIFS'!AF59,$A$6&\"\")","v":""},{"$f":"IF('CALCUL EFFECTIFS'!AG59>0,'CALCUL EFFECTIFS'!AG59,$A$6&\"\")","v":""},{"$f":"IF('CALCUL EFFECTIFS'!AH59>0,'CALCUL EFFECTIFS'!AH59,$A$6&\"\")","v":""},{"$f":"IF('CALCUL EFFECTIFS'!AI59>0,'CALCUL EFFECTIFS'!AI59,$A$6&\"\")","v":""},{"$f":"IF('CALCUL EFFECTIFS'!AJ59>0,'CALCUL EFFECTIFS'!AJ59,$A$6&\"\")","v":""},{"$f":"IF('CALCUL EFFECTIFS'!AK59>0,'CALCUL EFFECTIFS'!AK59,$A$6&\"\")","v":""},{"$f":"IF('CALCUL EFFECTIFS'!AL59>0,'CALCUL EFFECTIFS'!AL59,$A$6&\"\")","v":""},{"$f":"IF('CALCUL EFFECTIFS'!AM59>0,'CALCUL EFFECTIFS'!AM59,$A$6&\"\")","v":""},{"$f":"IF('CALCUL EFFECTIFS'!AN59>0,'CALCUL EFFECTIFS'!AN59,$A$6&\"\")","v":""},{"$f":"IF('CALCUL EFFECTIFS'!AO59>0,'CALCUL EFFECTIFS'!AO59,$A$6&\"\")","v":""},{"$f":"IF('CALCUL EFFECTIFS'!AP59>0,'CALCUL EFFECTIFS'!AP59,$A$6&\"\")","v":""},{"$f":"IF('CALCUL EFFECTIFS'!AQ59>0,'CALCUL EFFECTIFS'!AQ59,$A$6&\"\")","v":""},{"$f":"IF('CALCUL EFFECTIFS'!AR59>0,'CALCUL EFFECTIFS'!AR59,$A$6&\"\")","v":""},{"$f":"IF('CALCUL EFFECTIFS'!AS59>0,'CALCUL EFFECTIFS'!AS59,$A$6&\"\")","v":""}]
[{"$f":"IF(B32>0,'CALCUL EFFECTIFS'!B71&\"\",$A$6&\"\")","v":""},0,null,{"$f":"IF('CALCUL EFFECTIFS'!E71>0,'CALCUL EFFECTIFS'!E71,$A$6&\"\")","v":""},null,{"$f":"IF('CALCUL EFFECTIFS'!G71>0,'CALCUL EFFECTIFS'!G71,$A$6&\"\")","v":""},{"$f":"IF('CALCUL EFFECTIFS'!H71>0,'CALCUL EFFECTIFS'!H71,$A$6&\"\")","v":""},{"$f":"IF('CALCUL EFFECTIFS'!I71>0,'CALCUL EFFECTIFS'!I71,$A$6&\"\")","v":""},{"$f":"IF('CALCUL EFFECTIFS'!J71>0,'CALCUL EFFECTIFS'!J71,$A$6&\"\")","v":""},{"$f":"IF('CALCUL EFFECTIFS'!K71>0,'CALCUL EFFECTIFS'!K71,$A$6&\"\")","v":""},{"$f":"IF('CALCUL EFFECTIFS'!L71>0,'CALCUL EFFECTIFS'!L71,$A$6&\"\")","v":""},{"$f":"IF('CALCUL EFFECTIFS'!M71>0,'CALCUL EFFECTIFS'!M71,$A$6&\"\")","v":""},{"$f":"IF('CALCUL EFFECTIFS'!N71>0,'CALCUL EFFECTIFS'!N71,$A$6&\"\")","v":""},{"$f":"IF('CALCUL EFFECTIFS'!O71>0,'CALCUL EFFECTIFS'!O71,$A$6&\"\")","v":""},{"$f":"IF('CALCUL EFFECTIFS'!P71>0,'CALCUL EFFECTIFS'!P71,$A$6&\"\")","v":""},{"$f":"IF('CALCUL EFFECTIFS'!Q71>0,'CALCUL EFFECTIFS'!Q71,$A$6&\"\")","v":""},{"$f":"IF('CALCUL EFFECTIFS'!R71>0,'CALCUL EFFECTIFS'!R71,$A$6&\"\")","v":""},{"$f":"IF('CALCUL EFFECTIFS'!S71>0,'CALCUL EFFECTIFS'!S71,$A$6&\"\")","v":""},{"$f":"IF('CALCUL EFFECTIFS'!T71>0,'CALCUL EFFECTIFS'!T71,$A$6&\"\")","v":""},{"$f":"IF('CALCUL EFFECTIFS'!U71>0,'CALCUL EFFECTIFS'!U71,$A$6&\"\")","v":""},{"$f":"IF('CALCUL EFFECTIFS'!V71>0,'CALCUL EFFECTIFS'!V71,$A$6&\"\")","v":""},{"$f":"IF('CALCUL EFFECTIFS'!W71>0,'CALCUL EFFECTIFS'!W71,$A$6&\"\")","v":""},{"$f":"IF('CALCUL EFFECTIFS'!X71>0,'CALCUL EFFECTIFS'!X71,$A$6&\"\")","v":""},{"$f":"IF('CALCUL EFFECTIFS'!Y71>0,'CALCUL EFFECTIFS'!Y71,$A$6&\"\")","v":""},{"$f":"IF('CALCUL EFFECTIFS'!Z71>0,'CALCUL EFFECTIFS'!Z71,$A$6&\"\")","v":""},{"$f":"IF('CALCUL EFFECTIFS'!AA71>0,'CALCUL EFFECTIFS'!AA71,$A$6&\"\")","v":""},{"$f":"IF('CALCUL EFFECTIFS'!AB71>0,'CALCUL EFFECTIFS'!AB71,$A$6&\"\")","v":""},{"$f":"IF('CALCUL EFFECTIFS'!AC71>0,'CALCUL EFFECTIFS'!AC71,$A$6&\"\")","v":""},{"$f":"IF('CALCUL EFFECTIFS'!AD71>0,'CALCUL EFFECTIFS'!AD71,$A$6&\"\")","v":""},{"$f":"IF('CALCUL EFFECTIFS'!AE71>0,'CALCUL EFFECTIFS'!AE71,$A$6&\"\")","v":""},{"$f":"IF('CALCUL EFFECTIFS'!AF71>0,'CALCUL EFFECTIFS'!AF71,$A$6&\"\")","v":""},{"$f":"IF('CALCUL EFFECTIFS'!AG71>0,'CALCUL EFFECTIFS'!AG71,$A$6&\"\")","v":""},{"$f":"IF('CALCUL EFFECTIFS'!AH71>0,'CALCUL EFFECTIFS'!AH71,$A$6&\"\")","v":""},{"$f":"IF('CALCUL EFFECTIFS'!AI71>0,'CALCUL EFFECTIFS'!AI71,$A$6&\"\")","v":""},{"$f":"IF('CALCUL EFFECTIFS'!AJ71>0,'CALCUL EFFECTIFS'!AJ71,$A$6&\"\")","v":""},{"$f":"IF('CALCUL EFFECTIFS'!AK71>0,'CALCUL EFFECTIFS'!AK71,$A$6&\"\")","v":""},{"$f":"IF('CALCUL EFFECTIFS'!AL71>0,'CALCUL EFFECTIFS'!AL71,$A$6&\"\")","v":""},{"$f":"IF('CALCUL EFFECTIFS'!AM71>0,'CALCUL EFFECTIFS'!AM71,$A$6&\"\")","v":""},{"$f":"IF('CALCUL EFFECTIFS'!AN71>0,'CALCUL EFFECTIFS'!AN71,$A$6&\"\")","v":""},{"$f":"IF('CALCUL EFFECTIFS'!AO71>0,'CALCUL EFFECTIFS'!AO71,$A$6&\"\")","v":""},{"$f":"IF('CALCUL EFFECTIFS'!AP71>0,'CALCUL EFFECTIFS'!AP71,$A$6&\"\")","v":""},{"$f":"IF('CALCUL EFFECTIFS'!AQ71>0,'CALCUL EFFECTIFS'!AQ71,$A$6&\"\")","v":""},{"$f":"IF('CALCUL EFFECTIFS'!AR71>0,'CALCUL EFFECTIFS'!AR71,$A$6&\"\")","v":""},{"$f":"IF('CALCUL EFFECTIFS'!AS71>0,'CALCUL EFFECTIFS'!AS71,$A$6&\"\")","v":""}]
[{"$f":"IF(B33>0,'CALCUL EFFECTIFS'!B83&\"\",$A$6&\"\")","v":""},0,null,{"$f":"IF('CALCUL EFFECTIFS'!E83>0,'CALCUL EFFECTIFS'!E83,$A$6&\"\")","v":""},null,{"$f":"IF('CALCUL EFFECTIFS'!G83>0,'CALCUL EFFECTIFS'!G83,$A$6&\"\")","v":""},{"$f":"IF('CALCUL EFFECTIFS'!H83>0,'CALCUL EFFECTIFS'!H83,$A$6&\"\")","v":""},{"$f":"IF('CALCUL EFFECTIFS'!I83>0,'CALCUL EFFECTIFS'!I83,$A$6&\"\")","v":""},{"$f":"IF('CALCUL EFFECTIFS'!J83>0,'CALCUL EFFECTIFS'!J83,$A$6&\"\")","v":""},{"$f":"IF('CALCUL EFFECTIFS'!K83>0,'CALCUL EFFECTIFS'!K83,$A$6&\"\")","v":""},{"$f":"IF('CALCUL EFFECTIFS'!L83>0,'CALCUL EFFECTIFS'!L83,$A$6&\"\")","v":""},{"$f":"IF('CALCUL EFFECTIFS'!M83>0,'CALCUL EFFECTIFS'!M83,$A$6&\"\")","v":""},{"$f":"IF('CALCUL EFFECTIFS'!N83>0,'CALCUL EFFECTIFS'!N83,$A$6&\"\")","v":""},{"$f":"IF('CALCUL EFFECTIFS'!O83>0,'CALCUL EFFECTIFS'!O83,$A$6&\"\")","v":""},{"$f":"IF('CALCUL EFFECTIFS'!P83>0,'CALCUL EFFECTIFS'!P83,$A$6&\"\")","v":""},{"$f":"IF('CALCUL EFFECTIFS'!Q83>0,'CALCUL EFFECTIFS'!Q83,$A$6&\"\")","v":""},{"$f":"IF('CALCUL EFFECTIFS'!R83>0,'CALCUL EFFECTIFS'!R83,$A$6&\"\")","v":""},{"$f":"IF('CALCUL EFFECTIFS'!S83>0,'CALCUL EFFECTIFS'!S83,$A$6&\"\")","v":""},{"$f":"IF('CALCUL EFFECTIFS'!T83>0,'CALCUL EFFECTIFS'!T83,$A$6&\"\")","v":""},{"$f":"IF('CALCUL EFFECTIFS'!U83>0,'CALCUL EFFECTIFS'!U83,$A$6&\"\")","v":""},{"$f":"IF('CALCUL EFFECTIFS'!V83>0,'CALCUL EFFECTIFS'!V83,$A$6&\"\")","v":""},{"$f":"IF('CALCUL EFFECTIFS'!W83>0,'CALCUL EFFECTIFS'!W83,$A$6&\"\")","v":""},{"$f":"IF('CALCUL EFFECTIFS'!X83>0,'CALCUL EFFECTIFS'!X83,$A$6&\"\")","v":""},{"$f":"IF('CALCUL EFFECTIFS'!Y83>0,'CALCUL EFFECTIFS'!Y83,$A$6&\"\")","v":""},{"$f":"IF('CALCUL EFFECTIFS'!Z83>0,'CALCUL EFFECTIFS'!Z83,$A$6&\"\")","v":""},{"$f":"IF('CALCUL EFFECTIFS'!AA83>0,'CALCUL EFFECTIFS'!AA83,$A$6&\"\")","v":""},{"$f":"IF('CALCUL EFFECTIFS'!AB83>0,'CALCUL EFFECTIFS'!AB83,$A$6&\"\")","v":""},{"$f":"IF('CALCUL EFFECTIFS'!AC83>0,'CALCUL EFFECTIFS'!AC83,$A$6&\"\")","v":""},{"$f":"IF('CALCUL EFFECTIFS'!AD83>0,'CALCUL EFFECTIFS'!AD83,$A$6&\"\")","v":""},{"$f":"IF('CALCUL EFFECTIFS'!AE83>0,'CALCUL EFFECTIFS'!AE83,$A$6&\"\")","v":""},{"$f":"IF('CALCUL EFFECTIFS'!AF83>0,'CALCUL EFFECTIFS'!AF83,$A$6&\"\")","v":""},{"$f":"IF('CALCUL EFFECTIFS'!AG83>0,'CALCUL EFFECTIFS'!AG83,$A$6&\"\")","v":""},{"$f":"IF('CALCUL EFFECTIFS'!AH83>0,'CALCUL EFFECTIFS'!AH83,$A$6&\"\")","v":""},{"$f":"IF('CALCUL EFFECTIFS'!AI83>0,'CALCUL EFFECTIFS'!AI83,$A$6&\"\")","v":""},{"$f":"IF('CALCUL EFFECTIFS'!AJ83>0,'CALCUL EFFECTIFS'!AJ83,$A$6&\"\")","v":""},{"$f":"IF('CALCUL EFFECTIFS'!AK83>0,'CALCUL EFFECTIFS'!AK83,$A$6&\"\")","v":""},{"$f":"IF('CALCUL EFFECTIFS'!AL83>0,'CALCUL EFFECTIFS'!AL83,$A$6&\"\")","v":""},{"$f":"IF('CALCUL EFFECTIFS'!AM83>0,'CALCUL EFFECTIFS'!AM83,$A$6&\"\")","v":""},{"$f":"IF('CALCUL EFFECTIFS'!AN83>0,'CALCUL EFFECTIFS'!AN83,$A$6&\"\")","v":""},{"$f":"IF('CALCUL EFFECTIFS'!AO83>0,'CALCUL EFFECTIFS'!AO83,$A$6&\"\")","v":""},{"$f":"IF('CALCUL EFFECTIFS'!AP83>0,'CALCUL EFFECTIFS'!AP83,$A$6&\"\")","v":""},{"$f":"IF('CALCUL EFFECTIFS'!AQ83>0,'CALCUL EFFECTIFS'!AQ83,$A$6&\"\")","v":""},{"$f":"IF('CALCUL EFFECTIFS'!AR83>0,'CALCUL EFFECTIFS'!AR83,$A$6&\"\")","v":""},{"$f":"IF('CALCUL EFFECTIFS'!AS83>0,'CALCUL EFFECTIFS'!AS83,$A$6&\"\")","v":""}]
[{"$f":"IF(B34>0,'CALCUL EFFECTIFS'!B95&\"\",$A$6&\"\")","v":"POMME"},4,null,{"$f":"IF('CALCUL EFFECTIFS'!E95>0,'CALCUL EFFECTIFS'!E95,$A$6&\"\")","v":""},null,{"$f":"IF('CALCUL EFFECTIFS'!G95>0,'CALCUL EFFECTIFS'!G95,$A$6&\"\")","v":""},{"$f":"IF('CALCUL EFFECTIFS'!H95>0,'CALCUL EFFECTIFS'!H95,$A$6&\"\")","v":""},{"$f":"IF('CALCUL EFFECTIFS'!I95>0,'CALCUL EFFECTIFS'!I95,$A$6&\"\")","v":""},{"$f":"IF('CALCUL EFFECTIFS'!J95>0,'CALCUL EFFECTIFS'!J95,$A$6&\"\")","v":""},{"$f":"IF('CALCUL EFFECTIFS'!K95>0,'CALCUL EFFECTIFS'!K95,$A$6&\"\")","v":4},{"$f":"IF('CALCUL EFFECTIFS'!L95>0,'CALCUL EFFECTIFS'!L95,$A$6&\"\")","v":""},{"$f":"IF('CALCUL EFFECTIFS'!M95>0,'CALCUL EFFECTIFS'!M95,$A$6&\"\")","v":""},{"$f":"IF('CALCUL EFFECTIFS'!N95>0,'CALCUL EFFECTIFS'!N95,$A$6&\"\")","v":""},{"$f":"IF('CALCUL EFFECTIFS'!O95>0,'CALCUL EFFECTIFS'!O95,$A$6&\"\")","v":""},{"$f":"IF('CALCUL EFFECTIFS'!P95>0,'CALCUL EFFECTIFS'!P95,$A$6&\"\")","v":""},{"$f":"IF('CALCUL EFFECTIFS'!Q95>0,'CALCUL EFFECTIFS'!Q95,$A$6&\"\")","v":""},{"$f":"IF('CALCUL EFFECTIFS'!R95>0,'CALCUL EFFECTIFS'!R95,$A$6&\"\")","v":""},{"$f":"IF('CALCUL EFFECTIFS'!S95>0,'CALCUL EFFECTIFS'!S95,$A$6&\"\")","v":""},{"$f":"IF('CALCUL EFFECTIFS'!T95>0,'CALCUL EFFECTIFS'!T95,$A$6&\"\")","v":""},{"$f":"IF('CALCUL EFFECTIFS'!U95>0,'CALCUL EFFECTIFS'!U95,$A$6&\"\")","v":""},{"$f":"IF('CALCUL EFFECTIFS'!V95>0,'CALCUL EFFECTIFS'!V95,$A$6&\"\")","v":""},{"$f":"IF('CALCUL EFFECTIFS'!W95>0,'CALCUL EFFECTIFS'!W95,$A$6&\"\")","v":""},{"$f":"IF('CALCUL EFFECTIFS'!X95>0,'CALCUL EFFECTIFS'!X95,$A$6&\"\")","v":""},{"$f":"IF('CALCUL EFFECTIFS'!Y95>0,'CALCUL EFFECTIFS'!Y95,$A$6&\"\")","v":""},{"$f":"IF('CALCUL EFFECTIFS'!Z95>0,'CALCUL EFFECTIFS'!Z95,$A$6&\"\")","v":""},{"$f":"IF('CALCUL EFFECTIFS'!AA95>0,'CALCUL EFFECTIFS'!AA95,$A$6&\"\")","v":""},{"$f":"IF('CALCUL EFFECTIFS'!AB95>0,'CALCUL EFFECTIFS'!AB95,$A$6&\"\")","v":""},{"$f":"IF('CALCUL EFFECTIFS'!AC95>0,'CALCUL EFFECTIFS'!AC95,$A$6&\"\")","v":""},{"$f":"IF('CALCUL EFFECTIFS'!AD95>0,'CALCUL EFFECTIFS'!AD95,$A$6&\"\")","v":""},{"$f":"IF('CALCUL EFFECTIFS'!AE95>0,'CALCUL EFFECTIFS'!AE95,$A$6&\"\")","v":""},{"$f":"IF('CALCUL EFFECTIFS'!AF95>0,'CALCUL EFFECTIFS'!AF95,$A$6&\"\")","v":""},{"$f":"IF('CALCUL EFFECTIFS'!AG95>0,'CALCUL EFFECTIFS'!AG95,$A$6&\"\")","v":""},{"$f":"IF('CALCUL EFFECTIFS'!AH95>0,'CALCUL EFFECTIFS'!AH95,$A$6&\"\")","v":""},{"$f":"IF('CALCUL EFFECTIFS'!AI95>0,'CALCUL EFFECTIFS'!AI95,$A$6&\"\")","v":""},{"$f":"IF('CALCUL EFFECTIFS'!AJ95>0,'CALCUL EFFECTIFS'!AJ95,$A$6&\"\")","v":""},{"$f":"IF('CALCUL EFFECTIFS'!AK95>0,'CALCUL EFFECTIFS'!AK95,$A$6&\"\")","v":""},{"$f":"IF('CALCUL EFFECTIFS'!AL95>0,'CALCUL EFFECTIFS'!AL95,$A$6&\"\")","v":""},{"$f":"IF('CALCUL EFFECTIFS'!AM95>0,'CALCUL EFFECTIFS'!AM95,$A$6&\"\")","v":""},{"$f":"IF('CALCUL EFFECTIFS'!AN95>0,'CALCUL EFFECTIFS'!AN95,$A$6&\"\")","v":""},{"$f":"IF('CALCUL EFFECTIFS'!AO95>0,'CALCUL EFFECTIFS'!AO95,$A$6&\"\")","v":""},{"$f":"IF('CALCUL EFFECTIFS'!AP95>0,'CALCUL EFFECTIFS'!AP95,$A$6&\"\")","v":""},{"$f":"IF('CALCUL EFFECTIFS'!AQ95>0,'CALCUL EFFECTIFS'!AQ95,$A$6&\"\")","v":""},{"$f":"IF('CALCUL EFFECTIFS'!AR95>0,'CALCUL EFFECTIFS'!AR95,$A$6&\"\")","v":""},{"$f":"IF('CALCUL EFFECTIFS'!AS95>0,'CALCUL EFFECTIFS'!AS95,$A$6&\"\")","v":""}]
[{"$f":"IF(B35>0,'CALCUL EFFECTIFS'!B30&\"\",$A$6&\"\")","v":"TOMATE VINAIGRETTE"},13,null,{"$f":"IF('CALCUL EFFECTIFS'!E30>0,'CALCUL EFFECTIFS'!E30,$A$6&\"\")","v":""},null,{"$f":"IF(MENUS!$B$9=\"POTAGE\",$A$6&\"\",'CALCUL EFFECTIFS'!G31)","v":2},{"$f":"IF(MENUS!$B$9=\"POTAGE\",$A$6&\"\",'CALCUL EFFECTIFS'!H31)","v":5},{"$f":"IF(MENUS!$B$9=\"POTAGE\",$A$6&\"\",'CALCUL EFFECTIFS'!I31)","v":1},{"$f":"IF(MENUS!$B$9=\"POTAGE\",$A$6&\"\",'CALCUL EFFECTIFS'!J31)","v":2},{"$f":"IF(MENUS!$B$9=\"POTAGE\",$A$6&\"\",'CALCUL EFFECTIFS'!K31)","v":3},{"$f":"IF(MENUS!$B$9=\"POTAGE\",$A$6&\"\",'CALCUL EFFECTIFS'!L31)","v":""},{"$f":"IF(MENUS!$B$9=\"POTAGE\",$A$6&\"\",'CALCUL EFFECTIFS'!M31)","v":""},{"$f":"IF(MENUS!$B$9=\"POTAGE\",$A$6&\"\",'CALCUL EFFECTIFS'!N31)","v":""},{"$f":"IF(MENUS!$B$9=\"POTAGE\",$A$6&\"\",'CALCUL EFFECTIFS'!O31)","v":""},{"$f":"IF(MENUS!$B$9=\"POTAGE\",$A$6&\"\",'CALCUL EFFECTIFS'!P31)","v":""},{"$f":"IF(MENUS!$B$9=\"POTAGE\",$A$6&\"\",'CALCUL EFFECTIFS'!Q31)","v":""},{"$f":"IF(MENUS!$B$9=\"POTAGE\",$A$6&\"\",'CALCUL EFFECTIFS'!R31)","v":""},{"$f":"IF(MENUS!$B$9=\"POTAGE\",$A$6&\"\",'CALCUL EFFECTIFS'!S31)","v":""},{"$f":"IF(MENUS!$B$9=\"POTAGE\",$A$6&\"\",'CALCUL EFFECTIFS'!T31)","v":""},{"$f":"IF(MENUS!$B$9=\"POTAGE\",$A$6&\"\",'CALCUL EFFECTIFS'!U31)","v":""},{"$f":"IF(MENUS!$B$9=\"POTAGE\",$A$6&\"\",'CALCUL EFFECTIFS'!V31)","v":""},{"$f":"IF(MENUS!$B$9=\"POTAGE\",$A$6&\"\",'CALCUL EFFECTIFS'!W31)","v":""},{"$f":"IF(MENUS!$B$9=\"POTAGE\",$A$6&\"\",'CALCUL EFFECTIFS'!X31)","v":""},{"$f":"IF(MENUS!$B$9=\"POTAGE\",$A$6&\"\",'CALCUL EFFECTIFS'!Y31)","v":""},{"$f":"IF(MENUS!$B$9=\"POTAGE\",$A$6&\"\",'CALCUL EFFECTIFS'!Z31)","v":""},{"$f":"IF(MENUS!$B$9=\"POTAGE\",$A$6&\"\",'CALCUL EFFECTIFS'!AA31)","v":""},{"$f":"IF(MENUS!$B$9=\"POTAGE\",$A$6&\"\",'CALCUL EFFECTIFS'!AB31)","v":""},{"$f":"IF(MENUS!$B$9=\"POTAGE\",$A$6&\"\",'CALCUL EFFECTIFS'!AC31)","v":""},{"$f":"IF(MENUS!$B$9=\"POTAGE\",$A$6&\"\",'CALCUL EFFECTIFS'!AD31)","v":""},{"$f":"IF(MENUS!$B$9=\"POTAGE\",$A$6&\"\",'CALCUL EFFECTIFS'!AE31)","v":""},{"$f":"IF(MENUS!$B$9=\"POTAGE\",$A$6&\"\",'CALCUL EFFECTIFS'!AF31)","v":""},{"$f":"IF(MENUS!$B$9=\"POTAGE\",$A$6&\"\",'CALCUL EFFECTIFS'!AG31)","v":""},{"$f":"IF(MENUS!$B$9=\"POTAGE\",$A$6&\"\",'CALCUL EFFECTIFS'!AH31)","v":""},{"$f":"IF(MENUS!$B$9=\"POTAGE\",$A$6&\"\",'CALCUL EFFECTIFS'!AI31)","v":""},{"$f":"IF(MENUS!$B$9=\"POTAGE\",$A$6&\"\",'CALCUL EFFECTIFS'!AJ31)","v":""},{"$f":"IF(MENUS!$B$9=\"POTAGE\",$A$6&\"\",'CALCUL EFFECTIFS'!AK31)","v":""},{"$f":"IF(MENUS!$B$9=\"POTAGE\",$A$6&\"\",'CALCUL EFFECTIFS'!AL31)","v":""},{"$f":"IF(MENUS!$B$9=\"POTAGE\",$A$6&\"\",'CALCUL EFFECTIFS'!AM31)","v":""},{"$f":"IF(MENUS!$B$9=\"POTAGE\",$A$6&\"\",'CALCUL EFFECTIFS'!AN31)","v":""},{"$f":"IF(MENUS!$B$9=\"POTAGE\",$A$6&\"\",'CALCUL EFFECTIFS'!AO31)","v":""},{"$f":"IF(MENUS!$B$9=\"POTAGE\",$A$6&\"\",'CALCUL EFFECTIFS'!AP31)","v":""},{"$f":"IF(MENUS!$B$9=\"POTAGE\",$A$6&\"\",'CALCUL EFFECTIFS'!AQ31)","v":""},{"$f":"IF(MENUS!$B$9=\"POTAGE\",$A$6&\"\",'CALCUL EFFECTIFS'!AR31)","v":""},{"$f":"IF(MENUS!$B$9=\"POTAGE\",$A$6&\"\",'CALCUL EFFECTIFS'!AS31)","v":""}]
[{"$f":"IF(B36>0,'CALCUL EFFECTIFS'!B60&\"\",$A$6&\"\")","v":"BŒUF BOURGUIGNON SANS LARDONS"},13,null,{"$f":"IF('CALCUL EFFECTIFS'!E60>0,'CALCUL EFFECTIFS'!E60,$A$6&\"\")","v":""},null,{"$f":"IF('CALCUL EFFECTIFS'!G60>0,'CALCUL EFFECTIFS'!G60,$A$6&\"\")","v":2},{"$f":"IF('CALCUL EFFECTIFS'!H60>0,'CALCUL EFFECTIFS'!H60,$A$6&\"\")","v":5},{"$f":"IF('CALCUL EFFECTIFS'!I60>0,'CALCUL EFFECTIFS'!I60,$A$6&\"\")","v":1},{"$f":"IF('CALCUL EFFECTIFS'!J60>0,'CALCUL EFFECTIFS'!J60,$A$6&\"\")","v":2},{"$f":"IF('CALCUL EFFECTIFS'!K60>0,'CALCUL EFFECTIFS'!K60,$A$6&\"\")","v":3},{"$f":"IF('CALCUL EFFECTIFS'!L60>0,'CALCUL EFFECTIFS'!L60,$A$6&\"\")","v":""},{"$f":"IF('CALCUL EFFECTIFS'!M60>0,'CALCUL EFFECTIFS'!M60,$A$6&\"\")","v":""},{"$f":"IF('CALCUL EFFECTIFS'!N60>0,'CALCUL EFFECTIFS'!N60,$A$6&\"\")","v":""},{"$f":"IF('CALCUL EFFECTIFS'!O60>0,'CALCUL EFFECTIFS'!O60,$A$6&\"\")","v":""},{"$f":"IF('CALCUL EFFECTIFS'!P60>0,'CALCUL EFFECTIFS'!P60,$A$6&\"\")","v":""},{"$f":"IF('CALCUL EFFECTIFS'!Q60>0,'CALCUL EFFECTIFS'!Q60,$A$6&\"\")","v":""},{"$f":"IF('CALCUL EFFECTIFS'!R60>0,'CALCUL EFFECTIFS'!R60,$A$6&\"\")","v":""},{"$f":"IF('CALCUL EFFECTIFS'!S60>0,'CALCUL EFFECTIFS'!S60,$A$6&\"\")","v":""},{"$f":"IF('CALCUL EFFECTIFS'!T60>0,'CALCUL EFFECTIFS'!T60,$A$6&\"\")","v":""},{"$f":"IF('CALCUL EFFECTIFS'!U60>0,'CALCUL EFFECTIFS'!U60,$A$6&\"\")","v":""},{"$f":"IF('CALCUL EFFECTIFS'!V60>0,'CALCUL EFFECTIFS'!V60,$A$6&\"\")","v":""},{"$f":"IF('CALCUL EFFECTIFS'!W60>0,'CALCUL EFFECTIFS'!W60,$A$6&\"\")","v":""},{"$f":"IF('CALCUL EFFECTIFS'!X60>0,'CALCUL EFFECTIFS'!X60,$A$6&\"\")","v":""},{"$f":"IF('CALCUL EFFECTIFS'!Y60>0,'CALCUL EFFECTIFS'!Y60,$A$6&\"\")","v":""},{"$f":"IF('CALCUL EFFECTIFS'!Z60>0,'CALCUL EFFECTIFS'!Z60,$A$6&\"\")","v":""},{"$f":"IF('CALCUL EFFECTIFS'!AA60>0,'CALCUL EFFECTIFS'!AA60,$A$6&\"\")","v":""},{"$f":"IF('CALCUL EFFECTIFS'!AB60>0,'CALCUL EFFECTIFS'!AB60,$A$6&\"\")","v":""},{"$f":"IF('CALCUL EFFECTIFS'!AC60>0,'CALCUL EFFECTIFS'!AC60,$A$6&\"\")","v":""},{"$f":"IF('CALCUL EFFECTIFS'!AD60>0,'CALCUL EFFECTIFS'!AD60,$A$6&\"\")","v":""},{"$f":"IF('CALCUL EFFECTIFS'!AE60>0,'CALCUL EFFECTIFS'!AE60,$A$6&\"\")","v":""},{"$f":"IF('CALCUL EFFECTIFS'!AF60>0,'CALCUL EFFECTIFS'!AF60,$A$6&\"\")","v":""},{"$f":"IF('CALCUL EFFECTIFS'!AG60>0,'CALCUL EFFECTIFS'!AG60,$A$6&\"\")","v":""},{"$f":"IF('CALCUL EFFECTIFS'!AH60>0,'CALCUL EFFECTIFS'!AH60,$A$6&\"\")","v":""},{"$f":"IF('CALCUL EFFECTIFS'!AI60>0,'CALCUL EFFECTIFS'!AI60,$A$6&\"\")","v":""},{"$f":"IF('CALCUL EFFECTIFS'!AJ60>0,'CALCUL EFFECTIFS'!AJ60,$A$6&\"\")","v":""},{"$f":"IF('CALCUL EFFECTIFS'!AK60>0,'CALCUL EFFECTIFS'!AK60,$A$6&\"\")","v":""},{"$f":"IF('CALCUL EFFECTIFS'!AL60>0,'CALCUL EFFECTIFS'!AL60,$A$6&\"\")","v":""},{"$f":"IF('CALCUL EFFECTIFS'!AM60>0,'CALCUL EFFECTIFS'!AM60,$A$6&\"\")","v":""},{"$f":"IF('CALCUL EFFECTIFS'!AN60>0,'CALCUL EFFECTIFS'!AN60,$A$6&\"\")","v":""},{"$f":"IF('CALCUL EFFECTIFS'!AO60>0,'CALCUL EFFECTIFS'!AO60,$A$6&\"\")","v":""},{"$f":"IF('CALCUL EFFECTIFS'!AP60>0,'CALCUL EFFECTIFS'!AP60,$A$6&\"\")","v":""},{"$f":"IF('CALCUL EFFECTIFS'!AQ60>0,'CALCUL EFFECTIFS'!AQ60,$A$6&\"\")","v":""},{"$f":"IF('CALCUL EFFECTIFS'!AR60>0,'CALCUL EFFECTIFS'!AR60,$A$6&\"\")","v":""},{"$f":"IF('CALCUL EFFECTIFS'!AS60>0,'CALCUL EFFECTIFS'!AS60,$A$6&\"\")","v":""}]
[{"$f":"IF(B37>0,'CALCUL EFFECTIFS'!B72&\"\",$A$6&\"\")","v":""},0,null,{"$f":"IF('CALCUL EFFECTIFS'!E72>0,'CALCUL EFFECTIFS'!E72,$A$6&\"\")","v":""},null,{"$f":"IF('CALCUL EFFECTIFS'!G72>0,'CALCUL EFFECTIFS'!G72,$A$6&\"\")","v":""},{"$f":"IF('CALCUL EFFECTIFS'!H72>0,'CALCUL EFFECTIFS'!H72,$A$6&\"\")","v":""},{"$f":"IF('CALCUL EFFECTIFS'!I72>0,'CALCUL EFFECTIFS'!I72,$A$6&\"\")","v":""},{"$f":"IF('CALCUL EFFECTIFS'!J72>0,'CALCUL EFFECTIFS'!J72,$A$6&\"\")","v":""},{"$f":"IF('CALCUL EFFECTIFS'!K72>0,'CALCUL EFFECTIFS'!K72,$A$6&\"\")","v":""},{"$f":"IF('CALCUL EFFECTIFS'!L72>0,'CALCUL EFFECTIFS'!L72,$A$6&\"\")","v":""},{"$f":"IF('CALCUL EFFECTIFS'!M72>0,'CALCUL EFFECTIFS'!M72,$A$6&\"\")","v":""},{"$f":"IF('CALCUL EFFECTIFS'!N72>0,'CALCUL EFFECTIFS'!N72,$A$6&\"\")","v":""},{"$f":"IF('CALCUL EFFECTIFS'!O72>0,'CALCUL EFFECTIFS'!O72,$A$6&\"\")","v":""},{"$f":"IF('CALCUL EFFECTIFS'!P72>0,'CALCUL EFFECTIFS'!P72,$A$6&\"\")","v":""},{"$f":"IF('CALCUL EFFECTIFS'!Q72>0,'CALCUL EFFECTIFS'!Q72,$A$6&\"\")","v":""},{"$f":"IF('CALCUL EFFECTIFS'!R72>0,'CALCUL EFFECTIFS'!R72,$A$6&\"\")","v":""},{"$f":"IF('CALCUL EFFECTIFS'!S72>0,'CALCUL EFFECTIFS'!S72,$A$6&\"\")","v":""},{"$f":"IF('CALCUL EFFECTIFS'!T72>0,'CALCUL EFFECTIFS'!T72,$A$6&\"\")","v":""},{"$f":"IF('CALCUL EFFECTIFS'!U72>0,'CALCUL EFFECTIFS'!U72,$A$6&\"\")","v":""},{"$f":"IF('CALCUL EFFECTIFS'!V72>0,'CALCUL EFFECTIFS'!V72,$A$6&\"\")","v":""},{"$f":"IF('CALCUL EFFECTIFS'!W72>0,'CALCUL EFFECTIFS'!W72,$A$6&\"\")","v":""},{"$f":"IF('CALCUL EFFECTIFS'!X72>0,'CALCUL EFFECTIFS'!X72,$A$6&\"\")","v":""},{"$f":"IF('CALCUL EFFECTIFS'!Y72>0,'CALCUL EFFECTIFS'!Y72,$A$6&\"\")","v":""},{"$f":"IF('CALCUL EFFECTIFS'!Z72>0,'CALCUL EFFECTIFS'!Z72,$A$6&\"\")","v":""},{"$f":"IF('CALCUL EFFECTIFS'!AA72>0,'CALCUL EFFECTIFS'!AA72,$A$6&\"\")","v":""},{"$f":"IF('CALCUL EFFECTIFS'!AB72>0,'CALCUL EFFECTIFS'!AB72,$A$6&\"\")","v":""},{"$f":"IF('CALCUL EFFECTIFS'!AC72>0,'CALCUL EFFECTIFS'!AC72,$A$6&\"\")","v":""},{"$f":"IF('CALCUL EFFECTIFS'!AD72>0,'CALCUL EFFECTIFS'!AD72,$A$6&\"\")","v":""},{"$f":"IF('CALCUL EFFECTIFS'!AE72>0,'CALCUL EFFECTIFS'!AE72,$A$6&\"\")","v":""},{"$f":"IF('CALCUL EFFECTIFS'!AF72>0,'CALCUL EFFECTIFS'!AF72,$A$6&\"\")","v":""},{"$f":"IF('CALCUL EFFECTIFS'!AG72>0,'CALCUL EFFECTIFS'!AG72,$A$6&\"\")","v":""},{"$f":"IF('CALCUL EFFECTIFS'!AH72>0,'CALCUL EFFECTIFS'!AH72,$A$6&\"\")","v":""},{"$f":"IF('CALCUL EFFECTIFS'!AI72>0,'CALCUL EFFECTIFS'!AI72,$A$6&\"\")","v":""},{"$f":"IF('CALCUL EFFECTIFS'!AJ72>0,'CALCUL EFFECTIFS'!AJ72,$A$6&\"\")","v":""},{"$f":"IF('CALCUL EFFECTIFS'!AK72>0,'CALCUL EFFECTIFS'!AK72,$A$6&\"\")","v":""},{"$f":"IF('CALCUL EFFECTIFS'!AL72>0,'CALCUL EFFECTIFS'!AL72,$A$6&\"\")","v":""},{"$f":"IF('CALCUL EFFECTIFS'!AM72>0,'CALCUL EFFECTIFS'!AM72,$A$6&\"\")","v":""},{"$f":"IF('CALCUL EFFECTIFS'!AN72>0,'CALCUL EFFECTIFS'!AN72,$A$6&\"\")","v":""},{"$f":"IF('CALCUL EFFECTIFS'!AO72>0,'CALCUL EFFECTIFS'!AO72,$A$6&\"\")","v":""},{"$f":"IF('CALCUL EFFECTIFS'!AP72>0,'CALCUL EFFECTIFS'!AP72,$A$6&\"\")","v":""},{"$f":"IF('CALCUL EFFECTIFS'!AQ72>0,'CALCUL EFFECTIFS'!AQ72,$A$6&\"\")","v":""},{"$f":"IF('CALCUL EFFECTIFS'!AR72>0,'CALCUL EFFECTIFS'!AR72,$A$6&\"\")","v":""},{"$f":"IF('CALCUL EFFECTIFS'!AS72>0,'CALCUL EFFECTIFS'!AS72,$A$6&\"\")","v":""}]
[{"$f":"IF(B38>0,'CALCUL EFFECTIFS'!B84&\"\",$A$6&\"\")","v":"YAOURT"},13,null,{"$f":"IF('CALCUL EFFECTIFS'!E84>0,'CALCUL EFFECTIFS'!E84,$A$6&\"\")","v":""},null,{"$f":"IF('CALCUL EFFECTIFS'!G84>0,'CALCUL EFFECTIFS'!G84,$A$6&\"\")","v":2},{"$f":"IF('CALCUL EFFECTIFS'!H84>0,'CALCUL EFFECTIFS'!H84,$A$6&\"\")","v":5},{"$f":"IF('CALCUL EFFECTIFS'!I84>0,'CALCUL EFFECTIFS'!I84,$A$6&\"\")","v":1},{"$f":"IF('CALCUL EFFECTIFS'!J84>0,'CALCUL EFFECTIFS'!J84,$A$6&\"\")","v":2},{"$f":"IF('CALCUL EFFECTIFS'!K84>0,'CALCUL EFFECTIFS'!K84,$A$6&\"\")","v":3},{"$f":"IF('CALCUL EFFECTIFS'!L84>0,'CALCUL EFFECTIFS'!L84,$A$6&\"\")","v":""},{"$f":"IF('CALCUL EFFECTIFS'!M84>0,'CALCUL EFFECTIFS'!M84,$A$6&\"\")","v":""},{"$f":"IF('CALCUL EFFECTIFS'!N84>0,'CALCUL EFFECTIFS'!N84,$A$6&\"\")","v":""},{"$f":"IF('CALCUL EFFECTIFS'!O84>0,'CALCUL EFFECTIFS'!O84,$A$6&\"\")","v":""},{"$f":"IF('CALCUL EFFECTIFS'!P84>0,'CALCUL EFFECTIFS'!P84,$A$6&\"\")","v":""},{"$f":"IF('CALCUL EFFECTIFS'!Q84>0,'CALCUL EFFECTIFS'!Q84,$A$6&\"\")","v":""},{"$f":"IF('CALCUL EFFECTIFS'!R84>0,'CALCUL EFFECTIFS'!R84,$A$6&\"\")","v":""},{"$f":"IF('CALCUL EFFECTIFS'!S84>0,'CALCUL EFFECTIFS'!S84,$A$6&\"\")","v":""},{"$f":"IF('CALCUL EFFECTIFS'!T84>0,'CALCUL EFFECTIFS'!T84,$A$6&\"\")","v":""},{"$f":"IF('CALCUL EFFECTIFS'!U84>0,'CALCUL EFFECTIFS'!U84,$A$6&\"\")","v":""},{"$f":"IF('CALCUL EFFECTIFS'!V84>0,'CALCUL EFFECTIFS'!V84,$A$6&\"\")","v":""},{"$f":"IF('CALCUL EFFECTIFS'!W84>0,'CALCUL EFFECTIFS'!W84,$A$6&\"\")","v":""},{"$f":"IF('CALCUL EFFECTIFS'!X84>0,'CALCUL EFFECTIFS'!X84,$A$6&\"\")","v":""},{"$f":"IF('CALCUL EFFECTIFS'!Y84>0,'CALCUL EFFECTIFS'!Y84,$A$6&\"\")","v":""},{"$f":"IF('CALCUL EFFECTIFS'!Z84>0,'CALCUL EFFECTIFS'!Z84,$A$6&\"\")","v":""},{"$f":"IF('CALCUL EFFECTIFS'!AA84>0,'CALCUL EFFECTIFS'!AA84,$A$6&\"\")","v":""},{"$f":"IF('CALCUL EFFECTIFS'!AB84>0,'CALCUL EFFECTIFS'!AB84,$A$6&\"\")","v":""},{"$f":"IF('CALCUL EFFECTIFS'!AC84>0,'CALCUL EFFECTIFS'!AC84,$A$6&\"\")","v":""},{"$f":"IF('CALCUL EFFECTIFS'!AD84>0,'CALCUL EFFECTIFS'!AD84,$A$6&\"\")","v":""},{"$f":"IF('CALCUL EFFECTIFS'!AE84>0,'CALCUL EFFECTIFS'!AE84,$A$6&\"\")","v":""},{"$f":"IF('CALCUL EFFECTIFS'!AF84>0,'CALCUL EFFECTIFS'!AF84,$A$6&\"\")","v":""},{"$f":"IF('CALCUL EFFECTIFS'!AG84>0,'CALCUL EFFECTIFS'!AG84,$A$6&\"\")","v":""},{"$f":"IF('CALCUL EFFECTIFS'!AH84>0,'CALCUL EFFECTIFS'!AH84,$A$6&\"\")","v":""},{"$f":"IF('CALCUL EFFECTIFS'!AI84>0,'CALCUL EFFECTIFS'!AI84,$A$6&\"\")","v":""},{"$f":"IF('CALCUL EFFECTIFS'!AJ84>0,'CALCUL EFFECTIFS'!AJ84,$A$6&\"\")","v":""},{"$f":"IF('CALCUL EFFECTIFS'!AK84>0,'CALCUL EFFECTIFS'!AK84,$A$6&\"\")","v":""},{"$f":"IF('CALCUL EFFECTIFS'!AL84>0,'CALCUL EFFECTIFS'!AL84,$A$6&\"\")","v":""},{"$f":"IF('CALCUL EFFECTIFS'!AM84>0,'CALCUL EFFECTIFS'!AM84,$A$6&\"\")","v":""},{"$f":"IF('CALCUL EFFECTIFS'!AN84>0,'CALCUL EFFECTIFS'!AN84,$A$6&\"\")","v":""},{"$f":"IF('CALCUL EFFECTIFS'!AO84>0,'CALCUL EFFECTIFS'!AO84,$A$6&\"\")","v":""},{"$f":"IF('CALCUL EFFECTIFS'!AP84>0,'CALCUL EFFECTIFS'!AP84,$A$6&\"\")","v":""},{"$f":"IF('CALCUL EFFECTIFS'!AQ84>0,'CALCUL EFFECTIFS'!AQ84,$A$6&\"\")","v":""},{"$f":"IF('CALCUL EFFECTIFS'!AR84>0,'CALCUL EFFECTIFS'!AR84,$A$6&\"\")","v":""},{"$f":"IF('CALCUL EFFECTIFS'!AS84>0,'CALCUL EFFECTIFS'!AS84,$A$6&\"\")","v":""}]
[{"$f":"IF(B39>0,'CALCUL EFFECTIFS'!B96&\"\",$A$6&\"\")","v":"POMME"},13,null,{"$f":"IF('CALCUL EFFECTIFS'!E96>0,'CALCUL EFFECTIFS'!E96,$A$6&\"\")","v":""},null,{"$f":"IF('CALCUL EFFECTIFS'!G96>0,'CALCUL EFFECTIFS'!G96,$A$6&\"\")","v":2},{"$f":"IF('CALCUL EFFECTIFS'!H96>0,'CALCUL EFFECTIFS'!H96,$A$6&\"\")","v":5},{"$f":"IF('CALCUL EFFECTIFS'!I96>0,'CALCUL EFFECTIFS'!I96,$A$6&\"\")","v":1},{"$f":"IF('CALCUL EFFECTIFS'!J96>0,'CALCUL EFFECTIFS'!J96,$A$6&\"\")","v":2},{"$f":"IF('CALCUL EFFECTIFS'!K96>0,'CALCUL EFFECTIFS'!K96,$A$6&\"\")","v":3},{"$f":"IF('CALCUL EFFECTIFS'!L96>0,'CALCUL EFFECTIFS'!L96,$A$6&\"\")","v":""},{"$f":"IF('CALCUL EFFECTIFS'!M96>0,'CALCUL EFFECTIFS'!M96,$A$6&\"\")","v":""},{"$f":"IF('CALCUL EFFECTIFS'!N96>0,'CALCUL EFFECTIFS'!N96,$A$6&\"\")","v":""},{"$f":"IF('CALCUL EFFECTIFS'!O96>0,'CALCUL EFFECTIFS'!O96,$A$6&\"\")","v":""},{"$f":"IF('CALCUL EFFECTIFS'!P96>0,'CALCUL EFFECTIFS'!P96,$A$6&\"\")","v":""},{"$f":"IF('CALCUL EFFECTIFS'!Q96>0,'CALCUL EFFECTIFS'!Q96,$A$6&\"\")","v":""},{"$f":"IF('CALCUL EFFECTIFS'!R96>0,'CALCUL EFFECTIFS'!R96,$A$6&\"\")","v":""},{"$f":"IF('CALCUL EFFECTIFS'!S96>0,'CALCUL EFFECTIFS'!S96,$A$6&\"\")","v":""},{"$f":"IF('CALCUL EFFECTIFS'!T96>0,'CALCUL EFFECTIFS'!T96,$A$6&\"\")","v":""},{"$f":"IF('CALCUL EFFECTIFS'!U96>0,'CALCUL EFFECTIFS'!U96,$A$6&\"\")","v":""},{"$f":"IF('CALCUL EFFECTIFS'!V96>0,'CALCUL EFFECTIFS'!V96,$A$6&\"\")","v":""},{"$f":"IF('CALCUL EFFECTIFS'!W96>0,'CALCUL EFFECTIFS'!W96,$A$6&\"\")","v":""},{"$f":"IF('CALCUL EFFECTIFS'!X96>0,'CALCUL EFFECTIFS'!X96,$A$6&\"\")","v":""},{"$f":"IF('CALCUL EFFECTIFS'!Y96>0,'CALCUL EFFECTIFS'!Y96,$A$6&\"\")","v":""},{"$f":"IF('CALCUL EFFECTIFS'!Z96>0,'CALCUL EFFECTIFS'!Z96,$A$6&\"\")","v":""},{"$f":"IF('CALCUL EFFECTIFS'!AA96>0,'CALCUL EFFECTIFS'!AA96,$A$6&\"\")","v":""},{"$f":"IF('CALCUL EFFECTIFS'!AB96>0,'CALCUL EFFECTIFS'!AB96,$A$6&\"\")","v":""},{"$f":"IF('CALCUL EFFECTIFS'!AC96>0,'CALCUL EFFECTIFS'!AC96,$A$6&\"\")","v":""},{"$f":"IF('CALCUL EFFECTIFS'!AD96>0,'CALCUL EFFECTIFS'!AD96,$A$6&\"\")","v":""},{"$f":"IF('CALCUL EFFECTIFS'!AE96>0,'CALCUL EFFECTIFS'!AE96,$A$6&\"\")","v":""},{"$f":"IF('CALCUL EFFECTIFS'!AF96>0,'CALCUL EFFECTIFS'!AF96,$A$6&\"\")","v":""},{"$f":"IF('CALCUL EFFECTIFS'!AG96>0,'CALCUL EFFECTIFS'!AG96,$A$6&\"\")","v":""},{"$f":"IF('CALCUL EFFECTIFS'!AH96>0,'CALCUL EFFECTIFS'!AH96,$A$6&\"\")","v":""},{"$f":"IF('CALCUL EFFECTIFS'!AI96>0,'CALCUL EFFECTIFS'!AI96,$A$6&\"\")","v":""},{"$f":"IF('CALCUL EFFECTIFS'!AJ96>0,'CALCUL EFFECTIFS'!AJ96,$A$6&\"\")","v":""},{"$f":"IF('CALCUL EFFECTIFS'!AK96>0,'CALCUL EFFECTIFS'!AK96,$A$6&\"\")","v":""},{"$f":"IF('CALCUL EFFECTIFS'!AL96>0,'CALCUL EFFECTIFS'!AL96,$A$6&\"\")","v":""},{"$f":"IF('CALCUL EFFECTIFS'!AM96>0,'CALCUL EFFECTIFS'!AM96,$A$6&\"\")","v":""},{"$f":"IF('CALCUL EFFECTIFS'!AN96>0,'CALCUL EFFECTIFS'!AN96,$A$6&\"\")","v":""},{"$f":"IF('CALCUL EFFECTIFS'!AO96>0,'CALCUL EFFECTIFS'!AO96,$A$6&\"\")","v":""},{"$f":"IF('CALCUL EFFECTIFS'!AP96>0,'CALCUL EFFECTIFS'!AP96,$A$6&\"\")","v":""},{"$f":"IF('CALCUL EFFECTIFS'!AQ96>0,'CALCUL EFFECTIFS'!AQ96,$A$6&\"\")","v":""},{"$f":"IF('CALCUL EFFECTIFS'!AR96>0,'CALCUL EFFECTIFS'!AR96,$A$6&\"\")","v":""},{"$f":"IF('CALCUL EFFECTIFS'!AS96>0,'CALCUL EFFECTIFS'!AS96,$A$6&\"\")","v":""}]
[{"$f":"IF(B40>0,'CALCUL EFFECTIFS'!B32&\"\",$A$6&\"\")","v":"TOMATE VINAIGRETTE"},6,null,null,null,{"$f":"IF(MENUS!$B$9=\"POTAGE\",$A$6&\"\",'CALCUL EFFECTIFS'!G33)","v":""},{"$f":"IF(MENUS!$B$9=\"POTAGE\",$A$6&\"\",'CALCUL EFFECTIFS'!H33)","v":6},{"$f":"IF(MENUS!$B$9=\"POTAGE\",$A$6&\"\",'CALCUL EFFECTIFS'!I33)","v":""},{"$f":"IF(MENUS!$B$9=\"POTAGE\",$A$6&\"\",'CALCUL EFFECTIFS'!J33)","v":""},{"$f":"IF(MENUS!$B$9=\"POTAGE\",$A$6&\"\",'CALCUL EFFECTIFS'!K33)","v":""},{"$f":"IF(MENUS!$B$9=\"POTAGE\",$A$6&\"\",'CALCUL EFFECTIFS'!L33)","v":""},{"$f":"IF(MENUS!$B$9=\"POTAGE\",$A$6&\"\",'CALCUL EFFECTIFS'!M33)","v":""},{"$f":"IF(MENUS!$B$9=\"POTAGE\",$A$6&\"\",'CALCUL EFFECTIFS'!N33)","v":""},{"$f":"IF(MENUS!$B$9=\"POTAGE\",$A$6&\"\",'CALCUL EFFECTIFS'!O33)","v":""},{"$f":"IF(MENUS!$B$9=\"POTAGE\",$A$6&\"\",'CALCUL EFFECTIFS'!P33)","v":""},{"$f":"IF(MENUS!$B$9=\"POTAGE\",$A$6&\"\",'CALCUL EFFECTIFS'!Q33)","v":""},{"$f":"IF(MENUS!$B$9=\"POTAGE\",$A$6&\"\",'CALCUL EFFECTIFS'!R33)","v":""},{"$f":"IF(MENUS!$B$9=\"POTAGE\",$A$6&\"\",'CALCUL EFFECTIFS'!S33)","v":""},{"$f":"IF(MENUS!$B$9=\"POTAGE\",$A$6&\"\",'CALCUL EFFECTIFS'!T33)","v":""},{"$f":"IF(MENUS!$B$9=\"POTAGE\",$A$6&\"\",'CALCUL EFFECTIFS'!U33)","v":""},{"$f":"IF(MENUS!$B$9=\"POTAGE\",$A$6&\"\",'CALCUL EFFECTIFS'!V33)","v":""},{"$f":"IF(MENUS!$B$9=\"POTAGE\",$A$6&\"\",'CALCUL EFFECTIFS'!W33)","v":""},{"$f":"IF(MENUS!$B$9=\"POTAGE\",$A$6&\"\",'CALCUL EFFECTIFS'!X33)","v":""},{"$f":"IF(MENUS!$B$9=\"POTAGE\",$A$6&\"\",'CALCUL EFFECTIFS'!Y33)","v":""},{"$f":"IF(MENUS!$B$9=\"POTAGE\",$A$6&\"\",'CALCUL EFFECTIFS'!Z33)","v":""},{"$f":"IF(MENUS!$B$9=\"POTAGE\",$A$6&\"\",'CALCUL EFFECTIFS'!AA33)","v":""},{"$f":"IF(MENUS!$B$9=\"POTAGE\",$A$6&\"\",'CALCUL EFFECTIFS'!AB33)","v":""},{"$f":"IF(MENUS!$B$9=\"POTAGE\",$A$6&\"\",'CALCUL EFFECTIFS'!AC33)","v":""},{"$f":"IF(MENUS!$B$9=\"POTAGE\",$A$6&\"\",'CALCUL EFFECTIFS'!AD33)","v":""},{"$f":"IF(MENUS!$B$9=\"POTAGE\",$A$6&\"\",'CALCUL EFFECTIFS'!AE33)","v":""},{"$f":"IF(MENUS!$B$9=\"POTAGE\",$A$6&\"\",'CALCUL EFFECTIFS'!AF33)","v":""},{"$f":"IF(MENUS!$B$9=\"POTAGE\",$A$6&\"\",'CALCUL EFFECTIFS'!AG33)","v":""},{"$f":"IF(MENUS!$B$9=\"POTAGE\",$A$6&\"\",'CALCUL EFFECTIFS'!AH33)","v":""},{"$f":"IF(MENUS!$B$9=\"POTAGE\",$A$6&\"\",'CALCUL EFFECTIFS'!AI33)","v":""},{"$f":"IF(MENUS!$B$9=\"POTAGE\",$A$6&\"\",'CALCUL EFFECTIFS'!AJ33)","v":""},{"$f":"IF(MENUS!$B$9=\"POTAGE\",$A$6&\"\",'CALCUL EFFECTIFS'!AK33)","v":""},{"$f":"IF(MENUS!$B$9=\"POTAGE\",$A$6&\"\",'CALCUL EFFECTIFS'!AL33)","v":""},{"$f":"IF(MENUS!$B$9=\"POTAGE\",$A$6&\"\",'CALCUL EFFECTIFS'!AM33)","v":""},{"$f":"IF(MENUS!$B$9=\"POTAGE\",$A$6&\"\",'CALCUL EFFECTIFS'!AN33)","v":""},{"$f":"IF(MENUS!$B$9=\"POTAGE\",$A$6&\"\",'CALCUL EFFECTIFS'!AO33)","v":""},{"$f":"IF(MENUS!$B$9=\"POTAGE\",$A$6&\"\",'CALCUL EFFECTIFS'!AP33)","v":""},{"$f":"IF(MENUS!$B$9=\"POTAGE\",$A$6&\"\",'CALCUL EFFECTIFS'!AQ33)","v":""},{"$f":"IF(MENUS!$B$9=\"POTAGE\",$A$6&\"\",'CALCUL EFFECTIFS'!AR33)","v":""},{"$f":"IF(MENUS!$B$9=\"POTAGE\",$A$6&\"\",'CALCUL EFFECTIFS'!AS33)","v":""}]
[{"$f":"IF(B41>0,'CALCUL EFFECTIFS'!B61&\"\",$A$6&\"\")","v":"BŒUF BOURGUIGNON SANS LARDONS"},6,null,null,null,{"$f":"IF('CALCUL EFFECTIFS'!G61>0,'CALCUL EFFECTIFS'!G61,$A$6&\"\")","v":""},{"$f":"IF('CALCUL EFFECTIFS'!H61>0,'CALCUL EFFECTIFS'!H61,$A$6&\"\")","v":6},{"$f":"IF('CALCUL EFFECTIFS'!I61>0,'CALCUL EFFECTIFS'!I61,$A$6&\"\")","v":""},{"$f":"IF('CALCUL EFFECTIFS'!J61>0,'CALCUL EFFECTIFS'!J61,$A$6&\"\")","v":""},{"$f":"IF('CALCUL EFFECTIFS'!K61>0,'CALCUL EFFECTIFS'!K61,$A$6&\"\")","v":""},{"$f":"IF('CALCUL EFFECTIFS'!L61>0,'CALCUL EFFECTIFS'!L61,$A$6&\"\")","v":""},{"$f":"IF('CALCUL EFFECTIFS'!M61>0,'CALCUL EFFECTIFS'!M61,$A$6&\"\")","v":""},{"$f":"IF('CALCUL EFFECTIFS'!N61>0,'CALCUL EFFECTIFS'!N61,$A$6&\"\")","v":""},{"$f":"IF('CALCUL EFFECTIFS'!O61>0,'CALCUL EFFECTIFS'!O61,$A$6&\"\")","v":""},{"$f":"IF('CALCUL EFFECTIFS'!P61>0,'CALCUL EFFECTIFS'!P61,$A$6&\"\")","v":""},{"$f":"IF('CALCUL EFFECTIFS'!Q61>0,'CALCUL EFFECTIFS'!Q61,$A$6&\"\")","v":""},{"$f":"IF('CALCUL EFFECTIFS'!R61>0,'CALCUL EFFECTIFS'!R61,$A$6&\"\")","v":""},{"$f":"IF('CALCUL EFFECTIFS'!S61>0,'CALCUL EFFECTIFS'!S61,$A$6&\"\")","v":""},{"$f":"IF('CALCUL EFFECTIFS'!T61>0,'CALCUL EFFECTIFS'!T61,$A$6&\"\")","v":""},{"$f":"IF('CALCUL EFFECTIFS'!U61>0,'CALCUL EFFECTIFS'!U61,$A$6&\"\")","v":""},{"$f":"IF('CALCUL EFFECTIFS'!V61>0,'CALCUL EFFECTIFS'!V61,$A$6&\"\")","v":""},{"$f":"IF('CALCUL EFFECTIFS'!W61>0,'CALCUL EFFECTIFS'!W61,$A$6&\"\")","v":""},{"$f":"IF('CALCUL EFFECTIFS'!X61>0,'CALCUL EFFECTIFS'!X61,$A$6&\"\")","v":""},{"$f":"IF('CALCUL EFFECTIFS'!Y61>0,'CALCUL EFFECTIFS'!Y61,$A$6&\"\")","v":""},{"$f":"IF('CALCUL EFFECTIFS'!Z61>0,'CALCUL EFFECTIFS'!Z61,$A$6&\"\")","v":""},{"$f":"IF('CALCUL EFFECTIFS'!AA61>0,'CALCUL EFFECTIFS'!AA61,$A$6&\"\")","v":""},{"$f":"IF('CALCUL EFFECTIFS'!AB61>0,'CALCUL EFFECTIFS'!AB61,$A$6&\"\")","v":""},{"$f":"IF('CALCUL EFFECTIFS'!AC61>0,'CALCUL EFFECTIFS'!AC61,$A$6&\"\")","v":""},{"$f":"IF('CALCUL EFFECTIFS'!AD61>0,'CALCUL EFFECTIFS'!AD61,$A$6&\"\")","v":""},{"$f":"IF('CALCUL EFFECTIFS'!AE61>0,'CALCUL EFFECTIFS'!AE61,$A$6&\"\")","v":""},{"$f":"IF('CALCUL EFFECTIFS'!AF61>0,'CALCUL EFFECTIFS'!AF61,$A$6&\"\")","v":""},{"$f":"IF('CALCUL EFFECTIFS'!AG61>0,'CALCUL EFFECTIFS'!AG61,$A$6&\"\")","v":""},{"$f":"IF('CALCUL EFFECTIFS'!AH61>0,'CALCUL EFFECTIFS'!AH61,$A$6&\"\")","v":""},{"$f":"IF('CALCUL EFFECTIFS'!AI61>0,'CALCUL EFFECTIFS'!AI61,$A$6&\"\")","v":""},{"$f":"IF('CALCUL EFFECTIFS'!AJ61>0,'CALCUL EFFECTIFS'!AJ61,$A$6&\"\")","v":""},{"$f":"IF('CALCUL EFFECTIFS'!AK61>0,'CALCUL EFFECTIFS'!AK61,$A$6&\"\")","v":""},{"$f":"IF('CALCUL EFFECTIFS'!AL61>0,'CALCUL EFFECTIFS'!AL61,$A$6&\"\")","v":""},{"$f":"IF('CALCUL EFFECTIFS'!AM61>0,'CALCUL EFFECTIFS'!AM61,$A$6&\"\")","v":""},{"$f":"IF('CALCUL EFFECTIFS'!AN61>0,'CALCUL EFFECTIFS'!AN61,$A$6&\"\")","v":""},{"$f":"IF('CALCUL EFFECTIFS'!AO61>0,'CALCUL EFFECTIFS'!AO61,$A$6&\"\")","v":""},{"$f":"IF('CALCUL EFFECTIFS'!AP61>0,'CALCUL EFFECTIFS'!AP61,$A$6&\"\")","v":""},{"$f":"IF('CALCUL EFFECTIFS'!AQ61>0,'CALCUL EFFECTIFS'!AQ61,$A$6&\"\")","v":""},{"$f":"IF('CALCUL EFFECTIFS'!AR61>0,'CALCUL EFFECTIFS'!AR61,$A$6&\"\")","v":""},{"$f":"IF('CALCUL EFFECTIFS'!AS61>0,'CALCUL EFFECTIFS'!AS61,$A$6&\"\")","v":""}]
[{"$f":"IF(B42>0,'CALCUL EFFECTIFS'!B73&\"\",$A$6&\"\")","v":""},0,null,null,null,{"$f":"IF('CALCUL EFFECTIFS'!G73>0,'CALCUL EFFECTIFS'!G73,$A$6&\"\")","v":""},{"$f":"IF('CALCUL EFFECTIFS'!H73>0,'CALCUL EFFECTIFS'!H73,$A$6&\"\")","v":""},{"$f":"IF('CALCUL EFFECTIFS'!I73>0,'CALCUL EFFECTIFS'!I73,$A$6&\"\")","v":""},{"$f":"IF('CALCUL EFFECTIFS'!J73>0,'CALCUL EFFECTIFS'!J73,$A$6&\"\")","v":""},{"$f":"IF('CALCUL EFFECTIFS'!K73>0,'CALCUL EFFECTIFS'!K73,$A$6&\"\")","v":""},{"$f":"IF('CALCUL EFFECTIFS'!L73>0,'CALCUL EFFECTIFS'!L73,$A$6&\"\")","v":""},{"$f":"IF('CALCUL EFFECTIFS'!M73>0,'CALCUL EFFECTIFS'!M73,$A$6&\"\")","v":""},{"$f":"IF('CALCUL EFFECTIFS'!N73>0,'CALCUL EFFECTIFS'!N73,$A$6&\"\")","v":""},{"$f":"IF('CALCUL EFFECTIFS'!O73>0,'CALCUL EFFECTIFS'!O73,$A$6&\"\")","v":""},{"$f":"IF('CALCUL EFFECTIFS'!P73>0,'CALCUL EFFECTIFS'!P73,$A$6&\"\")","v":""},{"$f":"IF('CALCUL EFFECTIFS'!Q73>0,'CALCUL EFFECTIFS'!Q73,$A$6&\"\")","v":""},{"$f":"IF('CALCUL EFFECTIFS'!R73>0,'CALCUL EFFECTIFS'!R73,$A$6&\"\")","v":""},{"$f":"IF('CALCUL EFFECTIFS'!S73>0,'CALCUL EFFECTIFS'!S73,$A$6&\"\")","v":""},{"$f":"IF('CALCUL EFFECTIFS'!T73>0,'CALCUL EFFECTIFS'!T73,$A$6&\"\")","v":""},{"$f":"IF('CALCUL EFFECTIFS'!U73>0,'CALCUL EFFECTIFS'!U73,$A$6&\"\")","v":""},{"$f":"IF('CALCUL EFFECTIFS'!V73>0,'CALCUL EFFECTIFS'!V73,$A$6&\"\")","v":""},{"$f":"IF('CALCUL EFFECTIFS'!W73>0,'CALCUL EFFECTIFS'!W73,$A$6&\"\")","v":""},{"$f":"IF('CALCUL EFFECTIFS'!X73>0,'CALCUL EFFECTIFS'!X73,$A$6&\"\")","v":""},{"$f":"IF('CALCUL EFFECTIFS'!Y73>0,'CALCUL EFFECTIFS'!Y73,$A$6&\"\")","v":""},{"$f":"IF('CALCUL EFFECTIFS'!Z73>0,'CALCUL EFFECTIFS'!Z73,$A$6&\"\")","v":""},{"$f":"IF('CALCUL EFFECTIFS'!AA73>0,'CALCUL EFFECTIFS'!AA73,$A$6&\"\")","v":""},{"$f":"IF('CALCUL EFFECTIFS'!AB73>0,'CALCUL EFFECTIFS'!AB73,$A$6&\"\")","v":""},{"$f":"IF('CALCUL EFFECTIFS'!AC73>0,'CALCUL EFFECTIFS'!AC73,$A$6&\"\")","v":""},{"$f":"IF('CALCUL EFFECTIFS'!AD73>0,'CALCUL EFFECTIFS'!AD73,$A$6&\"\")","v":""},{"$f":"IF('CALCUL EFFECTIFS'!AE73>0,'CALCUL EFFECTIFS'!AE73,$A$6&\"\")","v":""},{"$f":"IF('CALCUL EFFECTIFS'!AF73>0,'CALCUL EFFECTIFS'!AF73,$A$6&\"\")","v":""},{"$f":"IF('CALCUL EFFECTIFS'!AG73>0,'CALCUL EFFECTIFS'!AG73,$A$6&\"\")","v":""},{"$f":"IF('CALCUL EFFECTIFS'!AH73>0,'CALCUL EFFECTIFS'!AH73,$A$6&\"\")","v":""},{"$f":"IF('CALCUL EFFECTIFS'!AI73>0,'CALCUL EFFECTIFS'!AI73,$A$6&\"\")","v":""},{"$f":"IF('CALCUL EFFECTIFS'!AJ73>0,'CALCUL EFFECTIFS'!AJ73,$A$6&\"\")","v":""},{"$f":"IF('CALCUL EFFECTIFS'!AK73>0,'CALCUL EFFECTIFS'!AK73,$A$6&\"\")","v":""},{"$f":"IF('CALCUL EFFECTIFS'!AL73>0,'CALCUL EFFECTIFS'!AL73,$A$6&\"\")","v":""},{"$f":"IF('CALCUL EFFECTIFS'!AM73>0,'CALCUL EFFECTIFS'!AM73,$A$6&\"\")","v":""},{"$f":"IF('CALCUL EFFECTIFS'!AN73>0,'CALCUL EFFECTIFS'!AN73,$A$6&\"\")","v":""},{"$f":"IF('CALCUL EFFECTIFS'!AO73>0,'CALCUL EFFECTIFS'!AO73,$A$6&\"\")","v":""},{"$f":"IF('CALCUL EFFECTIFS'!AP73>0,'CALCUL EFFECTIFS'!AP73,$A$6&\"\")","v":""},{"$f":"IF('CALCUL EFFECTIFS'!AQ73>0,'CALCUL EFFECTIFS'!AQ73,$A$6&\"\")","v":""},{"$f":"IF('CALCUL EFFECTIFS'!AR73>0,'CALCUL EFFECTIFS'!AR73,$A$6&\"\")","v":""},{"$f":"IF('CALCUL EFFECTIFS'!AS73>0,'CALCUL EFFECTIFS'!AS73,$A$6&\"\")","v":""}]
[{"$f":"IF(B43>0,'CALCUL EFFECTIFS'!B34&\"\",$A$6&\"\")","v":"TOMATE VINAIGRETTE"},22,null,null,null,{"$f":"IF(MENUS!$B$9=\"POTAGE\",$A$6&\"\",'CALCUL EFFECTIFS'!G35)","v":5},{"$f":"IF(MENUS!$B$9=\"POTAGE\",$A$6&\"\",'CALCUL EFFECTIFS'!H35)","v":2},{"$f":"IF(MENUS!$B$9=\"POTAGE\",$A$6&\"\",'CALCUL EFFECTIFS'!I35)","v":1},{"$f":"IF(MENUS!$B$9=\"POTAGE\",$A$6&\"\",'CALCUL EFFECTIFS'!J35)","v":""},{"$f":"IF(MENUS!$B$9=\"POTAGE\",$A$6&\"\",'CALCUL EFFECTIFS'!K35)","v":""},{"$f":"IF(MENUS!$B$9=\"POTAGE\",$A$6&\"\",'CALCUL EFFECTIFS'!L35)","v":""},{"$f":"IF(MENUS!$B$9=\"POTAGE\",$A$6&\"\",'CALCUL EFFECTIFS'!M35)","v":4},{"$f":"IF(MENUS!$B$9=\"POTAGE\",$A$6&\"\",'CALCUL EFFECTIFS'!N35)","v":3},{"$f":"IF(MENUS!$B$9=\"POTAGE\",$A$6&\"\",'CALCUL EFFECTIFS'!O35)","v":2},{"$f":"IF(MENUS!$B$9=\"POTAGE\",$A$6&\"\",'CALCUL EFFECTIFS'!P35)","v":1},{"$f":"IF(MENUS!$B$9=\"POTAGE\",$A$6&\"\",'CALCUL EFFECTIFS'!Q35)","v":4},{"$f":"IF(MENUS!$B$9=\"POTAGE\",$A$6&\"\",'CALCUL EFFECTIFS'!R35)","v":""},{"$f":"IF(MENUS!$B$9=\"POTAGE\",$A$6&\"\",'CALCUL EFFECTIFS'!S35)","v":""},{"$f":"IF(MENUS!$B$9=\"POTAGE\",$A$6&\"\",'CALCUL EFFECTIFS'!T35)","v":""},{"$f":"IF(MENUS!$B$9=\"POTAGE\",$A$6&\"\",'CALCUL EFFECTIFS'!U35)","v":""},{"$f":"IF(MENUS!$B$9=\"POTAGE\",$A$6&\"\",'CALCUL EFFECTIFS'!V35)","v":""},{"$f":"IF(MENUS!$B$9=\"POTAGE\",$A$6&\"\",'CALCUL EFFECTIFS'!W35)","v":""},{"$f":"IF(MENUS!$B$9=\"POTAGE\",$A$6&\"\",'CALCUL EFFECTIFS'!X35)","v":""},{"$f":"IF(MENUS!$B$9=\"POTAGE\",$A$6&\"\",'CALCUL EFFECTIFS'!Y35)","v":""},{"$f":"IF(MENUS!$B$9=\"POTAGE\",$A$6&\"\",'CALCUL EFFECTIFS'!Z35)","v":""},{"$f":"IF(MENUS!$B$9=\"POTAGE\",$A$6&\"\",'CALCUL EFFECTIFS'!AA35)","v":""},{"$f":"IF(MENUS!$B$9=\"POTAGE\",$A$6&\"\",'CALCUL EFFECTIFS'!AB35)","v":""},{"$f":"IF(MENUS!$B$9=\"POTAGE\",$A$6&\"\",'CALCUL EFFECTIFS'!AC35)","v":""},{"$f":"IF(MENUS!$B$9=\"POTAGE\",$A$6&\"\",'CALCUL EFFECTIFS'!AD35)","v":""},{"$f":"IF(MENUS!$B$9=\"POTAGE\",$A$6&\"\",'CALCUL EFFECTIFS'!AE35)","v":""},{"$f":"IF(MENUS!$B$9=\"POTAGE\",$A$6&\"\",'CALCUL EFFECTIFS'!AF35)","v":""},{"$f":"IF(MENUS!$B$9=\"POTAGE\",$A$6&\"\",'CALCUL EFFECTIFS'!AG35)","v":""},{"$f":"IF(MENUS!$B$9=\"POTAGE\",$A$6&\"\",'CALCUL EFFECTIFS'!AH35)","v":""},{"$f":"IF(MENUS!$B$9=\"POTAGE\",$A$6&\"\",'CALCUL EFFECTIFS'!AI35)","v":""},{"$f":"IF(MENUS!$B$9=\"POTAGE\",$A$6&\"\",'CALCUL EFFECTIFS'!AJ35)","v":""},{"$f":"IF(MENUS!$B$9=\"POTAGE\",$A$6&\"\",'CALCUL EFFECTIFS'!AK35)","v":""},{"$f":"IF(MENUS!$B$9=\"POTAGE\",$A$6&\"\",'CALCUL EFFECTIFS'!AL35)","v":""},{"$f":"IF(MENUS!$B$9=\"POTAGE\",$A$6&\"\",'CALCUL EFFECTIFS'!AM35)","v":""},{"$f":"IF(MENUS!$B$9=\"POTAGE\",$A$6&\"\",'CALCUL EFFECTIFS'!AN35)","v":""},{"$f":"IF(MENUS!$B$9=\"POTAGE\",$A$6&\"\",'CALCUL EFFECTIFS'!AO35)","v":""},{"$f":"IF(MENUS!$B$9=\"POTAGE\",$A$6&\"\",'CALCUL EFFECTIFS'!AP35)","v":""},{"$f":"IF(MENUS!$B$9=\"POTAGE\",$A$6&\"\",'CALCUL EFFECTIFS'!AQ35)","v":""},{"$f":"IF(MENUS!$B$9=\"POTAGE\",$A$6&\"\",'CALCUL EFFECTIFS'!AR35)","v":""},{"$f":"IF(MENUS!$B$9=\"POTAGE\",$A$6&\"\",'CALCUL EFFECTIFS'!AS35)","v":""}]
[{"$f":"IF(B44>0,'CALCUL EFFECTIFS'!B62&\"\",$A$6&\"\")","v":"BŒUF SANS LARDONS"},22,null,null,null,{"$f":"IF('CALCUL EFFECTIFS'!G62>0,'CALCUL EFFECTIFS'!G62,$A$6&\"\")","v":5},{"$f":"IF('CALCUL EFFECTIFS'!H62>0,'CALCUL EFFECTIFS'!H62,$A$6&\"\")","v":2},{"$f":"IF('CALCUL EFFECTIFS'!I62>0,'CALCUL EFFECTIFS'!I62,$A$6&\"\")","v":1},{"$f":"IF('CALCUL EFFECTIFS'!J62>0,'CALCUL EFFECTIFS'!J62,$A$6&\"\")","v":""},{"$f":"IF('CALCUL EFFECTIFS'!K62>0,'CALCUL EFFECTIFS'!K62,$A$6&\"\")","v":""},{"$f":"IF('CALCUL EFFECTIFS'!L62>0,'CALCUL EFFECTIFS'!L62,$A$6&\"\")","v":""},{"$f":"IF('CALCUL EFFECTIFS'!M62>0,'CALCUL EFFECTIFS'!M62,$A$6&\"\")","v":4},{"$f":"IF('CALCUL EFFECTIFS'!N62>0,'CALCUL EFFECTIFS'!N62,$A$6&\"\")","v":3},{"$f":"IF('CALCUL EFFECTIFS'!O62>0,'CALCUL EFFECTIFS'!O62,$A$6&\"\")","v":2},{"$f":"IF('CALCUL EFFECTIFS'!P62>0,'CALCUL EFFECTIFS'!P62,$A$6&\"\")","v":1},{"$f":"IF('CALCUL EFFECTIFS'!Q62>0,'CALCUL EFFECTIFS'!Q62,$A$6&\"\")","v":4},{"$f":"IF('CALCUL EFFECTIFS'!R62>0,'CALCUL EFFECTIFS'!R62,$A$6&\"\")","v":""},{"$f":"IF('CALCUL EFFECTIFS'!S62>0,'CALCUL EFFECTIFS'!S62,$A$6&\"\")","v":""},{"$f":"IF('CALCUL EFFECTIFS'!T62>0,'CALCUL EFFECTIFS'!T62,$A$6&\"\")","v":""},{"$f":"IF('CALCUL EFFECTIFS'!U62>0,'CALCUL EFFECTIFS'!U62,$A$6&\"\")","v":""},{"$f":"IF('CALCUL EFFECTIFS'!V62>0,'CALCUL EFFECTIFS'!V62,$A$6&\"\")","v":""},{"$f":"IF('CALCUL EFFECTIFS'!W62>0,'CALCUL EFFECTIFS'!W62,$A$6&\"\")","v":""},{"$f":"IF('CALCUL EFFECTIFS'!X62>0,'CALCUL EFFECTIFS'!X62,$A$6&\"\")","v":""},{"$f":"IF('CALCUL EFFECTIFS'!Y62>0,'CALCUL EFFECTIFS'!Y62,$A$6&\"\")","v":""},{"$f":"IF('CALCUL EFFECTIFS'!Z62>0,'CALCUL EFFECTIFS'!Z62,$A$6&\"\")","v":""},{"$f":"IF('CALCUL EFFECTIFS'!AA62>0,'CALCUL EFFECTIFS'!AA62,$A$6&\"\")","v":""},{"$f":"IF('CALCUL EFFECTIFS'!AB62>0,'CALCUL EFFECTIFS'!AB62,$A$6&\"\")","v":""},{"$f":"IF('CALCUL EFFECTIFS'!AC62>0,'CALCUL EFFECTIFS'!AC62,$A$6&\"\")","v":""},{"$f":"IF('CALCUL EFFECTIFS'!AD62>0,'CALCUL EFFECTIFS'!AD62,$A$6&\"\")","v":""},{"$f":"IF('CALCUL EFFECTIFS'!AE62>0,'CALCUL EFFECTIFS'!AE62,$A$6&\"\")","v":""},{"$f":"IF('CALCUL EFFECTIFS'!AF62>0,'CALCUL EFFECTIFS'!AF62,$A$6&\"\")","v":""},{"$f":"IF('CALCUL EFFECTIFS'!AG62>0,'CALCUL EFFECTIFS'!AG62,$A$6&\"\")","v":""},{"$f":"IF('CALCUL EFFECTIFS'!AH62>0,'CALCUL EFFECTIFS'!AH62,$A$6&\"\")","v":""},{"$f":"IF('CALCUL EFFECTIFS'!AI62>0,'CALCUL EFFECTIFS'!AI62,$A$6&\"\")","v":""},{"$f":"IF('CALCUL EFFECTIFS'!AJ62>0,'CALCUL EFFECTIFS'!AJ62,$A$6&\"\")","v":""},{"$f":"IF('CALCUL EFFECTIFS'!AK62>0,'CALCUL EFFECTIFS'!AK62,$A$6&\"\")","v":""},{"$f":"IF('CALCUL EFFECTIFS'!AL62>0,'CALCUL EFFECTIFS'!AL62,$A$6&\"\")","v":""},{"$f":"IF('CALCUL EFFECTIFS'!AM62>0,'CALCUL EFFECTIFS'!AM62,$A$6&\"\")","v":""},{"$f":"IF('CALCUL EFFECTIFS'!AN62>0,'CALCUL EFFECTIFS'!AN62,$A$6&\"\")","v":""},{"$f":"IF('CALCUL EFFECTIFS'!AO62>0,'CALCUL EFFECTIFS'!AO62,$A$6&\"\")","v":""},{"$f":"IF('CALCUL EFFECTIFS'!AP62>0,'CALCUL EFFECTIFS'!AP62,$A$6&\"\")","v":""},{"$f":"IF('CALCUL EFFECTIFS'!AQ62>0,'CALCUL EFFECTIFS'!AQ62,$A$6&\"\")","v":""},{"$f":"IF('CALCUL EFFECTIFS'!AR62>0,'CALCUL EFFECTIFS'!AR62,$A$6&\"\")","v":""},{"$f":"IF('CALCUL EFFECTIFS'!AS62>0,'CALCUL EFFECTIFS'!AS62,$A$6&\"\")","v":""}]
[{"$f":"IF(B45>0,'CALCUL EFFECTIFS'!B74&\"\",$A$6&\"\")","v":"P.DE TERRE VAPEUR"},22,null,null,null,{"$f":"IF('CALCUL EFFECTIFS'!G74>0,'CALCUL EFFECTIFS'!G74,$A$6&\"\")","v":5},{"$f":"IF('CALCUL EFFECTIFS'!H74>0,'CALCUL EFFECTIFS'!H74,$A$6&\"\")","v":2},{"$f":"IF('CALCUL EFFECTIFS'!I74>0,'CALCUL EFFECTIFS'!I74,$A$6&\"\")","v":1},{"$f":"IF('CALCUL EFFECTIFS'!J74>0,'CALCUL EFFECTIFS'!J74,$A$6&\"\")","v":""},{"$f":"IF('CALCUL EFFECTIFS'!K74>0,'CALCUL EFFECTIFS'!K74,$A$6&\"\")","v":""},{"$f":"IF('CALCUL EFFECTIFS'!L74>0,'CALCUL EFFECTIFS'!L74,$A$6&\"\")","v":""},{"$f":"IF('CALCUL EFFECTIFS'!M74>0,'CALCUL EFFECTIFS'!M74,$A$6&\"\")","v":4},{"$f":"IF('CALCUL EFFECTIFS'!N74>0,'CALCUL EFFECTIFS'!N74,$A$6&\"\")","v":3},{"$f":"IF('CALCUL EFFECTIFS'!O74>0,'CALCUL EFFECTIFS'!O74,$A$6&\"\")","v":2},{"$f":"IF('CALCUL EFFECTIFS'!P74>0,'CALCUL EFFECTIFS'!P74,$A$6&\"\")","v":1},{"$f":"IF('CALCUL EFFECTIFS'!Q74>0,'CALCUL EFFECTIFS'!Q74,$A$6&\"\")","v":4},{"$f":"IF('CALCUL EFFECTIFS'!R74>0,'CALCUL EFFECTIFS'!R74,$A$6&\"\")","v":""},{"$f":"IF('CALCUL EFFECTIFS'!S74>0,'CALCUL EFFECTIFS'!S74,$A$6&\"\")","v":""},{"$f":"IF('CALCUL EFFECTIFS'!T74>0,'CALCUL EFFECTIFS'!T74,$A$6&\"\")","v":""},{"$f":"IF('CALCUL EFFECTIFS'!U74>0,'CALCUL EFFECTIFS'!U74,$A$6&\"\")","v":""},{"$f":"IF('CALCUL EFFECTIFS'!V74>0,'CALCUL EFFECTIFS'!V74,$A$6&\"\")","v":""},{"$f":"IF('CALCUL EFFECTIFS'!W74>0,'CALCUL EFFECTIFS'!W74,$A$6&\"\")","v":""},{"$f":"IF('CALCUL EFFECTIFS'!X74>0,'CALCUL EFFECTIFS'!X74,$A$6&\"\")","v":""},{"$f":"IF('CALCUL EFFECTIFS'!Y74>0,'CALCUL EFFECTIFS'!Y74,$A$6&\"\")","v":""},{"$f":"IF('CALCUL EFFECTIFS'!Z74>0,'CALCUL EFFECTIFS'!Z74,$A$6&\"\")","v":""},{"$f":"IF('CALCUL EFFECTIFS'!AA74>0,'CALCUL EFFECTIFS'!AA74,$A$6&\"\")","v":""},{"$f":"IF('CALCUL EFFECTIFS'!AB74>0,'CALCUL EFFECTIFS'!AB74,$A$6&\"\")","v":""},{"$f":"IF('CALCUL EFFECTIFS'!AC74>0,'CALCUL EFFECTIFS'!AC74,$A$6&\"\")","v":""},{"$f":"IF('CALCUL EFFECTIFS'!AD74>0,'CALCUL EFFECTIFS'!AD74,$A$6&\"\")","v":""},{"$f":"IF('CALCUL EFFECTIFS'!AE74>0,'CALCUL EFFECTIFS'!AE74,$A$6&\"\")","v":""},{"$f":"IF('CALCUL EFFECTIFS'!AF74>0,'CALCUL EFFECTIFS'!AF74,$A$6&\"\")","v":""},{"$f":"IF('CALCUL EFFECTIFS'!AG74>0,'CALCUL EFFECTIFS'!AG74,$A$6&\"\")","v":""},{"$f":"IF('CALCUL EFFECTIFS'!AH74>0,'CALCUL EFFECTIFS'!AH74,$A$6&\"\")","v":""},{"$f":"IF('CALCUL EFFECTIFS'!AI74>0,'CALCUL EFFECTIFS'!AI74,$A$6&\"\")","v":""},{"$f":"IF('CALCUL EFFECTIFS'!AJ74>0,'CALCUL EFFECTIFS'!AJ74,$A$6&\"\")","v":""},{"$f":"IF('CALCUL EFFECTIFS'!AK74>0,'CALCUL EFFECTIFS'!AK74,$A$6&\"\")","v":""},{"$f":"IF('CALCUL EFFECTIFS'!AL74>0,'CALCUL EFFECTIFS'!AL74,$A$6&\"\")","v":""},{"$f":"IF('CALCUL EFFECTIFS'!AM74>0,'CALCUL EFFECTIFS'!AM74,$A$6&\"\")","v":""},{"$f":"IF('CALCUL EFFECTIFS'!AN74>0,'CALCUL EFFECTIFS'!AN74,$A$6&\"\")","v":""},{"$f":"IF('CALCUL EFFECTIFS'!AO74>0,'CALCUL EFFECTIFS'!AO74,$A$6&\"\")","v":""},{"$f":"IF('CALCUL EFFECTIFS'!AP74>0,'CALCUL EFFECTIFS'!AP74,$A$6&\"\")","v":""},{"$f":"IF('CALCUL EFFECTIFS'!AQ74>0,'CALCUL EFFECTIFS'!AQ74,$A$6&\"\")","v":""},{"$f":"IF('CALCUL EFFECTIFS'!AR74>0,'CALCUL EFFECTIFS'!AR74,$A$6&\"\")","v":""},{"$f":"IF('CALCUL EFFECTIFS'!AS74>0,'CALCUL EFFECTIFS'!AS74,$A$6&\"\")","v":""}]
[{"$f":"IF(B46>0,'CALCUL EFFECTIFS'!B36&\"\",$A$6&\"\")","v":""},0,{"$f":"IF('CALCUL EFFECTIFS'!D36>0,'CALCUL EFFECTIFS'!D36,$A$6&\"\")","v":""},null,null,{"$f":"IF('CALCUL EFFECTIFS'!G36>0,'CALCUL EFFECTIFS'!G36,$A$6&\"\")","v":""},{"$f":"IF('CALCUL EFFECTIFS'!H36>0,'CALCUL EFFECTIFS'!H36,$A$6&\"\")","v":""},{"$f":"IF('CALCUL EFFECTIFS'!I36>0,'CALCUL EFFECTIFS'!I36,$A$6&\"\")","v":""},{"$f":"IF('CALCUL EFFECTIFS'!J36>0,'CALCUL EFFECTIFS'!J36,$A$6&\"\")","v":""},{"$f":"IF('CALCUL EFFECTIFS'!K36>0,'CALCUL EFFECTIFS'!K36,$A$6&\"\")","v":""},{"$f":"IF('CALCUL EFFECTIFS'!L36>0,'CALCUL EFFECTIFS'!L36,$A$6&\"\")","v":""},{"$f":"IF('CALCUL EFFECTIFS'!M36>0,'CALCUL EFFECTIFS'!M36,$A$6&\"\")","v":""},{"$f":"IF('CALCUL EFFECTIFS'!N36>0,'CALCUL EFFECTIFS'!N36,$A$6&\"\")","v":""},{"$f":"IF('CALCUL EFFECTIFS'!O36>0,'CALCUL EFFECTIFS'!O36,$A$6&\"\")","v":""},{"$f":"IF('CALCUL EFFECTIFS'!P36>0,'CALCUL EFFECTIFS'!P36,$A$6&\"\")","v":""},{"$f":"IF('CALCUL EFFECTIFS'!Q36>0,'CALCUL EFFECTIFS'!Q36,$A$6&\"\")","v":""},{"$f":"IF('CALCUL EFFECTIFS'!R36>0,'CALCUL EFFECTIFS'!R36,$A$6&\"\")","v":""},{"$f":"IF('CALCUL EFFECTIFS'!S36>0,'CALCUL EFFECTIFS'!S36,$A$6&\"\")","v":""},{"$f":"IF('CALCUL EFFECTIFS'!T36>0,'CALCUL EFFECTIFS'!T36,$A$6&\"\")","v":""},{"$f":"IF('CALCUL EFFECTIFS'!U36>0,'CALCUL EFFECTIFS'!U36,$A$6&\"\")","v":""},{"$f":"IF('CALCUL EFFECTIFS'!V36>0,'CALCUL EFFECTIFS'!V36,$A$6&\"\")","v":""},{"$f":"IF('CALCUL EFFECTIFS'!W36>0,'CALCUL EFFECTIFS'!W36,$A$6&\"\")","v":""},{"$f":"IF('CALCUL EFFECTIFS'!X36>0,'CALCUL EFFECTIFS'!X36,$A$6&\"\")","v":""},{"$f":"IF('CALCUL EFFECTIFS'!Y36>0,'CALCUL EFFECTIFS'!Y36,$A$6&\"\")","v":""},{"$f":"IF('CALCUL EFFECTIFS'!Z36>0,'CALCUL EFFECTIFS'!Z36,$A$6&\"\")","v":""},{"$f":"IF('CALCUL EFFECTIFS'!AA36>0,'CALCUL EFFECTIFS'!AA36,$A$6&\"\")","v":""},{"$f":"IF('CALCUL EFFECTIFS'!AB36>0,'CALCUL EFFECTIFS'!AB36,$A$6&\"\")","v":""},{"$f":"IF('CALCUL EFFECTIFS'!AC36>0,'CALCUL EFFECTIFS'!AC36,$A$6&\"\")","v":""},{"$f":"IF('CALCUL EFFECTIFS'!AD36>0,'CALCUL EFFECTIFS'!AD36,$A$6&\"\")","v":""},{"$f":"IF('CALCUL EFFECTIFS'!AE36>0,'CALCUL EFFECTIFS'!AE36,$A$6&\"\")","v":""},{"$f":"IF('CALCUL EFFECTIFS'!AF36>0,'CALCUL EFFECTIFS'!AF36,$A$6&\"\")","v":""},{"$f":"IF('CALCUL EFFECTIFS'!AG36>0,'CALCUL EFFECTIFS'!AG36,$A$6&\"\")","v":""},{"$f":"IF('CALCUL EFFECTIFS'!AH36>0,'CALCUL EFFECTIFS'!AH36,$A$6&\"\")","v":""},{"$f":"IF('CALCUL EFFECTIFS'!AI36>0,'CALCUL EFFECTIFS'!AI36,$A$6&\"\")","v":""},{"$f":"IF('CALCUL EFFECTIFS'!AJ36>0,'CALCUL EFFECTIFS'!AJ36,$A$6&\"\")","v":""},{"$f":"IF('CALCUL EFFECTIFS'!AK36>0,'CALCUL EFFECTIFS'!AK36,$A$6&\"\")","v":""},{"$f":"IF('CALCUL EFFECTIFS'!AL36>0,'CALCUL EFFECTIFS'!AL36,$A$6&\"\")","v":""},{"$f":"IF('CALCUL EFFECTIFS'!AM36>0,'CALCUL EFFECTIFS'!AM36,$A$6&\"\")","v":""},{"$f":"IF('CALCUL EFFECTIFS'!AN36>0,'CALCUL EFFECTIFS'!AN36,$A$6&\"\")","v":""},{"$f":"IF('CALCUL EFFECTIFS'!AO36>0,'CALCUL EFFECTIFS'!AO36,$A$6&\"\")","v":""},{"$f":"IF('CALCUL EFFECTIFS'!AP36>0,'CALCUL EFFECTIFS'!AP36,$A$6&\"\")","v":""},{"$f":"IF('CALCUL EFFECTIFS'!AQ36>0,'CALCUL EFFECTIFS'!AQ36,$A$6&\"\")","v":""},{"$f":"IF('CALCUL EFFECTIFS'!AR36>0,'CALCUL EFFECTIFS'!AR36,$A$6&\"\")","v":""},{"$f":"IF('CALCUL EFFECTIFS'!AS36>0,'CALCUL EFFECTIFS'!AS36,$A$6&\"\")","v":""}]
[{"$f":"IF(B47>0,'CALCUL EFFECTIFS'!B63&\"\",$A$6&\"\")","v":""},0,{"$f":"IF('CALCUL EFFECTIFS'!D63>0,'CALCUL EFFECTIFS'!D63,$A$6&\"\")","v":""},null,null,{"$f":"IF('CALCUL EFFECTIFS'!G63>0,'CALCUL EFFECTIFS'!G63,$A$6&\"\")","v":""},{"$f":"IF('CALCUL EFFECTIFS'!H63>0,'CALCUL EFFECTIFS'!H63,$A$6&\"\")","v":""},{"$f":"IF('CALCUL EFFECTIFS'!I63>0,'CALCUL EFFECTIFS'!I63,$A$6&\"\")","v":""},{"$f":"IF('CALCUL EFFECTIFS'!J63>0,'CALCUL EFFECTIFS'!J63,$A$6&\"\")","v":""},{"$f":"IF('CALCUL EFFECTIFS'!K63>0,'CALCUL EFFECTIFS'!K63,$A$6&\"\")","v":""},{"$f":"IF('CALCUL EFFECTIFS'!L63>0,'CALCUL EFFECTIFS'!L63,$A$6&\"\")","v":""},{"$f":"IF('CALCUL EFFECTIFS'!M63>0,'CALCUL EFFECTIFS'!M63,$A$6&\"\")","v":""},{"$f":"IF('CALCUL EFFECTIFS'!N63>0,'CALCUL EFFECTIFS'!N63,$A$6&\"\")","v":""},{"$f":"IF('CALCUL EFFECTIFS'!O63>0,'CALCUL EFFECTIFS'!O63,$A$6&\"\")","v":""},{"$f":"IF('CALCUL EFFECTIFS'!P63>0,'CALCUL EFFECTIFS'!P63,$A$6&\"\")","v":""},{"$f":"IF('CALCUL EFFECTIFS'!Q63>0,'CALCUL EFFECTIFS'!Q63,$A$6&\"\")","v":""},{"$f":"IF('CALCUL EFFECTIFS'!R63>0,'CALCUL EFFECTIFS'!R63,$A$6&\"\")","v":""},{"$f":"IF('CALCUL EFFECTIFS'!S63>0,'CALCUL EFFECTIFS'!S63,$A$6&\"\")","v":""},{"$f":"IF('CALCUL EFFECTIFS'!T63>0,'CALCUL EFFECTIFS'!T63,$A$6&\"\")","v":""},{"$f":"IF('CALCUL EFFECTIFS'!U63>0,'CALCUL EFFECTIFS'!U63,$A$6&\"\")","v":""},{"$f":"IF('CALCUL EFFECTIFS'!V63>0,'CALCUL EFFECTIFS'!V63,$A$6&\"\")","v":""},{"$f":"IF('CALCUL EFFECTIFS'!W63>0,'CALCUL EFFECTIFS'!W63,$A$6&\"\")","v":""},{"$f":"IF('CALCUL EFFECTIFS'!X63>0,'CALCUL EFFECTIFS'!X63,$A$6&\"\")","v":""},{"$f":"IF('CALCUL EFFECTIFS'!Y63>0,'CALCUL EFFECTIFS'!Y63,$A$6&\"\")","v":""},{"$f":"IF('CALCUL EFFECTIFS'!Z63>0,'CALCUL EFFECTIFS'!Z63,$A$6&\"\")","v":""},{"$f":"IF('CALCUL EFFECTIFS'!AA63>0,'CALCUL EFFECTIFS'!AA63,$A$6&\"\")","v":""},{"$f":"IF('CALCUL EFFECTIFS'!AB63>0,'CALCUL EFFECTIFS'!AB63,$A$6&\"\")","v":""},{"$f":"IF('CALCUL EFFECTIFS'!AC63>0,'CALCUL EFFECTIFS'!AC63,$A$6&\"\")","v":""},{"$f":"IF('CALCUL EFFECTIFS'!AD63>0,'CALCUL EFFECTIFS'!AD63,$A$6&\"\")","v":""},{"$f":"IF('CALCUL EFFECTIFS'!AE63>0,'CALCUL EFFECTIFS'!AE63,$A$6&\"\")","v":""},{"$f":"IF('CALCUL EFFECTIFS'!AF63>0,'CALCUL EFFECTIFS'!AF63,$A$6&\"\")","v":""},{"$f":"IF('CALCUL EFFECTIFS'!AG63>0,'CALCUL EFFECTIFS'!AG63,$A$6&\"\")","v":""},{"$f":"IF('CALCUL EFFECTIFS'!AH63>0,'CALCUL EFFECTIFS'!AH63,$A$6&\"\")","v":""},{"$f":"IF('CALCUL EFFECTIFS'!AI63>0,'CALCUL EFFECTIFS'!AI63,$A$6&\"\")","v":""},{"$f":"IF('CALCUL EFFECTIFS'!AJ63>0,'CALCUL EFFECTIFS'!AJ63,$A$6&\"\")","v":""},{"$f":"IF('CALCUL EFFECTIFS'!AK63>0,'CALCUL EFFECTIFS'!AK63,$A$6&\"\")","v":""},{"$f":"IF('CALCUL EFFECTIFS'!AL63>0,'CALCUL EFFECTIFS'!AL63,$A$6&\"\")","v":""},{"$f":"IF('CALCUL EFFECTIFS'!AM63>0,'CALCUL EFFECTIFS'!AM63,$A$6&\"\")","v":""},{"$f":"IF('CALCUL EFFECTIFS'!AN63>0,'CALCUL EFFECTIFS'!AN63,$A$6&\"\")","v":""},{"$f":"IF('CALCUL EFFECTIFS'!AO63>0,'CALCUL EFFECTIFS'!AO63,$A$6&\"\")","v":""},{"$f":"IF('CALCUL EFFECTIFS'!AP63>0,'CALCUL EFFECTIFS'!AP63,$A$6&\"\")","v":""},{"$f":"IF('CALCUL EFFECTIFS'!AQ63>0,'CALCUL EFFECTIFS'!AQ63,$A$6&\"\")","v":""},{"$f":"IF('CALCUL EFFECTIFS'!AR63>0,'CALCUL EFFECTIFS'!AR63,$A$6&\"\")","v":""},{"$f":"IF('CALCUL EFFECTIFS'!AS63>0,'CALCUL EFFECTIFS'!AS63,$A$6&\"\")","v":""}]
[{"$f":"IF(B48>0,'CALCUL EFFECTIFS'!B75&\"\",$A$6&\"\")","v":""},0,{"$f":"IF('CALCUL EFFECTIFS'!D75>0,'CALCUL EFFECTIFS'!D75,$A$6&\"\")","v":""},null,null,{"$f":"IF('CALCUL EFFECTIFS'!G75>0,'CALCUL EFFECTIFS'!G75,$A$6&\"\")","v":""},{"$f":"IF('CALCUL EFFECTIFS'!H75>0,'CALCUL EFFECTIFS'!H75,$A$6&\"\")","v":""},{"$f":"IF('CALCUL EFFECTIFS'!I75>0,'CALCUL EFFECTIFS'!I75,$A$6&\"\")","v":""},{"$f":"IF('CALCUL EFFECTIFS'!J75>0,'CALCUL EFFECTIFS'!J75,$A$6&\"\")","v":""},{"$f":"IF('CALCUL EFFECTIFS'!K75>0,'CALCUL EFFECTIFS'!K75,$A$6&\"\")","v":""},{"$f":"IF('CALCUL EFFECTIFS'!L75>0,'CALCUL EFFECTIFS'!L75,$A$6&\"\")","v":""},{"$f":"IF('CALCUL EFFECTIFS'!M75>0,'CALCUL EFFECTIFS'!M75,$A$6&\"\")","v":""},{"$f":"IF('CALCUL EFFECTIFS'!N75>0,'CALCUL EFFECTIFS'!N75,$A$6&\"\")","v":""},{"$f":"IF('CALCUL EFFECTIFS'!O75>0,'CALCUL EFFECTIFS'!O75,$A$6&\"\")","v":""},{"$f":"IF('CALCUL EFFECTIFS'!P75>0,'CALCUL EFFECTIFS'!P75,$A$6&\"\")","v":""},{"$f":"IF('CALCUL EFFECTIFS'!Q75>0,'CALCUL EFFECTIFS'!Q75,$A$6&\"\")","v":""},{"$f":"IF('CALCUL EFFECTIFS'!R75>0,'CALCUL EFFECTIFS'!R75,$A$6&\"\")","v":""},{"$f":"IF('CALCUL EFFECTIFS'!S75>0,'CALCUL EFFECTIFS'!S75,$A$6&\"\")","v":""},{"$f":"IF('CALCUL EFFECTIFS'!T75>0,'CALCUL EFFECTIFS'!T75,$A$6&\"\")","v":""},{"$f":"IF('CALCUL EFFECTIFS'!U75>0,'CALCUL EFFECTIFS'!U75,$A$6&\"\")","v":""},{"$f":"IF('CALCUL EFFECTIFS'!V75>0,'CALCUL EFFECTIFS'!V75,$A$6&\"\")","v":""},{"$f":"IF('CALCUL EFFECTIFS'!W75>0,'CALCUL EFFECTIFS'!W75,$A$6&\"\")","v":""},{"$f":"IF('CALCUL EFFECTIFS'!X75>0,'CALCUL EFFECTIFS'!X75,$A$6&\"\")","v":""},{"$f":"IF('CALCUL EFFECTIFS'!Y75>0,'CALCUL EFFECTIFS'!Y75,$A$6&\"\")","v":""},{"$f":"IF('CALCUL EFFECTIFS'!Z75>0,'CALCUL EFFECTIFS'!Z75,$A$6&\"\")","v":""},{"$f":"IF('CALCUL EFFECTIFS'!AA75>0,'CALCUL EFFECTIFS'!AA75,$A$6&\"\")","v":""},{"$f":"IF('CALCUL EFFECTIFS'!AB75>0,'CALCUL EFFECTIFS'!AB75,$A$6&\"\")","v":""},{"$f":"IF('CALCUL EFFECTIFS'!AC75>0,'CALCUL EFFECTIFS'!AC75,$A$6&\"\")","v":""},{"$f":"IF('CALCUL EFFECTIFS'!AD75>0,'CALCUL EFFECTIFS'!AD75,$A$6&\"\")","v":""},{"$f":"IF('CALCUL EFFECTIFS'!AE75>0,'CALCUL EFFECTIFS'!AE75,$A$6&\"\")","v":""},{"$f":"IF('CALCUL EFFECTIFS'!AF75>0,'CALCUL EFFECTIFS'!AF75,$A$6&\"\")","v":""},{"$f":"IF('CALCUL EFFECTIFS'!AG75>0,'CALCUL EFFECTIFS'!AG75,$A$6&\"\")","v":""},{"$f":"IF('CALCUL EFFECTIFS'!AH75>0,'CALCUL EFFECTIFS'!AH75,$A$6&\"\")","v":""},{"$f":"IF('CALCUL EFFECTIFS'!AI75>0,'CALCUL EFFECTIFS'!AI75,$A$6&\"\")","v":""},{"$f":"IF('CALCUL EFFECTIFS'!AJ75>0,'CALCUL EFFECTIFS'!AJ75,$A$6&\"\")","v":""},{"$f":"IF('CALCUL EFFECTIFS'!AK75>0,'CALCUL EFFECTIFS'!AK75,$A$6&\"\")","v":""},{"$f":"IF('CALCUL EFFECTIFS'!AL75>0,'CALCUL EFFECTIFS'!AL75,$A$6&\"\")","v":""},{"$f":"IF('CALCUL EFFECTIFS'!AM75>0,'CALCUL EFFECTIFS'!AM75,$A$6&\"\")","v":""},{"$f":"IF('CALCUL EFFECTIFS'!AN75>0,'CALCUL EFFECTIFS'!AN75,$A$6&\"\")","v":""},{"$f":"IF('CALCUL EFFECTIFS'!AO75>0,'CALCUL EFFECTIFS'!AO75,$A$6&\"\")","v":""},{"$f":"IF('CALCUL EFFECTIFS'!AP75>0,'CALCUL EFFECTIFS'!AP75,$A$6&\"\")","v":""},{"$f":"IF('CALCUL EFFECTIFS'!AQ75>0,'CALCUL EFFECTIFS'!AQ75,$A$6&\"\")","v":""},{"$f":"IF('CALCUL EFFECTIFS'!AR75>0,'CALCUL EFFECTIFS'!AR75,$A$6&\"\")","v":""},{"$f":"IF('CALCUL EFFECTIFS'!AS75>0,'CALCUL EFFECTIFS'!AS75,$A$6&\"\")","v":""}]
[{"$f":"IF(B49>0,'CALCUL EFFECTIFS'!B87&\"\",$A$6&\"\")","v":""},0,{"$f":"IF('CALCUL EFFECTIFS'!D87>0,'CALCUL EFFECTIFS'!D87,$A$6&\"\")","v":""},null,null,{"$f":"IF('CALCUL EFFECTIFS'!G87>0,'CALCUL EFFECTIFS'!G87,$A$6&\"\")","v":""},{"$f":"IF('CALCUL EFFECTIFS'!H87>0,'CALCUL EFFECTIFS'!H87,$A$6&\"\")","v":""},{"$f":"IF('CALCUL EFFECTIFS'!I87>0,'CALCUL EFFECTIFS'!I87,$A$6&\"\")","v":""},{"$f":"IF('CALCUL EFFECTIFS'!J87>0,'CALCUL EFFECTIFS'!J87,$A$6&\"\")","v":""},{"$f":"IF('CALCUL EFFECTIFS'!K87>0,'CALCUL EFFECTIFS'!K87,$A$6&\"\")","v":""},{"$f":"IF('CALCUL EFFECTIFS'!L87>0,'CALCUL EFFECTIFS'!L87,$A$6&\"\")","v":""},{"$f":"IF('CALCUL EFFECTIFS'!M87>0,'CALCUL EFFECTIFS'!M87,$A$6&\"\")","v":""},{"$f":"IF('CALCUL EFFECTIFS'!N87>0,'CALCUL EFFECTIFS'!N87,$A$6&\"\")","v":""},{"$f":"IF('CALCUL EFFECTIFS'!O87>0,'CALCUL EFFECTIFS'!O87,$A$6&\"\")","v":""},{"$f":"IF('CALCUL EFFECTIFS'!P87>0,'CALCUL EFFECTIFS'!P87,$A$6&\"\")","v":""},{"$f":"IF('CALCUL EFFECTIFS'!Q87>0,'CALCUL EFFECTIFS'!Q87,$A$6&\"\")","v":""},{"$f":"IF('CALCUL EFFECTIFS'!R87>0,'CALCUL EFFECTIFS'!R87,$A$6&\"\")","v":""},{"$f":"IF('CALCUL EFFECTIFS'!S87>0,'CALCUL EFFECTIFS'!S87,$A$6&\"\")","v":""},{"$f":"IF('CALCUL EFFECTIFS'!T87>0,'CALCUL EFFECTIFS'!T87,$A$6&\"\")","v":""},{"$f":"IF('CALCUL EFFECTIFS'!U87>0,'CALCUL EFFECTIFS'!U87,$A$6&\"\")","v":""},{"$f":"IF('CALCUL EFFECTIFS'!V87>0,'CALCUL EFFECTIFS'!V87,$A$6&\"\")","v":""},{"$f":"IF('CALCUL EFFECTIFS'!W87>0,'CALCUL EFFECTIFS'!W87,$A$6&\"\")","v":""},{"$f":"IF('CALCUL EFFECTIFS'!X87>0,'CALCUL EFFECTIFS'!X87,$A$6&\"\")","v":""},{"$f":"IF('CALCUL EFFECTIFS'!Y87>0,'CALCUL EFFECTIFS'!Y87,$A$6&\"\")","v":""},{"$f":"IF('CALCUL EFFECTIFS'!Z87>0,'CALCUL EFFECTIFS'!Z87,$A$6&\"\")","v":""},{"$f":"IF('CALCUL EFFECTIFS'!AA87>0,'CALCUL EFFECTIFS'!AA87,$A$6&\"\")","v":""},{"$f":"IF('CALCUL EFFECTIFS'!AB87>0,'CALCUL EFFECTIFS'!AB87,$A$6&\"\")","v":""},{"$f":"IF('CALCUL EFFECTIFS'!AC87>0,'CALCUL EFFECTIFS'!AC87,$A$6&\"\")","v":""},{"$f":"IF('CALCUL EFFECTIFS'!AD87>0,'CALCUL EFFECTIFS'!AD87,$A$6&\"\")","v":""},{"$f":"IF('CALCUL EFFECTIFS'!AE87>0,'CALCUL EFFECTIFS'!AE87,$A$6&\"\")","v":""},{"$f":"IF('CALCUL EFFECTIFS'!AF87>0,'CALCUL EFFECTIFS'!AF87,$A$6&\"\")","v":""},{"$f":"IF('CALCUL EFFECTIFS'!AG87>0,'CALCUL EFFECTIFS'!AG87,$A$6&\"\")","v":""},{"$f":"IF('CALCUL EFFECTIFS'!AH87>0,'CALCUL EFFECTIFS'!AH87,$A$6&\"\")","v":""},{"$f":"IF('CALCUL EFFECTIFS'!AI87>0,'CALCUL EFFECTIFS'!AI87,$A$6&\"\")","v":""},{"$f":"IF('CALCUL EFFECTIFS'!AJ87>0,'CALCUL EFFECTIFS'!AJ87,$A$6&\"\")","v":""},{"$f":"IF('CALCUL EFFECTIFS'!AK87>0,'CALCUL EFFECTIFS'!AK87,$A$6&\"\")","v":""},{"$f":"IF('CALCUL EFFECTIFS'!AL87>0,'CALCUL EFFECTIFS'!AL87,$A$6&\"\")","v":""},{"$f":"IF('CALCUL EFFECTIFS'!AM87>0,'CALCUL EFFECTIFS'!AM87,$A$6&\"\")","v":""},{"$f":"IF('CALCUL EFFECTIFS'!AN87>0,'CALCUL EFFECTIFS'!AN87,$A$6&\"\")","v":""},{"$f":"IF('CALCUL EFFECTIFS'!AO87>0,'CALCUL EFFECTIFS'!AO87,$A$6&\"\")","v":""},{"$f":"IF('CALCUL EFFECTIFS'!AP87>0,'CALCUL EFFECTIFS'!AP87,$A$6&\"\")","v":""},{"$f":"IF('CALCUL EFFECTIFS'!AQ87>0,'CALCUL EFFECTIFS'!AQ87,$A$6&\"\")","v":""},{"$f":"IF('CALCUL EFFECTIFS'!AR87>0,'CALCUL EFFECTIFS'!AR87,$A$6&\"\")","v":""},{"$f":"IF('CALCUL EFFECTIFS'!AS87>0,'CALCUL EFFECTIFS'!AS87,$A$6&\"\")","v":""}]
[{"$f":"IF(B50>0,'CALCUL EFFECTIFS'!B99&\"\",$A$6&\"\")","v":""},0,{"$f":"IF('CALCUL EFFECTIFS'!D99>0,'CALCUL EFFECTIFS'!D99,$A$6&\"\")","v":""},null,null,{"$f":"IF('CALCUL EFFECTIFS'!G99>0,'CALCUL EFFECTIFS'!G99,$A$6&\"\")","v":""},{"$f":"IF('CALCUL EFFECTIFS'!H99>0,'CALCUL EFFECTIFS'!H99,$A$6&\"\")","v":""},{"$f":"IF('CALCUL EFFECTIFS'!I99>0,'CALCUL EFFECTIFS'!I99,$A$6&\"\")","v":""},{"$f":"IF('CALCUL EFFECTIFS'!J99>0,'CALCUL EFFECTIFS'!J99,$A$6&\"\")","v":""},{"$f":"IF('CALCUL EFFECTIFS'!K99>0,'CALCUL EFFECTIFS'!K99,$A$6&\"\")","v":""},{"$f":"IF('CALCUL EFFECTIFS'!L99>0,'CALCUL EFFECTIFS'!L99,$A$6&\"\")","v":""},{"$f":"IF('CALCUL EFFECTIFS'!M99>0,'CALCUL EFFECTIFS'!M99,$A$6&\"\")","v":""},{"$f":"IF('CALCUL EFFECTIFS'!N99>0,'CALCUL EFFECTIFS'!N99,$A$6&\"\")","v":""},{"$f":"IF('CALCUL EFFECTIFS'!O99>0,'CALCUL EFFECTIFS'!O99,$A$6&\"\")","v":""},{"$f":"IF('CALCUL EFFECTIFS'!P99>0,'CALCUL EFFECTIFS'!P99,$A$6&\"\")","v":""},{"$f":"IF('CALCUL EFFECTIFS'!Q99>0,'CALCUL EFFECTIFS'!Q99,$A$6&\"\")","v":""},{"$f":"IF('CALCUL EFFECTIFS'!R99>0,'CALCUL EFFECTIFS'!R99,$A$6&\"\")","v":""},{"$f":"IF('CALCUL EFFECTIFS'!S99>0,'CALCUL EFFECTIFS'!S99,$A$6&\"\")","v":""},{"$f":"IF('CALCUL EFFECTIFS'!T99>0,'CALCUL EFFECTIFS'!T99,$A$6&\"\")","v":""},{"$f":"IF('CALCUL EFFECTIFS'!U99>0,'CALCUL EFFECTIFS'!U99,$A$6&\"\")","v":""},{"$f":"IF('CALCUL EFFECTIFS'!V99>0,'CALCUL EFFECTIFS'!V99,$A$6&\"\")","v":""},{"$f":"IF('CALCUL EFFECTIFS'!W99>0,'CALCUL EFFECTIFS'!W99,$A$6&\"\")","v":""},{"$f":"IF('CALCUL EFFECTIFS'!X99>0,'CALCUL EFFECTIFS'!X99,$A$6&\"\")","v":""},{"$f":"IF('CALCUL EFFECTIFS'!Y99>0,'CALCUL EFFECTIFS'!Y99,$A$6&\"\")","v":""},{"$f":"IF('CALCUL EFFECTIFS'!Z99>0,'CALCUL EFFECTIFS'!Z99,$A$6&\"\")","v":""},{"$f":"IF('CALCUL EFFECTIFS'!AA99>0,'CALCUL EFFECTIFS'!AA99,$A$6&\"\")","v":""},{"$f":"IF('CALCUL EFFECTIFS'!AB99>0,'CALCUL EFFECTIFS'!AB99,$A$6&\"\")","v":""},{"$f":"IF('CALCUL EFFECTIFS'!AC99>0,'CALCUL EFFECTIFS'!AC99,$A$6&\"\")","v":""},{"$f":"IF('CALCUL EFFECTIFS'!AD99>0,'CALCUL EFFECTIFS'!AD99,$A$6&\"\")","v":""},{"$f":"IF('CALCUL EFFECTIFS'!AE99>0,'CALCUL EFFECTIFS'!AE99,$A$6&\"\")","v":""},{"$f":"IF('CALCUL EFFECTIFS'!AF99>0,'CALCUL EFFECTIFS'!AF99,$A$6&\"\")","v":""},{"$f":"IF('CALCUL EFFECTIFS'!AG99>0,'CALCUL EFFECTIFS'!AG99,$A$6&\"\")","v":""},{"$f":"IF('CALCUL EFFECTIFS'!AH99>0,'CALCUL EFFECTIFS'!AH99,$A$6&\"\")","v":""},{"$f":"IF('CALCUL EFFECTIFS'!AI99>0,'CALCUL EFFECTIFS'!AI99,$A$6&\"\")","v":""},{"$f":"IF('CALCUL EFFECTIFS'!AJ99>0,'CALCUL EFFECTIFS'!AJ99,$A$6&\"\")","v":""},{"$f":"IF('CALCUL EFFECTIFS'!AK99>0,'CALCUL EFFECTIFS'!AK99,$A$6&\"\")","v":""},{"$f":"IF('CALCUL EFFECTIFS'!AL99>0,'CALCUL EFFECTIFS'!AL99,$A$6&\"\")","v":""},{"$f":"IF('CALCUL EFFECTIFS'!AM99>0,'CALCUL EFFECTIFS'!AM99,$A$6&\"\")","v":""},{"$f":"IF('CALCUL EFFECTIFS'!AN99>0,'CALCUL EFFECTIFS'!AN99,$A$6&\"\")","v":""},{"$f":"IF('CALCUL EFFECTIFS'!AO99>0,'CALCUL EFFECTIFS'!AO99,$A$6&\"\")","v":""},{"$f":"IF('CALCUL EFFECTIFS'!AP99>0,'CALCUL EFFECTIFS'!AP99,$A$6&\"\")","v":""},{"$f":"IF('CALCUL EFFECTIFS'!AQ99>0,'CALCUL EFFECTIFS'!AQ99,$A$6&\"\")","v":""},{"$f":"IF('CALCUL EFFECTIFS'!AR99>0,'CALCUL EFFECTIFS'!AR99,$A$6&\"\")","v":""},{"$f":"IF('CALCUL EFFECTIFS'!AS99>0,'CALCUL EFFECTIFS'!AS99,$A$6&\"\")","v":""}]
[]
[]
["GOÛTERS","LA MERISAIE"]
[null,null,null,null,null,null,null,null,null,null,null,null,null,"TOUTE LA PARTIE EN JAUNE FONCE NE FONCTIONNE PAS SUR LES BL"]
[]
[]
[]
[null,"TOTAL","ACHATS PRINCIPAUX",null,null,null,null,null,null,null,null,null,null,null,null,null,null,null,null,null,null,null,null,null,null,{"$f":"'QUANTITES TOTAL'!G11","v":"TOMATE VINAIGRETTE"},null,null,null,null,null,null,null,{"$f":"'QUANTITES TOTAL'!O11","v":23},null,null,{"$f":"'QUANTITES TOTAL'!G17","v":""},null,null,null,null,null,null,{"$f":"'QUANTITES TOTAL'!O17","v":0}]
[{"$f":"'QUANTITES TOTAL'!G6","v":"TERRINE DE CAMPAGNE"},{"$f":"'QUANTITES TOTAL'!O6","v":52},null,null,null,null,null,null,null,null,null,null,null,null,null,null,null,null,null,null,null,null,null,null,null,{"$f":"'QUANTITES TOTAL'!G12","v":"BŒUF BOURGUIGNON SANS LARDONS"},null,null,null,null,null,null,null,{"$f":"'QUANTITES TOTAL'!O12","v":23},null,null,{"$f":"'QUANTITES TOTAL'!G18","v":""},null,null,null,null,null,null,{"$f":"'QUANTITES TOTAL'!O18","v":0}]
[{"$f":"'QUANTITES TOTAL'!G7","v":"BŒUF BOURGUIGNON"},{"$f":"'QUANTITES TOTAL'!O7","v":52},null,null,null,null,null,null,null,null,null,null,null,null,null,null,null,null,null,null,null,null,null,null,null,{"$f":"'QUANTITES TOTAL'!G13","v":""},null,null,null,null,null,null,null,{"$f":"'QUANTITES TOTAL'!O13","v":0},null,null,{"$f":"'QUANTITES TOTAL'!G19","v":""},null,null,null,null,null,null,{"$f":"'QUANTITES TOTAL'!O19","v":0}]
[{"$f":"'QUANTITES TOTAL'!G8","v":"CAROTTES VICHY"},{"$f":"'QUANTITES TOTAL'!O8","v":75},null,null,null,null,null,null,null,null,null,null,null,null,null,null,null,null,null,null,null,null,null,null,null,{"$f":"'QUANTITES TOTAL'!G14","v":"YAOURT"},null,null,null,null,null,null,null,{"$f":"'QUANTITES TOTAL'!O14","v":17},null,null,{"$f":"'QUANTITES TOTAL'!G20","v":""},null,null,null,null,null,null,{"$f":"'QUANTITES TOTAL'!O20","v":0}]
[{"$f":"'QUANTITES TOTAL'!G9","v":"CAMEMBERT"},{"$f":"'QUANTITES TOTAL'!O9","v":80},null,null,null,null,null,null,null,null,null,null,null,null,null,null,null,null,null,null,null,null,null,null,null,{"$f":"'QUANTITES TOTAL'!G15","v":"POMME"},null,null,null,null,null,null,null,{"$f":"'QUANTITES TOTAL'!O15","v":17},null,null,{"$f":"IF('QUANTITES TOTAL'!G21='QUANTITES TOTAL'!G6,A1&\"\",'QUANTITES TOTAL'!G21)","v":""},null,null,null,null,null,null,{"$f":"IF('QUANTITES TOTAL'!G21='QUANTITES TOTAL'!G6,'QUANTITES TOTAL'!O21,'QUANTITES TOTAL'!M21)","v":0}]
[{"$f":"'QUANTITES TOTAL'!G10","v":"PÂTISSERIE"},{"$f":"'QUANTITES TOTAL'!O10","v":80},null,null,null,null,null,null,null,null,null,null,null,null,null,null,null,null,null,null,null,null,null,null,null,{"$f":"'QUANTITES TOTAL'!G16","v":""},null,null,null,null,null,null,null,{"$f":"'QUANTITES TOTAL'!O16","v":0},null,null,{"$f":"'QUANTITES TOTAL'!G22","v":""},null,null,null,null,null,null,{"$f":"'QUANTITES TOTAL'!O22","v":0}]
[null,null,null,null,null,null,null,null,null,null,null,null,null,null,null,null,null,null,null,null,null,null,null,null,null,null,null,null,null,null,null,null,null,null,null,null,{"$f":"'QUANTITES TOTAL'!G23","v":""},null,null,null,null,null,null,{"$f":"'QUANTITES TOTAL'!O23","v":0}]

{"sheet":"BL","index":4,"n_rows":26,"n_cols":129,"rows_kept":26,"cut":false,"hidden":false,"merged":[[0,58,0,59],[0,61,0,62],[0,43,0,44],[0,46,0,47],[0,49,0,50],[0,52,0,53],[0,55,0,56],[0,1,0,2],[0,4,0,5],[2,1,2,2],[2,4,2,5],[0,37,0,38],[0,7,0,8],[0,10,0,11],[0,13,0,14],[0,16,0,17],[0,19,0,20],[0,40,0,41],[0,22,0,23],[0,25,0,26],[0,28,0,29],[0,31,0,32],[0,34,0,35],[0,88,0,89],[0,91,0,92],[0,64,0,65],[0,67,0,68],[0,70,0,71],[0,73,0,74],[0,76,0,77],[0,79,0,80],[0,82,0,83],[0,85,0,86],[0,127,0,128],[2,127,2,128],[0,94,0,95],[0,97,0,98],[0,100,0,101],[0,103,0,104],[0,106,0,107],[0,118,0,119],[0,121,0,122],[0,124,0,125],[0,109,0,110],[0,112,0,113],[0,115,0,116]]}
[null,"BON DE LIVRAISON",null,null,"BON DE LIVRAISON",null,null,"BON DE LIVRAISON",null,null,"BON DE LIVRAISON",null,null,"BON DE LIVRAISON",null,null,"BON DE LIVRAISON",null,null,"BON DE LIVRAISON",null,null,"BON DE LIVRAISON",null,null,"BON DE LIVRAISON",null,null,"BON DE LIVRAISON",null,null,"BON DE LIVRAISON",null,null,"BON DE LIVRAISON",null,null,"BON DE LIVRAISON",null,null,"BON DE LIVRAISON",null,null,"BON DE LIVRAISON",null,null,"BON DE LIVRAISON",null,null,"BON DE LIVRAISON",null,null,"BON DE LIVRAISON",null,null,"BON DE LIVRAISON",null,null,"BON DE LIVRAISON",null,null,"BON DE LIVRAISON",null,null,"BON DE LIVRAISON",null,null,"BON DE LIVRAISON",null,null,"BON DE LIVRAISON",null,null,"BON DE LIVRAISON",null,null,"BON DE LIVRAISON",null,null,"BON DE LIVRAISON",null,null,"BON DE LIVRAISON",null,null,"BON DE LIVRAISON",null,null,"BON DE LIVRAISON",null,null,"BON DE LIVRAISON",null,null,"BON DE LIVRAISON",null,null,"BON DE LIVRAISON",null,null,"BON DE LIVRAISON",null,null,"BON DE LIVRAISON",null,null,"BON DE LIVRAISON",null,null,"BON DE LIVRAISON",null,null,"BON DE LIVRAISON",null,null,"BON DE LIVRAISON",null,null,"BON DE LIVRAISON",null,null,"BON DE LIVRAISON",null,null,"BON DE LIVRAISON",null,null,"BON DE LIVRAISON"]
[]
[null,"ESAT MONTRICHARD",null,null,"ADMR",null,null,"ENTREPRISES",null,null,"FO MONTRICHARD","UNITE 1",null,"FO MONTRICHARD","UNITE 2",null,"FO MONTRICHARD","UNITE 3",null,"FH MONTRICHARD","2 RA",null,"FH MONTRICHARD",425,null,"FH MONTRICHARD","4 RL",null,"FH MONTRICHARD",2114,null,"FH MONTRICHARD","8 RA",null,"FH MONTRICHARD",1005,null,"FH MONTRICHARD",1015,null,"FH MONTRICHARD","10 RA",null,"FH MONTRICHARD","EDUC",null,"LA MERISAIE PONTLEVOY","DALI",null,"LA MERISAIE PONTLEVOY","MIRO",null,"LA MERISAIE PONTLEVOY","PICASSO",null,"LA MERISAIE PONTLEVOY","VINCI",null,"LA MERISAIE PONTLEVOY","VAN GOGH",null,"LA MERISAIE PONTLEVOY","PERS",null,"LA MERISAIE PONTLEVOY","IND",null,"FO / FAM ROMORANTIN","UNITE 1",null,"FO / FAM ROMORANTIN","UNITE 2",null,"FO / FAM ROMORANTIN","UNITE 3",null,"FO / FAM ROMORANTIN","UNITE 4",null,"FO / FAM ROMORANTIN","UNITE 5",null,"ESAT ROMORANTIN","COLL.",null,"ESAT ROMORANTIN","IND.",null,"FH ROMORANTIN","COLL.",null,"FH ROMORANTIN","IND.",null,"IME ROMORANTIN","UNITE 1",null,"IME ROMORANTIN","UNITE 2",null,"IME ROMORANTIN","UNITE 3",null,"IME ROMORANTIN","UNITE 4",null,"ESAT SALBRIS","COLL.",null,"ESAT SALBRIS","IND.",null,"FH SALBRIS","COR",null,"FH SALBRIS","HIR",null,"FH SALBRIS","CHE",null,"FH SALBRIS","SAR",null,"FH SALBRIS","SAR",null,"HANDI-CHIENS"]
[null,null,"ID01",null,null,"ID02",null,null,"ID01",null,null,"ID02",null,null,"ID01",null,null,"ID02",null,null,"ID01",null,null,"ID02",null,null,"ID01",null,null,"ID02",null,null,"ID01",null,null,"ID02",null,null,"ID01",null,null,"ID02",null,null,"ID01",null,null,"ID02",null,null,"ID01",null,null,"ID02",null,null,"ID02",null,null,"ID02",null,null,"ID02",null,null,"ID01",null,null,"ID02",null,null,"ID01",null,null,"ID02",null,null,"ID02",null,null,"ID02",null,null,"ID01",null,null,"ID02",null,null,"ID01",null,null,"ID02",null,null,"ID01",null,null,"ID02",null,null,"ID01",null,null,"ID02",null,null,"ID01",null,null,"ID02",null,null,"ID01",null,null,"ID02",null,null,"ID01",null,null,"ID02",null,null,"ID02",null,null,"ID02"]
[null,{"$f":"'FEUILLE FAB'!$A$10","v":"SAMEDI MIDI"},{"$f":"'FEUILLE FAB'!$B$5","v":"00:00:00"},null,{"$f":"'FEUILLE FAB'!$A$10","v":"SAMEDI MIDI"},{"$f":"'FEUILLE FAB'!$B$5","v":"00:00:00"},null,{"$f":"'FEUILLE FAB'!$A$10","v":"SAMEDI MIDI"},{"$f":"'FEUILLE FAB'!$B$5","v":"00:00:00"},null,{"$f":"'FEUILLE FAB'!$A$10","v":"SAMEDI MIDI"},{"$f":"'FEUILLE FAB'!$B$5","v":"00:00:00"},null,{"$f":"'FEUILLE FAB'!$A$10","v":"SAMEDI MIDI"},{"$f":"'FEUILLE FAB'!$B$5","v":"00:00:00"},null,{"$f":"'FEUILLE FAB'!$A$10","v":"SAMEDI MIDI"},{"$f":"'FEUILLE FAB'!$B$5","v":"00:00:00"},null,{"$f":"'FEUILLE FAB'!$A$10","v":"SAMEDI MIDI"},{"$f":"'FEUILLE FAB'!$B$5","v":"00:00:00"},null,{"$f":"'FEUILLE FAB'!$A$10","v":"SAMEDI MIDI"},{"$f":"'FEUILLE FAB'!$B$5","v":"00:00:00"},null,{"$f":"'FEUILLE FAB'!$A$10","v":"SAMEDI MIDI"},{"$f":"'FEUILLE FAB'!$B$5","v":"00:00:00"},null,{"$f":"'FEUILLE FAB'!$A$10","v":"SAMEDI MIDI"},{"$f":"'FEUILLE FAB'!$B$5","v":"00:00:00"},null,{"$f":"'FEUILLE FAB'!$A$10","v":"SAMEDI MIDI"},{"$f":"'FEUILLE FAB'!$B$5","v":"00:00:00"},null,{"$f":"'FEUILLE FAB'!$A$10","v":"SAMEDI MIDI"},{"$f":"'FEUILLE FAB'!$B$5","v":"00:00:00"},null,{"$f":"'FEUILLE FAB'!$A$10","v":"SAMEDI MIDI"},{"$f":"'FEUILLE FAB'!$B$5","v":"00:00:00"},null,{"$f":"'FEUILLE FAB'!$A$10","v":"SAMEDI MIDI"},{"$f":"'FEUILLE FAB'!$B$5","v":"00:00:00"},null,{"$f":"'FEUILLE FAB'!$A$10","v":"SAMEDI MIDI"},{"$f":"'FEUILLE FAB'!$B$5","v":"00:00:00"},null,{"$f":"'FEUILLE FAB'!$A$10","v":"SAMEDI MIDI"},{"$f":"'FEUILLE FAB'!$B$5","v":"00:00:00"},null,{"$f":"'FEUILLE FAB'!$A$10","v":"SAMEDI MIDI"},{"$f":"'FEUILLE FAB'!$B$5","v":"00:00:00"},null,{"$f":"'FEUILLE FAB'!$A$10","v":"SAMEDI MIDI"},{"$f":"'FEUILLE FAB'!$B$5","v":"00:00:00"},null,{"$f":"'FEUILLE FAB'!$A$10","v":"SAMEDI MIDI"},{"$f":"'FEUILLE FAB'!$B$5","v":"00:00:00"},null,{"$f":"'FEUILLE FAB'!$A$10","v":"SAMEDI MIDI"},{"$f":"'FEUILLE FAB'!$B$5","v":"00:00:00"},null,{"$f":"'FEUILLE FAB'!$A$10","v":"SAMEDI MIDI"},{"$f":"'FEUILLE FAB'!$B$5","v":"00:00:00"},null,{"$f":"'FEUILLE FAB'!$A$10","v":"SAMEDI MIDI"},{"$f":"'FEUILLE FAB'!$B$5","v":"00:00:00"},null,{"$f":"'FEUILLE FAB'!$A$10","v":"SAMEDI MIDI"},{"$f":"'FEUILLE FAB'!$B$5","v":"00:00:00"},null,{"$f":"'FEUILLE FAB'!$A$10","v":"SAMEDI MIDI"},{"$f":"'FEUILLE FAB'!$B$5","v":"00:00:00"},null,{"$f":"'FEUILLE FAB'!$A$10","v":"SAMEDI MIDI"},{"$f":"'FEUILLE FAB'!$B$5","v":"00:00:00"},null,{"$f":"'FEUILLE FAB'!$A$10","v":"SAMEDI MIDI"},{"$f":"'FEUILLE FAB'!$B$5","v":"00:00:00"},null,{"$f":"'FEUILLE FAB'!$A$10","v":"SAMEDI MIDI"},{"$f":"'FEUILLE FAB'!$B$5","v":"00:00:00"},null,{"$f":"'FEUILLE FAB'!$A$10","v":"SAMEDI MIDI"},{"$f":"'FEUILLE FAB'!$B$5","v":"00:00:00"},null,{"$f":"'FEUILLE FAB'!$A$10","v":"SAMEDI MIDI"},{"$f":"'FEUILLE FAB'!$B$5","v":"00:00:00"},null,{"$f":"'FEUILLE FAB'!$A$10","v":"SAMEDI MIDI"},{"$f":"'FEUILLE FAB'!$B$5","v":"00:00:00"},null,{"$f":"'FEUILLE FAB'!$A$10","v":"SAMEDI MIDI"},{"$f":"'FEUILLE FAB'!$B$5","v":"00:00:00"},null,{"$f":"'FEUILLE FAB'!$A$10","v":"SAMEDI MIDI"},{"$f":"'FEUILLE FAB'!$B$5","v":"00:00:00"},null,{"$f":"'FEUILLE FAB'!$A$10","v":"SAMEDI MIDI"},{"$f":"'FEUILLE FAB'!$B$5","v":"00:00:00"},null,{"$f":"'FEUILLE FAB'!$A$10","v":"SAMEDI MIDI"},{"$f":"'FEUILLE FAB'!$B$5","v":"00:00:00"},null,{"$f":"'FEUILLE FAB'!$A$10","v":"SAMEDI MIDI"},{"$f":"'FEUILLE FAB'!$B$5","v":"00:00:00"},null,{"$f":"'FEUILLE FAB'!$A$10","v":"SAMEDI MIDI"},{"$f":"'FEUILLE FAB'!$B$5","v":"00:00:00"},null,{"$f":"'FEUILLE FAB'!$A$10","v":"SAMEDI MIDI"},{"$f":"'FEUILLE FAB'!$B$5","v":"00:00:00"},null,{"$f":"'FEUILLE FAB'!$A$10","v":"SAMEDI MIDI"},{"$f":"'FEUILLE FAB'!$B$5","v":"00:00:00"},null,{"$f":"'FEUILLE FAB'!$A$10","v":"SAMEDI MIDI"},{"$f":"'FEUILLE FAB'!$B$5","v":"00:00:00"},null,{"$f":"'FEUILLE FAB'!$A$10","v":"SAMEDI MIDI"},{"$f":"'FEUILLE FAB'!$B$5","v":"00:00:00"},null,{"$f":"'FEUILLE FAB'!$A$10","v":"SAMEDI MIDI"},{"$f":"'FEUILLE FAB'!$B$5","v":"00:00:00"},null,{"$f":"'FEUILLE FAB'!$A$10","v":"SAMEDI MIDI"},{"$f":"'FEUILLE FAB'!$B$5","v":"00:00:00"},null,{"$f":"'FEUILLE FAB'!$A$10","v":"SAMEDI MIDI"},{"$f":"'FEUILLE FAB'!$B$5","v":"00:00:00"}]
[]
[null,"NOMBRE DE REPAS",{"$f":"'CALCUL EFFECTIFS'!D16","v":0},null,"NOMBRE DE REPAS",{"$f":"'CALCUL EFFECTIFS'!E16","v":0},null,"NOMBRE DE REPAS",{"$f":"'CALCUL EFFECTIFS'!F16","v":0},null,"NOMBRE DE REPAS",{"$f":"'CALCUL EFFECTIFS'!G16","v":19},null,"NOMBRE DE REPAS",{"$f":"'CALCUL EFFECTIFS'!H16","v":26},null,"NOMBRE DE REPAS",{"$f":"'CALCUL EFFECTIFS'!I16","v":17},null,"NOMBRE DE REPAS",{"$f":"'CALCUL EFFECTIFS'!J16","v":8},null,"NOMBRE DE REPAS",{"$f":"'CALCUL EFFECTIFS'!K16","v":11},null,"NOMBRE DE REPAS",{"$f":"'CALCUL EFFECTIFS'!L16","v":2},null,"NOMBRE DE REPAS",{"$f":"'CALCUL EFFECTIFS'!M16","v":4},null,"NOMBRE DE REPAS",{"$f":"'CALCUL EFFECTIFS'!N16","v":3},null,"NOMBRE DE REPAS",{"$f":"'CALCUL EFFECTIFS'!O16","v":2},null,"NOMBRE DE REPAS",{"$f":"'CALCUL EFFECTIFS'!P16","v":1},null,"NOMBRE DE REPAS",{"$f":"'CALCUL EFFECTIFS'!Q16","v":4},null,"NOMBRE DE REPAS",{"$f":"'CALCUL EFFECTIFS'!R16","v":0},null,"NOMBRE DE REPAS",{"$f":"'CALCUL EFFECTIFS'!S16","v":0},null,"NOMBRE DE REPAS",{"$f":"'CALCUL EFFECTIFS'!T16","v":0},null,"NOMBRE DE REPAS",{"$f":"'CALCUL EFFECTIFS'!U16","v":0},null,"NOMBRE DE REPAS",{"$f":"'CALCUL EFFECTIFS'!V16","v":0},null,"NOMBRE DE REPAS",{"$f":"'CALCUL EFFECTIFS'!W16","v":0},null,"NOMBRE DE REPAS",{"$f":"'CALCUL EFFECTIFS'!X16","v":0},null,"NOMBRE DE REPAS",{"$f":"'CALCUL EFFECTIFS'!Y16","v":0},null,"NOMBRE DE REPAS",{"$f":"'CALCUL EFFECTIFS'!Z16","v":0},null,"NOMBRE DE REPAS",{"$f":"'CALCUL EFFECTIFS'!AA16","v":0},null,"NOMBRE DE REPAS",{"$f":"'CALCUL EFFECTIFS'!AB16","v":0},null,"NOMBRE DE REPAS",{"$f":"'CALCUL EFFECTIFS'!AC16","v":0},null,"NOMBRE DE REPAS",{"$f":"'CALCUL EFFECTIFS'!AD16","v":0},null,"NOMBRE DE REPAS",{"$f":"'CALCUL EFFECTIFS'!AE16","v":0},null,"NOMBRE DE REPAS",{"$f":"'CALCUL EFFECTIFS'!AF16","v":0},null,"NOMBRE DE REPAS",{"$f":"'CALCUL EFFECTIFS'!AG16","v":0},null,"NOMBRE DE REPAS",{"$f":"'CALCUL EFFECTIFS'!AH16","v":0},null,"NOMBRE DE REPAS",{"$f":"'CALCUL EFFECTIFS'!AI16","v":0},null,"NOMBRE DE REPAS",{"$f":"'CALCUL EFFECTIFS'!AJ16","v":0},null,"NOMBRE DE REPAS",{"$f":"'CALCUL EFFECTIFS'!AK16","v":0},null,"NOMBRE DE REPAS",{"$f":"'CALCUL EFFECTIFS'!AL16","v":0},null,"NOMBRE DE REPAS",{"$f":"'CALCUL EFFECTIFS'!AM16","v":0},null,"NOMBRE DE REPAS",{"$f":"'CALCUL EFFECTIFS'!AN16","v":0},null,"NOMBRE DE REPAS",{"$f":"'CALCUL EFFECTIFS'!AO16","v":0},null,"NOMBRE DE REPAS",{"$f":"'CALCUL EFFECTIFS'!AP16","v":0},null,"NOMBRE DE REPAS",{"$f":"'CALCUL EFFECTIFS'!AQ16","v":0},null,"NOMBRE DE REPAS",{"$f":"'CALCUL EFFECTIFS'!AR16","v":0},null,"NOMBRE DE REPAS",{"$f":"'CALCUL EFFECTIFS'!AS16","v":0},null,"NOMBRE DE REPAS",{"$f":"'CALCUL EFFECTIFS'!AT16","v":0}]
[]
[null,"PLATS","NOMBRE DE PERS",null,"PLATS","NOMBRE DE PERS",null,"PLATS","NOMBRE DE PERS",null,"PLATS","NOMBRE DE PERS",null,"PLATS","NOMBRE DE PERS",null,"PLATS","NOMBRE DE PERS",null,"PLATS","NOMBRE DE PERS",null,"PLATS","NOMBRE DE PERS",null,"PLATS","NOMBRE DE PERS",null,"PLATS","NOMBRE DE PERS",null,"PLATS","NOMBRE DE PERS",null,"PLATS","NOMBRE DE PERS",null,"PLATS","NOMBRE DE PERS",null,"PLATS","NOMBRE DE PERS",null,"PLATS","NOMBRE DE PERS",null,"PLATS","NOMBRE DE PERS",null,"PLATS","NOMBRE DE PERS",null,"PLATS","NOMBRE DE PERS",null,"PLATS","NOMBRE DE PERS",null,"PLATS","NOMBRE DE PERS",null,"PLATS","NOMBRE DE PERS",null,"PLATS","NOMBRE DE PERS",null,"PLATS","NOMBRE DE PERS",null,"PLATS","NOMBRE DE PERS",null,"PLATS","NOMBRE DE PERS",null,"PLATS","NOMBRE DE PERS",null,"PLATS","NOMBRE DE PERS",null,"PLATS","NOMBRE DE PERS",null,"PLATS","NOMBRE DE PERS",null,"PLATS","NOMBRE DE PERS",null,"PLATS","NOMBRE DE PERS",null,"PLATS","NOMBRE DE PERS",null,"PLATS","NOMBRE DE PERS",null,"PLATS","NOMBRE DE PERS",null,"PLATS","NOMBRE DE PERS",null,"PLATS","NOMBRE DE PERS",null,"PLATS","NOMBRE DE PERS",null,"PLATS","NOMBRE DE PERS",null,"PLATS","NOMBRE DE PERS",null,"PLATS","NOMBRE DE PERS",null,"PLATS","NOMBRE DE PERS",null,"PLATS","NOMBRE DE PERS",null,"PLATS","NOMBRE DE PERS"]
[null,null,null,null,null,null,null,null,null,null,"TERRINE DE CAMPAGNE","12",null,"TERRINE DE CAMPAGNE","11",null,"TERRINE DE CAMPAGNE","13",null,"TERRINE DE CAMPAGNE","6",null,"TERRINE DE CAMPAGNE","8",null,"TERRINE DE CAMPAGNE","2",null,"CAMEMBERT","4",null,"CAMEMBERT","3",null,"CAMEMBERT","2",null,"CAMEMBERT","1",null,"CAMEMBERT","4"]
[null,null,null,null,null,null,null,null,null,null,"BŒUF BOURGUIGNON","12",null,"BŒUF BOURGUIGNON","11",null,"BŒUF BOURGUIGNON","13",null,"BŒUF BOURGUIGNON","6",null,"BŒUF BOURGUIGNON","8",null,"BŒUF BOURGUIGNON","2",null,"PÂTISSERIE","4",null,"PÂTISSERIE","3",null,"PÂTISSERIE","2",null,"PÂTISSERIE","1",null,"PÂTISSERIE","4"]
[null,null,null,null,null,null,null,null,null,null,"CAROTTES VICHY","14",null,"CAROTTES VICHY","24",null,"CAROTTES VICHY","16",null,"CAROTTES VICHY","8",null,"CAROTTES VICHY","11",null,"CAROTTES VICHY","2",null,"TOMATE VINAIGRETTE","4",null,"TOMATE VINAIGRETTE","3",null,"TOMATE VINAIGRETTE","2",null,"TOMATE VINAIGRETTE","1",null,"TOMATE VINAIGRETTE","4"]
[null,null,null,null,null,null,null,null,null,null,"CAMEMBERT","17",null,"CAMEMBERT","19",null,"CAMEMBERT","14",null,"CAMEMBERT","6",null,"CAMEMBERT","8",null,"CAMEMBERT","2",null,"BŒUF SANS LARDONS","4",null,"BŒUF SANS LARDONS","3",null,"BŒUF SANS LARDONS","2",null,"BŒUF SANS LARDONS","1",null,"BŒUF SANS LARDONS","4"]
[null,null,null,null,null,null,null,null,null,null,"PÂTISSERIE","17",null,"PÂTISSERIE","21",null,"PÂTISSERIE","16",null,"PÂTISSERIE","6",null,"PÂTISSERIE","4",null,"PÂTISSERIE","2",null,"P.DE TERRE VAPEUR","4",null,"P.DE TERRE VAPEUR","3",null,"P.DE TERRE VAPEUR","2",null,"P.DE TERRE VAPEUR","1",null,"P.DE TERRE VAPEUR","4"]
[null,null,null,null,null,null,null,null,null,null,"LEGUMES VERTS REMY","1",null,"TOMATE VINAIGRETTE","2",null,"LEGUMES VERTS","1",null,"TOMATE VINAIGRETTE","2",null,"POMME","4"]
[null,null,null,null,null,null,null,null,null,null,"FECULENT","1",null,"BŒUF BOURGUIGNON SANS LARDONS","2",null,"FECULENT","1",null,"BŒUF BOURGUIGNON SANS LARDONS","2",null,"TOMATE VINAIGRETTE","3"]
[null,null,null,null,null,null,null,null,null,null,"TOMATE VINAIGRETTE","2",null,"YAOURT","2",null,"TOMATE VINAIGRETTE","2",null,"YAOURT","2",null,"BŒUF BOURGUIGNON SANS LARDONS","3"]
[null,null,null,null,null,null,null,null,null,null,"BŒUF BOURGUIGNON SANS LARDONS","2",null,"TOMATE VINAIGRETTE","5",null,"BŒUF BOURGUIGNON SANS LARDONS","2",null,"POMME","2",null,"YAOURT","3"]
[null,null,null,null,null,null,null,null,null,null,"YAOURT","2",null,"BŒUF BOURGUIGNON SANS LARDONS","5",null,"YAOURT","2",null,null,null,null,"POMME","3"]
[null,null,null,null,null,null,null,null,null,null,"POMME","2",null,"YAOURT","5",null,"TOMATE VINAIGRETTE","1"]
[null,null,null,null,null,null,null,null,null,null,"TOMATE VINAIGRETTE","5",null,"POMME","5",null,"BŒUF BOURGUIGNON SANS LARDONS","1"]
[null,null,null,null,null,null,null,null,null,null,"BŒUF SANS LARDONS","5",null,"TOMATE VINAIGRETTE","6",null,"YAOURT","1"]
[null,null,null,null,null,null,null,null,null,null,"P.DE TERRE VAPEUR","5",null,"BŒUF BOURGUIGNON SANS LARDONS","6",null,"POMME","1"]
[null,null,null,null,null,null,null,null,null,null,null,null,null,"TOMATE VINAIGRETTE","2",null,"TOMATE VINAIGRETTE","1"]
[null,null,null,null,null,null,null,null,null,null,null,null,null,"BŒUF SANS LARDONS","2",null,"BŒUF SANS LARDONS","1"]
[null,null,null,null,null,null,null,null,null,null,null,null,null,"P.DE TERRE VAPEUR","2",null,"P.DE TERRE VAPEUR","1"]

{"sheet":"GOÛTERS MERISAIE","index":5,"n_rows":20,"n_cols":5,"rows_kept":20,"cut":false,"hidden":false,"merged":[[10,0,10,2],[10,4,10,5],[11,0,11,2],[11,4,11,5],[0,0,0,5],[3,3,3,5],[8,0,8,2],[8,4,8,5],[9,0,9,2],[9,4,9,5]]}
["GOÛTERS MERISAIE"]
[]
[]
["DATE DE CONSOMMATION :",null,null,{"$f":"'FEUILLE FAB'!B5","v":"00:00:00"}]
[]
[]
[]
[]
["NOMS DES PRODUITS",null,null,"QUANTITE","DLC"]
[{"$f":"'FEUILLE FAB'!A54&\"\"","v":""},null,null,{"$f":"'FEUILLE FAB'!B54&\"\"","v":""}]
[{"$f":"'FEUILLE FAB'!A55&\"\"","v":""},null,null,{"$f":"'FEUILLE FAB'!B55&\"\"","v":""}]
[{"$f":"'FEUILLE FAB'!A56&\"\"","v":""},null,null,{"$f":"'FEUILLE FAB'!B56&\"\"","v":""}]
[]
[]
[]
[]
[]
[]
[]
[null,null,null,"!!!  NOTER LA DLC DES PRODUITS  !!!!!"]

{"sheet":"BARQUETTES","index":6,"n_rows":86,"n_cols":44,"rows_kept":86,"cut":false,"hidden":false,"merged":[[60,0,60,11],[62,0,62,2],[1,3,1,14],[1,15,1,21],[1,22,1,34],[1,35,1,41],[2,3,2,5],[2,6,2,14],[2,15,2,21],[2,22,2,26],[2,27,2,28],[2,29,2,30],[2,31,2,34],[2,35,2,36],[2,37,2,41]]}
[]
[null,null,null,"MONTRICHARD",null,null,null,null,null,null,null,null,null,null,null,"PONTLEVOY",null,null,null,null,null,null,"ROMORANTIN",null,null,null,null,null,null,null,null,null,null,null,null,"SALBRIS"]
[null,null,null,"F.OCC",null,null,"FOYER HEB.",null,null,null,null,null,null,null,null,"LA MERISAIE",null,null,null,null,null,null,"FO / FAM",null,null,null,null,"ESAT",null,"FH ",null,"IME",null,null,null,"ESAT",null,"FOYER HEB."]
["MENUS","ADMR","ETS","U1","U2","U3","2RA",425,"4RL",2114,"8RA",1005,1015,"10RA","Educ","DA","MI","MO","VI","…","PERS","IND","U1","U2","U3","U4","U5","COL","IND","COL","IND","U1","U2","U3","U4","COL","IND","CO","HI","CH","SA","FOY","H.C","……."]
[{"$f":"'FEUILLE FAB'!A12","v":"TERRINE DE CAMPAGNE"},{"$f":"'FEUILLE FAB'!D12","v":""},{"$f":"'FEUILLE FAB'!E12","v":""},{"$f":"IF('FEUILLE FAB'!F12=1,'FEUILLE FAB'!F12,0)","v":0},{"$f":"IF('FEUILLE FAB'!G12=1,'FEUILLE FAB'!G12,0)","v":0},{"$f":"IF('FEUILLE FAB'!H12=1,'FEUILLE FAB'!H12,0)","v":0},{"$f":"IF('FEUILLE FAB'!I12=1,'FEUILLE FAB'!I12,0)","v":0},{"$f":"IF('FEUILLE FAB'!J12=1,'FEUILLE FAB'!J12,0)","v":0},{"$f":"IF('FEUILLE FAB'!K12=1,'FEUILLE FAB'!K12,0)","v":0},{"$f":"IF('FEUILLE FAB'!L12=1,'FEUILLE FAB'!L12,0)","v":0},{"$f":"IF('FEUILLE FAB'!M12=1,'FEUILLE FAB'!M12,0)","v":0},{"$f":"IF('FEUILLE FAB'!N12=1,'FEUILLE FAB'!N12,0)","v":0},{"$f":"IF('FEUILLE FAB'!O12=1,'FEUILLE FAB'!O12,0)","v":0},{"$f":"IF('FEUILLE FAB'!P12=1,'FEUILLE FAB'!P12,0)","v":0},{"$f":"'FEUILLE FAB'!Q12","v":""},{"$f":"IF('FEUILLE FAB'!R12=1,'FEUILLE FAB'!R12,0)","v":0},{"$f":"IF('FEUILLE FAB'!S12=1,'FEUILLE FAB'!S12,0)","v":0},{"$f":"IF('FEUILLE FAB'!T12=1,'FEUILLE FAB'!T12,0)","v":0},{"$f":"IF('FEUILLE FAB'!U12=1,'FEUILLE FAB'!U12,0)","v":0},{"$f":"IF('FEUILLE FAB'!V12=1,'FEUILLE FAB'!V12,0)","v":0},{"$f":"IF('FEUILLE FAB'!W12=1,'FEUILLE FAB'!W12,0)","v":0},{"$f":"'FEUILLE FAB'!X12","v":""},{"$f":"IF('FEUILLE FAB'!Y12=1,'FEUILLE FAB'!Y12,0)","v":0},{"$f":"IF('FEUILLE FAB'!Z12=1,'FEUILLE FAB'!Z12,0)","v":0},{"$f":"IF('FEUILLE FAB'!AA12=1,'FEUILLE FAB'!AA12,0)","v":0},{"$f":"IF('FEUILLE FAB'!AB12=1,'FEUILLE FAB'!AB12,0)","v":0},{"$f":"IF('FEUILLE FAB'!AC12=1,'FEUILLE FAB'!AC12,0)","v":0},{"$f":"IF('FEUILLE FAB'!AD12=1,'FEUILLE FAB'!AD12,0)","v":0},{"$f":"'FEUILLE FAB'!AE12","v":""},{"$f":"IF('FEUILLE FAB'!AF12=1,'FEUILLE FAB'!AF12,0)","v":0},{"$f":"'FEUILLE FAB'!AG12","v":""},{"$f":"IF('FEUILLE FAB'!AH12=1,'FEUILLE FAB'!AH12,0)","v":0},{"$f":"IF('FEUILLE FAB'!AI12=1,'FEUILLE FAB'!AI12,0)","v":0},{"$f":"IF('FEUILLE FAB'!AJ12=1,'FEUILLE FAB'!AJ12,0)","v":0},{"$f":"IF('FEUILLE FAB'!AK12=1,'FEUILLE FAB'!AK12,0)","v":0},{"$f":"IF('FEUILLE FAB'!AL12=1,'FEUILLE FAB'!AL12,0)","v":0},{"$f":"'FEUILLE FAB'!AM12","v":""},{"$f":"IF('FEUILLE FAB'!AN12=1,'FEUILLE FAB'!AN12,0)","v":0},{"$f":"IF('FEUILLE FAB'!AO12=1,'FEUILLE FAB'!AO12,0)","v":0},{"$f":"IF('FEUILLE FAB'!AP12=1,'FEUILLE FAB'!AP12,0)","v":0},{"$f":"IF('FEUILLE FAB'!AQ12=1,'FEUILLE FAB'!AQ12,0)","v":0},{"$f":"'FEUILLE FAB'!AR12","v":""},{"$f":"IF('FEUILLE FAB'!AS12=1,'FEUILLE FAB'!AS12,0)","v":0},{"$f":"IF('FEUILLE FAB'!AT12=1,'FEUILLE FAB'!AT12,0)","v":0}]
[{"$f":"'FEUILLE FAB'!A13","v":"BŒUF BOURGUIGNON"},{"$f":"'FEUILLE FAB'!D13","v":""},{"$f":"'FEUILLE FAB'!E13","v":""},{"$f":"IF('FEUILLE FAB'!F13=1,'FEUILLE FAB'!F13,0)","v":0},{"$f":"IF('FEUILLE FAB'!G13=1,'FEUILLE FAB'!G13,0)","v":0},{"$f":"IF('FEUILLE FAB'!H13=1,'FEUILLE FAB'!H13,0)","v":0},{"$f":"IF('FEUILLE FAB'!I13=1,'FEUILLE FAB'!I13,0)","v":0},{"$f":"IF('FEUILLE FAB'!J13=1,'FEUILLE FAB'!J13,0)","v":0},{"$f":"IF('FEUILLE FAB'!K13=1,'FEUILLE FAB'!K13,0)","v":0},{"$f":"IF('FEUILLE FAB'!L13=1,'FEUILLE FAB'!L13,0)","v":0},{"$f":"IF('FEUILLE FAB'!M13=1,'FEUILLE FAB'!M13,0)","v":0},{"$f":"IF('FEUILLE FAB'!N13=1,'FEUILLE FAB'!N13,0)","v":0},{"$f":"IF('FEUILLE FAB'!O13=1,'FEUILLE FAB'!O13,0)","v":0},{"$f":"IF('FEUILLE FAB'!P13=1,'FEUILLE FAB'!P13,0)","v":0},{"$f":"'FEUILLE FAB'!Q13","v":""},{"$f":"IF('FEUILLE FAB'!R13=1,'FEUILLE FAB'!R13,0)","v":0},{"$f":"IF('FEUILLE FAB'!S13=1,'FEUILLE FAB'!S13,0)","v":0},{"$f":"IF('FEUILLE FAB'!T13=1,'FEUILLE FAB'!T13,0)","v":0},{"$f":"IF('FEUILLE FAB'!U13=1,'FEUILLE FAB'!U13,0)","v":0},{"$f":"IF('FEUILLE FAB'!V13=1,'FEUILLE FAB'!V13,0)","v":0},{"$f":"IF('FEUILLE FAB'!W13=1,'FEUILLE FAB'!W13,0)","v":0},{"$f":"'FEUILLE FAB'!X13","v":""},{"$f":"IF('FEUILLE FAB'!Y13=1,'FEUILLE FAB'!Y13,0)","v":0},{"$f":"IF('FEUILLE FAB'!Z13=1,'FEUILLE FAB'!Z13,0)","v":0},{"$f":"IF('FEUILLE FAB'!AA13=1,'FEUILLE FAB'!AA13,0)","v":0},{"$f":"IF('FEUILLE FAB'!AB13=1,'FEUILLE FAB'!AB13,0)","v":0},{"$f":"IF('FEUILLE FAB'!AC13=1,'FEUILLE FAB'!AC13,0)","v":0},{"$f":"IF('FEUILLE FAB'!AD13=1,'FEUILLE FAB'!AD13,0)","v":0},{"$f":"'FEUILLE FAB'!AE13","v":""},{"$f":"IF('FEUILLE FAB'!AF13=1,'FEUILLE FAB'!AF13,0)","v":0},{"$f":"'FEUILLE FAB'!AG13","v":""},{"$f":"IF('FEUILLE FAB'!AH13=1,'FEUILLE FAB'!AH13,0)","v":0},{"$f":"IF('FEUILLE FAB'!AI13=1,'FEUILLE FAB'!AI13,0)","v":0},{"$f":"IF('FEUILLE FAB'!AJ13=1,'FEUILLE FAB'!AJ13,0)","v":0},{"$f":"IF('FEUILLE FAB'!AK13=1,'FEUILLE FAB'!AK13,0)","v":0},{"$f":"IF('FEUILLE FAB'!AL13=1,'FEUILLE FAB'!AL13,0)","v":0},{"$f":"'FEUILLE FAB'!AM13","v":""},{"$f":"IF('FEUILLE FAB'!AN13=1,'FEUILLE FAB'!AN13,0)","v":0},{"$f":"IF('FEUILLE FAB'!AO13=1,'FEUILLE FAB'!AO13,0)","v":0},{"$f":"IF('FEUILLE FAB'!AP13=1,'FEUILLE FAB'!AP13,0)","v":0},{"$f":"IF('FEUILLE FAB'!AQ13=1,'FEUILLE FAB'!AQ13,0)","v":0},{"$f":"'FEUILLE FAB'!AR13","v":""},{"$f":"IF('FEUILLE FAB'!AS13=1,'FEUILLE FAB'!AS13,0)","v":0},{"$f":"IF('FEUILLE FAB'!AT13=1,'FEUILLE FAB'!AT13,0)","v":0}]
[{"$f":"'FEUILLE FAB'!A14","v":"CAROTTES VICHY"},{"$f":"'FEUILLE FAB'!D14","v":""},{"$f":"'FEUILLE FAB'!E14","v":""},{"$f":"IF('FEUILLE FAB'!F14=1,'FEUILLE FAB'!F14,0)","v":0},{"$f":"IF('FEUILLE FAB'!G14=1,'FEUILLE FAB'!G14,0)","v":0},{"$f":"IF('FEUILLE FAB'!H14=1,'FEUILLE FAB'!H14,0)","v":0},{"$f":"IF('FEUILLE FAB'!I14=1,'FEUILLE FAB'!I14,0)","v":0},{"$f":"IF('FEUILLE FAB'!J14=1,'FEUILLE FAB'!J14,0)","v":0},{"$f":"IF('FEUILLE FAB'!K14=1,'FEUILLE FAB'!K14,0)","v":0},{"$f":"IF('FEUILLE FAB'!L14=1,'FEUILLE FAB'!L14,0)","v":0},{"$f":"IF('FEUILLE FAB'!M14=1,'FEUILLE FAB'!M14,0)","v":0},{"$f":"IF('FEUILLE FAB'!N14=1,'FEUILLE FAB'!N14,0)","v":0},{"$f":"IF('FEUILLE FAB'!O14=1,'FEUILLE FAB'!O14,0)","v":0},{"$f":"IF('FEUILLE FAB'!P14=1,'FEUILLE FAB'!P14,0)","v":0},{"$f":"'FEUILLE FAB'!Q14","v":""},{"$f":"IF('FEUILLE FAB'!R14=1,'FEUILLE FAB'!R14,0)","v":0},{"$f":"IF('FEUILLE FAB'!S14=1,'FEUILLE FAB'!S14,0)","v":0},{"$f":"IF('FEUILLE FAB'!T14=1,'FEUILLE FAB'!T14,0)","v":0},{"$f":"IF('FEUILLE FAB'!U14=1,'FEUILLE FAB'!U14,0)","v":0},{"$f":"IF('FEUILLE FAB'!V14=1,'FEUILLE FAB'!V14,0)","v":0},{"$f":"IF('FEUILLE FAB'!W14=1,'FEUILLE FAB'!W14,0)","v":0},{"$f":"'FEUILLE FAB'!X14","v":""},{"$f":"IF('FEUILLE FAB'!Y14=1,'FEUILLE FAB'!Y14,0)","v":0},{"$f":"IF('FEUILLE FAB'!Z14=1,'FEUILLE FAB'!Z14,0)","v":0},{"$f":"IF('FEUILLE FAB'!AA14=1,'FEUILLE FAB'!AA14,0)","v":0},{"$f":"IF('FEUILLE FAB'!AB14=1,'FEUILLE FAB'!AB14,0)","v":0},{"$f":"IF('FEUILLE FAB'!AC14=1,'FEUILLE FAB'!AC14,0)","v":0},{"$f":"IF('FEUILLE FAB'!AD14=1,'FEUILLE FAB'!AD14,0)","v":0},{"$f":"'FEUILLE FAB'!AE14","v":""},{"$f":"IF('FEUILLE FAB'!AF14=1,'FEUILLE FAB'!AF14,0)","v":0},{"$f":"'FEUILLE FAB'!AG14","v":""},{"$f":"IF('FEUILLE FAB'!AH14=1,'FEUILLE FAB'!AH14,0)","v":0},{"$f":"IF('FEUILLE FAB'!AI14=1,'FEUILLE FAB'!AI14,0)","v":0},{"$f":"IF('FEUILLE FAB'!AJ14=1,'FEUILLE FAB'!AJ14,0)","v":0},{"$f":"IF('FEUILLE FAB'!AK14=1,'FEUILLE FAB'!AK14,0)","v":0},{"$f":"IF('FEUILLE FAB'!AL14=1,'FEUILLE FAB'!AL14,0)","v":0},{"$f":"'FEUILLE FAB'!AM14","v":""},{"$f":"IF('FEUILLE FAB'!AN14=1,'FEUILLE FAB'!AN14,0)","v":0},{"$f":"IF('FEUILLE FAB'!AO14=1,'FEUILLE FAB'!AO14,0)","v":0},{"$f":"IF('FEUILLE FAB'!AP14=1,'FEUILLE FAB'!AP14,0)","v":0},{"$f":"IF('FEUILLE FAB'!AQ14=1,'FEUILLE FAB'!AQ14,0)","v":0},{"$f":"'FEUILLE FAB'!AR14","v":""},{"$f":"IF('FEUILLE FAB'!AS14=1,'FEUILLE FAB'!AS14,0)","v":0},{"$f":"IF('FEUILLE FAB'!AT14=1,'FEUILLE FAB'!AT14,0)","v":0}]
[{"$f":"'FEUILLE FAB'!A15","v":"CAMEMBERT"},{"$f":"'FEUILLE FAB'!D15","v":""},{"$f":"'FEUILLE FAB'!E15","v":""},{"$f":"IF('FEUILLE FAB'!F15=1,'FEUILLE FAB'!F15,0)","v":0},{"$f":"IF('FEUILLE FAB'!G15=1,'FEUILLE FAB'!G15,0)","v":0},{"$f":"IF('FEUILLE FAB'!H15=1,'FEUILLE FAB'!H15,0)","v":0},{"$f":"IF('FEUILLE FAB'!I15=1,'FEUILLE FAB'!I15,0)","v":0},{"$f":"IF('FEUILLE FAB'!J15=1,'FEUILLE FAB'!J15,0)","v":0},{"$f":"IF('FEUILLE FAB'!K15=1,'FEUILLE FAB'!K15,0)","v":0},{"$f":"IF('FEUILLE FAB'!L15=1,'FEUILLE FAB'!L15,0)","v":0},{"$f":"IF('FEUILLE FAB'!M15=1,'FEUILLE FAB'!M15,0)","v":0},{"$f":"IF('FEUILLE FAB'!N15=1,'FEUILLE FAB'!N15,0)","v":0},{"$f":"IF('FEUILLE FAB'!O15=1,'FEUILLE FAB'!O15,0)","v":1},{"$f":"IF('FEUILLE FAB'!P15=1,'FEUILLE FAB'!P15,0)","v":0},{"$f":"'FEUILLE FAB'!Q15","v":""},{"$f":"IF('FEUILLE FAB'!R15=1,'FEUILLE FAB'!R15,0)","v":0},{"$f":"IF('FEUILLE FAB'!S15=1,'FEUILLE FAB'!S15,0)","v":0},{"$f":"IF('FEUILLE FAB'!T15=1,'FEUILLE FAB'!T15,0)","v":0},{"$f":"IF('FEUILLE FAB'!U15=1,'FEUILLE FAB'!U15,0)","v":0},{"$f":"IF('FEUILLE FAB'!V15=1,'FEUILLE FAB'!V15,0)","v":0},{"$f":"IF('FEUILLE FAB'!W15=1,'FEUILLE FAB'!W15,0)","v":0},{"$f":"'FEUILLE FAB'!X15","v":""},{"$f":"IF('FEUILLE FAB'!Y15=1,'FEUILLE FAB'!Y15,0)","v":0},{"$f":"IF('FEUILLE FAB'!Z15=1,'FEUILLE FAB'!Z15,0)","v":0},{"$f":"IF('FEUILLE FAB'!AA15=1,'FEUILLE FAB'!AA15,0)","v":0},{"$f":"IF('FEUILLE FAB'!AB15=1,'FEUILLE FAB'!AB15,0)","v":0},{"$f":"IF('FEUILLE FAB'!AC15=1,'FEUILLE FAB'!AC15,0)","v":0},{"$f":"IF('FEUILLE FAB'!AD15=1,'FEUILLE FAB'!AD15,0)","v":0},{"$f":"'FEUILLE FAB'!AE15","v":""},{"$f":"IF('FEUILLE FAB'!AF15=1,'FEUILLE FAB'!AF15,0)","v":0},{"$f":"'FEUILLE FAB'!AG15","v":""},{"$f":"IF('FEUILLE FAB'!AH15=1,'FEUILLE FAB'!AH15,0)","v":0},{"$f":"IF('FEUILLE FAB'!AI15=1,'FEUILLE FAB'!AI15,0)","v":0},{"$f":"IF('FEUILLE FAB'!AJ15=1,'FEUILLE FAB'!AJ15,0)","v":0},{"$f":"IF('FEUILLE FAB'!AK15=1,'FEUILLE FAB'!AK15,0)","v":0},{"$f":"IF('FEUILLE FAB'!AL15=1,'FEUILLE FAB'!AL15,0)","v":0},{"$f":"'FEUILLE FAB'!AM15","v":""},{"$f":"IF('FEUILLE FAB'!AN15=1,'FEUILLE FAB'!AN15,0)","v":0},{"$f":"IF('FEUILLE FAB'!AO15=1,'FEUILLE FAB'!AO15,0)","v":0},{"$f":"IF('FEUILLE FAB'!AP15=1,'FEUILLE FAB'!AP15,0)","v":0},{"$f":"IF('FEUILLE FAB'!AQ15=1,'FEUILLE FAB'!AQ15,0)","v":0},{"$f":"'FEUILLE FAB'!AR15","v":""},{"$f":"IF('FEUILLE FAB'!AS15=1,'FEUILLE FAB'!AS15,0)","v":0},{"$f":"IF('FEUILLE FAB'!AT15=1,'FEUILLE FAB'!AT15,0)","v":0}]
[{"$f":"'FEUILLE FAB'!A16","v":"PÂTISSERIE"},{"$f":"'FEUILLE FAB'!D16","v":""},{"$f":"'FEUILLE FAB'!E16","v":""},{"$f":"IF('FEUILLE FAB'!F16=1,'FEUILLE FAB'!F16,0)","v":0},{"$f":"IF('FEUILLE FAB'!G16=1,'FEUILLE FAB'!G16,0)","v":0},{"$f":"IF('FEUILLE FAB'!H16=1,'FEUILLE FAB'!H16,0)","v":0},{"$f":"IF('FEUILLE FAB'!I16=1,'FEUILLE FAB'!I16,0)","v":0},{"$f":"IF('FEUILLE FAB'!J16=1,'FEUILLE FAB'!J16,0)","v":0},{"$f":"IF('FEUILLE FAB'!K16=1,'FEUILLE FAB'!K16,0)","v":0},{"$f":"IF('FEUILLE FAB'!L16=1,'FEUILLE FAB'!L16,0)","v":0},{"$f":"IF('FEUILLE FAB'!M16=1,'FEUILLE FAB'!M16,0)","v":0},{"$f":"IF('FEUILLE FAB'!N16=1,'FEUILLE FAB'!N16,0)","v":0},{"$f":"IF('FEUILLE FAB'!O16=1,'FEUILLE FAB'!O16,0)","v":1},{"$f":"IF('FEUILLE FAB'!P16=1,'FEUILLE FAB'!P16,0)","v":0},{"$f":"'FEUILLE FAB'!Q16","v":""},{"$f":"IF('FEUILLE FAB'!R16=1,'FEUILLE FAB'!R16,0)","v":0},{"$f":"IF('FEUILLE FAB'!S16=1,'FEUILLE FAB'!S16,0)","v":0},{"$f":"IF('FEUILLE FAB'!T16=1,'FEUILLE FAB'!T16,0)","v":0},{"$f":"IF('FEUILLE FAB'!U16=1,'FEUILLE FAB'!U16,0)","v":0},{"$f":"IF('FEUILLE FAB'!V16=1,'FEUILLE FAB'!V16,0)","v":0},{"$f":"IF('FEUILLE FAB'!W16=1,'FEUILLE FAB'!W16,0)","v":0},{"$f":"'FEUILLE FAB'!X16","v":""},{"$f":"IF('FEUILLE FAB'!Y16=1,'FEUILLE FAB'!Y16,0)","v":0},{"$f":"IF('FEUILLE FAB'!Z16=1,'FEUILLE FAB'!Z16,0)","v":0},{"$f":"IF('FEUILLE FAB'!AA16=1,'FEUILLE FAB'!AA16,0)","v":0},{"$f":"IF('FEUILLE FAB'!AB16=1,'FEUILLE FAB'!AB16,0)","v":0},{"$f":"IF('FEUILLE FAB'!AC16=1,'FEUILLE FAB'!AC16,0)","v":0},{"$f":"IF('FEUILLE FAB'!AD16=1,'FEUILLE FAB'!AD16,0)","v":0},{"$f":"'FEUILLE FAB'!AE16","v":""},{"$f":"IF('FEUILLE FAB'!AF16=1,'FEUILLE FAB'!AF16,0)","v":0},{"$f":"'FEUILLE FAB'!AG16","v":""},{"$f":"IF('FEUILLE FAB'!AH16=1,'FEUILLE FAB'!AH16,0)","v":0},{"$f":"IF('FEUILLE FAB'!AI16=1,'FEUILLE FAB'!AI16,0)","v":0},{"$f":"IF('FEUILLE FAB'!AJ16=1,'FEUILLE FAB'!AJ16,0)","v":0},{"$f":"IF('FEUILLE FAB'!AK16=1,'FEUILLE FAB'!AK16,0)","v":0},{"$f":"IF('FEUILLE FAB'!AL16=1,'FEUILLE FAB'!AL16,0)","v":0},{"$f":"'FEUILLE FAB'!AM16","v":""},{"$f":"IF('FEUILLE FAB'!AN16=1,'FEUILLE FAB'!AN16,0)","v":0},{"$f":"IF('FEUILLE FAB'!AO16=1,'FEUILLE FAB'!AO16,0)","v":0},{"$f":"IF('FEUILLE FAB'!AP16=1,'FEUILLE FAB'!AP16,0)","v":0},{"$f":"IF('FEUILLE FAB'!AQ16=1,'FEUILLE FAB'!AQ16,0)","v":0},{"$f":"'FEUILLE FAB'!AR16","v":""},{"$f":"IF('FEUILLE FAB'!AS16=1,'FEUILLE FAB'!AS16,0)","v":0},{"$f":"IF('FEUILLE FAB'!AT16=1,'FEUILLE FAB'!AT16,0)","v":0}]
[]
[]
[]
["BLANCHE","TOTAL"]
[{"$f":"A5","v":"TERRINE DE CAMPAGNE"},{"$f":"SUM(B5:AR5)-SUM(C5,AK5)","v":0}]
[{"$f":"A6","v":"BŒUF BOURGUIGNON"},{"$f":"SUM(B6:AR6)-SUM(C6,AK6)","v":0}]
["CAROTTES VICHY",0]
["CAMEMBERT",1]
["PÂTISSERIE",1]
[]
["NOIRE","TOTAL"]
[{"$f":"A5","v":"TERRINE DE CAMPAGNE"},{"$f":"SUM(C5,AK5)","v":0}]
[{"$f":"A6","v":"BŒUF BOURGUIGNON"},{"$f":"SUM(C6,AK6)","v":0}]
["CAROTTES VICHY",0]
["CAMEMBERT",0]
["PÂTISSERIE",0]
[]
["ROUGE","TOTAL"]
[{"$f":"MENUS!B19","v":"TOMATE VINAIGRETTE"},{"$f":"'FEUILLE FAB'!B25","v":4}]
[{"$f":"MENUS!B20","v":"BŒUF BOURGUIGNON SANS LARDONS"},{"$f":"'FEUILLE FAB'!B26","v":4}]
[{"$f":"MENUS!B21","v":"CAROTTES VICHY"},{"$f":"'FEUILLE FAB'!B27","v":0}]
[{"$f":"MENUS!B22","v":"YAOURT"},{"$f":"'FEUILLE FAB'!B28","v":4}]
[{"$f":"MENUS!B23","v":"PÂTISSERIE"},{"$f":"'FEUILLE FAB'!B29","v":0}]
[]
["VERT","TOTAL"]
[{"$f":"MENUS!B26","v":"TERRINE DE CAMPAGNE"},{"$f":"'FEUILLE FAB'!B30","v":0}]
[{"$f":"MENUS!B27","v":"BŒUF BOURGUIGNON"},{"$f":"'FEUILLE FAB'!B31","v":0}]
[{"$f":"MENUS!B28","v":"CAROTTES VICHY"},{"$f":"'FEUILLE FAB'!B32","v":0}]
[{"$f":"MENUS!B29","v":"CAMEMBERT"},{"$f":"'FEUILLE FAB'!B33","v":0}]
[{"$f":"MENUS!B30","v":"POMME"},{"$f":"'FEUILLE FAB'!B34","v":4}]
[]
["BLEU","TOTAL"]
[{"$f":"MENUS!B12","v":"TOMATE VINAIGRETTE"},{"$f":"'FEUILLE FAB'!B35","v":13}]
[{"$f":"MENUS!B13","v":"BŒUF BOURGUIGNON SANS LARDONS"},{"$f":"'FEUILLE FAB'!B36","v":13}]
[{"$f":"MENUS!B14","v":"CAROTTES VICHY"},{"$f":"'FEUILLE FAB'!B37","v":0}]
[{"$f":"MENUS!B15","v":"YAOURT"},{"$f":"'FEUILLE FAB'!B38","v":13}]
[{"$f":"MENUS!B16","v":"POMME"},{"$f":"'FEUILLE FAB'!B39","v":13}]
[]
["ROSE","TOTAL"]
[{"$f":"MENUS!B33","v":"TOMATE VINAIGRETTE"},{"$f":"'FEUILLE FAB'!B40","v":6}]
[{"$f":"MENUS!B34","v":"BŒUF BOURGUIGNON SANS LARDONS"},{"$f":"'FEUILLE FAB'!B41","v":6}]
[{"$f":"MENUS!B35","v":"CAROTTES VICHY"},{"$f":"'FEUILLE FAB'!B42","v":0}]
[]
["GRISE","TOTAL"]
[{"$f":"MENUS!B47","v":"TERRINE DE CAMPAGNE"},{"$f":"'FEUILLE FAB'!B46","v":0}]
[{"$f":"MENUS!B48","v":"BŒUF BOURGUIGNON"},{"$f":"'FEUILLE FAB'!B47","v":0}]
[{"$f":"MENUS!B49","v":"CAROTTES VICHY"},{"$f":"'FEUILLE FAB'!B48","v":0}]
[{"$f":"MENUS!B50","v":"CAMEMBERT"},{"$f":"'FEUILLE FAB'!B49","v":0}]
[{"$f":"MENUS!B51","v":"PÂTISSERIE"},{"$f":"'FEUILLE FAB'!B50","v":0}]
[]
[]
["PRODUCTION BARQUETTES"]
[]
[{"$f":"'FEUILLE FAB'!A10","v":"SAMEDI MIDI"}]
[]
[]
[null,"BLANCHE","NOIRE","ROUGE","VERTE","BLEU","ROSE","GRISE"]
[{"$f":"A14","v":"TERRINE DE CAMPAGNE"},{"$f":"B14","v":0},{"$f":"B21","v":0},{"$f":"IF(A28=A14,B28,$A$1&\"\")","v":""},{"$f":"IF(A35=A14,B35,A1&\"\")","v":0},{"$f":"IF(A42=A14,B42,A1&\"\")","v":""},{"$f":"IF(A49=A14,B49,A1&\"\")","v":""},{"$f":"IF(A54=A14,B54,A1&\"\")","v":0}]
[{"$f":"IF(A28<>A14,A28,A1&\"\")","v":"TOMATE VINAIGRETTE"},null,null,{"$f":"IF(A28<>A14,B28,A1&\"\")","v":4},{"$f":"IF(A35<>A14,B35,A1&\"\")","v":""},{"$f":"IF(A42<>A14,B42,A1&\"\")","v":13},{"$f":"IF(A49<>A14,B49,A1&\"\")","v":6},{"$f":"IF(OR(A54=A14,A54<>A28),A1&\"\",B54)","v":""}]
[{"$f":"IF(OR(A54=A14,A54=A28),$A$1&\"\",A54)","v":""},null,null,null,null,null,null,{"$f":"IF(OR(A54=A14,A54=A28),A1&\"\",B54)","v":""}]
[{"$f":"A15","v":"BŒUF BOURGUIGNON"},{"$f":"B15","v":0},{"$f":"B22","v":0},{"$f":"IF(A29=A15,B29,A1&\"\")","v":""},{"$f":"IF(A36=A15,B36,A1&\"\")","v":0},{"$f":"IF(A43=A15,B43,A1&\"\")","v":""},{"$f":"IF(A50=A15,B50,A1&\"\")","v":""},{"$f":"IF(A55=A15,B55,A1&\"\")","v":0}]
[{"$f":"IF(A29<>A15,A29,A1&\"\")","v":"BŒUF BOURGUIGNON SANS LARDONS"},null,null,{"$f":"IF(A29<>A15,B29,A1&\"\")","v":4},{"$f":"IF(A36<>A15,B36,A1&\"\")","v":""},{"$f":"IF(A43<>A15,B43,A1&\"\")","v":13},{"$f":"IF(OR(A50=A15,A50<>A29),A1&\"\",B50)","v":6},{"$f":"IF(OR(A55=A15,A55<>A29),A1&\"\",B55)","v":""}]
[{"$f":"IF(OR(A50=A15,A50=A29),A1&\"\",A50)","v":""},null,null,null,null,null,{"$f":"IF(OR(A50=A15,A50=A29),A1&\"\",B50)","v":""}]
[{"$f":"IF(OR(A55=A15,A55=A29),$A$1&\"\",A55)","v":""},null,null,null,null,null,null,{"$f":"IF(OR(A55=A15,A55=A29),A1&\"\",B55)","v":""}]
["VIANDE OU POISSON SANS SAUCE",null,null,null,null,null,null,{"$f":"'FEUILLE FAB'!B21","v":0}]
[{"$f":"A16","v":"CAROTTES VICHY"},{"$f":"B16","v":0},{"$f":"B23","v":0},{"$f":"IF(A30=A16,B30,A1&\"\")","v":0},{"$f":"IF(A37=A16,B37,A1&\"\")","v":0},{"$f":"IF(A44=A16,B44,A1&\"\")","v":0},{"$f":"IF(A51=A16,B51,A1&\"\")","v":0},{"$f":"IF(A56=A16,B56,A1&\"\")","v":0}]
[{"$f":"IF(A30<>A16,A30,A1&\"\")","v":""},null,null,{"$f":"IF(A30<>A16,B30,A1&\"\")","v":""},{"$f":"IF(A37<>A16,B37,A1&\"\")","v":""},{"$f":"IF(A44<>A16,B44,A1&\"\")","v":""},{"$f":"IF(OR(A51=A16,A51<>A30),A1&\"\",B51)","v":""},{"$f":"IF(OR(A56=A16,A56<>A30),A1&\"\",B56)","v":""}]
[{"$f":"IF(OR(A51=A16,A51=A30),A1&\"\",A51)","v":""},null,null,null,null,null,{"$f":"IF(OR(A51=A16,A51=A30),A1&\"\",B51)","v":""}]
[{"$f":"IF(OR(A56=A16,A56=A30),$A$1&\"\",A56)","v":""},null,null,null,null,null,null,{"$f":"IF(OR(A56=A16,A56=A30),A1&\"\",B56)","v":""}]
["LEGUME VERT REMY",null,null,null,null,null,null,{"$f":"'FEUILLE FAB'!B18","v":1}]
["LEGUME VERT",null,null,null,null,null,null,{"$f":"'FEUILLE FAB'!B19","v":1}]
["FECULENT",null,null,null,null,null,null,{"$f":"'FEUILLE FAB'!B20","v":2}]
[{"$f":"A17","v":"CAMEMBERT"},{"$f":"B17","v":1},{"$f":"B24","v":0},{"$f":"IF(A31=A17,B31,A1&\"\")","v":""},{"$f":"IF(A38=A17,B38,A1&\"\")","v":0},{"$f":"IF(A45=A17,B45,A1&\"\")","v":""},null,{"$f":"IF(A57=A17,B57,A1&\"\")","v":0}]
[{"$f":"IF(A31<>A17,A31,A1&\"\")","v":"YAOURT"},null,null,{"$f":"IF(A31<>A17,B31,A1&\"\")","v":4},{"$f":"IF(A38<>A17,B38,A1&\"\")","v":""},{"$f":"IF(A45<>A17,B45,A1&\"\")","v":13},null,{"$f":"IF(OR(A57=A17,A57<>A31),A1&\"\",B57)","v":""}]
[]
[{"$f":"A18","v":"PÂTISSERIE"},{"$f":"B18","v":1},{"$f":"B25","v":0},{"$f":"IF(A32=A18,B32,A1&\"\")","v":0},{"$f":"IF(A39=A18,B39,A1&\"\")","v":""},{"$f":"IF(A46=A18,B46,A1&\"\")","v":""},null,{"$f":"IF(A58=A18,B58,A1&\"\")","v":0}]
[{"$f":"IF(A39<>A18,A39,A1&\"\")","v":"POMME"},null,null,{"$f":"IF(A32<>A18,B32,A1&\"\")","v":""},{"$f":"IF(A39<>A18,B39,A1&\"\")","v":4},{"$f":"IF(A46<>A18,B46,A1&\"\")","v":13},null,{"$f":"IF(OR(A58=A18,A58<>A39),A1&\"\",B58)","v":""}]

{"sheet":"IMPRESSION BL","index":7,"n_rows":47,"n_cols":46,"rows_kept":47,"cut":false,"hidden":false,"merged":[[4,33,4,35],[6,1,6,12],[6,14,6,25],[6,26,6,37],[8,5,8,16],[1,0,2,0],[9,0,10,0],[4,1,4,12],[4,14,4,25],[4,26,4,32],[14,5,14,7],[8,17,8,23],[8,24,8,36],[8,37,8,43],[9,5,9,7],[9,8,9,16],[9,17,9,23],[9,24,9,28],[9,29,9,30],[9,31,9,32],[9,33,9,36],[9,37,9,38],[9,39,9,43],[11,5,11,7],[12,5,12,7],[13,5,13,7],[26,5,26,7],[15,5,15,7],[16,5,16,7],[17,5,17,7],[18,5,18,7],[19,5,19,7],[20,5,20,7],[21,5,21,7],[22,5,22,7],[23,5,23,7],[24,5,24,7],[25,5,25,7],[27,5,27,7],[28,5,28,7],[29,5,29,7],[30,5,30,7],[31,5,31,7],[32,5,32,7],[33,5,33,7],[34,5,34,7],[35,5,35,7],[36,5,36,7],[46,5,46,7],[37,5,37,7],[42,5,42,7],[43,5,43,7],[44,5,44,7],[45,5,45,7],[39,5,39,7],[40,5,40,7],[41,5,41,7],[38,5,38,7]]}
[]
[]
[]
[]
[{"$f":"'FEUILLE FAB'!A5","v":"REPAS DU :"},{"$f":"'FEUILLE FAB'!B5","v":"00:00:00"},{"$f":"'FEUILLE FAB'!C5","v":"00:00:00"},{"$f":"'FEUILLE FAB'!D5","v":"00:00:00"},{"$f":"'FEUILLE FAB'!E5","v":"00:00:00"},{"$f":"'FEUILLE FAB'!F5","v":"00:00:00"},{"$f":"'FEUILLE FAB'!G5","v":"00:00:00"},{"$f":"'FEUILLE FAB'!H5","v":"00:00:00"},{"$f":"'FEUILLE FAB'!I5","v":"00:00:00"},{"$f":"'FEUILLE FAB'!J5","v":"00:00:00"},{"$f":"'FEUILLE FAB'!K5","v":"00:00:00"},{"$f":"'FEUILLE FAB'!L5","v":"00:00:00"},{"$f":"'FEUILLE FAB'!M5","v":"00:00:00"},null,{"$f":"'FEUILLE FAB'!O5","v":"POTAGE OU ENTREE"},{"$f":"'FEUILLE FAB'!P5","v":0},{"$f":"'FEUILLE FAB'!Q5","v":0},{"$f":"'FEUILLE FAB'!R5","v":0},{"$f":"'FEUILLE FAB'!S5","v":0},{"$f":"'FEUILLE FAB'!T5","v":0},{"$f":"'FEUILLE FAB'!U5","v":0},{"$f":"'FEUILLE FAB'!V5","v":0},{"$f":"'FEUILLE FAB'!W5","v":0},{"$f":"'FEUILLE FAB'!X5","v":0},{"$f":"'FEUILLE FAB'!Y5","v":0},{"$f":"'FEUILLE FAB'!Z5","v":0},{"$f":"'FEUILLE FAB'!AA5","v":"SAMEDI MIDI"},{"$f":"'FEUILLE FAB'!AB5","v":0},{"$f":"'FEUILLE FAB'!AC5","v":0},{"$f":"'FEUILLE FAB'!AD5","v":0},{"$f":"'FEUILLE FAB'!AE5","v":0},{"$f":"'FEUILLE FAB'!AF5","v":0},{"$f":"'FEUILLE FAB'!AG5","v":0},{"$f":"'FEUILLE FAB'!AH5","v":3},{"$f":"'FEUILLE FAB'!AI5","v":0},{"$f":"'FEUILLE FAB'!AJ5","v":0}]
[]
[{"$f":"'FEUILLE FAB'!A7","v":"FABRIQUE LE :"},{"$f":"'FEUILLE FAB'!B7","v":"00:00:00"},{"$f":"'FEUILLE FAB'!C7","v":"00:00:00"},{"$f":"'FEUILLE FAB'!D7","v":"00:00:00"},{"$f":"'FEUILLE FAB'!E7","v":"00:00:00"},{"$f":"'FEUILLE FAB'!F7","v":"00:00:00"},{"$f":"'FEUILLE FAB'!G7","v":"00:00:00"},{"$f":"'FEUILLE FAB'!H7","v":"00:00:00"},{"$f":"'FEUILLE FAB'!I7","v":"00:00:00"},{"$f":"'FEUILLE FAB'!J7","v":"00:00:00"},{"$f":"'FEUILLE FAB'!K7","v":"00:00:00"},{"$f":"'FEUILLE FAB'!L7","v":"00:00:00"},{"$f":"'FEUILLE FAB'!M7","v":"00:00:00"},null,{"$f":"'FEUILLE FAB'!O7","v":"A CONSOMMER JUSQU'AU :"},{"$f":"'FEUILLE FAB'!P7","v":0},{"$f":"'FEUILLE FAB'!Q7","v":0},{"$f":"'FEUILLE FAB'!R7","v":0},{"$f":"'FEUILLE FAB'!S7","v":0},{"$f":"'FEUILLE FAB'!T7","v":0},{"$f":"'FEUILLE FAB'!U7","v":0},{"$f":"'FEUILLE FAB'!V7","v":0},{"$f":"'FEUILLE FAB'!W7","v":0},{"$f":"'FEUILLE FAB'!X7","v":0},{"$f":"'FEUILLE FAB'!Y7","v":0},{"$f":"'FEUILLE FAB'!Z7","v":0},{"$f":"'FEUILLE FAB'!AA7","v":"1900-01-03"},{"$f":"'FEUILLE FAB'!AB7","v":"00:00:00"},{"$f":"'FEUILLE FAB'!AC7","v":"00:00:00"},{"$f":"'FEUILLE FAB'!AD7","v":"00:00:00"},{"$f":"'FEUILLE FAB'!AE7","v":"00:00:00"},{"$f":"'FEUILLE FAB'!AF7","v":"00:00:00"},{"$f":"'FEUILLE FAB'!AG7","v":"00:00:00"},{"$f":"'FEUILLE FAB'!AH7","v":"00:00:00"},{"$f":"'FEUILLE FAB'!AI7","v":"00:00:00"},{"$f":"'FEUILLE FAB'!AJ7","v":"00:00:00"},{"$f":"'FEUILLE FAB'!AK7","v":"00:00:00"},{"$f":"'FEUILLE FAB'!AL7","v":"00:00:00"}]
[]
[null,null,null,null,null,{"$f":"'FEUILLE FAB'!F9","v":"MONTRICHARD"},null,null,null,null,null,null,null,null,null,null,null,{"$f":"'FEUILLE FAB'!R9","v":"PONTLEVOY"},null,null,null,null,null,null,{"$f":"'FEUILLE FAB'!Y9","v":"ROMORANTIN"},null,null,null,null,null,null,null,null,null,null,null,null,{"$f":"'FEUILLE FAB'!AL9","v":0}]
[{"$f":"'FEUILLE FAB'!A10","v":"SAMEDI MIDI"},null,null,null,null,{"$f":"'FEUILLE FAB'!F10","v":"F.OCC"},null,null,{"$f":"'FEUILLE FAB'!I10","v":"FOYER HEB."},null,null,null,null,null,null,null,null,{"$f":"'FEUILLE FAB'!R10","v":"LA MERISAIE"},null,null,null,null,null,null,{"$f":"'FEUILLE FAB'!Y10","v":"FO / FAM"},null,null,null,null,{"$f":"'FEUILLE FAB'!AD10","v":"ESAT"},null,{"$f":"'FEUILLE FAB'!AF10","v":"FH "},null,{"$f":"'FEUILLE FAB'!AH10","v":"IME"},null,null,null,{"$f":"'FEUILLE FAB'!AL10","v":0},null,{"$f":"'FEUILLE FAB'!AN10","v":0}]
[null,{"$f":"'FEUILLE FAB'!B11","v":"TOTAL"},{"$f":"'FEUILLE FAB'!C11","v":"SELF"},{"$f":"'FEUILLE FAB'!D11","v":"ADMR"},{"$f":"'FEUILLE FAB'!E11","v":"ETS"},{"$f":"'FEUILLE FAB'!F11","v":"U1"},{"$f":"'FEUILLE FAB'!G11","v":"U2"},{"$f":"'FEUILLE FAB'!H11","v":"U3"},{"$f":"'FEUILLE FAB'!I11","v":"2RA"},{"$f":"'FEUILLE FAB'!J11","v":425},{"$f":"'FEUILLE FAB'!K11","v":"4RL"},{"$f":"'FEUILLE FAB'!L11","v":2114},{"$f":"'FEUILLE FAB'!M11","v":"8RA"},{"$f":"'FEUILLE FAB'!N11","v":1005},{"$f":"'FEUILLE FAB'!O11","v":1015},{"$f":"'FEUILLE FAB'!P11","v":"10RA"},{"$f":"'FEUILLE FAB'!Q11","v":"Educ"},{"$f":"'FEUILLE FAB'!R11","v":"DA"},{"$f":"'FEUILLE FAB'!S11","v":"MI"},{"$f":"'FEUILLE FAB'!T11","v":"PI"},{"$f":"'FEUILLE FAB'!U11","v":"VI"},{"$f":"'FEUILLE FAB'!V11","v":"VA"},{"$f":"'FEUILLE FAB'!W11","v":"PERS"},{"$f":"'FEUILLE FAB'!X11","v":"IND"},{"$f":"'FEUILLE FAB'!Y11","v":"U1"},{"$f":"'FEUILLE FAB'!Z11","v":"U2"},{"$f":"'FEUILLE FAB'!AA11","v":"U3"},{"$f":"'FEUILLE FAB'!AB11","v":"U4"},{"$f":"'FEUILLE FAB'!AC11","v":"U5"},{"$f":"'FEUILLE FAB'!AD11","v":"COL"},{"$f":"'FEUILLE FAB'!AE11","v":"IND"},{"$f":"'FEUILLE FAB'!AF11","v":"COL"},{"$f":"'FEUILLE FAB'!AG11","v":"IND"},{"$f":"'FEUILLE FAB'!AH11","v":"U1"},{"$f":"'FEUILLE FAB'!AI11","v":"U2"},{"$f":"'FEUILLE FAB'!AJ11","v":"U3"},{"$f":"'FEUILLE FAB'!AK11","v":"U4"},{"$f":"'FEUILLE FAB'!AL11","v":0},{"$f":"'FEUILLE FAB'!AM11","v":0},{"$f":"'FEUILLE FAB'!AN11","v":0},{"$f":"'FEUILLE FAB'!AO11","v":0},{"$f":"'FEUILLE FAB'!AP11","v":0},{"$f":"'FEUILLE FAB'!AQ11","v":0},{"$f":"'FEUILLE FAB'!AR11","v":0},{"$f":"'FEUILLE FAB'!AS11","v":"….."},{"$f":"'FEUILLE FAB'!AT11","v":"….."}]
[{"$f":"'FEUILLE FAB'!A12","v":"TERRINE DE CAMPAGNE"},{"$f":"'FEUILLE FAB'!B12","v":52},{"$f":"'FEUILLE FAB'!C12&\"\"","v":""},{"$f":"'FEUILLE FAB'!D12&\"\"","v":""},{"$f":"'FEUILLE FAB'!E12&\"\"","v":""},{"$f":"'FEUILLE FAB'!F12&\"\"","v":"12"},{"$f":"'FEUILLE FAB'!G12&\"\"","v":"11"},{"$f":"'FEUILLE FAB'!H12&\"\"","v":"13"},{"$f":"'FEUILLE FAB'!I12&\"\"","v":"6"},{"$f":"'FEUILLE FAB'!J12&\"\"","v":"8"},{"$f":"'FEUILLE FAB'!K12&\"\"","v":"2"},{"$f":"'FEUILLE FAB'!L12&\"\"","v":""},{"$f":"'FEUILLE FAB'!M12&\"\"","v":""},{"$f":"'FEUILLE FAB'!N12&\"\"","v":""},{"$f":"'FEUILLE FAB'!O12&\"\"","v":""},{"$f":"'FEUILLE FAB'!P12&\"\"","v":""},{"$f":"'FEUILLE FAB'!Q12&\"\"","v":""},{"$f":"'FEUILLE FAB'!R12&\"\"","v":""},{"$f":"'FEUILLE FAB'!S12&\"\"","v":""},{"$f":"'FEUILLE FAB'!T12&\"\"","v":""},{"$f":"'FEUILLE FAB'!U12&\"\"","v":""},{"$f":"'FEUILLE FAB'!V12&\"\"","v":""},{"$f":"'FEUILLE FAB'!W12&\"\"","v":""},{"$f":"'FEUILLE FAB'!X12&\"\"","v":""},{"$f":"'FEUILLE FAB'!Y12&\"\"","v":""},{"$f":"'FEUILLE FAB'!Z12&\"\"","v":""},{"$f":"'FEUILLE FAB'!AA12&\"\"","v":""},{"$f":"'FEUILLE FAB'!AB12&\"\"","v":""},{"$f":"'FEUILLE FAB'!AC12&\"\"","v":""},{"$f":"'FEUILLE FAB'!AD12&\"\"","v":""},{"$f":"'FEUILLE FAB'!AE12&\"\"","v":""},{"$f":"'FEUILLE FAB'!AF12&\"\"","v":""},{"$f":"'FEUILLE FAB'!AG12&\"\"","v":""},{"$f":"'FEUILLE FAB'!AH12&\"\"","v":""},{"$f":"'FEUILLE FAB'!AI12&\"\"","v":""},{"$f":"'FEUILLE FAB'!AJ12&\"\"","v":""},{"$f":"'FEUILLE FAB'!AK12&\"\"","v":""},{"$f":"'FEUILLE FAB'!AL12&\"\"","v":""},{"$f":"'FEUILLE FAB'!AM12&\"\"","v":""},{"$f":"'FEUILLE FAB'!AN12&\"\"","v":""},{"$f":"'FEUILLE FAB'!AO12&\"\"","v":""},{"$f":"'FEUILLE FAB'!AP12&\"\"","v":""},{"$f":"'FEUILLE FAB'!AQ12&\"\"","v":""},{"$f":"'FEUILLE FAB'!AR12&\"\"","v":""},{"$f":"'FEUILLE FAB'!AS12&\"\"","v":""},{"$f":"'FEUILLE FAB'!AT12&\"\"","v":""}]
[{"$f":"'FEUILLE FAB'!A13","v":"BŒUF BOURGUIGNON"},{"$f":"'FEUILLE FAB'!B13","v":52},{"$f":"'FEUILLE FAB'!C13&\"\"","v":""},{"$f":"'FEUILLE FAB'!D13&\"\"","v":""},{"$f":"'FEUILLE FAB'!E13&\"\"","v":""},{"$f":"'FEUILLE FAB'!F13&\"\"","v":"12"},{"$f":"'FEUILLE FAB'!G13&\"\"","v":"11"},{"$f":"'FEUILLE FAB'!H13&\"\"","v":"13"},{"$f":"'FEUILLE FAB'!I13&\"\"","v":"6"},{"$f":"'FEUILLE FAB'!J13&\"\"","v":"8"},{"$f":"'FEUILLE FAB'!K13&\"\"","v":"2"},{"$f":"'FEUILLE FAB'!L13&\"\"","v":""},{"$f":"'FEUILLE FAB'!M13&\"\"","v":""},{"$f":"'FEUILLE FAB'!N13&\"\"","v":""},{"$f":"'FEUILLE FAB'!O13&\"\"","v":""},{"$f":"'FEUILLE FAB'!P13&\"\"","v":""},{"$f":"'FEUILLE FAB'!Q13&\"\"","v":""},{"$f":"'FEUILLE FAB'!R13&\"\"","v":""},{"$f":"'FEUILLE FAB'!S13&\"\"","v":""},{"$f":"'FEUILLE FAB'!T13&\"\"","v":""},{"$f":"'FEUILLE FAB'!U13&\"\"","v":""},{"$f":"'FEUILLE FAB'!V13&\"\"","v":""},{"$f":"'FEUILLE FAB'!W13&\"\"","v":""},{"$f":"'FEUILLE FAB'!X13&\"\"","v":""},{"$f":"'FEUILLE FAB'!Y13&\"\"","v":""},{"$f":"'FEUILLE FAB'!Z13&\"\"","v":""},{"$f":"'FEUILLE FAB'!AA13&\"\"","v":""},{"$f":"'FEUILLE FAB'!AB13&\"\"","v":""},{"$f":"'FEUILLE FAB'!AC13&\"\"","v":""},{"$f":"'FEUILLE FAB'!AD13&\"\"","v":""},{"$f":"'FEUILLE FAB'!AE13&\"\"","v":""},{"$f":"'FEUILLE FAB'!AF13&\"\"","v":""},{"$f":"'FEUILLE FAB'!AG13&\"\"","v":""},{"$f":"'FEUILLE FAB'!AH13&\"\"","v":""},{"$f":"'FEUILLE FAB'!AI13&\"\"","v":""},{"$f":"'FEUILLE FAB'!AJ13&\"\"","v":""},{"$f":"'FEUILLE FAB'!AK13&\"\"","v":""},{"$f":"'FEUILLE FAB'!AL13&\"\"","v":""},{"$f":"'FEUILLE FAB'!AM13&\"\"","v":""},{"$f":"'FEUILLE FAB'!AN13&\"\"","v":""},{"$f":"'FEUILLE FAB'!AO13&\"\"","v":""},{"$f":"'FEUILLE FAB'!AP13&\"\"","v":""},{"$f":"'FEUILLE FAB'!AQ13&\"\"","v":""},{"$f":"'FEUILLE FAB'!AR13&\"\"","v":""},{"$f":"'FEUILLE FAB'!AS13&\"\"","v":""},{"$f":"'FEUILLE FAB'!AT13&\"\"","v":""}]
[{"$f":"'FEUILLE FAB'!A14","v":"CAROTTES VICHY"},{"$f":"'FEUILLE FAB'!B14","v":75},{"$f":"'FEUILLE FAB'!C14&\"\"","v":""},{"$f":"'FEUILLE FAB'!D14&\"\"","v":""},{"$f":"'FEUILLE FAB'!E14&\"\"","v":""},{"$f":"'FEUILLE FAB'!F14&\"\"","v":"14"},{"$f":"'FEUILLE FAB'!G14&\"\"","v":"24"},{"$f":"'FEUILLE FAB'!H14&\"\"","v":"16"},{"$f":"'FEUILLE FAB'!I14&\"\"","v":"8"},{"$f":"'FEUILLE FAB'!J14&\"\"","v":"11"},{"$f":"'FEUILLE FAB'!K14&\"\"","v":"2"},{"$f":"'FEUILLE FAB'!L14&\"\"","v":""},{"$f":"'FEUILLE FAB'!M14&\"\"","v":""},{"$f":"'FEUILLE FAB'!N14&\"\"","v":""},{"$f":"'FEUILLE FAB'!O14&\"\"","v":""},{"$f":"'FEUILLE FAB'!P14&\"\"","v":""},{"$f":"'FEUILLE FAB'!Q14&\"\"","v":""},{"$f":"'FEUILLE FAB'!R14&\"\"","v":""},{"$f":"'FEUILLE FAB'!S14&\"\"","v":""},{"$f":"'FEUILLE FAB'!T14&\"\"","v":""},{"$f":"'FEUILLE FAB'!U14&\"\"","v":""},{"$f":"'FEUILLE FAB'!V14&\"\"","v":""},{"$f":"'FEUILLE FAB'!W14&\"\"","v":""},{"$f":"'FEUILLE FAB'!X14&\"\"","v":""},{"$f":"'FEUILLE FAB'!Y14&\"\"","v":""},{"$f":"'FEUILLE FAB'!Z14&\"\"","v":""},{"$f":"'FEUILLE FAB'!AA14&\"\"","v":""},{"$f":"'FEUILLE FAB'!AB14&\"\"","v":""},{"$f":"'FEUILLE FAB'!AC14&\"\"","v":""},{"$f":"'FEUILLE FAB'!AD14&\"\"","v":""},{"$f":"'FEUILLE FAB'!AE14&\"\"","v":""},{"$f":"'FEUILLE FAB'!AF14&\"\"","v":""},{"$f":"'FEUILLE FAB'!AG14&\"\"","v":""},{"$f":"'FEUILLE FAB'!AH14&\"\"","v":""},{"$f":"'FEUILLE FAB'!AI14&\"\"","v":""},{"$f":"'FEUILLE FAB'!AJ14&\"\"","v":""},{"$f":"'FEUILLE FAB'!AK14&\"\"","v":""},{"$f":"'FEUILLE FAB'!AL14&\"\"","v":""},{"$f":"'FEUILLE FAB'!AM14&\"\"","v":""},{"$f":"'FEUILLE FAB'!AN14&\"\"","v":""},{"$f":"'FEUILLE FAB'!AO14&\"\"","v":""},{"$f":"'FEUILLE FAB'!AP14&\"\"","v":""},{"$f":"'FEUILLE FAB'!AQ14&\"\"","v":""},{"$f":"'FEUILLE FAB'!AR14&\"\"","v":""},{"$f":"'FEUILLE FAB'!AS14&\"\"","v":""},{"$f":"'FEUILLE FAB'!AT14&\"\"","v":""}]
[{"$f":"'FEUILLE FAB'!A15","v":"CAMEMBERT"},{"$f":"'FEUILLE FAB'!B15","v":80},{"$f":"'FEUILLE FAB'!C15&\"\"","v":""},{"$f":"'FEUILLE FAB'!D15&\"\"","v":""},{"$f":"'FEUILLE FAB'!E15&\"\"","v":""},{"$f":"'FEUILLE FAB'!F15&\"\"","v":"17"},{"$f":"'FEUILLE FAB'!G15&\"\"","v":"19"},{"$f":"'FEUILLE FAB'!H15&\"\"","v":"14"},{"$f":"'FEUILLE FAB'!I15&\"\"","v":"6"},{"$f":"'FEUILLE FAB'!J15&\"\"","v":"8"},{"$f":"'FEUILLE FAB'!K15&\"\"","v":"2"},{"$f":"'FEUILLE FAB'!L15&\"\"","v":"4"},{"$f":"'FEUILLE FAB'!M15&\"\"","v":"3"},{"$f":"'FEUILLE FAB'!N15&\"\"","v":"2"},{"$f":"'FEUILLE FAB'!O15&\"\"","v":"1"},{"$f":"'FEUILLE FAB'!P15&\"\"","v":"4"},{"$f":"'FEUILLE FAB'!Q15&\"\"","v":""},{"$f":"'FEUILLE FAB'!R15&\"\"","v":""},{"$f":"'FEUILLE FAB'!S15&\"\"","v":""},{"$f":"'FEUILLE FAB'!T15&\"\"","v":""},{"$f":"'FEUILLE FAB'!U15&\"\"","v":""},{"$f":"'FEUILLE FAB'!V15&\"\"","v":""},{"$f":"'FEUILLE FAB'!W15&\"\"","v":""},{"$f":"'FEUILLE FAB'!X15&\"\"","v":""},{"$f":"'FEUILLE FAB'!Y15&\"\"","v":""},{"$f":"'FEUILLE FAB'!Z15&\"\"","v":""},{"$f":"'FEUILLE FAB'!AA15&\"\"","v":""},{"$f":"'FEUILLE FAB'!AB15&\"\"","v":""},{"$f":"'FEUILLE FAB'!AC15&\"\"","v":""},{"$f":"'FEUILLE FAB'!AD15&\"\"","v":""},{"$f":"'FEUILLE FAB'!AE15&\"\"","v":""},{"$f":"'FEUILLE FAB'!AF15&\"\"","v":""},{"$f":"'FEUILLE FAB'!AG15&\"\"","v":""},{"$f":"'FEUILLE FAB'!AH15&\"\"","v":""},{"$f":"'FEUILLE FAB'!AI15&\"\"","v":""},{"$f":"'FEUILLE FAB'!AJ15&\"\"","v":""},{"$f":"'FEUILLE FAB'!AK15&\"\"","v":""},{"$f":"'FEUILLE FAB'!AL15&\"\"","v":""},{"$f":"'FEUILLE FAB'!AM15&\"\"","v":""},{"$f":"'FEUILLE FAB'!AN15&\"\"","v":""},{"$f":"'FEUILLE FAB'!AO15&\"\"","v":""},{"$f":"'FEUILLE FAB'!AP15&\"\"","v":""},{"$f":"'FEUILLE FAB'!AQ15&\"\"","v":""},{"$f":"'FEUILLE FAB'!AR15&\"\"","v":""},{"$f":"'FEUILLE FAB'!AS15&\"\"","v":""},{"$f":"'FEUILLE FAB'!AT15&\"\"","v":""}]
[{"$f":"'FEUILLE FAB'!A16","v":"PÂTISSERIE"},{"$f":"'FEUILLE FAB'!B16","v":80},{"$f":"'FEUILLE FAB'!C16&\"\"","v":""},{"$f":"'FEUILLE FAB'!D16&\"\"","v":""},{"$f":"'FEUILLE FAB'!E16&\"\"","v":""},{"$f":"'FEUILLE FAB'!F16&\"\"","v":"17"},{"$f":"'FEUILLE FAB'!G16&\"\"","v":"21"},{"$f":"'FEUILLE FAB'!H16&\"\"","v":"16"},{"$f":"'FEUILLE FAB'!I16&\"\"","v":"6"},{"$f":"'FEUILLE FAB'!J16&\"\"","v":"4"},{"$f":"'FEUILLE FAB'!K16&\"\"","v":"2"},{"$f":"'FEUILLE FAB'!L16&\"\"","v":"4"},{"$f":"'FEUILLE FAB'!M16&\"\"","v":"3"},{"$f":"'FEUILLE FAB'!N16&\"\"","v":"2"},{"$f":"'FEUILLE FAB'!O16&\"\"","v":"1"},{"$f":"'FEUILLE FAB'!P16&\"\"","v":"4"},{"$f":"'FEUILLE FAB'!Q16&\"\"","v":""},{"$f":"'FEUILLE FAB'!R16&\"\"","v":""},{"$f":"'FEUILLE FAB'!S16&\"\"","v":""},{"$f":"'FEUILLE FAB'!T16&\"\"","v":""},{"$f":"'FEUILLE FAB'!U16&\"\"","v":""},{"$f":"'FEUILLE FAB'!V16&\"\"","v":""},{"$f":"'FEUILLE FAB'!W16&\"\"","v":""},{"$f":"'FEUILLE FAB'!X16&\"\"","v":""},{"$f":"'FEUILLE FAB'!Y16&\"\"","v":""},{"$f":"'FEUILLE FAB'!Z16&\"\"","v":""},{"$f":"'FEUILLE FAB'!AA16&\"\"","v":""},{"$f":"'FEUILLE FAB'!AB16&\"\"","v":""},{"$f":"'FEUILLE FAB'!AC16&\"\"","v":""},{"$f":"'FEUILLE FAB'!AD16&\"\"","v":""},{"$f":"'FEUILLE FAB'!AE16&\"\"","v":""},{"$f":"'FEUILLE FAB'!AF16&\"\"","v":""},{"$f":"'FEUILLE FAB'!AG16&\"\"","v":""},{"$f":"'FEUILLE FAB'!AH16&\"\"","v":""},{"$f":"'FEUILLE FAB'!AI16&\"\"","v":""},{"$f":"'FEUILLE FAB'!AJ16&\"\"","v":""},{"$f":"'FEUILLE FAB'!AK16&\"\"","v":""},{"$f":"'FEUILLE FAB'!AL16&\"\"","v":""},{"$f":"'FEUILLE FAB'!AM16&\"\"","v":""},{"$f":"'FEUILLE FAB'!AN16&\"\"","v":""},{"$f":"'FEUILLE FAB'!AO16&\"\"","v":""},{"$f":"'FEUILLE FAB'!AP16&\"\"","v":""},{"$f":"'FEUILLE FAB'!AQ16&\"\"","v":""},{"$f":"'FEUILLE FAB'!AR16&\"\"","v":""},{"$f":"'FEUILLE FAB'!AS16&\"\"","v":""},{"$f":"'FEUILLE FAB'!AT16&\"\"","v":""}]
[{"$f":"'FEUILLE FAB'!A17","v":""},{"$f":"'FEUILLE FAB'!B17","v":0},{"$f":"'FEUILLE FAB'!C17&\"\"","v":""},{"$f":"'FEUILLE FAB'!D17&\"\"","v":""},{"$f":"'FEUILLE FAB'!E17&\"\"","v":""},{"$f":"'FEUILLE FAB'!F17&\"\"","v":""},{"$f":"'FEUILLE FAB'!G17&\"\"","v":""},{"$f":"'FEUILLE FAB'!H17&\"\"","v":""},{"$f":"'FEUILLE FAB'!I17&\"\"","v":""},{"$f":"'FEUILLE FAB'!J17&\"\"","v":""},{"$f":"'FEUILLE FAB'!K17&\"\"","v":""},{"$f":"'FEUILLE FAB'!L17&\"\"","v":""},{"$f":"'FEUILLE FAB'!M17&\"\"","v":""},{"$f":"'FEUILLE FAB'!N17&\"\"","v":""},{"$f":"'FEUILLE FAB'!O17&\"\"","v":""},{"$f":"'FEUILLE FAB'!P17&\"\"","v":""},{"$f":"'FEUILLE FAB'!Q17&\"\"","v":""},{"$f":"'FEUILLE FAB'!R17&\"\"","v":""},{"$f":"'FEUILLE FAB'!S17&\"\"","v":""},{"$f":"'FEUILLE FAB'!T17&\"\"","v":""},{"$f":"'FEUILLE FAB'!U17&\"\"","v":""},{"$f":"'FEUILLE FAB'!V17&\"\"","v":""},{"$f":"'FEUILLE FAB'!W17&\"\"","v":""},{"$f":"'FEUILLE FAB'!X17&\"\"","v":""},{"$f":"'FEUILLE FAB'!Y17&\"\"","v":""},{"$f":"'FEUILLE FAB'!Z17&\"\"","v":""},{"$f":"'FEUILLE FAB'!AA17&\"\"","v":""},{"$f":"'FEUILLE FAB'!AB17&\"\"","v":""},{"$f":"'FEUILLE FAB'!AC17&\"\"","v":""},{"$f":"'FEUILLE FAB'!AD17&\"\"","v":""},{"$f":"'FEUILLE FAB'!AE17&\"\"","v":""},{"$f":"'FEUILLE FAB'!AF17&\"\"","v":""},{"$f":"'FEUILLE FAB'!AG17&\"\"","v":""},{"$f":"'FEUILLE FAB'!AH17&\"\"","v":""},{"$f":"'FEUILLE FAB'!AI17&\"\"","v":""},{"$f":"'FEUILLE FAB'!AJ17&\"\"","v":""},{"$f":"'FEUILLE FAB'!AK17&\"\"","v":""},{"$f":"'FEUILLE FAB'!AL17&\"\"","v":""},{"$f":"'FEUILLE FAB'!AM17&\"\"","v":""},{"$f":"'FEUILLE FAB'!AN17&\"\"","v":""},{"$f":"'FEUILLE FAB'!AO17&\"\"","v":""},{"$f":"'FEUILLE FAB'!AP17&\"\"","v":""},{"$f":"'FEUILLE FAB'!AQ17&\"\"","v":""},{"$f":"'FEUILLE FAB'!AR17&\"\"","v":""},{"$f":"'FEUILLE FAB'!AS17&\"\"","v":""},{"$f":"'FEUILLE FAB'!AT17&\"\"","v":""}]
[{"$f":"'FEUILLE FAB'!A18","v":"LEGUMES VERTS REMY"},{"$f":"'FEUILLE FAB'!B18","v":1},{"$f":"'FEUILLE FAB'!C18&\"\"","v":""},{"$f":"'FEUILLE FAB'!D18&\"\"","v":""},{"$f":"'FEUILLE FAB'!E18&\"\"","v":""},{"$f":"'FEUILLE FAB'!F18&\"\"","v":"1"},{"$f":"'FEUILLE FAB'!G18&\"\"","v":""},{"$f":"'FEUILLE FAB'!H18&\"\"","v":""},{"$f":"'FEUILLE FAB'!I18&\"\"","v":""},{"$f":"'FEUILLE FAB'!J18&\"\"","v":""},{"$f":"'FEUILLE FAB'!K18&\"\"","v":""},{"$f":"'FEUILLE FAB'!L18&\"\"","v":""},{"$f":"'FEUILLE FAB'!M18&\"\"","v":""},{"$f":"'FEUILLE FAB'!N18&\"\"","v":""},{"$f":"'FEUILLE FAB'!O18&\"\"","v":""},{"$f":"'FEUILLE FAB'!P18&\"\"","v":""},{"$f":"'FEUILLE FAB'!Q18&\"\"","v":""},{"$f":"'FEUILLE FAB'!R18&\"\"","v":""},{"$f":"'FEUILLE FAB'!S18&\"\"","v":""},{"$f":"'FEUILLE FAB'!T18&\"\"","v":""},{"$f":"'FEUILLE FAB'!U18&\"\"","v":""},{"$f":"'FEUILLE FAB'!V18&\"\"","v":""},{"$f":"'FEUILLE FAB'!W18&\"\"","v":""},{"$f":"'FEUILLE FAB'!X18&\"\"","v":""},{"$f":"'FEUILLE FAB'!Y18&\"\"","v":""},{"$f":"'FEUILLE FAB'!Z18&\"\"","v":""},{"$f":"'FEUILLE FAB'!AA18&\"\"","v":""},{"$f":"'FEUILLE FAB'!AB18&\"\"","v":""},{"$f":"'FEUILLE FAB'!AC18&\"\"","v":""},{"$f":"'FEUILLE FAB'!AD18&\"\"","v":""},{"$f":"'FEUILLE FAB'!AE18&\"\"","v":""},{"$f":"'FEUILLE FAB'!AF18&\"\"","v":""},{"$f":"'FEUILLE FAB'!AG18&\"\"","v":""},{"$f":"'FEUILLE FAB'!AH18&\"\"","v":""},{"$f":"'FEUILLE FAB'!AI18&\"\"","v":""},{"$f":"'FEUILLE FAB'!AJ18&\"\"","v":""},{"$f":"'FEUILLE FAB'!AK18&\"\"","v":""},{"$f":"'FEUILLE FAB'!AL18&\"\"","v":""},{"$f":"'FEUILLE FAB'!AM18&\"\"","v":""},{"$f":"'FEUILLE FAB'!AN18&\"\"","v":""},{"$f":"'FEUILLE FAB'!AO18&\"\"","v":""},{"$f":"'FEUILLE FAB'!AP18&\"\"","v":""},{"$f":"'FEUILLE FAB'!AQ18&\"\"","v":""},{"$f":"'FEUILLE FAB'!AR18&\"\"","v":""},{"$f":"'FEUILLE FAB'!AS18&\"\"","v":""},{"$f":"'FEUILLE FAB'!AT18&\"\"","v":""}]
[{"$f":"'FEUILLE FAB'!A19","v":"LEGUMES VERTS"},{"$f":"'FEUILLE FAB'!B19","v":1},{"$f":"'FEUILLE FAB'!C19&\"\"","v":""},{"$f":"'FEUILLE FAB'!D19&\"\"","v":""},{"$f":"'FEUILLE FAB'!E19&\"\"","v":""},{"$f":"'FEUILLE FAB'!F19&\"\"","v":""},{"$f":"'FEUILLE FAB'!G19&\"\"","v":""},{"$f":"'FEUILLE FAB'!H19&\"\"","v":"1"},{"$f":"'FEUILLE FAB'!I19&\"\"","v":""},{"$f":"'FEUILLE FAB'!J19&\"\"","v":""},{"$f":"'FEUILLE FAB'!K19&\"\"","v":""},{"$f":"'FEUILLE FAB'!L19&\"\"","v":""},{"$f":"'FEUILLE FAB'!M19&\"\"","v":""},{"$f":"'FEUILLE FAB'!N19&\"\"","v":""},{"$f":"'FEUILLE FAB'!O19&\"\"","v":""},{"$f":"'FEUILLE FAB'!P19&\"\"","v":""},{"$f":"'FEUILLE FAB'!Q19&\"\"","v":""},{"$f":"'FEUILLE FAB'!R19&\"\"","v":""},{"$f":"'FEUILLE FAB'!S19&\"\"","v":""},{"$f":"'FEUILLE FAB'!T19&\"\"","v":""},{"$f":"'FEUILLE FAB'!U19&\"\"","v":""},{"$f":"'FEUILLE FAB'!V19&\"\"","v":""},{"$f":"'FEUILLE FAB'!W19&\"\"","v":""},{"$f":"'FEUILLE FAB'!X19&\"\"","v":""},{"$f":"'FEUILLE FAB'!Y19&\"\"","v":""},{"$f":"'FEUILLE FAB'!Z19&\"\"","v":""},{"$f":"'FEUILLE FAB'!AA19&\"\"","v":""},{"$f":"'FEUILLE FAB'!AB19&\"\"","v":""},{"$f":"'FEUILLE FAB'!AC19&\"\"","v":""},{"$f":"'FEUILLE FAB'!AD19&\"\"","v":""},{"$f":"'FEUILLE FAB'!AE19&\"\"","v":""},{"$f":"'FEUILLE FAB'!AF19&\"\"","v":""},{"$f":"'FEUILLE FAB'!AG19&\"\"","v":""},{"$f":"'FEUILLE FAB'!AH19&\"\"","v":""},{"$f":"'FEUILLE FAB'!AI19&\"\"","v":""},{"$f":"'FEUILLE FAB'!AJ19&\"\"","v":""},{"$f":"'FEUILLE FAB'!AK19&\"\"","v":""},{"$f":"'FEUILLE FAB'!AL19&\"\"","v":""},{"$f":"'FEUILLE FAB'!AM19&\"\"","v":""},{"$f":"'FEUILLE FAB'!AN19&\"\"","v":""},{"$f":"'FEUILLE FAB'!AO19&\"\"","v":""},{"$f":"'FEUILLE FAB'!AP19&\"\"","v":""},{"$f":"'FEUILLE FAB'!AQ19&\"\"","v":""},{"$f":"'FEUILLE FAB'!AR19&\"\"","v":""},{"$f":"'FEUILLE FAB'!AS19&\"\"","v":""},{"$f":"'FEUILLE FAB'!AT19&\"\"","v":""}]
[{"$f":"'FEUILLE FAB'!A20","v":"FECULENT"},{"$f":"'FEUILLE FAB'!B20","v":2},{"$f":"'FEUILLE FAB'!C20&\"\"","v":""},{"$f":"'FEUILLE FAB'!D20&\"\"","v":""},{"$f":"'FEUILLE FAB'!E20&\"\"","v":""},{"$f":"'FEUILLE FAB'!F20&\"\"","v":"1"},{"$f":"'FEUILLE FAB'!G20&\"\"","v":""},{"$f":"'FEUILLE FAB'!H20&\"\"","v":"1"},{"$f":"'FEUILLE FAB'!I20&\"\"","v":""},{"$f":"'FEUILLE FAB'!J20&\"\"","v":""},{"$f":"'FEUILLE FAB'!K20&\"\"","v":""},{"$f":"'FEUILLE FAB'!L20&\"\"","v":""},{"$f":"'FEUILLE FAB'!M20&\"\"","v":""},{"$f":"'FEUILLE FAB'!N20&\"\"","v":""},{"$f":"'FEUILLE FAB'!O20&\"\"","v":""},{"$f":"'FEUILLE FAB'!P20&\"\"","v":""},{"$f":"'FEUILLE FAB'!Q20&\"\"","v":""},{"$f":"'FEUILLE FAB'!R20&\"\"","v":""},{"$f":"'FEUILLE FAB'!S20&\"\"","v":""},{"$f":"'FEUILLE FAB'!T20&\"\"","v":""},{"$f":"'FEUILLE FAB'!U20&\"\"","v":""},{"$f":"'FEUILLE FAB'!V20&\"\"","v":""},{"$f":"'FEUILLE FAB'!W20&\"\"","v":""},{"$f":"'FEUILLE FAB'!X20&\"\"","v":""},{"$f":"'FEUILLE FAB'!Y20&\"\"","v":""},{"$f":"'FEUILLE FAB'!Z20&\"\"","v":""},{"$f":"'FEUILLE FAB'!AA20&\"\"","v":""},{"$f":"'FEUILLE FAB'!AB20&\"\"","v":""},{"$f":"'FEUILLE FAB'!AC20&\"\"","v":""},{"$f":"'FEUILLE FAB'!AD20&\"\"","v":""},{"$f":"'FEUILLE FAB'!AE20&\"\"","v":""},{"$f":"'FEUILLE FAB'!AF20&\"\"","v":""},{"$f":"'FEUILLE FAB'!AG20&\"\"","v":""},{"$f":"'FEUILLE FAB'!AH20&\"\"","v":""},{"$f":"'FEUILLE FAB'!AI20&\"\"","v":""},{"$f":"'FEUILLE FAB'!AJ20&\"\"","v":""},{"$f":"'FEUILLE FAB'!AK20&\"\"","v":""},{"$f":"'FEUILLE FAB'!AL20&\"\"","v":""},{"$f":"'FEUILLE FAB'!AM20&\"\"","v":""},{"$f":"'FEUILLE FAB'!AN20&\"\"","v":""},{"$f":"'FEUILLE FAB'!AO20&\"\"","v":""},{"$f":"'FEUILLE FAB'!AP20&\"\"","v":""},{"$f":"'FEUILLE FAB'!AQ20&\"\"","v":""},{"$f":"'FEUILLE FAB'!AR20&\"\"","v":""},{"$f":"'FEUILLE FAB'!AS20&\"\"","v":""},{"$f":"'FEUILLE FAB'!AT20&\"\"","v":""}]
[{"$f":"'FEUILLE FAB'!A21","v":"VIANDE OU POISSON SANS SAUCE"},{"$f":"'FEUILLE FAB'!B21","v":0},{"$f":"'FEUILLE FAB'!C21&\"\"","v":""},{"$f":"'FEUILLE FAB'!D21&\"\"","v":""},{"$f":"'FEUILLE FAB'!E21&\"\"","v":""},{"$f":"'FEUILLE FAB'!F21&\"\"","v":""},{"$f":"'FEUILLE FAB'!G21&\"\"","v":""},{"$f":"'FEUILLE FAB'!H21&\"\"","v":""},{"$f":"'FEUILLE FAB'!I21&\"\"","v":""},{"$f":"'FEUILLE FAB'!J21&\"\"","v":""},{"$f":"'FEUILLE FAB'!K21&\"\"","v":""},{"$f":"'FEUILLE FAB'!L21&\"\"","v":""},{"$f":"'FEUILLE FAB'!M21&\"\"","v":""},{"$f":"'FEUILLE FAB'!N21&\"\"","v":""},{"$f":"'FEUILLE FAB'!O21&\"\"","v":""},{"$f":"'FEUILLE FAB'!P21&\"\"","v":""},{"$f":"'FEUILLE FAB'!Q21&\"\"","v":""},{"$f":"'FEUILLE FAB'!R21&\"\"","v":""},{"$f":"'FEUILLE FAB'!S21&\"\"","v":""},{"$f":"'FEUILLE FAB'!T21&\"\"","v":""},{"$f":"'FEUILLE FAB'!U21&\"\"","v":""},{"$f":"'FEUILLE FAB'!V21&\"\"","v":""},{"$f":"'FEUILLE FAB'!W21&\"\"","v":""},{"$f":"'FEUILLE FAB'!X21&\"\"","v":""},{"$f":"'FEUILLE FAB'!Y21&\"\"","v":""},{"$f":"'FEUILLE FAB'!Z21&\"\"","v":""},{"$f":"'FEUILLE FAB'!AA21&\"\"","v":""},{"$f":"'FEUILLE FAB'!AB21&\"\"","v":""},{"$f":"'FEUILLE FAB'!AC21&\"\"","v":""},{"$f":"'FEUILLE FAB'!AD21&\"\"","v":""},{"$f":"'FEUILLE FAB'!AE21&\"\"","v":""},{"$f":"'FEUILLE FAB'!AF21&\"\"","v":""},{"$f":"'FEUILLE FAB'!AG21&\"\"","v":""},{"$f":"'FEUILLE FAB'!AH21&\"\"","v":""},{"$f":"'FEUILLE FAB'!AI21&\"\"","v":""},{"$f":"'FEUILLE FAB'!AJ21&\"\"","v":""},{"$f":"'FEUILLE FAB'!AK21&\"\"","v":""},{"$f":"'FEUILLE FAB'!AL21&\"\"","v":""},{"$f":"'FEUILLE FAB'!AM21&\"\"","v":""},{"$f":"'FEUILLE FAB'!AN21&\"\"","v":""},{"$f":"'FEUILLE FAB'!AO21&\"\"","v":""},{"$f":"'FEUILLE FAB'!AP21&\"\"","v":""},{"$f":"'FEUILLE FAB'!AQ21&\"\"","v":""},{"$f":"'FEUILLE FAB'!AR21&\"\"","v":""},{"$f":"'FEUILLE FAB'!AS21&\"\"","v":""},{"$f":"'FEUILLE FAB'!AT21&\"\"","v":""}]
[{"$f":"'FEUILLE FAB'!A22","v":0},{"$f":"'FEUILLE FAB'!B22","v":0},{"$f":"'FEUILLE FAB'!C22&\"\"","v":""},{"$f":"'FEUILLE FAB'!D22&\"\"","v":""},{"$f":"'FEUILLE FAB'!E22&\"\"","v":""},{"$f":"'FEUILLE FAB'!F22&\"\"","v":""},{"$f":"'FEUILLE FAB'!G22&\"\"","v":""},{"$f":"'FEUILLE FAB'!H22&\"\"","v":""},{"$f":"'FEUILLE FAB'!I22&\"\"","v":""},{"$f":"'FEUILLE FAB'!J22&\"\"","v":""},{"$f":"'FEUILLE FAB'!K22&\"\"","v":""},{"$f":"'FEUILLE FAB'!L22&\"\"","v":""},{"$f":"'FEUILLE FAB'!M22&\"\"","v":""},{"$f":"'FEUILLE FAB'!N22&\"\"","v":""},{"$f":"'FEUILLE FAB'!O22&\"\"","v":""},{"$f":"'FEUILLE FAB'!P22&\"\"","v":""},{"$f":"'FEUILLE FAB'!Q22&\"\"","v":""},{"$f":"'FEUILLE FAB'!R22&\"\"","v":""},{"$f":"'FEUILLE FAB'!S22&\"\"","v":""},{"$f":"'FEUILLE FAB'!T22&\"\"","v":""},{"$f":"'FEUILLE FAB'!U22&\"\"","v":""},{"$f":"'FEUILLE FAB'!V22&\"\"","v":""},{"$f":"'FEUILLE FAB'!W22&\"\"","v":""},{"$f":"'FEUILLE FAB'!X22&\"\"","v":""},{"$f":"'FEUILLE FAB'!Y22&\"\"","v":""},{"$f":"'FEUILLE FAB'!Z22&\"\"","v":""},{"$f":"'FEUILLE FAB'!AA22&\"\"","v":""},{"$f":"'FEUILLE FAB'!AB22&\"\"","v":""},{"$f":"'FEUILLE FAB'!AC22&\"\"","v":""},{"$f":"'FEUILLE FAB'!AD22&\"\"","v":""},{"$f":"'FEUILLE FAB'!AE22&\"\"","v":""},{"$f":"'FEUILLE FAB'!AF22&\"\"","v":""},{"$f":"'FEUILLE FAB'!AG22&\"\"","v":""},{"$f":"'FEUILLE FAB'!AH22&\"\"","v":""},{"$f":"'FEUILLE FAB'!AI22&\"\"","v":""},{"$f":"'FEUILLE FAB'!AJ22&\"\"","v":""},{"$f":"'FEUILLE FAB'!AK22&\"\"","v":""},{"$f":"'FEUILLE FAB'!AL22&\"\"","v":""},{"$f":"'FEUILLE FAB'!AM22&\"\"","v":""},{"$f":"'FEUILLE FAB'!AN22&\"\"","v":""},{"$f":"'FEUILLE FAB'!AO22&\"\"","v":""},{"$f":"'FEUILLE FAB'!AP22&\"\"","v":""},{"$f":"'FEUILLE FAB'!AQ22&\"\"","v":""},{"$f":"'FEUILLE FAB'!AR22&\"\"","v":""},{"$f":"'FEUILLE FAB'!AS22&\"\"","v":""},{"$f":"'FEUILLE FAB'!AT22&\"\"","v":""}]
[{"$f":"'FEUILLE FAB'!A23","v":0},{"$f":"'FEUILLE FAB'!B23","v":0},{"$f":"'FEUILLE FAB'!C23&\"\"","v":""},{"$f":"'FEUILLE FAB'!D23&\"\"","v":""},{"$f":"'FEUILLE FAB'!E23&\"\"","v":""},{"$f":"'FEUILLE FAB'!F23&\"\"","v":""},{"$f":"'FEUILLE FAB'!G23&\"\"","v":""},{"$f":"'FEUILLE FAB'!H23&\"\"","v":""},{"$f":"'FEUILLE FAB'!I23&\"\"","v":""},{"$f":"'FEUILLE FAB'!J23&\"\"","v":""},{"$f":"'FEUILLE FAB'!K23&\"\"","v":""},{"$f":"'FEUILLE FAB'!L23&\"\"","v":""},{"$f":"'FEUILLE FAB'!M23&\"\"","v":""},{"$f":"'FEUILLE FAB'!N23&\"\"","v":""},{"$f":"'FEUILLE FAB'!O23&\"\"","v":""},{"$f":"'FEUILLE FAB'!P23&\"\"","v":""},{"$f":"'FEUILLE FAB'!Q23&\"\"","v":""},{"$f":"'FEUILLE FAB'!R23&\"\"","v":""},{"$f":"'FEUILLE FAB'!S23&\"\"","v":""},{"$f":"'FEUILLE FAB'!T23&\"\"","v":""},{"$f":"'FEUILLE FAB'!U23&\"\"","v":""},{"$f":"'FEUILLE FAB'!V23&\"\"","v":""},{"$f":"'FEUILLE FAB'!W23&\"\"","v":""},{"$f":"'FEUILLE FAB'!X23&\"\"","v":""},{"$f":"'FEUILLE FAB'!Y23&\"\"","v":""},{"$f":"'FEUILLE FAB'!Z23&\"\"","v":""},{"$f":"'FEUILLE FAB'!AA23&\"\"","v":""},{"$f":"'FEUILLE FAB'!AB23&\"\"","v":""},{"$f":"'FEUILLE FAB'!AC23&\"\"","v":""},{"$f":"'FEUILLE FAB'!AD23&\"\"","v":""},{"$f":"'FEUILLE FAB'!AE23&\"\"","v":""},{"$f":"'FEUILLE FAB'!AF23&\"\"","v":""},{"$f":"'FEUILLE FAB'!AG23&\"\"","v":""},{"$f":"'FEUILLE FAB'!AH23&\"\"","v":""},{"$f":"'FEUILLE FAB'!AI23&\"\"","v":""},{"$f":"'FEUILLE FAB'!AJ23&\"\"","v":""},{"$f":"'FEUILLE FAB'!AK23&\"\"","v":""},{"$f":"'FEUILLE FAB'!AL23&\"\"","v":""},{"$f":"'FEUILLE FAB'!AM23&\"\"","v":""},{"$f":"'FEUILLE FAB'!AN23&\"\"","v":""},{"$f":"'FEUILLE FAB'!AO23&\"\"","v":""},{"$f":"'FEUILLE FAB'!AP23&\"\"","v":""},{"$f":"'FEUILLE FAB'!AQ23&\"\"","v":""},{"$f":"'FEUILLE FAB'!AR23&\"\"","v":""},{"$f":"'FEUILLE FAB'!AS23&\"\"","v":""},{"$f":"'FEUILLE FAB'!AT23&\"\"","v":""}]
[{"$f":"'FEUILLE FAB'!A24","v":0},{"$f":"'FEUILLE FAB'!B24","v":0},{"$f":"'FEUILLE FAB'!C24&\"\"","v":""},{"$f":"'FEUILLE FAB'!D24&\"\"","v":""},{"$f":"'FEUILLE FAB'!E24&\"\"","v":""},{"$f":"'FEUILLE FAB'!F24&\"\"","v":""},{"$f":"'FEUILLE FAB'!G24&\"\"","v":""},{"$f":"'FEUILLE FAB'!H24&\"\"","v":""},{"$f":"'FEUILLE FAB'!I24&\"\"","v":""},{"$f":"'FEUILLE FAB'!J24&\"\"","v":""},{"$f":"'FEUILLE FAB'!K24&\"\"","v":""},{"$f":"'FEUILLE FAB'!L24&\"\"","v":""},{"$f":"'FEUILLE FAB'!M24&\"\"","v":""},{"$f":"'FEUILLE FAB'!N24&\"\"","v":""},{"$f":"'FEUILLE FAB'!O24&\"\"","v":""},{"$f":"'FEUILLE FAB'!P24&\"\"","v":""},{"$f":"'FEUILLE FAB'!Q24&\"\"","v":""},{"$f":"'FEUILLE FAB'!R24&\"\"","v":""},{"$f":"'FEUILLE FAB'!S24&\"\"","v":""},{"$f":"'FEUILLE FAB'!T24&\"\"","v":""},{"$f":"'FEUILLE FAB'!U24&\"\"","v":""},{"$f":"'FEUILLE FAB'!V24&\"\"","v":""},{"$f":"'FEUILLE FAB'!W24&\"\"","v":""},{"$f":"'FEUILLE FAB'!X24&\"\"","v":""},{"$f":"'FEUILLE FAB'!Y24&\"\"","v":""},{"$f":"'FEUILLE FAB'!Z24&\"\"","v":""},{"$f":"'FEUILLE FAB'!AA24&\"\"","v":""},{"$f":"'FEUILLE FAB'!AB24&\"\"","v":""},{"$f":"'FEUILLE FAB'!AC24&\"\"","v":""},{"$f":"'FEUILLE FAB'!AD24&\"\"","v":""},{"$f":"'FEUILLE FAB'!AE24&\"\"","v":""},{"$f":"'FEUILLE FAB'!AF24&\"\"","v":""},{"$f":"'FEUILLE FAB'!AG24&\"\"","v":""},{"$f":"'FEUILLE FAB'!AH24&\"\"","v":""},{"$f":"'FEUILLE FAB'!AI24&\"\"","v":""},{"$f":"'FEUILLE FAB'!AJ24&\"\"","v":""},{"$f":"'FEUILLE FAB'!AK24&\"\"","v":""},{"$f":"'FEUILLE FAB'!AL24&\"\"","v":""},{"$f":"'FEUILLE FAB'!AM24&\"\"","v":""},{"$f":"'FEUILLE FAB'!AN24&\"\"","v":""},{"$f":"'FEUILLE FAB'!AO24&\"\"","v":""},{"$f":"'FEUILLE FAB'!AP24&\"\"","v":""},{"$f":"'FEUILLE FAB'!AQ24&\"\"","v":""},{"$f":"'FEUILLE FAB'!AR24&\"\"","v":""},{"$f":"'FEUILLE FAB'!AS24&\"\"","v":""},{"$f":"'FEUILLE FAB'!AT24&\"\"","v":""}]
[{"$f":"'FEUILLE FAB'!A25","v":"TOMATE VINAIGRETTE"},{"$f":"'FEUILLE FAB'!B25","v":4},{"$f":"'FEUILLE FAB'!C25&\"\"","v":""},{"$f":"'FEUILLE FAB'!D25&\"\"","v":""},{"$f":"'FEUILLE FAB'!E25&\"\"","v":""},{"$f":"'FEUILLE FAB'!F25&\"\"","v":""},{"$f":"'FEUILLE FAB'!G25&\"\"","v":"2"},{"$f":"'FEUILLE FAB'!H25&\"\"","v":"2"},{"$f":"'FEUILLE FAB'!I25&\"\"","v":""},{"$f":"'FEUILLE FAB'!J25&\"\"","v":""},{"$f":"'FEUILLE FAB'!K25&\"\"","v":""},{"$f":"'FEUILLE FAB'!L25&\"\"","v":""},{"$f":"'FEUILLE FAB'!M25&\"\"","v":""},{"$f":"'FEUILLE FAB'!N25&\"\"","v":""},{"$f":"'FEUILLE FAB'!O25&\"\"","v":""},{"$f":"'FEUILLE FAB'!P25&\"\"","v":""},{"$f":"'FEUILLE FAB'!Q25&\"\"","v":""},{"$f":"'FEUILLE FAB'!R25&\"\"","v":""},{"$f":"'FEUILLE FAB'!S25&\"\"","v":""},{"$f":"'FEUILLE FAB'!T25&\"\"","v":""},{"$f":"'FEUILLE FAB'!U25&\"\"","v":""},{"$f":"'FEUILLE FAB'!V25&\"\"","v":""},{"$f":"'FEUILLE FAB'!W25&\"\"","v":""},{"$f":"'FEUILLE FAB'!X25&\"\"","v":""},{"$f":"'FEUILLE FAB'!Y25&\"\"","v":""},{"$f":"'FEUILLE FAB'!Z25&\"\"","v":""},{"$f":"'FEUILLE FAB'!AA25&\"\"","v":""},{"$f":"'FEUILLE FAB'!AB25&\"\"","v":""},{"$f":"'FEUILLE FAB'!AC25&\"\"","v":""},{"$f":"'FEUILLE FAB'!AD25&\"\"","v":""},{"$f":"'FEUILLE FAB'!AE25&\"\"","v":""},{"$f":"'FEUILLE FAB'!AF25&\"\"","v":""},{"$f":"'FEUILLE FAB'!AG25&\"\"","v":""},{"$f":"'FEUILLE FAB'!AH25&\"\"","v":""},{"$f":"'FEUILLE FAB'!AI25&\"\"","v":""},{"$f":"'FEUILLE FAB'!AJ25&\"\"","v":""},{"$f":"'FEUILLE FAB'!AK25&\"\"","v":""},{"$f":"'FEUILLE FAB'!AL25&\"\"","v":""},{"$f":"'FEUILLE FAB'!AM25&\"\"","v":""},{"$f":"'FEUILLE FAB'!AN25&\"\"","v":""},{"$f":"'FEUILLE FAB'!AO25&\"\"","v":""},{"$f":"'FEUILLE FAB'!AP25&\"\"","v":""},{"$f":"'FEUILLE FAB'!AQ25&\"\"","v":""},{"$f":"'FEUILLE FAB'!AR25&\"\"","v":""},{"$f":"'FEUILLE FAB'!AS25&\"\"","v":""},{"$f":"'FEUILLE FAB'!AT25&\"\"","v":""}]
[{"$f":"'FEUILLE FAB'!A26","v":"BŒUF BOURGUIGNON SANS LARDONS"},{"$f":"'FEUILLE FAB'!B26","v":4},{"$f":"'FEUILLE FAB'!C26&\"\"","v":""},{"$f":"'FEUILLE FAB'!D26&\"\"","v":""},{"$f":"'FEUILLE FAB'!E26&\"\"","v":""},{"$f":"'FEUILLE FAB'!F26&\"\"","v":""},{"$f":"'FEUILLE FAB'!G26&\"\"","v":"2"},{"$f":"'FEUILLE FAB'!H26&\"\"","v":"2"},{"$f":"'FEUILLE FAB'!I26&\"\"","v":""},{"$f":"'FEUILLE FAB'!J26&\"\"","v":""},{"$f":"'FEUILLE FAB'!K26&\"\"","v":""},{"$f":"'FEUILLE FAB'!L26&\"\"","v":""},{"$f":"'FEUILLE FAB'!M26&\"\"","v":""},{"$f":"'FEUILLE FAB'!N26&\"\"","v":""},{"$f":"'FEUILLE FAB'!O26&\"\"","v":""},{"$f":"'FEUILLE FAB'!P26&\"\"","v":""},{"$f":"'FEUILLE FAB'!Q26&\"\"","v":""},{"$f":"'FEUILLE FAB'!R26&\"\"","v":""},{"$f":"'FEUILLE FAB'!S26&\"\"","v":""},{"$f":"'FEUILLE FAB'!T26&\"\"","v":""},{"$f":"'FEUILLE FAB'!U26&\"\"","v":""},{"$f":"'FEUILLE FAB'!V26&\"\"","v":""},{"$f":"'FEUILLE FAB'!W26&\"\"","v":""},{"$f":"'FEUILLE FAB'!X26&\"\"","v":""},{"$f":"'FEUILLE FAB'!Y26&\"\"","v":""},{"$f":"'FEUILLE FAB'!Z26&\"\"","v":""},{"$f":"'FEUILLE FAB'!AA26&\"\"","v":""},{"$f":"'FEUILLE FAB'!AB26&\"\"","v":""},{"$f":"'FEUILLE FAB'!AC26&\"\"","v":""},{"$f":"'FEUILLE FAB'!AD26&\"\"","v":""},{"$f":"'FEUILLE FAB'!AE26&\"\"","v":""},{"$f":"'FEUILLE FAB'!AF26&\"\"","v":""},{"$f":"'FEUILLE FAB'!AG26&\"\"","v":""},{"$f":"'FEUILLE FAB'!AH26&\"\"","v":""},{"$f":"'FEUILLE FAB'!AI26&\"\"","v":""},{"$f":"'FEUILLE FAB'!AJ26&\"\"","v":""},{"$f":"'FEUILLE FAB'!AK26&\"\"","v":""},{"$f":"'FEUILLE FAB'!AL26&\"\"","v":""},{"$f":"'FEUILLE FAB'!AM26&\"\"","v":""},{"$f":"'FEUILLE FAB'!AN26&\"\"","v":""},{"$f":"'FEUILLE FAB'!AO26&\"\"","v":""},{"$f":"'FEUILLE FAB'!AP26&\"\"","v":""},{"$f":"'FEUILLE FAB'!AQ26&\"\"","v":""},{"$f":"'FEUILLE FAB'!AR26&\"\"","v":""},{"$f":"'FEUILLE FAB'!AS26&\"\"","v":""},{"$f":"'FEUILLE FAB'!AT26&\"\"","v":""}]
[{"$f":"'FEUILLE FAB'!A27","v":""},{"$f":"'FEUILLE FAB'!B27","v":0},{"$f":"'FEUILLE FAB'!C27&\"\"","v":""},{"$f":"'FEUILLE FAB'!D27&\"\"","v":""},{"$f":"'FEUILLE FAB'!E27&\"\"","v":""},{"$f":"'FEUILLE FAB'!F27&\"\"","v":""},{"$f":"'FEUILLE FAB'!G27&\"\"","v":""},{"$f":"'FEUILLE FAB'!H27&\"\"","v":""},{"$f":"'FEUILLE FAB'!I27&\"\"","v":""},{"$f":"'FEUILLE FAB'!J27&\"\"","v":""},{"$f":"'FEUILLE FAB'!K27&\"\"","v":""},{"$f":"'FEUILLE FAB'!L27&\"\"","v":""},{"$f":"'FEUILLE FAB'!M27&\"\"","v":""},{"$f":"'FEUILLE FAB'!N27&\"\"","v":""},{"$f":"'FEUILLE FAB'!O27&\"\"","v":""},{"$f":"'FEUILLE FAB'!P27&\"\"","v":""},{"$f":"'FEUILLE FAB'!Q27&\"\"","v":""},{"$f":"'FEUILLE FAB'!R27&\"\"","v":""},{"$f":"'FEUILLE FAB'!S27&\"\"","v":""},{"$f":"'FEUILLE FAB'!T27&\"\"","v":""},{"$f":"'FEUILLE FAB'!U27&\"\"","v":""},{"$f":"'FEUILLE FAB'!V27&\"\"","v":""},{"$f":"'FEUILLE FAB'!W27&\"\"","v":""},{"$f":"'FEUILLE FAB'!X27&\"\"","v":""},{"$f":"'FEUILLE FAB'!Y27&\"\"","v":""},{"$f":"'FEUILLE FAB'!Z27&\"\"","v":""},{"$f":"'FEUILLE FAB'!AA27&\"\"","v":""},{"$f":"'FEUILLE FAB'!AB27&\"\"","v":""},{"$f":"'FEUILLE FAB'!AC27&\"\"","v":""},{"$f":"'FEUILLE FAB'!AD27&\"\"","v":""},{"$f":"'FEUILLE FAB'!AE27&\"\"","v":""},{"$f":"'FEUILLE FAB'!AF27&\"\"","v":""},{"$f":"'FEUILLE FAB'!AG27&\"\"","v":""},{"$f":"'FEUILLE FAB'!AH27&\"\"","v":""},{"$f":"'FEUILLE FAB'!AI27&\"\"","v":""},{"$f":"'FEUILLE FAB'!AJ27&\"\"","v":""},{"$f":"'FEUILLE FAB'!AK27&\"\"","v":""},{"$f":"'FEUILLE FAB'!AL27&\"\"","v":""},{"$f":"'FEUILLE FAB'!AM27&\"\"","v":""},{"$f":"'FEUILLE FAB'!AN27&\"\"","v":""},{"$f":"'FEUILLE FAB'!AO27&\"\"","v":""},{"$f":"'FEUILLE FAB'!AP27&\"\"","v":""},{"$f":"'FEUILLE FAB'!AQ27&\"\"","v":""},{"$f":"'FEUILLE FAB'!AR27&\"\"","v":""},{"$f":"'FEUILLE FAB'!AS27&\"\"","v":""},{"$f":"'FEUILLE FAB'!AT27&\"\"","v":""}]
[{"$f":"'FEUILLE FAB'!A28","v":"YAOURT"},{"$f":"'FEUILLE FAB'!B28","v":4},{"$f":"'FEUILLE FAB'!C28&\"\"","v":""},{"$f":"'FEUILLE FAB'!D28&\"\"","v":""},{"$f":"'FEUILLE FAB'!E28&\"\"","v":""},{"$f":"'FEUILLE FAB'!F28&\"\"","v":""},{"$f":"'FEUILLE FAB'!G28&\"\"","v":"2"},{"$f":"'FEUILLE FAB'!H28&\"\"","v":"2"},{"$f":"'FEUILLE FAB'!I28&\"\"","v":""},{"$f":"'FEUILLE FAB'!J28&\"\"","v":""},{"$f":"'FEUILLE FAB'!K28&\"\"","v":""},{"$f":"'FEUILLE FAB'!L28&\"\"","v":""},{"$f":"'FEUILLE FAB'!M28&\"\"","v":""},{"$f":"'FEUILLE FAB'!N28&\"\"","v":""},{"$f":"'FEUILLE FAB'!O28&\"\"","v":""},{"$f":"'FEUILLE FAB'!P28&\"\"","v":""},{"$f":"'FEUILLE FAB'!Q28&\"\"","v":""},{"$f":"'FEUILLE FAB'!R28&\"\"","v":""},{"$f":"'FEUILLE FAB'!S28&\"\"","v":""},{"$f":"'FEUILLE FAB'!T28&\"\"","v":""},{"$f":"'FEUILLE FAB'!U28&\"\"","v":""},{"$f":"'FEUILLE FAB'!V28&\"\"","v":""},{"$f":"'FEUILLE FAB'!W28&\"\"","v":""},{"$f":"'FEUILLE FAB'!X28&\"\"","v":""},{"$f":"'FEUILLE FAB'!Y28&\"\"","v":""},{"$f":"'FEUILLE FAB'!Z28&\"\"","v":""},{"$f":"'FEUILLE FAB'!AA28&\"\"","v":""},{"$f":"'FEUILLE FAB'!AB28&\"\"","v":""},{"$f":"'FEUILLE FAB'!AC28&\"\"","v":""},{"$f":"'FEUILLE FAB'!AD28&\"\"","v":""},{"$f":"'FEUILLE FAB'!AE28&\"\"","v":""},{"$f":"'FEUILLE FAB'!AF28&\"\"","v":""},{"$f":"'FEUILLE FAB'!AG28&\"\"","v":""},{"$f":"'FEUILLE FAB'!AH28&\"\"","v":""},{"$f":"'FEUILLE FAB'!AI28&\"\"","v":""},{"$f":"'FEUILLE FAB'!AJ28&\"\"","v":""},{"$f":"'FEUILLE FAB'!AK28&\"\"","v":""},{"$f":"'FEUILLE FAB'!AL28&\"\"","v":""},{"$f":"'FEUILLE FAB'!AM28&\"\"","v":""},{"$f":"'FEUILLE FAB'!AN28&\"\"","v":""},{"$f":"'FEUILLE FAB'!AO28&\"\"","v":""},{"$f":"'FEUILLE FAB'!AP28&\"\"","v":""},{"$f":"'FEUILLE FAB'!AQ28&\"\"","v":""},{"$f":"'FEUILLE FAB'!AR28&\"\"","v":""},{"$f":"'FEUILLE FAB'!AS28&\"\"","v":""},{"$f":"'FEUILLE FAB'!AT28&\"\"","v":""}]
[{"$f":"'FEUILLE FAB'!A29","v":""},{"$f":"'FEUILLE FAB'!B29","v":0},{"$f":"'FEUILLE FAB'!C29&\"\"","v":""},{"$f":"'FEUILLE FAB'!D29&\"\"","v":""},{"$f":"'FEUILLE FAB'!E29&\"\"","v":""},{"$f":"'FEUILLE FAB'!F29&\"\"","v":""},{"$f":"'FEUILLE FAB'!G29&\"\"","v":""},{"$f":"'FEUILLE FAB'!H29&\"\"","v":""},{"$f":"'FEUILLE FAB'!I29&\"\"","v":""},{"$f":"'FEUILLE FAB'!J29&\"\"","v":""},{"$f":"'FEUILLE FAB'!K29&\"\"","v":""},{"$f":"'FEUILLE FAB'!L29&\"\"","v":""},{"$f":"'FEUILLE FAB'!M29&\"\"","v":""},{"$f":"'FEUILLE FAB'!N29&\"\"","v":""},{"$f":"'FEUILLE FAB'!O29&\"\"","v":""},{"$f":"'FEUILLE FAB'!P29&\"\"","v":""},{"$f":"'FEUILLE FAB'!Q29&\"\"","v":""},{"$f":"'FEUILLE FAB'!R29&\"\"","v":""},{"$f":"'FEUILLE FAB'!S29&\"\"","v":""},{"$f":"'FEUILLE FAB'!T29&\"\"","v":""},{"$f":"'FEUILLE FAB'!U29&\"\"","v":""},{"$f":"'FEUILLE FAB'!V29&\"\"","v":""},{"$f":"'FEUILLE FAB'!W29&\"\"","v":""},{"$f":"'FEUILLE FAB'!X29&\"\"","v":""},{"$f":"'FEUILLE FAB'!Y29&\"\"","v":""},{"$f":"'FEUILLE FAB'!Z29&\"\"","v":""},{"$f":"'FEUILLE FAB'!AA29&\"\"","v":""},{"$f":"'FEUILLE FAB'!AB29&\"\"","v":""},{"$f":"'FEUILLE FAB'!AC29&\"\"","v":""},{"$f":"'FEUILLE FAB'!AD29&\"\"","v":""},{"$f":"'FEUILLE FAB'!AE29&\"\"","v":""},{"$f":"'FEUILLE FAB'!AF29&\"\"","v":""},{"$f":"'FEUILLE FAB'!AG29&\"\"","v":""},{"$f":"'FEUILLE FAB'!AH29&\"\"","v":""},{"$f":"'FEUILLE FAB'!AI29&\"\"","v":""},{"$f":"'FEUILLE FAB'!AJ29&\"\"","v":""},{"$f":"'FEUILLE FAB'!AK29&\"\"","v":""},{"$f":"'FEUILLE FAB'!AL29&\"\"","v":""},{"$f":"'FEUILLE FAB'!AM29&\"\"","v":""},{"$f":"'FEUILLE FAB'!AN29&\"\"","v":""},{"$f":"'FEUILLE FAB'!AO29&\"\"","v":""},{"$f":"'FEUILLE FAB'!AP29&\"\"","v":""},{"$f":"'FEUILLE FAB'!AQ29&\"\"","v":""},{"$f":"'FEUILLE FAB'!AR29&\"\"","v":""},{"$f":"'FEUILLE FAB'!AS29&\"\"","v":""},{"$f":"'FEUILLE FAB'!AT29&\"\"","v":""}]
[{"$f":"'FEUILLE FAB'!A30","v":""},{"$f":"'FEUILLE FAB'!B30","v":0},{"$f":"'FEUILLE FAB'!C30&\"\"","v":""},{"$f":"'FEUILLE FAB'!D30&\"\"","v":""},{"$f":"'FEUILLE FAB'!E30&\"\"","v":""},{"$f":"'FEUILLE FAB'!F30&\"\"","v":""},{"$f":"'FEUILLE FAB'!G30&\"\"","v":""},{"$f":"'FEUILLE FAB'!H30&\"\"","v":""},{"$f":"'FEUILLE FAB'!I30&\"\"","v":""},{"$f":"'FEUILLE FAB'!J30&\"\"","v":""},{"$f":"'FEUILLE FAB'!K30&\"\"","v":""},{"$f":"'FEUILLE FAB'!L30&\"\"","v":""},{"$f":"'FEUILLE FAB'!M30&\"\"","v":""},{"$f":"'FEUILLE FAB'!N30&\"\"","v":""},{"$f":"'FEUILLE FAB'!O30&\"\"","v":""},{"$f":"'FEUILLE FAB'!P30&\"\"","v":""},{"$f":"'FEUILLE FAB'!Q30&\"\"","v":""},{"$f":"'FEUILLE FAB'!R30&\"\"","v":""},{"$f":"'FEUILLE FAB'!S30&\"\"","v":""},{"$f":"'FEUILLE FAB'!T30&\"\"","v":""},{"$f":"'FEUILLE FAB'!U30&\"\"","v":""},{"$f":"'FEUILLE FAB'!V30&\"\"","v":""},{"$f":"'FEUILLE FAB'!W30&\"\"","v":""},{"$f":"'FEUILLE FAB'!X30&\"\"","v":""},{"$f":"'FEUILLE FAB'!Y30&\"\"","v":""},{"$f":"'FEUILLE FAB'!Z30&\"\"","v":""},{"$f":"'FEUILLE FAB'!AA30&\"\"","v":""},{"$f":"'FEUILLE FAB'!AB30&\"\"","v":""},{"$f":"'FEUILLE FAB'!AC30&\"\"","v":""},{"$f":"'FEUILLE FAB'!AD30&\"\"","v":""},{"$f":"'FEUILLE FAB'!AE30&\"\"","v":""},{"$f":"'FEUILLE FAB'!AF30&\"\"","v":""},{"$f":"'FEUILLE FAB'!AG30&\"\"","v":""},{"$f":"'FEUILLE FAB'!AH30&\"\"","v":""},{"$f":"'FEUILLE FAB'!AI30&\"\"","v":""},{"$f":"'FEUILLE FAB'!AJ30&\"\"","v":""},{"$f":"'FEUILLE FAB'!AK30&\"\"","v":""},{"$f":"'FEUILLE FAB'!AL30&\"\"","v":""},{"$f":"'FEUILLE FAB'!AM30&\"\"","v":""},{"$f":"'FEUILLE FAB'!AN30&\"\"","v":""},{"$f":"'FEUILLE FAB'!AO30&\"\"","v":""},{"$f":"'FEUILLE FAB'!AP30&\"\"","v":""},{"$f":"'FEUILLE FAB'!AQ30&\"\"","v":""},{"$f":"'FEUILLE FAB'!AR30&\"\"","v":""},{"$f":"'FEUILLE FAB'!AS30&\"\"","v":""},{"$f":"'FEUILLE FAB'!AT30&\"\"","v":""}]
[{"$f":"'FEUILLE FAB'!A31","v":""},{"$f":"'FEUILLE FAB'!B31","v":0},{"$f":"'FEUILLE FAB'!C31&\"\"","v":""},{"$f":"'FEUILLE FAB'!D31&\"\"","v":""},{"$f":"'FEUILLE FAB'!E31&\"\"","v":""},{"$f":"'FEUILLE FAB'!F31&\"\"","v":""},{"$f":"'FEUILLE FAB'!G31&\"\"","v":""},{"$f":"'FEUILLE FAB'!H31&\"\"","v":""},{"$f":"'FEUILLE FAB'!I31&\"\"","v":""},{"$f":"'FEUILLE FAB'!J31&\"\"","v":""},{"$f":"'FEUILLE FAB'!K31&\"\"","v":""},{"$f":"'FEUILLE FAB'!L31&\"\"","v":""},{"$f":"'FEUILLE FAB'!M31&\"\"","v":""},{"$f":"'FEUILLE FAB'!N31&\"\"","v":""},{"$f":"'FEUILLE FAB'!O31&\"\"","v":""},{"$f":"'FEUILLE FAB'!P31&\"\"","v":""},{"$f":"'FEUILLE FAB'!Q31&\"\"","v":""},{"$f":"'FEUILLE FAB'!R31&\"\"","v":""},{"$f":"'FEUILLE FAB'!S31&\"\"","v":""},{"$f":"'FEUILLE FAB'!T31&\"\"","v":""},{"$f":"'FEUILLE FAB'!U31&\"\"","v":""},{"$f":"'FEUILLE FAB'!V31&\"\"","v":""},{"$f":"'FEUILLE FAB'!W31&\"\"","v":""},{"$f":"'FEUILLE FAB'!X31&\"\"","v":""},{"$f":"'FEUILLE FAB'!Y31&\"\"","v":""},{"$f":"'FEUILLE FAB'!Z31&\"\"","v":""},{"$f":"'FEUILLE FAB'!AA31&\"\"","v":""},{"$f":"'FEUILLE FAB'!AB31&\"\"","v":""},{"$f":"'FEUILLE FAB'!AC31&\"\"","v":""},{"$f":"'FEUILLE FAB'!AD31&\"\"","v":""},{"$f":"'FEUILLE FAB'!AE31&\"\"","v":""},{"$f":"'FEUILLE FAB'!AF31&\"\"","v":""},{"$f":"'FEUILLE FAB'!AG31&\"\"","v":""},{"$f":"'FEUILLE FAB'!AH31&\"\"","v":""},{"$f":"'FEUILLE FAB'!AI31&\"\"","v":""},{"$f":"'FEUILLE FAB'!AJ31&\"\"","v":""},{"$f":"'FEUILLE FAB'!AK31&\"\"","v":""},{"$f":"'FEUILLE FAB'!AL31&\"\"","v":""},{"$f":"'FEUILLE FAB'!AM31&\"\"","v":""},{"$f":"'FEUILLE FAB'!AN31&\"\"","v":""},{"$f":"'FEUILLE FAB'!AO31&\"\"","v":""},{"$f":"'FEUILLE FAB'!AP31&\"\"","v":""},{"$f":"'FEUILLE FAB'!AQ31&\"\"","v":""},{"$f":"'FEUILLE FAB'!AR31&\"\"","v":""},{"$f":"'FEUILLE FAB'!AS31&\"\"","v":""},{"$f":"'FEUILLE FAB'!AT31&\"\"","v":""}]
[{"$f":"'FEUILLE FAB'!A32","v":""},{"$f":"'FEUILLE FAB'!B32","v":0},{"$f":"'FEUILLE FAB'!C32&\"\"","v":""},{"$f":"'FEUILLE FAB'!D32&\"\"","v":""},{"$f":"'FEUILLE FAB'!E32&\"\"","v":""},{"$f":"'FEUILLE FAB'!F32&\"\"","v":""},{"$f":"'FEUILLE FAB'!G32&\"\"","v":""},{"$f":"'FEUILLE FAB'!H32&\"\"","v":""},{"$f":"'FEUILLE FAB'!I32&\"\"","v":""},{"$f":"'FEUILLE FAB'!J32&\"\"","v":""},{"$f":"'FEUILLE FAB'!K32&\"\"","v":""},{"$f":"'FEUILLE FAB'!L32&\"\"","v":""},{"$f":"'FEUILLE FAB'!M32&\"\"","v":""},{"$f":"'FEUILLE FAB'!N32&\"\"","v":""},{"$f":"'FEUILLE FAB'!O32&\"\"","v":""},{"$f":"'FEUILLE FAB'!P32&\"\"","v":""},{"$f":"'FEUILLE FAB'!Q32&\"\"","v":""},{"$f":"'FEUILLE FAB'!R32&\"\"","v":""},{"$f":"'FEUILLE FAB'!S32&\"\"","v":""},{"$f":"'FEUILLE FAB'!T32&\"\"","v":""},{"$f":"'FEUILLE FAB'!U32&\"\"","v":""},{"$f":"'FEUILLE FAB'!V32&\"\"","v":""},{"$f":"'FEUILLE FAB'!W32&\"\"","v":""},{"$f":"'FEUILLE FAB'!X32&\"\"","v":""},{"$f":"'FEUILLE FAB'!Y32&\"\"","v":""},{"$f":"'FEUILLE FAB'!Z32&\"\"","v":""},{"$f":"'FEUILLE FAB'!AA32&\"\"","v":""},{"$f":"'FEUILLE FAB'!AB32&\"\"","v":""},{"$f":"'FEUILLE FAB'!AC32&\"\"","v":""},{"$f":"'FEUILLE FAB'!AD32&\"\"","v":""},{"$f":"'FEUILLE FAB'!AE32&\"\"","v":""},{"$f":"'FEUILLE FAB'!AF32&\"\"","v":""},{"$f":"'FEUILLE FAB'!AG32&\"\"","v":""},{"$f":"'FEUILLE FAB'!AH32&\"\"","v":""},{"$f":"'FEUILLE FAB'!AI32&\"\"","v":""},{"$f":"'FEUILLE FAB'!AJ32&\"\"","v":""},{"$f":"'FEUILLE FAB'!AK32&\"\"","v":""},{"$f":"'FEUILLE FAB'!AL32&\"\"","v":""},{"$f":"'FEUILLE FAB'!AM32&\"\"","v":""},{"$f":"'FEUILLE FAB'!AN32&\"\"","v":""},{"$f":"'FEUILLE FAB'!AO32&\"\"","v":""},{"$f":"'FEUILLE FAB'!AP32&\"\"","v":""},{"$f":"'FEUILLE FAB'!AQ32&\"\"","v":""},{"$f":"'FEUILLE FAB'!AR32&\"\"","v":""},{"$f":"'FEUILLE FAB'!AS32&\"\"","v":""},{"$f":"'FEUILLE FAB'!AT32&\"\"","v":""}]
[{"$f":"'FEUILLE FAB'!A33","v":""},{"$f":"'FEUILLE FAB'!B33","v":0},{"$f":"'FEUILLE FAB'!C33&\"\"","v":""},{"$f":"'FEUILLE FAB'!D33&\"\"","v":""},{"$f":"'FEUILLE FAB'!E33&\"\"","v":""},{"$f":"'FEUILLE FAB'!F33&\"\"","v":""},{"$f":"'FEUILLE FAB'!G33&\"\"","v":""},{"$f":"'FEUILLE FAB'!H33&\"\"","v":""},{"$f":"'FEUILLE FAB'!I33&\"\"","v":""},{"$f":"'FEUILLE FAB'!J33&\"\"","v":""},{"$f":"'FEUILLE FAB'!K33&\"\"","v":""},{"$f":"'FEUILLE FAB'!L33&\"\"","v":""},{"$f":"'FEUILLE FAB'!M33&\"\"","v":""},{"$f":"'FEUILLE FAB'!N33&\"\"","v":""},{"$f":"'FEUILLE FAB'!O33&\"\"","v":""},{"$f":"'FEUILLE FAB'!P33&\"\"","v":""},{"$f":"'FEUILLE FAB'!Q33&\"\"","v":""},{"$f":"'FEUILLE FAB'!R33&\"\"","v":""},{"$f":"'FEUILLE FAB'!S33&\"\"","v":""},{"$f":"'FEUILLE FAB'!T33&\"\"","v":""},{"$f":"'FEUILLE FAB'!U33&\"\"","v":""},{"$f":"'FEUILLE FAB'!V33&\"\"","v":""},{"$f":"'FEUILLE FAB'!W33&\"\"","v":""},{"$f":"'FEUILLE FAB'!X33&\"\"","v":""},{"$f":"'FEUILLE FAB'!Y33&\"\"","v":""},{"$f":"'FEUILLE FAB'!Z33&\"\"","v":""},{"$f":"'FEUILLE FAB'!AA33&\"\"","v":""},{"$f":"'FEUILLE FAB'!AB33&\"\"","v":""},{"$f":"'FEUILLE FAB'!AC33&\"\"","v":""},{"$f":"'FEUILLE FAB'!AD33&\"\"","v":""},{"$f":"'FEUILLE FAB'!AE33&\"\"","v":""},{"$f":"'FEUILLE FAB'!AF33&\"\"","v":""},{"$f":"'FEUILLE FAB'!AG33&\"\"","v":""},{"$f":"'FEUILLE FAB'!AH33&\"\"","v":""},{"$f":"'FEUILLE FAB'!AI33&\"\"","v":""},{"$f":"'FEUILLE FAB'!AJ33&\"\"","v":""},{"$f":"'FEUILLE FAB'!AK33&\"\"","v":""},{"$f":"'FEUILLE FAB'!AL33&\"\"","v":""},{"$f":"'FEUILLE FAB'!AM33&\"\"","v":""},{"$f":"'FEUILLE FAB'!AN33&\"\"","v":""},{"$f":"'FEUILLE FAB'!AO33&\"\"","v":""},{"$f":"'FEUILLE FAB'!AP33&\"\"","v":""},{"$f":"'FEUILLE FAB'!AQ33&\"\"","v":""},{"$f":"'FEUILLE FAB'!AR33&\"\"","v":""},{"$f":"'FEUILLE FAB'!AS33&\"\"","v":""},{"$f":"'FEUILLE FAB'!AT33&\"\"","v":""}]
[{"$f":"'FEUILLE FAB'!A34","v":"POMME"},{"$f":"'FEUILLE FAB'!B34","v":4},{"$f":"'FEUILLE FAB'!C34&\"\"","v":""},{"$f":"'FEUILLE FAB'!D34&\"\"","v":""},{"$f":"'FEUILLE FAB'!E34&\"\"","v":""},{"$f":"'FEUILLE FAB'!F34&\"\"","v":""},{"$f":"'FEUILLE FAB'!G34&\"\"","v":""},{"$f":"'FEUILLE FAB'!H34&\"\"","v":""},{"$f":"'FEUILLE FAB'!I34&\"\"","v":""},{"$f":"'FEUILLE FAB'!J34&\"\"","v":"4"},{"$f":"'FEUILLE FAB'!K34&\"\"","v":""},{"$f":"'FEUILLE FAB'!L34&\"\"","v":""},{"$f":"'FEUILLE FAB'!M34&\"\"","v":""},{"$f":"'FEUILLE FAB'!N34&\"\"","v":""},{"$f":"'FEUILLE FAB'!O34&\"\"","v":""},{"$f":"'FEUILLE FAB'!P34&\"\"","v":""},{"$f":"'FEUILLE FAB'!Q34&\"\"","v":""},{"$f":"'FEUILLE FAB'!R34&\"\"","v":""},{"$f":"'FEUILLE FAB'!S34&\"\"","v":""},{"$f":"'FEUILLE FAB'!T34&\"\"","v":""},{"$f":"'FEUILLE FAB'!U34&\"\"","v":""},{"$f":"'FEUILLE FAB'!V34&\"\"","v":""},{"$f":"'FEUILLE FAB'!W34&\"\"","v":""},{"$f":"'FEUILLE FAB'!X34&\"\"","v":""},{"$f":"'FEUILLE FAB'!Y34&\"\"","v":""},{"$f":"'FEUILLE FAB'!Z34&\"\"","v":""},{"$f":"'FEUILLE FAB'!AA34&\"\"","v":""},{"$f":"'FEUILLE FAB'!AB34&\"\"","v":""},{"$f":"'FEUILLE FAB'!AC34&\"\"","v":""},{"$f":"'FEUILLE FAB'!AD34&\"\"","v":""},{"$f":"'FEUILLE FAB'!AE34&\"\"","v":""},{"$f":"'FEUILLE FAB'!AF34&\"\"","v":""},{"$f":"'FEUILLE FAB'!AG34&\"\"","v":""},{"$f":"'FEUILLE FAB'!AH34&\"\"","v":""},{"$f":"'FEUILLE FAB'!AI34&\"\"","v":""},{"$f":"'FEUILLE FAB'!AJ34&\"\"","v":""},{"$f":"'FEUILLE FAB'!AK34&\"\"","v":""},{"$f":"'FEUILLE FAB'!AL34&\"\"","v":""},{"$f":"'FEUILLE FAB'!AM34&\"\"","v":""},{"$f":"'FEUILLE FAB'!AN34&\"\"","v":""},{"$f":"'FEUILLE FAB'!AO34&\"\"","v":""},{"$f":"'FEUILLE FAB'!AP34&\"\"","v":""},{"$f":"'FEUILLE FAB'!AQ34&\"\"","v":""},{"$f":"'FEUILLE FAB'!AR34&\"\"","v":""},{"$f":"'FEUILLE FAB'!AS34&\"\"","v":""},{"$f":"'FEUILLE FAB'!AT34&\"\"","v":""}]
[{"$f":"'FEUILLE FAB'!A35","v":"TOMATE VINAIGRETTE"},{"$f":"'FEUILLE FAB'!B35","v":13},{"$f":"'FEUILLE FAB'!C35&\"\"","v":""},{"$f":"'FEUILLE FAB'!D35&\"\"","v":""},{"$f":"'FEUILLE FAB'!E35&\"\"","v":""},{"$f":"'FEUILLE FAB'!F35&\"\"","v":"2"},{"$f":"'FEUILLE FAB'!G35&\"\"","v":"5"},{"$f":"'FEUILLE FAB'!H35&\"\"","v":"1"},{"$f":"'FEUILLE FAB'!I35&\"\"","v":"2"},{"$f":"'FEUILLE FAB'!J35&\"\"","v":"3"},{"$f":"'FEUILLE FAB'!K35&\"\"","v":""},{"$f":"'FEUILLE FAB'!L35&\"\"","v":""},{"$f":"'FEUILLE FAB'!M35&\"\"","v":""},{"$f":"'FEUILLE FAB'!N35&\"\"","v":""},{"$f":"'FEUILLE FAB'!O35&\"\"","v":""},{"$f":"'FEUILLE FAB'!P35&\"\"","v":""},{"$f":"'FEUILLE FAB'!Q35&\"\"","v":""},{"$f":"'FEUILLE FAB'!R35&\"\"","v":""},{"$f":"'FEUILLE FAB'!S35&\"\"","v":""},{"$f":"'FEUILLE FAB'!T35&\"\"","v":""},{"$f":"'FEUILLE FAB'!U35&\"\"","v":""},{"$f":"'FEUILLE FAB'!V35&\"\"","v":""},{"$f":"'FEUILLE FAB'!W35&\"\"","v":""},{"$f":"'FEUILLE FAB'!X35&\"\"","v":""},{"$f":"'FEUILLE FAB'!Y35&\"\"","v":""},{"$f":"'FEUILLE FAB'!Z35&\"\"","v":""},{"$f":"'FEUILLE FAB'!AA35&\"\"","v":""},{"$f":"'FEUILLE FAB'!AB35&\"\"","v":""},{"$f":"'FEUILLE FAB'!AC35&\"\"","v":""},{"$f":"'FEUILLE FAB'!AD35&\"\"","v":""},{"$f":"'FEUILLE FAB'!AE35&\"\"","v":""},{"$f":"'FEUILLE FAB'!AF35&\"\"","v":""},{"$f":"'FEUILLE FAB'!AG35&\"\"","v":""},{"$f":"'FEUILLE FAB'!AH35&\"\"","v":""},{"$f":"'FEUILLE FAB'!AI35&\"\"","v":""},{"$f":"'FEUILLE FAB'!AJ35&\"\"","v":""},{"$f":"'FEUILLE FAB'!AK35&\"\"","v":""},{"$f":"'FEUILLE FAB'!AL35&\"\"","v":""},{"$f":"'FEUILLE FAB'!AM35&\"\"","v":""},{"$f":"'FEUILLE FAB'!AN35&\"\"","v":""},{"$f":"'FEUILLE FAB'!AO35&\"\"","v":""},{"$f":"'FEUILLE FAB'!AP35&\"\"","v":""},{"$f":"'FEUILLE FAB'!AQ35&\"\"","v":""},{"$f":"'FEUILLE FAB'!AR35&\"\"","v":""},{"$f":"'FEUILLE FAB'!AS35&\"\"","v":""},{"$f":"'FEUILLE FAB'!AT35&\"\"","v":""}]
[{"$f":"'FEUILLE FAB'!A36","v":"BŒUF BOURGUIGNON SANS LARDONS"},{"$f":"'FEUILLE FAB'!B36","v":13},{"$f":"'FEUILLE FAB'!C36&\"\"","v":""},{"$f":"'FEUILLE FAB'!D36&\"\"","v":""},{"$f":"'FEUILLE FAB'!E36&\"\"","v":""},{"$f":"'FEUILLE FAB'!F36&\"\"","v":"2"},{"$f":"'FEUILLE FAB'!G36&\"\"","v":"5"},{"$f":"'FEUILLE FAB'!H36&\"\"","v":"1"},{"$f":"'FEUILLE FAB'!I36&\"\"","v":"2"},{"$f":"'FEUILLE FAB'!J36&\"\"","v":"3"},{"$f":"'FEUILLE FAB'!K36&\"\"","v":""},{"$f":"'FEUILLE FAB'!L36&\"\"","v":""},{"$f":"'FEUILLE FAB'!M36&\"\"","v":""},{"$f":"'FEUILLE FAB'!N36&\"\"","v":""},{"$f":"'FEUILLE FAB'!O36&\"\"","v":""},{"$f":"'FEUILLE FAB'!P36&\"\"","v":""},{"$f":"'FEUILLE FAB'!Q36&\"\"","v":""},{"$f":"'FEUILLE FAB'!R36&\"\"","v":""},{"$f":"'FEUILLE FAB'!S36&\"\"","v":""},{"$f":"'FEUILLE FAB'!T36&\"\"","v":""},{"$f":"'FEUILLE FAB'!U36&\"\"","v":""},{"$f":"'FEUILLE FAB'!V36&\"\"","v":""},{"$f":"'FEUILLE FAB'!W36&\"\"","v":""},{"$f":"'FEUILLE FAB'!X36&\"\"","v":""},{"$f":"'FEUILLE FAB'!Y36&\"\"","v":""},{"$f":"'FEUILLE FAB'!Z36&\"\"","v":""},{"$f":"'FEUILLE FAB'!AA36&\"\"","v":""},{"$f":"'FEUILLE FAB'!AB36&\"\"","v":""},{"$f":"'FEUILLE FAB'!AC36&\"\"","v":""},{"$f":"'FEUILLE FAB'!AD36&\"\"","v":""},{"$f":"'FEUILLE FAB'!AE36&\"\"","v":""},{"$f":"'FEUILLE FAB'!AF36&\"\"","v":""},{"$f":"'FEUILLE FAB'!AG36&\"\"","v":""},{"$f":"'FEUILLE FAB'!AH36&\"\"","v":""},{"$f":"'FEUILLE FAB'!AI36&\"\"","v":""},{"$f":"'FEUILLE FAB'!AJ36&\"\"","v":""},{"$f":"'FEUILLE FAB'!AK36&\"\"","v":""},{"$f":"'FEUILLE FAB'!AL36&\"\"","v":""},{"$f":"'FEUILLE FAB'!AM36&\"\"","v":""},{"$f":"'FEUILLE FAB'!AN36&\"\"","v":""},{"$f":"'FEUILLE FAB'!AO36&\"\"","v":""},{"$f":"'FEUILLE FAB'!AP36&\"\"","v":""},{"$f":"'FEUILLE FAB'!AQ36&\"\"","v":""},{"$f":"'FEUILLE FAB'!AR36&\"\"","v":""},{"$f":"'FEUILLE FAB'!AS36&\"\"","v":""},{"$f":"'FEUILLE FAB'!AT36&\"\"","v":""}]
[{"$f":"'FEUILLE FAB'!A37","v":""},{"$f":"'FEUILLE FAB'!B37","v":0},{"$f":"'FEUILLE FAB'!C37&\"\"","v":""},{"$f":"'FEUILLE FAB'!D37&\"\"","v":""},{"$f":"'FEUILLE FAB'!E37&\"\"","v":""},{"$f":"'FEUILLE FAB'!F37&\"\"","v":""},{"$f":"'FEUILLE FAB'!G37&\"\"","v":""},{"$f":"'FEUILLE FAB'!H37&\"\"","v":""},{"$f":"'FEUILLE FAB'!I37&\"\"","v":""},{"$f":"'FEUILLE FAB'!J37&\"\"","v":""},{"$f":"'FEUILLE FAB'!K37&\"\"","v":""},{"$f":"'FEUILLE FAB'!L37&\"\"","v":""},{"$f":"'FEUILLE FAB'!M37&\"\"","v":""},{"$f":"'FEUILLE FAB'!N37&\"\"","v":""},{"$f":"'FEUILLE FAB'!O37&\"\"","v":""},{"$f":"'FEUILLE FAB'!P37&\"\"","v":""},{"$f":"'FEUILLE FAB'!Q37&\"\"","v":""},{"$f":"'FEUILLE FAB'!R37&\"\"","v":""},{"$f":"'FEUILLE FAB'!S37&\"\"","v":""},{"$f":"'FEUILLE FAB'!T37&\"\"","v":""},{"$f":"'FEUILLE FAB'!U37&\"\"","v":""},{"$f":"'FEUILLE FAB'!V37&\"\"","v":""},{"$f":"'FEUILLE FAB'!W37&\"\"","v":""},{"$f":"'FEUILLE FAB'!X37&\"\"","v":""},{"$f":"'FEUILLE FAB'!Y37&\"\"","v":""},{"$f":"'FEUILLE FAB'!Z37&\"\"","v":""},{"$f":"'FEUILLE FAB'!AA37&\"\"","v":""},{"$f":"'FEUILLE FAB'!AB37&\"\"","v":""},{"$f":"'FEUILLE FAB'!AC37&\"\"","v":""},{"$f":"'FEUILLE FAB'!AD37&\"\"","v":""},{"$f":"'FEUILLE FAB'!AE37&\"\"","v":""},{"$f":"'FEUILLE FAB'!AF37&\"\"","v":""},{"$f":"'FEUILLE FAB'!AG37&\"\"","v":""},{"$f":"'FEUILLE FAB'!AH37&\"\"","v":""},{"$f":"'FEUILLE FAB'!AI37&\"\"","v":""},{"$f":"'FEUILLE FAB'!AJ37&\"\"","v":""},{"$f":"'FEUILLE FAB'!AK37&\"\"","v":""},{"$f":"'FEUILLE FAB'!AL37&\"\"","v":""},{"$f":"'FEUILLE FAB'!AM37&\"\"","v":""},{"$f":"'FEUILLE FAB'!AN37&\"\"","v":""},{"$f":"'FEUILLE FAB'!AO37&\"\"","v":""},{"$f":"'FEUILLE FAB'!AP37&\"\"","v":""},{"$f":"'FEUILLE FAB'!AQ37&\"\"","v":""},{"$f":"'FEUILLE FAB'!AR37&\"\"","v":""},{"$f":"'FEUILLE FAB'!AS37&\"\"","v":""},{"$f":"'FEUILLE FAB'!AT37&\"\"","v":""}]
[{"$f":"'FEUILLE FAB'!A38","v":"YAOURT"},{"$f":"'FEUILLE FAB'!B38","v":13},{"$f":"'FEUILLE FAB'!C38&\"\"","v":""},{"$f":"'FEUILLE FAB'!D38&\"\"","v":""},{"$f":"'FEUILLE FAB'!E38&\"\"","v":""},{"$f":"'FEUILLE FAB'!F38&\"\"","v":"2"},{"$f":"'FEUILLE FAB'!G38&\"\"","v":"5"},{"$f":"'FEUILLE FAB'!H38&\"\"","v":"1"},{"$f":"'FEUILLE FAB'!I38&\"\"","v":"2"},{"$f":"'FEUILLE FAB'!J38&\"\"","v":"3"},{"$f":"'FEUILLE FAB'!K38&\"\"","v":""},{"$f":"'FEUILLE FAB'!L38&\"\"","v":""},{"$f":"'FEUILLE FAB'!M38&\"\"","v":""},{"$f":"'FEUILLE FAB'!N38&\"\"","v":""},{"$f":"'FEUILLE FAB'!O38&\"\"","v":""},{"$f":"'FEUILLE FAB'!P38&\"\"","v":""},{"$f":"'FEUILLE FAB'!Q38&\"\"","v":""},{"$f":"'FEUILLE FAB'!R38&\"\"","v":""},{"$f":"'FEUILLE FAB'!S38&\"\"","v":""},{"$f":"'FEUILLE FAB'!T38&\"\"","v":""},{"$f":"'FEUILLE FAB'!U38&\"\"","v":""},{"$f":"'FEUILLE FAB'!V38&\"\"","v":""},{"$f":"'FEUILLE FAB'!W38&\"\"","v":""},{"$f":"'FEUILLE FAB'!X38&\"\"","v":""},{"$f":"'FEUILLE FAB'!Y38&\"\"","v":""},{"$f":"'FEUILLE FAB'!Z38&\"\"","v":""},{"$f":"'FEUILLE FAB'!AA38&\"\"","v":""},{"$f":"'FEUILLE FAB'!AB38&\"\"","v":""},{"$f":"'FEUILLE FAB'!AC38&\"\"","v":""},{"$f":"'FEUILLE FAB'!AD38&\"\"","v":""},{"$f":"'FEUILLE FAB'!AE38&\"\"","v":""},{"$f":"'FEUILLE FAB'!AF38&\"\"","v":""},{"$f":"'FEUILLE FAB'!AG38&\"\"","v":""},{"$f":"'FEUILLE FAB'!AH38&\"\"","v":""},{"$f":"'FEUILLE FAB'!AI38&\"\"","v":""},{"$f":"'FEUILLE FAB'!AJ38&\"\"","v":""},{"$f":"'FEUILLE FAB'!AK38&\"\"","v":""},{"$f":"'FEUILLE FAB'!AL38&\"\"","v":""},{"$f":"'FEUILLE FAB'!AM38&\"\"","v":""},{"$f":"'FEUILLE FAB'!AN38&\"\"","v":""},{"$f":"'FEUILLE FAB'!AO38&\"\"","v":""},{"$f":"'FEUILLE FAB'!AP38&\"\"","v":""},{"$f":"'FEUILLE FAB'!AQ38&\"\"","v":""},{"$f":"'FEUILLE FAB'!AR38&\"\"","v":""},{"$f":"'FEUILLE FAB'!AS38&\"\"","v":""},{"$f":"'FEUILLE FAB'!AT38&\"\"","v":""}]
[{"$f":"'FEUILLE FAB'!A39","v":"POMME"},{"$f":"'FEUILLE FAB'!B39","v":13},{"$f":"'FEUILLE FAB'!C39&\"\"","v":""},{"$f":"'FEUILLE FAB'!D39&\"\"","v":""},{"$f":"'FEUILLE FAB'!E39&\"\"","v":""},{"$f":"'FEUILLE FAB'!F39&\"\"","v":"2"},{"$f":"'FEUILLE FAB'!G39&\"\"","v":"5"},{"$f":"'FEUILLE FAB'!H39&\"\"","v":"1"},{"$f":"'FEUILLE FAB'!I39&\"\"","v":"2"},{"$f":"'FEUILLE FAB'!J39&\"\"","v":"3"},{"$f":"'FEUILLE FAB'!K39&\"\"","v":""},{"$f":"'FEUILLE FAB'!L39&\"\"","v":""},{"$f":"'FEUILLE FAB'!M39&\"\"","v":""},{"$f":"'FEUILLE FAB'!N39&\"\"","v":""},{"$f":"'FEUILLE FAB'!O39&\"\"","v":""},{"$f":"'FEUILLE FAB'!P39&\"\"","v":""},{"$f":"'FEUILLE FAB'!Q39&\"\"","v":""},{"$f":"'FEUILLE FAB'!R39&\"\"","v":""},{"$f":"'FEUILLE FAB'!S39&\"\"","v":""},{"$f":"'FEUILLE FAB'!T39&\"\"","v":""},{"$f":"'FEUILLE FAB'!U39&\"\"","v":""},{"$f":"'FEUILLE FAB'!V39&\"\"","v":""},{"$f":"'FEUILLE FAB'!W39&\"\"","v":""},{"$f":"'FEUILLE FAB'!X39&\"\"","v":""},{"$f":"'FEUILLE FAB'!Y39&\"\"","v":""},{"$f":"'FEUILLE FAB'!Z39&\"\"","v":""},{"$f":"'FEUILLE FAB'!AA39&\"\"","v":""},{"$f":"'FEUILLE FAB'!AB39&\"\"","v":""},{"$f":"'FEUILLE FAB'!AC39&\"\"","v":""},{"$f":"'FEUILLE FAB'!AD39&\"\"","v":""},{"$f":"'FEUILLE FAB'!AE39&\"\"","v":""},{"$f":"'FEUILLE FAB'!AF39&\"\"","v":""},{"$f":"'FEUILLE FAB'!AG39&\"\"","v":""},{"$f":"'FEUILLE FAB'!AH39&\"\"","v":""},{"$f":"'FEUILLE FAB'!AI39&\"\"","v":""},{"$f":"'FEUILLE FAB'!AJ39&\"\"","v":""},{"$f":"'FEUILLE FAB'!AK39&\"\"","v":""},{"$f":"'FEUILLE FAB'!AL39&\"\"","v":""},{"$f":"'FEUILLE FAB'!AM39&\"\"","v":""},{"$f":"'FEUILLE FAB'!AN39&\"\"","v":""},{"$f":"'FEUILLE FAB'!AO39&\"\"","v":""},{"$f":"'FEUILLE FAB'!AP39&\"\"","v":""},{"$f":"'FEUILLE FAB'!AQ39&\"\"","v":""},{"$f":"'FEUILLE FAB'!AR39&\"\"","v":""},{"$f":"'FEUILLE FAB'!AS39&\"\"","v":""},{"$f":"'FEUILLE FAB'!AT39&\"\"","v":""}]
[{"$f":"'FEUILLE FAB'!A40","v":"TOMATE VINAIGRETTE"},{"$f":"'FEUILLE FAB'!B40","v":6},{"$f":"'FEUILLE FAB'!C40&\"\"","v":""},{"$f":"'FEUILLE FAB'!D40&\"\"","v":""},{"$f":"'FEUILLE FAB'!E40&\"\"","v":""},{"$f":"'FEUILLE FAB'!F40&\"\"","v":""},{"$f":"'FEUILLE FAB'!G40&\"\"","v":"6"},{"$f":"'FEUILLE FAB'!H40&\"\"","v":""},{"$f":"'FEUILLE FAB'!I40&\"\"","v":""},{"$f":"'FEUILLE FAB'!J40&\"\"","v":""},{"$f":"'FEUILLE FAB'!K40&\"\"","v":""},{"$f":"'FEUILLE FAB'!L40&\"\"","v":""},{"$f":"'FEUILLE FAB'!M40&\"\"","v":""},{"$f":"'FEUILLE FAB'!N40&\"\"","v":""},{"$f":"'FEUILLE FAB'!O40&\"\"","v":""},{"$f":"'FEUILLE FAB'!P40&\"\"","v":""},{"$f":"'FEUILLE FAB'!Q40&\"\"","v":""},{"$f":"'FEUILLE FAB'!R40&\"\"","v":""},{"$f":"'FEUILLE FAB'!S40&\"\"","v":""},{"$f":"'FEUILLE FAB'!T40&\"\"","v":""},{"$f":"'FEUILLE FAB'!U40&\"\"","v":""},{"$f":"'FEUILLE FAB'!V40&\"\"","v":""},{"$f":"'FEUILLE FAB'!W40&\"\"","v":""},{"$f":"'FEUILLE FAB'!X40&\"\"","v":""},{"$f":"'FEUILLE FAB'!Y40&\"\"","v":""},{"$f":"'FEUILLE FAB'!Z40&\"\"","v":""},{"$f":"'FEUILLE FAB'!AA40&\"\"","v":""},{"$f":"'FEUILLE FAB'!AB40&\"\"","v":""},{"$f":"'FEUILLE FAB'!AC40&\"\"","v":""},{"$f":"'FEUILLE FAB'!AD40&\"\"","v":""},{"$f":"'FEUILLE FAB'!AE40&\"\"","v":""},{"$f":"'FEUILLE FAB'!AF40&\"\"","v":""},{"$f":"'FEUILLE FAB'!AG40&\"\"","v":""},{"$f":"'FEUILLE FAB'!AH40&\"\"","v":""},{"$f":"'FEUILLE FAB'!AI40&\"\"","v":""},{"$f":"'FEUILLE FAB'!AJ40&\"\"","v":""},{"$f":"'FEUILLE FAB'!AK40&\"\"","v":""},{"$f":"'FEUILLE FAB'!AL40&\"\"","v":""},{"$f":"'FEUILLE FAB'!AM40&\"\"","v":""},{"$f":"'FEUILLE FAB'!AN40&\"\"","v":""},{"$f":"'FEUILLE FAB'!AO40&\"\"","v":""},{"$f":"'FEUILLE FAB'!AP40&\"\"","v":""},{"$f":"'FEUILLE FAB'!AQ40&\"\"","v":""},{"$f":"'FEUILLE FAB'!AR40&\"\"","v":""},{"$f":"'FEUILLE FAB'!AS40&\"\"","v":""},{"$f":"'FEUILLE FAB'!AT40&\"\"","v":""}]
[{"$f":"'FEUILLE FAB'!A41","v":"BŒUF BOURGUIGNON SANS LARDONS"},{"$f":"'FEUILLE FAB'!B41","v":6},{"$f":"'FEUILLE FAB'!C41&\"\"","v":""},{"$f":"'FEUILLE FAB'!D41&\"\"","v":""},{"$f":"'FEUILLE FAB'!E41&\"\"","v":""},{"$f":"'FEUILLE FAB'!F41&\"\"","v":""},{"$f":"'FEUILLE FAB'!G41&\"\"","v":"6"},{"$f":"'FEUILLE FAB'!H41&\"\"","v":""},{"$f":"'FEUILLE FAB'!I41&\"\"","v":""},{"$f":"'FEUILLE FAB'!J41&\"\"","v":""},{"$f":"'FEUILLE FAB'!K41&\"\"","v":""},{"$f":"'FEUILLE FAB'!L41&\"\"","v":""},{"$f":"'FEUILLE FAB'!M41&\"\"","v":""},{"$f":"'FEUILLE FAB'!N41&\"\"","v":""},{"$f":"'FEUILLE FAB'!O41&\"\"","v":""},{"$f":"'FEUILLE FAB'!P41&\"\"","v":""},{"$f":"'FEUILLE FAB'!Q41&\"\"","v":""},{"$f":"'FEUILLE FAB'!R41&\"\"","v":""},{"$f":"'FEUILLE FAB'!S41&\"\"","v":""},{"$f":"'FEUILLE FAB'!T41&\"\"","v":""},{"$f":"'FEUILLE FAB'!U41&\"\"","v":""},{"$f":"'FEUILLE FAB'!V41&\"\"","v":""},{"$f":"'FEUILLE FAB'!W41&\"\"","v":""},{"$f":"'FEUILLE FAB'!X41&\"\"","v":""},{"$f":"'FEUILLE FAB'!Y41&\"\"","v":""},{"$f":"'FEUILLE FAB'!Z41&\"\"","v":""},{"$f":"'FEUILLE FAB'!AA41&\"\"","v":""},{"$f":"'FEUILLE FAB'!AB41&\"\"","v":""},{"$f":"'FEUILLE FAB'!AC41&\"\"","v":""},{"$f":"'FEUILLE FAB'!AD41&\"\"","v":""},{"$f":"'FEUILLE FAB'!AE41&\"\"","v":""},{"$f":"'FEUILLE FAB'!AF41&\"\"","v":""},{"$f":"'FEUILLE FAB'!AG41&\"\"","v":""},{"$f":"'FEUILLE FAB'!AH41&\"\"","v":""},{"$f":"'FEUILLE FAB'!AI41&\"\"","v":""},{"$f":"'FEUILLE FAB'!AJ41&\"\"","v":""},{"$f":"'FEUILLE FAB'!AK41&\"\"","v":""},{"$f":"'FEUILLE FAB'!AL41&\"\"","v":""},{"$f":"'FEUILLE FAB'!AM41&\"\"","v":""},{"$f":"'FEUILLE FAB'!AN41&\"\"","v":""},{"$f":"'FEUILLE FAB'!AO41&\"\"","v":""},{"$f":"'FEUILLE FAB'!AP41&\"\"","v":""},{"$f":"'FEUILLE FAB'!AQ41&\"\"","v":""},{"$f":"'FEUILLE FAB'!AR41&\"\"","v":""},{"$f":"'FEUILLE FAB'!AS41&\"\"","v":""},{"$f":"'FEUILLE FAB'!AT41&\"\"","v":""}]
[{"$f":"'FEUILLE FAB'!A42","v":""},{"$f":"'FEUILLE FAB'!B42","v":0},{"$f":"'FEUILLE FAB'!C42&\"\"","v":""},{"$f":"'FEUILLE FAB'!D42&\"\"","v":""},{"$f":"'FEUILLE FAB'!E42&\"\"","v":""},{"$f":"'FEUILLE FAB'!F42&\"\"","v":""},{"$f":"'FEUILLE FAB'!G42&\"\"","v":""},{"$f":"'FEUILLE FAB'!H42&\"\"","v":""},{"$f":"'FEUILLE FAB'!I42&\"\"","v":""},{"$f":"'FEUILLE FAB'!J42&\"\"","v":""},{"$f":"'FEUILLE FAB'!K42&\"\"","v":""},{"$f":"'FEUILLE FAB'!L42&\"\"","v":""},{"$f":"'FEUILLE FAB'!M42&\"\"","v":""},{"$f":"'FEUILLE FAB'!N42&\"\"","v":""},{"$f":"'FEUILLE FAB'!O42&\"\"","v":""},{"$f":"'FEUILLE FAB'!P42&\"\"","v":""},{"$f":"'FEUILLE FAB'!Q42&\"\"","v":""},{"$f":"'FEUILLE FAB'!R42&\"\"","v":""},{"$f":"'FEUILLE FAB'!S42&\"\"","v":""},{"$f":"'FEUILLE FAB'!T42&\"\"","v":""},{"$f":"'FEUILLE FAB'!U42&\"\"","v":""},{"$f":"'FEUILLE FAB'!V42&\"\"","v":""},{"$f":"'FEUILLE FAB'!W42&\"\"","v":""},{"$f":"'FEUILLE FAB'!X42&\"\"","v":""},{"$f":"'FEUILLE FAB'!Y42&\"\"","v":""},{"$f":"'FEUILLE FAB'!Z42&\"\"","v":""},{"$f":"'FEUILLE FAB'!AA42&\"\"","v":""},{"$f":"'FEUILLE FAB'!AB42&\"\"","v":""},{"$f":"'FEUILLE FAB'!AC42&\"\"","v":""},{"$f":"'FEUILLE FAB'!AD42&\"\"","v":""},{"$f":"'FEUILLE FAB'!AE42&\"\"","v":""},{"$f":"'FEUILLE FAB'!AF42&\"\"","v":""},{"$f":"'FEUILLE FAB'!AG42&\"\"","v":""},{"$f":"'FEUILLE FAB'!AH42&\"\"","v":""},{"$f":"'FEUILLE FAB'!AI42&\"\"","v":""},{"$f":"'FEUILLE FAB'!AJ42&\"\"","v":""},{"$f":"'FEUILLE FAB'!AK42&\"\"","v":""},{"$f":"'FEUILLE FAB'!AL42&\"\"","v":""},{"$f":"'FEUILLE FAB'!AM42&\"\"","v":""},{"$f":"'FEUILLE FAB'!AN42&\"\"","v":""},{"$f":"'FEUILLE FAB'!AO42&\"\"","v":""},{"$f":"'FEUILLE FAB'!AP42&\"\"","v":""},{"$f":"'FEUILLE FAB'!AQ42&\"\"","v":""},{"$f":"'FEUILLE FAB'!AR42&\"\"","v":""},{"$f":"'FEUILLE FAB'!AS42&\"\"","v":""},{"$f":"'FEUILLE FAB'!AT42&\"\"","v":""}]
[{"$f":"'FEUILLE FAB'!A43","v":"TOMATE VINAIGRETTE"},{"$f":"'FEUILLE FAB'!B43","v":22},{"$f":"'FEUILLE FAB'!C43&\"\"","v":""},{"$f":"'FEUILLE FAB'!D43&\"\"","v":""},{"$f":"'FEUILLE FAB'!E43&\"\"","v":""},{"$f":"'FEUILLE FAB'!F43&\"\"","v":"5"},{"$f":"'FEUILLE FAB'!G43&\"\"","v":"2"},{"$f":"'FEUILLE FAB'!H43&\"\"","v":"1"},{"$f":"'FEUILLE FAB'!I43&\"\"","v":""},{"$f":"'FEUILLE FAB'!J43&\"\"","v":""},{"$f":"'FEUILLE FAB'!K43&\"\"","v":""},{"$f":"'FEUILLE FAB'!L43&\"\"","v":"4"},{"$f":"'FEUILLE FAB'!M43&\"\"","v":"3"},{"$f":"'FEUILLE FAB'!N43&\"\"","v":"2"},{"$f":"'FEUILLE FAB'!O43&\"\"","v":"1"},{"$f":"'FEUILLE FAB'!P43&\"\"","v":"4"},{"$f":"'FEUILLE FAB'!Q43&\"\"","v":""},{"$f":"'FEUILLE FAB'!R43&\"\"","v":""},{"$f":"'FEUILLE FAB'!S43&\"\"","v":""},{"$f":"'FEUILLE FAB'!T43&\"\"","v":""},{"$f":"'FEUILLE FAB'!U43&\"\"","v":""},{"$f":"'FEUILLE FAB'!V43&\"\"","v":""},{"$f":"'FEUILLE FAB'!W43&\"\"","v":""},{"$f":"'FEUILLE FAB'!X43&\"\"","v":""},{"$f":"'FEUILLE FAB'!Y43&\"\"","v":""},{"$f":"'FEUILLE FAB'!Z43&\"\"","v":""},{"$f":"'FEUILLE FAB'!AA43&\"\"","v":""},{"$f":"'FEUILLE FAB'!AB43&\"\"","v":""},{"$f":"'FEUILLE FAB'!AC43&\"\"","v":""},{"$f":"'FEUILLE FAB'!AD43&\"\"","v":""},{"$f":"'FEUILLE FAB'!AE43&\"\"","v":""},{"$f":"'FEUILLE FAB'!AF43&\"\"","v":""},{"$f":"'FEUILLE FAB'!AG43&\"\"","v":""},{"$f":"'FEUILLE FAB'!AH43&\"\"","v":""},{"$f":"'FEUILLE FAB'!AI43&\"\"","v":""},{"$f":"'FEUILLE FAB'!AJ43&\"\"","v":""},{"$f":"'FEUILLE FAB'!AK43&\"\"","v":""},{"$f":"'FEUILLE FAB'!AL43&\"\"","v":""},{"$f":"'FEUILLE FAB'!AM43&\"\"","v":""},{"$f":"'FEUILLE FAB'!AN43&\"\"","v":""},{"$f":"'FEUILLE FAB'!AO43&\"\"","v":""},{"$f":"'FEUILLE FAB'!AP43&\"\"","v":""},{"$f":"'FEUILLE FAB'!AQ43&\"\"","v":""},{"$f":"'FEUILLE FAB'!AR43&\"\"","v":""},{"$f":"'FEUILLE FAB'!AS43&\"\"","v":""},{"$f":"'FEUILLE FAB'!AT43&\"\"","v":""}]
[{"$f":"'FEUILLE FAB'!A44","v":"BŒUF SANS LARDONS"},{"$f":"'FEUILLE FAB'!B44","v":22},{"$f":"'FEUILLE FAB'!C44&\"\"","v":""},{"$f":"'FEUILLE FAB'!D44&\"\"","v":""},{"$f":"'FEUILLE FAB'!E44&\"\"","v":""},{"$f":"'FEUILLE FAB'!F44&\"\"","v":"5"},{"$f":"'FEUILLE FAB'!G44&\"\"","v":"2"},{"$f":"'FEUILLE FAB'!H44&\"\"","v":"1"},{"$f":"'FEUILLE FAB'!I44&\"\"","v":""},{"$f":"'FEUILLE FAB'!J44&\"\"","v":""},{"$f":"'FEUILLE FAB'!K44&\"\"","v":""},{"$f":"'FEUILLE FAB'!L44&\"\"","v":"4"},{"$f":"'FEUILLE FAB'!M44&\"\"","v":"3"},{"$f":"'FEUILLE FAB'!N44&\"\"","v":"2"},{"$f":"'FEUILLE FAB'!O44&\"\"","v":"1"},{"$f":"'FEUILLE FAB'!P44&\"\"","v":"4"},{"$f":"'FEUILLE FAB'!Q44&\"\"","v":""},{"$f":"'FEUILLE FAB'!R44&\"\"","v":""},{"$f":"'FEUILLE FAB'!S44&\"\"","v":""},{"$f":"'FEUILLE FAB'!T44&\"\"","v":""},{"$f":"'FEUILLE FAB'!U44&\"\"","v":""},{"$f":"'FEUILLE FAB'!V44&\"\"","v":""},{"$f":"'FEUILLE FAB'!W44&\"\"","v":""},{"$f":"'FEUILLE FAB'!X44&\"\"","v":""},{"$f":"'FEUILLE FAB'!Y44&\"\"","v":""},{"$f":"'FEUILLE FAB'!Z44&\"\"","v":""},{"$f":"'FEUILLE FAB'!AA44&\"\"","v":""},{"$f":"'FEUILLE FAB'!AB44&\"\"","v":""},{"$f":"'FEUILLE FAB'!AC44&\"\"","v":""},{"$f":"'FEUILLE FAB'!AD44&\"\"","v":""},{"$f":"'FEUILLE FAB'!AE44&\"\"","v":""},{"$f":"'FEUILLE FAB'!AF44&\"\"","v":""},{"$f":"'FEUILLE FAB'!AG44&\"\"","v":""},{"$f":"'FEUILLE FAB'!AH44&\"\"","v":""},{"$f":"'FEUILLE FAB'!AI44&\"\"","v":""},{"$f":"'FEUILLE FAB'!AJ44&\"\"","v":""},{"$f":"'FEUILLE FAB'!AK44&\"\"","v":""},{"$f":"'FEUILLE FAB'!AL44&\"\"","v":""},{"$f":"'FEUILLE FAB'!AM44&\"\"","v":""},{"$f":"'FEUILLE FAB'!AN44&\"\"","v":""},{"$f":"'FEUILLE FAB'!AO44&\"\"","v":""},{"$f":"'FEUILLE FAB'!AP44&\"\"","v":""},{"$f":"'FEUILLE FAB'!AQ44&\"\"","v":""},{"$f":"'FEUILLE FAB'!AR44&\"\"","v":""},{"$f":"'FEUILLE FAB'!AS44&\"\"","v":""},{"$f":"'FEUILLE FAB'!AT44&\"\"","v":""}]
[{"$f":"'FEUILLE FAB'!A45","v":"P.DE TERRE VAPEUR"},{"$f":"'FEUILLE FAB'!B45","v":22},{"$f":"'FEUILLE FAB'!C45&\"\"","v":""},{"$f":"'FEUILLE FAB'!D45&\"\"","v":""},{"$f":"'FEUILLE FAB'!E45&\"\"","v":""},{"$f":"'FEUILLE FAB'!F45&\"\"","v":"5"},{"$f":"'FEUILLE FAB'!G45&\"\"","v":"2"},{"$f":"'FEUILLE FAB'!H45&\"\"","v":"1"},{"$f":"'FEUILLE FAB'!I45&\"\"","v":""},{"$f":"'FEUILLE FAB'!J45&\"\"","v":""},{"$f":"'FEUILLE FAB'!K45&\"\"","v":""},{"$f":"'FEUILLE FAB'!L45&\"\"","v":"4"},{"$f":"'FEUILLE FAB'!M45&\"\"","v":"3"},{"$f":"'FEUILLE FAB'!N45&\"\"","v":"2"},{"$f":"'FEUILLE FAB'!O45&\"\"","v":"1"},{"$f":"'FEUILLE FAB'!P45&\"\"","v":"4"},{"$f":"'FEUILLE FAB'!Q45&\"\"","v":""},{"$f":"'FEUILLE FAB'!R45&\"\"","v":""},{"$f":"'FEUILLE FAB'!S45&\"\"","v":""},{"$f":"'FEUILLE FAB'!T45&\"\"","v":""},{"$f":"'FEUILLE FAB'!U45&\"\"","v":""},{"$f":"'FEUILLE FAB'!V45&\"\"","v":""},{"$f":"'FEUILLE FAB'!W45&\"\"","v":""},{"$f":"'FEUILLE FAB'!X45&\"\"","v":""},{"$f":"'FEUILLE FAB'!Y45&\"\"","v":""},{"$f":"'FEUILLE FAB'!Z45&\"\"","v":""},{"$f":"'FEUILLE FAB'!AA45&\"\"","v":""},{"$f":"'FEUILLE FAB'!AB45&\"\"","v":""},{"$f":"'FEUILLE FAB'!AC45&\"\"","v":""},{"$f":"'FEUILLE FAB'!AD45&\"\"","v":""},{"$f":"'FEUILLE FAB'!AE45&\"\"","v":""},{"$f":"'FEUILLE FAB'!AF45&\"\"","v":""},{"$f":"'FEUILLE FAB'!AG45&\"\"","v":""},{"$f":"'FEUILLE FAB'!AH45&\"\"","v":""},{"$f":"'FEUILLE FAB'!AI45&\"\"","v":""},{"$f":"'FEUILLE FAB'!AJ45&\"\"","v":""},{"$f":"'FEUILLE FAB'!AK45&\"\"","v":""},{"$f":"'FEUILLE FAB'!AL45&\"\"","v":""},{"$f":"'FEUILLE FAB'!AM45&\"\"","v":""},{"$f":"'FEUILLE FAB'!AN45&\"\"","v":""},{"$f":"'FEUILLE FAB'!AO45&\"\"","v":""},{"$f":"'FEUILLE FAB'!AP45&\"\"","v":""},{"$f":"'FEUILLE FAB'!AQ45&\"\"","v":""},{"$f":"'FEUILLE FAB'!AR45&\"\"","v":""},{"$f":"'FEUILLE FAB'!AS45&\"\"","v":""},{"$f":"'FEUILLE FAB'!AT45&\"\"","v":""}]
[{"$f":"'FEUILLE FAB'!A46","v":""},{"$f":"'FEUILLE FAB'!B46","v":0},{"$f":"'FEUILLE FAB'!C46&\"\"","v":""},{"$f":"'FEUILLE FAB'!D46&\"\"","v":""},{"$f":"'FEUILLE FAB'!E46&\"\"","v":""},{"$f":"'FEUILLE FAB'!F46&\"\"","v":""},{"$f":"'FEUILLE FAB'!G46&\"\"","v":""},{"$f":"'FEUILLE FAB'!H46&\"\"","v":""},{"$f":"'FEUILLE FAB'!I46&\"\"","v":""},{"$f":"'FEUILLE FAB'!J46&\"\"","v":""},{"$f":"'FEUILLE FAB'!K46&\"\"","v":""},{"$f":"'FEUILLE FAB'!L46&\"\"","v":""},{"$f":"'FEUILLE FAB'!M46&\"\"","v":""},{"$f":"'FEUILLE FAB'!N46&\"\"","v":""},{"$f":"'FEUILLE FAB'!O46&\"\"","v":""},{"$f":"'FEUILLE FAB'!P46&\"\"","v":""},{"$f":"'FEUILLE FAB'!Q46&\"\"","v":""},{"$f":"'FEUILLE FAB'!R46&\"\"","v":""},{"$f":"'FEUILLE FAB'!S46&\"\"","v":""},{"$f":"'FEUILLE FAB'!T46&\"\"","v":""},{"$f":"'FEUILLE FAB'!U46&\"\"","v":""},{"$f":"'FEUILLE FAB'!V46&\"\"","v":""},{"$f":"'FEUILLE FAB'!W46&\"\"","v":""},{"$f":"'FEUILLE FAB'!X46&\"\"","v":""},{"$f":"'FEUILLE FAB'!Y46&\"\"","v":""},{"$f":"'FEUILLE FAB'!Z46&\"\"","v":""},{"$f":"'FEUILLE FAB'!AA46&\"\"","v":""},{"$f":"'FEUILLE FAB'!AB46&\"\"","v":""},{"$f":"'FEUILLE FAB'!AC46&\"\"","v":""},{"$f":"'FEUILLE FAB'!AD46&\"\"","v":""},{"$f":"'FEUILLE FAB'!AE46&\"\"","v":""},{"$f":"'FEUILLE FAB'!AF46&\"\"","v":""},{"$f":"'FEUILLE FAB'!AG46&\"\"","v":""},{"$f":"'FEUILLE FAB'!AH46&\"\"","v":""},{"$f":"'FEUILLE FAB'!AI46&\"\"","v":""},{"$f":"'FEUILLE FAB'!AJ46&\"\"","v":""},{"$f":"'FEUILLE FAB'!AK46&\"\"","v":""},{"$f":"'FEUILLE FAB'!AL46&\"\"","v":""},{"$f":"'FEUILLE FAB'!AM46&\"\"","v":""},{"$f":"'FEUILLE FAB'!AN46&\"\"","v":""},{"$f":"'FEUILLE FAB'!AO46&\"\"","v":""},{"$f":"'FEUILLE FAB'!AP46&\"\"","v":""},{"$f":"'FEUILLE FAB'!AQ46&\"\"","v":""},{"$f":"'FEUILLE FAB'!AR46&\"\"","v":""},{"$f":"'FEUILLE FAB'!AS46&\"\"","v":""},{"$f":"'FEUILLE FAB'!AT46&\"\"","v":""}]
[{"$f":"'FEUILLE FAB'!A47","v":""},{"$f":"'FEUILLE FAB'!B47","v":0},{"$f":"'FEUILLE FAB'!C47&\"\"","v":""},{"$f":"'FEUILLE FAB'!D47&\"\"","v":""},{"$f":"'FEUILLE FAB'!E47&\"\"","v":""},{"$f":"'FEUILLE FAB'!F47&\"\"","v":""},{"$f":"'FEUILLE FAB'!G47&\"\"","v":""},{"$f":"'FEUILLE FAB'!H47&\"\"","v":""},{"$f":"'FEUILLE FAB'!I47&\"\"","v":""},{"$f":"'FEUILLE FAB'!J47&\"\"","v":""},{"$f":"'FEUILLE FAB'!K47&\"\"","v":""},{"$f":"'FEUILLE FAB'!L47&\"\"","v":""},{"$f":"'FEUILLE FAB'!M47&\"\"","v":""},{"$f":"'FEUILLE FAB'!N47&\"\"","v":""},{"$f":"'FEUILLE FAB'!O47&\"\"","v":""},{"$f":"'FEUILLE FAB'!P47&\"\"","v":""},{"$f":"'FEUILLE FAB'!Q47&\"\"","v":""},{"$f":"'FEUILLE FAB'!R47&\"\"","v":""},{"$f":"'FEUILLE FAB'!S47&\"\"","v":""},{"$f":"'FEUILLE FAB'!T47&\"\"","v":""},{"$f":"'FEUILLE FAB'!U47&\"\"","v":""},{"$f":"'FEUILLE FAB'!V47&\"\"","v":""},{"$f":"'FEUILLE FAB'!W47&\"\"","v":""},{"$f":"'FEUILLE FAB'!X47&\"\"","v":""},{"$f":"'FEUILLE FAB'!Y47&\"\"","v":""},{"$f":"'FEUILLE FAB'!Z47&\"\"","v":""},{"$f":"'FEUILLE FAB'!AA47&\"\"","v":""},{"$f":"'FEUILLE FAB'!AB47&\"\"","v":""},{"$f":"'FEUILLE FAB'!AC47&\"\"","v":""},{"$f":"'FEUILLE FAB'!AD47&\"\"","v":""},{"$f":"'FEUILLE FAB'!AE47&\"\"","v":""},{"$f":"'FEUILLE FAB'!AF47&\"\"","v":""},{"$f":"'FEUILLE FAB'!AG47&\"\"","v":""},{"$f":"'FEUILLE FAB'!AH47&\"\"","v":""},{"$f":"'FEUILLE FAB'!AI47&\"\"","v":""},{"$f":"'FEUILLE FAB'!AJ47&\"\"","v":""},{"$f":"'FEUILLE FAB'!AK47&\"\"","v":""},{"$f":"'FEUILLE FAB'!AL47&\"\"","v":""},{"$f":"'FEUILLE FAB'!AM47&\"\"","v":""},{"$f":"'FEUILLE FAB'!AN47&\"\"","v":""},{"$f":"'FEUILLE FAB'!AO47&\"\"","v":""},{"$f":"'FEUILLE FAB'!AP47&\"\"","v":""},{"$f":"'FEUILLE FAB'!AQ47&\"\"","v":""},{"$f":"'FEUILLE FAB'!AR47&\"\"","v":""},{"$f":"'FEUILLE FAB'!AS47&\"\"","v":""},{"$f":"'FEUILLE FAB'!AT47&\"\"","v":""}]