{"text_format":"1","workbook":"xlsx","n_sheets":4,"sheets":["Contact","Organisme","Annuaire de recherche","Sheet"],"not_rendered":{"charts":0,"images":14,"macros":1,"external_links":0,"defined_names":10,"comments":0,"pivot_tables":0},"unopened":[],"bounds":{"document_bytes":16777216,"sheet_cells":100000,"rows_first":2000,"rows_last":500,"rows_between":2000,"halvings":0,"cell_chars":16384,"cell_head_chars":4096},"cells_cut":0,"cells_raw":0,"read":"whole","date_system":"1900"}

{"sheet":"Contact","index":0,"n_rows":18,"n_cols":18,"rows_kept":18,"cut":false,"hidden":false,"merged":[[7,1,8,8],[7,9,8,13],[7,14,8,17],[1,3,4,13]]}
[]
[null,null,null,"Base de données CONTACTS"]
[]
[]
[]
[]
[]
[null,"PROFIL",null,null,null,null,null,null,null,"CONTACT",null,null,null,null,"HISTORIQUE"]
[]
[null,"ID PQ","Civilité ","Nom","Prénom ","Entreprise","Departement ","Fonction ","Propriétaire","Téléphone","Portable","Email","Linkedin","Twitter","Commentaire ","Origine du contact","Date de création ","MAJ"]
[{"$f":"IF(E11=\"\",0,1)+IF(C11=\"\",0,1)+IF(D11=\"\",0,1)+IF(G11=\"\",0,1)+IF(H11=\"\",0,1)+IF(F11=\"\",0,1)+IF(J11=\"\",0,1)+IF(K11=\"\",0,1)+IF(L11=\"\",0,1)+IF(N11=\"\",0,1)+IF(I11=\"\",0,1)+IF(P11=\"\",0,1)+IF(Q11=\"\",0,1)+IF(R11=\"\",0,1)+IF(M11=\"\",0,1)+IF(B11=\"\",0,1)","v":16},"PQ1","Mr","Poule","Luc","pluto","Ressources humaines","responsable paie et formation","oui","09 78 98 78 98","06 84 94 04 94","Luc.polo@gmail.com","/","@",null,"chantier","2017-11-23","2017-11-24"]
[{"$f":"IF(E12=\"\",0,1)+IF(C12=\"\",0,1)+IF(D12=\"\",0,1)+IF(G12=\"\",0,1)+IF(H12=\"\",0,1)+IF(F12=\"\",0,1)+IF(J12=\"\",0,1)+IF(K12=\"\",0,1)+IF(L12=\"\",0,1)+IF(N12=\"\",0,1)+IF(I12=\"\",0,1)+IF(P12=\"\",0,1)+IF(Q12=\"\",0,1)+IF(R12=\"\",0,1)+IF(M12=\"\",0,1)+IF(B12=\"\",0,1)","v":16},"PQ2","Mme","Coq","Mic","molo","Marketing","chef de publicité ","non","08 98 78 67 89","06 78 12 47 54","Mic.molo@gmail.com","/","@",null,"partenaire","2017-11-23","2017-11-24"]
[16,"PQ3","Mme","Anne","Molly","molo","Services généraux","stagiaire ","non","08 98 09 78 00","07 78 12 47 54","molly.ploc@gmail.com","/","@",null,"business","2017-11-23","2017-11-24"]
[1,"PQ4"]
[1,"PQ5"]
[1,"PQ6"]
[1,"PQ7"]
[1,"PQ8"]

{"sheet":"Organisme","index":1,"n_rows":14,"n_cols":21,"rows_kept":14,"cut":false,"hidden":false,"merged":[[7,17,8,20],[1,3,4,12],[7,1,8,11],[7,12,8,16]]}
[]
[null,null,null,"Base de données ORGANISMES"]
[]
[]
[]
[]
[]
[null,"PROFIL",null,null,null,null,null,null,null,null,null,null,"CONTACT",null,null,null,null,"HISTORIQUE"]
[]
[null,"ID OQ","Organisme ","Secteur ","Nbr d'employés","Adresse ","Code postal","Ville ","PAYS","Parc Noveos","Club Noveos","Club entreprise","Téléphone","Site internet ","Facebook","Linkedin","Twitter","Commentaire","Origine du contact","Date de contact","Date MAJ"]
[{"$f":"IF(B11=\"\",0,1)+IF(C11=\"\",0,1)+IF(D11=\"\",0,1)+IF(E11=\"\",0,1)+IF(M11=\"\",0,1)+IF(F11=\"\",0,1)+IF(G11=\"\",0,1)+IF(H11=\"\",0,1)+IF(I11=\"\",0,1)+IF(J11=\"\",0,1)+IF(K11=\"\",0,1)+IF(L11=\"\",0,1)+IF(N11=\"\",0,1)+IF(O11=\"\",0,1)+IF(P11=\"\",0,1)+IF(Q11=\"\",0,1)+IF(S11=\"\",0,1)+IF(T11=\"\",0,1)+IF(U11=\"\",0,1)","v":16},"OQ1","Pluto","btp",4,"route du près",57000,"Metz","France ","oui","non","Le vivier","08 39 93 99 93","pluto.fr","lien FB  pluto","lien LKDN","lien T","opportunité à développer"]
[{"$f":"IF(B12=\"\",0,1)+IF(C12=\"\",0,1)+IF(D12=\"\",0,1)+IF(E12=\"\",0,1)+IF(M12=\"\",0,1)+IF(F12=\"\",0,1)+IF(G12=\"\",0,1)+IF(H12=\"\",0,1)+IF(I12=\"\",0,1)+IF(J12=\"\",0,1)+IF(K12=\"\",0,1)+IF(L12=\"\",0,1)+IF(N12=\"\",0,1)+IF(O12=\"\",0,1)+IF(P12=\"\",0,1)+IF(Q12=\"\",0,1)+IF(S12=\"\",0,1)+IF(T12=\"\",0,1)+IF(U12=\"\",0,1)","v":16},"OQ2","Molo","tourisme",3,"rue de paris ",57950,"Montigny les Metz ","France ","oui","oui","/","09 39 93 99 93","molo.fr","lien FB  molo","lien LKDN","lien T"]
[0]
[0]

{"sheet":"Annuaire de recherche","index":2,"n_rows":76,"n_cols":17,"rows_kept":76,"cut":false,"hidden":false,"merged":[[21,15,21,17],[23,3,25,17],[18,11,18,12],[19,11,19,12],[20,11,20,12],[20,13,21,13],[18,2,18,4],[19,3,19,4],[20,2,20,4],[19,5,20,7],[19,8,20,10],[18,15,18,17],[19,15,19,17],[20,15,20,17],[28,3,29,4],[1,4,4,13],[8,1,9,5],[8,6,9,9],[12,3,13,4],[15,3,15,4],[44,3,44,5],[46,3,46,5],[32,3,32,4],[32,5,32,6],[34,3,35,5],[48,13,48,16],[34,13,35,16],[37,13,38,16],[48,3,48,5],[32,8,32,9],[32,10,32,11],[40,8,40,10],[42,8,42,10],[44,8,44,10],[46,8,46,10],[48,8,48,10],[34,8,35,11],[37,8,38,11],[37,3,38,5],[40,3,40,5],[42,3,42,5],[32,14,32,15],[40,13,40,16],[42,13,42,16],[44,13,44,16],[46,13,46,16],[50,1,54,6],[50,7,54,11],[50,12,54,18],[57,3,57,4],[57,5,57,6],[57,8,57,9],[57,10,57,11],[57,14,57,15],[59,3,60,5],[59,8,60,11],[59,13,60,16],[62,3,63,5],[62,8,63,11],[62,13,63,16],[65,3,65,5],[65,8,65,10],[65,13,65,16],[67,3,67,5],[67,8,67,10],[67,13,67,16],[69,3,69,5],[69,8,69,10],[69,13,69,16],[71,3,71,5],[71,8,71,10],[71,13,71,16],[73,3,73,5],[73,8,73,10],[73,13,73,16],[75,1,79,6],[75,7,79,11],[75,12,79,18]]}
[]
[null,null,null,null,"Annuaire de recherches "]
[]
[]
[]
[]
[]
[]
[null,"Rechercher un organisme / entreprise :",null,null,null,null,"Molo"]
[]
[]
[]
[null,null,null,"Entreprise"]
[]
[]
[]
[]
[]
[null,null,{"$f":"VLOOKUP(G9,Organisme!C10:U913,4,FALSE)","v":"rue de paris "},null,null,null,null,null,null,null,null,"Parc Noveos:",null,{"$f":"VLOOKUP(G9,Organisme!C10:U913,8,FALSE)","v":"oui"},null,{"$f":"VLOOKUP(G9,Organisme!C10:U913,11,FALSE)","v":"09 39 93 99 93"}]
[null,null,{"$f":"VLOOKUP(G9,Organisme!C10:U913,5,FALSE)","v":57950},{"$f":"VLOOKUP(G9,Organisme!C10:U913,6,FALSE)","v":"Montigny les Metz "},null,{"$f":"VLOOKUP(G9,Organisme!C10:U913,2,FALSE)","v":"tourisme"},null,null,{"$f":"VLOOKUP(G9,Organisme!C10:U913,3,FALSE)","v":3},null,null,"Club Noveos:",null,{"$f":"VLOOKUP(G9,Organisme!C10:U913,9,FALSE)","v":"oui"},null,{"$f":"VLOOKUP(G9,Organisme!C10:U913,12,FALSE)","v":"molo.fr"}]
[null,null,{"$f":"VLOOKUP(G9,Organisme!C10:U913,7,FALSE)","v":"France "},null,null,null,null,null,null,null,null,"Club d'entreprise:",null,{"$f":"VLOOKUP(G9,Organisme!C10:U913,10,FALSE)","v":"/"},null,{"$f":"VLOOKUP(G9,Organisme!C10:U913,13,FALSE)","v":"lien FB  molo"}]
[null,null,null,null,null,null,null,null,null,null,null,null,null,null,null,{"$f":"VLOOKUP(G9,Organisme!C10:U913,14,FALSE)","v":"lien LKDN"}]
[]
[null,null,null,{"$f":"VLOOKUP(G9,Organisme!C10:U13,16,FALSE)","v":0}]
[]
[]
[]
[]
[null,null,null,"Contacts"]
[]
[]
[]
[null,null,"Civilité","NOM",null,"Prénom",null,"Civilité","NOM",null,"Prénom",null,null,"Civilité","NOM",null,"Prénom"]
[]
[null,null,null,"Departement",null,null,null,null,"Departement",null,null,null,null,"Departement"]
[]
[]
[null,null,null,"Fonction ",null,null,null,null,"Fonction ",null,null,null,null,"Fonction "]
[]
[]
[null,null,null,"Téléphone",null,null,null,null,"Téléphone",null,null,null,null,"Téléphone"]
[]
[null,null,null,"Portable",null,null,null,null,"Portable",null,null,null,null,"Portable"]
[]
[null,null,null,"Email",null,null,null,null,"Email",null,null,null,null,"Email"]
[]
[null,null,null,"Linkedin",null,null,null,null,"Linkedin",null,null,null,null,"Linkedin"]
[]
[null,null,null,"Twitter",null,null,null,null,"Twitter",null,null,null,null,"Twitter"]
[]
[null,"Commentaire",null,null,null,null,null,"Commenataire ",null,null,null,null,"Commentaire"]
[]
[]
[]
[]
[]
[]
[null,null,"Civilité","NOM",null,"Prénom",null,"Civilité","NOM",null,"Prénom",null,null,"Civilité","NOM",null,"Prénom"]
[]
[null,null,null,"Departement",null,null,null,null,"Departement",null,null,null,null,"Departement"]
[]
[]
[null,null,null,"Fonction ",null,null,null,null,"Fonction ",null,null,null,null,"Fonction "]
[]
[]
[null,null,null,"Téléphone",null,null,null,null,"Téléphone",null,null,null,null,"Téléphone"]
[]
[null,null,null,"Portable",null,null,null,null,"Portable",null,null,null,null,"Portable"]
[]
[null,null,null,"Email",null,null,null,null,"Email",null,null,null,null,"Email"]
[]
[null,null,null,"Linkedin",null,null,null,null,"Linkedin",null,null,null,null,"Linkedin"]
[]
[null,null,null,"Twitter",null,null,null,null,"Twitter",null,null,null,null,"Twitter"]
[]
[null,"Commentaire",null,null,null,null,null,"Commentaire ",null,null,null,null,"Commentaire"]

{"sheet":"Sheet","index":3,"n_rows":1000,"n_cols":11,"rows_kept":1000,"cut":false,"hidden":false,"merged":[]}
["Secteur",null,"Departement",null,"Civilité",null,"Réponse",null,"Organisme",null,"Pays"]
["Agriculture",null,"Achat",null,"Mme",null,"Oui",null,{"$f":"IF(Organisme!C11=\"\",\"\",Organisme!C11)","v":"Pluto"},null,"Afrique du Sud"]
["Agroalimentaire - Alimentation",null,"Administration, Comptabilité et Finance ",null,"Mr",null,"Non",null,{"$f":"IF(Organisme!C12=\"\",\"\",Organisme!C12)","v":"Molo"},null,"Afghanistan"]
["Aménageur - Parc d'activité ",null,"Commercial",null,null,null,null,null,{"$f":"IF(Organisme!C13=\"\",\"\",Organisme!C13)","v":""},null,"Albanie"]
["Animaux",null,"Communication ",null,null,null,null,null,{"$f":"IF(Organisme!C14=\"\",\"\",Organisme!C14)","v":""},null,"Algérie"]
["Architecture - Aménagement intérieur",null,"Evenémentiel ",null,null,null,null,null,{"$f":"IF(Organisme!C15=\"\",\"\",Organisme!C15)","v":""},null,"Allemagne"]
["Artisanat - Métiers d'art",null,"Ingénierie et Technique",null,null,null,null,null,{"$f":"IF(Organisme!C16=\"\",\"\",Organisme!C16)","v":""},null,"Andorre"]
["Banque - Finance - Assurance",null,"IT et Télécommunication ",null,null,null,null,null,{"$f":"IF(Organisme!C17=\"\",\"\",Organisme!C17)","v":""},null,"Angola"]
["Bâtiment - Travaux publics",null,"Management et Direction",null,null,null,null,null,{"$f":"IF(Organisme!C18=\"\",\"\",Organisme!C18)","v":""},null,"Antigua-et-Barbuda"]
["Biologie - Chimie",null,"Marketing",null,null,null,null,null,{"$f":"IF(Organisme!C19=\"\",\"\",Organisme!C19)","v":""},null,"Arabie Saoudite"]
["Club d'entreprise",null,"Production et Construction",null,null,null,null,null,{"$f":"IF(Organisme!C20=\"\",\"\",Organisme!C20)","v":""},null,"Argentine"]
["Collectivité territoriale",null,"Recherche et Développement",null,null,null,null,null,{"$f":"IF(Organisme!C21=\"\",\"\",Organisme!C21)","v":""},null,"Arménie"]
["Commerce - Immobilier",null,"Ressources humaines",null,null,null,null,null,{"$f":"IF(Organisme!C22=\"\",\"\",Organisme!C22)","v":""},null,"Australie"]
["Communication - Information",null,"Secrétariat et Support Administratif",null,null,null,null,null,{"$f":"IF(Organisme!C23=\"\",\"\",Organisme!C23)","v":""},null,"Autriche"]
["Culture - Spectacle",null,"Service Légal",null,null,null,null,null,{"$f":"IF(Organisme!C24=\"\",\"\",Organisme!C24)","v":""},null,"Azerbaïdjan"]
["Défense - Sécurité - Secours",null,"Services généraux",null,null,null,null,null,{"$f":"IF(Organisme!C25=\"\",\"\",Organisme!C25)","v":""},null,"Bahamas"]
["Droit",null,"Transport et Logistique",null,null,null,null,null,{"$f":"IF(Organisme!C26=\"\",\"\",Organisme!C26)","v":""},null,"Bahreïn"]
["Edition - Imprimerie - Livre",null,null,null,null,null,null,null,{"$f":"IF(Organisme!C27=\"\",\"\",Organisme!C27)","v":""},null,"Bangladesh"]
["Electronique - Informatique",null,null,null,null,null,null,null,{"$f":"IF(Organisme!C28=\"\",\"\",Organisme!C28)","v":""},null,"Barbade"]
["Enseignement - Formation",null,null,null,null,null,null,null,{"$f":"IF(Organisme!C29=\"\",\"\",Organisme!C29)","v":""},null,"Belgique"]
["Environnement - Nature - Nettoyage",null,null,null,null,null,null,null,{"$f":"IF(Organisme!C30=\"\",\"\",Organisme!C30)","v":""},null,"Belize"]
["Gestion - Audit - Ressources humaines",null,null,null,null,null,null,null,{"$f":"IF(Organisme!C31=\"\",\"\",Organisme!C31)","v":""},null,"Bénin"]
["Hôtellerie - Restauration - Tourisme",null,null,null,null,null,null,null,{"$f":"IF(Organisme!C29=\"\",\"\",Organisme!C29)","v":""},null,"Bhoutan"]
["Humanitaire",null,null,null,null,null,null,null,{"$f":"IF(Organisme!C30=\"\",\"\",Organisme!C30)","v":""},null,"Biélorussie"]
["Industrie - Matériaux",null,null,null,null,null,null,null,{"$f":"IF(Organisme!C31=\"\",\"\",Organisme!C31)","v":""},null,"Birmanie"]
["Lettres - Sciences humaines",null,null,null,null,null,null,null,{"$f":"IF(Organisme!C32=\"\",\"\",Organisme!C32)","v":""},null,"Bolivie"]
["Mécanique - Maintenance",null,null,null,null,null,null,null,{"$f":"IF(Organisme!C33=\"\",\"\",Organisme!C33)","v":""},null,"Bosnie-Herzégovine"]
["Numérique - Multimédia - Audiovisuel",null,null,null,null,null,null,null,{"$f":"IF(Organisme!C34=\"\",\"\",Organisme!C34)","v":""},null,"Botswana"]
["Santé",null,null,null,null,null,null,null,{"$f":"IF(Organisme!C35=\"\",\"\",Organisme!C35)","v":""},null,"Brésil"]
["Sciences - Maths - Physique",null,null,null,null,null,null,null,{"$f":"IF(Organisme!C36=\"\",\"\",Organisme!C36)","v":""},null,"Brunei"]
["Secrétariat - Accueil",null,null,null,null,null,null,null,{"$f":"IF(Organisme!C37=\"\",\"\",Organisme!C37)","v":""},null,"Bulgarie"]
["Social - Services à la personne",null,null,null,null,null,null,null,{"$f":"IF(Organisme!C38=\"\",\"\",Organisme!C38)","v":""},null,"Burkina Faso"]
["Soins - Esthétique - Coiffure",null,null,null,null,null,null,null,{"$f":"IF(Organisme!C39=\"\",\"\",Organisme!C39)","v":""},null,"Burundi"]
["Sport - Animation",null,null,null,null,null,null,null,{"$f":"IF(Organisme!C40=\"\",\"\",Organisme!C40)","v":""},null,"Cambodge"]
["Transport - Logistique",null,null,null,null,null,null,null,{"$f":"IF(Organisme!C41=\"\",\"\",Organisme!C41)","v":""},null,"Cameroun"]
[null,null,null,null,null,null,null,null,{"$f":"IF(Organisme!C42=\"\",\"\",Organisme!C42)","v":""},null,"Canada"]
[null,null,null,null,null,null,null,null,{"$f":"IF(Organisme!C43=\"\",\"\",Organisme!C43)","v":""},null,"Cap-Vert"]
[null,null,null,null,null,null,null,null,{"$f":"IF(Organisme!C44=\"\",\"\",Organisme!C44)","v":""},null,"Chili"]
[null,null,null,null,null,null,null,null,{"$f":"IF(Organisme!C45=\"\",\"\",Organisme!C45)","v":""},null,"Chine"]
[null,null,null,null,null,null,null,null,{"$f":"IF(Organisme!C46=\"\",\"\",Organisme!C46)","v":""},null,"Chypre"]
[null,null,null,null,null,null,null,null,{"$f":"IF(Organisme!C47=\"\",\"\",Organisme!C47)","v":""},null,"Colombie"]
[null,null,null,null,null,null,null,null,{"$f":"IF(Organisme!C48=\"\",\"\",Organisme!C48)","v":""},null,"Comores"]
[null,null,null,null,null,null,null,null,{"$f":"IF(Organisme!C49=\"\",\"\",Organisme!C49)","v":""},null,"Corée du Nord"]
[null,null,null,null,null,null,null,null,{"$f":"IF(Organisme!C50=\"\",\"\",Organisme!C50)","v":""},null,"Corée du Sud"]
[null,null,null,null,null,null,null,null,{"$f":"IF(Organisme!C51=\"\",\"\",Organisme!C51)","v":""},null,"Costa Rica"]
[null,null,null,null,null,null,null,null,{"$f":"IF(Organisme!C52=\"\",\"\",Organisme!C52)","v":""},null,"Côte d’Ivoire"]
[null,null,null,null,null,null,null,null,{"$f":"IF(Organisme!C53=\"\",\"\",Organisme!C53)","v":""},null,"Croatie"]
[null,null,null,null,null,null,null,null,{"$f":"IF(Organisme!C54=\"\",\"\",Organisme!C54)","v":""},null,"Cuba"]
[null,null,null,null,null,null,null,null,{"$f":"IF(Organisme!C55=\"\",\"\",Organisme!C55)","v":""},null,"Danemark"]
[null,null,null,null,null,null,null,null,{"$f":"IF(Organisme!C56=\"\",\"\",Organisme!C56)","v":""},null,"Djibouti"]
[null,null,null,null,null,null,null,null,{"$f":"IF(Organisme!C57=\"\",\"\",Organisme!C57)","v":""},null,"Dominique"]
[null,null,null,null,null,null,null,null,{"$f":"IF(Organisme!C58=\"\",\"\",Organisme!C58)","v":""},null,"Égypte"]
[null,null,null,null,null,null,null,null,{"$f":"IF(Organisme!C59=\"\",\"\",Organisme!C59)","v":""},null,"Émirats arabes unis"]
[null,null,null,null,null,null,null,null,{"$f":"IF(Organisme!C60=\"\",\"\",Organisme!C60)","v":""},null,"Équateur"]
[null,null,null,null,null,null,null,null,{"$f":"IF(Organisme!C61=\"\",\"\",Organisme!C61)","v":""},null,"Érythrée"]
[null,null,null,null,null,null,null,null,{"$f":"IF(Organisme!C62=\"\",\"\",Organisme!C62)","v":""},null,"Espagne"]
[null,null,null,null,null,null,null,null,{"$f":"IF(Organisme!C63=\"\",\"\",Organisme!C63)","v":""},null,"Estonie"]
[null,null,null,null,null,null,null,null,{"$f":"IF(Organisme!C64=\"\",\"\",Organisme!C64)","v":""},null,"États-Unis"]
[null,null,null,null,null,null,null,null,{"$f":"IF(Organisme!C65=\"\",\"\",Organisme!C65)","v":""},null,"Éthiopie"]
[null,null,null,null,null,null,null,null,{"$f":"IF(Organisme!C66=\"\",\"\",Organisme!C66)","v":""},null,"Fidji"]
[null,null,null,null,null,null,null,null,{"$f":"IF(Organisme!C67=\"\",\"\",Organisme!C67)","v":""},null,"Finlande"]
[null,null,null,null,null,null,null,null,{"$f":"IF(Organisme!C68=\"\",\"\",Organisme!C68)","v":""},null,"France"]
[null,null,null,null,null,null,null,null,{"$f":"IF(Organisme!C69=\"\",\"\",Organisme!C69)","v":""},null,"Gabon"]
[null,null,null,null,null,null,null,null,{"$f":"IF(Organisme!C70=\"\",\"\",Organisme!C70)","v":""},null,"Gambie"]
[null,null,null,null,null,null,null,null,{"$f":"IF(Organisme!C71=\"\",\"\",Organisme!C71)","v":""},null,"Géorgie"]
[null,null,null,null,null,null,null,null,{"$f":"IF(Organisme!C72=\"\",\"\",Organisme!C72)","v":""},null,"Ghana"]
[null,null,null,null,null,null,null,null,{"$f":"IF(Organisme!C73=\"\",\"\",Organisme!C73)","v":""},null,"Grèce"]
[null,null,null,null,null,null,null,null,{"$f":"IF(Organisme!C74=\"\",\"\",Organisme!C74)","v":""},null,"Grenade"]
[null,null,null,null,null,null,null,null,{"$f":"IF(Organisme!C75=\"\",\"\",Organisme!C75)","v":""},null,"Guatemala"]
[null,null,null,null,null,null,null,null,{"$f":"IF(Organisme!C76=\"\",\"\",Organisme!C76)","v":""},null,"Guinée"]
[null,null,null,null,null,null,null,null,{"$f":"IF(Organisme!C77=\"\",\"\",Organisme!C77)","v":""},null,"Guinée équatoriale"]
[null,null,null,null,null,null,null,null,{"$f":"IF(Organisme!C78=\"\",\"\",Organisme!C78)","v":""},null,"Guinée-Bissau"]
[null,null,null,null,null,null,null,null,{"$f":"IF(Organisme!C79=\"\",\"\",Organisme!C79)","v":""},null,"Guyana"]
[null,null,null,null,null,null,null,null,{"$f":"IF(Organisme!C80=\"\",\"\",Organisme!C80)","v":""},null,"Haïti"]
[null,null,null,null,null,null,null,null,{"$f":"IF(Organisme!C81=\"\",\"\",Organisme!C81)","v":""},null,"Honduras"]
[null,null,null,null,null,null,null,null,{"$f":"IF(Organisme!C82=\"\",\"\",Organisme!C82)","v":""},null,"Hongrie"]
[null,null,null,null,null,null,null,null,{"$f":"IF(Organisme!C83=\"\",\"\",Organisme!C83)","v":""},null,"Îles Cook"]
[null,null,null,null,null,null,null,null,{"$f":"IF(Organisme!C84=\"\",\"\",Organisme!C84)","v":""},null,"Îles Marshall"]
[null,null,null,null,null,null,null,null,{"$f":"IF(Organisme!C85=\"\",\"\",Organisme!C85)","v":""},null,"Inde"]
[null,null,null,null,null,null,null,null,{"$f":"IF(Organisme!C86=\"\",\"\",Organisme!C86)","v":""},null,"Indonésie"]
[null,null,null,null,null,null,null,null,{"$f":"IF(Organisme!C87=\"\",\"\",Organisme!C87)","v":""},null,"Irak"]
[null,null,null,null,null,null,null,null,{"$f":"IF(Organisme!C88=\"\",\"\",Organisme!C88)","v":""},null,"Iran"]
[null,null,null,null,null,null,null,null,{"$f":"IF(Organisme!C89=\"\",\"\",Organisme!C89)","v":""},null,"Irlande"]
[null,null,null,null,null,null,null,null,{"$f":"IF(Organisme!C90=\"\",\"\",Organisme!C90)","v":""},null,"Islande"]
[null,null,null,null,null,null,null,null,{"$f":"IF(Organisme!C91=\"\",\"\",Organisme!C91)","v":""},null,"Israël"]
[null,null,null,null,null,null,null,null,{"$f":"IF(Organisme!C92=\"\",\"\",Organisme!C92)","v":""},null,"Italie"]
[null,null,null,null,null,null,null,null,{"$f":"IF(Organisme!C93=\"\",\"\",Organisme!C93)","v":""},null,"Jamaïque"]
[null,null,null,null,null,null,null,null,{"$f":"IF(Organisme!C94=\"\",\"\",Organisme!C94)","v":""},null,"Japon"]
[null,null,null,null,null,null,null,null,{"$f":"IF(Organisme!C95=\"\",\"\",Organisme!C95)","v":""},null,"Jordanie"]
[null,null,null,null,null,null,null,null,{"$f":"IF(Organisme!C96=\"\",\"\",Organisme!C96)","v":""},null,"Kazakhstan"]
[null,null,null,null,null,null,null,null,{"$f":"IF(Organisme!C97=\"\",\"\",Organisme!C97)","v":""},null,"Kenya"]
[null,null,null,null,null,null,null,null,{"$f":"IF(Organisme!C98=\"\",\"\",Organisme!C98)","v":""},null,"Kirghizistan"]
[null,null,null,null,null,null,null,null,{"$f":"IF(Organisme!C99=\"\",\"\",Organisme!C99)","v":""},null,"Kiribati"]
[null,null,null,null,null,null,null,null,{"$f":"IF(Organisme!C100=\"\",\"\",Organisme!C100)","v":""},null,"Koweït"]
[null,null,null,null,null,null,null,null,{"$f":"IF(Organisme!C101=\"\",\"\",Organisme!C101)","v":""},null,"Laos"]
[null,null,null,null,null,null,null,null,{"$f":"IF(Organisme!C102=\"\",\"\",Organisme!C102)","v":""},null,"Lesotho"]
[null,null,null,null,null,null,null,null,{"$f":"IF(Organisme!C103=\"\",\"\",Organisme!C103)","v":""},null,"Lettonie"]
[null,null,null,null,null,null,null,null,{"$f":"IF(Organisme!C104=\"\",\"\",Organisme!C104)","v":""},null,"Liban"]
[null,null,null,null,null,null,null,null,{"$f":"IF(Organisme!C105=\"\",\"\",Organisme!C105)","v":""},null,"Liberia"]
[null,null,null,null,null,null,null,null,{"$f":"IF(Organisme!C106=\"\",\"\",Organisme!C106)","v":""},null,"Libye"]
[null,null,null,null,null,null,null,null,{"$f":"IF(Organisme!C107=\"\",\"\",Organisme!C107)","v":""},null,"Liechtenstein"]
[null,null,null,null,null,null,null,null,{"$f":"IF(Organisme!C108=\"\",\"\",Organisme!C108)","v":""},null,"Lituanie"]
[null,null,null,null,null,null,null,null,{"$f":"IF(Organisme!C109=\"\",\"\",Organisme!C109)","v":""},null,"Luxembourg"]
[null,null,null,null,null,null,null,null,{"$f":"IF(Organisme!C110=\"\",\"\",Organisme!C110)","v":""},null,"Macédoine"]
[null,null,null,null,null,null,null,null,{"$f":"IF(Organisme!C111=\"\",\"\",Organisme!C111)","v":""},null,"Madagascar"]
[null,null,null,null,null,null,null,null,{"$f":"IF(Organisme!C112=\"\",\"\",Organisme!C112)","v":""},null,"Malaisie"]
[null,null,null,null,null,null,null,null,{"$f":"IF(Organisme!C113=\"\",\"\",Organisme!C113)","v":""},null,"Malawi"]
[null,null,null,null,null,null,null,null,{"$f":"IF(Organisme!C114=\"\",\"\",Organisme!C114)","v":""},null,"Maldives"]
[null,null,null,null,null,null,null,null,{"$f":"IF(Organisme!C115=\"\",\"\",Organisme!C115)","v":""},null,"Mali"]
[null,null,null,null,null,null,null,null,{"$f":"IF(Organisme!C116=\"\",\"\",Organisme!C116)","v":""},null,"Malte"]
[null,null,null,null,null,null,null,null,{"$f":"IF(Organisme!C117=\"\",\"\",Organisme!C117)","v":""},null,"Maroc"]
[null,null,null,null,null,null,null,null,{"$f":"IF(Organisme!C118=\"\",\"\",Organisme!C118)","v":""},null,"Maurice"]
[null,null,null,null,null,null,null,null,{"$f":"IF(Organisme!C119=\"\",\"\",Organisme!C119)","v":""},null,"Mauritanie"]
[null,null,null,null,null,null,null,null,{"$f":"IF(Organisme!C120=\"\",\"\",Organisme!C120)","v":""},null,"Mexique"]
[null,null,null,null,null,null,null,null,{"$f":"IF(Organisme!C121=\"\",\"\",Organisme!C121)","v":""},null,"Micronésie"]
[null,null,null,null,null,null,null,null,{"$f":"IF(Organisme!C122=\"\",\"\",Organisme!C122)","v":""},null,"Moldavie"]
[null,null,null,null,null,null,null,null,{"$f":"IF(Organisme!C123=\"\",\"\",Organisme!C123)","v":""},null,"Monaco"]
[null,null,null,null,null,null,null,null,{"$f":"IF(Organisme!C124=\"\",\"\",Organisme!C124)","v":""},null,"Mongolie"]
[null,null,null,null,null,null,null,null,{"$f":"IF(Organisme!C125=\"\",\"\",Organisme!C125)","v":""},null,"Monténégro"]
[null,null,null,null,null,null,null,null,{"$f":"IF(Organisme!C126=\"\",\"\",Organisme!C126)","v":""},null,"Mozambique"]
{"$rows_left_out":880}