{"text_format":"1","workbook":"xlsx","n_sheets":3,"sheets":["Feuil1","Feuil2","Feuil3"],"not_rendered":{"charts":0,"images":0,"macros":1,"external_links":1,"defined_names":0,"comments":0,"pivot_tables":0},"unopened":[],"bounds":{"document_bytes":16777216,"sheet_cells":100000,"rows_first":2000,"rows_last":500,"rows_between":2000,"halvings":0,"cell_chars":16384,"cell_head_chars":4096},"cells_cut":0,"cells_raw":0,"read":"whole","date_system":"1900"}

{"sheet":"Feuil1","index":0,"n_rows":37,"n_cols":29,"rows_kept":37,"cut":false,"hidden":false,"merged":[]}
[]
[null,null,null,null,null,"Il s'agit de copier la dernière ligne Client (17 en l'ocurence) pour la copier en ligne 19 en effaçant le nom (F), la remise (P) et le timbre (U) et ainsi de suite pour une nouvelle facture"]
[]
["N° Ordre","Mois","Date","N°  Facture","N° Facture","Client                                                     Code barre Produit","Réf. Article","N° Art.","Code Article","Désignation Article","Unité","Quantité","Prix Unité HT","Montant HT Brut","Remise %","Remise Montant","Montant HT Net","Taux TVA","Montant TVA ","Montant TTC","Timbre    1%","Montant TTC+Timbre","Référence","Colonne2","Colonne1","Indice",null,"Liste déroulante sans doublon"]
[0,"01","2017-01-22",null,{"$f":"IF(C5=\"\",\"\",\"17.\"&TEXT(B5,\"00\")&\"-\"&TEXT(SUMPRODUCT((LEFT(E$4:E4,5)=\"17.\"&TEXT($B5,\"00\"))*1)+1,\"00\"))","v":"17.01-01"},"TREPOST",{"$f":"IF(ISNA(INDEX([1]ART!$Q:$Q,MATCH(I5,[1]ART!$B:$B,0))),\"\",INDEX([1]ART!$Q:$Q,MATCH(I5,[1]ART!$B:$B,0)))","v":""},null,2,null,{"$f":"IF(ISNA(INDEX([1]ART!$D:$D,MATCH(I5,[1]ART!$B:$B,0))),\"\",INDEX([1]ART!$D:$D,MATCH(I5,[1]ART!$B:$B,0)))","v":""},null,null,{"$f":"SUMIF($D6:$D$9423,$E5,N6:N$9423)","v":5407.79},{"$f":"P5/N5","v":0},null,{"$f":"N5-P5","v":5407.79},{"$f":"R6","v":0.19},{"$f":"Q5*R5","v":1027.4801},{"$f":"Q5+S5","v":6435.2700999999997},null,{"$f":"T5+U5","v":6435.2700999999997},".",null,null,{"$f":"A6","v":1},null,{"$f":"IF(E5=\"\",\"\",IF(COUNTIF(E$5:E5,E5)>1,\"\",MAX($AB$4:$AB4)+1))","v":1},{"$f":"IF(ROWS($AB$5:$AB5)>MAX($Z$5:$Z$9097),\"\",OFFSET($E$5,MATCH(ROWS($AB$5:$AB5),$Z$5:$Z$9097,0)-1,0))","v":"17.01-01"}]
[{"$f":"IF(ISNA(INDEX([1]VTR!$A:$A,MATCH(D6,[1]VTR!$D:$D,0))),\"\",INDEX([1]VTR!$A:$A,MATCH(D6,[1]VTR!$D:$D,0)))","v":1},{"$f":"IF(C6<>\"\",\"\",IF(B5=\"\",B5,B5))","v":"01"},null,{"$f":"IF(E6<>\"\",\"\",IF(D5=\"\",E5,D5))","v":"17.01-01"},null,null,{"$f":"IF(ISNA(INDEX([1]ART!$Q:$Q,MATCH(I6,[1]ART!$B:$B,0))),\"\",INDEX([1]ART!$Q:$Q,MATCH(I6,[1]ART!$B:$B,0)))","v":"1-PRS"},"1","TP",{"$f":"IF(ISNA(INDEX([1]ART!$C:$C,MATCH(I6,[1]ART!$B:$B,0))),\"\",INDEX([1]ART!$C:$C,MATCH(I6,[1]ART!$B:$B,0)))","v":"Tirage Noir & Blanc / Papier"},{"$f":"IF(ISNA(INDEX([1]ART!$D:$D,MATCH(I6,[1]ART!$B:$B,0))),\"\",INDEX([1]ART!$D:$D,MATCH(I6,[1]ART!$B:$B,0)))","v":"ML"},25.65,68.380116959064338,1753.95,{"$f":"IF(E6<>\"\",\"\",IF(O5=\"\",O5,O5))","v":0},null,{"$f":"N6-P6","v":1753.95},{"$f":"IF(ISNA(INDEX([1]ART!$H:$H,MATCH(I6,[1]ART!$B:$B,0))),\"\",INDEX([1]ART!$H:$H,MATCH(I6,[1]ART!$B:$B,0)))","v":0.19},{"$f":"Q6*R6","v":333.25049999999999},{"$f":"Q6+S6","v":2087.2004999999999},null,null,null,null,null,{"$f":"A6","v":1},null,{"$f":"IF(E6=\"\",\"\",IF(COUNTIF(E$5:E6,E6)>1,\"\",MAX($AB$4:$AB5)+1))","v":""},{"$f":"IF(ROWS($AB$5:$AB6)>MAX($Z$5:$Z$9097),\"\",OFFSET($E$5,MATCH(ROWS($AB$5:$AB6),$Z$5:$Z$9097,0)-1,0))","v":"17.01-02"}]
[{"$f":"IF(ISNA(INDEX([1]VTR!$A:$A,MATCH(D7,[1]VTR!$D:$D,0))),\"\",INDEX([1]VTR!$A:$A,MATCH(D7,[1]VTR!$D:$D,0)))","v":1},{"$f":"IF(C7<>\"\",\"\",IF(B6=\"\",B6,B6))","v":"01"},null,{"$f":"IF(E7<>\"\",\"\",IF(D6=\"\",E6,D6))","v":"17.01-01"},null,null,{"$f":"IF(ISNA(INDEX([1]ART!$Q:$Q,MATCH(I7,[1]ART!$B:$B,0))),\"\",INDEX([1]ART!$Q:$Q,MATCH(I7,[1]ART!$B:$B,0)))","v":"1-PRS"},"2","PP0",{"$f":"IF(ISNA(INDEX([1]ART!$C:$C,MATCH(I7,[1]ART!$B:$B,0))),\"\",INDEX([1]ART!$C:$C,MATCH(I7,[1]ART!$B:$B,0)))","v":"Traçage Couleur / Papier (aucun aplat)"},{"$f":"IF(ISNA(INDEX([1]ART!$D:$D,MATCH(I7,[1]ART!$B:$B,0))),\"\",INDEX([1]ART!$D:$D,MATCH(I7,[1]ART!$B:$B,0)))","v":"ML"},8.5500000000000007,427.34970760233915,3653.84,0,null,{"$f":"N7-P7","v":3653.84},{"$f":"IF(ISNA(INDEX([1]ART!$H:$H,MATCH(I7,[1]ART!$B:$B,0))),\"\",INDEX([1]ART!$H:$H,MATCH(I7,[1]ART!$B:$B,0)))","v":0.19},{"$f":"Q7*R7","v":694.2296},{"$f":"Q7+S7","v":4348.0695999999998},null,null,null,null,null,{"$f":"A7","v":1},null,{"$f":"IF(E7=\"\",\"\",IF(COUNTIF(E$5:E7,E7)>1,\"\",MAX($AB$4:$AB6)+1))","v":""},{"$f":"IF(ROWS($AB$5:$AB7)>MAX($Z$5:$Z$9097),\"\",OFFSET($E$5,MATCH(ROWS($AB$5:$AB7),$Z$5:$Z$9097,0)-1,0))","v":"17.01-03"}]
[0,"01","2017-01-22","",{"$f":"IF(C8=\"\",\"\",\"17.\"&TEXT(B8,\"00\")&\"-\"&TEXT(SUMPRODUCT((LEFT(E$4:E7,5)=\"17.\"&TEXT($B8,\"00\"))*1)+1,\"00\"))","v":"17.01-02"},"MEDIA",{"$f":"IF(ISNA(INDEX([1]ART!$Q:$Q,MATCH(I8,[1]ART!$B:$B,0))),\"\",INDEX([1]ART!$Q:$Q,MATCH(I8,[1]ART!$B:$B,0)))","v":""},null,2,null,{"$f":"IF(ISNA(INDEX([1]ART!$D:$D,MATCH(I8,[1]ART!$B:$B,0))),\"\",INDEX([1]ART!$D:$D,MATCH(I8,[1]ART!$B:$B,0)))","v":""},null,null,{"$f":"SUMIF($D9:$D$9423,$E8,N9:N$9423)","v":5252.38},{"$f":"P8/N8","v":9.9998476880956824E-2},525.23,{"$f":"N8-P8","v":4727.1499999999996},{"$f":"R9","v":0.19},{"$f":"Q8*R8","v":898.15849999999989},{"$f":"Q8+S8","v":5625.3084999999992},{"$f":"ROUNDDOWN(T8,-2)/100","v":56},{"$f":"T8+U8","v":5681.3084999999992},".",null,null,{"$f":"A9","v":2},null,{"$f":"IF(E8=\"\",\"\",IF(COUNTIF(E$5:E8,E8)>1,\"\",MAX($AB$4:$AB7)+1))","v":2},{"$f":"IF(ROWS($AB$5:$AB8)>MAX($Z$5:$Z$9097),\"\",OFFSET($E$5,MATCH(ROWS($AB$5:$AB8),$Z$5:$Z$9097,0)-1,0))","v":"17.01-04"}]
[{"$f":"IF(ISNA(INDEX([1]VTR!$A:$A,MATCH(D9,[1]VTR!$D:$D,0))),\"\",INDEX([1]VTR!$A:$A,MATCH(D9,[1]VTR!$D:$D,0)))","v":2},{"$f":"IF(C9<>\"\",\"\",IF(B8=\"\",B8,B8))","v":"01"},null,"17.01-02",null,null,{"$f":"IF(ISNA(INDEX([1]ART!$Q:$Q,MATCH(I9,[1]ART!$B:$B,0))),\"\",INDEX([1]ART!$Q:$Q,MATCH(I9,[1]ART!$B:$B,0)))","v":"1-PRS"},"1","C42",{"$f":"IF(ISNA(INDEX([1]ART!$C:$C,MATCH(I9,[1]ART!$B:$B,0))),\"\",INDEX([1]ART!$C:$C,MATCH(I9,[1]ART!$B:$B,0)))","v":"Copie Couleur A4-R /  Papier (tout aplat)"},{"$f":"IF(ISNA(INDEX([1]ART!$D:$D,MATCH(I9,[1]ART!$B:$B,0))),\"\",INDEX([1]ART!$D:$D,MATCH(I9,[1]ART!$B:$B,0)))","v":"U"},68,55.56,3778.08,9.9998476880956824E-2,{"$f":"N9*O9","v":377.80224553440536},{"$f":"N9-P9","v":3400.2777544655946},{"$f":"IF(ISNA(INDEX([1]ART!$H:$H,MATCH(I9,[1]ART!$B:$B,0))),\"\",INDEX([1]ART!$H:$H,MATCH(I9,[1]ART!$B:$B,0)))","v":0.19},{"$f":"Q9*R9","v":646.05277334846301},{"$f":"Q9+S9","v":4046.3305278140579},null,null,null,null,null,{"$f":"A9","v":2},null,{"$f":"IF(E9=\"\",\"\",IF(COUNTIF(E$5:E9,E9)>1,\"\",MAX($AB$4:$AB8)+1))","v":""},{"$f":"IF(ROWS($AB$5:$AB9)>MAX($Z$5:$Z$9097),\"\",OFFSET($E$5,MATCH(ROWS($AB$5:$AB9),$Z$5:$Z$9097,0)-1,0))","v":"17.01-05"}]
[{"$f":"IF(ISNA(INDEX([1]VTR!$A:$A,MATCH(D10,[1]VTR!$D:$D,0))),\"\",INDEX([1]VTR!$A:$A,MATCH(D10,[1]VTR!$D:$D,0)))","v":2},{"$f":"IF(C10<>\"\",\"\",IF(B9=\"\",B9,B9))","v":"01"},null,"17.01-02",null,null,{"$f":"IF(ISNA(INDEX([1]ART!$Q:$Q,MATCH(I10,[1]ART!$B:$B,0))),\"\",INDEX([1]ART!$Q:$Q,MATCH(I10,[1]ART!$B:$B,0)))","v":"1-PRS"},"2","I42",{"$f":"IF(ISNA(INDEX([1]ART!$C:$C,MATCH(I10,[1]ART!$B:$B,0))),\"\",INDEX([1]ART!$C:$C,MATCH(I10,[1]ART!$B:$B,0)))","v":"Impression Couleur A4-R /  Papier (tout aplat)"},{"$f":"IF(ISNA(INDEX([1]ART!$D:$D,MATCH(I10,[1]ART!$B:$B,0))),\"\",INDEX([1]ART!$D:$D,MATCH(I10,[1]ART!$B:$B,0)))","v":"U"},17,64.100000000000009,1089.7,9.9998476880956824E-2,108.96834025717865,980.73165974282142,{"$f":"IF(ISNA(INDEX([1]ART!$H:$H,MATCH(I10,[1]ART!$B:$B,0))),\"\",INDEX([1]ART!$H:$H,MATCH(I10,[1]ART!$B:$B,0)))","v":0.19},186.33901535113608,1167.0706750939576,null,null,null,null,null,{"$f":"A10","v":2},null,null,{"$f":"IF(ROWS($AB$5:$AB10)>MAX($Z$5:$Z$9097),\"\",OFFSET($E$5,MATCH(ROWS($AB$5:$AB10),$Z$5:$Z$9097,0)-1,0))","v":""}]
[{"$f":"IF(ISNA(INDEX([1]VTR!$A:$A,MATCH(D11,[1]VTR!$D:$D,0))),\"\",INDEX([1]VTR!$A:$A,MATCH(D11,[1]VTR!$D:$D,0)))","v":2},{"$f":"IF(C11<>\"\",\"\",IF(B10=\"\",B10,B10))","v":"01"},null,"17.01-02",null,null,{"$f":"IF(ISNA(INDEX([1]ART!$Q:$Q,MATCH(I11,[1]ART!$B:$B,0))),\"\",INDEX([1]ART!$Q:$Q,MATCH(I11,[1]ART!$B:$B,0)))","v":"1-PRS"},"3","R4S1",{"$f":"IF(ISNA(INDEX([1]ART!$C:$C,MATCH(I11,[1]ART!$B:$B,0))),\"\",INDEX([1]ART!$C:$C,MATCH(I11,[1]ART!$B:$B,0)))","v":"Reliure  A4 Spirale n° 06 à 19 + Transparent + Bristol"},{"$f":"IF(ISNA(INDEX([1]ART!$D:$D,MATCH(I11,[1]ART!$B:$B,0))),\"\",INDEX([1]ART!$D:$D,MATCH(I11,[1]ART!$B:$B,0)))","v":"U"},5,76.92,384.6,9.9998476880956824E-2,38.459414208416,346.14058579158404,{"$f":"IF(ISNA(INDEX([1]ART!$H:$H,MATCH(I11,[1]ART!$B:$B,0))),\"\",INDEX([1]ART!$H:$H,MATCH(I11,[1]ART!$B:$B,0)))","v":0.19},65.766711300400971,411.90729709198501,null,null,null,null,null,{"$f":"A11","v":2},null,{"$f":"IF(E11=\"\",\"\",IF(COUNTIF(E$5:E11,E11)>1,\"\",MAX($AB$4:$AB10)+1))","v":""},{"$f":"IF(ROWS($AB$5:$AB11)>MAX($Z$5:$Z$9097),\"\",OFFSET($E$5,MATCH(ROWS($AB$5:$AB11),$Z$5:$Z$9097,0)-1,0))","v":""}]
[0,"01","2017-01-25","",{"$f":"IF(C12=\"\",\"\",\"17.\"&TEXT(B12,\"00\")&\"-\"&TEXT(SUMPRODUCT((LEFT(E$4:E11,5)=\"17.\"&TEXT($B12,\"00\"))*1)+1,\"00\"))","v":"17.01-03"},"SONY",{"$f":"IF(ISNA(INDEX([1]ART!$Q:$Q,MATCH(I12,[1]ART!$B:$B,0))),\"\",INDEX([1]ART!$Q:$Q,MATCH(I12,[1]ART!$B:$B,0)))","v":""},null,2,{"$f":"IF(ISNA(INDEX([1]ART!$C:$C,MATCH(I12,[1]ART!$B:$B,0))),\"\",INDEX([1]ART!$C:$C,MATCH(I12,[1]ART!$B:$B,0)))","v":""},{"$f":"IF(ISNA(INDEX([1]ART!$D:$D,MATCH(I12,[1]ART!$B:$B,0))),\"\",INDEX([1]ART!$D:$D,MATCH(I12,[1]ART!$B:$B,0)))","v":""},null,null,{"$f":"SUMIF($D13:$D$9423,$E12,N13:N$9423)","v":862.40000000000009},{"$f":"P12/N12","v":0},null,{"$f":"N12-P12","v":862.40000000000009},{"$f":"R13","v":0.19},{"$f":"Q12*R12","v":163.85600000000002},{"$f":"Q12+S12","v":1026.2560000000001},null,{"$f":"T12+U12","v":1026.2560000000001},".",null,null,{"$f":"A13","v":3},null,{"$f":"IF(E12=\"\",\"\",IF(COUNTIF(E$5:E12,E12)>1,\"\",MAX($AB$4:$AB11)+1))","v":3},{"$f":"IF(ROWS($AB$5:$AB12)>MAX($Z$5:$Z$9097),\"\",OFFSET($E$5,MATCH(ROWS($AB$5:$AB12),$Z$5:$Z$9097,0)-1,0))","v":""}]
[{"$f":"IF(ISNA(INDEX([1]VTR!$A:$A,MATCH(D13,[1]VTR!$D:$D,0))),\"\",INDEX([1]VTR!$A:$A,MATCH(D13,[1]VTR!$D:$D,0)))","v":3},{"$f":"IF(C13<>\"\",\"\",IF(B12=\"\",B12,B12))","v":"01"},null,"17.01-03",null,null,{"$f":"IF(ISNA(INDEX([1]ART!$Q:$Q,MATCH(I13,[1]ART!$B:$B,0))),\"\",INDEX([1]ART!$Q:$Q,MATCH(I13,[1]ART!$B:$B,0)))","v":"1-PRS"},"1","C3",{"$f":"IF(ISNA(INDEX([1]ART!$C:$C,MATCH(I13,[1]ART!$B:$B,0))),\"\",INDEX([1]ART!$C:$C,MATCH(I13,[1]ART!$B:$B,0)))","v":"Copie Noir & Blanc A3-R /  Papier "},{"$f":"IF(ISNA(INDEX([1]ART!$D:$D,MATCH(I13,[1]ART!$B:$B,0))),\"\",INDEX([1]ART!$D:$D,MATCH(I13,[1]ART!$B:$B,0)))","v":"U"},3,5.98,17.940000000000001,0,0,{"$f":"N13-P13","v":17.940000000000001},{"$f":"IF(ISNA(INDEX([1]ART!$H:$H,MATCH(I13,[1]ART!$B:$B,0))),\"\",INDEX([1]ART!$H:$H,MATCH(I13,[1]ART!$B:$B,0)))","v":0.19},{"$f":"Q13*R13","v":3.4086000000000003},{"$f":"Q13+S13","v":21.348600000000001},null,null,null,null,null,{"$f":"A13","v":3},null,{"$f":"IF(E13=\"\",\"\",IF(COUNTIF(E$5:E13,E13)>1,\"\",MAX($AB$4:$AB12)+1))","v":""},{"$f":"IF(ROWS($AB$5:$AB13)>MAX($Z$5:$Z$9097),\"\",OFFSET($E$5,MATCH(ROWS($AB$5:$AB13),$Z$5:$Z$9097,0)-1,0))","v":""}]
[{"$f":"IF(ISNA(INDEX([1]VTR!$A:$A,MATCH(D14,[1]VTR!$D:$D,0))),\"\",INDEX([1]VTR!$A:$A,MATCH(D14,[1]VTR!$D:$D,0)))","v":3},{"$f":"IF(C14<>\"\",\"\",IF(B13=\"\",B13,B13))","v":"01"},null,"17.01-03",null,null,{"$f":"IF(ISNA(INDEX([1]ART!$Q:$Q,MATCH(I14,[1]ART!$B:$B,0))),\"\",INDEX([1]ART!$Q:$Q,MATCH(I14,[1]ART!$B:$B,0)))","v":"1-PRS"},"2","I30",{"$f":"IF(ISNA(INDEX([1]ART!$C:$C,MATCH(I14,[1]ART!$B:$B,0))),\"\",INDEX([1]ART!$C:$C,MATCH(I14,[1]ART!$B:$B,0)))","v":"Impression Couleur A3-R /  Papier (aucun aplat)"},{"$f":"IF(ISNA(INDEX([1]ART!$D:$D,MATCH(I14,[1]ART!$B:$B,0))),\"\",INDEX([1]ART!$D:$D,MATCH(I14,[1]ART!$B:$B,0)))","v":"U"},1,85.47,85.47,0,0,85.47,{"$f":"IF(ISNA(INDEX([1]ART!$H:$H,MATCH(I14,[1]ART!$B:$B,0))),\"\",INDEX([1]ART!$H:$H,MATCH(I14,[1]ART!$B:$B,0)))","v":0.19},16.2393,101.7093,null,null,null,null,null,{"$f":"A14","v":3},null,{"$f":"IF(E14=\"\",\"\",IF(COUNTIF(E$5:E14,E14)>1,\"\",MAX($AB$4:$AB13)+1))","v":""},{"$f":"IF(ROWS($AB$5:$AB14)>MAX($Z$5:$Z$9097),\"\",OFFSET($E$5,MATCH(ROWS($AB$5:$AB14),$Z$5:$Z$9097,0)-1,0))","v":""}]
[{"$f":"IF(ISNA(INDEX([1]VTR!$A:$A,MATCH(D15,[1]VTR!$D:$D,0))),\"\",INDEX([1]VTR!$A:$A,MATCH(D15,[1]VTR!$D:$D,0)))","v":3},{"$f":"IF(C15<>\"\",\"\",IF(B14=\"\",B14,B14))","v":"01"},null,"17.01-03",null,null,{"$f":"IF(ISNA(INDEX([1]ART!$Q:$Q,MATCH(I15,[1]ART!$B:$B,0))),\"\",INDEX([1]ART!$Q:$Q,MATCH(I15,[1]ART!$B:$B,0)))","v":"1-PRS"},"3","TP",{"$f":"IF(ISNA(INDEX([1]ART!$C:$C,MATCH(I15,[1]ART!$B:$B,0))),\"\",INDEX([1]ART!$C:$C,MATCH(I15,[1]ART!$B:$B,0)))","v":"Tirage Noir & Blanc / Papier"},{"$f":"IF(ISNA(INDEX([1]ART!$D:$D,MATCH(I15,[1]ART!$B:$B,0))),\"\",INDEX([1]ART!$D:$D,MATCH(I15,[1]ART!$B:$B,0)))","v":"ML"},3.6,68.380555555555546,246.17,0,0,246.17,{"$f":"IF(ISNA(INDEX([1]ART!$H:$H,MATCH(I15,[1]ART!$B:$B,0))),\"\",INDEX([1]ART!$H:$H,MATCH(I15,[1]ART!$B:$B,0)))","v":0.19},46.772300000000001,292.94229999999999,null,null,null,null,null,{"$f":"A15","v":3},null,{"$f":"IF(E15=\"\",\"\",IF(COUNTIF(E$5:E15,E15)>1,\"\",MAX($AB$4:$AB14)+1))","v":""},{"$f":"IF(ROWS($AB$5:$AB15)>MAX($Z$5:$Z$9097),\"\",OFFSET($E$5,MATCH(ROWS($AB$5:$AB15),$Z$5:$Z$9097,0)-1,0))","v":""}]
[{"$f":"IF(ISNA(INDEX([1]VTR!$A:$A,MATCH(D16,[1]VTR!$D:$D,0))),\"\",INDEX([1]VTR!$A:$A,MATCH(D16,[1]VTR!$D:$D,0)))","v":3},{"$f":"IF(C16<>\"\",\"\",IF(B15=\"\",B15,B15))","v":"01"},null,"17.01-03",null,null,{"$f":"IF(ISNA(INDEX([1]ART!$Q:$Q,MATCH(I16,[1]ART!$B:$B,0))),\"\",INDEX([1]ART!$Q:$Q,MATCH(I16,[1]ART!$B:$B,0)))","v":"1-PRS"},"4","PP0",{"$f":"IF(ISNA(INDEX([1]ART!$C:$C,MATCH(I16,[1]ART!$B:$B,0))),\"\",INDEX([1]ART!$C:$C,MATCH(I16,[1]ART!$B:$B,0)))","v":"Traçage Couleur / Papier (aucun aplat)"},{"$f":"IF(ISNA(INDEX([1]ART!$D:$D,MATCH(I16,[1]ART!$B:$B,0))),\"\",INDEX([1]ART!$D:$D,MATCH(I16,[1]ART!$B:$B,0)))","v":"ML"},1.2,427.35000000000008,512.82000000000005,0,0,512.82000000000005,{"$f":"IF(ISNA(INDEX([1]ART!$H:$H,MATCH(I16,[1]ART!$B:$B,0))),\"\",INDEX([1]ART!$H:$H,MATCH(I16,[1]ART!$B:$B,0)))","v":0.19},97.435800000000015,610.25580000000002,null,null,null,null,null,{"$f":"A16","v":3},null,{"$f":"IF(E16=\"\",\"\",IF(COUNTIF(E$5:E16,E16)>1,\"\",MAX($AB$4:$AB15)+1))","v":""},{"$f":"IF(ROWS($AB$5:$AB16)>MAX($Z$5:$Z$9097),\"\",OFFSET($E$5,MATCH(ROWS($AB$5:$AB16),$Z$5:$Z$9097,0)-1,0))","v":""}]
[0,"01","2017-01-25","",{"$f":"IF(C17=\"\",\"\",\"17.\"&TEXT(B17,\"00\")&\"-\"&TEXT(SUMPRODUCT((LEFT(E$4:E16,5)=\"17.\"&TEXT($B17,\"00\"))*1)+1,\"00\"))","v":"17.01-04"},"FITNESS",{"$f":"IF(ISNA(INDEX([1]ART!$Q:$Q,MATCH(I17,[1]ART!$B:$B,0))),\"\",INDEX([1]ART!$Q:$Q,MATCH(I17,[1]ART!$B:$B,0)))","v":""},null,2,{"$f":"IF(ISNA(INDEX([1]ART!$C:$C,MATCH(I17,[1]ART!$B:$B,0))),\"\",INDEX([1]ART!$C:$C,MATCH(I17,[1]ART!$B:$B,0)))","v":""},{"$f":"IF(ISNA(INDEX([1]ART!$D:$D,MATCH(I17,[1]ART!$B:$B,0))),\"\",INDEX([1]ART!$D:$D,MATCH(I17,[1]ART!$B:$B,0)))","v":""},null,null,{"$f":"SUMIF($D18:$D$9423,$E17,N18:N$9423)","v":7051.3},{"$f":"P17/N17","v":4.9990781841646223E-2},352.5,{"$f":"N17-P17","v":6698.8},{"$f":"R18","v":0.19},{"$f":"Q17*R17","v":1272.7720000000002},{"$f":"Q17+S17","v":7971.5720000000001},{"$f":"ROUNDDOWN(T17,-2)/100","v":79},{"$f":"T17+U17","v":8050.5720000000001},".",null,null,{"$f":"A18","v":4},null,{"$f":"IF(E17=\"\",\"\",IF(COUNTIF(E$5:E17,E17)>1,\"\",MAX($AB$4:$AB16)+1))","v":4},{"$f":"IF(ROWS($AB$5:$AB17)>MAX($Z$5:$Z$9097),\"\",OFFSET($E$5,MATCH(ROWS($AB$5:$AB17),$Z$5:$Z$9097,0)-1,0))","v":""}]
[{"$f":"IF(ISNA(INDEX([1]VTR!$A:$A,MATCH(D18,[1]VTR!$D:$D,0))),\"\",INDEX([1]VTR!$A:$A,MATCH(D18,[1]VTR!$D:$D,0)))","v":4},{"$f":"IF(C18<>\"\",\"\",IF(B17=\"\",B17,B17))","v":"01"},null,"17.01-04",null,null,{"$f":"IF(ISNA(INDEX([1]ART!$Q:$Q,MATCH(I18,[1]ART!$B:$B,0))),\"\",INDEX([1]ART!$Q:$Q,MATCH(I18,[1]ART!$B:$B,0)))","v":"1-PRS"},"1","PP1",{"$f":"IF(ISNA(INDEX([1]ART!$C:$C,MATCH(I18,[1]ART!$B:$B,0))),\"\",INDEX([1]ART!$C:$C,MATCH(I18,[1]ART!$B:$B,0)))","v":"Traçage Couleur / Papier (avec aplats)"},{"$f":"IF(ISNA(INDEX([1]ART!$D:$D,MATCH(I18,[1]ART!$B:$B,0))),\"\",INDEX([1]ART!$D:$D,MATCH(I18,[1]ART!$B:$B,0)))","v":"ML"},10,705.13,7051.3,4.9990781841646223E-2,352.5,{"$f":"N18-P18","v":6698.8},{"$f":"IF(ISNA(INDEX([1]ART!$H:$H,MATCH(I18,[1]ART!$B:$B,0))),\"\",INDEX([1]ART!$H:$H,MATCH(I18,[1]ART!$B:$B,0)))","v":0.19},{"$f":"Q18*R18","v":1272.7720000000002},{"$f":"Q18+S18","v":7971.5720000000001},null,null,null,null,null,{"$f":"A18","v":4},null,{"$f":"IF(E18=\"\",\"\",IF(COUNTIF(E$5:E18,E18)>1,\"\",MAX($AB$4:$AB17)+1))","v":""},{"$f":"IF(ROWS($AB$5:$AB18)>MAX($Z$5:$Z$9097),\"\",OFFSET($E$5,MATCH(ROWS($AB$5:$AB18),$Z$5:$Z$9097,0)-1,0))","v":""}]
[0,"01","2017-01-25",{"$f":"IF(E19<>\"\",\"\",IF(D18=\"\",E18,D18))","v":""},{"$f":"IF(C19=\"\",\"\",\"17.\"&TEXT(B19,\"00\")&\"-\"&TEXT(SUMPRODUCT((LEFT(E$4:E18,5)=\"17.\"&TEXT($B19,\"00\"))*1)+1,\"00\"))","v":"17.01-05"},null,{"$f":"IF(ISNA(INDEX([1]ART!$Q:$Q,MATCH(I19,[1]ART!$B:$B,0))),\"\",INDEX([1]ART!$Q:$Q,MATCH(I19,[1]ART!$B:$B,0)))","v":""},null,2,{"$f":"IF(ISNA(INDEX([1]ART!$C:$C,MATCH(I19,[1]ART!$B:$B,0))),\"\",INDEX([1]ART!$C:$C,MATCH(I19,[1]ART!$B:$B,0)))","v":""},{"$f":"IF(ISNA(INDEX([1]ART!$D:$D,MATCH(I19,[1]ART!$B:$B,0))),\"\",INDEX([1]ART!$D:$D,MATCH(I19,[1]ART!$B:$B,0)))","v":""},null,null,{"$f":"SUMIF($D20:$D$9423,$E19,N20:N$9423)","v":0},{"$f":"P19/N19","v":{"$error":"#DIV/0!"}},null,{"$f":"N19-P19","v":0},{"$f":"R20","v":""},{"$f":"Q19*R19","v":{"$error":"#VALUE!"}},{"$f":"Q19+S19","v":{"$error":"#VALUE!"}},null,{"$f":"T19+U19","v":{"$error":"#VALUE!"}},".",null,null,{"$f":"A20","v":5},null,{"$f":"IF(E19=\"\",\"\",IF(COUNTIF(E$5:E19,E19)>1,\"\",MAX($AB$4:$AB18)+1))","v":5},{"$f":"IF(ROWS($AB$5:$AB19)>MAX($Z$5:$Z$9097),\"\",OFFSET($E$5,MATCH(ROWS($AB$5:$AB19),$Z$5:$Z$9097,0)-1,0))","v":""}]
[{"$f":"IF(ISNA(INDEX([1]VTR!$A:$A,MATCH(D20,[1]VTR!$D:$D,0))),\"\",INDEX([1]VTR!$A:$A,MATCH(D20,[1]VTR!$D:$D,0)))","v":5},{"$f":"IF(C20<>\"\",\"\",IF(B19=\"\",B19,B19))","v":"01"},null,"17.01-05",null,null,{"$f":"IF(ISNA(INDEX([1]ART!$Q:$Q,MATCH(I20,[1]ART!$B:$B,0))),\"\",INDEX([1]ART!$Q:$Q,MATCH(I20,[1]ART!$B:$B,0)))","v":""},null,null,{"$f":"IF(ISNA(INDEX([1]ART!$C:$C,MATCH(I20,[1]ART!$B:$B,0))),\"\",INDEX([1]ART!$C:$C,MATCH(I20,[1]ART!$B:$B,0)))","v":""},{"$f":"IF(ISNA(INDEX([1]ART!$D:$D,MATCH(I20,[1]ART!$B:$B,0))),\"\",INDEX([1]ART!$D:$D,MATCH(I20,[1]ART!$B:$B,0)))","v":""},null,null,null,null,null,null,{"$f":"IF(ISNA(INDEX([1]ART!$H:$H,MATCH(I20,[1]ART!$B:$B,0))),\"\",INDEX([1]ART!$H:$H,MATCH(I20,[1]ART!$B:$B,0)))","v":""}]
[{"$f":"IF(ISNA(INDEX([1]VTR!$A:$A,MATCH(D21,[1]VTR!$D:$D,0))),\"\",INDEX([1]VTR!$A:$A,MATCH(D21,[1]VTR!$D:$D,0)))","v":5},{"$f":"IF(C21<>\"\",\"\",IF(B20=\"\",B20,B20))","v":"01"},null,"17.01-05",null,null,{"$f":"IF(ISNA(INDEX([1]ART!$Q:$Q,MATCH(I21,[1]ART!$B:$B,0))),\"\",INDEX([1]ART!$Q:$Q,MATCH(I21,[1]ART!$B:$B,0)))","v":""},null,null,{"$f":"IF(ISNA(INDEX([1]ART!$C:$C,MATCH(I21,[1]ART!$B:$B,0))),\"\",INDEX([1]ART!$C:$C,MATCH(I21,[1]ART!$B:$B,0)))","v":""},{"$f":"IF(ISNA(INDEX([1]ART!$D:$D,MATCH(I21,[1]ART!$B:$B,0))),\"\",INDEX([1]ART!$D:$D,MATCH(I21,[1]ART!$B:$B,0)))","v":""},null,null,null,null,null,null,{"$f":"IF(ISNA(INDEX([1]ART!$H:$H,MATCH(I21,[1]ART!$B:$B,0))),\"\",INDEX([1]ART!$H:$H,MATCH(I21,[1]ART!$B:$B,0)))","v":""}]
[{"$f":"IF(ISNA(INDEX([1]VTR!$A:$A,MATCH(D22,[1]VTR!$D:$D,0))),\"\",INDEX([1]VTR!$A:$A,MATCH(D22,[1]VTR!$D:$D,0)))","v":5},"01",null,"17.01-05",null,null,{"$f":"IF(ISNA(INDEX([1]ART!$Q:$Q,MATCH(I22,[1]ART!$B:$B,0))),\"\",INDEX([1]ART!$Q:$Q,MATCH(I22,[1]ART!$B:$B,0)))","v":""},null,null,{"$f":"IF(ISNA(INDEX([1]ART!$C:$C,MATCH(I22,[1]ART!$B:$B,0))),\"\",INDEX([1]ART!$C:$C,MATCH(I22,[1]ART!$B:$B,0)))","v":""},{"$f":"IF(ISNA(INDEX([1]ART!$D:$D,MATCH(I22,[1]ART!$B:$B,0))),\"\",INDEX([1]ART!$D:$D,MATCH(I22,[1]ART!$B:$B,0)))","v":""},null,null,null,null,null,null,{"$f":"IF(ISNA(INDEX([1]ART!$H:$H,MATCH(I22,[1]ART!$B:$B,0))),\"\",INDEX([1]ART!$H:$H,MATCH(I22,[1]ART!$B:$B,0)))","v":""}]
[{"$f":"IF(ISNA(INDEX([1]VTR!$A:$A,MATCH(D23,[1]VTR!$D:$D,0))),\"\",INDEX([1]VTR!$A:$A,MATCH(D23,[1]VTR!$D:$D,0)))","v":5},"01",null,"17.01-05",null,null,{"$f":"IF(ISNA(INDEX([1]ART!$Q:$Q,MATCH(I23,[1]ART!$B:$B,0))),\"\",INDEX([1]ART!$Q:$Q,MATCH(I23,[1]ART!$B:$B,0)))","v":""},null,null,{"$f":"IF(ISNA(INDEX([1]ART!$C:$C,MATCH(I23,[1]ART!$B:$B,0))),\"\",INDEX([1]ART!$C:$C,MATCH(I23,[1]ART!$B:$B,0)))","v":""},{"$f":"IF(ISNA(INDEX([1]ART!$D:$D,MATCH(I23,[1]ART!$B:$B,0))),\"\",INDEX([1]ART!$D:$D,MATCH(I23,[1]ART!$B:$B,0)))","v":""},null,null,null,null,null,null,{"$f":"IF(ISNA(INDEX([1]ART!$H:$H,MATCH(I23,[1]ART!$B:$B,0))),\"\",INDEX([1]ART!$H:$H,MATCH(I23,[1]ART!$B:$B,0)))","v":""}]
[{"$f":"IF(ISNA(INDEX([1]VTR!$A:$A,MATCH(D24,[1]VTR!$D:$D,0))),\"\",INDEX([1]VTR!$A:$A,MATCH(D24,[1]VTR!$D:$D,0)))","v":5},"01",null,"17.01-05",null,null,{"$f":"IF(ISNA(INDEX([1]ART!$Q:$Q,MATCH(I24,[1]ART!$B:$B,0))),\"\",INDEX([1]ART!$Q:$Q,MATCH(I24,[1]ART!$B:$B,0)))","v":""},null,null,{"$f":"IF(ISNA(INDEX([1]ART!$C:$C,MATCH(I24,[1]ART!$B:$B,0))),\"\",INDEX([1]ART!$C:$C,MATCH(I24,[1]ART!$B:$B,0)))","v":""},{"$f":"IF(ISNA(INDEX([1]ART!$D:$D,MATCH(I24,[1]ART!$B:$B,0))),\"\",INDEX([1]ART!$D:$D,MATCH(I24,[1]ART!$B:$B,0)))","v":""},null,null,null,null,null,null,{"$f":"IF(ISNA(INDEX([1]ART!$H:$H,MATCH(I24,[1]ART!$B:$B,0))),\"\",INDEX([1]ART!$H:$H,MATCH(I24,[1]ART!$B:$B,0)))","v":""}]
[{"$f":"IF(ISNA(INDEX([1]VTR!$A:$A,MATCH(D25,[1]VTR!$D:$D,0))),\"\",INDEX([1]VTR!$A:$A,MATCH(D25,[1]VTR!$D:$D,0)))","v":5},"01",null,"17.01-05",null,null,{"$f":"IF(ISNA(INDEX([1]ART!$Q:$Q,MATCH(I25,[1]ART!$B:$B,0))),\"\",INDEX([1]ART!$Q:$Q,MATCH(I25,[1]ART!$B:$B,0)))","v":""},null,null,{"$f":"IF(ISNA(INDEX([1]ART!$C:$C,MATCH(I25,[1]ART!$B:$B,0))),\"\",INDEX([1]ART!$C:$C,MATCH(I25,[1]ART!$B:$B,0)))","v":""},{"$f":"IF(ISNA(INDEX([1]ART!$D:$D,MATCH(I25,[1]ART!$B:$B,0))),\"\",INDEX([1]ART!$D:$D,MATCH(I25,[1]ART!$B:$B,0)))","v":""},null,null,null,null,null,null,{"$f":"IF(ISNA(INDEX([1]ART!$H:$H,MATCH(I25,[1]ART!$B:$B,0))),\"\",INDEX([1]ART!$H:$H,MATCH(I25,[1]ART!$B:$B,0)))","v":""}]
[{"$f":"IF(ISNA(INDEX([1]VTR!$A:$A,MATCH(D26,[1]VTR!$D:$D,0))),\"\",INDEX([1]VTR!$A:$A,MATCH(D26,[1]VTR!$D:$D,0)))","v":5},"01",null,"17.01-05",null,null,{"$f":"IF(ISNA(INDEX([1]ART!$Q:$Q,MATCH(I26,[1]ART!$B:$B,0))),\"\",INDEX([1]ART!$Q:$Q,MATCH(I26,[1]ART!$B:$B,0)))","v":""},null,null,{"$f":"IF(ISNA(INDEX([1]ART!$C:$C,MATCH(I26,[1]ART!$B:$B,0))),\"\",INDEX([1]ART!$C:$C,MATCH(I26,[1]ART!$B:$B,0)))","v":""},{"$f":"IF(ISNA(INDEX([1]ART!$D:$D,MATCH(I26,[1]ART!$B:$B,0))),\"\",INDEX([1]ART!$D:$D,MATCH(I26,[1]ART!$B:$B,0)))","v":""},null,null,null,null,null,null,{"$f":"IF(ISNA(INDEX([1]ART!$H:$H,MATCH(I26,[1]ART!$B:$B,0))),\"\",INDEX([1]ART!$H:$H,MATCH(I26,[1]ART!$B:$B,0)))","v":""}]
[{"$f":"IF(ISNA(INDEX([1]VTR!$A:$A,MATCH(D27,[1]VTR!$D:$D,0))),\"\",INDEX([1]VTR!$A:$A,MATCH(D27,[1]VTR!$D:$D,0)))","v":5},"01",null,"17.01-05",null,null,{"$f":"IF(ISNA(INDEX([1]ART!$Q:$Q,MATCH(I27,[1]ART!$B:$B,0))),\"\",INDEX([1]ART!$Q:$Q,MATCH(I27,[1]ART!$B:$B,0)))","v":""},null,null,{"$f":"IF(ISNA(INDEX([1]ART!$C:$C,MATCH(I27,[1]ART!$B:$B,0))),\"\",INDEX([1]ART!$C:$C,MATCH(I27,[1]ART!$B:$B,0)))","v":""},{"$f":"IF(ISNA(INDEX([1]ART!$D:$D,MATCH(I27,[1]ART!$B:$B,0))),\"\",INDEX([1]ART!$D:$D,MATCH(I27,[1]ART!$B:$B,0)))","v":""},null,null,null,null,null,null,{"$f":"IF(ISNA(INDEX([1]ART!$H:$H,MATCH(I27,[1]ART!$B:$B,0))),\"\",INDEX([1]ART!$H:$H,MATCH(I27,[1]ART!$B:$B,0)))","v":""}]
[{"$f":"IF(ISNA(INDEX([1]VTR!$A:$A,MATCH(D28,[1]VTR!$D:$D,0))),\"\",INDEX([1]VTR!$A:$A,MATCH(D28,[1]VTR!$D:$D,0)))","v":5},"01",null,"17.01-05",null,null,{"$f":"IF(ISNA(INDEX([1]ART!$Q:$Q,MATCH(I28,[1]ART!$B:$B,0))),\"\",INDEX([1]ART!$Q:$Q,MATCH(I28,[1]ART!$B:$B,0)))","v":""},null,null,{"$f":"IF(ISNA(INDEX([1]ART!$C:$C,MATCH(I28,[1]ART!$B:$B,0))),\"\",INDEX([1]ART!$C:$C,MATCH(I28,[1]ART!$B:$B,0)))","v":""},{"$f":"IF(ISNA(INDEX([1]ART!$D:$D,MATCH(I28,[1]ART!$B:$B,0))),\"\",INDEX([1]ART!$D:$D,MATCH(I28,[1]ART!$B:$B,0)))","v":""},null,null,null,null,null,null,{"$f":"IF(ISNA(INDEX([1]ART!$H:$H,MATCH(I28,[1]ART!$B:$B,0))),\"\",INDEX([1]ART!$H:$H,MATCH(I28,[1]ART!$B:$B,0)))","v":""}]
[{"$f":"IF(ISNA(INDEX([1]VTR!$A:$A,MATCH(D29,[1]VTR!$D:$D,0))),\"\",INDEX([1]VTR!$A:$A,MATCH(D29,[1]VTR!$D:$D,0)))","v":5},"01",null,"17.01-05",null,null,{"$f":"IF(ISNA(INDEX([1]ART!$Q:$Q,MATCH(I29,[1]ART!$B:$B,0))),\"\",INDEX([1]ART!$Q:$Q,MATCH(I29,[1]ART!$B:$B,0)))","v":""},null,null,{"$f":"IF(ISNA(INDEX([1]ART!$C:$C,MATCH(I29,[1]ART!$B:$B,0))),\"\",INDEX([1]ART!$C:$C,MATCH(I29,[1]ART!$B:$B,0)))","v":""},{"$f":"IF(ISNA(INDEX([1]ART!$D:$D,MATCH(I29,[1]ART!$B:$B,0))),\"\",INDEX([1]ART!$D:$D,MATCH(I29,[1]ART!$B:$B,0)))","v":""},null,null,null,null,null,null,{"$f":"IF(ISNA(INDEX([1]ART!$H:$H,MATCH(I29,[1]ART!$B:$B,0))),\"\",INDEX([1]ART!$H:$H,MATCH(I29,[1]ART!$B:$B,0)))","v":""}]
[{"$f":"IF(ISNA(INDEX([1]VTR!$A:$A,MATCH(D30,[1]VTR!$D:$D,0))),\"\",INDEX([1]VTR!$A:$A,MATCH(D30,[1]VTR!$D:$D,0)))","v":5},"01",null,"17.01-05",null,null,{"$f":"IF(ISNA(INDEX([1]ART!$Q:$Q,MATCH(I30,[1]ART!$B:$B,0))),\"\",INDEX([1]ART!$Q:$Q,MATCH(I30,[1]ART!$B:$B,0)))","v":""},null,null,{"$f":"IF(ISNA(INDEX([1]ART!$C:$C,MATCH(I30,[1]ART!$B:$B,0))),\"\",INDEX([1]ART!$C:$C,MATCH(I30,[1]ART!$B:$B,0)))","v":""},{"$f":"IF(ISNA(INDEX([1]ART!$D:$D,MATCH(I30,[1]ART!$B:$B,0))),\"\",INDEX([1]ART!$D:$D,MATCH(I30,[1]ART!$B:$B,0)))","v":""},null,null,null,null,null,null,{"$f":"IF(ISNA(INDEX([1]ART!$H:$H,MATCH(I30,[1]ART!$B:$B,0))),\"\",INDEX([1]ART!$H:$H,MATCH(I30,[1]ART!$B:$B,0)))","v":""}]
{"$rows_left_out":8}
{"sheet":"Feuil2","index":1,"n_rows":0,"n_cols":0,"rows_kept":0,"cut":false,"hidden":false,"merged":[]}

{"sheet":"Feuil3","index":2,"n_rows":0,"n_cols":0,"rows_kept":0,"cut":false,"hidden":false,"merged":[]}