{"text_format":"1","workbook":"xlsx","n_sheets":4,"sheets":["Thème","Ordre","Original","Liste photos"],"not_rendered":{"charts":0,"images":0,"macros":1,"external_links":1,"defined_names":3,"comments":0,"pivot_tables":0},"unopened":[],"bounds":{"document_bytes":16777216,"sheet_cells":100000,"rows_first":2000,"rows_last":500,"rows_between":2000,"halvings":0,"cell_chars":16384,"cell_head_chars":4096},"cells_cut":0,"cells_raw":0,"read":"whole","date_system":"1900"}

{"sheet":"Thème","index":0,"n_rows":36,"n_cols":10,"rows_kept":36,"cut":false,"hidden":false,"merged":[]}
[]
[null,null,"Palmares FDT 2016\nS.M.C"]
[]
[null,null,"Thème","Thème","N° d'ordre","Catégorie","Titre","Auteur","Pays","Code"]
[1,"FIAP","Médailles d'or Thème",{"$f":"COUNTIF($C7,\"*Thème*\")","v":1},1,{"$f":"IF($E5=\"\",\"\",VLOOKUP($E5,'Liste photos'!$A$3:$F$1410,6,FALSE))","v":"Thème"},{"$f":"IF($E5=\"\",\"\",VLOOKUP($E5,'Liste photos'!$A$3:$F$1410,5,FALSE))","v":"Street washerwoman"},{"$f":"IF($E5=\"\",\"\",VLOOKUP($E5,'Liste photos'!$A$3:$F$1410,2,FALSE))","v":"Zhang  Tianming"},{"$f":"IF($E5=\"\",\"\",VLOOKUP($E5,'Liste photos'!$A$3:$F$1410,3,FALSE))","v":"Chine"},{"$f":"IF($E5=\"\",\"\",VLOOKUP($E5,'Liste photos'!$A$3:$F$1410,4,FALSE))","v":"CNZHTI005171_54.JPG"}]
[2,"PSA","Médailles d'or PSA Thème",{"$f":"COUNTIF($C5,\"*Thème*\")","v":1},2,{"$f":"IF($E6=\"\",\"\",VLOOKUP($E6,'Liste photos'!$A$3:$F$1410,6,FALSE))","v":"Thème"},{"$f":"IF($E6=\"\",\"\",VLOOKUP($E6,'Liste photos'!$A$3:$F$1410,5,FALSE))","v":"Texting"},{"$f":"IF($E6=\"\",\"\",VLOOKUP($E6,'Liste photos'!$A$3:$F$1410,2,FALSE))","v":"Hyllseth  Torhild"},{"$f":"IF($E6=\"\",\"\",VLOOKUP($E6,'Liste photos'!$A$3:$F$1410,3,FALSE))","v":"Norvège"},{"$f":"IF($E6=\"\",\"\",VLOOKUP($E6,'Liste photos'!$A$3:$F$1410,4,FALSE))","v":"NOHYTO004760_54.JPG"}]
[3,"FPF","Médaille d'or Thème",{"$f":"COUNTIF($C18,\"*Thème*\")","v":1},3,{"$f":"IF($E7=\"\",\"\",VLOOKUP($E7,'Liste photos'!$A$3:$F$1410,6,FALSE))","v":"Thème"},{"$f":"IF($E7=\"\",\"\",VLOOKUP($E7,'Liste photos'!$A$3:$F$1410,5,FALSE))","v":"Hanging around"},{"$f":"IF($E7=\"\",\"\",VLOOKUP($E7,'Liste photos'!$A$3:$F$1410,2,FALSE))","v":"Selzer  Klaus-Peter"},{"$f":"IF($E7=\"\",\"\",VLOOKUP($E7,'Liste photos'!$A$3:$F$1410,3,FALSE))","v":"Allemagne"},{"$f":"IF($E7=\"\",\"\",VLOOKUP($E7,'Liste photos'!$A$3:$F$1410,4,FALSE))","v":"DESEKL005085_51.JPG"}]
[4,"IUP","Médailles d'or Thème",{"$f":"COUNTIF($C19,\"*Thème*\")","v":1},4,{"$f":"IF($E8=\"\",\"\",VLOOKUP($E8,'Liste photos'!$A$3:$F$1410,6,FALSE))","v":"Thème"},{"$f":"IF($E8=\"\",\"\",VLOOKUP($E8,'Liste photos'!$A$3:$F$1410,5,FALSE))","v":"la quietude"},{"$f":"IF($E8=\"\",\"\",VLOOKUP($E8,'Liste photos'!$A$3:$F$1410,2,FALSE))","v":"Le Mouel  Martine"},{"$f":"IF($E8=\"\",\"\",VLOOKUP($E8,'Liste photos'!$A$3:$F$1410,3,FALSE))","v":"France"},{"$f":"IF($E8=\"\",\"\",VLOOKUP($E8,'Liste photos'!$A$3:$F$1410,4,FALSE))","v":"FRLEMA004827_53.JPG"}]
[5,"PSA","Médailles d'argent PSA Thème",{"$f":"COUNTIF($C20,\"*Thème*\")","v":1},5,{"$f":"IF($E9=\"\",\"\",VLOOKUP($E9,'Liste photos'!$A$3:$F$1410,6,FALSE))","v":"Thème"},{"$f":"IF($E9=\"\",\"\",VLOOKUP($E9,'Liste photos'!$A$3:$F$1410,5,FALSE))","v":"La star"},{"$f":"IF($E9=\"\",\"\",VLOOKUP($E9,'Liste photos'!$A$3:$F$1410,2,FALSE))","v":"Amenta  Armand"},{"$f":"IF($E9=\"\",\"\",VLOOKUP($E9,'Liste photos'!$A$3:$F$1410,3,FALSE))","v":"France"},{"$f":"IF($E9=\"\",\"\",VLOOKUP($E9,'Liste photos'!$A$3:$F$1410,4,FALSE))","v":"FRAMAR004907_53.JPG"}]
[6,"GPU","Médaille d'argent Thème",{"$f":"COUNTIF($C21,\"*Thème*\")","v":1},6,{"$f":"IF($E10=\"\",\"\",VLOOKUP($E10,'Liste photos'!$A$3:$F$1410,6,FALSE))","v":"Thème"},{"$f":"IF($E10=\"\",\"\",VLOOKUP($E10,'Liste photos'!$A$3:$F$1410,5,FALSE))","v":"Musichien"},{"$f":"IF($E10=\"\",\"\",VLOOKUP($E10,'Liste photos'!$A$3:$F$1410,2,FALSE))","v":"Causse  Eric"},{"$f":"IF($E10=\"\",\"\",VLOOKUP($E10,'Liste photos'!$A$3:$F$1410,3,FALSE))","v":"France"},{"$f":"IF($E10=\"\",\"\",VLOOKUP($E10,'Liste photos'!$A$3:$F$1410,4,FALSE))","v":"FRCAER004805_54.JPG"}]
[7,"ISF","Médaille d'argent Thème",{"$f":"COUNTIF($C6,\"*Thème*\")","v":1},7,{"$f":"IF($E11=\"\",\"\",VLOOKUP($E11,'Liste photos'!$A$3:$F$1410,6,FALSE))","v":"Thème"},{"$f":"IF($E11=\"\",\"\",VLOOKUP($E11,'Liste photos'!$A$3:$F$1410,5,FALSE))","v":"Wife calling"},{"$f":"IF($E11=\"\",\"\",VLOOKUP($E11,'Liste photos'!$A$3:$F$1410,2,FALSE))","v":"Albrecht  Urs"},{"$f":"IF($E11=\"\",\"\",VLOOKUP($E11,'Liste photos'!$A$3:$F$1410,3,FALSE))","v":"Suisse"},{"$f":"IF($E11=\"\",\"\",VLOOKUP($E11,'Liste photos'!$A$3:$F$1410,4,FALSE))","v":"CHALUR005041_54.JPG"}]
[8,"RPS","Médaille d'argent Thème",{"$f":"COUNTIF($C9,\"*Thème*\")","v":1},8,{"$f":"IF($E12=\"\",\"\",VLOOKUP($E12,'Liste photos'!$A$3:$F$1410,6,FALSE))","v":"Thème"},{"$f":"IF($E12=\"\",\"\",VLOOKUP($E12,'Liste photos'!$A$3:$F$1410,5,FALSE))","v":"Choco talk"},{"$f":"IF($E12=\"\",\"\",VLOOKUP($E12,'Liste photos'!$A$3:$F$1410,2,FALSE))","v":"Lander  Igor"},{"$f":"IF($E12=\"\",\"\",VLOOKUP($E12,'Liste photos'!$A$3:$F$1410,3,FALSE))","v":"Ukraine"},{"$f":"IF($E12=\"\",\"\",VLOOKUP($E12,'Liste photos'!$A$3:$F$1410,4,FALSE))","v":"UALAIG005026_53.JPG"}]
[9,"IUP","Médailles d'argent Thème",{"$f":"COUNTIF($C14,\"*Thème*\")","v":1},9,{"$f":"IF($E13=\"\",\"\",VLOOKUP($E13,'Liste photos'!$A$3:$F$1410,6,FALSE))","v":"Thème"},{"$f":"IF($E13=\"\",\"\",VLOOKUP($E13,'Liste photos'!$A$3:$F$1410,5,FALSE))","v":"Beijos de Saudades"},{"$f":"IF($E13=\"\",\"\",VLOOKUP($E13,'Liste photos'!$A$3:$F$1410,2,FALSE))","v":"Pires Dias  José Manuel"},{"$f":"IF($E13=\"\",\"\",VLOOKUP($E13,'Liste photos'!$A$3:$F$1410,3,FALSE))","v":"France"},{"$f":"IF($E13=\"\",\"\",VLOOKUP($E13,'Liste photos'!$A$3:$F$1410,4,FALSE))","v":"FRPIJO004798_51.JPG"}]
[10,"PSA","Médailles de bronze PSA Thème",{"$f":"COUNTIF($C22,\"*Thème*\")","v":1},10,{"$f":"IF($E14=\"\",\"\",VLOOKUP($E14,'Liste photos'!$A$3:$F$1410,6,FALSE))","v":"Thème"},{"$f":"IF($E14=\"\",\"\",VLOOKUP($E14,'Liste photos'!$A$3:$F$1410,5,FALSE))","v":"Haircut Shop on the Street"},{"$f":"IF($E14=\"\",\"\",VLOOKUP($E14,'Liste photos'!$A$3:$F$1410,2,FALSE))","v":"Desheng  Xu"},{"$f":"IF($E14=\"\",\"\",VLOOKUP($E14,'Liste photos'!$A$3:$F$1410,3,FALSE))","v":"Chine"},{"$f":"IF($E14=\"\",\"\",VLOOKUP($E14,'Liste photos'!$A$3:$F$1410,4,FALSE))","v":"CNDEXU004887_53.JPG"}]
[11,"IUP","Médailles de bronze Thème",{"$f":"COUNTIF($C10,\"*Thème*\")","v":1},11,{"$f":"IF($E15=\"\",\"\",VLOOKUP($E15,'Liste photos'!$A$3:$F$1410,6,FALSE))","v":"Thème"},{"$f":"IF($E15=\"\",\"\",VLOOKUP($E15,'Liste photos'!$A$3:$F$1410,5,FALSE))","v":"Hurry"},{"$f":"IF($E15=\"\",\"\",VLOOKUP($E15,'Liste photos'!$A$3:$F$1410,2,FALSE))","v":"Xiaolian   Zhang"},{"$f":"IF($E15=\"\",\"\",VLOOKUP($E15,'Liste photos'!$A$3:$F$1410,3,FALSE))","v":"Chine"},{"$f":"IF($E15=\"\",\"\",VLOOKUP($E15,'Liste photos'!$A$3:$F$1410,4,FALSE))","v":"CNXIZH004892_51.JPG"}]
[12,"FDT","Médaille d'or Thème",{"$f":"COUNTIF($C23,\"*Thème*\")","v":1},12,{"$f":"IF($E16=\"\",\"\",VLOOKUP($E16,'Liste photos'!$A$3:$F$1410,6,FALSE))","v":"Thème"},{"$f":"IF($E16=\"\",\"\",VLOOKUP($E16,'Liste photos'!$A$3:$F$1410,5,FALSE))","v":"Sprinkle holy water"},{"$f":"IF($E16=\"\",\"\",VLOOKUP($E16,'Liste photos'!$A$3:$F$1410,2,FALSE))","v":"Wang  Bingcheng"},{"$f":"IF($E16=\"\",\"\",VLOOKUP($E16,'Liste photos'!$A$3:$F$1410,3,FALSE))","v":"Chine"},{"$f":"IF($E16=\"\",\"\",VLOOKUP($E16,'Liste photos'!$A$3:$F$1410,4,FALSE))","v":"CNWABI005177_54.JPG"}]
[13,"SMC","Médaille de la ville Thème",{"$f":"COUNTIF($C11,\"*Thème*\")","v":1},14,{"$f":"IF($E17=\"\",\"\",VLOOKUP($E17,'Liste photos'!$A$3:$F$1410,6,FALSE))","v":"Thème"},{"$f":"IF($E17=\"\",\"\",VLOOKUP($E17,'Liste photos'!$A$3:$F$1410,5,FALSE))","v":"Un chameau dans le trafic"},{"$f":"IF($E17=\"\",\"\",VLOOKUP($E17,'Liste photos'!$A$3:$F$1410,2,FALSE))","v":"Travaillé  Claude"},{"$f":"IF($E17=\"\",\"\",VLOOKUP($E17,'Liste photos'!$A$3:$F$1410,3,FALSE))","v":"France"},{"$f":"IF($E17=\"\",\"\",VLOOKUP($E17,'Liste photos'!$A$3:$F$1410,4,FALSE))","v":"FRTRCL005089_52.JPG"}]
[14,"FIAP","Ruban FIAP Thème",{"$f":"COUNTIF($C27,\"*Thème*\")","v":1},15,{"$f":"IF($E18=\"\",\"\",VLOOKUP($E18,'Liste photos'!$A$3:$F$1410,6,FALSE))","v":"Thème"},{"$f":"IF($E18=\"\",\"\",VLOOKUP($E18,'Liste photos'!$A$3:$F$1410,5,FALSE))","v":"retour a l etable"},{"$f":"IF($E18=\"\",\"\",VLOOKUP($E18,'Liste photos'!$A$3:$F$1410,2,FALSE))","v":"Bailly  Michel"},{"$f":"IF($E18=\"\",\"\",VLOOKUP($E18,'Liste photos'!$A$3:$F$1410,3,FALSE))","v":"France"},{"$f":"IF($E18=\"\",\"\",VLOOKUP($E18,'Liste photos'!$A$3:$F$1410,4,FALSE))","v":"FRBAMI004818_53.JPG"}]
[15,"FIAP","Ruban FIAP Thème",{"$f":"COUNTIF($C28,\"*Thème*\")","v":1},16,{"$f":"IF($E19=\"\",\"\",VLOOKUP($E19,'Liste photos'!$A$3:$F$1410,6,FALSE))","v":"Thème"},{"$f":"IF($E19=\"\",\"\",VLOOKUP($E19,'Liste photos'!$A$3:$F$1410,5,FALSE))","v":"The Walk"},{"$f":"IF($E19=\"\",\"\",VLOOKUP($E19,'Liste photos'!$A$3:$F$1410,2,FALSE))","v":"Hofmann  Klaus"},{"$f":"IF($E19=\"\",\"\",VLOOKUP($E19,'Liste photos'!$A$3:$F$1410,3,FALSE))","v":"Allemagne"},{"$f":"IF($E19=\"\",\"\",VLOOKUP($E19,'Liste photos'!$A$3:$F$1410,4,FALSE))","v":"DEHOKL005038_53.JPG"}]
[16,"FIAP","Ruban FIAP Thème",{"$f":"COUNTIF($C12,\"*Thème*\")","v":1},17,{"$f":"IF($E20=\"\",\"\",VLOOKUP($E20,'Liste photos'!$A$3:$F$1410,6,FALSE))","v":"Thème"},{"$f":"IF($E20=\"\",\"\",VLOOKUP($E20,'Liste photos'!$A$3:$F$1410,5,FALSE))","v":"Le joueur d'orgue"},{"$f":"IF($E20=\"\",\"\",VLOOKUP($E20,'Liste photos'!$A$3:$F$1410,2,FALSE))","v":"Frances  Georges"},{"$f":"IF($E20=\"\",\"\",VLOOKUP($E20,'Liste photos'!$A$3:$F$1410,3,FALSE))","v":"France"},{"$f":"IF($E20=\"\",\"\",VLOOKUP($E20,'Liste photos'!$A$3:$F$1410,4,FALSE))","v":"FRFRGE004906_52.JPG"}]
[17,"FIAP","Ruban FIAP Thème",{"$f":"COUNTIF($C8,\"*Thème*\")","v":1},18,{"$f":"IF($E21=\"\",\"\",VLOOKUP($E21,'Liste photos'!$A$3:$F$1410,6,FALSE))","v":"Thème"},{"$f":"IF($E21=\"\",\"\",VLOOKUP($E21,'Liste photos'!$A$3:$F$1410,5,FALSE))","v":"Certainly steps"},{"$f":"IF($E21=\"\",\"\",VLOOKUP($E21,'Liste photos'!$A$3:$F$1410,2,FALSE))","v":"Charalambous  Constantinos"},{"$f":"IF($E21=\"\",\"\",VLOOKUP($E21,'Liste photos'!$A$3:$F$1410,3,FALSE))","v":"Chypre"},{"$f":"IF($E21=\"\",\"\",VLOOKUP($E21,'Liste photos'!$A$3:$F$1410,4,FALSE))","v":"CYCHCO005285_51.JPG"}]
[18,"PSA","Ruban PSA Thème",{"$f":"COUNTIF($C13,\"*Thème*\")","v":1},19,{"$f":"IF($E22=\"\",\"\",VLOOKUP($E22,'Liste photos'!$A$3:$F$1410,6,FALSE))","v":"Thème"},{"$f":"IF($E22=\"\",\"\",VLOOKUP($E22,'Liste photos'!$A$3:$F$1410,5,FALSE))","v":"Those left behind"},{"$f":"IF($E22=\"\",\"\",VLOOKUP($E22,'Liste photos'!$A$3:$F$1410,2,FALSE))","v":"Yang  Fu"},{"$f":"IF($E22=\"\",\"\",VLOOKUP($E22,'Liste photos'!$A$3:$F$1410,3,FALSE))","v":"Chine"},{"$f":"IF($E22=\"\",\"\",VLOOKUP($E22,'Liste photos'!$A$3:$F$1410,4,FALSE))","v":"CNYAFU005169_54.JPG"}]
[19,"GPU","Ruban Thème",{"$f":"COUNTIF($C15,\"*Thème*\")","v":1},20,{"$f":"IF($E23=\"\",\"\",VLOOKUP($E23,'Liste photos'!$A$3:$F$1410,6,FALSE))","v":"Thème"},{"$f":"IF($E23=\"\",\"\",VLOOKUP($E23,'Liste photos'!$A$3:$F$1410,5,FALSE))","v":"Zombie day"},{"$f":"IF($E23=\"\",\"\",VLOOKUP($E23,'Liste photos'!$A$3:$F$1410,2,FALSE))","v":"Viguier  Mireille"},{"$f":"IF($E23=\"\",\"\",VLOOKUP($E23,'Liste photos'!$A$3:$F$1410,3,FALSE))","v":"France"},{"$f":"IF($E23=\"\",\"\",VLOOKUP($E23,'Liste photos'!$A$3:$F$1410,4,FALSE))","v":"FRVIMI004911_54.JPG"}]
[20,"IUP","Ruban IUP Thème",{"$f":"COUNTIF($C24,\"*Thème*\")","v":1},21,{"$f":"IF($E24=\"\",\"\",VLOOKUP($E24,'Liste photos'!$A$3:$F$1410,6,FALSE))","v":"Thème"},{"$f":"IF($E24=\"\",\"\",VLOOKUP($E24,'Liste photos'!$A$3:$F$1410,5,FALSE))","v":"After the war"},{"$f":"IF($E24=\"\",\"\",VLOOKUP($E24,'Liste photos'!$A$3:$F$1410,2,FALSE))","v":"Tevfik  Ileri"},{"$f":"IF($E24=\"\",\"\",VLOOKUP($E24,'Liste photos'!$A$3:$F$1410,3,FALSE))","v":"Chypre"},{"$f":"IF($E24=\"\",\"\",VLOOKUP($E24,'Liste photos'!$A$3:$F$1410,4,FALSE))","v":"CYTEIL002747_51.JPG"}]
[21,"IUP","Ruban IUP Thème",{"$f":"COUNTIF($C25,\"*Thème*\")","v":1},22,{"$f":"IF($E25=\"\",\"\",VLOOKUP($E25,'Liste photos'!$A$3:$F$1410,6,FALSE))","v":"Thème"},{"$f":"IF($E25=\"\",\"\",VLOOKUP($E25,'Liste photos'!$A$3:$F$1410,5,FALSE))","v":"Si grand"},{"$f":"IF($E25=\"\",\"\",VLOOKUP($E25,'Liste photos'!$A$3:$F$1410,2,FALSE))","v":"Flornoy  Caroline"},{"$f":"IF($E25=\"\",\"\",VLOOKUP($E25,'Liste photos'!$A$3:$F$1410,3,FALSE))","v":"France"},{"$f":"IF($E25=\"\",\"\",VLOOKUP($E25,'Liste photos'!$A$3:$F$1410,4,FALSE))","v":"FRFLCA005009_54.JPG"}]
[24,"IUP","Ruban IUP Thème",{"$f":"COUNTIF($C29,\"*Thème*\")","v":1},23,{"$f":"IF($E26=\"\",\"\",VLOOKUP($E26,'Liste photos'!$A$3:$F$1410,6,FALSE))","v":"Thème"},{"$f":"IF($E26=\"\",\"\",VLOOKUP($E26,'Liste photos'!$A$3:$F$1410,5,FALSE))","v":"The Lovers"},{"$f":"IF($E26=\"\",\"\",VLOOKUP($E26,'Liste photos'!$A$3:$F$1410,2,FALSE))","v":"Lechanski  M."},{"$f":"IF($E26=\"\",\"\",VLOOKUP($E26,'Liste photos'!$A$3:$F$1410,3,FALSE))","v":"Royaume-Uni"},{"$f":"IF($E26=\"\",\"\",VLOOKUP($E26,'Liste photos'!$A$3:$F$1410,4,FALSE))","v":"GBLEM.004934_53.JPG"}]
[22,"ISF","Diplôme Thème",{"$f":"COUNTIF($C26,\"*Thème*\")","v":1},24,{"$f":"IF($E27=\"\",\"\",VLOOKUP($E27,'Liste photos'!$A$3:$F$1410,6,FALSE))","v":"Thème"},{"$f":"IF($E27=\"\",\"\",VLOOKUP($E27,'Liste photos'!$A$3:$F$1410,5,FALSE))","v":"Entrance to village"},{"$f":"IF($E27=\"\",\"\",VLOOKUP($E27,'Liste photos'!$A$3:$F$1410,2,FALSE))","v":"Wang  Shibo"},{"$f":"IF($E27=\"\",\"\",VLOOKUP($E27,'Liste photos'!$A$3:$F$1410,3,FALSE))","v":"Chine"},{"$f":"IF($E27=\"\",\"\",VLOOKUP($E27,'Liste photos'!$A$3:$F$1410,4,FALSE))","v":"CNWASH005167_51.JPG"}]
[23,"ISF","Diplôme Thème",{"$f":"COUNTIF($C16,\"*Thème*\")","v":1},25,{"$f":"IF($E28=\"\",\"\",VLOOKUP($E28,'Liste photos'!$A$3:$F$1410,6,FALSE))","v":"Thème"},{"$f":"IF($E28=\"\",\"\",VLOOKUP($E28,'Liste photos'!$A$3:$F$1410,5,FALSE))","v":"Gay pride"},{"$f":"IF($E28=\"\",\"\",VLOOKUP($E28,'Liste photos'!$A$3:$F$1410,2,FALSE))","v":"Dallavalle  Jean"},{"$f":"IF($E28=\"\",\"\",VLOOKUP($E28,'Liste photos'!$A$3:$F$1410,3,FALSE))","v":"France"},{"$f":"IF($E28=\"\",\"\",VLOOKUP($E28,'Liste photos'!$A$3:$F$1410,4,FALSE))","v":"FRDAJE004793_52.JPG"}]
[25,"FDT","Diplôme Thème",{"$f":"COUNTIF($C17,\"*Thème*\")","v":1},26,{"$f":"IF($E29=\"\",\"\",VLOOKUP($E29,'Liste photos'!$A$3:$F$1410,6,FALSE))","v":"Thème"},{"$f":"IF($E29=\"\",\"\",VLOOKUP($E29,'Liste photos'!$A$3:$F$1410,5,FALSE))","v":"A votre bon coeur"},{"$f":"IF($E29=\"\",\"\",VLOOKUP($E29,'Liste photos'!$A$3:$F$1410,2,FALSE))","v":"Raoulas  Daniel"},{"$f":"IF($E29=\"\",\"\",VLOOKUP($E29,'Liste photos'!$A$3:$F$1410,3,FALSE))","v":"France"},{"$f":"IF($E29=\"\",\"\",VLOOKUP($E29,'Liste photos'!$A$3:$F$1410,4,FALSE))","v":"FRRADA003731_54.JPG"}]
[null,null,null,{"$f":"SUM(D5:D29)","v":25}]
[]
[null,null,null,null,"Il suffit de rentrer un N°, compris entre 1 et 1408, dans la colonne \"E\" pour renseigner les autres colonnes d'une même ligne,"]
[]
[null,null,null,null,"On ne peut attribuer qu'une seule récompense à un même auteur dans une catgorie."]
[]
[null,null,null,null,"Les doublons sont signalés en rouge."]

{"sheet":"Ordre","index":1,"n_rows":27,"n_cols":13,"rows_kept":27,"cut":false,"hidden":true,"merged":[[2,2,10,2],[11,2,17,2],[19,2,20,2],[21,2,22,2],[23,2,24,2]]}
[]
[null,null,null,"Couleur",null,"N° d'ordre","Titre","Nom","Prénom","Code"]
[null,null,"FIAP","Médaille d'or Couleur",null,637,"Horseracing","Plovie","Bjorn","BEPLBJ000095_11"]
[null,null,null,"Médaille d'argent Couleur",null,2185,"Sunset Racing","Man-kui, Wisely","Ng","HKMANG000652_11"]
[null,null,null,"Médaille de bronze Couleur",null,716,"Portuguese Love","Joao","Taborda","PTJOTA000547_12",null,"FIAP","FPF"]
[null,null,null,"Ruban FIAP Couleur",null,1349,"Sidecar duo","Plovie","Bjorn","BEPLBJ000095_13",null,"PSA","FIAP"]
[null,null,null,"Ruban FIAP Couleur",null,1983,"The Grinder","Marriott","Steve","GBMAST000459_13",null,"FPF","PSA"]
[null,null,null,"Ruban FIAP Couleur",null,328,"Happy dog","Kyndt","Daniel","BEKYDA000124_12",null,"GPU","GPU"]
[null,null,null,"Ruban FIAP Couleur",null,1361,"Red Shawl","McKelvey","Ross","GBMCRO000775_13",null,"ISF","ISF"]
[null,null,null,"Ruban FIAP Couleur",null,157,"Vivienne - Three Pole Positions","Finighan","Brennan","AUFIBR000215_12",null,"RPS","RPS"]
[null,null,null,"Ruban FIAP Couleur",null,1395,"Walking on water","Papp","Elek","HUPAEL000620_12",null,"IUP","IUP"]
[null,null,"PSA","Médaille d 'or PSA Couleur",null,1481,"All Honour To Our Lord","Patel","Dilip","USPADI000739_13",null,"FDT","FDT"]
[null,null,null,"Médaille d 'argent PSA Couleur",null,2168,"So beauttiful","Cowles","Susan","USCOSU000769_12",null,null,"DIVERS"]
[null,null,null,"Médaille de bronze Couleur",null,1892,"Safari with a difference","Pichler","Thomas","ATPITH000846_12"]
[null,null,null,"Ruban PSA Couleur",null,897,"The Body Snatchers","Grafton","Jacqui Jay","GBGRJA000694_11"]
[null,null,null,"Ruban PSA Couleur",null,283,"Castellers-1","Remola Pages","Lluis","ESRELL000804_13"]
[null,null,null,"Ruban PSA Couleur",null,884,"Battling with calf","Tam","Kam Chiu","CATAKA000283_12"]
[null,null,null,"Ruban PSA Couleur",null,1211,"Waternymph 4","Diana","Carlo","BEDICA000084_14"]
[null,null,"FPF","Médaille d'argent Couleur",null,1349,"Sidecar duo","Plovie","Bjorn","BEPLBJ000095_13"]
[null,null,"UPI","Médaille d'or Couleur",null,1020,"Natalie and Badger","Keene","Paul","GBKEPA000423_11"]
[null,null,null,"Ruban Couleur",null,2205,"Early sunny on the river","Duc Toai","Le","VNDULE000678_12"]
[null,null,"ISF","Diplôme Couleur",null,34,"MorningGlow","Yap","Anthony PW","AUYAAN000532_12"]
[null,null,null,"Diplôme Couleur",null,1480,"The Transience","Buenger","Harry","DEBUHA000049_14"]
[null,null,"FDT","Médaille d'or Couleur",null,2511,"Pierre précieuse","Dubs","Marcel","FRDUMA000411_12"]
[null,null,null,"Diplôme Couleur",null,48,"Dila 4","Cemil","Guven","TRCEGU000869_11"]
[null,null,"Spécif.","Médaille de la ville",null,1774,"Gregory","Papp","Elek","HUPAEL000620_13"]
[null,null,"C.C","Juge 3",null,1409,"Red Bag","Buenger","Harry","DEBUHA000049_12"]

{"sheet":"Original","index":2,"n_rows":112,"n_cols":10,"rows_kept":112,"cut":false,"hidden":true,"merged":[[107,1,110,1],[5,1,8,1],[9,1,33,1],[34,1,38,1],[39,1,42,1],[43,1,46,1],[47,1,50,1],[51,1,60,1],[61,1,71,1],[72,1,74,1],[75,1,98,1],[99,1,106,1]]}
[]
[]
[null,null,"Palmares FDT 2016\nS.M.C"]
[]
[null,null,"Couleur",null,null,"Couleur","Nature","N&B","Thème"]
[1,"FPF","Meilleur auteur Français",null,null,{"$f":"COUNTIF($C$6,\"*Couleur*\")","v":0},{"$f":"COUNTIF($C6,\"*Nature*\")","v":0},{"$f":"COUNTIF($C6,\"*N&B*\")","v":0},{"$f":"COUNTIF($C6,\"*Thème*\")","v":0}]
[2,null,"Médaille d'or Thème",null,null,{"$f":"COUNTIF(C7,\"*Couleur*\")","v":0},{"$f":"COUNTIF($C7,\"*Nature*\")","v":0},{"$f":"COUNTIF($C7,\"*N&B*\")","v":0},{"$f":"COUNTIF($C7,\"*Thème*\")","v":1}]
[3,null,"Médaille d'argent Couleur",null,null,{"$f":"COUNTIF(C8,\"*Couleur*\")","v":1},0,0,0]
[4,null,"Médaille de bronze N&B",null,null,{"$f":"COUNTIF(C9,\"*Couleur*\")","v":0},0,1,0]
[5,"FIAP","Meilleur auteur du Salon",null,null,0,0,0,0]
[6,null,"Médaille d'or Couleur",null,null,1,0,0,0]
[7,null,"Médaile d'or Nature",null,null,0,1,0,0]
[8,null,"Médaille d'or N&B",null,null,0,0,1,0]
[9,null,"Médailles d'or Thème",null,null,0,0,0,1]
[10,null,"Médaille d'argent N&B",null,null,0,0,1,0]
[11,null,"Médaile d'argent Nature",null,null,0,1,0,0]
[12,null,"Médaille de bronze N&B",null,null,0,0,1,0]
[13,null,"Médaile de bronze Nature",null,null,0,1,0,0]
[14,null,"Ruban FIAP Couleur",null,null,1,0,0,0]
[15,null,"Ruban FIAP Couleur",null,null,1,0,0,0]
[16,null,"Ruban FIAP Couleur",null,null,1,0,0,0]
[17,null,"Ruban FIAP Couleur",null,null,1,0,0,0]
[18,null,"Ruban FIAP Nature",null,null,0,1,0,0]
[19,null,"Ruban FIAP Nature",null,null,0,1,0,0]
[20,null,"Ruban FIAP Nature",null,null,0,1,0,0]
[21,null,"Ruban FIAP Nature",null,null,0,1,0,0]
[22,null,"Ruban FIAP N&B",null,null,0,0,1,0]
[23,null,"Ruban FIAP N&B",null,null,0,0,1,0]
[24,null,"Ruban FIAP N&B",null,null,0,0,1,0]
[25,null,"Ruban FIAP N&B",null,null,0,0,1,0]
[26,null,"Ruban FIAP Thème",null,null,0,0,0,1]
[27,null,"Ruban FIAP Thème",null,null,0,0,0,1]
[28,null,"Ruban FIAP Thème",null,null,0,0,0,1]
[29,null,"Ruban FIAP Thème",null,null,0,0,0,1]
[30,"PSA\nCouleur","Médaille d 'or PSA Couleur",null,null,1,0,0,0]
[31,null,"Médaille d 'argent PSA Couleur",null,null,1,0,0,0]
[32,null,"Médaille de bronze Couleur",null,null,1,0,0,0]
[33,null,"Ruban PSA Couleur",null,null,1,0,0,0]
[34,null,"Ruban PSA Couleur",null,null,1,0,0,0]
[35,"PSA\nNature","Médailles d'or PSA Nature",null,null,0,1,0,0]
{"$rows_left_out":73}
{"sheet":"Liste photos","index":3,"n_rows":1410,"n_cols":6,"rows_kept":1410,"cut":false,"hidden":false,"merged":[[0,0,0,5]]}
["Thème"]
["N° Ordre","Auteur","Pays","Nom","Titre","Categorie"]
[1,"Zhang  Tianming","Chine","CNZHTI005171_54.JPG","Street washerwoman","Thème"]
[2,"Hyllseth  Torhild","Norvège","NOHYTO004760_54.JPG","Texting","Thème"]
[3,"Selzer  Klaus-Peter","Allemagne","DESEKL005085_51.JPG","Hanging around","Thème"]
[4,"Le Mouel  Martine","France","FRLEMA004827_53.JPG","la quietude","Thème"]
[5,"Amenta  Armand","France","FRAMAR004907_53.JPG","La star","Thème"]
[6,"Causse  Eric","France","FRCAER004805_54.JPG","Musichien","Thème"]
[7,"Albrecht  Urs","Suisse","CHALUR005041_54.JPG","Wife calling","Thème"]
[8,"Lander  Igor","Ukraine","UALAIG005026_53.JPG","Choco talk","Thème"]
[9,"Pires Dias  José Manuel","France","FRPIJO004798_51.JPG","Beijos de Saudades","Thème"]
[10,"Desheng  Xu","Chine","CNDEXU004887_53.JPG","Haircut Shop on the Street","Thème"]
[11,"Xiaolian   Zhang","Chine","CNXIZH004892_51.JPG","Hurry","Thème"]
[12,"Wang  Bingcheng","Chine","CNWABI005177_54.JPG","Sprinkle holy water","Thème"]
[13,"Bailly  Michel","France","FRBAMI004818_52.JPG","entre les tags","Thème"]
[14,"Travaillé  Claude","France","FRTRCL005089_52.JPG","Un chameau dans le trafic","Thème"]
[15,"Bailly  Michel","France","FRBAMI004818_53.JPG","retour a l etable","Thème"]
[16,"Hofmann  Klaus","Allemagne","DEHOKL005038_53.JPG","The Walk","Thème"]
[17,"Frances  Georges","France","FRFRGE004906_52.JPG","Le joueur d'orgue","Thème"]
[18,"Charalambous  Constantinos","Chypre","CYCHCO005285_51.JPG","Certainly steps","Thème"]
[19,"Yang  Fu","Chine","CNYAFU005169_54.JPG","Those left behind","Thème"]
[20,"Viguier  Mireille","France","FRVIMI004911_54.JPG","Zombie day","Thème"]
[21,"Tevfik  Ileri","Chypre","CYTEIL002747_51.JPG","After the war","Thème"]
[22,"Flornoy  Caroline","France","FRFLCA005009_54.JPG","Si grand","Thème"]
[23,"Lechanski  M.","Royaume-Uni","GBLEM.004934_53.JPG","The Lovers","Thème"]
[24,"Wang  Shibo","Chine","CNWASH005167_51.JPG","Entrance to village","Thème"]
[25,"Dallavalle  Jean","France","FRDAJE004793_52.JPG","Gay pride","Thème"]
[26,"Raoulas  Daniel","France","FRRADA003731_54.JPG","A votre bon coeur","Thème"]
[27,"Feehan  Sean","Irlande","IEFESE005356_52.JPG","Illumination","Thème"]
[28,"Lei  Ming","Chine","CNLEMI005161_53.JPG","Rickshaw boy","Thème"]
[29,"Verelst  Greta","Belgique","BEVEGR004945_54.JPG","Le dernier café","Thème"]
[30,"Pauly  Jean","France","FRPAJE004765_51.JPG","Morgane Chaussure","Thème"]
[31,"Yang  Liming","Chine","CNYALI005217_53.JPG","Street culture","Thème"]
[32,"Lindqvist  Leena-Maija","Finlande","FILILE005275_54.JPG","Water street of Venice 11","Thème"]
[33,"Bacle  Jean Claude","France","FRBAJE004750_52.JPG","Service d ordre","Thème"]
[34,"Mead  Barry","Royaume-Uni","GBMEBA005056_52.JPG","GROTESQUE","Thème"]
[35,"Pauly  Jean","France","FRPAJE004765_54.JPG","Nettoyage","Thème"]
[36,"O'Hagan  David J.","Irlande","IEO'DA005273_52.JPG","Calypso Morning, Dublin","Thème"]
[37,"Feehan  Sean","Irlande","IEFESE005356_53.JPG","Morning Run","Thème"]
[38,"Cividin  Dino","Belgique","BECIDI004752_51.JPG","Collés, serrés !","Thème"]
{"$rows_left_out":1370}