{"text_format":"1","workbook":"xlsx","n_sheets":3,"sheets":["Année1","Année2","Comparatif"],"not_rendered":{"charts":0,"images":0,"macros":0,"external_links":0,"defined_names":2,"comments":0,"pivot_tables":0},"unopened":[],"bounds":{"document_bytes":16777216,"sheet_cells":100000,"rows_first":2000,"rows_last":500,"rows_between":2000,"halvings":0,"cell_chars":16384,"cell_head_chars":4096},"cells_cut":0,"cells_raw":0,"read":"whole","date_system":"1900"}

{"sheet":"Année1","index":0,"n_rows":30,"n_cols":3,"rows_kept":30,"cut":false,"hidden":false,"merged":[]}
["REF","Libellé","Montant"]
["AA_001","Peuplier",1516500]
["AA_002","Sycomore",3060000]
["AA_003","Chêne",1525500]
["AA_004","Bouleau",9189000]
["AA_005","Platane",4603500]
["AA_006","Papayer",3012000]
["AA_007","Cyprés",4608000]
["AA_008","Frêne",1527000]
["AA_009","Manguier",3039000]
["AA_010","If",4612500]
["AA_011","Sorbier",1507500]
["AA_012","Hêtre",4527000]
["AA_013","Erable",3057000]
["AA_014","Saule",1501500]
["AA_015","Olivier",1539000]
["AA_016","Noyer",3003000]
["AA_017","Charme",1512000]
["AA_018","Orme",4567500]
["AA_019","Mélèze",1515000]
{"$rows_left_out":11}
{"sheet":"Année2","index":1,"n_rows":100,"n_cols":4,"rows_kept":100,"cut":false,"hidden":false,"merged":[]}
["REF","Libellé","Montant",{"$f":"COUNTA(Année1!A2:$A$100)+1","v":30}]
["AA_001",{"$f":"VLOOKUP(A2,Année1!$A$2:$B$30,2,0)","v":"Peuplier"},3060000,{"$f":"IF(OR(A2=\"\",COUNTIF(Année1!$A$2:$A$100,A2)),\"\",MAX($D$1:D1)+1)","v":""}]
["AA_002",{"$f":"VLOOKUP(A3,Année1!$A$2:$B$30,2,0)","v":"Sycomore"},4567500,{"$f":"IF(OR(A3=\"\",COUNTIF(Année1!$A$2:$A$100,A3)),\"\",MAX($D$1:D2)+1)","v":""}]
["AA_003",{"$f":"VLOOKUP(A4,Année1!$A$2:$B$30,2,0)","v":"Chêne"},4527000,{"$f":"IF(OR(A4=\"\",COUNTIF(Année1!$A$2:$A$100,A4)),\"\",MAX($D$1:D3)+1)","v":""}]
["AA_005",{"$f":"VLOOKUP(A5,Année1!$A$2:$B$30,2,0)","v":"Platane"},1515000,{"$f":"IF(OR(A5=\"\",COUNTIF(Année1!$A$2:$A$100,A5)),\"\",MAX($D$1:D4)+1)","v":""}]
["AA_006",{"$f":"VLOOKUP(A6,Année1!$A$2:$B$30,2,0)","v":"Papayer"},1507500,{"$f":"IF(OR(A6=\"\",COUNTIF(Année1!$A$2:$A$100,A6)),\"\",MAX($D$1:D5)+1)","v":""}]
["AA_007",{"$f":"VLOOKUP(A7,Année1!$A$2:$B$30,2,0)","v":"Cyprés"},3039000,{"$f":"IF(OR(A7=\"\",COUNTIF(Année1!$A$2:$A$100,A7)),\"\",MAX($D$1:D6)+1)","v":""}]
["AA_008",{"$f":"VLOOKUP(A8,Année1!$A$2:$B$30,2,0)","v":"Frêne"},4513500,{"$f":"IF(OR(A8=\"\",COUNTIF(Année1!$A$2:$A$100,A8)),\"\",MAX($D$1:D7)+1)","v":""}]
["AA_009",{"$f":"VLOOKUP(A9,Année1!$A$2:$B$30,2,0)","v":"Manguier"},1524000,{"$f":"IF(OR(A9=\"\",COUNTIF(Année1!$A$2:$A$100,A9)),\"\",MAX($D$1:D8)+1)","v":""}]
["AA_010",{"$f":"VLOOKUP(A10,Année1!$A$2:$B$30,2,0)","v":"If"},1518000,{"$f":"IF(OR(A10=\"\",COUNTIF(Année1!$A$2:$A$100,A10)),\"\",MAX($D$1:D9)+1)","v":""}]
["AA_012",{"$f":"VLOOKUP(A11,Année1!$A$2:$B$30,2,0)","v":"Hêtre"},4599000,{"$f":"IF(OR(A11=\"\",COUNTIF(Année1!$A$2:$A$100,A11)),\"\",MAX($D$1:D10)+1)","v":""}]
["AA_013",{"$f":"VLOOKUP(A12,Année1!$A$2:$B$30,2,0)","v":"Erable"},3081000,{"$f":"IF(OR(A12=\"\",COUNTIF(Année1!$A$2:$A$100,A12)),\"\",MAX($D$1:D11)+1)","v":""}]
["AA_014",{"$f":"VLOOKUP(A13,Année1!$A$2:$B$30,2,0)","v":"Saule"},1539000,{"$f":"IF(OR(A13=\"\",COUNTIF(Année1!$A$2:$A$100,A13)),\"\",MAX($D$1:D12)+1)","v":""}]
["AA_016",{"$f":"VLOOKUP(A14,Année1!$A$2:$B$30,2,0)","v":"Noyer"},1525500,{"$f":"IF(OR(A14=\"\",COUNTIF(Année1!$A$2:$A$100,A14)),\"\",MAX($D$1:D13)+1)","v":""}]
["AA_017",{"$f":"VLOOKUP(A15,Année1!$A$2:$B$30,2,0)","v":"Charme"},1512000,{"$f":"IF(OR(A15=\"\",COUNTIF(Année1!$A$2:$A$100,A15)),\"\",MAX($D$1:D14)+1)","v":""}]
["AA_018",{"$f":"VLOOKUP(A16,Année1!$A$2:$B$30,2,0)","v":"Orme"},4608000,{"$f":"IF(OR(A16=\"\",COUNTIF(Année1!$A$2:$A$100,A16)),\"\",MAX($D$1:D15)+1)","v":""}]
["AA_019",{"$f":"VLOOKUP(A17,Année1!$A$2:$B$30,2,0)","v":"Mélèze"},3003000,{"$f":"IF(OR(A17=\"\",COUNTIF(Année1!$A$2:$A$100,A17)),\"\",MAX($D$1:D16)+1)","v":""}]
["AA_020",{"$f":"VLOOKUP(A18,Année1!$A$2:$B$30,2,0)","v":"Palmier"},1516500,{"$f":"IF(OR(A18=\"\",COUNTIF(Année1!$A$2:$A$100,A18)),\"\",MAX($D$1:D17)+1)","v":""}]
["AA_022",{"$f":"VLOOKUP(A19,Année1!$A$2:$B$30,2,0)","v":"Cornouiller"},4603500,{"$f":"IF(OR(A19=\"\",COUNTIF(Année1!$A$2:$A$100,A19)),\"\",MAX($D$1:D18)+1)","v":""}]
["AA_023",{"$f":"VLOOKUP(A20,Année1!$A$2:$B$30,2,0)","v":"Cocotier"},3057000,{"$f":"IF(OR(A20=\"\",COUNTIF(Année1!$A$2:$A$100,A20)),\"\",MAX($D$1:D19)+1)","v":""}]
{"$rows_left_out":81}
{"sheet":"Comparatif","index":2,"n_rows":317,"n_cols":6,"rows_kept":317,"cut":false,"hidden":false,"merged":[]}
[null,"ANNEE 1",null,"ANNEE 2"]
["REF","Libellé","Montant","Libellé","Montant","écart"]
[{"$f":"IF(COUNTIF(Année1!$A$2:$A$100,\"<>\")>COUNTA($A$2:A2),Année1!A2,IF(ROW()>MAX(Année2!$D$2:$D$100),\"\",INDEX(Année2!A$2:A100,MATCH(ROW(),Année2!$D$2:$D$100,0))))","v":"AA_001"},{"$f":"IF(A3=\"\",\"\",IF(COUNTIF(Année1!$A$2:$A$100,$A3),VLOOKUP($A3,Année1!$A$2:$C$100,2,0),\"Non référencé\"))","v":"Peuplier"},{"$f":"IF(B3=\"\",\"\",IF(COUNTIF(Année1!$A$2:$A$100,$A3),VLOOKUP($A3,Année1!$A$2:$C$100,3,0),\"Non référencé\"))","v":1516500},{"$f":"IF($A3=\"\",\"\",IF(COUNTIF(Année2!$A$2:$A$100,$A3),VLOOKUP($A3,Année2!$A$2:$C$100,2,0),\"Non référencé\"))","v":"Peuplier"},{"$f":"IF($A3=\"\",\"\",IF(COUNTIF(Année2!$A$2:$A$100,$A3),VLOOKUP($A3,Année2!$A$2:$C$100,3,0),\"Non référencé\"))","v":3060000},{"$f":"IFERROR(E3-C3,\"non réf\")","v":1543500}]
[{"$f":"IF(COUNTIF(Année1!$A$2:$A$100,\"<>\")>COUNTA($A$2:A3),Année1!A3,IF(ROW()>MAX(Année2!$D$2:$D$100),\"\",INDEX(Année2!A$2:A101,MATCH(ROW(),Année2!$D$2:$D$100,0))))","v":"AA_002"},{"$f":"IF(A4=\"\",\"\",IF(COUNTIF(Année1!$A$2:$A$100,$A4),VLOOKUP($A4,Année1!$A$2:$C$100,2,0),\"Non référencé\"))","v":"Sycomore"},{"$f":"IF(B4=\"\",\"\",IF(COUNTIF(Année1!$A$2:$A$100,$A4),VLOOKUP($A4,Année1!$A$2:$C$100,3,0),\"Non référencé\"))","v":3060000},{"$f":"IF($A4=\"\",\"\",IF(COUNTIF(Année2!$A$2:$A$100,$A4),VLOOKUP($A4,Année2!$A$2:$C$100,2,0),\"Non référencé\"))","v":"Sycomore"},{"$f":"IF($A4=\"\",\"\",IF(COUNTIF(Année2!$A$2:$A$100,$A4),VLOOKUP($A4,Année2!$A$2:$C$100,3,0),\"Non référencé\"))","v":4567500},{"$f":"IFERROR(E4-C4,\"non réf\")","v":1507500}]
[{"$f":"IF(COUNTIF(Année1!$A$2:$A$100,\"<>\")>COUNTA($A$2:A4),Année1!A4,IF(ROW()>MAX(Année2!$D$2:$D$100),\"\",INDEX(Année2!A$2:A102,MATCH(ROW(),Année2!$D$2:$D$100,0))))","v":"AA_003"},{"$f":"IF(A5=\"\",\"\",IF(COUNTIF(Année1!$A$2:$A$100,$A5),VLOOKUP($A5,Année1!$A$2:$C$100,2,0),\"Non référencé\"))","v":"Chêne"},{"$f":"IF(B5=\"\",\"\",IF(COUNTIF(Année1!$A$2:$A$100,$A5),VLOOKUP($A5,Année1!$A$2:$C$100,3,0),\"Non référencé\"))","v":1525500},{"$f":"IF($A5=\"\",\"\",IF(COUNTIF(Année2!$A$2:$A$100,$A5),VLOOKUP($A5,Année2!$A$2:$C$100,2,0),\"Non référencé\"))","v":"Chêne"},{"$f":"IF($A5=\"\",\"\",IF(COUNTIF(Année2!$A$2:$A$100,$A5),VLOOKUP($A5,Année2!$A$2:$C$100,3,0),\"Non référencé\"))","v":4527000},3001500]
[{"$f":"IF(COUNTIF(Année1!$A$2:$A$100,\"<>\")>COUNTA($A$2:A5),Année1!A5,IF(ROW()>MAX(Année2!$D$2:$D$100),\"\",INDEX(Année2!A$2:A103,MATCH(ROW(),Année2!$D$2:$D$100,0))))","v":"AA_004"},{"$f":"IF(A6=\"\",\"\",IF(COUNTIF(Année1!$A$2:$A$100,$A6),VLOOKUP($A6,Année1!$A$2:$C$100,2,0),\"Non référencé\"))","v":"Bouleau"},{"$f":"IF(B6=\"\",\"\",IF(COUNTIF(Année1!$A$2:$A$100,$A6),VLOOKUP($A6,Année1!$A$2:$C$100,3,0),\"Non référencé\"))","v":9189000},{"$f":"IF($A6=\"\",\"\",IF(COUNTIF(Année2!$A$2:$A$100,$A6),VLOOKUP($A6,Année2!$A$2:$C$100,2,0),\"Non référencé\"))","v":"Non référencé"},{"$f":"IF($A6=\"\",\"\",IF(COUNTIF(Année2!$A$2:$A$100,$A6),VLOOKUP($A6,Année2!$A$2:$C$100,3,0),\"Non référencé\"))","v":"Non référencé"},"non réf"]
[{"$f":"IF(COUNTIF(Année1!$A$2:$A$100,\"<>\")>COUNTA($A$2:A6),Année1!A6,IF(ROW()>MAX(Année2!$D$2:$D$100),\"\",INDEX(Année2!A$2:A104,MATCH(ROW(),Année2!$D$2:$D$100,0))))","v":"AA_005"},{"$f":"IF(A7=\"\",\"\",IF(COUNTIF(Année1!$A$2:$A$100,$A7),VLOOKUP($A7,Année1!$A$2:$C$100,2,0),\"Non référencé\"))","v":"Platane"},{"$f":"IF(B7=\"\",\"\",IF(COUNTIF(Année1!$A$2:$A$100,$A7),VLOOKUP($A7,Année1!$A$2:$C$100,3,0),\"Non référencé\"))","v":4603500},{"$f":"IF($A7=\"\",\"\",IF(COUNTIF(Année2!$A$2:$A$100,$A7),VLOOKUP($A7,Année2!$A$2:$C$100,2,0),\"Non référencé\"))","v":"Platane"},{"$f":"IF($A7=\"\",\"\",IF(COUNTIF(Année2!$A$2:$A$100,$A7),VLOOKUP($A7,Année2!$A$2:$C$100,3,0),\"Non référencé\"))","v":1515000},-3088500]
[{"$f":"IF(COUNTIF(Année1!$A$2:$A$100,\"<>\")>COUNTA($A$2:A7),Année1!A7,IF(ROW()>MAX(Année2!$D$2:$D$100),\"\",INDEX(Année2!A$2:A105,MATCH(ROW(),Année2!$D$2:$D$100,0))))","v":"AA_006"},{"$f":"IF(A8=\"\",\"\",IF(COUNTIF(Année1!$A$2:$A$100,$A8),VLOOKUP($A8,Année1!$A$2:$C$100,2,0),\"Non référencé\"))","v":"Papayer"},{"$f":"IF(B8=\"\",\"\",IF(COUNTIF(Année1!$A$2:$A$100,$A8),VLOOKUP($A8,Année1!$A$2:$C$100,3,0),\"Non référencé\"))","v":3012000},{"$f":"IF($A8=\"\",\"\",IF(COUNTIF(Année2!$A$2:$A$100,$A8),VLOOKUP($A8,Année2!$A$2:$C$100,2,0),\"Non référencé\"))","v":"Papayer"},{"$f":"IF($A8=\"\",\"\",IF(COUNTIF(Année2!$A$2:$A$100,$A8),VLOOKUP($A8,Année2!$A$2:$C$100,3,0),\"Non référencé\"))","v":1507500},-1504500]
[{"$f":"IF(COUNTIF(Année1!$A$2:$A$100,\"<>\")>COUNTA($A$2:A8),Année1!A8,IF(ROW()>MAX(Année2!$D$2:$D$100),\"\",INDEX(Année2!A$2:A106,MATCH(ROW(),Année2!$D$2:$D$100,0))))","v":"AA_007"},{"$f":"IF(A9=\"\",\"\",IF(COUNTIF(Année1!$A$2:$A$100,$A9),VLOOKUP($A9,Année1!$A$2:$C$100,2,0),\"Non référencé\"))","v":"Cyprés"},{"$f":"IF(B9=\"\",\"\",IF(COUNTIF(Année1!$A$2:$A$100,$A9),VLOOKUP($A9,Année1!$A$2:$C$100,3,0),\"Non référencé\"))","v":4608000},{"$f":"IF($A9=\"\",\"\",IF(COUNTIF(Année2!$A$2:$A$100,$A9),VLOOKUP($A9,Année2!$A$2:$C$100,2,0),\"Non référencé\"))","v":"Cyprés"},{"$f":"IF($A9=\"\",\"\",IF(COUNTIF(Année2!$A$2:$A$100,$A9),VLOOKUP($A9,Année2!$A$2:$C$100,3,0),\"Non référencé\"))","v":3039000},-1569000]
[{"$f":"IF(COUNTIF(Année1!$A$2:$A$100,\"<>\")>COUNTA($A$2:A9),Année1!A9,IF(ROW()>MAX(Année2!$D$2:$D$100),\"\",INDEX(Année2!A$2:A107,MATCH(ROW(),Année2!$D$2:$D$100,0))))","v":"AA_008"},{"$f":"IF(A10=\"\",\"\",IF(COUNTIF(Année1!$A$2:$A$100,$A10),VLOOKUP($A10,Année1!$A$2:$C$100,2,0),\"Non référencé\"))","v":"Frêne"},{"$f":"IF(B10=\"\",\"\",IF(COUNTIF(Année1!$A$2:$A$100,$A10),VLOOKUP($A10,Année1!$A$2:$C$100,3,0),\"Non référencé\"))","v":1527000},{"$f":"IF($A10=\"\",\"\",IF(COUNTIF(Année2!$A$2:$A$100,$A10),VLOOKUP($A10,Année2!$A$2:$C$100,2,0),\"Non référencé\"))","v":"Frêne"},{"$f":"IF($A10=\"\",\"\",IF(COUNTIF(Année2!$A$2:$A$100,$A10),VLOOKUP($A10,Année2!$A$2:$C$100,3,0),\"Non référencé\"))","v":4513500},2986500]
[{"$f":"IF(COUNTIF(Année1!$A$2:$A$100,\"<>\")>COUNTA($A$2:A10),Année1!A10,IF(ROW()>MAX(Année2!$D$2:$D$100),\"\",INDEX(Année2!A$2:A108,MATCH(ROW(),Année2!$D$2:$D$100,0))))","v":"AA_009"},{"$f":"IF(A11=\"\",\"\",IF(COUNTIF(Année1!$A$2:$A$100,$A11),VLOOKUP($A11,Année1!$A$2:$C$100,2,0),\"Non référencé\"))","v":"Manguier"},{"$f":"IF(B11=\"\",\"\",IF(COUNTIF(Année1!$A$2:$A$100,$A11),VLOOKUP($A11,Année1!$A$2:$C$100,3,0),\"Non référencé\"))","v":3039000},{"$f":"IF($A11=\"\",\"\",IF(COUNTIF(Année2!$A$2:$A$100,$A11),VLOOKUP($A11,Année2!$A$2:$C$100,2,0),\"Non référencé\"))","v":"Manguier"},{"$f":"IF($A11=\"\",\"\",IF(COUNTIF(Année2!$A$2:$A$100,$A11),VLOOKUP($A11,Année2!$A$2:$C$100,3,0),\"Non référencé\"))","v":1524000},-1515000]
[{"$f":"IF(COUNTIF(Année1!$A$2:$A$100,\"<>\")>COUNTA($A$2:A11),Année1!A11,IF(ROW()>MAX(Année2!$D$2:$D$100),\"\",INDEX(Année2!A$2:A109,MATCH(ROW(),Année2!$D$2:$D$100,0))))","v":"AA_010"},{"$f":"IF(A12=\"\",\"\",IF(COUNTIF(Année1!$A$2:$A$100,$A12),VLOOKUP($A12,Année1!$A$2:$C$100,2,0),\"Non référencé\"))","v":"If"},{"$f":"IF(B12=\"\",\"\",IF(COUNTIF(Année1!$A$2:$A$100,$A12),VLOOKUP($A12,Année1!$A$2:$C$100,3,0),\"Non référencé\"))","v":4612500},{"$f":"IF($A12=\"\",\"\",IF(COUNTIF(Année2!$A$2:$A$100,$A12),VLOOKUP($A12,Année2!$A$2:$C$100,2,0),\"Non référencé\"))","v":"If"},{"$f":"IF($A12=\"\",\"\",IF(COUNTIF(Année2!$A$2:$A$100,$A12),VLOOKUP($A12,Année2!$A$2:$C$100,3,0),\"Non référencé\"))","v":1518000},-3094500]
[{"$f":"IF(COUNTIF(Année1!$A$2:$A$100,\"<>\")>COUNTA($A$2:A12),Année1!A12,IF(ROW()>MAX(Année2!$D$2:$D$100),\"\",INDEX(Année2!A$2:A110,MATCH(ROW(),Année2!$D$2:$D$100,0))))","v":"AA_011"},{"$f":"IF(A13=\"\",\"\",IF(COUNTIF(Année1!$A$2:$A$100,$A13),VLOOKUP($A13,Année1!$A$2:$C$100,2,0),\"Non référencé\"))","v":"Sorbier"},{"$f":"IF(B13=\"\",\"\",IF(COUNTIF(Année1!$A$2:$A$100,$A13),VLOOKUP($A13,Année1!$A$2:$C$100,3,0),\"Non référencé\"))","v":1507500},{"$f":"IF($A13=\"\",\"\",IF(COUNTIF(Année2!$A$2:$A$100,$A13),VLOOKUP($A13,Année2!$A$2:$C$100,2,0),\"Non référencé\"))","v":"Non référencé"},{"$f":"IF($A13=\"\",\"\",IF(COUNTIF(Année2!$A$2:$A$100,$A13),VLOOKUP($A13,Année2!$A$2:$C$100,3,0),\"Non référencé\"))","v":"Non référencé"},"non réf"]
[{"$f":"IF(COUNTIF(Année1!$A$2:$A$100,\"<>\")>COUNTA($A$2:A13),Année1!A13,IF(ROW()>MAX(Année2!$D$2:$D$100),\"\",INDEX(Année2!A$2:A111,MATCH(ROW(),Année2!$D$2:$D$100,0))))","v":"AA_012"},{"$f":"IF(A14=\"\",\"\",IF(COUNTIF(Année1!$A$2:$A$100,$A14),VLOOKUP($A14,Année1!$A$2:$C$100,2,0),\"Non référencé\"))","v":"Hêtre"},{"$f":"IF(B14=\"\",\"\",IF(COUNTIF(Année1!$A$2:$A$100,$A14),VLOOKUP($A14,Année1!$A$2:$C$100,3,0),\"Non référencé\"))","v":4527000},{"$f":"IF($A14=\"\",\"\",IF(COUNTIF(Année2!$A$2:$A$100,$A14),VLOOKUP($A14,Année2!$A$2:$C$100,2,0),\"Non référencé\"))","v":"Hêtre"},{"$f":"IF($A14=\"\",\"\",IF(COUNTIF(Année2!$A$2:$A$100,$A14),VLOOKUP($A14,Année2!$A$2:$C$100,3,0),\"Non référencé\"))","v":4599000},72000]
[{"$f":"IF(COUNTIF(Année1!$A$2:$A$100,\"<>\")>COUNTA($A$2:A14),Année1!A14,IF(ROW()>MAX(Année2!$D$2:$D$100),\"\",INDEX(Année2!A$2:A112,MATCH(ROW(),Année2!$D$2:$D$100,0))))","v":"AA_013"},{"$f":"IF(A15=\"\",\"\",IF(COUNTIF(Année1!$A$2:$A$100,$A15),VLOOKUP($A15,Année1!$A$2:$C$100,2,0),\"Non référencé\"))","v":"Erable"},{"$f":"IF(B15=\"\",\"\",IF(COUNTIF(Année1!$A$2:$A$100,$A15),VLOOKUP($A15,Année1!$A$2:$C$100,3,0),\"Non référencé\"))","v":3057000},{"$f":"IF($A15=\"\",\"\",IF(COUNTIF(Année2!$A$2:$A$100,$A15),VLOOKUP($A15,Année2!$A$2:$C$100,2,0),\"Non référencé\"))","v":"Erable"},{"$f":"IF($A15=\"\",\"\",IF(COUNTIF(Année2!$A$2:$A$100,$A15),VLOOKUP($A15,Année2!$A$2:$C$100,3,0),\"Non référencé\"))","v":3081000},24000]
[{"$f":"IF(COUNTIF(Année1!$A$2:$A$100,\"<>\")>COUNTA($A$2:A15),Année1!A15,IF(ROW()>MAX(Année2!$D$2:$D$100),\"\",INDEX(Année2!A$2:A113,MATCH(ROW(),Année2!$D$2:$D$100,0))))","v":"AA_014"},{"$f":"IF(A16=\"\",\"\",IF(COUNTIF(Année1!$A$2:$A$100,$A16),VLOOKUP($A16,Année1!$A$2:$C$100,2,0),\"Non référencé\"))","v":"Saule"},{"$f":"IF(B16=\"\",\"\",IF(COUNTIF(Année1!$A$2:$A$100,$A16),VLOOKUP($A16,Année1!$A$2:$C$100,3,0),\"Non référencé\"))","v":1501500},{"$f":"IF($A16=\"\",\"\",IF(COUNTIF(Année2!$A$2:$A$100,$A16),VLOOKUP($A16,Année2!$A$2:$C$100,2,0),\"Non référencé\"))","v":"Saule"},{"$f":"IF($A16=\"\",\"\",IF(COUNTIF(Année2!$A$2:$A$100,$A16),VLOOKUP($A16,Année2!$A$2:$C$100,3,0),\"Non référencé\"))","v":1539000},37500]
[{"$f":"IF(COUNTIF(Année1!$A$2:$A$100,\"<>\")>COUNTA($A$2:A16),Année1!A16,IF(ROW()>MAX(Année2!$D$2:$D$100),\"\",INDEX(Année2!A$2:A114,MATCH(ROW(),Année2!$D$2:$D$100,0))))","v":"AA_015"},{"$f":"IF(A17=\"\",\"\",IF(COUNTIF(Année1!$A$2:$A$100,$A17),VLOOKUP($A17,Année1!$A$2:$C$100,2,0),\"Non référencé\"))","v":"Olivier"},{"$f":"IF(B17=\"\",\"\",IF(COUNTIF(Année1!$A$2:$A$100,$A17),VLOOKUP($A17,Année1!$A$2:$C$100,3,0),\"Non référencé\"))","v":1539000},{"$f":"IF($A17=\"\",\"\",IF(COUNTIF(Année2!$A$2:$A$100,$A17),VLOOKUP($A17,Année2!$A$2:$C$100,2,0),\"Non référencé\"))","v":"Non référencé"},{"$f":"IF($A17=\"\",\"\",IF(COUNTIF(Année2!$A$2:$A$100,$A17),VLOOKUP($A17,Année2!$A$2:$C$100,3,0),\"Non référencé\"))","v":"Non référencé"},"non réf"]
[{"$f":"IF(COUNTIF(Année1!$A$2:$A$100,\"<>\")>COUNTA($A$2:A17),Année1!A17,IF(ROW()>MAX(Année2!$D$2:$D$100),\"\",INDEX(Année2!A$2:A115,MATCH(ROW(),Année2!$D$2:$D$100,0))))","v":"AA_016"},{"$f":"IF(A18=\"\",\"\",IF(COUNTIF(Année1!$A$2:$A$100,$A18),VLOOKUP($A18,Année1!$A$2:$C$100,2,0),\"Non référencé\"))","v":"Noyer"},{"$f":"IF(B18=\"\",\"\",IF(COUNTIF(Année1!$A$2:$A$100,$A18),VLOOKUP($A18,Année1!$A$2:$C$100,3,0),\"Non référencé\"))","v":3003000},{"$f":"IF($A18=\"\",\"\",IF(COUNTIF(Année2!$A$2:$A$100,$A18),VLOOKUP($A18,Année2!$A$2:$C$100,2,0),\"Non référencé\"))","v":"Noyer"},{"$f":"IF($A18=\"\",\"\",IF(COUNTIF(Année2!$A$2:$A$100,$A18),VLOOKUP($A18,Année2!$A$2:$C$100,3,0),\"Non référencé\"))","v":1525500},-1477500]
[{"$f":"IF(COUNTIF(Année1!$A$2:$A$100,\"<>\")>COUNTA($A$2:A18),Année1!A18,IF(ROW()>MAX(Année2!$D$2:$D$100),\"\",INDEX(Année2!A$2:A116,MATCH(ROW(),Année2!$D$2:$D$100,0))))","v":"AA_017"},{"$f":"IF(A19=\"\",\"\",IF(COUNTIF(Année1!$A$2:$A$100,$A19),VLOOKUP($A19,Année1!$A$2:$C$100,2,0),\"Non référencé\"))","v":"Charme"},{"$f":"IF(B19=\"\",\"\",IF(COUNTIF(Année1!$A$2:$A$100,$A19),VLOOKUP($A19,Année1!$A$2:$C$100,3,0),\"Non référencé\"))","v":1512000},{"$f":"IF($A19=\"\",\"\",IF(COUNTIF(Année2!$A$2:$A$100,$A19),VLOOKUP($A19,Année2!$A$2:$C$100,2,0),\"Non référencé\"))","v":"Charme"},{"$f":"IF($A19=\"\",\"\",IF(COUNTIF(Année2!$A$2:$A$100,$A19),VLOOKUP($A19,Année2!$A$2:$C$100,3,0),\"Non référencé\"))","v":1512000},0]
[{"$f":"IF(COUNTIF(Année1!$A$2:$A$100,\"<>\")>COUNTA($A$2:A19),Année1!A19,IF(ROW()>MAX(Année2!$D$2:$D$100),\"\",INDEX(Année2!A$2:A117,MATCH(ROW(),Année2!$D$2:$D$100,0))))","v":"AA_018"},{"$f":"IF(A20=\"\",\"\",IF(COUNTIF(Année1!$A$2:$A$100,$A20),VLOOKUP($A20,Année1!$A$2:$C$100,2,0),\"Non référencé\"))","v":"Orme"},{"$f":"IF(B20=\"\",\"\",IF(COUNTIF(Année1!$A$2:$A$100,$A20),VLOOKUP($A20,Année1!$A$2:$C$100,3,0),\"Non référencé\"))","v":4567500},{"$f":"IF($A20=\"\",\"\",IF(COUNTIF(Année2!$A$2:$A$100,$A20),VLOOKUP($A20,Année2!$A$2:$C$100,2,0),\"Non référencé\"))","v":"Orme"},{"$f":"IF($A20=\"\",\"\",IF(COUNTIF(Année2!$A$2:$A$100,$A20),VLOOKUP($A20,Année2!$A$2:$C$100,3,0),\"Non référencé\"))","v":4608000},40500]
{"$rows_left_out":297}