{"text_format":"1","workbook":"xlsx","n_sheets":3,"sheets":["Année1","Année2","Comparatif"],"not_rendered":{"charts":0,"images":0,"macros":0,"external_links":0,"defined_names":2,"comments":0,"pivot_tables":0},"unopened":[],"bounds":{"document_bytes":16777216,"sheet_cells":100000,"rows_first":2000,"rows_last":500,"rows_between":2000,"halvings":0,"cell_chars":16384,"cell_head_chars":4096},"cells_cut":0,"cells_raw":0,"read":"whole","date_system":"1900"}

{"sheet":"Année1","index":0,"n_rows":30,"n_cols":3,"rows_kept":30,"cut":false,"hidden":false,"merged":[]}
["REF","Libellé","Montant"]
["AA_001","Peuplier",1516500]
["AA_002","Sycomore",3060000]
["AA_003","Chêne",1525500]
["AA_004","Bouleau",9189000]
["AA_005","Platane",4603500]
["AA_006","Papayer",3012000]
["AA_007","Cyprés",4608000]
["AA_008","Frêne",1527000]
["AA_009","Manguier",3039000]
["AA_010","If",4612500]
["AA_011","Sorbier",1507500]
["AA_012","Hêtre",4527000]
["AA_013","Erable",3057000]
["AA_014","Saule",1501500]
["AA_015","Olivier",1539000]
["AA_016","Noyer",3003000]
["AA_017","Charme",1512000]
["AA_018","Orme",4567500]
["AA_019","Mélèze",1515000]
["AA_020","Palmier",4599000]
["AA_021","Tuyas",4513500]
["AA_022","Cornouiller",3081000]
["AA_023","Cocotier",1524000]
["AA_024","Epicéa",1503000]
["AA_025","Baobab",1542000]
["AA_026","Séquoïa",1518000]
["AA_027","Murier",4531500]
["AA_028","Tremble",1513500]
["AA_029","Pin",4563000]

{"sheet":"Année2","index":1,"n_rows":100,"n_cols":4,"rows_kept":100,"cut":false,"hidden":false,"merged":[]}
["REF","Libellé","Montant",{"$f":"COUNTA(Année1!A2:$A$100)+1","v":30}]
["AA_001",{"$f":"VLOOKUP(A2,Année1!$A$2:$B$30,2,0)","v":"Peuplier"},3060000,{"$f":"IF(OR(A2=\"\",COUNTIF(Année1!$A$2:$A$100,A2)),\"\",MAX($D$1:D1)+1)","v":""}]
["AA_002",{"$f":"VLOOKUP(A3,Année1!$A$2:$B$30,2,0)","v":"Sycomore"},4567500,{"$f":"IF(OR(A3=\"\",COUNTIF(Année1!$A$2:$A$100,A3)),\"\",MAX($D$1:D2)+1)","v":""}]
["AA_003",{"$f":"VLOOKUP(A4,Année1!$A$2:$B$30,2,0)","v":"Chêne"},4527000,{"$f":"IF(OR(A4=\"\",COUNTIF(Année1!$A$2:$A$100,A4)),\"\",MAX($D$1:D3)+1)","v":""}]
["AA_005",{"$f":"VLOOKUP(A5,Année1!$A$2:$B$30,2,0)","v":"Platane"},1515000,{"$f":"IF(OR(A5=\"\",COUNTIF(Année1!$A$2:$A$100,A5)),\"\",MAX($D$1:D4)+1)","v":""}]
["AA_006",{"$f":"VLOOKUP(A6,Année1!$A$2:$B$30,2,0)","v":"Papayer"},1507500,{"$f":"IF(OR(A6=\"\",COUNTIF(Année1!$A$2:$A$100,A6)),\"\",MAX($D$1:D5)+1)","v":""}]
["AA_007",{"$f":"VLOOKUP(A7,Année1!$A$2:$B$30,2,0)","v":"Cyprés"},3039000,{"$f":"IF(OR(A7=\"\",COUNTIF(Année1!$A$2:$A$100,A7)),\"\",MAX($D$1:D6)+1)","v":""}]
["AA_008",{"$f":"VLOOKUP(A8,Année1!$A$2:$B$30,2,0)","v":"Frêne"},4513500,{"$f":"IF(OR(A8=\"\",COUNTIF(Année1!$A$2:$A$100,A8)),\"\",MAX($D$1:D7)+1)","v":""}]
["AA_009",{"$f":"VLOOKUP(A9,Année1!$A$2:$B$30,2,0)","v":"Manguier"},1524000,{"$f":"IF(OR(A9=\"\",COUNTIF(Année1!$A$2:$A$100,A9)),\"\",MAX($D$1:D8)+1)","v":""}]
["AA_010",{"$f":"VLOOKUP(A10,Année1!$A$2:$B$30,2,0)","v":"If"},1518000,{"$f":"IF(OR(A10=\"\",COUNTIF(Année1!$A$2:$A$100,A10)),\"\",MAX($D$1:D9)+1)","v":""}]
["AA_012",{"$f":"VLOOKUP(A11,Année1!$A$2:$B$30,2,0)","v":"Hêtre"},4599000,{"$f":"IF(OR(A11=\"\",COUNTIF(Année1!$A$2:$A$100,A11)),\"\",MAX($D$1:D10)+1)","v":""}]
["AA_013",{"$f":"VLOOKUP(A12,Année1!$A$2:$B$30,2,0)","v":"Erable"},3081000,{"$f":"IF(OR(A12=\"\",COUNTIF(Année1!$A$2:$A$100,A12)),\"\",MAX($D$1:D11)+1)","v":""}]
["AA_014",{"$f":"VLOOKUP(A13,Année1!$A$2:$B$30,2,0)","v":"Saule"},1539000,{"$f":"IF(OR(A13=\"\",COUNTIF(Année1!$A$2:$A$100,A13)),\"\",MAX($D$1:D12)+1)","v":""}]
["AA_016",{"$f":"VLOOKUP(A14,Année1!$A$2:$B$30,2,0)","v":"Noyer"},1525500,{"$f":"IF(OR(A14=\"\",COUNTIF(Année1!$A$2:$A$100,A14)),\"\",MAX($D$1:D13)+1)","v":""}]
["AA_017",{"$f":"VLOOKUP(A15,Année1!$A$2:$B$30,2,0)","v":"Charme"},1512000,{"$f":"IF(OR(A15=\"\",COUNTIF(Année1!$A$2:$A$100,A15)),\"\",MAX($D$1:D14)+1)","v":""}]
["AA_018",{"$f":"VLOOKUP(A16,Année1!$A$2:$B$30,2,0)","v":"Orme"},4608000,{"$f":"IF(OR(A16=\"\",COUNTIF(Année1!$A$2:$A$100,A16)),\"\",MAX($D$1:D15)+1)","v":""}]
["AA_019",{"$f":"VLOOKUP(A17,Année1!$A$2:$B$30,2,0)","v":"Mélèze"},3003000,{"$f":"IF(OR(A17=\"\",COUNTIF(Année1!$A$2:$A$100,A17)),\"\",MAX($D$1:D16)+1)","v":""}]
["AA_020",{"$f":"VLOOKUP(A18,Année1!$A$2:$B$30,2,0)","v":"Palmier"},1516500,{"$f":"IF(OR(A18=\"\",COUNTIF(Année1!$A$2:$A$100,A18)),\"\",MAX($D$1:D17)+1)","v":""}]
["AA_022",{"$f":"VLOOKUP(A19,Année1!$A$2:$B$30,2,0)","v":"Cornouiller"},4603500,{"$f":"IF(OR(A19=\"\",COUNTIF(Année1!$A$2:$A$100,A19)),\"\",MAX($D$1:D18)+1)","v":""}]
["AA_023",{"$f":"VLOOKUP(A20,Année1!$A$2:$B$30,2,0)","v":"Cocotier"},3057000,{"$f":"IF(OR(A20=\"\",COUNTIF(Année1!$A$2:$A$100,A20)),\"\",MAX($D$1:D19)+1)","v":""}]
["AA_024",{"$f":"VLOOKUP(A21,Année1!$A$2:$B$30,2,0)","v":"Epicéa"},1513500,{"$f":"IF(OR(A21=\"\",COUNTIF(Année1!$A$2:$A$100,A21)),\"\",MAX($D$1:D20)+1)","v":""}]
["AA_025",{"$f":"VLOOKUP(A22,Année1!$A$2:$B$30,2,0)","v":"Baobab"},1503000,{"$f":"IF(OR(A22=\"\",COUNTIF(Année1!$A$2:$A$100,A22)),\"\",MAX($D$1:D21)+1)","v":""}]
["AA_026",{"$f":"VLOOKUP(A23,Année1!$A$2:$B$30,2,0)","v":"Séquoïa"},4612500,{"$f":"IF(OR(A23=\"\",COUNTIF(Année1!$A$2:$A$100,A23)),\"\",MAX($D$1:D22)+1)","v":""}]
["AA_027",{"$f":"VLOOKUP(A24,Année1!$A$2:$B$30,2,0)","v":"Murier"},1501500,{"$f":"IF(OR(A24=\"\",COUNTIF(Année1!$A$2:$A$100,A24)),\"\",MAX($D$1:D23)+1)","v":""}]
["AA_028",{"$f":"VLOOKUP(A25,Année1!$A$2:$B$30,2,0)","v":"Tremble"},1542000,{"$f":"IF(OR(A25=\"\",COUNTIF(Année1!$A$2:$A$100,A25)),\"\",MAX($D$1:D24)+1)","v":""}]
["AA_030",{"$f":"VLOOKUP(A26,Année1!$A$2:$B$30,2,0)","v":{"$error":"#N/A"}},4531500,{"$f":"IF(OR(A26=\"\",COUNTIF(Année1!$A$2:$A$100,A26)),\"\",MAX($D$1:D25)+1)","v":31}]
["AA_031",{"$f":"VLOOKUP(A27,Année1!$A$2:$B$30,2,0)","v":{"$error":"#N/A"}},3012000,{"$f":"IF(OR(A27=\"\",COUNTIF(Année1!$A$2:$A$100,A27)),\"\",MAX($D$1:D26)+1)","v":32}]
["AA_033",{"$f":"VLOOKUP(A28,Année1!$A$2:$B$30,2,0)","v":{"$error":"#N/A"}},9189000,{"$f":"IF(OR(A28=\"\",COUNTIF(Année1!$A$2:$A$100,A28)),\"\",MAX($D$1:D27)+1)","v":33}]
["AA_034",{"$f":"VLOOKUP(A29,Année1!$A$2:$B$30,2,0)","v":{"$error":"#N/A"}},1527000,{"$f":"IF(OR(A29=\"\",COUNTIF(Année1!$A$2:$A$100,A29)),\"\",MAX($D$1:D28)+1)","v":34}]
["AA_035",{"$f":"VLOOKUP(A30,Année1!$A$2:$B$30,2,0)","v":{"$error":"#N/A"}},4563000,{"$f":"IF(OR(A30=\"\",COUNTIF(Année1!$A$2:$A$100,A30)),\"\",MAX($D$1:D29)+1)","v":35}]
[null,null,null,{"$f":"IF(OR(A31=\"\",COUNTIF(Année1!$A$2:$A$100,A31)),\"\",MAX($D$1:D30)+1)","v":""}]
[null,null,null,{"$f":"IF(OR(A32=\"\",COUNTIF(Année1!$A$2:$A$100,A32)),\"\",MAX($D$1:D31)+1)","v":""}]
[null,null,null,{"$f":"IF(OR(A33=\"\",COUNTIF(Année1!$A$2:$A$100,A33)),\"\",MAX($D$1:D32)+1)","v":""}]
[null,null,null,{"$f":"IF(OR(A34=\"\",COUNTIF(Année1!$A$2:$A$100,A34)),\"\",MAX($D$1:D33)+1)","v":""}]
[null,null,null,{"$f":"IF(OR(A35=\"\",COUNTIF(Année1!$A$2:$A$100,A35)),\"\",MAX($D$1:D34)+1)","v":""}]
[null,null,null,{"$f":"IF(OR(A36=\"\",COUNTIF(Année1!$A$2:$A$100,A36)),\"\",MAX($D$1:D35)+1)","v":""}]
[null,null,null,{"$f":"IF(OR(A37=\"\",COUNTIF(Année1!$A$2:$A$100,A37)),\"\",MAX($D$1:D36)+1)","v":""}]
[null,null,null,{"$f":"IF(OR(A38=\"\",COUNTIF(Année1!$A$2:$A$100,A38)),\"\",MAX($D$1:D37)+1)","v":""}]
[null,null,null,{"$f":"IF(OR(A39=\"\",COUNTIF(Année1!$A$2:$A$100,A39)),\"\",MAX($D$1:D38)+1)","v":""}]
[null,null,null,{"$f":"IF(OR(A40=\"\",COUNTIF(Année1!$A$2:$A$100,A40)),\"\",MAX($D$1:D39)+1)","v":""}]
[null,null,null,{"$f":"IF(OR(A41=\"\",COUNTIF(Année1!$A$2:$A$100,A41)),\"\",MAX($D$1:D40)+1)","v":""}]
[null,null,null,{"$f":"IF(OR(A42=\"\",COUNTIF(Année1!$A$2:$A$100,A42)),\"\",MAX($D$1:D41)+1)","v":""}]
[null,null,null,{"$f":"IF(OR(A43=\"\",COUNTIF(Année1!$A$2:$A$100,A43)),\"\",MAX($D$1:D42)+1)","v":""}]
[null,null,null,{"$f":"IF(OR(A44=\"\",COUNTIF(Année1!$A$2:$A$100,A44)),\"\",MAX($D$1:D43)+1)","v":""}]
[null,null,null,{"$f":"IF(OR(A45=\"\",COUNTIF(Année1!$A$2:$A$100,A45)),\"\",MAX($D$1:D44)+1)","v":""}]
[null,null,null,{"$f":"IF(OR(A46=\"\",COUNTIF(Année1!$A$2:$A$100,A46)),\"\",MAX($D$1:D45)+1)","v":""}]
[null,null,null,{"$f":"IF(OR(A47=\"\",COUNTIF(Année1!$A$2:$A$100,A47)),\"\",MAX($D$1:D46)+1)","v":""}]
[null,null,null,{"$f":"IF(OR(A48=\"\",COUNTIF(Année1!$A$2:$A$100,A48)),\"\",MAX($D$1:D47)+1)","v":""}]
[null,null,null,{"$f":"IF(OR(A49=\"\",COUNTIF(Année1!$A$2:$A$100,A49)),\"\",MAX($D$1:D48)+1)","v":""}]
[null,null,null,{"$f":"IF(OR(A50=\"\",COUNTIF(Année1!$A$2:$A$100,A50)),\"\",MAX($D$1:D49)+1)","v":""}]
[null,null,null,{"$f":"IF(OR(A51=\"\",COUNTIF(Année1!$A$2:$A$100,A51)),\"\",MAX($D$1:D50)+1)","v":""}]
[null,null,null,{"$f":"IF(OR(A52=\"\",COUNTIF(Année1!$A$2:$A$100,A52)),\"\",MAX($D$1:D51)+1)","v":""}]
[null,null,null,{"$f":"IF(OR(A53=\"\",COUNTIF(Année1!$A$2:$A$100,A53)),\"\",MAX($D$1:D52)+1)","v":""}]
[null,null,null,{"$f":"IF(OR(A54=\"\",COUNTIF(Année1!$A$2:$A$100,A54)),\"\",MAX($D$1:D53)+1)","v":""}]
[null,null,null,{"$f":"IF(OR(A55=\"\",COUNTIF(Année1!$A$2:$A$100,A55)),\"\",MAX($D$1:D54)+1)","v":""}]
[null,null,null,{"$f":"IF(OR(A56=\"\",COUNTIF(Année1!$A$2:$A$100,A56)),\"\",MAX($D$1:D55)+1)","v":""}]
[null,null,null,{"$f":"IF(OR(A57=\"\",COUNTIF(Année1!$A$2:$A$100,A57)),\"\",MAX($D$1:D56)+1)","v":""}]
[null,null,null,{"$f":"IF(OR(A58=\"\",COUNTIF(Année1!$A$2:$A$100,A58)),\"\",MAX($D$1:D57)+1)","v":""}]
[null,null,null,{"$f":"IF(OR(A59=\"\",COUNTIF(Année1!$A$2:$A$100,A59)),\"\",MAX($D$1:D58)+1)","v":""}]
[null,null,null,{"$f":"IF(OR(A60=\"\",COUNTIF(Année1!$A$2:$A$100,A60)),\"\",MAX($D$1:D59)+1)","v":""}]
[null,null,null,{"$f":"IF(OR(A61=\"\",COUNTIF(Année1!$A$2:$A$100,A61)),\"\",MAX($D$1:D60)+1)","v":""}]
[null,null,null,{"$f":"IF(OR(A62=\"\",COUNTIF(Année1!$A$2:$A$100,A62)),\"\",MAX($D$1:D61)+1)","v":""}]
[null,null,null,{"$f":"IF(OR(A63=\"\",COUNTIF(Année1!$A$2:$A$100,A63)),\"\",MAX($D$1:D62)+1)","v":""}]
[null,null,null,{"$f":"IF(OR(A64=\"\",COUNTIF(Année1!$A$2:$A$100,A64)),\"\",MAX($D$1:D63)+1)","v":""}]
[null,null,null,{"$f":"IF(OR(A65=\"\",COUNTIF(Année1!$A$2:$A$100,A65)),\"\",MAX($D$1:D64)+1)","v":""}]
[null,null,null,{"$f":"IF(OR(A66=\"\",COUNTIF(Année1!$A$2:$A$100,A66)),\"\",MAX($D$1:D65)+1)","v":""}]
[null,null,null,{"$f":"IF(OR(A67=\"\",COUNTIF(Année1!$A$2:$A$100,A67)),\"\",MAX($D$1:D66)+1)","v":""}]
[null,null,null,{"$f":"IF(OR(A68=\"\",COUNTIF(Année1!$A$2:$A$100,A68)),\"\",MAX($D$1:D67)+1)","v":""}]
[null,null,null,{"$f":"IF(OR(A69=\"\",COUNTIF(Année1!$A$2:$A$100,A69)),\"\",MAX($D$1:D68)+1)","v":""}]
[null,null,null,{"$f":"IF(OR(A70=\"\",COUNTIF(Année1!$A$2:$A$100,A70)),\"\",MAX($D$1:D69)+1)","v":""}]
[null,null,null,{"$f":"IF(OR(A71=\"\",COUNTIF(Année1!$A$2:$A$100,A71)),\"\",MAX($D$1:D70)+1)","v":""}]
[null,null,null,{"$f":"IF(OR(A72=\"\",COUNTIF(Année1!$A$2:$A$100,A72)),\"\",MAX($D$1:D71)+1)","v":""}]
[null,null,null,{"$f":"IF(OR(A73=\"\",COUNTIF(Année1!$A$2:$A$100,A73)),\"\",MAX($D$1:D72)+1)","v":""}]
[null,null,null,{"$f":"IF(OR(A74=\"\",COUNTIF(Année1!$A$2:$A$100,A74)),\"\",MAX($D$1:D73)+1)","v":""}]
[null,null,null,{"$f":"IF(OR(A75=\"\",COUNTIF(Année1!$A$2:$A$100,A75)),\"\",MAX($D$1:D74)+1)","v":""}]
[null,null,null,{"$f":"IF(OR(A76=\"\",COUNTIF(Année1!$A$2:$A$100,A76)),\"\",MAX($D$1:D75)+1)","v":""}]
[null,null,null,{"$f":"IF(OR(A77=\"\",COUNTIF(Année1!$A$2:$A$100,A77)),\"\",MAX($D$1:D76)+1)","v":""}]
[null,null,null,{"$f":"IF(OR(A78=\"\",COUNTIF(Année1!$A$2:$A$100,A78)),\"\",MAX($D$1:D77)+1)","v":""}]
[null,null,null,{"$f":"IF(OR(A79=\"\",COUNTIF(Année1!$A$2:$A$100,A79)),\"\",MAX($D$1:D78)+1)","v":""}]
[null,null,null,{"$f":"IF(OR(A80=\"\",COUNTIF(Année1!$A$2:$A$100,A80)),\"\",MAX($D$1:D79)+1)","v":""}]
[null,null,null,{"$f":"IF(OR(A81=\"\",COUNTIF(Année1!$A$2:$A$100,A81)),\"\",MAX($D$1:D80)+1)","v":""}]
[null,null,null,{"$f":"IF(OR(A82=\"\",COUNTIF(Année1!$A$2:$A$100,A82)),\"\",MAX($D$1:D81)+1)","v":""}]
[null,null,null,{"$f":"IF(OR(A83=\"\",COUNTIF(Année1!$A$2:$A$100,A83)),\"\",MAX($D$1:D82)+1)","v":""}]
[null,null,null,{"$f":"IF(OR(A84=\"\",COUNTIF(Année1!$A$2:$A$100,A84)),\"\",MAX($D$1:D83)+1)","v":""}]
[null,null,null,{"$f":"IF(OR(A85=\"\",COUNTIF(Année1!$A$2:$A$100,A85)),\"\",MAX($D$1:D84)+1)","v":""}]
[null,null,null,{"$f":"IF(OR(A86=\"\",COUNTIF(Année1!$A$2:$A$100,A86)),\"\",MAX($D$1:D85)+1)","v":""}]
[null,null,null,{"$f":"IF(OR(A87=\"\",COUNTIF(Année1!$A$2:$A$100,A87)),\"\",MAX($D$1:D86)+1)","v":""}]
[null,null,null,{"$f":"IF(OR(A88=\"\",COUNTIF(Année1!$A$2:$A$100,A88)),\"\",MAX($D$1:D87)+1)","v":""}]
[null,null,null,{"$f":"IF(OR(A89=\"\",COUNTIF(Année1!$A$2:$A$100,A89)),\"\",MAX($D$1:D88)+1)","v":""}]
[null,null,null,{"$f":"IF(OR(A90=\"\",COUNTIF(Année1!$A$2:$A$100,A90)),\"\",MAX($D$1:D89)+1)","v":""}]
[null,null,null,{"$f":"IF(OR(A91=\"\",COUNTIF(Année1!$A$2:$A$100,A91)),\"\",MAX($D$1:D90)+1)","v":""}]
[null,null,null,{"$f":"IF(OR(A92=\"\",COUNTIF(Année1!$A$2:$A$100,A92)),\"\",MAX($D$1:D91)+1)","v":""}]
[null,null,null,{"$f":"IF(OR(A93=\"\",COUNTIF(Année1!$A$2:$A$100,A93)),\"\",MAX($D$1:D92)+1)","v":""}]
[null,null,null,{"$f":"IF(OR(A94=\"\",COUNTIF(Année1!$A$2:$A$100,A94)),\"\",MAX($D$1:D93)+1)","v":""}]
[null,null,null,{"$f":"IF(OR(A95=\"\",COUNTIF(Année1!$A$2:$A$100,A95)),\"\",MAX($D$1:D94)+1)","v":""}]
[null,null,null,{"$f":"IF(OR(A96=\"\",COUNTIF(Année1!$A$2:$A$100,A96)),\"\",MAX($D$1:D95)+1)","v":""}]
[null,null,null,{"$f":"IF(OR(A97=\"\",COUNTIF(Année1!$A$2:$A$100,A97)),\"\",MAX($D$1:D96)+1)","v":""}]
[null,null,null,{"$f":"IF(OR(A98=\"\",COUNTIF(Année1!$A$2:$A$100,A98)),\"\",MAX($D$1:D97)+1)","v":""}]
[null,null,null,{"$f":"IF(OR(A99=\"\",COUNTIF(Année1!$A$2:$A$100,A99)),\"\",MAX($D$1:D98)+1)","v":""}]
[null,null,null,{"$f":"IF(OR(A100=\"\",COUNTIF(Année1!$A$2:$A$100,A100)),\"\",MAX($D$1:D99)+1)","v":""}]

{"sheet":"Comparatif","index":2,"n_rows":317,"n_cols":6,"rows_kept":317,"cut":false,"hidden":false,"merged":[]}
[null,"ANNEE 1",null,"ANNEE 2"]
["REF","Libellé","Montant","Libellé","Montant","écart"]
[{"$f":"IF(COUNTIF(Année1!$A$2:$A$100,\"<>\")>COUNTA($A$2:A2),Année1!A2,IF(ROW()>MAX(Année2!$D$2:$D$100),\"\",INDEX(Année2!A$2:A100,MATCH(ROW(),Année2!$D$2:$D$100,0))))","v":"AA_001"},{"$f":"IF(A3=\"\",\"\",IF(COUNTIF(Année1!$A$2:$A$100,$A3),VLOOKUP($A3,Année1!$A$2:$C$100,2,0),\"Non référencé\"))","v":"Peuplier"},{"$f":"IF(B3=\"\",\"\",IF(COUNTIF(Année1!$A$2:$A$100,$A3),VLOOKUP($A3,Année1!$A$2:$C$100,3,0),\"Non référencé\"))","v":1516500},{"$f":"IF($A3=\"\",\"\",IF(COUNTIF(Année2!$A$2:$A$100,$A3),VLOOKUP($A3,Année2!$A$2:$C$100,2,0),\"Non référencé\"))","v":"Peuplier"},{"$f":"IF($A3=\"\",\"\",IF(COUNTIF(Année2!$A$2:$A$100,$A3),VLOOKUP($A3,Année2!$A$2:$C$100,3,0),\"Non référencé\"))","v":3060000},{"$f":"IFERROR(E3-C3,\"non réf\")","v":1543500}]
[{"$f":"IF(COUNTIF(Année1!$A$2:$A$100,\"<>\")>COUNTA($A$2:A3),Année1!A3,IF(ROW()>MAX(Année2!$D$2:$D$100),\"\",INDEX(Année2!A$2:A101,MATCH(ROW(),Année2!$D$2:$D$100,0))))","v":"AA_002"},{"$f":"IF(A4=\"\",\"\",IF(COUNTIF(Année1!$A$2:$A$100,$A4),VLOOKUP($A4,Année1!$A$2:$C$100,2,0),\"Non référencé\"))","v":"Sycomore"},{"$f":"IF(B4=\"\",\"\",IF(COUNTIF(Année1!$A$2:$A$100,$A4),VLOOKUP($A4,Année1!$A$2:$C$100,3,0),\"Non référencé\"))","v":3060000},{"$f":"IF($A4=\"\",\"\",IF(COUNTIF(Année2!$A$2:$A$100,$A4),VLOOKUP($A4,Année2!$A$2:$C$100,2,0),\"Non référencé\"))","v":"Sycomore"},{"$f":"IF($A4=\"\",\"\",IF(COUNTIF(Année2!$A$2:$A$100,$A4),VLOOKUP($A4,Année2!$A$2:$C$100,3,0),\"Non référencé\"))","v":4567500},{"$f":"IFERROR(E4-C4,\"non réf\")","v":1507500}]
[{"$f":"IF(COUNTIF(Année1!$A$2:$A$100,\"<>\")>COUNTA($A$2:A4),Année1!A4,IF(ROW()>MAX(Année2!$D$2:$D$100),\"\",INDEX(Année2!A$2:A102,MATCH(ROW(),Année2!$D$2:$D$100,0))))","v":"AA_003"},{"$f":"IF(A5=\"\",\"\",IF(COUNTIF(Année1!$A$2:$A$100,$A5),VLOOKUP($A5,Année1!$A$2:$C$100,2,0),\"Non référencé\"))","v":"Chêne"},{"$f":"IF(B5=\"\",\"\",IF(COUNTIF(Année1!$A$2:$A$100,$A5),VLOOKUP($A5,Année1!$A$2:$C$100,3,0),\"Non référencé\"))","v":1525500},{"$f":"IF($A5=\"\",\"\",IF(COUNTIF(Année2!$A$2:$A$100,$A5),VLOOKUP($A5,Année2!$A$2:$C$100,2,0),\"Non référencé\"))","v":"Chêne"},{"$f":"IF($A5=\"\",\"\",IF(COUNTIF(Année2!$A$2:$A$100,$A5),VLOOKUP($A5,Année2!$A$2:$C$100,3,0),\"Non référencé\"))","v":4527000},3001500]
[{"$f":"IF(COUNTIF(Année1!$A$2:$A$100,\"<>\")>COUNTA($A$2:A5),Année1!A5,IF(ROW()>MAX(Année2!$D$2:$D$100),\"\",INDEX(Année2!A$2:A103,MATCH(ROW(),Année2!$D$2:$D$100,0))))","v":"AA_004"},{"$f":"IF(A6=\"\",\"\",IF(COUNTIF(Année1!$A$2:$A$100,$A6),VLOOKUP($A6,Année1!$A$2:$C$100,2,0),\"Non référencé\"))","v":"Bouleau"},{"$f":"IF(B6=\"\",\"\",IF(COUNTIF(Année1!$A$2:$A$100,$A6),VLOOKUP($A6,Année1!$A$2:$C$100,3,0),\"Non référencé\"))","v":9189000},{"$f":"IF($A6=\"\",\"\",IF(COUNTIF(Année2!$A$2:$A$100,$A6),VLOOKUP($A6,Année2!$A$2:$C$100,2,0),\"Non référencé\"))","v":"Non référencé"},{"$f":"IF($A6=\"\",\"\",IF(COUNTIF(Année2!$A$2:$A$100,$A6),VLOOKUP($A6,Année2!$A$2:$C$100,3,0),\"Non référencé\"))","v":"Non référencé"},"non réf"]
[{"$f":"IF(COUNTIF(Année1!$A$2:$A$100,\"<>\")>COUNTA($A$2:A6),Année1!A6,IF(ROW()>MAX(Année2!$D$2:$D$100),\"\",INDEX(Année2!A$2:A104,MATCH(ROW(),Année2!$D$2:$D$100,0))))","v":"AA_005"},{"$f":"IF(A7=\"\",\"\",IF(COUNTIF(Année1!$A$2:$A$100,$A7),VLOOKUP($A7,Année1!$A$2:$C$100,2,0),\"Non référencé\"))","v":"Platane"},{"$f":"IF(B7=\"\",\"\",IF(COUNTIF(Année1!$A$2:$A$100,$A7),VLOOKUP($A7,Année1!$A$2:$C$100,3,0),\"Non référencé\"))","v":4603500},{"$f":"IF($A7=\"\",\"\",IF(COUNTIF(Année2!$A$2:$A$100,$A7),VLOOKUP($A7,Année2!$A$2:$C$100,2,0),\"Non référencé\"))","v":"Platane"},{"$f":"IF($A7=\"\",\"\",IF(COUNTIF(Année2!$A$2:$A$100,$A7),VLOOKUP($A7,Année2!$A$2:$C$100,3,0),\"Non référencé\"))","v":1515000},-3088500]
[{"$f":"IF(COUNTIF(Année1!$A$2:$A$100,\"<>\")>COUNTA($A$2:A7),Année1!A7,IF(ROW()>MAX(Année2!$D$2:$D$100),\"\",INDEX(Année2!A$2:A105,MATCH(ROW(),Année2!$D$2:$D$100,0))))","v":"AA_006"},{"$f":"IF(A8=\"\",\"\",IF(COUNTIF(Année1!$A$2:$A$100,$A8),VLOOKUP($A8,Année1!$A$2:$C$100,2,0),\"Non référencé\"))","v":"Papayer"},{"$f":"IF(B8=\"\",\"\",IF(COUNTIF(Année1!$A$2:$A$100,$A8),VLOOKUP($A8,Année1!$A$2:$C$100,3,0),\"Non référencé\"))","v":3012000},{"$f":"IF($A8=\"\",\"\",IF(COUNTIF(Année2!$A$2:$A$100,$A8),VLOOKUP($A8,Année2!$A$2:$C$100,2,0),\"Non référencé\"))","v":"Papayer"},{"$f":"IF($A8=\"\",\"\",IF(COUNTIF(Année2!$A$2:$A$100,$A8),VLOOKUP($A8,Année2!$A$2:$C$100,3,0),\"Non référencé\"))","v":1507500},-1504500]
[{"$f":"IF(COUNTIF(Année1!$A$2:$A$100,\"<>\")>COUNTA($A$2:A8),Année1!A8,IF(ROW()>MAX(Année2!$D$2:$D$100),\"\",INDEX(Année2!A$2:A106,MATCH(ROW(),Année2!$D$2:$D$100,0))))","v":"AA_007"},{"$f":"IF(A9=\"\",\"\",IF(COUNTIF(Année1!$A$2:$A$100,$A9),VLOOKUP($A9,Année1!$A$2:$C$100,2,0),\"Non référencé\"))","v":"Cyprés"},{"$f":"IF(B9=\"\",\"\",IF(COUNTIF(Année1!$A$2:$A$100,$A9),VLOOKUP($A9,Année1!$A$2:$C$100,3,0),\"Non référencé\"))","v":4608000},{"$f":"IF($A9=\"\",\"\",IF(COUNTIF(Année2!$A$2:$A$100,$A9),VLOOKUP($A9,Année2!$A$2:$C$100,2,0),\"Non référencé\"))","v":"Cyprés"},{"$f":"IF($A9=\"\",\"\",IF(COUNTIF(Année2!$A$2:$A$100,$A9),VLOOKUP($A9,Année2!$A$2:$C$100,3,0),\"Non référencé\"))","v":3039000},-1569000]
[{"$f":"IF(COUNTIF(Année1!$A$2:$A$100,\"<>\")>COUNTA($A$2:A9),Année1!A9,IF(ROW()>MAX(Année2!$D$2:$D$100),\"\",INDEX(Année2!A$2:A107,MATCH(ROW(),Année2!$D$2:$D$100,0))))","v":"AA_008"},{"$f":"IF(A10=\"\",\"\",IF(COUNTIF(Année1!$A$2:$A$100,$A10),VLOOKUP($A10,Année1!$A$2:$C$100,2,0),\"Non référencé\"))","v":"Frêne"},{"$f":"IF(B10=\"\",\"\",IF(COUNTIF(Année1!$A$2:$A$100,$A10),VLOOKUP($A10,Année1!$A$2:$C$100,3,0),\"Non référencé\"))","v":1527000},{"$f":"IF($A10=\"\",\"\",IF(COUNTIF(Année2!$A$2:$A$100,$A10),VLOOKUP($A10,Année2!$A$2:$C$100,2,0),\"Non référencé\"))","v":"Frêne"},{"$f":"IF($A10=\"\",\"\",IF(COUNTIF(Année2!$A$2:$A$100,$A10),VLOOKUP($A10,Année2!$A$2:$C$100,3,0),\"Non référencé\"))","v":4513500},2986500]
[{"$f":"IF(COUNTIF(Année1!$A$2:$A$100,\"<>\")>COUNTA($A$2:A10),Année1!A10,IF(ROW()>MAX(Année2!$D$2:$D$100),\"\",INDEX(Année2!A$2:A108,MATCH(ROW(),Année2!$D$2:$D$100,0))))","v":"AA_009"},{"$f":"IF(A11=\"\",\"\",IF(COUNTIF(Année1!$A$2:$A$100,$A11),VLOOKUP($A11,Année1!$A$2:$C$100,2,0),\"Non référencé\"))","v":"Manguier"},{"$f":"IF(B11=\"\",\"\",IF(COUNTIF(Année1!$A$2:$A$100,$A11),VLOOKUP($A11,Année1!$A$2:$C$100,3,0),\"Non référencé\"))","v":3039000},{"$f":"IF($A11=\"\",\"\",IF(COUNTIF(Année2!$A$2:$A$100,$A11),VLOOKUP($A11,Année2!$A$2:$C$100,2,0),\"Non référencé\"))","v":"Manguier"},{"$f":"IF($A11=\"\",\"\",IF(COUNTIF(Année2!$A$2:$A$100,$A11),VLOOKUP($A11,Année2!$A$2:$C$100,3,0),\"Non référencé\"))","v":1524000},-1515000]
[{"$f":"IF(COUNTIF(Année1!$A$2:$A$100,\"<>\")>COUNTA($A$2:A11),Année1!A11,IF(ROW()>MAX(Année2!$D$2:$D$100),\"\",INDEX(Année2!A$2:A109,MATCH(ROW(),Année2!$D$2:$D$100,0))))","v":"AA_010"},{"$f":"IF(A12=\"\",\"\",IF(COUNTIF(Année1!$A$2:$A$100,$A12),VLOOKUP($A12,Année1!$A$2:$C$100,2,0),\"Non référencé\"))","v":"If"},{"$f":"IF(B12=\"\",\"\",IF(COUNTIF(Année1!$A$2:$A$100,$A12),VLOOKUP($A12,Année1!$A$2:$C$100,3,0),\"Non référencé\"))","v":4612500},{"$f":"IF($A12=\"\",\"\",IF(COUNTIF(Année2!$A$2:$A$100,$A12),VLOOKUP($A12,Année2!$A$2:$C$100,2,0),\"Non référencé\"))","v":"If"},{"$f":"IF($A12=\"\",\"\",IF(COUNTIF(Année2!$A$2:$A$100,$A12),VLOOKUP($A12,Année2!$A$2:$C$100,3,0),\"Non référencé\"))","v":1518000},-3094500]
[{"$f":"IF(COUNTIF(Année1!$A$2:$A$100,\"<>\")>COUNTA($A$2:A12),Année1!A12,IF(ROW()>MAX(Année2!$D$2:$D$100),\"\",INDEX(Année2!A$2:A110,MATCH(ROW(),Année2!$D$2:$D$100,0))))","v":"AA_011"},{"$f":"IF(A13=\"\",\"\",IF(COUNTIF(Année1!$A$2:$A$100,$A13),VLOOKUP($A13,Année1!$A$2:$C$100,2,0),\"Non référencé\"))","v":"Sorbier"},{"$f":"IF(B13=\"\",\"\",IF(COUNTIF(Année1!$A$2:$A$100,$A13),VLOOKUP($A13,Année1!$A$2:$C$100,3,0),\"Non référencé\"))","v":1507500},{"$f":"IF($A13=\"\",\"\",IF(COUNTIF(Année2!$A$2:$A$100,$A13),VLOOKUP($A13,Année2!$A$2:$C$100,2,0),\"Non référencé\"))","v":"Non référencé"},{"$f":"IF($A13=\"\",\"\",IF(COUNTIF(Année2!$A$2:$A$100,$A13),VLOOKUP($A13,Année2!$A$2:$C$100,3,0),\"Non référencé\"))","v":"Non référencé"},"non réf"]
[{"$f":"IF(COUNTIF(Année1!$A$2:$A$100,\"<>\")>COUNTA($A$2:A13),Année1!A13,IF(ROW()>MAX(Année2!$D$2:$D$100),\"\",INDEX(Année2!A$2:A111,MATCH(ROW(),Année2!$D$2:$D$100,0))))","v":"AA_012"},{"$f":"IF(A14=\"\",\"\",IF(COUNTIF(Année1!$A$2:$A$100,$A14),VLOOKUP($A14,Année1!$A$2:$C$100,2,0),\"Non référencé\"))","v":"Hêtre"},{"$f":"IF(B14=\"\",\"\",IF(COUNTIF(Année1!$A$2:$A$100,$A14),VLOOKUP($A14,Année1!$A$2:$C$100,3,0),\"Non référencé\"))","v":4527000},{"$f":"IF($A14=\"\",\"\",IF(COUNTIF(Année2!$A$2:$A$100,$A14),VLOOKUP($A14,Année2!$A$2:$C$100,2,0),\"Non référencé\"))","v":"Hêtre"},{"$f":"IF($A14=\"\",\"\",IF(COUNTIF(Année2!$A$2:$A$100,$A14),VLOOKUP($A14,Année2!$A$2:$C$100,3,0),\"Non référencé\"))","v":4599000},72000]
[{"$f":"IF(COUNTIF(Année1!$A$2:$A$100,\"<>\")>COUNTA($A$2:A14),Année1!A14,IF(ROW()>MAX(Année2!$D$2:$D$100),\"\",INDEX(Année2!A$2:A112,MATCH(ROW(),Année2!$D$2:$D$100,0))))","v":"AA_013"},{"$f":"IF(A15=\"\",\"\",IF(COUNTIF(Année1!$A$2:$A$100,$A15),VLOOKUP($A15,Année1!$A$2:$C$100,2,0),\"Non référencé\"))","v":"Erable"},{"$f":"IF(B15=\"\",\"\",IF(COUNTIF(Année1!$A$2:$A$100,$A15),VLOOKUP($A15,Année1!$A$2:$C$100,3,0),\"Non référencé\"))","v":3057000},{"$f":"IF($A15=\"\",\"\",IF(COUNTIF(Année2!$A$2:$A$100,$A15),VLOOKUP($A15,Année2!$A$2:$C$100,2,0),\"Non référencé\"))","v":"Erable"},{"$f":"IF($A15=\"\",\"\",IF(COUNTIF(Année2!$A$2:$A$100,$A15),VLOOKUP($A15,Année2!$A$2:$C$100,3,0),\"Non référencé\"))","v":3081000},24000]
[{"$f":"IF(COUNTIF(Année1!$A$2:$A$100,\"<>\")>COUNTA($A$2:A15),Année1!A15,IF(ROW()>MAX(Année2!$D$2:$D$100),\"\",INDEX(Année2!A$2:A113,MATCH(ROW(),Année2!$D$2:$D$100,0))))","v":"AA_014"},{"$f":"IF(A16=\"\",\"\",IF(COUNTIF(Année1!$A$2:$A$100,$A16),VLOOKUP($A16,Année1!$A$2:$C$100,2,0),\"Non référencé\"))","v":"Saule"},{"$f":"IF(B16=\"\",\"\",IF(COUNTIF(Année1!$A$2:$A$100,$A16),VLOOKUP($A16,Année1!$A$2:$C$100,3,0),\"Non référencé\"))","v":1501500},{"$f":"IF($A16=\"\",\"\",IF(COUNTIF(Année2!$A$2:$A$100,$A16),VLOOKUP($A16,Année2!$A$2:$C$100,2,0),\"Non référencé\"))","v":"Saule"},{"$f":"IF($A16=\"\",\"\",IF(COUNTIF(Année2!$A$2:$A$100,$A16),VLOOKUP($A16,Année2!$A$2:$C$100,3,0),\"Non référencé\"))","v":1539000},37500]
[{"$f":"IF(COUNTIF(Année1!$A$2:$A$100,\"<>\")>COUNTA($A$2:A16),Année1!A16,IF(ROW()>MAX(Année2!$D$2:$D$100),\"\",INDEX(Année2!A$2:A114,MATCH(ROW(),Année2!$D$2:$D$100,0))))","v":"AA_015"},{"$f":"IF(A17=\"\",\"\",IF(COUNTIF(Année1!$A$2:$A$100,$A17),VLOOKUP($A17,Année1!$A$2:$C$100,2,0),\"Non référencé\"))","v":"Olivier"},{"$f":"IF(B17=\"\",\"\",IF(COUNTIF(Année1!$A$2:$A$100,$A17),VLOOKUP($A17,Année1!$A$2:$C$100,3,0),\"Non référencé\"))","v":1539000},{"$f":"IF($A17=\"\",\"\",IF(COUNTIF(Année2!$A$2:$A$100,$A17),VLOOKUP($A17,Année2!$A$2:$C$100,2,0),\"Non référencé\"))","v":"Non référencé"},{"$f":"IF($A17=\"\",\"\",IF(COUNTIF(Année2!$A$2:$A$100,$A17),VLOOKUP($A17,Année2!$A$2:$C$100,3,0),\"Non référencé\"))","v":"Non référencé"},"non réf"]
[{"$f":"IF(COUNTIF(Année1!$A$2:$A$100,\"<>\")>COUNTA($A$2:A17),Année1!A17,IF(ROW()>MAX(Année2!$D$2:$D$100),\"\",INDEX(Année2!A$2:A115,MATCH(ROW(),Année2!$D$2:$D$100,0))))","v":"AA_016"},{"$f":"IF(A18=\"\",\"\",IF(COUNTIF(Année1!$A$2:$A$100,$A18),VLOOKUP($A18,Année1!$A$2:$C$100,2,0),\"Non référencé\"))","v":"Noyer"},{"$f":"IF(B18=\"\",\"\",IF(COUNTIF(Année1!$A$2:$A$100,$A18),VLOOKUP($A18,Année1!$A$2:$C$100,3,0),\"Non référencé\"))","v":3003000},{"$f":"IF($A18=\"\",\"\",IF(COUNTIF(Année2!$A$2:$A$100,$A18),VLOOKUP($A18,Année2!$A$2:$C$100,2,0),\"Non référencé\"))","v":"Noyer"},{"$f":"IF($A18=\"\",\"\",IF(COUNTIF(Année2!$A$2:$A$100,$A18),VLOOKUP($A18,Année2!$A$2:$C$100,3,0),\"Non référencé\"))","v":1525500},-1477500]
[{"$f":"IF(COUNTIF(Année1!$A$2:$A$100,\"<>\")>COUNTA($A$2:A18),Année1!A18,IF(ROW()>MAX(Année2!$D$2:$D$100),\"\",INDEX(Année2!A$2:A116,MATCH(ROW(),Année2!$D$2:$D$100,0))))","v":"AA_017"},{"$f":"IF(A19=\"\",\"\",IF(COUNTIF(Année1!$A$2:$A$100,$A19),VLOOKUP($A19,Année1!$A$2:$C$100,2,0),\"Non référencé\"))","v":"Charme"},{"$f":"IF(B19=\"\",\"\",IF(COUNTIF(Année1!$A$2:$A$100,$A19),VLOOKUP($A19,Année1!$A$2:$C$100,3,0),\"Non référencé\"))","v":1512000},{"$f":"IF($A19=\"\",\"\",IF(COUNTIF(Année2!$A$2:$A$100,$A19),VLOOKUP($A19,Année2!$A$2:$C$100,2,0),\"Non référencé\"))","v":"Charme"},{"$f":"IF($A19=\"\",\"\",IF(COUNTIF(Année2!$A$2:$A$100,$A19),VLOOKUP($A19,Année2!$A$2:$C$100,3,0),\"Non référencé\"))","v":1512000},0]
[{"$f":"IF(COUNTIF(Année1!$A$2:$A$100,\"<>\")>COUNTA($A$2:A19),Année1!A19,IF(ROW()>MAX(Année2!$D$2:$D$100),\"\",INDEX(Année2!A$2:A117,MATCH(ROW(),Année2!$D$2:$D$100,0))))","v":"AA_018"},{"$f":"IF(A20=\"\",\"\",IF(COUNTIF(Année1!$A$2:$A$100,$A20),VLOOKUP($A20,Année1!$A$2:$C$100,2,0),\"Non référencé\"))","v":"Orme"},{"$f":"IF(B20=\"\",\"\",IF(COUNTIF(Année1!$A$2:$A$100,$A20),VLOOKUP($A20,Année1!$A$2:$C$100,3,0),\"Non référencé\"))","v":4567500},{"$f":"IF($A20=\"\",\"\",IF(COUNTIF(Année2!$A$2:$A$100,$A20),VLOOKUP($A20,Année2!$A$2:$C$100,2,0),\"Non référencé\"))","v":"Orme"},{"$f":"IF($A20=\"\",\"\",IF(COUNTIF(Année2!$A$2:$A$100,$A20),VLOOKUP($A20,Année2!$A$2:$C$100,3,0),\"Non référencé\"))","v":4608000},40500]
[{"$f":"IF(COUNTIF(Année1!$A$2:$A$100,\"<>\")>COUNTA($A$2:A20),Année1!A20,IF(ROW()>MAX(Année2!$D$2:$D$100),\"\",INDEX(Année2!A$2:A118,MATCH(ROW(),Année2!$D$2:$D$100,0))))","v":"AA_019"},{"$f":"IF(A21=\"\",\"\",IF(COUNTIF(Année1!$A$2:$A$100,$A21),VLOOKUP($A21,Année1!$A$2:$C$100,2,0),\"Non référencé\"))","v":"Mélèze"},{"$f":"IF(B21=\"\",\"\",IF(COUNTIF(Année1!$A$2:$A$100,$A21),VLOOKUP($A21,Année1!$A$2:$C$100,3,0),\"Non référencé\"))","v":1515000},{"$f":"IF($A21=\"\",\"\",IF(COUNTIF(Année2!$A$2:$A$100,$A21),VLOOKUP($A21,Année2!$A$2:$C$100,2,0),\"Non référencé\"))","v":"Mélèze"},{"$f":"IF($A21=\"\",\"\",IF(COUNTIF(Année2!$A$2:$A$100,$A21),VLOOKUP($A21,Année2!$A$2:$C$100,3,0),\"Non référencé\"))","v":3003000},1488000]
[{"$f":"IF(COUNTIF(Année1!$A$2:$A$100,\"<>\")>COUNTA($A$2:A21),Année1!A21,IF(ROW()>MAX(Année2!$D$2:$D$100),\"\",INDEX(Année2!A$2:A119,MATCH(ROW(),Année2!$D$2:$D$100,0))))","v":"AA_020"},{"$f":"IF(A22=\"\",\"\",IF(COUNTIF(Année1!$A$2:$A$100,$A22),VLOOKUP($A22,Année1!$A$2:$C$100,2,0),\"Non référencé\"))","v":"Palmier"},{"$f":"IF(B22=\"\",\"\",IF(COUNTIF(Année1!$A$2:$A$100,$A22),VLOOKUP($A22,Année1!$A$2:$C$100,3,0),\"Non référencé\"))","v":4599000},{"$f":"IF($A22=\"\",\"\",IF(COUNTIF(Année2!$A$2:$A$100,$A22),VLOOKUP($A22,Année2!$A$2:$C$100,2,0),\"Non référencé\"))","v":"Palmier"},{"$f":"IF($A22=\"\",\"\",IF(COUNTIF(Année2!$A$2:$A$100,$A22),VLOOKUP($A22,Année2!$A$2:$C$100,3,0),\"Non référencé\"))","v":1516500},-3082500]
[{"$f":"IF(COUNTIF(Année1!$A$2:$A$100,\"<>\")>COUNTA($A$2:A22),Année1!A22,IF(ROW()>MAX(Année2!$D$2:$D$100),\"\",INDEX(Année2!A$2:A120,MATCH(ROW(),Année2!$D$2:$D$100,0))))","v":"AA_021"},{"$f":"IF(A23=\"\",\"\",IF(COUNTIF(Année1!$A$2:$A$100,$A23),VLOOKUP($A23,Année1!$A$2:$C$100,2,0),\"Non référencé\"))","v":"Tuyas"},{"$f":"IF(B23=\"\",\"\",IF(COUNTIF(Année1!$A$2:$A$100,$A23),VLOOKUP($A23,Année1!$A$2:$C$100,3,0),\"Non référencé\"))","v":4513500},{"$f":"IF($A23=\"\",\"\",IF(COUNTIF(Année2!$A$2:$A$100,$A23),VLOOKUP($A23,Année2!$A$2:$C$100,2,0),\"Non référencé\"))","v":"Non référencé"},{"$f":"IF($A23=\"\",\"\",IF(COUNTIF(Année2!$A$2:$A$100,$A23),VLOOKUP($A23,Année2!$A$2:$C$100,3,0),\"Non référencé\"))","v":"Non référencé"},"non réf"]
[{"$f":"IF(COUNTIF(Année1!$A$2:$A$100,\"<>\")>COUNTA($A$2:A23),Année1!A23,IF(ROW()>MAX(Année2!$D$2:$D$100),\"\",INDEX(Année2!A$2:A121,MATCH(ROW(),Année2!$D$2:$D$100,0))))","v":"AA_022"},{"$f":"IF(A24=\"\",\"\",IF(COUNTIF(Année1!$A$2:$A$100,$A24),VLOOKUP($A24,Année1!$A$2:$C$100,2,0),\"Non référencé\"))","v":"Cornouiller"},{"$f":"IF(B24=\"\",\"\",IF(COUNTIF(Année1!$A$2:$A$100,$A24),VLOOKUP($A24,Année1!$A$2:$C$100,3,0),\"Non référencé\"))","v":3081000},{"$f":"IF($A24=\"\",\"\",IF(COUNTIF(Année2!$A$2:$A$100,$A24),VLOOKUP($A24,Année2!$A$2:$C$100,2,0),\"Non référencé\"))","v":"Cornouiller"},{"$f":"IF($A24=\"\",\"\",IF(COUNTIF(Année2!$A$2:$A$100,$A24),VLOOKUP($A24,Année2!$A$2:$C$100,3,0),\"Non référencé\"))","v":4603500},1522500]
[{"$f":"IF(COUNTIF(Année1!$A$2:$A$100,\"<>\")>COUNTA($A$2:A24),Année1!A24,IF(ROW()>MAX(Année2!$D$2:$D$100),\"\",INDEX(Année2!A$2:A122,MATCH(ROW(),Année2!$D$2:$D$100,0))))","v":"AA_023"},{"$f":"IF(A25=\"\",\"\",IF(COUNTIF(Année1!$A$2:$A$100,$A25),VLOOKUP($A25,Année1!$A$2:$C$100,2,0),\"Non référencé\"))","v":"Cocotier"},{"$f":"IF(B25=\"\",\"\",IF(COUNTIF(Année1!$A$2:$A$100,$A25),VLOOKUP($A25,Année1!$A$2:$C$100,3,0),\"Non référencé\"))","v":1524000},{"$f":"IF($A25=\"\",\"\",IF(COUNTIF(Année2!$A$2:$A$100,$A25),VLOOKUP($A25,Année2!$A$2:$C$100,2,0),\"Non référencé\"))","v":"Cocotier"},{"$f":"IF($A25=\"\",\"\",IF(COUNTIF(Année2!$A$2:$A$100,$A25),VLOOKUP($A25,Année2!$A$2:$C$100,3,0),\"Non référencé\"))","v":3057000},1533000]
[{"$f":"IF(COUNTIF(Année1!$A$2:$A$100,\"<>\")>COUNTA($A$2:A25),Année1!A25,IF(ROW()>MAX(Année2!$D$2:$D$100),\"\",INDEX(Année2!A$2:A123,MATCH(ROW(),Année2!$D$2:$D$100,0))))","v":"AA_024"},{"$f":"IF(A26=\"\",\"\",IF(COUNTIF(Année1!$A$2:$A$100,$A26),VLOOKUP($A26,Année1!$A$2:$C$100,2,0),\"Non référencé\"))","v":"Epicéa"},{"$f":"IF(B26=\"\",\"\",IF(COUNTIF(Année1!$A$2:$A$100,$A26),VLOOKUP($A26,Année1!$A$2:$C$100,3,0),\"Non référencé\"))","v":1503000},{"$f":"IF($A26=\"\",\"\",IF(COUNTIF(Année2!$A$2:$A$100,$A26),VLOOKUP($A26,Année2!$A$2:$C$100,2,0),\"Non référencé\"))","v":"Epicéa"},{"$f":"IF($A26=\"\",\"\",IF(COUNTIF(Année2!$A$2:$A$100,$A26),VLOOKUP($A26,Année2!$A$2:$C$100,3,0),\"Non référencé\"))","v":1513500},10500]
[{"$f":"IF(COUNTIF(Année1!$A$2:$A$100,\"<>\")>COUNTA($A$2:A26),Année1!A26,IF(ROW()>MAX(Année2!$D$2:$D$100),\"\",INDEX(Année2!A$2:A124,MATCH(ROW(),Année2!$D$2:$D$100,0))))","v":"AA_025"},{"$f":"IF(A27=\"\",\"\",IF(COUNTIF(Année1!$A$2:$A$100,$A27),VLOOKUP($A27,Année1!$A$2:$C$100,2,0),\"Non référencé\"))","v":"Baobab"},{"$f":"IF(B27=\"\",\"\",IF(COUNTIF(Année1!$A$2:$A$100,$A27),VLOOKUP($A27,Année1!$A$2:$C$100,3,0),\"Non référencé\"))","v":1542000},{"$f":"IF($A27=\"\",\"\",IF(COUNTIF(Année2!$A$2:$A$100,$A27),VLOOKUP($A27,Année2!$A$2:$C$100,2,0),\"Non référencé\"))","v":"Baobab"},{"$f":"IF($A27=\"\",\"\",IF(COUNTIF(Année2!$A$2:$A$100,$A27),VLOOKUP($A27,Année2!$A$2:$C$100,3,0),\"Non référencé\"))","v":1503000},-39000]
[{"$f":"IF(COUNTIF(Année1!$A$2:$A$100,\"<>\")>COUNTA($A$2:A27),Année1!A27,IF(ROW()>MAX(Année2!$D$2:$D$100),\"\",INDEX(Année2!A$2:A125,MATCH(ROW(),Année2!$D$2:$D$100,0))))","v":"AA_026"},{"$f":"IF(A28=\"\",\"\",IF(COUNTIF(Année1!$A$2:$A$100,$A28),VLOOKUP($A28,Année1!$A$2:$C$100,2,0),\"Non référencé\"))","v":"Séquoïa"},{"$f":"IF(B28=\"\",\"\",IF(COUNTIF(Année1!$A$2:$A$100,$A28),VLOOKUP($A28,Année1!$A$2:$C$100,3,0),\"Non référencé\"))","v":1518000},{"$f":"IF($A28=\"\",\"\",IF(COUNTIF(Année2!$A$2:$A$100,$A28),VLOOKUP($A28,Année2!$A$2:$C$100,2,0),\"Non référencé\"))","v":"Séquoïa"},{"$f":"IF($A28=\"\",\"\",IF(COUNTIF(Année2!$A$2:$A$100,$A28),VLOOKUP($A28,Année2!$A$2:$C$100,3,0),\"Non référencé\"))","v":4612500},3094500]
[{"$f":"IF(COUNTIF(Année1!$A$2:$A$100,\"<>\")>COUNTA($A$2:A28),Année1!A28,IF(ROW()>MAX(Année2!$D$2:$D$100),\"\",INDEX(Année2!A$2:A126,MATCH(ROW(),Année2!$D$2:$D$100,0))))","v":"AA_027"},{"$f":"IF(A29=\"\",\"\",IF(COUNTIF(Année1!$A$2:$A$100,$A29),VLOOKUP($A29,Année1!$A$2:$C$100,2,0),\"Non référencé\"))","v":"Murier"},{"$f":"IF(B29=\"\",\"\",IF(COUNTIF(Année1!$A$2:$A$100,$A29),VLOOKUP($A29,Année1!$A$2:$C$100,3,0),\"Non référencé\"))","v":4531500},{"$f":"IF($A29=\"\",\"\",IF(COUNTIF(Année2!$A$2:$A$100,$A29),VLOOKUP($A29,Année2!$A$2:$C$100,2,0),\"Non référencé\"))","v":"Murier"},{"$f":"IF($A29=\"\",\"\",IF(COUNTIF(Année2!$A$2:$A$100,$A29),VLOOKUP($A29,Année2!$A$2:$C$100,3,0),\"Non référencé\"))","v":1501500},-3030000]
[{"$f":"IF(COUNTIF(Année1!$A$2:$A$100,\"<>\")>COUNTA($A$2:A29),Année1!A29,IF(ROW()>MAX(Année2!$D$2:$D$100),\"\",INDEX(Année2!A$2:A127,MATCH(ROW(),Année2!$D$2:$D$100,0))))","v":"AA_028"},{"$f":"IF(A30=\"\",\"\",IF(COUNTIF(Année1!$A$2:$A$100,$A30),VLOOKUP($A30,Année1!$A$2:$C$100,2,0),\"Non référencé\"))","v":"Tremble"},{"$f":"IF(B30=\"\",\"\",IF(COUNTIF(Année1!$A$2:$A$100,$A30),VLOOKUP($A30,Année1!$A$2:$C$100,3,0),\"Non référencé\"))","v":1513500},{"$f":"IF($A30=\"\",\"\",IF(COUNTIF(Année2!$A$2:$A$100,$A30),VLOOKUP($A30,Année2!$A$2:$C$100,2,0),\"Non référencé\"))","v":"Tremble"},{"$f":"IF($A30=\"\",\"\",IF(COUNTIF(Année2!$A$2:$A$100,$A30),VLOOKUP($A30,Année2!$A$2:$C$100,3,0),\"Non référencé\"))","v":1542000},28500]
[{"$f":"IF(COUNTIF(Année1!$A$2:$A$100,\"<>\")>COUNTA($A$2:A30),Année1!A30,IF(ROW()>MAX(Année2!$D$2:$D$100),\"\",INDEX(Année2!A$2:A128,MATCH(ROW(),Année2!$D$2:$D$100,0))))","v":"AA_030"},{"$f":"IF(A31=\"\",\"\",IF(COUNTIF(Année1!$A$2:$A$100,$A31),VLOOKUP($A31,Année1!$A$2:$C$100,2,0),\"Non référencé\"))","v":"Non référencé"},{"$f":"IF(B31=\"\",\"\",IF(COUNTIF(Année1!$A$2:$A$100,$A31),VLOOKUP($A31,Année1!$A$2:$C$100,3,0),\"Non référencé\"))","v":"Non référencé"},{"$f":"IF($A31=\"\",\"\",IF(COUNTIF(Année2!$A$2:$A$100,$A31),VLOOKUP($A31,Année2!$A$2:$C$100,2,0),\"Non référencé\"))","v":{"$error":"#N/A"}},{"$f":"IF($A31=\"\",\"\",IF(COUNTIF(Année2!$A$2:$A$100,$A31),VLOOKUP($A31,Année2!$A$2:$C$100,3,0),\"Non référencé\"))","v":4531500},"non réf"]
[{"$f":"IF(COUNTIF(Année1!$A$2:$A$100,\"<>\")>COUNTA($A$2:A31),Année1!A31,IF(ROW()>MAX(Année2!$D$2:$D$100),\"\",INDEX(Année2!A$2:A129,MATCH(ROW(),Année2!$D$2:$D$100,0))))","v":"AA_031"},{"$f":"IF(A32=\"\",\"\",IF(COUNTIF(Année1!$A$2:$A$100,$A32),VLOOKUP($A32,Année1!$A$2:$C$100,2,0),\"Non référencé\"))","v":"Non référencé"},{"$f":"IF(B32=\"\",\"\",IF(COUNTIF(Année1!$A$2:$A$100,$A32),VLOOKUP($A32,Année1!$A$2:$C$100,3,0),\"Non référencé\"))","v":"Non référencé"},{"$f":"IF($A32=\"\",\"\",IF(COUNTIF(Année2!$A$2:$A$100,$A32),VLOOKUP($A32,Année2!$A$2:$C$100,2,0),\"Non référencé\"))","v":{"$error":"#N/A"}},{"$f":"IF($A32=\"\",\"\",IF(COUNTIF(Année2!$A$2:$A$100,$A32),VLOOKUP($A32,Année2!$A$2:$C$100,3,0),\"Non référencé\"))","v":3012000},"non réf"]
[{"$f":"IF(COUNTIF(Année1!$A$2:$A$100,\"<>\")>COUNTA($A$2:A32),Année1!A32,IF(ROW()>MAX(Année2!$D$2:$D$100),\"\",INDEX(Année2!A$2:A130,MATCH(ROW(),Année2!$D$2:$D$100,0))))","v":"AA_033"},{"$f":"IF(A33=\"\",\"\",IF(COUNTIF(Année1!$A$2:$A$100,$A33),VLOOKUP($A33,Année1!$A$2:$C$100,2,0),\"Non référencé\"))","v":"Non référencé"},{"$f":"IF(B33=\"\",\"\",IF(COUNTIF(Année1!$A$2:$A$100,$A33),VLOOKUP($A33,Année1!$A$2:$C$100,3,0),\"Non référencé\"))","v":"Non référencé"},{"$f":"IF($A33=\"\",\"\",IF(COUNTIF(Année2!$A$2:$A$100,$A33),VLOOKUP($A33,Année2!$A$2:$C$100,2,0),\"Non référencé\"))","v":{"$error":"#N/A"}},{"$f":"IF($A33=\"\",\"\",IF(COUNTIF(Année2!$A$2:$A$100,$A33),VLOOKUP($A33,Année2!$A$2:$C$100,3,0),\"Non référencé\"))","v":9189000},"non réf"]
[{"$f":"IF(COUNTIF(Année1!$A$2:$A$100,\"<>\")>COUNTA($A$2:A33),Année1!A33,IF(ROW()>MAX(Année2!$D$2:$D$100),\"\",INDEX(Année2!A$2:A131,MATCH(ROW(),Année2!$D$2:$D$100,0))))","v":"AA_034"},{"$f":"IF(A34=\"\",\"\",IF(COUNTIF(Année1!$A$2:$A$100,$A34),VLOOKUP($A34,Année1!$A$2:$C$100,2,0),\"Non référencé\"))","v":"Non référencé"},{"$f":"IF(B34=\"\",\"\",IF(COUNTIF(Année1!$A$2:$A$100,$A34),VLOOKUP($A34,Année1!$A$2:$C$100,3,0),\"Non référencé\"))","v":"Non référencé"},{"$f":"IF($A34=\"\",\"\",IF(COUNTIF(Année2!$A$2:$A$100,$A34),VLOOKUP($A34,Année2!$A$2:$C$100,2,0),\"Non référencé\"))","v":{"$error":"#N/A"}},{"$f":"IF($A34=\"\",\"\",IF(COUNTIF(Année2!$A$2:$A$100,$A34),VLOOKUP($A34,Année2!$A$2:$C$100,3,0),\"Non référencé\"))","v":1527000},"non réf"]
[{"$f":"IF(COUNTIF(Année1!$A$2:$A$100,\"<>\")>COUNTA($A$2:A34),Année1!A34,IF(ROW()>MAX(Année2!$D$2:$D$100),\"\",INDEX(Année2!A$2:A132,MATCH(ROW(),Année2!$D$2:$D$100,0))))","v":"AA_035"},{"$f":"IF(A35=\"\",\"\",IF(COUNTIF(Année1!$A$2:$A$100,$A35),VLOOKUP($A35,Année1!$A$2:$C$100,2,0),\"Non référencé\"))","v":"Non référencé"},{"$f":"IF(B35=\"\",\"\",IF(COUNTIF(Année1!$A$2:$A$100,$A35),VLOOKUP($A35,Année1!$A$2:$C$100,3,0),\"Non référencé\"))","v":"Non référencé"},{"$f":"IF($A35=\"\",\"\",IF(COUNTIF(Année2!$A$2:$A$100,$A35),VLOOKUP($A35,Année2!$A$2:$C$100,2,0),\"Non référencé\"))","v":{"$error":"#N/A"}},{"$f":"IF($A35=\"\",\"\",IF(COUNTIF(Année2!$A$2:$A$100,$A35),VLOOKUP($A35,Année2!$A$2:$C$100,3,0),\"Non référencé\"))","v":4563000},"non réf"]
[{"$f":"IF(COUNTIF(Année1!$A$2:$A$100,\"<>\")>COUNTA($A$2:A35),Année1!A35,IF(ROW()>MAX(Année2!$D$2:$D$100),\"\",INDEX(Année2!A$2:A133,MATCH(ROW(),Année2!$D$2:$D$100,0))))","v":""},{"$f":"IF(A36=\"\",\"\",IF(COUNTIF(Année1!$A$2:$A$100,$A36),VLOOKUP($A36,Année1!$A$2:$C$100,2,0),\"Non référencé\"))","v":""},{"$f":"IF(B36=\"\",\"\",IF(COUNTIF(Année1!$A$2:$A$100,$A36),VLOOKUP($A36,Année1!$A$2:$C$100,3,0),\"Non référencé\"))","v":""},{"$f":"IF($A36=\"\",\"\",IF(COUNTIF(Année2!$A$2:$A$100,$A36),VLOOKUP($A36,Année2!$A$2:$C$100,2,0),\"Non référencé\"))","v":""},{"$f":"IF($A36=\"\",\"\",IF(COUNTIF(Année2!$A$2:$A$100,$A36),VLOOKUP($A36,Année2!$A$2:$C$100,3,0),\"Non référencé\"))","v":""}]
[{"$f":"IF(COUNTIF(Année1!$A$2:$A$100,\"<>\")>COUNTA($A$2:A36),Année1!A36,IF(ROW()>MAX(Année2!$D$2:$D$100),\"\",INDEX(Année2!A$2:A134,MATCH(ROW(),Année2!$D$2:$D$100,0))))","v":""},{"$f":"IF(A37=\"\",\"\",IF(COUNTIF(Année1!$A$2:$A$100,$A37),VLOOKUP($A37,Année1!$A$2:$C$100,2,0),\"Non référencé\"))","v":""},{"$f":"IF(B37=\"\",\"\",IF(COUNTIF(Année1!$A$2:$A$100,$A37),VLOOKUP($A37,Année1!$A$2:$C$100,3,0),\"Non référencé\"))","v":""},{"$f":"IF($A37=\"\",\"\",IF(COUNTIF(Année2!$A$2:$A$100,$A37),VLOOKUP($A37,Année2!$A$2:$C$100,2,0),\"Non référencé\"))","v":""},{"$f":"IF($A37=\"\",\"\",IF(COUNTIF(Année2!$A$2:$A$100,$A37),VLOOKUP($A37,Année2!$A$2:$C$100,3,0),\"Non référencé\"))","v":""}]
[{"$f":"IF(COUNTIF(Année1!$A$2:$A$100,\"<>\")>COUNTA($A$2:A37),Année1!A37,IF(ROW()>MAX(Année2!$D$2:$D$100),\"\",INDEX(Année2!A$2:A135,MATCH(ROW(),Année2!$D$2:$D$100,0))))","v":""},{"$f":"IF(A38=\"\",\"\",IF(COUNTIF(Année1!$A$2:$A$100,$A38),VLOOKUP($A38,Année1!$A$2:$C$100,2,0),\"Non référencé\"))","v":""},{"$f":"IF(B38=\"\",\"\",IF(COUNTIF(Année1!$A$2:$A$100,$A38),VLOOKUP($A38,Année1!$A$2:$C$100,3,0),\"Non référencé\"))","v":""},{"$f":"IF($A38=\"\",\"\",IF(COUNTIF(Année2!$A$2:$A$100,$A38),VLOOKUP($A38,Année2!$A$2:$C$100,2,0),\"Non référencé\"))","v":""},{"$f":"IF($A38=\"\",\"\",IF(COUNTIF(Année2!$A$2:$A$100,$A38),VLOOKUP($A38,Année2!$A$2:$C$100,3,0),\"Non référencé\"))","v":""}]
[{"$f":"IF(COUNTIF(Année1!$A$2:$A$100,\"<>\")>COUNTA($A$2:A38),Année1!A38,IF(ROW()>MAX(Année2!$D$2:$D$100),\"\",INDEX(Année2!A$2:A136,MATCH(ROW(),Année2!$D$2:$D$100,0))))","v":""},{"$f":"IF(A39=\"\",\"\",IF(COUNTIF(Année1!$A$2:$A$100,$A39),VLOOKUP($A39,Année1!$A$2:$C$100,2,0),\"Non référencé\"))","v":""},{"$f":"IF(B39=\"\",\"\",IF(COUNTIF(Année1!$A$2:$A$100,$A39),VLOOKUP($A39,Année1!$A$2:$C$100,3,0),\"Non référencé\"))","v":""},{"$f":"IF($A39=\"\",\"\",IF(COUNTIF(Année2!$A$2:$A$100,$A39),VLOOKUP($A39,Année2!$A$2:$C$100,2,0),\"Non référencé\"))","v":""},{"$f":"IF($A39=\"\",\"\",IF(COUNTIF(Année2!$A$2:$A$100,$A39),VLOOKUP($A39,Année2!$A$2:$C$100,3,0),\"Non référencé\"))","v":""}]
[{"$f":"IF(COUNTIF(Année1!$A$2:$A$100,\"<>\")>COUNTA($A$2:A39),Année1!A39,IF(ROW()>MAX(Année2!$D$2:$D$100),\"\",INDEX(Année2!A$2:A137,MATCH(ROW(),Année2!$D$2:$D$100,0))))","v":""},{"$f":"IF(A40=\"\",\"\",IF(COUNTIF(Année1!$A$2:$A$100,$A40),VLOOKUP($A40,Année1!$A$2:$C$100,2,0),\"Non référencé\"))","v":""},{"$f":"IF(B40=\"\",\"\",IF(COUNTIF(Année1!$A$2:$A$100,$A40),VLOOKUP($A40,Année1!$A$2:$C$100,3,0),\"Non référencé\"))","v":""},{"$f":"IF($A40=\"\",\"\",IF(COUNTIF(Année2!$A$2:$A$100,$A40),VLOOKUP($A40,Année2!$A$2:$C$100,2,0),\"Non référencé\"))","v":""},{"$f":"IF($A40=\"\",\"\",IF(COUNTIF(Année2!$A$2:$A$100,$A40),VLOOKUP($A40,Année2!$A$2:$C$100,3,0),\"Non référencé\"))","v":""}]
[{"$f":"IF(COUNTIF(Année1!$A$2:$A$100,\"<>\")>COUNTA($A$2:A40),Année1!A40,IF(ROW()>MAX(Année2!$D$2:$D$100),\"\",INDEX(Année2!A$2:A138,MATCH(ROW(),Année2!$D$2:$D$100,0))))","v":""},{"$f":"IF(A41=\"\",\"\",IF(COUNTIF(Année1!$A$2:$A$100,$A41),VLOOKUP($A41,Année1!$A$2:$C$100,2,0),\"Non référencé\"))","v":""},{"$f":"IF(B41=\"\",\"\",IF(COUNTIF(Année1!$A$2:$A$100,$A41),VLOOKUP($A41,Année1!$A$2:$C$100,3,0),\"Non référencé\"))","v":""},{"$f":"IF($A41=\"\",\"\",IF(COUNTIF(Année2!$A$2:$A$100,$A41),VLOOKUP($A41,Année2!$A$2:$C$100,2,0),\"Non référencé\"))","v":""},{"$f":"IF($A41=\"\",\"\",IF(COUNTIF(Année2!$A$2:$A$100,$A41),VLOOKUP($A41,Année2!$A$2:$C$100,3,0),\"Non référencé\"))","v":""}]
[{"$f":"IF(COUNTIF(Année1!$A$2:$A$100,\"<>\")>COUNTA($A$2:A41),Année1!A41,IF(ROW()>MAX(Année2!$D$2:$D$100),\"\",INDEX(Année2!A$2:A139,MATCH(ROW(),Année2!$D$2:$D$100,0))))","v":""},{"$f":"IF(A42=\"\",\"\",IF(COUNTIF(Année1!$A$2:$A$100,$A42),VLOOKUP($A42,Année1!$A$2:$C$100,2,0),\"Non référencé\"))","v":""},{"$f":"IF(B42=\"\",\"\",IF(COUNTIF(Année1!$A$2:$A$100,$A42),VLOOKUP($A42,Année1!$A$2:$C$100,3,0),\"Non référencé\"))","v":""},{"$f":"IF($A42=\"\",\"\",IF(COUNTIF(Année2!$A$2:$A$100,$A42),VLOOKUP($A42,Année2!$A$2:$C$100,2,0),\"Non référencé\"))","v":""},{"$f":"IF($A42=\"\",\"\",IF(COUNTIF(Année2!$A$2:$A$100,$A42),VLOOKUP($A42,Année2!$A$2:$C$100,3,0),\"Non référencé\"))","v":""}]
[{"$f":"IF(COUNTIF(Année1!$A$2:$A$100,\"<>\")>COUNTA($A$2:A42),Année1!A42,IF(ROW()>MAX(Année2!$D$2:$D$100),\"\",INDEX(Année2!A$2:A140,MATCH(ROW(),Année2!$D$2:$D$100,0))))","v":""},{"$f":"IF(A43=\"\",\"\",IF(COUNTIF(Année1!$A$2:$A$100,$A43),VLOOKUP($A43,Année1!$A$2:$C$100,2,0),\"Non référencé\"))","v":""},{"$f":"IF(B43=\"\",\"\",IF(COUNTIF(Année1!$A$2:$A$100,$A43),VLOOKUP($A43,Année1!$A$2:$C$100,3,0),\"Non référencé\"))","v":""},{"$f":"IF($A43=\"\",\"\",IF(COUNTIF(Année2!$A$2:$A$100,$A43),VLOOKUP($A43,Année2!$A$2:$C$100,2,0),\"Non référencé\"))","v":""},{"$f":"IF($A43=\"\",\"\",IF(COUNTIF(Année2!$A$2:$A$100,$A43),VLOOKUP($A43,Année2!$A$2:$C$100,3,0),\"Non référencé\"))","v":""}]
[{"$f":"IF(COUNTIF(Année1!$A$2:$A$100,\"<>\")>COUNTA($A$2:A43),Année1!A43,IF(ROW()>MAX(Année2!$D$2:$D$100),\"\",INDEX(Année2!A$2:A141,MATCH(ROW(),Année2!$D$2:$D$100,0))))","v":""},{"$f":"IF(A44=\"\",\"\",IF(COUNTIF(Année1!$A$2:$A$100,$A44),VLOOKUP($A44,Année1!$A$2:$C$100,2,0),\"Non référencé\"))","v":""},{"$f":"IF(B44=\"\",\"\",IF(COUNTIF(Année1!$A$2:$A$100,$A44),VLOOKUP($A44,Année1!$A$2:$C$100,3,0),\"Non référencé\"))","v":""},{"$f":"IF($A44=\"\",\"\",IF(COUNTIF(Année2!$A$2:$A$100,$A44),VLOOKUP($A44,Année2!$A$2:$C$100,2,0),\"Non référencé\"))","v":""},{"$f":"IF($A44=\"\",\"\",IF(COUNTIF(Année2!$A$2:$A$100,$A44),VLOOKUP($A44,Année2!$A$2:$C$100,3,0),\"Non référencé\"))","v":""}]
[{"$f":"IF(COUNTIF(Année1!$A$2:$A$100,\"<>\")>COUNTA($A$2:A44),Année1!A44,IF(ROW()>MAX(Année2!$D$2:$D$100),\"\",INDEX(Année2!A$2:A142,MATCH(ROW(),Année2!$D$2:$D$100,0))))","v":""},{"$f":"IF(A45=\"\",\"\",IF(COUNTIF(Année1!$A$2:$A$100,$A45),VLOOKUP($A45,Année1!$A$2:$C$100,2,0),\"Non référencé\"))","v":""},{"$f":"IF(B45=\"\",\"\",IF(COUNTIF(Année1!$A$2:$A$100,$A45),VLOOKUP($A45,Année1!$A$2:$C$100,3,0),\"Non référencé\"))","v":""},{"$f":"IF($A45=\"\",\"\",IF(COUNTIF(Année2!$A$2:$A$100,$A45),VLOOKUP($A45,Année2!$A$2:$C$100,2,0),\"Non référencé\"))","v":""},{"$f":"IF($A45=\"\",\"\",IF(COUNTIF(Année2!$A$2:$A$100,$A45),VLOOKUP($A45,Année2!$A$2:$C$100,3,0),\"Non référencé\"))","v":""}]
[{"$f":"IF(COUNTIF(Année1!$A$2:$A$100,\"<>\")>COUNTA($A$2:A45),Année1!A45,IF(ROW()>MAX(Année2!$D$2:$D$100),\"\",INDEX(Année2!A$2:A143,MATCH(ROW(),Année2!$D$2:$D$100,0))))","v":""},{"$f":"IF(A46=\"\",\"\",IF(COUNTIF(Année1!$A$2:$A$100,$A46),VLOOKUP($A46,Année1!$A$2:$C$100,2,0),\"Non référencé\"))","v":""},{"$f":"IF(B46=\"\",\"\",IF(COUNTIF(Année1!$A$2:$A$100,$A46),VLOOKUP($A46,Année1!$A$2:$C$100,3,0),\"Non référencé\"))","v":""},{"$f":"IF($A46=\"\",\"\",IF(COUNTIF(Année2!$A$2:$A$100,$A46),VLOOKUP($A46,Année2!$A$2:$C$100,2,0),\"Non référencé\"))","v":""},{"$f":"IF($A46=\"\",\"\",IF(COUNTIF(Année2!$A$2:$A$100,$A46),VLOOKUP($A46,Année2!$A$2:$C$100,3,0),\"Non référencé\"))","v":""}]
[{"$f":"IF(COUNTIF(Année1!$A$2:$A$100,\"<>\")>COUNTA($A$2:A46),Année1!A46,IF(ROW()>MAX(Année2!$D$2:$D$100),\"\",INDEX(Année2!A$2:A144,MATCH(ROW(),Année2!$D$2:$D$100,0))))","v":""},{"$f":"IF(A47=\"\",\"\",IF(COUNTIF(Année1!$A$2:$A$100,$A47),VLOOKUP($A47,Année1!$A$2:$C$100,2,0),\"Non référencé\"))","v":""},{"$f":"IF(B47=\"\",\"\",IF(COUNTIF(Année1!$A$2:$A$100,$A47),VLOOKUP($A47,Année1!$A$2:$C$100,3,0),\"Non référencé\"))","v":""},{"$f":"IF($A47=\"\",\"\",IF(COUNTIF(Année2!$A$2:$A$100,$A47),VLOOKUP($A47,Année2!$A$2:$C$100,2,0),\"Non référencé\"))","v":""},{"$f":"IF($A47=\"\",\"\",IF(COUNTIF(Année2!$A$2:$A$100,$A47),VLOOKUP($A47,Année2!$A$2:$C$100,3,0),\"Non référencé\"))","v":""}]
[{"$f":"IF(COUNTIF(Année1!$A$2:$A$100,\"<>\")>COUNTA($A$2:A47),Année1!A47,IF(ROW()>MAX(Année2!$D$2:$D$100),\"\",INDEX(Année2!A$2:A145,MATCH(ROW(),Année2!$D$2:$D$100,0))))","v":""},{"$f":"IF(A48=\"\",\"\",IF(COUNTIF(Année1!$A$2:$A$100,$A48),VLOOKUP($A48,Année1!$A$2:$C$100,2,0),\"Non référencé\"))","v":""},{"$f":"IF(B48=\"\",\"\",IF(COUNTIF(Année1!$A$2:$A$100,$A48),VLOOKUP($A48,Année1!$A$2:$C$100,3,0),\"Non référencé\"))","v":""},{"$f":"IF($A48=\"\",\"\",IF(COUNTIF(Année2!$A$2:$A$100,$A48),VLOOKUP($A48,Année2!$A$2:$C$100,2,0),\"Non référencé\"))","v":""},{"$f":"IF($A48=\"\",\"\",IF(COUNTIF(Année2!$A$2:$A$100,$A48),VLOOKUP($A48,Année2!$A$2:$C$100,3,0),\"Non référencé\"))","v":""}]
[{"$f":"IF(COUNTIF(Année1!$A$2:$A$100,\"<>\")>COUNTA($A$2:A48),Année1!A48,IF(ROW()>MAX(Année2!$D$2:$D$100),\"\",INDEX(Année2!A$2:A146,MATCH(ROW(),Année2!$D$2:$D$100,0))))","v":""},{"$f":"IF(A49=\"\",\"\",IF(COUNTIF(Année1!$A$2:$A$100,$A49),VLOOKUP($A49,Année1!$A$2:$C$100,2,0),\"Non référencé\"))","v":""},{"$f":"IF(B49=\"\",\"\",IF(COUNTIF(Année1!$A$2:$A$100,$A49),VLOOKUP($A49,Année1!$A$2:$C$100,3,0),\"Non référencé\"))","v":""},{"$f":"IF($A49=\"\",\"\",IF(COUNTIF(Année2!$A$2:$A$100,$A49),VLOOKUP($A49,Année2!$A$2:$C$100,2,0),\"Non référencé\"))","v":""},{"$f":"IF($A49=\"\",\"\",IF(COUNTIF(Année2!$A$2:$A$100,$A49),VLOOKUP($A49,Année2!$A$2:$C$100,3,0),\"Non référencé\"))","v":""}]
[{"$f":"IF(COUNTIF(Année1!$A$2:$A$100,\"<>\")>COUNTA($A$2:A49),Année1!A49,IF(ROW()>MAX(Année2!$D$2:$D$100),\"\",INDEX(Année2!A$2:A147,MATCH(ROW(),Année2!$D$2:$D$100,0))))","v":""},{"$f":"IF(A50=\"\",\"\",IF(COUNTIF(Année1!$A$2:$A$100,$A50),VLOOKUP($A50,Année1!$A$2:$C$100,2,0),\"Non référencé\"))","v":""},{"$f":"IF(B50=\"\",\"\",IF(COUNTIF(Année1!$A$2:$A$100,$A50),VLOOKUP($A50,Année1!$A$2:$C$100,3,0),\"Non référencé\"))","v":""},{"$f":"IF($A50=\"\",\"\",IF(COUNTIF(Année2!$A$2:$A$100,$A50),VLOOKUP($A50,Année2!$A$2:$C$100,2,0),\"Non référencé\"))","v":""},{"$f":"IF($A50=\"\",\"\",IF(COUNTIF(Année2!$A$2:$A$100,$A50),VLOOKUP($A50,Année2!$A$2:$C$100,3,0),\"Non référencé\"))","v":""}]
[{"$f":"IF(COUNTIF(Année1!$A$2:$A$100,\"<>\")>COUNTA($A$2:A50),Année1!A50,IF(ROW()>MAX(Année2!$D$2:$D$100),\"\",INDEX(Année2!A$2:A148,MATCH(ROW(),Année2!$D$2:$D$100,0))))","v":""},{"$f":"IF(A51=\"\",\"\",IF(COUNTIF(Année1!$A$2:$A$100,$A51),VLOOKUP($A51,Année1!$A$2:$C$100,2,0),\"Non référencé\"))","v":""},{"$f":"IF(B51=\"\",\"\",IF(COUNTIF(Année1!$A$2:$A$100,$A51),VLOOKUP($A51,Année1!$A$2:$C$100,3,0),\"Non référencé\"))","v":""},{"$f":"IF($A51=\"\",\"\",IF(COUNTIF(Année2!$A$2:$A$100,$A51),VLOOKUP($A51,Année2!$A$2:$C$100,2,0),\"Non référencé\"))","v":""},{"$f":"IF($A51=\"\",\"\",IF(COUNTIF(Année2!$A$2:$A$100,$A51),VLOOKUP($A51,Année2!$A$2:$C$100,3,0),\"Non référencé\"))","v":""}]
[{"$f":"IF(COUNTIF(Année1!$A$2:$A$100,\"<>\")>COUNTA($A$2:A51),Année1!A51,IF(ROW()>MAX(Année2!$D$2:$D$100),\"\",INDEX(Année2!A$2:A149,MATCH(ROW(),Année2!$D$2:$D$100,0))))","v":""},{"$f":"IF(A52=\"\",\"\",IF(COUNTIF(Année1!$A$2:$A$100,$A52),VLOOKUP($A52,Année1!$A$2:$C$100,2,0),\"Non référencé\"))","v":""},{"$f":"IF(B52=\"\",\"\",IF(COUNTIF(Année1!$A$2:$A$100,$A52),VLOOKUP($A52,Année1!$A$2:$C$100,3,0),\"Non référencé\"))","v":""},{"$f":"IF($A52=\"\",\"\",IF(COUNTIF(Année2!$A$2:$A$100,$A52),VLOOKUP($A52,Année2!$A$2:$C$100,2,0),\"Non référencé\"))","v":""},{"$f":"IF($A52=\"\",\"\",IF(COUNTIF(Année2!$A$2:$A$100,$A52),VLOOKUP($A52,Année2!$A$2:$C$100,3,0),\"Non référencé\"))","v":""}]
[{"$f":"IF(COUNTIF(Année1!$A$2:$A$100,\"<>\")>COUNTA($A$2:A52),Année1!A52,IF(ROW()>MAX(Année2!$D$2:$D$100),\"\",INDEX(Année2!A$2:A150,MATCH(ROW(),Année2!$D$2:$D$100,0))))","v":""},{"$f":"IF(A53=\"\",\"\",IF(COUNTIF(Année1!$A$2:$A$100,$A53),VLOOKUP($A53,Année1!$A$2:$C$100,2,0),\"Non référencé\"))","v":""},{"$f":"IF(B53=\"\",\"\",IF(COUNTIF(Année1!$A$2:$A$100,$A53),VLOOKUP($A53,Année1!$A$2:$C$100,3,0),\"Non référencé\"))","v":""},{"$f":"IF($A53=\"\",\"\",IF(COUNTIF(Année2!$A$2:$A$100,$A53),VLOOKUP($A53,Année2!$A$2:$C$100,2,0),\"Non référencé\"))","v":""},{"$f":"IF($A53=\"\",\"\",IF(COUNTIF(Année2!$A$2:$A$100,$A53),VLOOKUP($A53,Année2!$A$2:$C$100,3,0),\"Non référencé\"))","v":""}]
[{"$f":"IF(COUNTIF(Année1!$A$2:$A$100,\"<>\")>COUNTA($A$2:A53),Année1!A53,IF(ROW()>MAX(Année2!$D$2:$D$100),\"\",INDEX(Année2!A$2:A151,MATCH(ROW(),Année2!$D$2:$D$100,0))))","v":""},{"$f":"IF(A54=\"\",\"\",IF(COUNTIF(Année1!$A$2:$A$100,$A54),VLOOKUP($A54,Année1!$A$2:$C$100,2,0),\"Non référencé\"))","v":""},{"$f":"IF(B54=\"\",\"\",IF(COUNTIF(Année1!$A$2:$A$100,$A54),VLOOKUP($A54,Année1!$A$2:$C$100,3,0),\"Non référencé\"))","v":""},{"$f":"IF($A54=\"\",\"\",IF(COUNTIF(Année2!$A$2:$A$100,$A54),VLOOKUP($A54,Année2!$A$2:$C$100,2,0),\"Non référencé\"))","v":""},{"$f":"IF($A54=\"\",\"\",IF(COUNTIF(Année2!$A$2:$A$100,$A54),VLOOKUP($A54,Année2!$A$2:$C$100,3,0),\"Non référencé\"))","v":""}]
[{"$f":"IF(COUNTIF(Année1!$A$2:$A$100,\"<>\")>COUNTA($A$2:A54),Année1!A54,IF(ROW()>MAX(Année2!$D$2:$D$100),\"\",INDEX(Année2!A$2:A152,MATCH(ROW(),Année2!$D$2:$D$100,0))))","v":""},{"$f":"IF(A55=\"\",\"\",IF(COUNTIF(Année1!$A$2:$A$100,$A55),VLOOKUP($A55,Année1!$A$2:$C$100,2,0),\"Non référencé\"))","v":""},{"$f":"IF(B55=\"\",\"\",IF(COUNTIF(Année1!$A$2:$A$100,$A55),VLOOKUP($A55,Année1!$A$2:$C$100,3,0),\"Non référencé\"))","v":""},{"$f":"IF($A55=\"\",\"\",IF(COUNTIF(Année2!$A$2:$A$100,$A55),VLOOKUP($A55,Année2!$A$2:$C$100,2,0),\"Non référencé\"))","v":""},{"$f":"IF($A55=\"\",\"\",IF(COUNTIF(Année2!$A$2:$A$100,$A55),VLOOKUP($A55,Année2!$A$2:$C$100,3,0),\"Non référencé\"))","v":""}]
[{"$f":"IF(COUNTIF(Année1!$A$2:$A$100,\"<>\")>COUNTA($A$2:A55),Année1!A55,IF(ROW()>MAX(Année2!$D$2:$D$100),\"\",INDEX(Année2!A$2:A153,MATCH(ROW(),Année2!$D$2:$D$100,0))))","v":""},{"$f":"IF(A56=\"\",\"\",IF(COUNTIF(Année1!$A$2:$A$100,$A56),VLOOKUP($A56,Année1!$A$2:$C$100,2,0),\"Non référencé\"))","v":""},{"$f":"IF(B56=\"\",\"\",IF(COUNTIF(Année1!$A$2:$A$100,$A56),VLOOKUP($A56,Année1!$A$2:$C$100,3,0),\"Non référencé\"))","v":""},{"$f":"IF($A56=\"\",\"\",IF(COUNTIF(Année2!$A$2:$A$100,$A56),VLOOKUP($A56,Année2!$A$2:$C$100,2,0),\"Non référencé\"))","v":""},{"$f":"IF($A56=\"\",\"\",IF(COUNTIF(Année2!$A$2:$A$100,$A56),VLOOKUP($A56,Année2!$A$2:$C$100,3,0),\"Non référencé\"))","v":""}]
[{"$f":"IF(COUNTIF(Année1!$A$2:$A$100,\"<>\")>COUNTA($A$2:A56),Année1!A56,IF(ROW()>MAX(Année2!$D$2:$D$100),\"\",INDEX(Année2!A$2:A154,MATCH(ROW(),Année2!$D$2:$D$100,0))))","v":""},{"$f":"IF(A57=\"\",\"\",IF(COUNTIF(Année1!$A$2:$A$100,$A57),VLOOKUP($A57,Année1!$A$2:$C$100,2,0),\"Non référencé\"))","v":""},{"$f":"IF(B57=\"\",\"\",IF(COUNTIF(Année1!$A$2:$A$100,$A57),VLOOKUP($A57,Année1!$A$2:$C$100,3,0),\"Non référencé\"))","v":""},{"$f":"IF($A57=\"\",\"\",IF(COUNTIF(Année2!$A$2:$A$100,$A57),VLOOKUP($A57,Année2!$A$2:$C$100,2,0),\"Non référencé\"))","v":""},{"$f":"IF($A57=\"\",\"\",IF(COUNTIF(Année2!$A$2:$A$100,$A57),VLOOKUP($A57,Année2!$A$2:$C$100,3,0),\"Non référencé\"))","v":""}]
[{"$f":"IF(COUNTIF(Année1!$A$2:$A$100,\"<>\")>COUNTA($A$2:A57),Année1!A57,IF(ROW()>MAX(Année2!$D$2:$D$100),\"\",INDEX(Année2!A$2:A155,MATCH(ROW(),Année2!$D$2:$D$100,0))))","v":""},{"$f":"IF(A58=\"\",\"\",IF(COUNTIF(Année1!$A$2:$A$100,$A58),VLOOKUP($A58,Année1!$A$2:$C$100,2,0),\"Non référencé\"))","v":""},{"$f":"IF(B58=\"\",\"\",IF(COUNTIF(Année1!$A$2:$A$100,$A58),VLOOKUP($A58,Année1!$A$2:$C$100,3,0),\"Non référencé\"))","v":""},{"$f":"IF($A58=\"\",\"\",IF(COUNTIF(Année2!$A$2:$A$100,$A58),VLOOKUP($A58,Année2!$A$2:$C$100,2,0),\"Non référencé\"))","v":""},{"$f":"IF($A58=\"\",\"\",IF(COUNTIF(Année2!$A$2:$A$100,$A58),VLOOKUP($A58,Année2!$A$2:$C$100,3,0),\"Non référencé\"))","v":""}]
[{"$f":"IF(COUNTIF(Année1!$A$2:$A$100,\"<>\")>COUNTA($A$2:A58),Année1!A58,IF(ROW()>MAX(Année2!$D$2:$D$100),\"\",INDEX(Année2!A$2:A156,MATCH(ROW(),Année2!$D$2:$D$100,0))))","v":""},{"$f":"IF(A59=\"\",\"\",IF(COUNTIF(Année1!$A$2:$A$100,$A59),VLOOKUP($A59,Année1!$A$2:$C$100,2,0),\"Non référencé\"))","v":""},{"$f":"IF(B59=\"\",\"\",IF(COUNTIF(Année1!$A$2:$A$100,$A59),VLOOKUP($A59,Année1!$A$2:$C$100,3,0),\"Non référencé\"))","v":""},{"$f":"IF($A59=\"\",\"\",IF(COUNTIF(Année2!$A$2:$A$100,$A59),VLOOKUP($A59,Année2!$A$2:$C$100,2,0),\"Non référencé\"))","v":""},{"$f":"IF($A59=\"\",\"\",IF(COUNTIF(Année2!$A$2:$A$100,$A59),VLOOKUP($A59,Année2!$A$2:$C$100,3,0),\"Non référencé\"))","v":""}]
[{"$f":"IF(COUNTIF(Année1!$A$2:$A$100,\"<>\")>COUNTA($A$2:A59),Année1!A59,IF(ROW()>MAX(Année2!$D$2:$D$100),\"\",INDEX(Année2!A$2:A157,MATCH(ROW(),Année2!$D$2:$D$100,0))))","v":""},{"$f":"IF(A60=\"\",\"\",IF(COUNTIF(Année1!$A$2:$A$100,$A60),VLOOKUP($A60,Année1!$A$2:$C$100,2,0),\"Non référencé\"))","v":""},{"$f":"IF(B60=\"\",\"\",IF(COUNTIF(Année1!$A$2:$A$100,$A60),VLOOKUP($A60,Année1!$A$2:$C$100,3,0),\"Non référencé\"))","v":""},{"$f":"IF($A60=\"\",\"\",IF(COUNTIF(Année2!$A$2:$A$100,$A60),VLOOKUP($A60,Année2!$A$2:$C$100,2,0),\"Non référencé\"))","v":""},{"$f":"IF($A60=\"\",\"\",IF(COUNTIF(Année2!$A$2:$A$100,$A60),VLOOKUP($A60,Année2!$A$2:$C$100,3,0),\"Non référencé\"))","v":""}]
[{"$f":"IF(COUNTIF(Année1!$A$2:$A$100,\"<>\")>COUNTA($A$2:A60),Année1!A60,IF(ROW()>MAX(Année2!$D$2:$D$100),\"\",INDEX(Année2!A$2:A158,MATCH(ROW(),Année2!$D$2:$D$100,0))))","v":""},{"$f":"IF(A61=\"\",\"\",IF(COUNTIF(Année1!$A$2:$A$100,$A61),VLOOKUP($A61,Année1!$A$2:$C$100,2,0),\"Non référencé\"))","v":""},{"$f":"IF(B61=\"\",\"\",IF(COUNTIF(Année1!$A$2:$A$100,$A61),VLOOKUP($A61,Année1!$A$2:$C$100,3,0),\"Non référencé\"))","v":""},{"$f":"IF($A61=\"\",\"\",IF(COUNTIF(Année2!$A$2:$A$100,$A61),VLOOKUP($A61,Année2!$A$2:$C$100,2,0),\"Non référencé\"))","v":""},{"$f":"IF($A61=\"\",\"\",IF(COUNTIF(Année2!$A$2:$A$100,$A61),VLOOKUP($A61,Année2!$A$2:$C$100,3,0),\"Non référencé\"))","v":""}]
[{"$f":"IF(COUNTIF(Année1!$A$2:$A$100,\"<>\")>COUNTA($A$2:A61),Année1!A61,IF(ROW()>MAX(Année2!$D$2:$D$100),\"\",INDEX(Année2!A$2:A159,MATCH(ROW(),Année2!$D$2:$D$100,0))))","v":""},{"$f":"IF(A62=\"\",\"\",IF(COUNTIF(Année1!$A$2:$A$100,$A62),VLOOKUP($A62,Année1!$A$2:$C$100,2,0),\"Non référencé\"))","v":""},{"$f":"IF(B62=\"\",\"\",IF(COUNTIF(Année1!$A$2:$A$100,$A62),VLOOKUP($A62,Année1!$A$2:$C$100,3,0),\"Non référencé\"))","v":""},{"$f":"IF($A62=\"\",\"\",IF(COUNTIF(Année2!$A$2:$A$100,$A62),VLOOKUP($A62,Année2!$A$2:$C$100,2,0),\"Non référencé\"))","v":""},{"$f":"IF($A62=\"\",\"\",IF(COUNTIF(Année2!$A$2:$A$100,$A62),VLOOKUP($A62,Année2!$A$2:$C$100,3,0),\"Non référencé\"))","v":""}]
[{"$f":"IF(COUNTIF(Année1!$A$2:$A$100,\"<>\")>COUNTA($A$2:A62),Année1!A62,IF(ROW()>MAX(Année2!$D$2:$D$100),\"\",INDEX(Année2!A$2:A160,MATCH(ROW(),Année2!$D$2:$D$100,0))))","v":""},{"$f":"IF(A63=\"\",\"\",IF(COUNTIF(Année1!$A$2:$A$100,$A63),VLOOKUP($A63,Année1!$A$2:$C$100,2,0),\"Non référencé\"))","v":""},{"$f":"IF(B63=\"\",\"\",IF(COUNTIF(Année1!$A$2:$A$100,$A63),VLOOKUP($A63,Année1!$A$2:$C$100,3,0),\"Non référencé\"))","v":""},{"$f":"IF($A63=\"\",\"\",IF(COUNTIF(Année2!$A$2:$A$100,$A63),VLOOKUP($A63,Année2!$A$2:$C$100,2,0),\"Non référencé\"))","v":""},{"$f":"IF($A63=\"\",\"\",IF(COUNTIF(Année2!$A$2:$A$100,$A63),VLOOKUP($A63,Année2!$A$2:$C$100,3,0),\"Non référencé\"))","v":""}]
[{"$f":"IF(COUNTIF(Année1!$A$2:$A$100,\"<>\")>COUNTA($A$2:A63),Année1!A63,IF(ROW()>MAX(Année2!$D$2:$D$100),\"\",INDEX(Année2!A$2:A161,MATCH(ROW(),Année2!$D$2:$D$100,0))))","v":""},{"$f":"IF(A64=\"\",\"\",IF(COUNTIF(Année1!$A$2:$A$100,$A64),VLOOKUP($A64,Année1!$A$2:$C$100,2,0),\"Non référencé\"))","v":""},{"$f":"IF(B64=\"\",\"\",IF(COUNTIF(Année1!$A$2:$A$100,$A64),VLOOKUP($A64,Année1!$A$2:$C$100,3,0),\"Non référencé\"))","v":""},{"$f":"IF($A64=\"\",\"\",IF(COUNTIF(Année2!$A$2:$A$100,$A64),VLOOKUP($A64,Année2!$A$2:$C$100,2,0),\"Non référencé\"))","v":""},{"$f":"IF($A64=\"\",\"\",IF(COUNTIF(Année2!$A$2:$A$100,$A64),VLOOKUP($A64,Année2!$A$2:$C$100,3,0),\"Non référencé\"))","v":""}]
[{"$f":"IF(COUNTIF(Année1!$A$2:$A$100,\"<>\")>COUNTA($A$2:A64),Année1!A64,IF(ROW()>MAX(Année2!$D$2:$D$100),\"\",INDEX(Année2!A$2:A162,MATCH(ROW(),Année2!$D$2:$D$100,0))))","v":""},{"$f":"IF(A65=\"\",\"\",IF(COUNTIF(Année1!$A$2:$A$100,$A65),VLOOKUP($A65,Année1!$A$2:$C$100,2,0),\"Non référencé\"))","v":""},{"$f":"IF(B65=\"\",\"\",IF(COUNTIF(Année1!$A$2:$A$100,$A65),VLOOKUP($A65,Année1!$A$2:$C$100,3,0),\"Non référencé\"))","v":""},{"$f":"IF($A65=\"\",\"\",IF(COUNTIF(Année2!$A$2:$A$100,$A65),VLOOKUP($A65,Année2!$A$2:$C$100,2,0),\"Non référencé\"))","v":""},{"$f":"IF($A65=\"\",\"\",IF(COUNTIF(Année2!$A$2:$A$100,$A65),VLOOKUP($A65,Année2!$A$2:$C$100,3,0),\"Non référencé\"))","v":""}]
[{"$f":"IF(COUNTIF(Année1!$A$2:$A$100,\"<>\")>COUNTA($A$2:A65),Année1!A65,IF(ROW()>MAX(Année2!$D$2:$D$100),\"\",INDEX(Année2!A$2:A163,MATCH(ROW(),Année2!$D$2:$D$100,0))))","v":""},{"$f":"IF(A66=\"\",\"\",IF(COUNTIF(Année1!$A$2:$A$100,$A66),VLOOKUP($A66,Année1!$A$2:$C$100,2,0),\"Non référencé\"))","v":""},{"$f":"IF(B66=\"\",\"\",IF(COUNTIF(Année1!$A$2:$A$100,$A66),VLOOKUP($A66,Année1!$A$2:$C$100,3,0),\"Non référencé\"))","v":""},{"$f":"IF($A66=\"\",\"\",IF(COUNTIF(Année2!$A$2:$A$100,$A66),VLOOKUP($A66,Année2!$A$2:$C$100,2,0),\"Non référencé\"))","v":""},{"$f":"IF($A66=\"\",\"\",IF(COUNTIF(Année2!$A$2:$A$100,$A66),VLOOKUP($A66,Année2!$A$2:$C$100,3,0),\"Non référencé\"))","v":""}]
[{"$f":"IF(COUNTIF(Année1!$A$2:$A$100,\"<>\")>COUNTA($A$2:A66),Année1!A66,IF(ROW()>MAX(Année2!$D$2:$D$100),\"\",INDEX(Année2!A$2:A164,MATCH(ROW(),Année2!$D$2:$D$100,0))))","v":""},{"$f":"IF(A67=\"\",\"\",IF(COUNTIF(Année1!$A$2:$A$100,$A67),VLOOKUP($A67,Année1!$A$2:$C$100,2,0),\"Non référencé\"))","v":""},{"$f":"IF(B67=\"\",\"\",IF(COUNTIF(Année1!$A$2:$A$100,$A67),VLOOKUP($A67,Année1!$A$2:$C$100,3,0),\"Non référencé\"))","v":""},{"$f":"IF($A67=\"\",\"\",IF(COUNTIF(Année2!$A$2:$A$100,$A67),VLOOKUP($A67,Année2!$A$2:$C$100,2,0),\"Non référencé\"))","v":""},{"$f":"IF($A67=\"\",\"\",IF(COUNTIF(Année2!$A$2:$A$100,$A67),VLOOKUP($A67,Année2!$A$2:$C$100,3,0),\"Non référencé\"))","v":""}]
[{"$f":"IF(COUNTIF(Année1!$A$2:$A$100,\"<>\")>COUNTA($A$2:A67),Année1!A67,IF(ROW()>MAX(Année2!$D$2:$D$100),\"\",INDEX(Année2!A$2:A165,MATCH(ROW(),Année2!$D$2:$D$100,0))))","v":""},{"$f":"IF(A68=\"\",\"\",IF(COUNTIF(Année1!$A$2:$A$100,$A68),VLOOKUP($A68,Année1!$A$2:$C$100,2,0),\"Non référencé\"))","v":""},{"$f":"IF(B68=\"\",\"\",IF(COUNTIF(Année1!$A$2:$A$100,$A68),VLOOKUP($A68,Année1!$A$2:$C$100,3,0),\"Non référencé\"))","v":""},{"$f":"IF($A68=\"\",\"\",IF(COUNTIF(Année2!$A$2:$A$100,$A68),VLOOKUP($A68,Année2!$A$2:$C$100,2,0),\"Non référencé\"))","v":""},{"$f":"IF($A68=\"\",\"\",IF(COUNTIF(Année2!$A$2:$A$100,$A68),VLOOKUP($A68,Année2!$A$2:$C$100,3,0),\"Non référencé\"))","v":""}]
[{"$f":"IF(COUNTIF(Année1!$A$2:$A$100,\"<>\")>COUNTA($A$2:A68),Année1!A68,IF(ROW()>MAX(Année2!$D$2:$D$100),\"\",INDEX(Année2!A$2:A166,MATCH(ROW(),Année2!$D$2:$D$100,0))))","v":""},{"$f":"IF(A69=\"\",\"\",IF(COUNTIF(Année1!$A$2:$A$100,$A69),VLOOKUP($A69,Année1!$A$2:$C$100,2,0),\"Non référencé\"))","v":""},{"$f":"IF(B69=\"\",\"\",IF(COUNTIF(Année1!$A$2:$A$100,$A69),VLOOKUP($A69,Année1!$A$2:$C$100,3,0),\"Non référencé\"))","v":""},{"$f":"IF($A69=\"\",\"\",IF(COUNTIF(Année2!$A$2:$A$100,$A69),VLOOKUP($A69,Année2!$A$2:$C$100,2,0),\"Non référencé\"))","v":""},{"$f":"IF($A69=\"\",\"\",IF(COUNTIF(Année2!$A$2:$A$100,$A69),VLOOKUP($A69,Année2!$A$2:$C$100,3,0),\"Non référencé\"))","v":""}]
[{"$f":"IF(COUNTIF(Année1!$A$2:$A$100,\"<>\")>COUNTA($A$2:A69),Année1!A69,IF(ROW()>MAX(Année2!$D$2:$D$100),\"\",INDEX(Année2!A$2:A167,MATCH(ROW(),Année2!$D$2:$D$100,0))))","v":""},{"$f":"IF(A70=\"\",\"\",IF(COUNTIF(Année1!$A$2:$A$100,$A70),VLOOKUP($A70,Année1!$A$2:$C$100,2,0),\"Non référencé\"))","v":""},{"$f":"IF(B70=\"\",\"\",IF(COUNTIF(Année1!$A$2:$A$100,$A70),VLOOKUP($A70,Année1!$A$2:$C$100,3,0),\"Non référencé\"))","v":""},{"$f":"IF($A70=\"\",\"\",IF(COUNTIF(Année2!$A$2:$A$100,$A70),VLOOKUP($A70,Année2!$A$2:$C$100,2,0),\"Non référencé\"))","v":""},{"$f":"IF($A70=\"\",\"\",IF(COUNTIF(Année2!$A$2:$A$100,$A70),VLOOKUP($A70,Année2!$A$2:$C$100,3,0),\"Non référencé\"))","v":""}]
[{"$f":"IF(COUNTIF(Année1!$A$2:$A$100,\"<>\")>COUNTA($A$2:A70),Année1!A70,IF(ROW()>MAX(Année2!$D$2:$D$100),\"\",INDEX(Année2!A$2:A168,MATCH(ROW(),Année2!$D$2:$D$100,0))))","v":""},{"$f":"IF(A71=\"\",\"\",IF(COUNTIF(Année1!$A$2:$A$100,$A71),VLOOKUP($A71,Année1!$A$2:$C$100,2,0),\"Non référencé\"))","v":""},{"$f":"IF(B71=\"\",\"\",IF(COUNTIF(Année1!$A$2:$A$100,$A71),VLOOKUP($A71,Année1!$A$2:$C$100,3,0),\"Non référencé\"))","v":""},{"$f":"IF($A71=\"\",\"\",IF(COUNTIF(Année2!$A$2:$A$100,$A71),VLOOKUP($A71,Année2!$A$2:$C$100,2,0),\"Non référencé\"))","v":""},{"$f":"IF($A71=\"\",\"\",IF(COUNTIF(Année2!$A$2:$A$100,$A71),VLOOKUP($A71,Année2!$A$2:$C$100,3,0),\"Non référencé\"))","v":""}]
[{"$f":"IF(COUNTIF(Année1!$A$2:$A$100,\"<>\")>COUNTA($A$2:A71),Année1!A71,IF(ROW()>MAX(Année2!$D$2:$D$100),\"\",INDEX(Année2!A$2:A169,MATCH(ROW(),Année2!$D$2:$D$100,0))))","v":""},{"$f":"IF(A72=\"\",\"\",IF(COUNTIF(Année1!$A$2:$A$100,$A72),VLOOKUP($A72,Année1!$A$2:$C$100,2,0),\"Non référencé\"))","v":""},{"$f":"IF(B72=\"\",\"\",IF(COUNTIF(Année1!$A$2:$A$100,$A72),VLOOKUP($A72,Année1!$A$2:$C$100,3,0),\"Non référencé\"))","v":""},{"$f":"IF($A72=\"\",\"\",IF(COUNTIF(Année2!$A$2:$A$100,$A72),VLOOKUP($A72,Année2!$A$2:$C$100,2,0),\"Non référencé\"))","v":""},{"$f":"IF($A72=\"\",\"\",IF(COUNTIF(Année2!$A$2:$A$100,$A72),VLOOKUP($A72,Année2!$A$2:$C$100,3,0),\"Non référencé\"))","v":""}]
[{"$f":"IF(COUNTIF(Année1!$A$2:$A$100,\"<>\")>COUNTA($A$2:A72),Année1!A72,IF(ROW()>MAX(Année2!$D$2:$D$100),\"\",INDEX(Année2!A$2:A170,MATCH(ROW(),Année2!$D$2:$D$100,0))))","v":""},{"$f":"IF(A73=\"\",\"\",IF(COUNTIF(Année1!$A$2:$A$100,$A73),VLOOKUP($A73,Année1!$A$2:$C$100,2,0),\"Non référencé\"))","v":""},{"$f":"IF(B73=\"\",\"\",IF(COUNTIF(Année1!$A$2:$A$100,$A73),VLOOKUP($A73,Année1!$A$2:$C$100,3,0),\"Non référencé\"))","v":""},{"$f":"IF($A73=\"\",\"\",IF(COUNTIF(Année2!$A$2:$A$100,$A73),VLOOKUP($A73,Année2!$A$2:$C$100,2,0),\"Non référencé\"))","v":""},{"$f":"IF($A73=\"\",\"\",IF(COUNTIF(Année2!$A$2:$A$100,$A73),VLOOKUP($A73,Année2!$A$2:$C$100,3,0),\"Non référencé\"))","v":""}]
[{"$f":"IF(COUNTIF(Année1!$A$2:$A$100,\"<>\")>COUNTA($A$2:A73),Année1!A73,IF(ROW()>MAX(Année2!$D$2:$D$100),\"\",INDEX(Année2!A$2:A171,MATCH(ROW(),Année2!$D$2:$D$100,0))))","v":""},{"$f":"IF(A74=\"\",\"\",IF(COUNTIF(Année1!$A$2:$A$100,$A74),VLOOKUP($A74,Année1!$A$2:$C$100,2,0),\"Non référencé\"))","v":""},{"$f":"IF(B74=\"\",\"\",IF(COUNTIF(Année1!$A$2:$A$100,$A74),VLOOKUP($A74,Année1!$A$2:$C$100,3,0),\"Non référencé\"))","v":""},{"$f":"IF($A74=\"\",\"\",IF(COUNTIF(Année2!$A$2:$A$100,$A74),VLOOKUP($A74,Année2!$A$2:$C$100,2,0),\"Non référencé\"))","v":""},{"$f":"IF($A74=\"\",\"\",IF(COUNTIF(Année2!$A$2:$A$100,$A74),VLOOKUP($A74,Année2!$A$2:$C$100,3,0),\"Non référencé\"))","v":""}]
[{"$f":"IF(COUNTIF(Année1!$A$2:$A$100,\"<>\")>COUNTA($A$2:A74),Année1!A74,IF(ROW()>MAX(Année2!$D$2:$D$100),\"\",INDEX(Année2!A$2:A172,MATCH(ROW(),Année2!$D$2:$D$100,0))))","v":""},{"$f":"IF(A75=\"\",\"\",IF(COUNTIF(Année1!$A$2:$A$100,$A75),VLOOKUP($A75,Année1!$A$2:$C$100,2,0),\"Non référencé\"))","v":""},{"$f":"IF(B75=\"\",\"\",IF(COUNTIF(Année1!$A$2:$A$100,$A75),VLOOKUP($A75,Année1!$A$2:$C$100,3,0),\"Non référencé\"))","v":""},{"$f":"IF($A75=\"\",\"\",IF(COUNTIF(Année2!$A$2:$A$100,$A75),VLOOKUP($A75,Année2!$A$2:$C$100,2,0),\"Non référencé\"))","v":""},{"$f":"IF($A75=\"\",\"\",IF(COUNTIF(Année2!$A$2:$A$100,$A75),VLOOKUP($A75,Année2!$A$2:$C$100,3,0),\"Non référencé\"))","v":""}]
[{"$f":"IF(COUNTIF(Année1!$A$2:$A$100,\"<>\")>COUNTA($A$2:A75),Année1!A75,IF(ROW()>MAX(Année2!$D$2:$D$100),\"\",INDEX(Année2!A$2:A173,MATCH(ROW(),Année2!$D$2:$D$100,0))))","v":""},{"$f":"IF(A76=\"\",\"\",IF(COUNTIF(Année1!$A$2:$A$100,$A76),VLOOKUP($A76,Année1!$A$2:$C$100,2,0),\"Non référencé\"))","v":""},{"$f":"IF(B76=\"\",\"\",IF(COUNTIF(Année1!$A$2:$A$100,$A76),VLOOKUP($A76,Année1!$A$2:$C$100,3,0),\"Non référencé\"))","v":""},{"$f":"IF($A76=\"\",\"\",IF(COUNTIF(Année2!$A$2:$A$100,$A76),VLOOKUP($A76,Année2!$A$2:$C$100,2,0),\"Non référencé\"))","v":""},{"$f":"IF($A76=\"\",\"\",IF(COUNTIF(Année2!$A$2:$A$100,$A76),VLOOKUP($A76,Année2!$A$2:$C$100,3,0),\"Non référencé\"))","v":""}]
[{"$f":"IF(COUNTIF(Année1!$A$2:$A$100,\"<>\")>COUNTA($A$2:A76),Année1!A76,IF(ROW()>MAX(Année2!$D$2:$D$100),\"\",INDEX(Année2!A$2:A174,MATCH(ROW(),Année2!$D$2:$D$100,0))))","v":""},{"$f":"IF(A77=\"\",\"\",IF(COUNTIF(Année1!$A$2:$A$100,$A77),VLOOKUP($A77,Année1!$A$2:$C$100,2,0),\"Non référencé\"))","v":""},{"$f":"IF(B77=\"\",\"\",IF(COUNTIF(Année1!$A$2:$A$100,$A77),VLOOKUP($A77,Année1!$A$2:$C$100,3,0),\"Non référencé\"))","v":""},{"$f":"IF($A77=\"\",\"\",IF(COUNTIF(Année2!$A$2:$A$100,$A77),VLOOKUP($A77,Année2!$A$2:$C$100,2,0),\"Non référencé\"))","v":""},{"$f":"IF($A77=\"\",\"\",IF(COUNTIF(Année2!$A$2:$A$100,$A77),VLOOKUP($A77,Année2!$A$2:$C$100,3,0),\"Non référencé\"))","v":""}]
[{"$f":"IF(COUNTIF(Année1!$A$2:$A$100,\"<>\")>COUNTA($A$2:A77),Année1!A77,IF(ROW()>MAX(Année2!$D$2:$D$100),\"\",INDEX(Année2!A$2:A175,MATCH(ROW(),Année2!$D$2:$D$100,0))))","v":""},{"$f":"IF(A78=\"\",\"\",IF(COUNTIF(Année1!$A$2:$A$100,$A78),VLOOKUP($A78,Année1!$A$2:$C$100,2,0),\"Non référencé\"))","v":""},{"$f":"IF(B78=\"\",\"\",IF(COUNTIF(Année1!$A$2:$A$100,$A78),VLOOKUP($A78,Année1!$A$2:$C$100,3,0),\"Non référencé\"))","v":""},{"$f":"IF($A78=\"\",\"\",IF(COUNTIF(Année2!$A$2:$A$100,$A78),VLOOKUP($A78,Année2!$A$2:$C$100,2,0),\"Non référencé\"))","v":""},{"$f":"IF($A78=\"\",\"\",IF(COUNTIF(Année2!$A$2:$A$100,$A78),VLOOKUP($A78,Année2!$A$2:$C$100,3,0),\"Non référencé\"))","v":""}]
[{"$f":"IF(COUNTIF(Année1!$A$2:$A$100,\"<>\")>COUNTA($A$2:A78),Année1!A78,IF(ROW()>MAX(Année2!$D$2:$D$100),\"\",INDEX(Année2!A$2:A176,MATCH(ROW(),Année2!$D$2:$D$100,0))))","v":""},{"$f":"IF(A79=\"\",\"\",IF(COUNTIF(Année1!$A$2:$A$100,$A79),VLOOKUP($A79,Année1!$A$2:$C$100,2,0),\"Non référencé\"))","v":""},{"$f":"IF(B79=\"\",\"\",IF(COUNTIF(Année1!$A$2:$A$100,$A79),VLOOKUP($A79,Année1!$A$2:$C$100,3,0),\"Non référencé\"))","v":""},{"$f":"IF($A79=\"\",\"\",IF(COUNTIF(Année2!$A$2:$A$100,$A79),VLOOKUP($A79,Année2!$A$2:$C$100,2,0),\"Non référencé\"))","v":""},{"$f":"IF($A79=\"\",\"\",IF(COUNTIF(Année2!$A$2:$A$100,$A79),VLOOKUP($A79,Année2!$A$2:$C$100,3,0),\"Non référencé\"))","v":""}]
[{"$f":"IF(COUNTIF(Année1!$A$2:$A$100,\"<>\")>COUNTA($A$2:A79),Année1!A79,IF(ROW()>MAX(Année2!$D$2:$D$100),\"\",INDEX(Année2!A$2:A177,MATCH(ROW(),Année2!$D$2:$D$100,0))))","v":""},{"$f":"IF(A80=\"\",\"\",IF(COUNTIF(Année1!$A$2:$A$100,$A80),VLOOKUP($A80,Année1!$A$2:$C$100,2,0),\"Non référencé\"))","v":""},{"$f":"IF(B80=\"\",\"\",IF(COUNTIF(Année1!$A$2:$A$100,$A80),VLOOKUP($A80,Année1!$A$2:$C$100,3,0),\"Non référencé\"))","v":""},{"$f":"IF($A80=\"\",\"\",IF(COUNTIF(Année2!$A$2:$A$100,$A80),VLOOKUP($A80,Année2!$A$2:$C$100,2,0),\"Non référencé\"))","v":""},{"$f":"IF($A80=\"\",\"\",IF(COUNTIF(Année2!$A$2:$A$100,$A80),VLOOKUP($A80,Année2!$A$2:$C$100,3,0),\"Non référencé\"))","v":""}]
[{"$f":"IF(COUNTIF(Année1!$A$2:$A$100,\"<>\")>COUNTA($A$2:A80),Année1!A80,IF(ROW()>MAX(Année2!$D$2:$D$100),\"\",INDEX(Année2!A$2:A178,MATCH(ROW(),Année2!$D$2:$D$100,0))))","v":""},{"$f":"IF(A81=\"\",\"\",IF(COUNTIF(Année1!$A$2:$A$100,$A81),VLOOKUP($A81,Année1!$A$2:$C$100,2,0),\"Non référencé\"))","v":""},{"$f":"IF(B81=\"\",\"\",IF(COUNTIF(Année1!$A$2:$A$100,$A81),VLOOKUP($A81,Année1!$A$2:$C$100,3,0),\"Non référencé\"))","v":""},{"$f":"IF($A81=\"\",\"\",IF(COUNTIF(Année2!$A$2:$A$100,$A81),VLOOKUP($A81,Année2!$A$2:$C$100,2,0),\"Non référencé\"))","v":""},{"$f":"IF($A81=\"\",\"\",IF(COUNTIF(Année2!$A$2:$A$100,$A81),VLOOKUP($A81,Année2!$A$2:$C$100,3,0),\"Non référencé\"))","v":""}]
[{"$f":"IF(COUNTIF(Année1!$A$2:$A$100,\"<>\")>COUNTA($A$2:A81),Année1!A81,IF(ROW()>MAX(Année2!$D$2:$D$100),\"\",INDEX(Année2!A$2:A179,MATCH(ROW(),Année2!$D$2:$D$100,0))))","v":""},{"$f":"IF(A82=\"\",\"\",IF(COUNTIF(Année1!$A$2:$A$100,$A82),VLOOKUP($A82,Année1!$A$2:$C$100,2,0),\"Non référencé\"))","v":""},{"$f":"IF(B82=\"\",\"\",IF(COUNTIF(Année1!$A$2:$A$100,$A82),VLOOKUP($A82,Année1!$A$2:$C$100,3,0),\"Non référencé\"))","v":""},{"$f":"IF($A82=\"\",\"\",IF(COUNTIF(Année2!$A$2:$A$100,$A82),VLOOKUP($A82,Année2!$A$2:$C$100,2,0),\"Non référencé\"))","v":""},{"$f":"IF($A82=\"\",\"\",IF(COUNTIF(Année2!$A$2:$A$100,$A82),VLOOKUP($A82,Année2!$A$2:$C$100,3,0),\"Non référencé\"))","v":""}]
[{"$f":"IF(COUNTIF(Année1!$A$2:$A$100,\"<>\")>COUNTA($A$2:A82),Année1!A82,IF(ROW()>MAX(Année2!$D$2:$D$100),\"\",INDEX(Année2!A$2:A180,MATCH(ROW(),Année2!$D$2:$D$100,0))))","v":""},{"$f":"IF(A83=\"\",\"\",IF(COUNTIF(Année1!$A$2:$A$100,$A83),VLOOKUP($A83,Année1!$A$2:$C$100,2,0),\"Non référencé\"))","v":""},{"$f":"IF(B83=\"\",\"\",IF(COUNTIF(Année1!$A$2:$A$100,$A83),VLOOKUP($A83,Année1!$A$2:$C$100,3,0),\"Non référencé\"))","v":""},{"$f":"IF($A83=\"\",\"\",IF(COUNTIF(Année2!$A$2:$A$100,$A83),VLOOKUP($A83,Année2!$A$2:$C$100,2,0),\"Non référencé\"))","v":""},{"$f":"IF($A83=\"\",\"\",IF(COUNTIF(Année2!$A$2:$A$100,$A83),VLOOKUP($A83,Année2!$A$2:$C$100,3,0),\"Non référencé\"))","v":""}]
[{"$f":"IF(COUNTIF(Année1!$A$2:$A$100,\"<>\")>COUNTA($A$2:A83),Année1!A83,IF(ROW()>MAX(Année2!$D$2:$D$100),\"\",INDEX(Année2!A$2:A181,MATCH(ROW(),Année2!$D$2:$D$100,0))))","v":""},{"$f":"IF(A84=\"\",\"\",IF(COUNTIF(Année1!$A$2:$A$100,$A84),VLOOKUP($A84,Année1!$A$2:$C$100,2,0),\"Non référencé\"))","v":""},{"$f":"IF(B84=\"\",\"\",IF(COUNTIF(Année1!$A$2:$A$100,$A84),VLOOKUP($A84,Année1!$A$2:$C$100,3,0),\"Non référencé\"))","v":""},{"$f":"IF($A84=\"\",\"\",IF(COUNTIF(Année2!$A$2:$A$100,$A84),VLOOKUP($A84,Année2!$A$2:$C$100,2,0),\"Non référencé\"))","v":""},{"$f":"IF($A84=\"\",\"\",IF(COUNTIF(Année2!$A$2:$A$100,$A84),VLOOKUP($A84,Année2!$A$2:$C$100,3,0),\"Non référencé\"))","v":""}]
[{"$f":"IF(COUNTIF(Année1!$A$2:$A$100,\"<>\")>COUNTA($A$2:A84),Année1!A84,IF(ROW()>MAX(Année2!$D$2:$D$100),\"\",INDEX(Année2!A$2:A182,MATCH(ROW(),Année2!$D$2:$D$100,0))))","v":""},{"$f":"IF(A85=\"\",\"\",IF(COUNTIF(Année1!$A$2:$A$100,$A85),VLOOKUP($A85,Année1!$A$2:$C$100,2,0),\"Non référencé\"))","v":""},{"$f":"IF(B85=\"\",\"\",IF(COUNTIF(Année1!$A$2:$A$100,$A85),VLOOKUP($A85,Année1!$A$2:$C$100,3,0),\"Non référencé\"))","v":""},{"$f":"IF($A85=\"\",\"\",IF(COUNTIF(Année2!$A$2:$A$100,$A85),VLOOKUP($A85,Année2!$A$2:$C$100,2,0),\"Non référencé\"))","v":""},{"$f":"IF($A85=\"\",\"\",IF(COUNTIF(Année2!$A$2:$A$100,$A85),VLOOKUP($A85,Année2!$A$2:$C$100,3,0),\"Non référencé\"))","v":""}]
[{"$f":"IF(COUNTIF(Année1!$A$2:$A$100,\"<>\")>COUNTA($A$2:A85),Année1!A85,IF(ROW()>MAX(Année2!$D$2:$D$100),\"\",INDEX(Année2!A$2:A183,MATCH(ROW(),Année2!$D$2:$D$100,0))))","v":""},{"$f":"IF(A86=\"\",\"\",IF(COUNTIF(Année1!$A$2:$A$100,$A86),VLOOKUP($A86,Année1!$A$2:$C$100,2,0),\"Non référencé\"))","v":""},{"$f":"IF(B86=\"\",\"\",IF(COUNTIF(Année1!$A$2:$A$100,$A86),VLOOKUP($A86,Année1!$A$2:$C$100,3,0),\"Non référencé\"))","v":""},{"$f":"IF($A86=\"\",\"\",IF(COUNTIF(Année2!$A$2:$A$100,$A86),VLOOKUP($A86,Année2!$A$2:$C$100,2,0),\"Non référencé\"))","v":""},{"$f":"IF($A86=\"\",\"\",IF(COUNTIF(Année2!$A$2:$A$100,$A86),VLOOKUP($A86,Année2!$A$2:$C$100,3,0),\"Non référencé\"))","v":""}]
[{"$f":"IF(COUNTIF(Année1!$A$2:$A$100,\"<>\")>COUNTA($A$2:A86),Année1!A86,IF(ROW()>MAX(Année2!$D$2:$D$100),\"\",INDEX(Année2!A$2:A184,MATCH(ROW(),Année2!$D$2:$D$100,0))))","v":""},{"$f":"IF(A87=\"\",\"\",IF(COUNTIF(Année1!$A$2:$A$100,$A87),VLOOKUP($A87,Année1!$A$2:$C$100,2,0),\"Non référencé\"))","v":""},{"$f":"IF(B87=\"\",\"\",IF(COUNTIF(Année1!$A$2:$A$100,$A87),VLOOKUP($A87,Année1!$A$2:$C$100,3,0),\"Non référencé\"))","v":""},{"$f":"IF($A87=\"\",\"\",IF(COUNTIF(Année2!$A$2:$A$100,$A87),VLOOKUP($A87,Année2!$A$2:$C$100,2,0),\"Non référencé\"))","v":""},{"$f":"IF($A87=\"\",\"\",IF(COUNTIF(Année2!$A$2:$A$100,$A87),VLOOKUP($A87,Année2!$A$2:$C$100,3,0),\"Non référencé\"))","v":""}]
[{"$f":"IF(COUNTIF(Année1!$A$2:$A$100,\"<>\")>COUNTA($A$2:A87),Année1!A87,IF(ROW()>MAX(Année2!$D$2:$D$100),\"\",INDEX(Année2!A$2:A185,MATCH(ROW(),Année2!$D$2:$D$100,0))))","v":""},{"$f":"IF(A88=\"\",\"\",IF(COUNTIF(Année1!$A$2:$A$100,$A88),VLOOKUP($A88,Année1!$A$2:$C$100,2,0),\"Non référencé\"))","v":""},{"$f":"IF(B88=\"\",\"\",IF(COUNTIF(Année1!$A$2:$A$100,$A88),VLOOKUP($A88,Année1!$A$2:$C$100,3,0),\"Non référencé\"))","v":""},{"$f":"IF($A88=\"\",\"\",IF(COUNTIF(Année2!$A$2:$A$100,$A88),VLOOKUP($A88,Année2!$A$2:$C$100,2,0),\"Non référencé\"))","v":""},{"$f":"IF($A88=\"\",\"\",IF(COUNTIF(Année2!$A$2:$A$100,$A88),VLOOKUP($A88,Année2!$A$2:$C$100,3,0),\"Non référencé\"))","v":""}]
[{"$f":"IF(COUNTIF(Année1!$A$2:$A$100,\"<>\")>COUNTA($A$2:A88),Année1!A88,IF(ROW()>MAX(Année2!$D$2:$D$100),\"\",INDEX(Année2!A$2:A186,MATCH(ROW(),Année2!$D$2:$D$100,0))))","v":""},{"$f":"IF(A89=\"\",\"\",IF(COUNTIF(Année1!$A$2:$A$100,$A89),VLOOKUP($A89,Année1!$A$2:$C$100,2,0),\"Non référencé\"))","v":""},{"$f":"IF(B89=\"\",\"\",IF(COUNTIF(Année1!$A$2:$A$100,$A89),VLOOKUP($A89,Année1!$A$2:$C$100,3,0),\"Non référencé\"))","v":""},{"$f":"IF($A89=\"\",\"\",IF(COUNTIF(Année2!$A$2:$A$100,$A89),VLOOKUP($A89,Année2!$A$2:$C$100,2,0),\"Non référencé\"))","v":""},{"$f":"IF($A89=\"\",\"\",IF(COUNTIF(Année2!$A$2:$A$100,$A89),VLOOKUP($A89,Année2!$A$2:$C$100,3,0),\"Non référencé\"))","v":""}]
[{"$f":"IF(COUNTIF(Année1!$A$2:$A$100,\"<>\")>COUNTA($A$2:A89),Année1!A89,IF(ROW()>MAX(Année2!$D$2:$D$100),\"\",INDEX(Année2!A$2:A187,MATCH(ROW(),Année2!$D$2:$D$100,0))))","v":""},{"$f":"IF(A90=\"\",\"\",IF(COUNTIF(Année1!$A$2:$A$100,$A90),VLOOKUP($A90,Année1!$A$2:$C$100,2,0),\"Non référencé\"))","v":""},{"$f":"IF(B90=\"\",\"\",IF(COUNTIF(Année1!$A$2:$A$100,$A90),VLOOKUP($A90,Année1!$A$2:$C$100,3,0),\"Non référencé\"))","v":""},{"$f":"IF($A90=\"\",\"\",IF(COUNTIF(Année2!$A$2:$A$100,$A90),VLOOKUP($A90,Année2!$A$2:$C$100,2,0),\"Non référencé\"))","v":""},{"$f":"IF($A90=\"\",\"\",IF(COUNTIF(Année2!$A$2:$A$100,$A90),VLOOKUP($A90,Année2!$A$2:$C$100,3,0),\"Non référencé\"))","v":""}]
[{"$f":"IF(COUNTIF(Année1!$A$2:$A$100,\"<>\")>COUNTA($A$2:A90),Année1!A90,IF(ROW()>MAX(Année2!$D$2:$D$100),\"\",INDEX(Année2!A$2:A188,MATCH(ROW(),Année2!$D$2:$D$100,0))))","v":""},{"$f":"IF(A91=\"\",\"\",IF(COUNTIF(Année1!$A$2:$A$100,$A91),VLOOKUP($A91,Année1!$A$2:$C$100,2,0),\"Non référencé\"))","v":""},{"$f":"IF(B91=\"\",\"\",IF(COUNTIF(Année1!$A$2:$A$100,$A91),VLOOKUP($A91,Année1!$A$2:$C$100,3,0),\"Non référencé\"))","v":""},{"$f":"IF($A91=\"\",\"\",IF(COUNTIF(Année2!$A$2:$A$100,$A91),VLOOKUP($A91,Année2!$A$2:$C$100,2,0),\"Non référencé\"))","v":""},{"$f":"IF($A91=\"\",\"\",IF(COUNTIF(Année2!$A$2:$A$100,$A91),VLOOKUP($A91,Année2!$A$2:$C$100,3,0),\"Non référencé\"))","v":""}]
[{"$f":"IF(COUNTIF(Année1!$A$2:$A$100,\"<>\")>COUNTA($A$2:A91),Année1!A91,IF(ROW()>MAX(Année2!$D$2:$D$100),\"\",INDEX(Année2!A$2:A189,MATCH(ROW(),Année2!$D$2:$D$100,0))))","v":""},{"$f":"IF(A92=\"\",\"\",IF(COUNTIF(Année1!$A$2:$A$100,$A92),VLOOKUP($A92,Année1!$A$2:$C$100,2,0),\"Non référencé\"))","v":""},{"$f":"IF(B92=\"\",\"\",IF(COUNTIF(Année1!$A$2:$A$100,$A92),VLOOKUP($A92,Année1!$A$2:$C$100,3,0),\"Non référencé\"))","v":""},{"$f":"IF($A92=\"\",\"\",IF(COUNTIF(Année2!$A$2:$A$100,$A92),VLOOKUP($A92,Année2!$A$2:$C$100,2,0),\"Non référencé\"))","v":""},{"$f":"IF($A92=\"\",\"\",IF(COUNTIF(Année2!$A$2:$A$100,$A92),VLOOKUP($A92,Année2!$A$2:$C$100,3,0),\"Non référencé\"))","v":""}]
[{"$f":"IF(COUNTIF(Année1!$A$2:$A$100,\"<>\")>COUNTA($A$2:A92),Année1!A92,IF(ROW()>MAX(Année2!$D$2:$D$100),\"\",INDEX(Année2!A$2:A190,MATCH(ROW(),Année2!$D$2:$D$100,0))))","v":""},{"$f":"IF(A93=\"\",\"\",IF(COUNTIF(Année1!$A$2:$A$100,$A93),VLOOKUP($A93,Année1!$A$2:$C$100,2,0),\"Non référencé\"))","v":""},{"$f":"IF(B93=\"\",\"\",IF(COUNTIF(Année1!$A$2:$A$100,$A93),VLOOKUP($A93,Année1!$A$2:$C$100,3,0),\"Non référencé\"))","v":""},{"$f":"IF($A93=\"\",\"\",IF(COUNTIF(Année2!$A$2:$A$100,$A93),VLOOKUP($A93,Année2!$A$2:$C$100,2,0),\"Non référencé\"))","v":""},{"$f":"IF($A93=\"\",\"\",IF(COUNTIF(Année2!$A$2:$A$100,$A93),VLOOKUP($A93,Année2!$A$2:$C$100,3,0),\"Non référencé\"))","v":""}]
[{"$f":"IF(COUNTIF(Année1!$A$2:$A$100,\"<>\")>COUNTA($A$2:A93),Année1!A93,IF(ROW()>MAX(Année2!$D$2:$D$100),\"\",INDEX(Année2!A$2:A191,MATCH(ROW(),Année2!$D$2:$D$100,0))))","v":""},{"$f":"IF(A94=\"\",\"\",IF(COUNTIF(Année1!$A$2:$A$100,$A94),VLOOKUP($A94,Année1!$A$2:$C$100,2,0),\"Non référencé\"))","v":""},{"$f":"IF(B94=\"\",\"\",IF(COUNTIF(Année1!$A$2:$A$100,$A94),VLOOKUP($A94,Année1!$A$2:$C$100,3,0),\"Non référencé\"))","v":""},{"$f":"IF($A94=\"\",\"\",IF(COUNTIF(Année2!$A$2:$A$100,$A94),VLOOKUP($A94,Année2!$A$2:$C$100,2,0),\"Non référencé\"))","v":""},{"$f":"IF($A94=\"\",\"\",IF(COUNTIF(Année2!$A$2:$A$100,$A94),VLOOKUP($A94,Année2!$A$2:$C$100,3,0),\"Non référencé\"))","v":""}]
[{"$f":"IF(COUNTIF(Année1!$A$2:$A$100,\"<>\")>COUNTA($A$2:A94),Année1!A94,IF(ROW()>MAX(Année2!$D$2:$D$100),\"\",INDEX(Année2!A$2:A192,MATCH(ROW(),Année2!$D$2:$D$100,0))))","v":""},{"$f":"IF(A95=\"\",\"\",IF(COUNTIF(Année1!$A$2:$A$100,$A95),VLOOKUP($A95,Année1!$A$2:$C$100,2,0),\"Non référencé\"))","v":""},{"$f":"IF(B95=\"\",\"\",IF(COUNTIF(Année1!$A$2:$A$100,$A95),VLOOKUP($A95,Année1!$A$2:$C$100,3,0),\"Non référencé\"))","v":""},{"$f":"IF($A95=\"\",\"\",IF(COUNTIF(Année2!$A$2:$A$100,$A95),VLOOKUP($A95,Année2!$A$2:$C$100,2,0),\"Non référencé\"))","v":""},{"$f":"IF($A95=\"\",\"\",IF(COUNTIF(Année2!$A$2:$A$100,$A95),VLOOKUP($A95,Année2!$A$2:$C$100,3,0),\"Non référencé\"))","v":""}]
[{"$f":"IF(COUNTIF(Année1!$A$2:$A$100,\"<>\")>COUNTA($A$2:A95),Année1!A95,IF(ROW()>MAX(Année2!$D$2:$D$100),\"\",INDEX(Année2!A$2:A193,MATCH(ROW(),Année2!$D$2:$D$100,0))))","v":""},{"$f":"IF(A96=\"\",\"\",IF(COUNTIF(Année1!$A$2:$A$100,$A96),VLOOKUP($A96,Année1!$A$2:$C$100,2,0),\"Non référencé\"))","v":""},{"$f":"IF(B96=\"\",\"\",IF(COUNTIF(Année1!$A$2:$A$100,$A96),VLOOKUP($A96,Année1!$A$2:$C$100,3,0),\"Non référencé\"))","v":""},{"$f":"IF($A96=\"\",\"\",IF(COUNTIF(Année2!$A$2:$A$100,$A96),VLOOKUP($A96,Année2!$A$2:$C$100,2,0),\"Non référencé\"))","v":""},{"$f":"IF($A96=\"\",\"\",IF(COUNTIF(Année2!$A$2:$A$100,$A96),VLOOKUP($A96,Année2!$A$2:$C$100,3,0),\"Non référencé\"))","v":""}]
[{"$f":"IF(COUNTIF(Année1!$A$2:$A$100,\"<>\")>COUNTA($A$2:A96),Année1!A96,IF(ROW()>MAX(Année2!$D$2:$D$100),\"\",INDEX(Année2!A$2:A194,MATCH(ROW(),Année2!$D$2:$D$100,0))))","v":""},{"$f":"IF(A97=\"\",\"\",IF(COUNTIF(Année1!$A$2:$A$100,$A97),VLOOKUP($A97,Année1!$A$2:$C$100,2,0),\"Non référencé\"))","v":""},{"$f":"IF(B97=\"\",\"\",IF(COUNTIF(Année1!$A$2:$A$100,$A97),VLOOKUP($A97,Année1!$A$2:$C$100,3,0),\"Non référencé\"))","v":""},{"$f":"IF($A97=\"\",\"\",IF(COUNTIF(Année2!$A$2:$A$100,$A97),VLOOKUP($A97,Année2!$A$2:$C$100,2,0),\"Non référencé\"))","v":""},{"$f":"IF($A97=\"\",\"\",IF(COUNTIF(Année2!$A$2:$A$100,$A97),VLOOKUP($A97,Année2!$A$2:$C$100,3,0),\"Non référencé\"))","v":""}]
[{"$f":"IF(COUNTIF(Année1!$A$2:$A$100,\"<>\")>COUNTA($A$2:A97),Année1!A97,IF(ROW()>MAX(Année2!$D$2:$D$100),\"\",INDEX(Année2!A$2:A195,MATCH(ROW(),Année2!$D$2:$D$100,0))))","v":""},{"$f":"IF(A98=\"\",\"\",IF(COUNTIF(Année1!$A$2:$A$100,$A98),VLOOKUP($A98,Année1!$A$2:$C$100,2,0),\"Non référencé\"))","v":""},{"$f":"IF(B98=\"\",\"\",IF(COUNTIF(Année1!$A$2:$A$100,$A98),VLOOKUP($A98,Année1!$A$2:$C$100,3,0),\"Non référencé\"))","v":""},{"$f":"IF($A98=\"\",\"\",IF(COUNTIF(Année2!$A$2:$A$100,$A98),VLOOKUP($A98,Année2!$A$2:$C$100,2,0),\"Non référencé\"))","v":""},{"$f":"IF($A98=\"\",\"\",IF(COUNTIF(Année2!$A$2:$A$100,$A98),VLOOKUP($A98,Année2!$A$2:$C$100,3,0),\"Non référencé\"))","v":""}]
[{"$f":"IF(COUNTIF(Année1!$A$2:$A$100,\"<>\")>COUNTA($A$2:A98),Année1!A98,IF(ROW()>MAX(Année2!$D$2:$D$100),\"\",INDEX(Année2!A$2:A196,MATCH(ROW(),Année2!$D$2:$D$100,0))))","v":""},{"$f":"IF(A99=\"\",\"\",IF(COUNTIF(Année1!$A$2:$A$100,$A99),VLOOKUP($A99,Année1!$A$2:$C$100,2,0),\"Non référencé\"))","v":""},{"$f":"IF(B99=\"\",\"\",IF(COUNTIF(Année1!$A$2:$A$100,$A99),VLOOKUP($A99,Année1!$A$2:$C$100,3,0),\"Non référencé\"))","v":""},{"$f":"IF($A99=\"\",\"\",IF(COUNTIF(Année2!$A$2:$A$100,$A99),VLOOKUP($A99,Année2!$A$2:$C$100,2,0),\"Non référencé\"))","v":""},{"$f":"IF($A99=\"\",\"\",IF(COUNTIF(Année2!$A$2:$A$100,$A99),VLOOKUP($A99,Année2!$A$2:$C$100,3,0),\"Non référencé\"))","v":""}]
[{"$f":"IF(COUNTIF(Année1!$A$2:$A$100,\"<>\")>COUNTA($A$2:A99),Année1!A99,IF(ROW()>MAX(Année2!$D$2:$D$100),\"\",INDEX(Année2!A$2:A197,MATCH(ROW(),Année2!$D$2:$D$100,0))))","v":""},{"$f":"IF(A100=\"\",\"\",IF(COUNTIF(Année1!$A$2:$A$100,$A100),VLOOKUP($A100,Année1!$A$2:$C$100,2,0),\"Non référencé\"))","v":""},{"$f":"IF(B100=\"\",\"\",IF(COUNTIF(Année1!$A$2:$A$100,$A100),VLOOKUP($A100,Année1!$A$2:$C$100,3,0),\"Non référencé\"))","v":""},{"$f":"IF($A100=\"\",\"\",IF(COUNTIF(Année2!$A$2:$A$100,$A100),VLOOKUP($A100,Année2!$A$2:$C$100,2,0),\"Non référencé\"))","v":""},{"$f":"IF($A100=\"\",\"\",IF(COUNTIF(Année2!$A$2:$A$100,$A100),VLOOKUP($A100,Année2!$A$2:$C$100,3,0),\"Non référencé\"))","v":""}]
[{"$f":"IF(COUNTIF(Année1!$A$2:$A$100,\"<>\")>COUNTA($A$2:A100),Année1!A100,\"\")","v":""}]
[{"$f":"IF(COUNTIF(Année1!$A$2:$A$100,\"<>\")>COUNTA($A$2:A101),Année1!A101,\"\")","v":""}]
[{"$f":"IF(COUNTIF(Année1!$A$2:$A$100,\"<>\")>COUNTA($A$2:A102),Année1!A102,\"\")","v":""}]
[{"$f":"IF(COUNTIF(Année1!$A$2:$A$100,\"<>\")>COUNTA($A$2:A103),Année1!A103,\"\")","v":""}]
[{"$f":"IF(COUNTIF(Année1!$A$2:$A$100,\"<>\")>COUNTA($A$2:A104),Année1!A104,\"\")","v":""}]
[{"$f":"IF(COUNTIF(Année1!$A$2:$A$100,\"<>\")>COUNTA($A$2:A105),Année1!A105,\"\")","v":""}]
[{"$f":"IF(COUNTIF(Année1!$A$2:$A$100,\"<>\")>COUNTA($A$2:A106),Année1!A106,\"\")","v":""}]
[{"$f":"IF(COUNTIF(Année1!$A$2:$A$100,\"<>\")>COUNTA($A$2:A107),Année1!A107,\"\")","v":""}]
[{"$f":"IF(COUNTIF(Année1!$A$2:$A$100,\"<>\")>COUNTA($A$2:A108),Année1!A108,\"\")","v":""}]
[{"$f":"IF(COUNTIF(Année1!$A$2:$A$100,\"<>\")>COUNTA($A$2:A109),Année1!A109,\"\")","v":""}]
[{"$f":"IF(COUNTIF(Année1!$A$2:$A$100,\"<>\")>COUNTA($A$2:A110),Année1!A110,\"\")","v":""}]
[{"$f":"IF(COUNTIF(Année1!$A$2:$A$100,\"<>\")>COUNTA($A$2:A111),Année1!A111,\"\")","v":""}]
[{"$f":"IF(COUNTIF(Année1!$A$2:$A$100,\"<>\")>COUNTA($A$2:A112),Année1!A112,\"\")","v":""}]
[{"$f":"IF(COUNTIF(Année1!$A$2:$A$100,\"<>\")>COUNTA($A$2:A113),Année1!A113,\"\")","v":""}]
[{"$f":"IF(COUNTIF(Année1!$A$2:$A$100,\"<>\")>COUNTA($A$2:A114),Année1!A114,\"\")","v":""}]
[{"$f":"IF(COUNTIF(Année1!$A$2:$A$100,\"<>\")>COUNTA($A$2:A115),Année1!A115,\"\")","v":""}]
[{"$f":"IF(COUNTIF(Année1!$A$2:$A$100,\"<>\")>COUNTA($A$2:A116),Année1!A116,\"\")","v":""}]
[{"$f":"IF(COUNTIF(Année1!$A$2:$A$100,\"<>\")>COUNTA($A$2:A117),Année1!A117,\"\")","v":""}]
[{"$f":"IF(COUNTIF(Année1!$A$2:$A$100,\"<>\")>COUNTA($A$2:A118),Année1!A118,\"\")","v":""}]
[{"$f":"IF(COUNTIF(Année1!$A$2:$A$100,\"<>\")>COUNTA($A$2:A119),Année1!A119,\"\")","v":""}]
[{"$f":"IF(COUNTIF(Année1!$A$2:$A$100,\"<>\")>COUNTA($A$2:A120),Année1!A120,\"\")","v":""}]
[{"$f":"IF(COUNTIF(Année1!$A$2:$A$100,\"<>\")>COUNTA($A$2:A121),Année1!A121,\"\")","v":""}]
[{"$f":"IF(COUNTIF(Année1!$A$2:$A$100,\"<>\")>COUNTA($A$2:A122),Année1!A122,\"\")","v":""}]
[{"$f":"IF(COUNTIF(Année1!$A$2:$A$100,\"<>\")>COUNTA($A$2:A123),Année1!A123,\"\")","v":""}]
[{"$f":"IF(COUNTIF(Année1!$A$2:$A$100,\"<>\")>COUNTA($A$2:A124),Année1!A124,\"\")","v":""}]
[{"$f":"IF(COUNTIF(Année1!$A$2:$A$100,\"<>\")>COUNTA($A$2:A125),Année1!A125,\"\")","v":""}]
[{"$f":"IF(COUNTIF(Année1!$A$2:$A$100,\"<>\")>COUNTA($A$2:A126),Année1!A126,\"\")","v":""}]
[{"$f":"IF(COUNTIF(Année1!$A$2:$A$100,\"<>\")>COUNTA($A$2:A127),Année1!A127,\"\")","v":""}]
[{"$f":"IF(COUNTIF(Année1!$A$2:$A$100,\"<>\")>COUNTA($A$2:A128),Année1!A128,\"\")","v":""}]
[{"$f":"IF(COUNTIF(Année1!$A$2:$A$100,\"<>\")>COUNTA($A$2:A129),Année1!A129,\"\")","v":""}]
[{"$f":"IF(COUNTIF(Année1!$A$2:$A$100,\"<>\")>COUNTA($A$2:A130),Année1!A130,\"\")","v":""}]
[{"$f":"IF(COUNTIF(Année1!$A$2:$A$100,\"<>\")>COUNTA($A$2:A131),Année1!A131,\"\")","v":""}]
[{"$f":"IF(COUNTIF(Année1!$A$2:$A$100,\"<>\")>COUNTA($A$2:A132),Année1!A132,\"\")","v":""}]
[{"$f":"IF(COUNTIF(Année1!$A$2:$A$100,\"<>\")>COUNTA($A$2:A133),Année1!A133,\"\")","v":""}]
[{"$f":"IF(COUNTIF(Année1!$A$2:$A$100,\"<>\")>COUNTA($A$2:A134),Année1!A134,\"\")","v":""}]
[{"$f":"IF(COUNTIF(Année1!$A$2:$A$100,\"<>\")>COUNTA($A$2:A135),Année1!A135,\"\")","v":""}]
[{"$f":"IF(COUNTIF(Année1!$A$2:$A$100,\"<>\")>COUNTA($A$2:A136),Année1!A136,\"\")","v":""}]
[{"$f":"IF(COUNTIF(Année1!$A$2:$A$100,\"<>\")>COUNTA($A$2:A137),Année1!A137,\"\")","v":""}]
[{"$f":"IF(COUNTIF(Année1!$A$2:$A$100,\"<>\")>COUNTA($A$2:A138),Année1!A138,\"\")","v":""}]
[{"$f":"IF(COUNTIF(Année1!$A$2:$A$100,\"<>\")>COUNTA($A$2:A139),Année1!A139,\"\")","v":""}]
[{"$f":"IF(COUNTIF(Année1!$A$2:$A$100,\"<>\")>COUNTA($A$2:A140),Année1!A140,\"\")","v":""}]
[{"$f":"IF(COUNTIF(Année1!$A$2:$A$100,\"<>\")>COUNTA($A$2:A141),Année1!A141,\"\")","v":""}]
[{"$f":"IF(COUNTIF(Année1!$A$2:$A$100,\"<>\")>COUNTA($A$2:A142),Année1!A142,\"\")","v":""}]
[{"$f":"IF(COUNTIF(Année1!$A$2:$A$100,\"<>\")>COUNTA($A$2:A143),Année1!A143,\"\")","v":""}]
[{"$f":"IF(COUNTIF(Année1!$A$2:$A$100,\"<>\")>COUNTA($A$2:A144),Année1!A144,\"\")","v":""}]
[{"$f":"IF(COUNTIF(Année1!$A$2:$A$100,\"<>\")>COUNTA($A$2:A145),Année1!A145,\"\")","v":""}]
[{"$f":"IF(COUNTIF(Année1!$A$2:$A$100,\"<>\")>COUNTA($A$2:A146),Année1!A146,\"\")","v":""}]
[{"$f":"IF(COUNTIF(Année1!$A$2:$A$100,\"<>\")>COUNTA($A$2:A147),Année1!A147,\"\")","v":""}]
[{"$f":"IF(COUNTIF(Année1!$A$2:$A$100,\"<>\")>COUNTA($A$2:A148),Année1!A148,\"\")","v":""}]
[{"$f":"IF(COUNTIF(Année1!$A$2:$A$100,\"<>\")>COUNTA($A$2:A149),Année1!A149,\"\")","v":""}]
[{"$f":"IF(COUNTIF(Année1!$A$2:$A$100,\"<>\")>COUNTA($A$2:A150),Année1!A150,\"\")","v":""}]
[{"$f":"IF(COUNTIF(Année1!$A$2:$A$100,\"<>\")>COUNTA($A$2:A151),Année1!A151,\"\")","v":""}]
[{"$f":"IF(COUNTIF(Année1!$A$2:$A$100,\"<>\")>COUNTA($A$2:A152),Année1!A152,\"\")","v":""}]
[{"$f":"IF(COUNTIF(Année1!$A$2:$A$100,\"<>\")>COUNTA($A$2:A153),Année1!A153,\"\")","v":""}]
[{"$f":"IF(COUNTIF(Année1!$A$2:$A$100,\"<>\")>COUNTA($A$2:A154),Année1!A154,\"\")","v":""}]
[{"$f":"IF(COUNTIF(Année1!$A$2:$A$100,\"<>\")>COUNTA($A$2:A155),Année1!A155,\"\")","v":""}]
[{"$f":"IF(COUNTIF(Année1!$A$2:$A$100,\"<>\")>COUNTA($A$2:A156),Année1!A156,\"\")","v":""}]
[{"$f":"IF(COUNTIF(Année1!$A$2:$A$100,\"<>\")>COUNTA($A$2:A157),Année1!A157,\"\")","v":""}]
[{"$f":"IF(COUNTIF(Année1!$A$2:$A$100,\"<>\")>COUNTA($A$2:A158),Année1!A158,\"\")","v":""}]
[{"$f":"IF(COUNTIF(Année1!$A$2:$A$100,\"<>\")>COUNTA($A$2:A159),Année1!A159,\"\")","v":""}]
[{"$f":"IF(COUNTIF(Année1!$A$2:$A$100,\"<>\")>COUNTA($A$2:A160),Année1!A160,\"\")","v":""}]
[{"$f":"IF(COUNTIF(Année1!$A$2:$A$100,\"<>\")>COUNTA($A$2:A161),Année1!A161,\"\")","v":""}]
[{"$f":"IF(COUNTIF(Année1!$A$2:$A$100,\"<>\")>COUNTA($A$2:A162),Année1!A162,\"\")","v":""}]
[{"$f":"IF(COUNTIF(Année1!$A$2:$A$100,\"<>\")>COUNTA($A$2:A163),Année1!A163,\"\")","v":""}]
[{"$f":"IF(COUNTIF(Année1!$A$2:$A$100,\"<>\")>COUNTA($A$2:A164),Année1!A164,\"\")","v":""}]
[{"$f":"IF(COUNTIF(Année1!$A$2:$A$100,\"<>\")>COUNTA($A$2:A165),Année1!A165,\"\")","v":""}]
[{"$f":"IF(COUNTIF(Année1!$A$2:$A$100,\"<>\")>COUNTA($A$2:A166),Année1!A166,\"\")","v":""}]
[{"$f":"IF(COUNTIF(Année1!$A$2:$A$100,\"<>\")>COUNTA($A$2:A167),Année1!A167,\"\")","v":""}]
[{"$f":"IF(COUNTIF(Année1!$A$2:$A$100,\"<>\")>COUNTA($A$2:A168),Année1!A168,\"\")","v":""}]
[{"$f":"IF(COUNTIF(Année1!$A$2:$A$100,\"<>\")>COUNTA($A$2:A169),Année1!A169,\"\")","v":""}]
[{"$f":"IF(COUNTIF(Année1!$A$2:$A$100,\"<>\")>COUNTA($A$2:A170),Année1!A170,\"\")","v":""}]
[{"$f":"IF(COUNTIF(Année1!$A$2:$A$100,\"<>\")>COUNTA($A$2:A171),Année1!A171,\"\")","v":""}]
[{"$f":"IF(COUNTIF(Année1!$A$2:$A$100,\"<>\")>COUNTA($A$2:A172),Année1!A172,\"\")","v":""}]
[{"$f":"IF(COUNTIF(Année1!$A$2:$A$100,\"<>\")>COUNTA($A$2:A173),Année1!A173,\"\")","v":""}]
[{"$f":"IF(COUNTIF(Année1!$A$2:$A$100,\"<>\")>COUNTA($A$2:A174),Année1!A174,\"\")","v":""}]
[{"$f":"IF(COUNTIF(Année1!$A$2:$A$100,\"<>\")>COUNTA($A$2:A175),Année1!A175,\"\")","v":""}]
[{"$f":"IF(COUNTIF(Année1!$A$2:$A$100,\"<>\")>COUNTA($A$2:A176),Année1!A176,\"\")","v":""}]
[{"$f":"IF(COUNTIF(Année1!$A$2:$A$100,\"<>\")>COUNTA($A$2:A177),Année1!A177,\"\")","v":""}]
[{"$f":"IF(COUNTIF(Année1!$A$2:$A$100,\"<>\")>COUNTA($A$2:A178),Année1!A178,\"\")","v":""}]
[{"$f":"IF(COUNTIF(Année1!$A$2:$A$100,\"<>\")>COUNTA($A$2:A179),Année1!A179,\"\")","v":""}]
[{"$f":"IF(COUNTIF(Année1!$A$2:$A$100,\"<>\")>COUNTA($A$2:A180),Année1!A180,\"\")","v":""}]
[{"$f":"IF(COUNTIF(Année1!$A$2:$A$100,\"<>\")>COUNTA($A$2:A181),Année1!A181,\"\")","v":""}]
[{"$f":"IF(COUNTIF(Année1!$A$2:$A$100,\"<>\")>COUNTA($A$2:A182),Année1!A182,\"\")","v":""}]
[{"$f":"IF(COUNTIF(Année1!$A$2:$A$100,\"<>\")>COUNTA($A$2:A183),Année1!A183,\"\")","v":""}]
[{"$f":"IF(COUNTIF(Année1!$A$2:$A$100,\"<>\")>COUNTA($A$2:A184),Année1!A184,\"\")","v":""}]
[{"$f":"IF(COUNTIF(Année1!$A$2:$A$100,\"<>\")>COUNTA($A$2:A185),Année1!A185,\"\")","v":""}]
[{"$f":"IF(COUNTIF(Année1!$A$2:$A$100,\"<>\")>COUNTA($A$2:A186),Année1!A186,\"\")","v":""}]
[{"$f":"IF(COUNTIF(Année1!$A$2:$A$100,\"<>\")>COUNTA($A$2:A187),Année1!A187,\"\")","v":""}]
[{"$f":"IF(COUNTIF(Année1!$A$2:$A$100,\"<>\")>COUNTA($A$2:A188),Année1!A188,\"\")","v":""}]
[{"$f":"IF(COUNTIF(Année1!$A$2:$A$100,\"<>\")>COUNTA($A$2:A189),Année1!A189,\"\")","v":""}]
[{"$f":"IF(COUNTIF(Année1!$A$2:$A$100,\"<>\")>COUNTA($A$2:A190),Année1!A190,\"\")","v":""}]
[{"$f":"IF(COUNTIF(Année1!$A$2:$A$100,\"<>\")>COUNTA($A$2:A191),Année1!A191,\"\")","v":""}]
[{"$f":"IF(COUNTIF(Année1!$A$2:$A$100,\"<>\")>COUNTA($A$2:A192),Année1!A192,\"\")","v":""}]
[{"$f":"IF(COUNTIF(Année1!$A$2:$A$100,\"<>\")>COUNTA($A$2:A193),Année1!A193,\"\")","v":""}]
[{"$f":"IF(COUNTIF(Année1!$A$2:$A$100,\"<>\")>COUNTA($A$2:A194),Année1!A194,\"\")","v":""}]
[{"$f":"IF(COUNTIF(Année1!$A$2:$A$100,\"<>\")>COUNTA($A$2:A195),Année1!A195,\"\")","v":""}]
[{"$f":"IF(COUNTIF(Année1!$A$2:$A$100,\"<>\")>COUNTA($A$2:A196),Année1!A196,\"\")","v":""}]
[{"$f":"IF(COUNTIF(Année1!$A$2:$A$100,\"<>\")>COUNTA($A$2:A197),Année1!A197,\"\")","v":""}]
[{"$f":"IF(COUNTIF(Année1!$A$2:$A$100,\"<>\")>COUNTA($A$2:A198),Année1!A198,\"\")","v":""}]
[{"$f":"IF(COUNTIF(Année1!$A$2:$A$100,\"<>\")>COUNTA($A$2:A199),Année1!A199,\"\")","v":""}]
[{"$f":"IF(COUNTIF(Année1!$A$2:$A$100,\"<>\")>COUNTA($A$2:A200),Année1!A200,\"\")","v":""}]
[{"$f":"IF(COUNTIF(Année1!$A$2:$A$100,\"<>\")>COUNTA($A$2:A201),Année1!A201,\"\")","v":""}]
[{"$f":"IF(COUNTIF(Année1!$A$2:$A$100,\"<>\")>COUNTA($A$2:A202),Année1!A202,\"\")","v":""}]
[{"$f":"IF(COUNTIF(Année1!$A$2:$A$100,\"<>\")>COUNTA($A$2:A203),Année1!A203,\"\")","v":""}]
[{"$f":"IF(COUNTIF(Année1!$A$2:$A$100,\"<>\")>COUNTA($A$2:A204),Année1!A204,\"\")","v":""}]
[{"$f":"IF(COUNTIF(Année1!$A$2:$A$100,\"<>\")>COUNTA($A$2:A205),Année1!A205,\"\")","v":""}]
[{"$f":"IF(COUNTIF(Année1!$A$2:$A$100,\"<>\")>COUNTA($A$2:A206),Année1!A206,\"\")","v":""}]
[{"$f":"IF(COUNTIF(Année1!$A$2:$A$100,\"<>\")>COUNTA($A$2:A207),Année1!A207,\"\")","v":""}]
[{"$f":"IF(COUNTIF(Année1!$A$2:$A$100,\"<>\")>COUNTA($A$2:A208),Année1!A208,\"\")","v":""}]
[{"$f":"IF(COUNTIF(Année1!$A$2:$A$100,\"<>\")>COUNTA($A$2:A209),Année1!A209,\"\")","v":""}]
[{"$f":"IF(COUNTIF(Année1!$A$2:$A$100,\"<>\")>COUNTA($A$2:A210),Année1!A210,\"\")","v":""}]
[{"$f":"IF(COUNTIF(Année1!$A$2:$A$100,\"<>\")>COUNTA($A$2:A211),Année1!A211,\"\")","v":""}]
[{"$f":"IF(COUNTIF(Année1!$A$2:$A$100,\"<>\")>COUNTA($A$2:A212),Année1!A212,\"\")","v":""}]
[{"$f":"IF(COUNTIF(Année1!$A$2:$A$100,\"<>\")>COUNTA($A$2:A213),Année1!A213,\"\")","v":""}]
[{"$f":"IF(COUNTIF(Année1!$A$2:$A$100,\"<>\")>COUNTA($A$2:A214),Année1!A214,\"\")","v":""}]
[{"$f":"IF(COUNTIF(Année1!$A$2:$A$100,\"<>\")>COUNTA($A$2:A215),Année1!A215,\"\")","v":""}]
[{"$f":"IF(COUNTIF(Année1!$A$2:$A$100,\"<>\")>COUNTA($A$2:A216),Année1!A216,\"\")","v":""}]
[{"$f":"IF(COUNTIF(Année1!$A$2:$A$100,\"<>\")>COUNTA($A$2:A217),Année1!A217,\"\")","v":""}]
[{"$f":"IF(COUNTIF(Année1!$A$2:$A$100,\"<>\")>COUNTA($A$2:A218),Année1!A218,\"\")","v":""}]
[{"$f":"IF(COUNTIF(Année1!$A$2:$A$100,\"<>\")>COUNTA($A$2:A219),Année1!A219,\"\")","v":""}]
[{"$f":"IF(COUNTIF(Année1!$A$2:$A$100,\"<>\")>COUNTA($A$2:A220),Année1!A220,\"\")","v":""}]
[{"$f":"IF(COUNTIF(Année1!$A$2:$A$100,\"<>\")>COUNTA($A$2:A221),Année1!A221,\"\")","v":""}]
[{"$f":"IF(COUNTIF(Année1!$A$2:$A$100,\"<>\")>COUNTA($A$2:A222),Année1!A222,\"\")","v":""}]
[{"$f":"IF(COUNTIF(Année1!$A$2:$A$100,\"<>\")>COUNTA($A$2:A223),Année1!A223,\"\")","v":""}]
[{"$f":"IF(COUNTIF(Année1!$A$2:$A$100,\"<>\")>COUNTA($A$2:A224),Année1!A224,\"\")","v":""}]
[{"$f":"IF(COUNTIF(Année1!$A$2:$A$100,\"<>\")>COUNTA($A$2:A225),Année1!A225,\"\")","v":""}]
[{"$f":"IF(COUNTIF(Année1!$A$2:$A$100,\"<>\")>COUNTA($A$2:A226),Année1!A226,\"\")","v":""}]
[{"$f":"IF(COUNTIF(Année1!$A$2:$A$100,\"<>\")>COUNTA($A$2:A227),Année1!A227,\"\")","v":""}]
[{"$f":"IF(COUNTIF(Année1!$A$2:$A$100,\"<>\")>COUNTA($A$2:A228),Année1!A228,\"\")","v":""}]
[{"$f":"IF(COUNTIF(Année1!$A$2:$A$100,\"<>\")>COUNTA($A$2:A229),Année1!A229,\"\")","v":""}]
[{"$f":"IF(COUNTIF(Année1!$A$2:$A$100,\"<>\")>COUNTA($A$2:A230),Année1!A230,\"\")","v":""}]
[{"$f":"IF(COUNTIF(Année1!$A$2:$A$100,\"<>\")>COUNTA($A$2:A231),Année1!A231,\"\")","v":""}]
[{"$f":"IF(COUNTIF(Année1!$A$2:$A$100,\"<>\")>COUNTA($A$2:A232),Année1!A232,\"\")","v":""}]
[{"$f":"IF(COUNTIF(Année1!$A$2:$A$100,\"<>\")>COUNTA($A$2:A233),Année1!A233,\"\")","v":""}]
[{"$f":"IF(COUNTIF(Année1!$A$2:$A$100,\"<>\")>COUNTA($A$2:A234),Année1!A234,\"\")","v":""}]
[{"$f":"IF(COUNTIF(Année1!$A$2:$A$100,\"<>\")>COUNTA($A$2:A235),Année1!A235,\"\")","v":""}]
[{"$f":"IF(COUNTIF(Année1!$A$2:$A$100,\"<>\")>COUNTA($A$2:A236),Année1!A236,\"\")","v":""}]
[{"$f":"IF(COUNTIF(Année1!$A$2:$A$100,\"<>\")>COUNTA($A$2:A237),Année1!A237,\"\")","v":""}]
[{"$f":"IF(COUNTIF(Année1!$A$2:$A$100,\"<>\")>COUNTA($A$2:A238),Année1!A238,\"\")","v":""}]
[{"$f":"IF(COUNTIF(Année1!$A$2:$A$100,\"<>\")>COUNTA($A$2:A239),Année1!A239,\"\")","v":""}]
[{"$f":"IF(COUNTIF(Année1!$A$2:$A$100,\"<>\")>COUNTA($A$2:A240),Année1!A240,\"\")","v":""}]
[{"$f":"IF(COUNTIF(Année1!$A$2:$A$100,\"<>\")>COUNTA($A$2:A241),Année1!A241,\"\")","v":""}]
[{"$f":"IF(COUNTIF(Année1!$A$2:$A$100,\"<>\")>COUNTA($A$2:A242),Année1!A242,\"\")","v":""}]
[{"$f":"IF(COUNTIF(Année1!$A$2:$A$100,\"<>\")>COUNTA($A$2:A243),Année1!A243,\"\")","v":""}]
[{"$f":"IF(COUNTIF(Année1!$A$2:$A$100,\"<>\")>COUNTA($A$2:A244),Année1!A244,\"\")","v":""}]
[{"$f":"IF(COUNTIF(Année1!$A$2:$A$100,\"<>\")>COUNTA($A$2:A245),Année1!A245,\"\")","v":""}]
[{"$f":"IF(COUNTIF(Année1!$A$2:$A$100,\"<>\")>COUNTA($A$2:A246),Année1!A246,\"\")","v":""}]
[{"$f":"IF(COUNTIF(Année1!$A$2:$A$100,\"<>\")>COUNTA($A$2:A247),Année1!A247,\"\")","v":""}]
[{"$f":"IF(COUNTIF(Année1!$A$2:$A$100,\"<>\")>COUNTA($A$2:A248),Année1!A248,\"\")","v":""}]
[{"$f":"IF(COUNTIF(Année1!$A$2:$A$100,\"<>\")>COUNTA($A$2:A249),Année1!A249,\"\")","v":""}]
[{"$f":"IF(COUNTIF(Année1!$A$2:$A$100,\"<>\")>COUNTA($A$2:A250),Année1!A250,\"\")","v":""}]
[{"$f":"IF(COUNTIF(Année1!$A$2:$A$100,\"<>\")>COUNTA($A$2:A251),Année1!A251,\"\")","v":""}]
[{"$f":"IF(COUNTIF(Année1!$A$2:$A$100,\"<>\")>COUNTA($A$2:A252),Année1!A252,\"\")","v":""}]
[{"$f":"IF(COUNTIF(Année1!$A$2:$A$100,\"<>\")>COUNTA($A$2:A253),Année1!A253,\"\")","v":""}]
[{"$f":"IF(COUNTIF(Année1!$A$2:$A$100,\"<>\")>COUNTA($A$2:A254),Année1!A254,\"\")","v":""}]
[{"$f":"IF(COUNTIF(Année1!$A$2:$A$100,\"<>\")>COUNTA($A$2:A255),Année1!A255,\"\")","v":""}]
[{"$f":"IF(COUNTIF(Année1!$A$2:$A$100,\"<>\")>COUNTA($A$2:A256),Année1!A256,\"\")","v":""}]
[{"$f":"IF(COUNTIF(Année1!$A$2:$A$100,\"<>\")>COUNTA($A$2:A257),Année1!A257,\"\")","v":""}]
[{"$f":"IF(COUNTIF(Année1!$A$2:$A$100,\"<>\")>COUNTA($A$2:A258),Année1!A258,\"\")","v":""}]
[{"$f":"IF(COUNTIF(Année1!$A$2:$A$100,\"<>\")>COUNTA($A$2:A259),Année1!A259,\"\")","v":""}]
[{"$f":"IF(COUNTIF(Année1!$A$2:$A$100,\"<>\")>COUNTA($A$2:A260),Année1!A260,\"\")","v":""}]
[{"$f":"IF(COUNTIF(Année1!$A$2:$A$100,\"<>\")>COUNTA($A$2:A261),Année1!A261,\"\")","v":""}]
[{"$f":"IF(COUNTIF(Année1!$A$2:$A$100,\"<>\")>COUNTA($A$2:A262),Année1!A262,\"\")","v":""}]
[{"$f":"IF(COUNTIF(Année1!$A$2:$A$100,\"<>\")>COUNTA($A$2:A263),Année1!A263,\"\")","v":""}]
[{"$f":"IF(COUNTIF(Année1!$A$2:$A$100,\"<>\")>COUNTA($A$2:A264),Année1!A264,\"\")","v":""}]
[{"$f":"IF(COUNTIF(Année1!$A$2:$A$100,\"<>\")>COUNTA($A$2:A265),Année1!A265,\"\")","v":""}]
[{"$f":"IF(COUNTIF(Année1!$A$2:$A$100,\"<>\")>COUNTA($A$2:A266),Année1!A266,\"\")","v":""}]
[{"$f":"IF(COUNTIF(Année1!$A$2:$A$100,\"<>\")>COUNTA($A$2:A267),Année1!A267,\"\")","v":""}]
[{"$f":"IF(COUNTIF(Année1!$A$2:$A$100,\"<>\")>COUNTA($A$2:A268),Année1!A268,\"\")","v":""}]
[{"$f":"IF(COUNTIF(Année1!$A$2:$A$100,\"<>\")>COUNTA($A$2:A269),Année1!A269,\"\")","v":""}]
[{"$f":"IF(COUNTIF(Année1!$A$2:$A$100,\"<>\")>COUNTA($A$2:A270),Année1!A270,\"\")","v":""}]
[{"$f":"IF(COUNTIF(Année1!$A$2:$A$100,\"<>\")>COUNTA($A$2:A271),Année1!A271,\"\")","v":""}]
[{"$f":"IF(COUNTIF(Année1!$A$2:$A$100,\"<>\")>COUNTA($A$2:A272),Année1!A272,\"\")","v":""}]
[{"$f":"IF(COUNTIF(Année1!$A$2:$A$100,\"<>\")>COUNTA($A$2:A273),Année1!A273,\"\")","v":""}]
[{"$f":"IF(COUNTIF(Année1!$A$2:$A$100,\"<>\")>COUNTA($A$2:A274),Année1!A274,\"\")","v":""}]
[{"$f":"IF(COUNTIF(Année1!$A$2:$A$100,\"<>\")>COUNTA($A$2:A275),Année1!A275,\"\")","v":""}]
[{"$f":"IF(COUNTIF(Année1!$A$2:$A$100,\"<>\")>COUNTA($A$2:A276),Année1!A276,\"\")","v":""}]
[{"$f":"IF(COUNTIF(Année1!$A$2:$A$100,\"<>\")>COUNTA($A$2:A277),Année1!A277,\"\")","v":""}]
[{"$f":"IF(COUNTIF(Année1!$A$2:$A$100,\"<>\")>COUNTA($A$2:A278),Année1!A278,\"\")","v":""}]
[{"$f":"IF(COUNTIF(Année1!$A$2:$A$100,\"<>\")>COUNTA($A$2:A279),Année1!A279,\"\")","v":""}]
[{"$f":"IF(COUNTIF(Année1!$A$2:$A$100,\"<>\")>COUNTA($A$2:A280),Année1!A280,\"\")","v":""}]
[{"$f":"IF(COUNTIF(Année1!$A$2:$A$100,\"<>\")>COUNTA($A$2:A281),Année1!A281,\"\")","v":""}]
[{"$f":"IF(COUNTIF(Année1!$A$2:$A$100,\"<>\")>COUNTA($A$2:A282),Année1!A282,\"\")","v":""}]
[{"$f":"IF(COUNTIF(Année1!$A$2:$A$100,\"<>\")>COUNTA($A$2:A283),Année1!A283,\"\")","v":""}]
[{"$f":"IF(COUNTIF(Année1!$A$2:$A$100,\"<>\")>COUNTA($A$2:A284),Année1!A284,\"\")","v":""}]
[{"$f":"IF(COUNTIF(Année1!$A$2:$A$100,\"<>\")>COUNTA($A$2:A285),Année1!A285,\"\")","v":""}]
[{"$f":"IF(COUNTIF(Année1!$A$2:$A$100,\"<>\")>COUNTA($A$2:A286),Année1!A286,\"\")","v":""}]
[{"$f":"IF(COUNTIF(Année1!$A$2:$A$100,\"<>\")>COUNTA($A$2:A287),Année1!A287,\"\")","v":""}]
[{"$f":"IF(COUNTIF(Année1!$A$2:$A$100,\"<>\")>COUNTA($A$2:A288),Année1!A288,\"\")","v":""}]
[{"$f":"IF(COUNTIF(Année1!$A$2:$A$100,\"<>\")>COUNTA($A$2:A289),Année1!A289,\"\")","v":""}]
[{"$f":"IF(COUNTIF(Année1!$A$2:$A$100,\"<>\")>COUNTA($A$2:A290),Année1!A290,\"\")","v":""}]
[{"$f":"IF(COUNTIF(Année1!$A$2:$A$100,\"<>\")>COUNTA($A$2:A291),Année1!A291,\"\")","v":""}]
[{"$f":"IF(COUNTIF(Année1!$A$2:$A$100,\"<>\")>COUNTA($A$2:A292),Année1!A292,\"\")","v":""}]
[{"$f":"IF(COUNTIF(Année1!$A$2:$A$100,\"<>\")>COUNTA($A$2:A293),Année1!A293,\"\")","v":""}]
[{"$f":"IF(COUNTIF(Année1!$A$2:$A$100,\"<>\")>COUNTA($A$2:A294),Année1!A294,\"\")","v":""}]
[{"$f":"IF(COUNTIF(Année1!$A$2:$A$100,\"<>\")>COUNTA($A$2:A295),Année1!A295,\"\")","v":""}]
[{"$f":"IF(COUNTIF(Année1!$A$2:$A$100,\"<>\")>COUNTA($A$2:A296),Année1!A296,\"\")","v":""}]
[{"$f":"IF(COUNTIF(Année1!$A$2:$A$100,\"<>\")>COUNTA($A$2:A297),Année1!A297,\"\")","v":""}]
[{"$f":"IF(COUNTIF(Année1!$A$2:$A$100,\"<>\")>COUNTA($A$2:A298),Année1!A298,\"\")","v":""}]
[{"$f":"IF(COUNTIF(Année1!$A$2:$A$100,\"<>\")>COUNTA($A$2:A299),Année1!A299,\"\")","v":""}]
[{"$f":"IF(COUNTIF(Année1!$A$2:$A$100,\"<>\")>COUNTA($A$2:A300),Année1!A300,\"\")","v":""}]
[{"$f":"IF(COUNTIF(Année1!$A$2:$A$100,\"<>\")>COUNTA($A$2:A301),Année1!A301,\"\")","v":""}]
[{"$f":"IF(COUNTIF(Année1!$A$2:$A$100,\"<>\")>COUNTA($A$2:A302),Année1!A302,\"\")","v":""}]
[{"$f":"IF(COUNTIF(Année1!$A$2:$A$100,\"<>\")>COUNTA($A$2:A303),Année1!A303,\"\")","v":""}]
[{"$f":"IF(COUNTIF(Année1!$A$2:$A$100,\"<>\")>COUNTA($A$2:A304),Année1!A304,\"\")","v":""}]
[{"$f":"IF(COUNTIF(Année1!$A$2:$A$100,\"<>\")>COUNTA($A$2:A305),Année1!A305,\"\")","v":""}]
[{"$f":"IF(COUNTIF(Année1!$A$2:$A$100,\"<>\")>COUNTA($A$2:A306),Année1!A306,\"\")","v":""}]
[{"$f":"IF(COUNTIF(Année1!$A$2:$A$100,\"<>\")>COUNTA($A$2:A307),Année1!A307,\"\")","v":""}]
[{"$f":"IF(COUNTIF(Année1!$A$2:$A$100,\"<>\")>COUNTA($A$2:A308),Année1!A308,\"\")","v":""}]
[{"$f":"IF(COUNTIF(Année1!$A$2:$A$100,\"<>\")>COUNTA($A$2:A309),Année1!A309,\"\")","v":""}]
[{"$f":"IF(COUNTIF(Année1!$A$2:$A$100,\"<>\")>COUNTA($A$2:A310),Année1!A310,\"\")","v":""}]
[{"$f":"IF(COUNTIF(Année1!$A$2:$A$100,\"<>\")>COUNTA($A$2:A311),Année1!A311,\"\")","v":""}]
[{"$f":"IF(COUNTIF(Année1!$A$2:$A$100,\"<>\")>COUNTA($A$2:A312),Année1!A312,\"\")","v":""}]
[{"$f":"IF(COUNTIF(Année1!$A$2:$A$100,\"<>\")>COUNTA($A$2:A313),Année1!A313,\"\")","v":""}]
[{"$f":"IF(COUNTIF(Année1!$A$2:$A$100,\"<>\")>COUNTA($A$2:A314),Année1!A314,\"\")","v":""}]
[{"$f":"IF(COUNTIF(Année1!$A$2:$A$100,\"<>\")>COUNTA($A$2:A315),Année1!A315,\"\")","v":""}]
[{"$f":"IF(COUNTIF(Année1!$A$2:$A$100,\"<>\")>COUNTA($A$2:A316),Année1!A316,\"\")","v":""}]