{"text_format":"1","workbook":"xlsx","n_sheets":15,"sheets":["Renseignements","Ce que fait le tableau","Prévisionnel","Réel","Tableau baignade","Moyennes","Fréquentation globale","Fréquentation TA1","Fréquentation TA2","Fréquentation TA3","Prév-Réel","Comparaison G-F","Récap","Calculs","Global"],"not_rendered":{"charts":9,"images":23,"macros":1,"external_links":0,"defined_names":11,"comments":1,"pivot_tables":0},"unopened":[{"sheet":"Comparaison G-F","index":11,"reason":"not_a_worksheet"},{"sheet":"Global","index":14,"reason":"not_a_worksheet"}],"bounds":{"document_bytes":16777216,"sheet_cells":100000,"rows_first":2000,"rows_last":500,"rows_between":2000,"halvings":0,"cell_chars":16384,"cell_head_chars":4096},"cells_cut":0,"cells_raw":0,"read":"whole","date_system":"1900"}

{"sheet":"Renseignements","index":0,"n_rows":50,"n_cols":5,"rows_kept":50,"cut":false,"hidden":false,"merged":[[35,0,36,8],[49,0,49,8],[0,0,5,8],[6,0,7,8],[8,0,8,8],[10,1,10,5],[11,1,11,5],[19,1,19,3],[20,1,20,3],[22,1,22,3],[13,0,13,4],[18,0,18,3],[21,1,21,3],[23,1,23,3],[27,0,27,1],[26,0,26,1],[28,0,28,1],[29,0,29,1],[25,0,25,3],[26,2,26,3],[27,2,27,3],[28,2,28,3],[29,2,29,3]]}
["Informations"]
[]
[]
[]
[]
[]
["L'utilisation de ce tableau se veut simple et accessible à tous !\nMerci de nous faire parvenir vos remarques et améliorations éventuelles par courriel"]
[]
["admin@lanimetvous.com"]
[]
["Période :","Vacances de Février"]
["Date :","2016-02-23"]
[]
["Tranches d'âge (TA)"]
["Tranches d'âge 1 (TA1)",4,"-",5,"ans"]
["Tranches d'âge 2 (TA2)",6,"-",11,"ans"]
["Tranches d'âge 3 (TA3)",12,"-",17,"ans"]
[]
["Durée :"]
["Durée de fonctionnement du matin",4]
["Durée de fonctionnement de l'après-midi :",4]
["Durée de fonctionnement de la soirée :",4]
["Une journée dure au maximum",{"$f":"SUM(B20:D22)","v":12}]
["Durée de fonctionnement d'un séjour :",10]
[]
["Taux d'occupation (TO)"]
["Taux d'occupation maximum du matin :",null,12]
["Taux d'occupation maximum de l'après-midi :",null,13]
["Taux d'occupation maximum de la soirée :",null,14]
["Taux d'occupation maximum d'un séjour :",null,15]
[]
[]
[]
[]
[]
["Les dons pour l'association sont les bienvenus"]
[]
[]
[]
[]
[]
[]
[]
[]
[]
[]
[]
[]
[]
["Merci à la communauté CCM pour son soutien technique"]

{"sheet":"Ce que fait le tableau","index":1,"n_rows":31,"n_cols":11,"rows_kept":31,"cut":false,"hidden":false,"merged":[[0,0,1,13],[23,2,23,13],[12,3,12,7],[13,3,13,7],[14,3,14,7],[8,9,8,13],[9,10,9,13],[10,10,10,13],[11,10,11,13],[24,0,29,13],[30,0,30,13],[5,9,5,13],[7,0,7,13],[22,0,22,13],[8,2,8,7],[9,3,9,7],[10,3,10,7],[11,3,11,7]]}
["Ce que fait ce tableau :"]
[]
["Tranches d'âge :",null,null,null,null,null,null,"Moyennes :"]
[null,"·","Renseignez les tranches d'âge de votre structure",null,null,null,null,null,"·","Moyenne du nombre de garçons et de filles"]
[null,null,null,null,null,null,null,null,"·","Moyenne du nombre d'enfant pour chaque semaine"]
[null,null,null,null,null,null,null,null,"·","Moyenne du nombre d'enfant pour la totalité du séjour"]
[]
["Fréquentations :"]
[null,"·","Fréquentation globale",null,null,null,null,null,"·","Fréquentation par tranche d'âge"]
[null,null,"·","En demi-journée pour chaque semaine",null,null,null,null,null,"·","En heure"]
[null,null,"·","En demi-journée pour la totalité du séjour",null,null,null,null,null,"·","En journée"]
[null,null,"·","En journée pour chaque semaine",null,null,null,null,null,"·","En demi-journée"]
[null,null,"·","En journée pour la totalité du séjour"]
[null,null,"·","En heure pour chaque semaine"]
[null,null,"·","En heure pour la totalité du séjour"]
[]
["Pourcentages :",null,null,null,null,null,null,"Différence Prévisionnel/Réel :"]
[null,"·","Fréquentation par semaine par tranche d'âge",null,null,null,null,null,"·","Calcul de la différence entre l'effectif prévisionnel et le réel"]
[]
["Tableau baignade :"]
[null,"·","Intégration d'un tableau de baignade"]
[]
["Base de donnée :"]
[null,"·","Possibilité d'utilisation d'une base de donnée"]
["        Le fichier comportant les informations doit impérativement s'intituler \"bdd.xlsx\"et se trouver dans le même dossier que celui où se trouve ce fichier ! En l'absence du fichier de base de données, il ne vous sera pas possible d'ajouter d'enfant depuis une base de données. Il reste cependant possible d'utiliser le fichier.\n     Le fichier de base de donnée est livré avec le fichier de pointage. Les deux fichiers doivent se trouver dans le même dossier."]
[]
[]
[]
[]
[]
["plus d'aide à propos de son utilisation…"]

{"sheet":"Prévisionnel","index":2,"n_rows":29,"n_cols":88,"rows_kept":29,"cut":false,"hidden":false,"merged":[[6,7,6,26],[7,4,8,4],[7,5,8,5],[7,3,8,3],[6,87,8,87],[7,6,8,6],[7,7,7,10],[7,11,7,14],[7,15,7,18],[7,19,7,22],[7,23,7,26],[6,27,6,46],[7,27,7,30],[7,31,7,34],[7,35,7,38],[7,39,7,42],[7,0,8,0],[7,1,8,1],[7,2,8,2],[1,0,1,2],[1,4,1,6],[2,0,2,2],[2,4,2,6],[7,43,7,46],[6,47,6,66],[7,47,7,50],[7,51,7,54],[7,55,7,58],[7,59,7,62],[7,63,7,66],[6,67,6,86],[7,67,7,70],[7,71,7,74],[7,75,7,78],[7,79,7,82],[7,83,7,86]]}
[]
["Date du premier jour du séjour :",null,null,null,"Période :"]
[{"$f":"Renseignements!B12","v":"2016-02-23"},null,null,null,{"$f":"Renseignements!B11","v":"Vacances de Février"}]
[]
[]
[]
[null,null,null,null,null,null,null,"Semaine 1",null,null,null,null,null,null,null,null,null,null,null,null,null,null,null,null,null,null,null,"Semaine 2",null,null,null,null,null,null,null,null,null,null,null,null,null,null,null,null,null,null,null,"Semaine 3",null,null,null,null,null,null,null,null,null,null,null,null,null,null,null,null,null,null,null,"Semaine 4",null,null,null,null,null,null,null,null,null,null,null,null,null,null,null,null,null,null,null,"TOT"]
["NOM","Prénom","Date de naissance","Sexe","Régime","Âge","Tranche d'âge","2016-10-24",null,null,null,"2016-10-25",null,null,null,"2016-10-26",null,null,null,"2016-10-27",null,null,null,"2016-10-28",null,null,null,"2016-10-29",null,null,null,"2016-10-30",null,null,null,"2016-10-31",null,null,null,"2016-11-01",null,null,null,"2016-11-02",null,null,null,"2016-11-03",null,null,null,"2016-11-04",null,null,null,"2016-11-05",null,null,null,"2016-11-06",null,null,null,"2016-11-07",null,null,null,"2016-11-08",null,null,null,"2016-11-09",null,null,null,"2016-11-10",null,null,null,"2016-11-11",null,null,null,"2016-11-12"]
[null,null,null,null,null,null,null,"m","am","s","sé",{"$f":"H9","v":"m"},"am","s","sé","m","am","s","sé","m","am","s","sé","m","am","s","sé","m","am","s","sé","m","am","s","sé","m","am","s","sé","m","am","s","sé",{"$f":"AN9","v":"m"},"am","s","sé","m","am","s","sé","m","am","s","sé","m","am","s","sé","m","am","s","sé","m","am","s","sé","m","am","s","sé","m","am","s","sé",{"$f":"BT9","v":"m"},"am","s","sé","m","am","s","sé","m","am","s","sé"]
["TAIEB","Michel","2013-08-01","G","CAF",{"$f":"IF(C10<>\"\",DATEDIF(C10,$A$3,\"y\"),\"\")","v":2},{"$f":"IF(C10=\"\",\"\",IF(F10<Renseignements!$B$15,\"Autres\",IF(F10<Renseignements!$B$16,Renseignements!$B$15&\" \"&Renseignements!$C$15&\" \"&Renseignements!$D$15&\" \"&Renseignements!$E$15,IF(F10<Renseignements!$B$17,Renseignements!$B$16&\" \"&Renseignements!$C$16&\" \"&Renseignements!$D$16&\" \"&Renseignements!$E$16,IF(F10<=Renseignements!$D$17,Renseignements!$B$17&\" \"&Renseignements!$C$17&\" \"&Renseignements!$D$17&\" \"&Renseignements!$E$17,\"Autres\")))))","v":"Autres"},null,null,null,null,null,null,null,null,null,null,null,null,null,null,null,null,null,null,null,null,null,null,null,null,null,null,null,null,null,null,null,null,null,null,null,null,null,null,null,null,null,null,null,null,null,null,null,null,null,null,null,null,null,null,null,null,null,null,null,null,null,null,null,null,null,null,null,null,null,null,null,null,null,null,null,null,null,null,null,null,{"$f":"SUBTOTAL(3,H10:AA10)","v":0}]
["TAIEB","Michel","2013-08-01","G","CAF",{"$f":"IF(C11<>\"\",DATEDIF(C11,$A$3,\"y\"),\"\")","v":2},{"$f":"IF(C11=\"\",\"\",IF(F11<Renseignements!$B$15,\"Autres\",IF(F11<Renseignements!$B$16,Renseignements!$B$15&\" \"&Renseignements!$C$15&\" \"&Renseignements!$D$15&\" \"&Renseignements!$E$15,IF(F11<Renseignements!$B$17,Renseignements!$B$16&\" \"&Renseignements!$C$16&\" \"&Renseignements!$D$16&\" \"&Renseignements!$E$16,IF(F11<=Renseignements!$D$17,Renseignements!$B$17&\" \"&Renseignements!$C$17&\" \"&Renseignements!$D$17&\" \"&Renseignements!$E$17,\"Autres\")))))","v":"Autres"},null,null,null,null,null,null,null,null,null,null,null,null,null,null,null,null,null,null,null,null,null,null,null,null,null,null,null,null,null,null,null,null,null,null,null,null,null,null,null,null,null,null,null,null,null,null,null,null,null,null,null,null,null,null,null,null,null,null,null,null,null,null,null,null,null,null,null,null,null,null,null,null,null,null,null,null,null,null,null,null,{"$f":"SUBTOTAL(3,H11:AA11)","v":0}]
["TAIEB","Michel","2013-08-01","G","CAF",{"$f":"IF(C12<>\"\",DATEDIF(C12,$A$3,\"y\"),\"\")","v":2},{"$f":"IF(C12=\"\",\"\",IF(F12<Renseignements!$B$15,\"Autres\",IF(F12<Renseignements!$B$16,Renseignements!$B$15&\" \"&Renseignements!$C$15&\" \"&Renseignements!$D$15&\" \"&Renseignements!$E$15,IF(F12<Renseignements!$B$17,Renseignements!$B$16&\" \"&Renseignements!$C$16&\" \"&Renseignements!$D$16&\" \"&Renseignements!$E$16,IF(F12<=Renseignements!$D$17,Renseignements!$B$17&\" \"&Renseignements!$C$17&\" \"&Renseignements!$D$17&\" \"&Renseignements!$E$17,\"Autres\")))))","v":"Autres"},null,null,null,null,null,null,null,null,null,null,null,null,null,null,null,null,null,null,null,null,null,null,null,null,null,null,null,null,null,null,null,null,null,null,null,null,null,null,null,null,null,null,null,null,null,null,null,null,null,null,null,null,null,null,null,null,null,null,null,null,null,null,null,null,null,null,null,null,null,null,null,null,null,null,null,null,null,null,null,null,{"$f":"SUBTOTAL(3,H12:AA12)","v":0}]
["ILARDO","Sylvie","1998-03-01","F","CAF",{"$f":"IF(C13<>\"\",DATEDIF(C13,$A$3,\"y\"),\"\")","v":17},{"$f":"IF(C13=\"\",\"\",IF(F13<Renseignements!$B$15,\"Autres\",IF(F13<Renseignements!$B$16,Renseignements!$B$15&\" \"&Renseignements!$C$15&\" \"&Renseignements!$D$15&\" \"&Renseignements!$E$15,IF(F13<Renseignements!$B$17,Renseignements!$B$16&\" \"&Renseignements!$C$16&\" \"&Renseignements!$D$16&\" \"&Renseignements!$E$16,IF(F13<=Renseignements!$D$17,Renseignements!$B$17&\" \"&Renseignements!$C$17&\" \"&Renseignements!$D$17&\" \"&Renseignements!$E$17,\"Autres\")))))","v":"12 - 17 ans"},"x","x",null,null,null,null,null,null,null,null,null,null,null,null,null,null,null,null,null,null,null,null,null,null,null,null,null,null,null,null,null,null,null,null,null,null,null,null,null,null,null,null,null,null,null,null,null,null,null,null,null,null,null,null,null,null,null,null,null,null,null,null,null,null,null,null,null,null,null,null,null,null,null,null,null,null,null,null,null,null,{"$f":"SUBTOTAL(3,H13:AA13)","v":2}]
[null,null,null,null,null,{"$f":"IF(C14<>\"\",DATEDIF(C14,$A$3,\"y\"),\"\")","v":""},{"$f":"IF(C14=\"\",\"\",IF(F14<Renseignements!$B$15,\"Autres\",IF(F14<Renseignements!$B$16,Renseignements!$B$15&\" \"&Renseignements!$C$15&\" \"&Renseignements!$D$15&\" \"&Renseignements!$E$15,IF(F14<Renseignements!$B$17,Renseignements!$B$16&\" \"&Renseignements!$C$16&\" \"&Renseignements!$D$16&\" \"&Renseignements!$E$16,IF(F14<=Renseignements!$D$17,Renseignements!$B$17&\" \"&Renseignements!$C$17&\" \"&Renseignements!$D$17&\" \"&Renseignements!$E$17,\"Autres\")))))","v":""},null,null,null,null,null,null,null,null,null,null,null,null,null,null,null,null,null,null,null,null,null,null,null,null,null,null,null,null,null,null,null,null,null,null,null,null,null,null,null,null,null,null,null,null,null,null,null,null,null,null,null,null,null,null,null,null,null,null,null,null,null,null,null,null,null,null,null,null,null,null,null,null,null,null,null,null,null,null,null,null,{"$f":"SUBTOTAL(3,H14:AA14)","v":0}]
[null,null,null,null,null,"Total",{"$f":"SUM(G16:G19)","v":4},{"$f":"SUM(H16:H19)","v":1},{"$f":"SUM(I16:I19)","v":1},{"$f":"SUM(J16:J19)","v":0},0,0,0,0,0,{"$f":"SUM(P16:P19)","v":0},0,0,0,0,0,0,0,0,0,0,0,{"$f":"SUM(AB16:AB19)","v":0},{"$f":"SUM(AC16:AC19)","v":0},0,0,0,0,0,0,0,0,0,0,0,0,0,0,0,0,0,0,{"$f":"SUM(AV16:AV19)","v":0},{"$f":"SUM(AW16:AW19)","v":0},0,0,0,0,0,0,0,0,0,0,0,0,0,0,0,0,0,0,{"$f":"SUM(BP16:BP19)","v":0},{"$f":"SUM(BQ16:BQ19)","v":0},0,0,0,0,0,0,0,0,0,0,0,0,0,0,0,0,0,0]
[null,null,null,null,null,{"$f":"Renseignements!$B$15&\" \"&Renseignements!$C$15&\" \"&Renseignements!$D$15&\" \"&Renseignements!$E$15","v":"4 - 5 ans"},{"$f":"COUNTIF(G$9:G$14,$F16)","v":0},{"$f":"SUMPRODUCT(($G$9:$G$14=$F16)*(H$9:H$14=\"x\"))","v":0},0,0,0,0,0,0,0,0,0,{"$f":"SUMPRODUCT(($G$9:$G$14=$F16)*(R$9:R$14=\"x\"))","v":0},0,0,0,0,0,0,0,0,0,{"$f":"SUMPRODUCT(($G$9:$G$14=$F16)*(AB$9:AB$14=\"x\"))","v":0},0,0,0,0,0,0,0,0,0,{"$f":"SUMPRODUCT(($G$9:$G$14=$F16)*(AL$9:AL$14=\"x\"))","v":0},0,0,0,0,0,0,0,0,0,{"$f":"SUMPRODUCT(($G$9:$G$14=$F16)*(AV$9:AV$14=\"x\"))","v":0},0,0,0,0,0,0,0,0,0,{"$f":"SUMPRODUCT(($G$9:$G$14=$F16)*(BF$9:BF$14=\"x\"))","v":0},0,0,0,0,0,0,0,0,0,{"$f":"SUMPRODUCT(($G$9:$G$14=$F16)*(BP$9:BP$14=\"x\"))","v":0},0,0,0,0,0,0,0,0,0,{"$f":"SUMPRODUCT(($G$9:$G$14=$F16)*(BZ$9:BZ$14=\"x\"))","v":0},0,0,0,0,0,0,0,0,0]
[null,null,null,null,null,{"$f":"Renseignements!$B$16&\" \"&Renseignements!$C$16&\" \"&Renseignements!$D$16&\" \"&Renseignements!$E$16","v":"6 - 11 ans"},{"$f":"COUNTIF(G$9:G$14,$F17)","v":0},0,0,0,0,0,0,0,0,0,0,0,0,0,0,0,0,0,0,0,0,0,0,0,0,0,0,0,0,0,0,0,0,0,0,0,0,0,0,0,0,0,0,0,0,0,0,0,0,0,0,0,0,0,0,0,0,0,0,0,0,0,0,0,0,0,0,0,0,0,0,0,0,0,0,0,0,0,0,0,0]
[null,null,null,null,null,{"$f":"Renseignements!$B$17&\" \"&Renseignements!$C$17&\" \"&Renseignements!$D$17&\" \"&Renseignements!$E$17","v":"12 - 17 ans"},{"$f":"COUNTIF(G$9:G$14,$F18)","v":1},1,1,0,0,0,0,0,0,0,0,0,0,0,0,0,0,0,0,0,0,0,0,0,0,0,0,0,0,0,0,0,0,0,0,0,0,0,0,0,0,0,0,0,0,0,0,0,0,0,0,0,0,0,0,0,0,0,0,0,0,0,0,0,0,0,0,0,0,0,0,0,0,0,0,0,0,0,0,0,0]
[null,null,null,null,null,"Autres",{"$f":"COUNTIF(G$9:G$14,$F19)","v":3},0,0,0,0,0,0,0,0,0,0,0,0,0,0,0,0,0,0,0,0,0,0,0,0,0,0,0,0,0,0,0,0,0,0,0,0,0,0,0,0,0,0,0,0,0,0,0,0,0,0,0,0,0,0,0,0,0,0,0,0,0,0,0,0,0,0,0,0,0,0,0,0,0,0,0,0,0,0,0,0]
[null,null,null,null,null,"Garçons",{"$f":"COUNTIF(D$9:D$14,\"G\")","v":3},{"$f":"SUMPRODUCT(($D$9:$D$14=\"G\")*(H$9:H$14=\"x\"))","v":0},0,0,0,0,0,0,0,0,0,0,0,0,0,0,0,0,0,0,0,0,0,0,0,0,0,0,0,0,0,0,0,{"$f":"SUMPRODUCT(($D$9:$D$14=\"G\")*(AN$9:AN$14=\"x\"))","v":0},0,0,0,0,0,0,0,0,0,0,0,0,0,0,0,0,0,0,0,0,0,0,0,0,0,0,0,0,0,0,0,{"$f":"SUMPRODUCT(($D$9:$D$14=\"G\")*(BT$9:BT$14=\"x\"))","v":0},0,0,0,0,0,0,0,0,0,0,0,0,0,0,0]
[null,null,null,null,null,{"$f":"F16","v":"4 - 5 ans"},{"$f":"SUMPRODUCT(($G$9:$G$14=F21)*($D$9:$D$14=\"G\"))","v":0},{"$f":"SUMPRODUCT(($D$9:$D$14=\"G\")*($G$9:$G$14=$F21)*(H$9:H$14=\"x\"))","v":0},0,0,0,0,0,0,0,0,0,{"$f":"SUMPRODUCT(($D$9:$D$14=\"G\")*($G$9:$G$14=$F21)*(R$9:R$14=\"x\"))","v":0},0,0,0,0,0,0,0,0,0,{"$f":"SUMPRODUCT(($D$9:$D$14=\"G\")*($G$9:$G$14=$F21)*(AB$9:AB$14=\"x\"))","v":0},0,0,0,0,0,0,0,0,0,{"$f":"SUMPRODUCT(($D$9:$D$14=\"G\")*($G$9:$G$14=$F21)*(AL$9:AL$14=\"x\"))","v":0},0,0,0,0,0,0,0,0,0,{"$f":"SUMPRODUCT(($D$9:$D$14=\"G\")*($G$9:$G$14=$F21)*(AV$9:AV$14=\"x\"))","v":0},0,0,0,0,0,0,0,0,0,{"$f":"SUMPRODUCT(($D$9:$D$14=\"G\")*($G$9:$G$14=$F21)*(BF$9:BF$14=\"x\"))","v":0},0,0,0,0,0,0,0,0,0,{"$f":"SUMPRODUCT(($D$9:$D$14=\"G\")*($G$9:$G$14=$F21)*(BP$9:BP$14=\"x\"))","v":0},0,0,0,0,0,0,0,0,0,{"$f":"SUMPRODUCT(($D$9:$D$14=\"G\")*($G$9:$G$14=$F21)*(BZ$9:BZ$14=\"x\"))","v":0},0,0,0,0,0,0,0,0,0]
[null,null,null,null,null,{"$f":"F17","v":"6 - 11 ans"},{"$f":"SUMPRODUCT(($G$9:$G$14=F22)*($D$9:$D$14=\"G\"))","v":0},0,0,0,0,0,0,0,0,0,0,0,0,0,0,0,0,0,0,0,0,0,0,0,0,0,0,0,0,0,0,0,0,0,0,0,0,0,0,0,0,0,0,0,0,0,0,0,0,0,0,0,0,0,0,0,0,0,0,0,0,0,0,0,0,0,0,0,0,0,0,0,0,0,0,0,0,0,0,0,0]
[null,null,null,null,null,{"$f":"F18","v":"12 - 17 ans"},{"$f":"SUMPRODUCT(($G$9:$G$14=F23)*($D$9:$D$14=\"G\"))","v":0},0,0,0,0,0,0,0,0,0,0,0,0,0,0,0,0,0,0,0,0,0,0,0,0,0,0,0,0,0,0,0,0,0,0,0,0,0,0,0,0,0,0,0,0,0,0,0,0,0,0,0,0,0,0,0,0,0,0,0,0,0,0,0,0,0,0,0,0,0,0,0,0,0,0,0,0,0,0,0,0]
[null,null,null,null,null,{"$f":"F19","v":"Autres"},{"$f":"SUMPRODUCT(($G$9:$G$14=F24)*($D$9:$D$14=\"G\"))","v":3},0,0,0,0,0,0,0,0,0,0,0,0,0,0,0,0,0,0,0,0,0,0,0,0,0,0,0,0,0,0,0,0,0,0,0,0,0,0,0,0,0,0,0,0,0,0,0,0,0,0,0,0,0,0,0,0,0,0,0,0,0,0,0,0,0,0,0,0,0,0,0,0,0,0,0,0,0,0,0,0]
[null,null,null,null,null,"Filles",{"$f":"COUNTIF(D$9:D$14,\"F\")","v":1},{"$f":"SUMPRODUCT(($D$9:$D$14=\"F\")*(H$9:H$14=\"x\"))","v":1},1,0,0,0,0,0,0,0,0,0,0,0,0,0,0,0,0,0,0,0,0,0,0,0,0,0,0,0,0,0,0,{"$f":"SUMPRODUCT(($D$9:$D$14=\"F\")*(AN$9:AN$14=\"x\"))","v":0},0,0,0,0,0,0,0,0,0,0,0,0,0,0,0,0,0,0,0,0,0,0,0,0,0,0,0,0,0,0,0,{"$f":"SUMPRODUCT(($D$9:$D$14=\"F\")*(BT$9:BT$14=\"x\"))","v":0},0,0,0,0,0,0,0,0,0,0,0,0,0,0,0]
[null,null,null,null,null,{"$f":"F16","v":"4 - 5 ans"},{"$f":"SUMPRODUCT(($G$9:$G$14=F26)*($D$9:$D$14=\"F\"))","v":0},{"$f":"SUMPRODUCT(($D$9:$D$14=\"F\")*($G$9:$G$14=$F26)*(H$9:H$14=\"x\"))","v":0},0,0,0,0,0,0,0,0,0,{"$f":"SUMPRODUCT(($D$9:$D$14=\"F\")*($G$9:$G$14=$F26)*(R$9:R$14=\"x\"))","v":0},0,0,0,0,0,0,0,0,0,{"$f":"SUMPRODUCT(($D$9:$D$14=\"F\")*($G$9:$G$14=$F26)*(AB$9:AB$14=\"x\"))","v":0},0,0,0,0,0,0,0,0,0,{"$f":"SUMPRODUCT(($D$9:$D$14=\"F\")*($G$9:$G$14=$F26)*(AL$9:AL$14=\"x\"))","v":0},0,0,0,0,0,0,0,0,0,{"$f":"SUMPRODUCT(($D$9:$D$14=\"F\")*($G$9:$G$14=$F26)*(AV$9:AV$14=\"x\"))","v":0},0,0,0,0,0,0,0,0,0,{"$f":"SUMPRODUCT(($D$9:$D$14=\"F\")*($G$9:$G$14=$F26)*(BF$9:BF$14=\"x\"))","v":0},0,0,0,0,0,0,0,0,0,{"$f":"SUMPRODUCT(($D$9:$D$14=\"F\")*($G$9:$G$14=$F26)*(BP$9:BP$14=\"x\"))","v":0},0,0,0,0,0,0,0,0,0,{"$f":"SUMPRODUCT(($D$9:$D$14=\"F\")*($G$9:$G$14=$F26)*(BZ$9:BZ$14=\"x\"))","v":0},0,0,0,0,0,0,0,0,0]
[null,null,null,null,null,{"$f":"F17","v":"6 - 11 ans"},{"$f":"SUMPRODUCT(($G$9:$G$14=F27)*($D$9:$D$14=\"F\"))","v":0},0,0,0,0,0,0,0,0,0,0,0,0,0,0,0,0,0,0,0,0,0,0,0,0,0,0,0,0,0,0,0,0,0,0,0,0,0,0,0,0,0,0,0,0,0,0,0,0,0,0,0,0,0,0,0,0,0,0,0,0,0,0,0,0,0,0,0,0,0,0,0,0,0,0,0,0,0,0,0,0]
[null,null,null,null,null,{"$f":"F18","v":"12 - 17 ans"},{"$f":"SUMPRODUCT(($G$9:$G$14=F28)*($D$9:$D$14=\"F\"))","v":1},1,1,0,0,0,0,0,0,0,0,0,0,0,0,0,0,0,0,0,0,0,0,0,0,0,0,0,0,0,0,0,0,0,0,0,0,0,0,0,0,0,0,0,0,0,0,0,0,0,0,0,0,0,0,0,0,0,0,0,0,0,0,0,0,0,0,0,0,0,0,0,0,0,0,0,0,0,0,0,0]
[null,null,null,null,null,{"$f":"F19","v":"Autres"},{"$f":"SUMPRODUCT(($G$9:$G$14=F29)*($D$9:$D$14=\"F\"))","v":0},0,0,0,0,0,0,0,0,0,0,0,0,0,0,0,0,0,0,0,0,0,0,0,0,0,0,0,0,0,0,0,0,0,0,0,0,0,0,0,0,0,0,0,0,0,0,0,0,0,0,0,0,0,0,0,0,0,0,0,0,0,0,0,0,0,0,0,0,0,0,0,0,0,0,0,0,0,0,0,0]

{"sheet":"Réel","index":3,"n_rows":29,"n_cols":88,"rows_kept":29,"cut":false,"hidden":false,"merged":[[6,87,8,87],[7,19,7,22],[7,23,7,26],[6,7,6,26],[7,7,7,10],[7,11,7,14],[7,15,7,18],[7,27,7,30],[7,31,7,34],[7,35,7,38],[7,39,7,42],[7,43,7,46],[6,27,6,46],[6,47,6,66],[6,67,6,86],[7,47,7,50],[7,4,8,4],[1,0,1,2],[2,0,2,2],[7,0,8,0],[7,1,8,1],[7,2,8,2],[2,4,2,6],[1,4,1,6],[7,5,8,5],[7,6,8,6],[7,3,8,3],[7,71,7,74],[7,75,7,78],[7,79,7,82],[7,83,7,86],[7,51,7,54],[7,55,7,58],[7,59,7,62],[7,63,7,66],[7,67,7,70]]}
[]
["Date du premier jour du séjour :",null,null,null,"Période :"]
[{"$f":"Renseignements!B12","v":"2016-02-23"},null,null,null,{"$f":"Renseignements!B11","v":"Vacances de Février"}]
[]
[]
[]
[null,null,null,null,null,null,null,"Semaine 1",null,null,null,null,null,null,null,null,null,null,null,null,null,null,null,null,null,null,null,"Semaine 2",null,null,null,null,null,null,null,null,null,null,null,null,null,null,null,null,null,null,null,"Semaine 3",null,null,null,null,null,null,null,null,null,null,null,null,null,null,null,null,null,null,null,"Semaine 4",null,null,null,null,null,null,null,null,null,null,null,null,null,null,null,null,null,null,null,"TOT"]
["NOM","Prénom","Date de naissance","Sexe","Régime","Âge","Tranche d'âge",{"$f":"Prévisionnel!H8","v":"2016-10-24"},null,null,null,{"$f":"Prévisionnel!L8","v":"2016-10-25"},null,null,null,{"$f":"Prévisionnel!P8","v":"2016-10-26"},null,null,null,{"$f":"Prévisionnel!T8","v":"2016-10-27"},null,null,null,{"$f":"Prévisionnel!X8","v":"2016-10-28"},null,null,null,{"$f":"Prévisionnel!AB8","v":"2016-10-29"},null,null,null,{"$f":"Prévisionnel!AF8","v":"2016-10-30"},null,null,null,{"$f":"Prévisionnel!AJ8","v":"2016-10-31"},null,null,null,{"$f":"Prévisionnel!AN8","v":"2016-11-01"},null,null,null,{"$f":"Prévisionnel!AR8","v":"2016-11-02"},null,null,null,{"$f":"Prévisionnel!AV8","v":"2016-11-03"},null,null,null,{"$f":"Prévisionnel!AZ8","v":"2016-11-04"},null,null,null,{"$f":"Prévisionnel!BD8","v":"2016-11-05"},null,null,null,{"$f":"Prévisionnel!BH8","v":"2016-11-06"},null,null,null,{"$f":"Prévisionnel!BL8","v":"2016-11-07"},null,null,null,{"$f":"Prévisionnel!BP8","v":"2016-11-08"},null,null,null,{"$f":"Prévisionnel!BT8","v":"2016-11-09"},null,null,null,{"$f":"Prévisionnel!BX8","v":"2016-11-10"},null,null,null,{"$f":"Prévisionnel!CB8","v":"2016-11-11"},null,null,null,{"$f":"Prévisionnel!CF8","v":"2016-11-12"}]
[null,null,null,null,null,null,null,"m","am","s","sé","m","am","s","sé","m","am","s","sé","m","am","s","sé","m","am","s","sé","m","am","s","sé","m","am","s","sé","m","am","s","sé","m","am","s","sé","m","am","s","sé","m","am","s","sé","m","am","s","sé","m","am","s","sé","m","am","s","sé","m","am","s","sé","m","am","s","sé","m","am","s","sé","m","am","s","sé","m","am","s","sé","m","am","s","sé"]
["TAIEB","Michel","2013-08-01","G","CAF",{"$f":"IF(C10<>\"\",DATEDIF(C10,$A$3,\"y\"),\"\")","v":2},{"$f":"IF(C10=\"\",\"\",IF(F10<Renseignements!$B$15,\"Autres\",IF(F10<Renseignements!$B$16,Renseignements!$B$15&\" \"&Renseignements!$C$15&\" \"&Renseignements!$D$15&\" \"&Renseignements!$E$15,IF(F10<Renseignements!$B$17,Renseignements!$B$16&\" \"&Renseignements!$C$16&\" \"&Renseignements!$D$16&\" \"&Renseignements!$E$16,IF(F10<=Renseignements!$D$17,Renseignements!$B$17&\" \"&Renseignements!$C$17&\" \"&Renseignements!$D$17&\" \"&Renseignements!$E$17,\"Autres\")))))","v":"Autres"},null,null,null,null,null,null,null,null,null,null,null,null,null,null,null,null,null,null,null,null,null,null,null,null,null,null,null,null,null,null,null,null,null,null,null,null,null,null,null,null,null,null,null,null,null,null,null,null,null,null,null,null,null,null,null,null,null,null,null,null,null,null,null,null,null,null,null,null,null,null,null,null,null,null,null,null,null,null,null,null,{"$f":"SUBTOTAL(3,H10:AU10)","v":0}]
["TAIEB","Michel","2013-08-01","G","CAF",{"$f":"IF(C11<>\"\",DATEDIF(C11,$A$3,\"y\"),\"\")","v":2},{"$f":"IF(C11=\"\",\"\",IF(F11<Renseignements!$B$15,\"Autres\",IF(F11<Renseignements!$B$16,Renseignements!$B$15&\" \"&Renseignements!$C$15&\" \"&Renseignements!$D$15&\" \"&Renseignements!$E$15,IF(F11<Renseignements!$B$17,Renseignements!$B$16&\" \"&Renseignements!$C$16&\" \"&Renseignements!$D$16&\" \"&Renseignements!$E$16,IF(F11<=Renseignements!$D$17,Renseignements!$B$17&\" \"&Renseignements!$C$17&\" \"&Renseignements!$D$17&\" \"&Renseignements!$E$17,\"Autres\")))))","v":"Autres"},null,null,null,null,null,null,null,null,null,null,null,null,null,null,null,null,null,null,null,null,null,null,null,null,null,null,null,null,null,null,null,null,null,null,null,null,null,null,null,null,null,null,null,null,null,null,null,null,null,null,null,null,null,null,null,null,null,null,null,null,null,null,null,null,null,null,null,null,null,null,null,null,null,null,null,null,null,null,null,null,{"$f":"SUBTOTAL(3,H11:AU11)","v":0}]
["TAIEB","Michel","2013-08-01","G","CAF",{"$f":"IF(C12<>\"\",DATEDIF(C12,$A$3,\"y\"),\"\")","v":2},{"$f":"IF(C12=\"\",\"\",IF(F12<Renseignements!$B$15,\"Autres\",IF(F12<Renseignements!$B$16,Renseignements!$B$15&\" \"&Renseignements!$C$15&\" \"&Renseignements!$D$15&\" \"&Renseignements!$E$15,IF(F12<Renseignements!$B$17,Renseignements!$B$16&\" \"&Renseignements!$C$16&\" \"&Renseignements!$D$16&\" \"&Renseignements!$E$16,IF(F12<=Renseignements!$D$17,Renseignements!$B$17&\" \"&Renseignements!$C$17&\" \"&Renseignements!$D$17&\" \"&Renseignements!$E$17,\"Autres\")))))","v":"Autres"},null,null,null,null,null,null,null,null,null,null,null,null,null,null,null,null,null,null,null,null,null,null,null,null,null,null,null,null,null,null,null,null,null,null,null,null,null,null,null,null,null,null,null,null,null,null,null,null,null,null,null,null,null,null,null,null,null,null,null,null,null,null,null,null,null,null,null,null,null,null,null,null,null,null,null,null,null,null,null,null,{"$f":"SUBTOTAL(3,H12:AU12)","v":0}]
["KAC","Christine","1998-03-01","F","CAF",{"$f":"IF(C13<>\"\",DATEDIF(C13,$A$3,\"y\"),\"\")","v":17},{"$f":"IF(C13=\"\",\"\",IF(F13<Renseignements!$B$15,\"Autres\",IF(F13<Renseignements!$B$16,Renseignements!$B$15&\" \"&Renseignements!$C$15&\" \"&Renseignements!$D$15&\" \"&Renseignements!$E$15,IF(F13<Renseignements!$B$17,Renseignements!$B$16&\" \"&Renseignements!$C$16&\" \"&Renseignements!$D$16&\" \"&Renseignements!$E$16,IF(F13<=Renseignements!$D$17,Renseignements!$B$17&\" \"&Renseignements!$C$17&\" \"&Renseignements!$D$17&\" \"&Renseignements!$E$17,\"Autres\")))))","v":"12 - 17 ans"},"x",null,null,null,null,null,null,null,null,null,null,null,null,null,null,null,null,null,null,null,null,null,null,null,null,null,null,null,null,null,null,null,null,null,null,null,null,null,null,null,null,null,null,null,null,null,null,null,null,null,null,null,null,null,null,null,null,null,null,null,null,null,null,null,null,null,null,null,null,null,null,null,null,null,null,null,null,null,null,null,{"$f":"SUBTOTAL(3,H13:AU13)","v":1}]
[null,null,null,null,null,{"$f":"IF(C14<>\"\",DATEDIF(C14,$A$3,\"y\"),\"\")","v":""},{"$f":"IF(C14=\"\",\"\",IF(F14<Renseignements!$B$15,\"Autres\",IF(F14<Renseignements!$B$16,Renseignements!$B$15&\" \"&Renseignements!$C$15&\" \"&Renseignements!$D$15&\" \"&Renseignements!$E$15,IF(F14<Renseignements!$B$17,Renseignements!$B$16&\" \"&Renseignements!$C$16&\" \"&Renseignements!$D$16&\" \"&Renseignements!$E$16,IF(F14<=Renseignements!$D$17,Renseignements!$B$17&\" \"&Renseignements!$C$17&\" \"&Renseignements!$D$17&\" \"&Renseignements!$E$17,\"Autres\")))))","v":""},null,null,null,null,null,null,null,null,null,null,null,null,null,null,null,null,null,null,null,null,null,null,null,null,null,null,null,null,null,null,null,null,null,null,null,null,null,null,null,null,null,null,null,null,null,null,null,null,null,null,null,null,null,null,null,null,null,null,null,null,null,null,null,null,null,null,null,null,null,null,null,null,null,null,null,null,null,null,null,null,{"$f":"SUBTOTAL(3,H14:AU14)","v":0}]
[null,null,null,null,null,"Total",{"$f":"SUM(G16:G19)","v":4},{"$f":"SUM(H16:H19)","v":1},{"$f":"SUM(I16:I19)","v":0},0,0,0,0,0,0,0,0,0,0,0,0,0,0,0,0,0,0,0,0,0,0,0,0,0,0,0,0,0,0,0,0,0,0,0,0,0,0,{"$f":"SUM(AV16:AV19)","v":0},0,0,0,0,0,0,0,0,0,0,0,0,0,0,0,0,0,0,0,0,0,0,0,0,0,0,0,0,0,0,0,0,0,0,0,0,0,0,0]
[null,null,null,null,null,{"$f":"Renseignements!$B$15&\" \"&Renseignements!$C$15&\" \"&Renseignements!$D$15&\" \"&Renseignements!$E$15","v":"4 - 5 ans"},{"$f":"COUNTIF(G$9:G$14,$F16)","v":0},{"$f":"SUMPRODUCT(($G$9:$G$14=$F16)*(H$9:H$14=\"x\"))","v":0},0,0,0,0,0,0,0,0,0,{"$f":"SUMPRODUCT(($G$9:$G$14=$F16)*(R$9:R$14=\"x\"))","v":0},0,0,0,0,0,0,0,0,0,{"$f":"SUMPRODUCT(($G$9:$G$14=$F16)*(AB$9:AB$14=\"x\"))","v":0},0,0,0,0,0,0,0,0,0,{"$f":"SUMPRODUCT(($G$9:$G$14=$F16)*(AL$9:AL$14=\"x\"))","v":0},0,0,0,0,0,0,0,0,0,{"$f":"SUMPRODUCT(($G$9:$G$14=$F16)*(AV$9:AV$14=\"x\"))","v":0},0,0,0,0,0,0,0,0,0,{"$f":"SUMPRODUCT(($G$9:$G$14=$F16)*(BF$9:BF$14=\"x\"))","v":0},0,0,0,0,0,0,0,0,0,{"$f":"SUMPRODUCT(($G$9:$G$14=$F16)*(BP$9:BP$14=\"x\"))","v":0},0,0,0,0,0,0,0,0,0,{"$f":"SUMPRODUCT(($G$9:$G$14=$F16)*(BZ$9:BZ$14=\"x\"))","v":0},0,0,0,0,0,0,0,0,0]
[null,null,null,null,null,{"$f":"Renseignements!$B$16&\" \"&Renseignements!$C$16&\" \"&Renseignements!$D$16&\" \"&Renseignements!$E$16","v":"6 - 11 ans"},{"$f":"COUNTIF(G$9:G$14,$F17)","v":0},0,0,0,0,0,0,0,0,0,0,0,0,0,0,0,0,0,0,0,0,0,0,0,0,0,0,0,0,0,0,0,0,0,0,0,0,0,0,0,0,0,0,0,0,0,0,0,0,0,0,0,0,0,0,0,0,0,0,0,0,0,0,0,0,0,0,0,0,0,0,0,0,0,0,0,0,0,0,0,0]
[null,null,null,null,null,{"$f":"Renseignements!$B$17&\" \"&Renseignements!$C$17&\" \"&Renseignements!$D$17&\" \"&Renseignements!$E$17","v":"12 - 17 ans"},{"$f":"COUNTIF(G$9:G$14,$F18)","v":1},1,0,0,0,0,0,0,0,0,0,0,0,0,0,0,0,0,0,0,0,0,0,0,0,0,0,0,0,0,0,0,0,0,0,0,0,0,0,0,0,0,0,0,0,0,0,0,0,0,0,0,0,0,0,0,0,0,0,0,0,0,0,0,0,0,0,0,0,0,0,0,0,0,0,0,0,0,0,0,0]
[null,null,null,null,null,"Autres",{"$f":"COUNTIF(G$9:G$14,$F19)","v":3},0,0,0,0,0,0,0,0,0,0,0,0,0,0,0,0,0,0,0,0,0,0,0,0,0,0,0,0,0,0,0,0,0,0,0,0,0,0,0,0,0,0,0,0,0,0,0,0,0,0,0,0,0,0,0,0,0,0,0,0,0,0,0,0,0,0,0,0,0,0,0,0,0,0,0,0,0,0,0,0]
[null,null,null,null,null,"Garçons",{"$f":"COUNTIF(D$9:D$14,\"G\")","v":3},{"$f":"SUMPRODUCT(($D$9:$D$14=\"G\")*(H$9:H$14=\"x\"))","v":0},0,0,0,0,0,0,0,0,0,0,0,0,0,0,0,0,0,0,0,0,0,0,0,0,0,0,0,0,0,0,0,{"$f":"SUMPRODUCT(($D$9:$D$14=\"G\")*(AN$9:AN$14=\"x\"))","v":0},0,0,0,0,0,0,0,0,0,0,0,0,0,0,0,0,0,0,0,0,0,0,0,0,0,0,0,0,0,0,0,{"$f":"SUMPRODUCT(($D$9:$D$14=\"G\")*(BT$9:BT$14=\"x\"))","v":0},0,0,0,0,0,0,0,0,0,0,0,0,0,0,0]
[null,null,null,null,null,{"$f":"F16","v":"4 - 5 ans"},{"$f":"SUMPRODUCT(($G$9:$G$14=F21)*($D$9:$D$14=\"G\"))","v":0},{"$f":"SUMPRODUCT(($D$9:$D$14=\"G\")*($G$9:$G$14=$F21)*(H$9:H$14=\"x\"))","v":0},0,0,0,0,0,0,0,0,0,{"$f":"SUMPRODUCT(($D$9:$D$14=\"G\")*($G$9:$G$14=$F21)*(R$9:R$14=\"x\"))","v":0},0,0,0,0,0,0,0,0,0,{"$f":"SUMPRODUCT(($D$9:$D$14=\"G\")*($G$9:$G$14=$F21)*(AB$9:AB$14=\"x\"))","v":0},0,0,0,0,0,0,0,0,0,{"$f":"SUMPRODUCT(($D$9:$D$14=\"G\")*($G$9:$G$14=$F21)*(AL$9:AL$14=\"x\"))","v":0},0,0,0,0,0,0,0,0,0,{"$f":"SUMPRODUCT(($D$9:$D$14=\"G\")*($G$9:$G$14=$F21)*(AV$9:AV$14=\"x\"))","v":0},0,0,0,0,0,0,0,0,0,{"$f":"SUMPRODUCT(($D$9:$D$14=\"G\")*($G$9:$G$14=$F21)*(BF$9:BF$14=\"x\"))","v":0},0,0,0,0,0,0,0,0,0,{"$f":"SUMPRODUCT(($D$9:$D$14=\"G\")*($G$9:$G$14=$F21)*(BP$9:BP$14=\"x\"))","v":0},0,0,0,0,0,0,0,0,0,{"$f":"SUMPRODUCT(($D$9:$D$14=\"G\")*($G$9:$G$14=$F21)*(BZ$9:BZ$14=\"x\"))","v":0},0,0,0,0,0,0,0,0,0]
[null,null,null,null,null,{"$f":"F17","v":"6 - 11 ans"},{"$f":"SUMPRODUCT(($G$9:$G$14=F22)*($D$9:$D$14=\"G\"))","v":0},0,0,0,0,0,0,0,0,0,0,0,0,0,0,0,0,0,0,0,0,0,0,0,0,0,0,0,0,0,0,0,0,0,0,0,0,0,0,0,0,0,0,0,0,0,0,0,0,0,0,0,0,0,0,0,0,0,0,0,0,0,0,0,0,0,0,0,0,0,0,0,0,0,0,0,0,0,0,0,0]
[null,null,null,null,null,{"$f":"F18","v":"12 - 17 ans"},{"$f":"SUMPRODUCT(($G$9:$G$14=F23)*($D$9:$D$14=\"G\"))","v":0},0,0,0,0,0,0,0,0,0,0,0,0,0,0,0,0,0,0,0,0,0,0,0,0,0,0,0,0,0,0,0,0,0,0,0,0,0,0,0,0,0,0,0,0,0,0,0,0,0,0,0,0,0,0,0,0,0,0,0,0,0,0,0,0,0,0,0,0,0,0,0,0,0,0,0,0,0,0,0,0]
[null,null,null,null,null,{"$f":"F19","v":"Autres"},{"$f":"SUMPRODUCT(($G$9:$G$14=F24)*($D$9:$D$14=\"G\"))","v":3},0,0,0,0,0,0,0,0,0,0,0,0,0,0,0,0,0,0,0,0,0,0,0,0,0,0,0,0,0,0,0,0,0,0,0,0,0,0,0,0,0,0,0,0,0,0,0,0,0,0,0,0,0,0,0,0,0,0,0,0,0,0,0,0,0,0,0,0,0,0,0,0,0,0,0,0,0,0,0,0]
[null,null,null,null,null,"Filles",{"$f":"COUNTIF(D$9:D$14,\"F\")","v":1},{"$f":"SUMPRODUCT(($D$9:$D$14=\"F\")*(H$9:H$14=\"x\"))","v":1},0,0,0,0,0,0,0,0,0,0,0,0,0,0,0,0,0,0,0,0,0,0,0,0,0,0,0,0,0,0,0,{"$f":"SUMPRODUCT(($D$9:$D$14=\"F\")*(AN$9:AN$14=\"x\"))","v":0},0,0,0,0,0,0,0,0,0,0,0,0,0,0,0,0,0,0,0,0,0,0,0,0,0,0,0,0,0,0,0,{"$f":"SUMPRODUCT(($D$9:$D$14=\"F\")*(BT$9:BT$14=\"x\"))","v":0},0,0,0,0,0,0,0,0,0,0,0,0,0,0,0]
[null,null,null,null,null,{"$f":"F16","v":"4 - 5 ans"},{"$f":"SUMPRODUCT(($G$9:$G$14=F26)*($D$9:$D$14=\"F\"))","v":0},{"$f":"SUMPRODUCT(($D$9:$D$14=\"F\")*($G$9:$G$14=$F26)*(H$9:H$14=\"x\"))","v":0},0,0,0,0,0,0,0,0,0,{"$f":"SUMPRODUCT(($D$9:$D$14=\"F\")*($G$9:$G$14=$F26)*(R$9:R$14=\"x\"))","v":0},0,0,0,0,0,0,0,0,0,{"$f":"SUMPRODUCT(($D$9:$D$14=\"F\")*($G$9:$G$14=$F26)*(AB$9:AB$14=\"x\"))","v":0},0,0,0,0,0,0,0,0,0,{"$f":"SUMPRODUCT(($D$9:$D$14=\"F\")*($G$9:$G$14=$F26)*(AL$9:AL$14=\"x\"))","v":0},0,0,0,0,0,0,0,0,0,{"$f":"SUMPRODUCT(($D$9:$D$14=\"F\")*($G$9:$G$14=$F26)*(AV$9:AV$14=\"x\"))","v":0},0,0,0,0,0,0,0,0,0,{"$f":"SUMPRODUCT(($D$9:$D$14=\"F\")*($G$9:$G$14=$F26)*(BF$9:BF$14=\"x\"))","v":0},0,0,0,0,0,0,0,0,0,{"$f":"SUMPRODUCT(($D$9:$D$14=\"F\")*($G$9:$G$14=$F26)*(BP$9:BP$14=\"x\"))","v":0},0,0,0,0,0,0,0,0,0,{"$f":"SUMPRODUCT(($D$9:$D$14=\"F\")*($G$9:$G$14=$F26)*(BZ$9:BZ$14=\"x\"))","v":0},0,0,0,0,0,0,0,0,0]
[null,null,null,null,null,{"$f":"F17","v":"6 - 11 ans"},{"$f":"SUMPRODUCT(($G$9:$G$14=F27)*($D$9:$D$14=\"F\"))","v":0},0,0,0,0,0,0,0,0,0,0,0,0,0,0,0,0,0,0,0,0,0,0,0,0,0,0,0,0,0,0,0,0,0,0,0,0,0,0,0,0,0,0,0,0,0,0,0,0,0,0,0,0,0,0,0,0,0,0,0,0,0,0,0,0,0,0,0,0,0,0,0,0,0,0,0,0,0,0,0,0]
[null,null,null,null,null,{"$f":"F18","v":"12 - 17 ans"},{"$f":"SUMPRODUCT(($G$9:$G$14=F28)*($D$9:$D$14=\"F\"))","v":1},1,0,0,0,0,0,0,0,0,0,0,0,0,0,0,0,0,0,0,0,0,0,0,0,0,0,0,0,0,0,0,0,0,0,0,0,0,0,0,0,0,0,0,0,0,0,0,0,0,0,0,0,0,0,0,0,0,0,0,0,0,0,0,0,0,0,0,0,0,0,0,0,0,0,0,0,0,0,0,0]
[null,null,null,null,null,{"$f":"F19","v":"Autres"},{"$f":"SUMPRODUCT(($G$9:$G$14=F29)*($D$9:$D$14=\"F\"))","v":0},0,0,0,0,0,0,0,0,0,0,0,0,0,0,0,0,0,0,0,0,0,0,0,0,0,0,0,0,0,0,0,0,0,0,0,0,0,0,0,0,0,0,0,0,0,0,0,0,0,0,0,0,0,0,0,0,0,0,0,0,0,0,0,0,0,0,0,0,0,0,0,0,0,0,0,0,0,0,0,0]

{"sheet":"Tableau baignade","index":4,"n_rows":36,"n_cols":15,"rows_kept":36,"cut":false,"hidden":false,"merged":[[13,8,13,10],[13,11,13,12],[14,13,14,14],[14,5,14,6],[6,1,6,2],[7,1,7,2],[13,0,13,2],[13,3,13,4],[6,3,6,5],[3,1,3,2],[3,4,3,7],[4,1,4,2],[4,4,4,7],[0,0,1,14],[25,0,25,2],[25,3,25,4],[25,8,25,10],[25,11,25,12],[14,3,15,3],[14,4,15,4],[14,9,15,9],[14,10,15,10],[14,11,15,11],[14,12,15,12],[24,0,24,6],[24,8,24,14],[14,0,15,0],[14,1,15,1],[14,2,15,2],[14,8,15,8],[26,13,26,14],[26,0,27,0],[26,1,27,1],[26,2,27,2],[26,3,27,3],[26,4,27,4],[26,5,26,6],[26,8,27,8],[26,9,27,9],[26,10,27,10],[26,11,27,11],[26,12,27,12]]}
["ALSH : TABLEAU NAGEURS/NON NAGEURS"]
[]
[null,"Rappel :"]
[null,"Un animateur pour",null,5,"enfants de moins de",null,null,null,6,"ans"]
[null,{"$f":"B4","v":"Un animateur pour"},null,8,{"$f":"E4","v":"enfants de moins de"},null,null,null,{"$f":"I4","v":6},{"$f":"J4","v":"ans"}]
[]
[null,"Date de réservation",null,"2016-08-23"]
[null,"Nom de la structure",null,"ALSH"]
[null,"Adresse :",null,"RUE DES ENFANTS"]
[null,"Tél :",null,"00 00 00 00 00 - 06 00 00 00 00"]
[null,"Fax :",null,"00 00 00 00 00"]
[null,"Nom du responsable :",null,"Jean MARTIN"]
[]
["Prénom et NOM de l'animateur :",null,null,"BERKATI David",null,"+","-",null,"Prénom et NOM de l'animateur :",null,null,null,null,"+","-"]
["N°","NOM","Prénom","Date de naissance","Âge","Nageurs",null,null,"N°","NOM","Prénom","Date de naissance","Âge","Nageurs"]
[null,null,null,null,null,"Oui","Non",null,null,null,null,null,null,"Oui","Non"]
[1,null,null,null,null,null,null,null,1]
[2,null,null,null,null,null,null,null,2]
[3,null,null,null,null,null,null,null,3]
[4,null,null,null,null,null,null,null,4]
[5,null,null,null,null,null,null,null,5]
[6,null,null,null,null,null,null,null,6]
[7,null,null,null,null,null,null,null,7]
[8,null,null,null,null,null,null,null,8]
[]
["Prénom et NOM de l'animateur :",null,null,null,null,"+","-",null,"Prénom et NOM de l'animateur :",null,null,null,null,"+","-"]
["N°","NOM","Prénom","Date de naissance","Âge","Nageurs",null,null,"N°","NOM","Prénom","Date de naissance","Âge","Nageurs"]
[null,null,null,null,null,"Oui","Non",null,null,null,null,null,null,"Oui","Non"]
[1,null,null,null,null,null,null,null,1]
[2,null,null,null,null,null,null,null,2]
[3,null,null,null,null,null,null,null,3]
[4,null,null,null,null,null,null,null,4]
[5,null,null,null,null,null,null,null,5]
[6,null,null,null,null,null,null,null,6]
[7,null,null,null,null,null,null,null,7]
[8,null,null,null,null,null,null,null,8]

{"sheet":"Moyennes","index":5,"n_rows":85,"n_cols":7,"rows_kept":85,"cut":false,"hidden":false,"merged":[[55,1,57,1],[55,4,55,5],[56,4,56,5],[27,0,42,0],[43,0,58,0],[27,1,29,1],[31,1,33,1],[35,1,37,1],[39,1,41,1],[35,4,35,5],[36,4,36,5],[37,4,37,5],[39,4,39,5],[31,4,31,5],[41,4,41,5],[33,4,33,5],[84,4,84,7],[71,1,73,1],[71,4,71,5],[72,4,72,5],[73,4,73,5],[81,0,81,7],[82,4,82,7],[76,0,79,0],[77,4,77,7],[78,4,78,7],[79,4,79,7],[59,0,74,0],[59,1,61,1],[59,4,59,5],[60,4,60,5],[63,1,65,1],[63,4,63,5],[64,4,64,5],[65,4,65,5],[83,4,83,7],[67,1,69,1],[67,4,67,5],[68,4,68,5],[76,4,76,7],[69,4,69,5],[82,0,82,1],[83,0,83,1],[51,1,53,1],[51,4,51,5],[52,4,52,5],[53,4,53,5],[1,0,1,4],[2,0,2,4],[4,0,7,7],[9,0,9,7],[43,1,45,1],[43,4,43,5],[44,4,44,5],[45,4,45,5],[32,4,32,5],[23,4,23,5],[24,4,24,5],[25,4,25,5],[18,4,18,5],[47,1,49,1],[47,4,47,5],[48,4,48,5],[49,4,49,5],[40,4,40,5],[27,4,27,5],[28,4,28,5],[29,4,29,5],[20,4,20,5],[21,4,21,5],[84,0,84,1],[57,4,57,5],[61,4,61,5],[11,0,25,0],[19,1,21,1],[23,1,25,1],[11,1,13,1],[11,4,11,5],[12,4,12,5],[13,4,13,5],[15,1,17,1],[15,4,15,5],[16,4,16,5],[17,4,17,5],[19,4,19,5],[14,4,14,5]]}
[]
["Période :"]
[{"$f":"Renseignements!B11","v":"Vacances de Février"}]
[]
["Les feuilles suivantes sont en lecture seule. \nAucune modification ne doit y être apportée. \nLes calculs se font automatiquements."]
[]
[]
[]
[]
["Moyennes :"]
[null,null,"Prév","Réel"]
["Semaine 1","Matin",{"$f":"AVERAGE(Prévisionnel!H15,Prévisionnel!L15,Prévisionnel!P15,Prévisionnel!T15,Prévisionnel!X15)","v":0.2},{"$f":"AVERAGE(Réel!H15,Réel!L15,Réel!P15,Réel!T15,Réel!X15)","v":0.2},"enfant de moyenne ",null,"par matin"]
[null,null,{"$f":"AVERAGE(Prévisionnel!H25,Prévisionnel!L25,Prévisionnel!P25,Prévisionnel!T25,Prévisionnel!X25)","v":0.2},{"$f":"AVERAGE(Réel!H25,Réel!L25,Réel!P25,Réel!T25,Réel!X25)","v":0.2},"filles en moyenne",null,{"$f":"G12","v":"par matin"}]
[null,null,{"$f":"AVERAGE(Prévisionnel!H20,Prévisionnel!L20,Prévisionnel!P20,Prévisionnel!T20,Prévisionnel!X20)","v":0},{"$f":"AVERAGE(Réel!H20,Réel!L20,Réel!P20,Réel!T20,Réel!X20)","v":0},"garçons en moyenne",null,{"$f":"G12","v":"par matin"}]
[null,"TO",{"$f":"AVERAGE(Prévisionnel!H15,Prévisionnel!L15,Prévisionnel!P15,Prévisionnel!T15,Prévisionnel!X15)/Renseignements!C27","v":1.6666666666666666E-2},{"$f":"AVERAGE(Réel!H15,Réel!L15,Réel!P15,Réel!T15,Réel!X15)/Renseignements!C27","v":1.6666666666666666E-2},"Taux d'occupation moyen",null,{"$f":"G12","v":"par matin"}]
[null,"Après-midi",{"$f":"AVERAGE(Prévisionnel!I15,Prévisionnel!M15,Prévisionnel!Q15,Prévisionnel!U15,Prévisionnel!Y15)","v":0.2},{"$f":"AVERAGE(Réel!I15,Réel!M15,Réel!Q15,Réel!U15,Réel!Y15)","v":0},{"$f":"E12","v":"enfant de moyenne "},null,"par après-midi"]
[null,null,{"$f":"AVERAGE(Prévisionnel!I25,Prévisionnel!M25,Prévisionnel!Q25,Prévisionnel!U25,Prévisionnel!Y25)","v":0.2},{"$f":"AVERAGE(Réel!I25,Réel!M25,Réel!Q25,Réel!U25,Réel!Y25)","v":0},"filles en moyenne",null,{"$f":"G16","v":"par après-midi"}]
[null,null,{"$f":"AVERAGE(Prévisionnel!I20,Prévisionnel!M20,Prévisionnel!Q20,Prévisionnel!U20,Prévisionnel!Y20)","v":0},{"$f":"AVERAGE(Réel!I20,Réel!M20,Réel!Q20,Réel!U20,Réel!Y20)","v":0},"garçons en moyenne",null,{"$f":"G16","v":"par après-midi"}]
[null,"TO",{"$f":"AVERAGE(Prévisionnel!I15,Prévisionnel!M15,Prévisionnel!Q15,Prévisionnel!U15,Prévisionnel!Y15)/Renseignements!C28","v":1.5384615384615385E-2},{"$f":"AVERAGE(Réel!I15,Réel!M15,Réel!Q15,Réel!U15,Réel!Y15)/Renseignements!C28","v":0},{"$f":"E15","v":"Taux d'occupation moyen"},null,{"$f":"G16","v":"par après-midi"}]
[null,"Soirée",{"$f":"AVERAGE(Prévisionnel!J15,Prévisionnel!N15,Prévisionnel!R15,Prévisionnel!V15,Prévisionnel!Z15)","v":0},{"$f":"AVERAGE(Réel!J15,Réel!N15,Réel!R15,Réel!V15,Réel!Z15)","v":0},{"$f":"E12","v":"enfant de moyenne "},null,"par soirée"]
[null,null,{"$f":"AVERAGE(Prévisionnel!J25,Prévisionnel!N25,Prévisionnel!R25,Prévisionnel!V25,Prévisionnel!Z25)","v":0},{"$f":"AVERAGE(Réel!J25,Réel!N25,Réel!R25,Réel!V25,Réel!Z25)","v":0},"filles en moyenne",null,{"$f":"G20","v":"par soirée"}]
[null,null,{"$f":"AVERAGE(Prévisionnel!J20,Prévisionnel!N20,Prévisionnel!R20,Prévisionnel!V20,Prévisionnel!Z20)","v":0},{"$f":"AVERAGE(Réel!J20,Réel!N20,Réel!R20,Réel!V20,Réel!Z20)","v":0},"garçons en moyenne",null,{"$f":"G20","v":"par soirée"}]
[null,"TO",{"$f":"AVERAGE(Prévisionnel!J15,Prévisionnel!N15,Prévisionnel!R15,Prévisionnel!V15,Prévisionnel!Z15)/Renseignements!C29","v":0},{"$f":"AVERAGE(Réel!J15,Réel!N15,Réel!R15,Réel!V15,Réel!Z15)/Renseignements!C29","v":0},{"$f":"E15","v":"Taux d'occupation moyen"},null,{"$f":"G20","v":"par soirée"}]
[null,"Séjour",{"$f":"AVERAGE(Prévisionnel!K15,Prévisionnel!O15,Prévisionnel!S15,Prévisionnel!W15,Prévisionnel!AA15)","v":0},{"$f":"AVERAGE(Réel!K15,Réel!O15,Réel!S15,Réel!W15,Réel!AA15)","v":0},{"$f":"E12","v":"enfant de moyenne "},null,"par séjour"]
[null,null,{"$f":"AVERAGE(Prévisionnel!K25,Prévisionnel!O25,Prévisionnel!S25,Prévisionnel!W25,Prévisionnel!AA25)","v":0},{"$f":"AVERAGE(Réel!K25,Réel!O25,Réel!S25,Réel!W25,Réel!AA25)","v":0},"filles en moyenne",null,{"$f":"G24","v":"par séjour"}]
[null,null,{"$f":"AVERAGE(Prévisionnel!K20,Prévisionnel!O20,Prévisionnel!S20,Prévisionnel!W20,Prévisionnel!AA20)","v":0},{"$f":"AVERAGE(Réel!K20,Réel!O20,Réel!S20,Réel!W20,Réel!AA20)","v":0},"garçons en moyenne",null,{"$f":"G24","v":"par séjour"}]
[null,"TO",{"$f":"AVERAGE(Prévisionnel!K15,Prévisionnel!O15,Prévisionnel!S15,Prévisionnel!W15,Prévisionnel!AA15)/Renseignements!C30","v":0},{"$f":"AVERAGE(Réel!K15,Réel!O15,Réel!S15,Réel!W15,Réel!AA15)/Renseignements!C30","v":0},{"$f":"E15","v":"Taux d'occupation moyen"},null,{"$f":"G24","v":"par séjour"}]
["Semaine 2",{"$f":"B12","v":"Matin"},{"$f":"AVERAGE(Prévisionnel!AB15,Prévisionnel!AF15,Prévisionnel!AJ15,Prévisionnel!AN15,Prévisionnel!AR15)","v":0},{"$f":"AVERAGE(Réel!AB15,Réel!AF15,Réel!AJ15,Réel!AN15,Réel!AR15)","v":0},{"$f":"E12","v":"enfant de moyenne "},null,{"$f":"G12","v":"par matin"}]
[null,null,{"$f":"AVERAGE(Prévisionnel!AB25,Prévisionnel!AF25,Prévisionnel!AJ25,Prévisionnel!AN25,Prévisionnel!AR25)","v":0},{"$f":"AVERAGE(Réel!AB25,Réel!AF25,Réel!AJ25,Réel!AN25,Réel!AR25)","v":0},"filles en moyenne",null,{"$f":"G28","v":"par matin"}]
[null,null,{"$f":"AVERAGE(Prévisionnel!AB20,Prévisionnel!AF20,Prévisionnel!AJ20,Prévisionnel!AN20,Prévisionnel!AR20)","v":0},{"$f":"AVERAGE(Réel!AB20,Réel!AF20,Réel!AJ20,Réel!AN20,Réel!AR20)","v":0},"garçons en moyenne",null,{"$f":"G28","v":"par matin"}]
[null,"TO",{"$f":"AVERAGE(Prévisionnel!AB15,Prévisionnel!AF15,Prévisionnel!AJ15,Prévisionnel!AN15,Prévisionnel!AR15)/Renseignements!C27","v":0},{"$f":"AVERAGE(Réel!AB15,Réel!AF15,Réel!AJ15,Réel!AN15,Réel!AR15)/Renseignements!C27","v":0},{"$f":"E27","v":"Taux d'occupation moyen"},null,{"$f":"G28","v":"par matin"}]
[null,{"$f":"B16","v":"Après-midi"},{"$f":"AVERAGE(Prévisionnel!AC15,Prévisionnel!AG15,Prévisionnel!AK15,Prévisionnel!AO15,Prévisionnel!AS15)","v":0},{"$f":"AVERAGE(Réel!AC15,Réel!AG15,Réel!AK15,Réel!AO15,Réel!AS15)","v":0},{"$f":"E12","v":"enfant de moyenne "},null,{"$f":"G16","v":"par après-midi"}]
[null,null,{"$f":"AVERAGE(Prévisionnel!AC25,Prévisionnel!AG25,Prévisionnel!AK25,Prévisionnel!AO25,Prévisionnel!AS25)","v":0},{"$f":"AVERAGE(Réel!AC25,Réel!AG25,Réel!AK25,Réel!AO25,Réel!AS25)","v":0},"filles en moyenne",null,{"$f":"G32","v":"par après-midi"}]
[null,null,{"$f":"AVERAGE(Prévisionnel!AC20,Prévisionnel!AG20,Prévisionnel!AK20,Prévisionnel!AO20,Prévisionnel!AS20)","v":0},{"$f":"AVERAGE(Réel!AC20,Réel!AG20,Réel!AK20,Réel!AO20,Réel!AS20)","v":0},"garçons en moyenne",null,{"$f":"G32","v":"par après-midi"}]
[null,"TO",{"$f":"AVERAGE(Prévisionnel!AC15,Prévisionnel!AG15,Prévisionnel!AK15,Prévisionnel!AO15,Prévisionnel!AS15)/Renseignements!C28","v":0},{"$f":"AVERAGE(Réel!AC15,Réel!AG15,Réel!AK15,Réel!AO15,Réel!AS15)/Renseignements!C28","v":0},{"$f":"E31","v":"Taux d'occupation moyen"},null,{"$f":"G32","v":"par après-midi"}]
[null,{"$f":"B20","v":"Soirée"},{"$f":"AVERAGE(Prévisionnel!AD15,Prévisionnel!AH15,Prévisionnel!AL15,Prévisionnel!AP15,Prévisionnel!AT15)","v":0},{"$f":"AVERAGE(Réel!AD15,Réel!AH15,Réel!AL15,Réel!AP15,Réel!AT15)","v":0},{"$f":"E12","v":"enfant de moyenne "},null,{"$f":"G20","v":"par soirée"}]
[null,null,{"$f":"AVERAGE(Prévisionnel!AD25,Prévisionnel!AH25,Prévisionnel!AL25,Prévisionnel!AP25,Prévisionnel!AT25)","v":0},{"$f":"AVERAGE(Réel!AD25,Réel!AH25,Réel!AL25,Réel!AP25,Réel!AT25)","v":0},"filles en moyenne",null,{"$f":"G36","v":"par soirée"}]
[null,null,{"$f":"AVERAGE(Prévisionnel!AD20,Prévisionnel!AH20,Prévisionnel!AL20,Prévisionnel!AP20,Prévisionnel!AT20)","v":0},{"$f":"AVERAGE(Réel!AD20,Réel!AH20,Réel!AL20,Réel!AP20,Réel!AT20)","v":0},"garçons en moyenne",null,{"$f":"G36","v":"par soirée"}]
[null,"TO",{"$f":"AVERAGE(Prévisionnel!AD15,Prévisionnel!AH15,Prévisionnel!AL15,Prévisionnel!AP15,Prévisionnel!AT15)/Renseignements!C29","v":0},{"$f":"AVERAGE(Réel!AD15,Réel!AH15,Réel!AL15,Réel!AP15,Réel!AT15)/Renseignements!C29","v":0},{"$f":"E35","v":"Taux d'occupation moyen"},null,{"$f":"G36","v":"par soirée"}]
[null,{"$f":"B24","v":"Séjour"},{"$f":"AVERAGE(Prévisionnel!AE15,Prévisionnel!AI15,Prévisionnel!AM15,Prévisionnel!AQ15,Prévisionnel!AU15)","v":0},{"$f":"AVERAGE(Réel!AE15,Réel!AI15,Réel!AM15,Réel!AQ15,Réel!AU15)","v":0},{"$f":"E12","v":"enfant de moyenne "},null,{"$f":"G24","v":"par séjour"}]
[null,null,{"$f":"AVERAGE(Prévisionnel!AE25,Prévisionnel!AI25,Prévisionnel!AM25,Prévisionnel!AQ25,Prévisionnel!AU25)","v":0},{"$f":"AVERAGE(Réel!AE25,Réel!AI25,Réel!AM25,Réel!AQ25,Réel!AU25)","v":0},"filles en moyenne",null,{"$f":"G40","v":"par séjour"}]
[null,null,{"$f":"AVERAGE(Prévisionnel!AE20,Prévisionnel!AI20,Prévisionnel!AM20,Prévisionnel!AQ20,Prévisionnel!AU20)","v":0},{"$f":"AVERAGE(Réel!AE20,Réel!AI20,Réel!AM20,Réel!AQ20,Réel!AU20)","v":0},"garçons en moyenne",null,{"$f":"G40","v":"par séjour"}]
[null,"TO",{"$f":"AVERAGE(Prévisionnel!AE15,Prévisionnel!AI15,Prévisionnel!AM15,Prévisionnel!AQ15,Prévisionnel!AU15)/Renseignements!C30","v":0},{"$f":"AVERAGE(Réel!AE15,Réel!AI15,Réel!AM15,Réel!AQ15,Réel!AU15)/Renseignements!C30","v":0},{"$f":"E39","v":"Taux d'occupation moyen"},null,{"$f":"G40","v":"par séjour"}]
["Semaine 3",{"$f":"B28","v":"Matin"},{"$f":"AVERAGE(Prévisionnel!AV15,Prévisionnel!AZ15,Prévisionnel!BD15,Prévisionnel!BH15,Prévisionnel!BL15)","v":0},{"$f":"AVERAGE(Réel!AV15,Réel!AZ15,Réel!BD15,Réel!BH15,Réel!BL15)","v":0},{"$f":"E12","v":"enfant de moyenne "},null,{"$f":"G28","v":"par matin"}]
[null,null,{"$f":"AVERAGE(Prévisionnel!AV25,Prévisionnel!AZ25,Prévisionnel!BD25,Prévisionnel!BH25,Prévisionnel!BL25)","v":0},{"$f":"AVERAGE(Réel!AV25,Réel!AZ25,Réel!BD25,Réel!BH25,Réel!BL25)","v":0},"filles en moyenne",null,{"$f":"G44","v":"par matin"}]
[null,null,{"$f":"AVERAGE(Prévisionnel!AV20,Prévisionnel!AZ20,Prévisionnel!BD20,Prévisionnel!BH20,Prévisionnel!BL20)","v":0},{"$f":"AVERAGE(Réel!AV20,Réel!AZ20,Réel!BD20,Réel!BH20,Réel!BL20)","v":0},"garçons en moyenne",null,{"$f":"G44","v":"par matin"}]
[null,"TO",{"$f":"AVERAGE(Prévisionnel!AV15,Prévisionnel!AZ15,Prévisionnel!BD15,Prévisionnel!BH15,Prévisionnel!BL15)/Renseignements!C27","v":0},{"$f":"AVERAGE(Réel!AV15,Réel!AZ15,Réel!BD15,Réel!BH15,Réel!BL15)/Renseignements!C27","v":0},{"$f":"E43","v":"Taux d'occupation moyen"},null,{"$f":"G44","v":"par matin"}]
[null,{"$f":"B32","v":"Après-midi"},{"$f":"AVERAGE(Prévisionnel!AW15,Prévisionnel!BA15,Prévisionnel!BE15,Prévisionnel!BI15,Prévisionnel!BM15)","v":0},{"$f":"AVERAGE(Réel!AW15,Réel!BA15,Réel!BE15,Réel!BI15,Réel!BM15)","v":0},{"$f":"E12","v":"enfant de moyenne "},null,{"$f":"G32","v":"par après-midi"}]
[null,null,{"$f":"AVERAGE(Prévisionnel!AW25,Prévisionnel!BA25,Prévisionnel!BE25,Prévisionnel!BI25,Prévisionnel!BM25)","v":0},{"$f":"AVERAGE(Réel!AW25,Réel!BA25,Réel!BE25,Réel!BI25,Réel!BM25)","v":0},"filles en moyenne",null,{"$f":"G48","v":"par après-midi"}]
[null,null,{"$f":"AVERAGE(Prévisionnel!AW20,Prévisionnel!BA20,Prévisionnel!BE20,Prévisionnel!BI20,Prévisionnel!BM20)","v":0},{"$f":"AVERAGE(Réel!AW20,Réel!BA20,Réel!BE20,Réel!BI20,Réel!BM20)","v":0},"garçons en moyenne",null,{"$f":"G48","v":"par après-midi"}]
[null,"TO",{"$f":"AVERAGE(Prévisionnel!AW15,Prévisionnel!BA15,Prévisionnel!BE15,Prévisionnel!BI15,Prévisionnel!BM15)/Renseignements!C28","v":0},{"$f":"AVERAGE(Réel!AW15,Réel!BA15,Réel!BE15,Réel!BI15,Réel!BM15)/Renseignements!C28","v":0},{"$f":"E47","v":"Taux d'occupation moyen"},null,{"$f":"G48","v":"par après-midi"}]
[null,{"$f":"B36","v":"Soirée"},{"$f":"AVERAGE(Prévisionnel!AX15,Prévisionnel!BB15,Prévisionnel!BF15,Prévisionnel!BJ15,Prévisionnel!BN15)","v":0},{"$f":"AVERAGE(Réel!AX15,Réel!BB15,Réel!BF15,Réel!BJ15,Réel!BN15)","v":0},{"$f":"E12","v":"enfant de moyenne "},null,{"$f":"G36","v":"par soirée"}]
[null,null,{"$f":"AVERAGE(Prévisionnel!AX25,Prévisionnel!BB25,Prévisionnel!BF25,Prévisionnel!BJ25,Prévisionnel!BN25)","v":0},{"$f":"AVERAGE(Réel!AX25,Réel!BB25,Réel!BF25,Réel!BJ25,Réel!BN25)","v":0},"filles en moyenne",null,{"$f":"G52","v":"par soirée"}]
[null,null,{"$f":"AVERAGE(Prévisionnel!AX20,Prévisionnel!BB20,Prévisionnel!BF20,Prévisionnel!BJ20,Prévisionnel!BN20)","v":0},{"$f":"AVERAGE(Réel!AX20,Réel!BB20,Réel!BF20,Réel!BJ20,Réel!BN20)","v":0},"garçons en moyenne",null,{"$f":"G52","v":"par soirée"}]
[null,"TO",{"$f":"AVERAGE(Prévisionnel!AX15,Prévisionnel!BB15,Prévisionnel!BF15,Prévisionnel!BJ15,Prévisionnel!BN15)/Renseignements!C29","v":0},{"$f":"AVERAGE(Réel!AX15,Réel!BB15,Réel!BF15,Réel!BJ15,Réel!BN15)/Renseignements!C29","v":0},{"$f":"E51","v":"Taux d'occupation moyen"},null,{"$f":"G52","v":"par soirée"}]
[null,{"$f":"B40","v":"Séjour"},{"$f":"AVERAGE(Prévisionnel!AY15,Prévisionnel!BC15,Prévisionnel!BG15,Prévisionnel!BK15,Prévisionnel!BO15)","v":0},{"$f":"AVERAGE(Réel!AY15,Réel!BC15,Réel!BG15,Réel!BK15,Réel!BO15)","v":0},{"$f":"E12","v":"enfant de moyenne "},null,{"$f":"G40","v":"par séjour"}]
[null,null,{"$f":"AVERAGE(Prévisionnel!AY25,Prévisionnel!BC25,Prévisionnel!BG25,Prévisionnel!BK25,Prévisionnel!BO25)","v":0},{"$f":"AVERAGE(Réel!AY25,Réel!BC25,Réel!BG25,Réel!BK25,Réel!BO25)","v":0},"filles en moyenne",null,{"$f":"G56","v":"par séjour"}]
[null,null,{"$f":"AVERAGE(Prévisionnel!AY20,Prévisionnel!BC20,Prévisionnel!BG20,Prévisionnel!BK20,Prévisionnel!BO20)","v":0},{"$f":"AVERAGE(Réel!AY20,Réel!BC20,Réel!BG20,Réel!BK20,Réel!BO20)","v":0},"garçons en moyenne",null,{"$f":"G56","v":"par séjour"}]
[null,"TO",{"$f":"AVERAGE(Prévisionnel!AY15,Prévisionnel!BC15,Prévisionnel!BG15,Prévisionnel!BK15,Prévisionnel!BO15)/Renseignements!C30","v":0},{"$f":"AVERAGE(Réel!AY15,Réel!BC15,Réel!BG15,Réel!BK15,Réel!BO15)/Renseignements!C30","v":0},{"$f":"E55","v":"Taux d'occupation moyen"},null,{"$f":"G56","v":"par séjour"}]
["Semaine 4",{"$f":"B44","v":"Matin"},{"$f":"AVERAGE(Prévisionnel!BP15,Prévisionnel!BT15,Prévisionnel!BX15,Prévisionnel!CB15,Prévisionnel!CF15)","v":0},{"$f":"AVERAGE(Réel!BP15,Réel!BT15,Réel!BX15,Réel!CB15,Réel!CF15)","v":0},{"$f":"E12","v":"enfant de moyenne "},null,{"$f":"G44","v":"par matin"}]
[null,null,{"$f":"AVERAGE(Prévisionnel!BP25,Prévisionnel!BT25,Prévisionnel!BX25,Prévisionnel!CB25,Prévisionnel!CF25)","v":0},{"$f":"AVERAGE(Réel!BP25,Réel!BT25,Réel!BX25,Réel!CB25,Réel!CF25)","v":0},"filles en moyenne",null,{"$f":"G60","v":"par matin"}]
[null,null,{"$f":"AVERAGE(Prévisionnel!BP20,Prévisionnel!BT20,Prévisionnel!BX20,Prévisionnel!CB20,Prévisionnel!CF20)","v":0},{"$f":"AVERAGE(Réel!BP20,Réel!BT20,Réel!BX20,Réel!CB20,Réel!CF20)","v":0},"garçons en moyenne",null,{"$f":"G60","v":"par matin"}]
[null,"TO",{"$f":"AVERAGE(Prévisionnel!BP15,Prévisionnel!BT15,Prévisionnel!BX15,Prévisionnel!CB15,Prévisionnel!CF15)/Renseignements!C27","v":0},{"$f":"AVERAGE(Réel!BP15,Réel!BT15,Réel!BX15,Réel!CB15,Réel!CF15)/Renseignements!C27","v":0},{"$f":"E47","v":"Taux d'occupation moyen"},null,{"$f":"G60","v":"par matin"}]
[null,{"$f":"B48","v":"Après-midi"},{"$f":"AVERAGE(Prévisionnel!BQ15,Prévisionnel!BU15,Prévisionnel!BY15,Prévisionnel!CC15,Prévisionnel!CG15)","v":0},{"$f":"AVERAGE(Réel!BQ15,Réel!BU15,Réel!BY15,Réel!CC15,Réel!CG15)","v":0},{"$f":"E12","v":"enfant de moyenne "},null,{"$f":"G48","v":"par après-midi"}]
[null,null,{"$f":"AVERAGE(Prévisionnel!BQ25,Prévisionnel!BU25,Prévisionnel!BY25,Prévisionnel!CC25,Prévisionnel!CG25)","v":0},{"$f":"AVERAGE(Réel!BQ25,Réel!BU25,Réel!BY25,Réel!CC25,Réel!CG25)","v":0},"filles en moyenne",null,{"$f":"G64","v":"par après-midi"}]
[null,null,{"$f":"AVERAGE(Prévisionnel!BQ20,Prévisionnel!BU20,Prévisionnel!BY20,Prévisionnel!CC20,Prévisionnel!CG20)","v":0},{"$f":"AVERAGE(Réel!BQ20,Réel!BU20,Réel!BY20,Réel!CC20,Réel!CG20)","v":0},"garçons en moyenne",null,{"$f":"G64","v":"par après-midi"}]
[null,"TO",{"$f":"AVERAGE(Prévisionnel!BQ15,Prévisionnel!BU15,Prévisionnel!BY15,Prévisionnel!CC15,Prévisionnel!CG15)/Renseignements!C28","v":0},{"$f":"AVERAGE(Réel!BQ15,Réel!BU15,Réel!BY15,Réel!CC15,Réel!CG15)/Renseignements!C28","v":0},{"$f":"E63","v":"Taux d'occupation moyen"},null,{"$f":"G64","v":"par après-midi"}]
[null,{"$f":"B52","v":"Soirée"},{"$f":"AVERAGE(Prévisionnel!BR15,Prévisionnel!BV15,Prévisionnel!BZ15,Prévisionnel!CD15,Prévisionnel!CH15)","v":0},{"$f":"AVERAGE(Réel!BR15,Réel!BV15,Réel!BZ15,Réel!CD15,Réel!CH15)","v":0},{"$f":"E12","v":"enfant de moyenne "},null,{"$f":"G52","v":"par soirée"}]
[null,null,{"$f":"AVERAGE(Prévisionnel!BR25,Prévisionnel!BV25,Prévisionnel!BZ25,Prévisionnel!CD25,Prévisionnel!CH25)","v":0},{"$f":"AVERAGE(Réel!BR25,Réel!BV25,Réel!BZ25,Réel!CD25,Réel!CH25)","v":0},"filles en moyenne",null,{"$f":"G68","v":"par soirée"}]
[null,null,{"$f":"AVERAGE(Prévisionnel!BR20,Prévisionnel!BV20,Prévisionnel!BZ20,Prévisionnel!CD20,Prévisionnel!CH20)","v":0},{"$f":"AVERAGE(Réel!BR20,Réel!BV20,Réel!BZ20,Réel!CD20,Réel!CH20)","v":0},"garçons en moyenne",null,{"$f":"G68","v":"par soirée"}]
[null,"TO",{"$f":"AVERAGE(Prévisionnel!BR15,Prévisionnel!BV15,Prévisionnel!BZ15,Prévisionnel!CD15,Prévisionnel!CH15)/Renseignements!C29","v":0},{"$f":"AVERAGE(Réel!BR15,Réel!BV15,Réel!BZ15,Réel!CD15,Réel!CH15)/Renseignements!C29","v":0},{"$f":"E67","v":"Taux d'occupation moyen"},null,{"$f":"G68","v":"par soirée"}]
[null,{"$f":"B56","v":"Séjour"},{"$f":"AVERAGE(Prévisionnel!BS15,Prévisionnel!BW15,Prévisionnel!CA15,Prévisionnel!CE15,Prévisionnel!CI15)","v":0},{"$f":"AVERAGE(Réel!BS15,Réel!BW15,Réel!CA15,Réel!CE15,Réel!CI15)","v":0},{"$f":"E12","v":"enfant de moyenne "},null,{"$f":"G56","v":"par séjour"}]
[null,null,{"$f":"AVERAGE(Prévisionnel!BS25,Prévisionnel!BW25,Prévisionnel!CA25,Prévisionnel!CE25,Prévisionnel!CI25)","v":0},{"$f":"AVERAGE(Réel!BS25,Réel!BW25,Réel!CA25,Réel!CE25,Réel!CI25)","v":0},"filles en moyenne",null,{"$f":"G72","v":"par séjour"}]
[null,null,{"$f":"AVERAGE(Prévisionnel!BS20,Prévisionnel!BW20,Prévisionnel!CA20,Prévisionnel!CE20,Prévisionnel!CI20)","v":0},{"$f":"AVERAGE(Réel!BS20,Réel!BW20,Réel!CA20,Réel!CE20,Réel!CI20)","v":0},"garçons en moyenne",null,{"$f":"G72","v":"par séjour"}]
[null,"TO",{"$f":"AVERAGE(Prévisionnel!BS15,Prévisionnel!BW15,Prévisionnel!CA15,Prévisionnel!CE15,Prévisionnel!CI15)/Renseignements!C30","v":0},{"$f":"AVERAGE(Réel!BS15,Réel!BW15,Réel!CA15,Réel!CE15,Réel!CI15)/Renseignements!C30","v":0},{"$f":"E71","v":"Taux d'occupation moyen"},null,{"$f":"G72","v":"par séjour"}]
[]
["Globale",{"$f":"B60","v":"Matin"},{"$f":"AVERAGE(C12,C28,C44,C60)","v":0.05},{"$f":"AVERAGE(D12,D28,D44,D60)","v":0.05},"enfant(s) de moyenne par matin"]
[null,{"$f":"B64","v":"Après-midi"},{"$f":"AVERAGE(C16,C32,C48,C64)","v":0.05},{"$f":"AVERAGE(D16,D32,D48,D64)","v":0},"enfant(s) de moyenne par après-midi"]
[null,{"$f":"B68","v":"Soirée"},{"$f":"AVERAGE(C20,C36,C52,C68)","v":0},{"$f":"AVERAGE(D20,D36,D52,D68)","v":0},"enfant(s) de moyenne par soirée"]
[null,{"$f":"B72","v":"Séjour"},{"$f":"AVERAGE(C24,C40,C56,C72)","v":0},{"$f":"AVERAGE(D24,D40,D56,D72)","v":0},"enfant(s) de moyenne par séjour"]
[]
["Inscrits"]
["Globale",null,{"$f":"SUM(Prévisionnel!G15)","v":4},{"$f":"SUM(Réel!G15)","v":4},"inscrits sur les quatre semaines"]
["Garçons",null,{"$f":"Prévisionnel!G20","v":3},{"$f":"Réel!G20","v":3},{"$f":"E83","v":"inscrits sur les quatre semaines"}]
["Filles",null,{"$f":"Prévisionnel!G25","v":1},{"$f":"Réel!G25","v":1},{"$f":"E83","v":"inscrits sur les quatre semaines"}]

{"sheet":"Fréquentation globale","index":6,"n_rows":42,"n_cols":4,"rows_kept":42,"cut":false,"hidden":false,"merged":[[1,0,1,4],[2,0,2,4],[8,3,8,8],[9,3,9,8],[10,3,10,8],[6,3,6,8],[4,3,5,8],[7,3,7,8],[12,3,13,8],[14,3,14,8],[15,3,15,8],[16,3,16,8],[17,3,17,8],[18,3,18,8],[20,3,21,8],[22,3,22,8],[23,3,23,8],[24,3,24,8],[25,3,25,8],[26,3,26,8],[28,3,29,8],[30,3,30,8],[31,3,31,8],[32,3,32,8],[33,3,33,8],[34,3,34,8],[40,0,40,5],[38,0,38,5],[36,0,36,5]]}
[]
["Période :"]
[{"$f":"Renseignements!B11","v":"Vacances de Février"}]
[]
[null,null,null,"Fréquentation :\n(matin)"]
[null,{"$f":"Moyennes!C11","v":"Prév"},{"$f":"Moyennes!D11","v":"Réel"}]
["Semaine 1",{"$f":"SUM(Prévisionnel!H15,Prévisionnel!L15,Prévisionnel!P15,Prévisionnel!T15,Prévisionnel!X15)*Renseignements!B20","v":4},{"$f":"SUM(Réel!H15,Réel!L15,Réel!P15,Réel!T15,Réel!X15)*Renseignements!B20","v":4},"heure(s) de fréquentation pour cette semaine"]
["Semaine 2",{"$f":"SUM(Prévisionnel!AB15,Prévisionnel!AF15,Prévisionnel!AJ15,Prévisionnel!AN15,Prévisionnel!AR15)*Renseignements!B20","v":0},{"$f":"SUM(Réel!AB15,Réel!AF15,Réel!AJ15,Réel!AN15,Réel!AR15)*Renseignements!B20","v":0},{"$f":"D7","v":"heure(s) de fréquentation pour cette semaine"}]
["Semaine 3",{"$f":"SUM(Prévisionnel!AV15,Prévisionnel!AZ15,Prévisionnel!BD15,Prévisionnel!BH15,Prévisionnel!BL15)*Renseignements!B20","v":0},{"$f":"SUM(Réel!AV15,Réel!AZ15,Réel!BD15,Réel!BH15,Réel!BL15)*Renseignements!B20","v":0},{"$f":"D7","v":"heure(s) de fréquentation pour cette semaine"}]
["Semaine 4",{"$f":"SUM(Prévisionnel!BP15,Prévisionnel!BT15,Prévisionnel!BX15,Prévisionnel!CB15,Prévisionnel!CF15)*Renseignements!B20","v":0},{"$f":"SUM(Réel!BP15,Réel!BT15,Réel!BX15,Réel!CB15,Réel!CF15)*Renseignements!B20","v":0},{"$f":"D7","v":"heure(s) de fréquentation pour cette semaine"}]
["Globale",{"$f":"SUM(B7:B10)","v":4},{"$f":"SUM(C7:C10)","v":4},"heure(s) de fréquentation pour les quatre semaines"]
[]
[null,null,null,"Fréquentation :\n(après-midi)"]
[null,{"$f":"B6","v":"Prév"},{"$f":"C6","v":"Réel"}]
["Semaine 1",{"$f":"SUM(Prévisionnel!I15,Prévisionnel!M15,Prévisionnel!Q15,Prévisionnel!U15,Prévisionnel!Y15)*Renseignements!B21","v":4},{"$f":"SUM(Réel!I15,Réel!M15,Réel!Q15,Réel!U15,Réel!Y15)*Renseignements!B21","v":0},"heure(s) de fréquentation pour cette semaine"]
["Semaine 2",{"$f":"SUM(Prévisionnel!I15,Prévisionnel!M15,Prévisionnel!Q15,Prévisionnel!U15,Prévisionnel!Y15,Prévisionnel!AC15)*Renseignements!B21","v":4},{"$f":"SUM(Réel!I15,Réel!M15,Réel!Q15,Réel!U15,Réel!Y15,Réel!AC15)*Renseignements!B21","v":0},{"$f":"D15","v":"heure(s) de fréquentation pour cette semaine"}]
["Semaine 3",{"$f":"SUM(Prévisionnel!AW15,Prévisionnel!BA15,Prévisionnel!BE15,Prévisionnel!BI15,Prévisionnel!BM15)*Renseignements!B21","v":0},{"$f":"SUM(Réel!AW15,Réel!BA15,Réel!BE15,Réel!BI15,Réel!BM15)*Renseignements!B21","v":0},{"$f":"D15","v":"heure(s) de fréquentation pour cette semaine"}]
["Semaine 4",{"$f":"SUM(Prévisionnel!BQ15,Prévisionnel!BU15,Prévisionnel!BY15,Prévisionnel!CC15,Prévisionnel!CG15)*Renseignements!B21","v":0},{"$f":"SUM(Réel!BQ15,Réel!BU15,Réel!BY15,Réel!CC15,Réel!CG15)*Renseignements!B21","v":0},{"$f":"D15","v":"heure(s) de fréquentation pour cette semaine"}]
["Globale",{"$f":"SUM(B15:B18)","v":8},{"$f":"SUM(C15:C18)","v":0},"heure(s) de fréquentation pour les quatre semaines"]
[]
[null,null,null,"Fréquentation :\n(soirée)"]
[null,{"$f":"B14","v":"Prév"},{"$f":"C14","v":"Réel"}]
["Semaine 1",{"$f":"SUM(Prévisionnel!J15,Prévisionnel!N15,Prévisionnel!R15,Prévisionnel!V15,Prévisionnel!Z15)*Renseignements!B22","v":0},{"$f":"SUM(Réel!J15,Réel!N15,Réel!R15,Réel!V15,Réel!Z15)*Renseignements!B22","v":0},"heure(s) de fréquentation pour cette semaine"]
["Semaine 2",{"$f":"SUM(Prévisionnel!AD15,Prévisionnel!AH15,Prévisionnel!AL15,Prévisionnel!AP15,Prévisionnel!AT15)*Renseignements!B22","v":0},{"$f":"SUM(Réel!AD15,Réel!AH15,Réel!AL15,Réel!AP15,Réel!AT15)*Renseignements!B22","v":0},{"$f":"D23","v":"heure(s) de fréquentation pour cette semaine"}]
["Semaine 3",{"$f":"SUM(Prévisionnel!AX15,Prévisionnel!BB15,Prévisionnel!BF15,Prévisionnel!BJ15,Prévisionnel!BN15)*Renseignements!B22","v":0},{"$f":"SUM(Réel!AX15,Réel!BB15,Réel!BF15,Réel!BJ15,Réel!BN15)*Renseignements!B22","v":0},{"$f":"D23","v":"heure(s) de fréquentation pour cette semaine"}]
["Semaine 4",{"$f":"SUM(Prévisionnel!BR15,Prévisionnel!BV15,Prévisionnel!BZ15,Prévisionnel!CD15,Prévisionnel!CH15)*Renseignements!B22","v":0},{"$f":"SUM(Réel!BR15,Réel!BV15,Réel!BZ15,Réel!CD15,Réel!CH15)*Renseignements!B22","v":0},{"$f":"D23","v":"heure(s) de fréquentation pour cette semaine"}]
["Globale",{"$f":"SUM(B23:B26)","v":0},{"$f":"SUM(C23:C26)","v":0},"heure(s) de fréquentation pour les quatre semaines"]
[]
[null,null,null,"Fréquentation :\n(séjour)"]
[null,{"$f":"B22","v":"Prév"},{"$f":"C22","v":"Réel"}]
["Semaine 1",{"$f":"SUM(Prévisionnel!K15,Prévisionnel!O15,Prévisionnel!S15,Prévisionnel!W15,Prévisionnel!AA15)*Renseignements!B24","v":0},{"$f":"SUM(Réel!K15,Réel!O15,Réel!S15,Réel!W15,Réel!AA15)*Renseignements!B24","v":0},"heure(s) de fréquentation pour cette semaine"]
["Semaine 2",{"$f":"SUM(Prévisionnel!AE15,Prévisionnel!AI15,Prévisionnel!AM15,Prévisionnel!AQ15,Prévisionnel!AU15)*Renseignements!B24","v":0},{"$f":"SUM(Réel!AE15,Réel!AI15,Réel!AM15,Réel!AQ15,Réel!AU15)*Renseignements!B24","v":0},{"$f":"D31","v":"heure(s) de fréquentation pour cette semaine"}]
["Semaine 3",{"$f":"SUM(Prévisionnel!AY15,Prévisionnel!BC15,Prévisionnel!BG15,Prévisionnel!BK15,Prévisionnel!BO15)*Renseignements!B24","v":0},{"$f":"SUM(Réel!AY15,Réel!BC15,Réel!BG15,Réel!BK15,Réel!BO15)*Renseignements!B24","v":0},{"$f":"D31","v":"heure(s) de fréquentation pour cette semaine"}]
["Semaine 4",{"$f":"SUM(Prévisionnel!BS15,Prévisionnel!BW15,Prévisionnel!CA15,Prévisionnel!CE15,Prévisionnel!CI15)*Renseignements!B24","v":0},{"$f":"SUM(Réel!BS15,Réel!BW15,Réel!CA15,Réel!CE15,Réel!CI15)*Renseignements!B24","v":0},{"$f":"D31","v":"heure(s) de fréquentation pour cette semaine"}]
["Globale",{"$f":"SUM(B31:B34)","v":0},{"$f":"SUM(C31:C34)","v":0},"heure(s) de fréquentation pour les quatre semaines"]
[]
["Général (Matin + après-midi + soirée)"]
[null,{"$f":"SUM(B11,B19,B27)","v":12},{"$f":"SUM(C11,C19,C27)","v":4},"heures de fréquentation"]
["Général (Séjour)"]
[null,{"$f":"B35","v":0},{"$f":"C35","v":0},{"$f":"D38","v":"heures de fréquentation"}]
[{"$f":"\"Général\" &\" \"& Renseignements!B11","v":"Général Vacances de Février"}]
[null,{"$f":"SUM(B38+B40)","v":12},{"$f":"SUM(C38+C40)","v":4},{"$f":"D38","v":"heures de fréquentation"}]

{"sheet":"Fréquentation TA1","index":7,"n_rows":42,"n_cols":7,"rows_kept":42,"cut":false,"hidden":false,"merged":[[12,3,12,7],[13,3,13,7],[20,3,20,7],[21,3,21,7],[8,3,8,7],[9,3,9,7],[10,3,10,7],[1,0,1,4],[2,0,2,4],[6,3,6,7],[7,3,7,7],[4,3,4,7],[5,3,5,7],[1,6,2,7],[25,3,25,7],[26,3,26,7],[14,3,14,7],[15,3,15,7],[16,3,16,7],[17,3,17,7],[18,3,18,7],[22,3,22,7],[23,3,23,7],[24,3,24,7],[28,3,28,7],[29,3,29,7],[30,3,30,7],[31,3,31,7],[32,3,32,7],[36,0,36,5],[38,0,38,5],[40,0,40,5],[33,3,33,7],[34,3,34,7]]}
[]
["Période :",null,null,null,null,null,{"$f":"(\"Détails de la TA1 :\" &\" \"&D6)","v":"Détails de la TA1 : 4 - 5 ans"}]
[{"$f":"Renseignements!B11","v":"Vacances de Février"}]
[]
[null,null,null,"Fréquentation : Matin"]
[null,{"$f":"Moyennes!C11","v":"Prév"},{"$f":"Moyennes!D11","v":"Réel"},{"$f":"Renseignements!$B$15&\" \"&Renseignements!$C$15&\" \"&Renseignements!$D$15&\" \"&Renseignements!$E$15","v":"4 - 5 ans"}]
["Semaine 1",{"$f":"SUM(Prévisionnel!H16,Prévisionnel!L16,Prévisionnel!P16,Prévisionnel!T16,Prévisionnel!X16)*Renseignements!B20","v":0},{"$f":"SUM(Réel!H16,Réel!L16,Réel!P16,Réel!T16,Réel!X16)*Renseignements!B20","v":0},"heure(s) de fréquentation pour cette semaine"]
["Semaine 2",{"$f":"SUM(Prévisionnel!AB16,Prévisionnel!AF16,Prévisionnel!AJ16,Prévisionnel!AN16,Prévisionnel!AR16)*Renseignements!B20","v":0},{"$f":"SUM(Réel!AB16,Réel!AF16,Réel!AJ16,Réel!AN16,Réel!AR16)*Renseignements!B20","v":0},{"$f":"D7","v":"heure(s) de fréquentation pour cette semaine"}]
["Semaine 3",{"$f":"SUM(Prévisionnel!AV16,Prévisionnel!AZ16,Prévisionnel!BD16,Prévisionnel!BH16,Prévisionnel!BL16)*Renseignements!B20","v":0},{"$f":"SUM(Réel!AV16,Réel!AZ16,Réel!BD16,Réel!BH16,Réel!BL16)*Renseignements!B20","v":0},{"$f":"D7","v":"heure(s) de fréquentation pour cette semaine"}]
["Semaine 4",{"$f":"SUM(Prévisionnel!BP16,Prévisionnel!BT16,Prévisionnel!BX16,Prévisionnel!CB16,Prévisionnel!CF16)*Renseignements!B20","v":0},{"$f":"SUM(Réel!BP16,Réel!BT16,Réel!BX16,Réel!CB16,Réel!CF16)*Renseignements!B20","v":0},{"$f":"D7","v":"heure(s) de fréquentation pour cette semaine"}]
["Globale",{"$f":"SUM(B7:B10)","v":0},{"$f":"SUM(C7:C10)","v":0},"heure(s) de fréquentation pour les quatre semaines"]
[]
[null,null,null,"Fréquentation : Après-midi"]
[null,{"$f":"B6","v":"Prév"},{"$f":"C6","v":"Réel"},{"$f":"Renseignements!$B$15&\" \"&Renseignements!$C$15&\" \"&Renseignements!$D$15&\" \"&Renseignements!$E$15","v":"4 - 5 ans"}]
["Semaine 1",{"$f":"SUM(Prévisionnel!I16,Prévisionnel!M16,Prévisionnel!Q16,Prévisionnel!U16,Prévisionnel!Y16)*Renseignements!B21","v":0},{"$f":"SUM(Réel!I16,Réel!M16,Réel!Q16,Réel!U16,Réel!Y16)*Renseignements!B21","v":0},"heure(s) de fréquentation pour cette semaine"]
["Semaine 2",{"$f":"SUM(Prévisionnel!I16,Prévisionnel!M16,Prévisionnel!Q16,Prévisionnel!U16,Prévisionnel!Y16,Prévisionnel!AC16)*Renseignements!B21","v":0},{"$f":"SUM(Réel!I16,Réel!M16,Réel!Q16,Réel!U16,Réel!Y16,Réel!AC16)*Renseignements!B21","v":0},{"$f":"D15","v":"heure(s) de fréquentation pour cette semaine"}]
["Semaine 3",{"$f":"SUM(Prévisionnel!AW16,Prévisionnel!BA16,Prévisionnel!BE16,Prévisionnel!BI16,Prévisionnel!BM16)*Renseignements!B21","v":0},{"$f":"SUM(Réel!AW16,Réel!BA16,Réel!BE16,Réel!BI16,Réel!BM16)*Renseignements!B21","v":0},{"$f":"D15","v":"heure(s) de fréquentation pour cette semaine"}]
["Semaine 4",{"$f":"SUM(Prévisionnel!BQ16,Prévisionnel!BU16,Prévisionnel!BY16,Prévisionnel!CC16,Prévisionnel!CG16)*Renseignements!B21","v":0},{"$f":"SUM(Réel!BQ16,Réel!BU16,Réel!BY16,Réel!CC16,Réel!CG16)*Renseignements!B21","v":0},{"$f":"D15","v":"heure(s) de fréquentation pour cette semaine"}]
["Globale",{"$f":"SUM(B15:B18)","v":0},{"$f":"SUM(C15:C18)","v":0},"heure(s) de fréquentation pour les quatre semaines"]
[]
[null,null,null,"Fréquentation : Soirée"]
[null,{"$f":"B14","v":"Prév"},{"$f":"C14","v":"Réel"},{"$f":"Renseignements!$B$15&\" \"&Renseignements!$C$15&\" \"&Renseignements!$D$15&\" \"&Renseignements!$E$15","v":"4 - 5 ans"}]
["Semaine 1",{"$f":"SUM(Prévisionnel!J16,Prévisionnel!N16,Prévisionnel!R16,Prévisionnel!V16,Prévisionnel!Z16)*Renseignements!B22","v":0},{"$f":"SUM(Réel!J16,Réel!N16,Réel!R16,Réel!V16,Réel!Z16)*Renseignements!B22","v":0},"heure(s) de fréquentation pour cette semaine"]
["Semaine 2",{"$f":"SUM(Prévisionnel!AD16,Prévisionnel!AH16,Prévisionnel!AL16,Prévisionnel!AP16,Prévisionnel!AT16)*Renseignements!B22","v":0},{"$f":"SUM(Réel!AD16,Réel!AH16,Réel!AL16,Réel!AP16,Réel!AT16)*Renseignements!B22","v":0},{"$f":"D23","v":"heure(s) de fréquentation pour cette semaine"}]
["Semaine 3",{"$f":"SUM(Prévisionnel!AX16,Prévisionnel!BB16,Prévisionnel!BF16,Prévisionnel!BJ16,Prévisionnel!BN16)*Renseignements!B22","v":0},{"$f":"SUM(Réel!AX16,Réel!BB16,Réel!BF16,Réel!BJ16,Réel!BN16)*Renseignements!B22","v":0},{"$f":"D23","v":"heure(s) de fréquentation pour cette semaine"}]
["Semaine 4",{"$f":"SUM(Prévisionnel!BR16,Prévisionnel!BV16,Prévisionnel!BZ16,Prévisionnel!CD16,Prévisionnel!CH16)*Renseignements!B22","v":0},{"$f":"SUM(Réel!BR16,Réel!BV16,Réel!BZ16,Réel!CD16,Réel!CH16)*Renseignements!B22","v":0},{"$f":"D23","v":"heure(s) de fréquentation pour cette semaine"}]
["Globale",{"$f":"SUM(B23:B26)","v":0},{"$f":"SUM(C23:C26)","v":0},"heure(s) de fréquentation pour les quatre semaines"]
[]
[null,null,null,"Fréquentation : Séjour"]
[null,{"$f":"B22","v":"Prév"},{"$f":"C22","v":"Réel"},{"$f":"Renseignements!$B$15&\" \"&Renseignements!$C$15&\" \"&Renseignements!$D$15&\" \"&Renseignements!$E$15","v":"4 - 5 ans"}]
["Semaine 1",{"$f":"SUM(Prévisionnel!K16,Prévisionnel!O16,Prévisionnel!S16,Prévisionnel!W16,Prévisionnel!AA16)*Renseignements!B24","v":0},{"$f":"SUM(Réel!K16,Réel!O16,Réel!S16,Réel!W16,Réel!AA16)*Renseignements!B24","v":0},"heure(s) de fréquentation pour cette semaine"]
["Semaine 2",{"$f":"SUM(Prévisionnel!AE16,Prévisionnel!AI16,Prévisionnel!AM16,Prévisionnel!AQ16,Prévisionnel!AU16)*Renseignements!B24","v":0},{"$f":"SUM(Réel!AE16,Réel!AI16,Réel!AM16,Réel!AQ16,Réel!AU16)*Renseignements!B24","v":0},{"$f":"D31","v":"heure(s) de fréquentation pour cette semaine"}]
["Semaine 3",{"$f":"SUM(Prévisionnel!AY16,Prévisionnel!BC16,Prévisionnel!BG16,Prévisionnel!BK16,Prévisionnel!BO16)*Renseignements!B24","v":0},{"$f":"SUM(Réel!AY16,Réel!BC16,Réel!BG16,Réel!BK16,Réel!BO16)*Renseignements!B24","v":0},{"$f":"D31","v":"heure(s) de fréquentation pour cette semaine"}]
["Semaine 4",{"$f":"SUM(Prévisionnel!BS16,Prévisionnel!BW16,Prévisionnel!CA16,Prévisionnel!CE16,Prévisionnel!CI16)*Renseignements!B24","v":0},{"$f":"SUM(Réel!BS16,Réel!BW16,Réel!CA16,Réel!CE16,Réel!CI16)*Renseignements!B24","v":0},{"$f":"D31","v":"heure(s) de fréquentation pour cette semaine"}]
["Globale",{"$f":"SUM(B31:B34)","v":0},{"$f":"SUM(C31:C34)","v":0},"heure(s) de fréquentation pour les quatre semaines"]
[]
["Général (Matin + après-midi + soirée)"]
[null,{"$f":"SUM(B11,B19,B27)","v":0},{"$f":"SUM(C11,C19,C27)","v":0},"heures de fréquentation"]
["Général (Séjour)"]
[null,{"$f":"B35","v":0},{"$f":"C35","v":0},{"$f":"D38","v":"heures de fréquentation"}]
[{"$f":"\"Général\" &\" \"& Renseignements!B11","v":"Général Vacances de Février"}]
[null,{"$f":"SUM(B38+B40)","v":0},{"$f":"SUM(C38+C40)","v":0},{"$f":"D38","v":"heures de fréquentation"}]

{"sheet":"Fréquentation TA2","index":8,"n_rows":42,"n_cols":4,"rows_kept":42,"cut":false,"hidden":false,"merged":[[1,0,1,4],[2,0,2,4],[10,3,10,6],[6,3,6,6],[7,3,7,6],[8,3,8,6],[9,3,9,6],[4,3,4,6],[5,3,5,6],[14,3,14,6],[15,3,15,6],[16,3,16,6],[17,3,17,6],[12,3,12,6],[13,3,13,6],[18,3,18,6],[22,3,22,6],[23,3,23,6],[24,3,24,6],[20,3,20,6],[21,3,21,6],[36,0,36,5],[38,0,38,5],[40,0,40,5],[25,3,25,6],[26,3,26,6],[33,3,33,6],[34,3,34,6],[28,3,28,6],[29,3,29,6],[30,3,30,6],[31,3,31,6],[32,3,32,6]]}
[]
["Période :"]
[{"$f":"Renseignements!B11","v":"Vacances de Février"}]
[]
[null,null,null,{"$f":"'Fréquentation TA1'!D5:H5","v":"Fréquentation : Matin"}]
[null,{"$f":"Moyennes!C11","v":"Prév"},{"$f":"Moyennes!D11","v":"Réel"},{"$f":"Renseignements!$B$16&\" \"&Renseignements!$C$16&\" \"&Renseignements!$D$16&\" \"&Renseignements!$E$16","v":"6 - 11 ans"}]
["Semaine 1",{"$f":"SUM(Prévisionnel!H17,Prévisionnel!L17,Prévisionnel!P17,Prévisionnel!T17,Prévisionnel!X17)*Renseignements!B20","v":0},{"$f":"SUM(Réel!H17,Réel!L17,Réel!P17,Réel!T17,Réel!X17)*Renseignements!B20","v":0},"heures de fréquentation pour cette semaine"]
["Semaine 2",{"$f":"SUM(Prévisionnel!AB17,Prévisionnel!AF17,Prévisionnel!AJ17,Prévisionnel!AN17,Prévisionnel!AR17)*Renseignements!B20","v":0},{"$f":"SUM(Réel!AB17,Réel!AF17,Réel!AJ17,Réel!AN17,Réel!AR17)*Renseignements!B20","v":0},{"$f":"D7","v":"heures de fréquentation pour cette semaine"}]
["Semaine 3",{"$f":"SUM(Prévisionnel!AV17,Prévisionnel!AZ17,Prévisionnel!BD17,Prévisionnel!BH17,Prévisionnel!BL17)*Renseignements!B20","v":0},{"$f":"SUM(Réel!AV17,Réel!AZ17,Réel!BD17,Réel!BH17,Réel!BL17)*Renseignements!B20","v":0},{"$f":"D7","v":"heures de fréquentation pour cette semaine"}]
["Semaine 4",{"$f":"SUM(Prévisionnel!BP17,Prévisionnel!BT17,Prévisionnel!BX17,Prévisionnel!CB17,Prévisionnel!CF17)*Renseignements!B20","v":0},{"$f":"SUM(Réel!BP17,Réel!BT17,Réel!BX17,Réel!CB17,Réel!CF17)*Renseignements!B20","v":0},{"$f":"D7","v":"heures de fréquentation pour cette semaine"}]
["Globale",{"$f":"SUM(B7:B10)","v":0},{"$f":"SUM(C7:C10)","v":0},"heures de fréquentation pour les quatre semaines"]
[]
[null,null,null,{"$f":"'Fréquentation TA1'!D13:H13","v":"Fréquentation : Après-midi"}]
[null,{"$f":"B6","v":"Prév"},{"$f":"C6","v":"Réel"},{"$f":"D6","v":"6 - 11 ans"}]
["Semaine 1",{"$f":"SUM(Prévisionnel!I17,Prévisionnel!M17,Prévisionnel!Q17,Prévisionnel!U17,Prévisionnel!Y17)*Renseignements!B21","v":0},{"$f":"SUM(Réel!I17,Réel!M17,Réel!Q17,Réel!U17,Réel!Y17)*Renseignements!B21","v":0},{"$f":"D7","v":"heures de fréquentation pour cette semaine"}]
["Semaine 2",{"$f":"SUM(Prévisionnel!I17,Prévisionnel!M17,Prévisionnel!Q17,Prévisionnel!U17,Prévisionnel!Y17,Prévisionnel!AC17)*Renseignements!B21","v":0},{"$f":"SUM(Réel!I17,Réel!M17,Réel!Q17,Réel!U17,Réel!Y17,Réel!AC17)*Renseignements!B21","v":0},{"$f":"D7","v":"heures de fréquentation pour cette semaine"}]
["Semaine 3",{"$f":"SUM(Prévisionnel!AW17,Prévisionnel!BA17,Prévisionnel!BE17,Prévisionnel!BI17,Prévisionnel!BM17)*Renseignements!B21","v":0},{"$f":"SUM(Réel!AW17,Réel!BA17,Réel!BE17,Réel!BI17,Réel!BM17)*Renseignements!B21","v":0},{"$f":"D7","v":"heures de fréquentation pour cette semaine"}]
["Semaine 4",{"$f":"SUM(Prévisionnel!BQ17,Prévisionnel!BU17,Prévisionnel!BY17,Prévisionnel!CC17,Prévisionnel!CG17)*Renseignements!B21","v":0},{"$f":"SUM(Réel!BQ17,Réel!BU17,Réel!BY17,Réel!CC17,Réel!CG17)*Renseignements!B21","v":0},{"$f":"D15","v":"heures de fréquentation pour cette semaine"}]
["Globale",{"$f":"SUM(B15:B18)","v":0},{"$f":"SUM(C15:C18)","v":0},{"$f":"D11","v":"heures de fréquentation pour les quatre semaines"}]
[]
[null,null,null,{"$f":"'Fréquentation TA1'!D21:H21","v":"Fréquentation : Soirée"}]
[null,{"$f":"B14","v":"Prév"},{"$f":"C14","v":"Réel"},{"$f":"D6","v":"6 - 11 ans"}]
["Semaine 1",{"$f":"SUM(Prévisionnel!J17,Prévisionnel!N17,Prévisionnel!R17,Prévisionnel!V17,Prévisionnel!Z17)*Renseignements!B22","v":0},{"$f":"SUM(Réel!J17,Réel!N17,Réel!R17,Réel!V17,Réel!Z17)*Renseignements!B22","v":0},{"$f":"D7","v":"heures de fréquentation pour cette semaine"}]
["Semaine 2",{"$f":"SUM(Prévisionnel!AD17,Prévisionnel!AH17,Prévisionnel!AL17,Prévisionnel!AP17,Prévisionnel!AT17)*Renseignements!B22","v":0},{"$f":"SUM(Réel!AD17,Réel!AH17,Réel!AL17,Réel!AP17,Réel!AT17)*Renseignements!B22","v":0},{"$f":"D7","v":"heures de fréquentation pour cette semaine"}]
["Semaine 3",{"$f":"SUM(Prévisionnel!AX17,Prévisionnel!BB17,Prévisionnel!BF17,Prévisionnel!BJ17,Prévisionnel!BN17)*Renseignements!B22","v":0},{"$f":"SUM(Réel!AX17,Réel!BB17,Réel!BF17,Réel!BJ17,Réel!BN17)*Renseignements!B22","v":0},{"$f":"D7","v":"heures de fréquentation pour cette semaine"}]
["Semaine 4",{"$f":"SUM(Prévisionnel!BR17,Prévisionnel!BV17,Prévisionnel!BZ17,Prévisionnel!CD17,Prévisionnel!CH17)*Renseignements!B22","v":0},{"$f":"SUM(Réel!BR17,Réel!BV17,Réel!BZ17,Réel!CD17,Réel!CH17)*Renseignements!B22","v":0},{"$f":"D7","v":"heures de fréquentation pour cette semaine"}]
["Globale",{"$f":"SUM(B23:B26)","v":0},{"$f":"SUM(C23:C26)","v":0},{"$f":"D11","v":"heures de fréquentation pour les quatre semaines"}]
[]
[null,null,null,{"$f":"'Fréquentation TA1'!D29:H29","v":"Fréquentation : Séjour"}]
[null,{"$f":"B22","v":"Prév"},{"$f":"C22","v":"Réel"},{"$f":"D6","v":"6 - 11 ans"}]
["Semaine 1",{"$f":"SUM(Prévisionnel!K17,Prévisionnel!O17,Prévisionnel!S17,Prévisionnel!W17,Prévisionnel!AA17)*Renseignements!B24","v":0},{"$f":"SUM(Réel!K17,Réel!O17,Réel!S17,Réel!W17,Réel!AA17)*Renseignements!B24","v":0},{"$f":"D23","v":"heures de fréquentation pour cette semaine"}]
["Semaine 2",{"$f":"SUM(Prévisionnel!AE17,Prévisionnel!AI17,Prévisionnel!AM17,Prévisionnel!AQ17,Prévisionnel!AU17)*Renseignements!B24","v":0},{"$f":"SUM(Réel!AE17,Réel!AI17,Réel!AM17,Réel!AQ17,Réel!AU17)*Renseignements!B24","v":0},{"$f":"D23","v":"heures de fréquentation pour cette semaine"}]
["Semaine 3",{"$f":"SUM(Prévisionnel!AY17,Prévisionnel!BC17,Prévisionnel!BG17,Prévisionnel!BK17,Prévisionnel!BO17)*Renseignements!B24","v":0},{"$f":"SUM(Réel!AY17,Réel!BC17,Réel!BG17,Réel!BK17,Réel!BO17)*Renseignements!B24","v":0},{"$f":"D23","v":"heures de fréquentation pour cette semaine"}]
["Semaine 4",{"$f":"SUM(Prévisionnel!BS17,Prévisionnel!BW17,Prévisionnel!CA17,Prévisionnel!CE17,Prévisionnel!CI17)*Renseignements!B24","v":0},{"$f":"SUM(Réel!BS17,Réel!BW17,Réel!CA17,Réel!CE17,Réel!CI17)*Renseignements!B24","v":0},{"$f":"D23","v":"heures de fréquentation pour cette semaine"}]
["Globale",{"$f":"SUM(B31:B34)","v":0},{"$f":"SUM(C31:C34)","v":0},{"$f":"D27","v":"heures de fréquentation pour les quatre semaines"}]
[]
["Général (Matin + après-midi + soirée)"]
[null,{"$f":"SUM(B11,B19,B27)","v":0},{"$f":"SUM(C11,C19,C27)","v":0},"heures de fréquentation"]
["Général (Séjour)"]
[null,{"$f":"B35","v":0},{"$f":"C35","v":0},{"$f":"D38","v":"heures de fréquentation"}]
[{"$f":"\"Général\" &\" \"& Renseignements!B11","v":"Général Vacances de Février"}]
[null,{"$f":"SUM(B38+B40)","v":0},{"$f":"SUM(C38+C40)","v":0},{"$f":"D38","v":"heures de fréquentation"}]

{"sheet":"Fréquentation TA3","index":9,"n_rows":42,"n_cols":4,"rows_kept":42,"cut":false,"hidden":false,"merged":[[8,3,8,7],[9,3,9,7],[10,3,10,7],[12,3,12,7],[13,3,13,7],[1,0,1,4],[2,0,2,4],[6,3,6,7],[7,3,7,7],[4,3,4,7],[5,3,5,7],[22,3,22,7],[23,3,23,7],[24,3,24,7],[20,3,20,7],[21,3,21,7],[14,3,14,7],[15,3,15,7],[16,3,16,7],[17,3,17,7],[18,3,18,7],[36,0,36,5],[38,0,38,5],[40,0,40,5],[25,3,25,7],[26,3,26,7],[33,3,33,7],[34,3,34,7],[28,3,28,7],[29,3,29,7],[30,3,30,7],[31,3,31,7],[32,3,32,7]]}
[]
["Période :"]
[{"$f":"Renseignements!B11","v":"Vacances de Février"}]
[]
[null,null,null,{"$f":"'Fréquentation TA2'!D5:G5","v":"Fréquentation : Matin"}]
[null,{"$f":"Moyennes!C11","v":"Prév"},{"$f":"Moyennes!D11","v":"Réel"},{"$f":"Renseignements!$B$17&\" \"&Renseignements!$C$17&\" \"&Renseignements!$D$17&\" \"&Renseignements!$E$17","v":"12 - 17 ans"}]
["Semaine 1",{"$f":"SUM(Prévisionnel!H18,Prévisionnel!L18,Prévisionnel!P18,Prévisionnel!T18,Prévisionnel!X18)*Renseignements!B20","v":4},{"$f":"SUM(Réel!H18,Réel!L18,Réel!P18,Réel!T18,Réel!X18)*Renseignements!B20","v":4},"heures de fréquentation pour cette semaine"]
["Semaine 2",{"$f":"SUM(Prévisionnel!AB18,Prévisionnel!AF18,Prévisionnel!AJ18,Prévisionnel!AN18,Prévisionnel!AR18)*Renseignements!B20","v":0},{"$f":"SUM(Réel!AB18,Réel!AF18,Réel!AJ18,Réel!AN18,Réel!AR18)*Renseignements!B20","v":0},{"$f":"D7","v":"heures de fréquentation pour cette semaine"}]
["Semaine 3",{"$f":"SUM(Prévisionnel!AV18,Prévisionnel!AZ18,Prévisionnel!BD18,Prévisionnel!BH18,Prévisionnel!BL18)*Renseignements!B20","v":0},{"$f":"SUM(Réel!AV18,Réel!AZ18,Réel!BD18,Réel!BH18,Réel!BL18)*Renseignements!B20","v":0},{"$f":"D7","v":"heures de fréquentation pour cette semaine"}]
["Semaine 4",{"$f":"SUM(Prévisionnel!BP18,Prévisionnel!BT18,Prévisionnel!BX18,Prévisionnel!CB18,Prévisionnel!CF18)*Renseignements!B20","v":0},{"$f":"SUM(Réel!BP18,Réel!BT18,Réel!BX18,Réel!CB18,Réel!CF18)*Renseignements!B20","v":0},{"$f":"D7","v":"heures de fréquentation pour cette semaine"}]
["Globale",{"$f":"SUM(B7:B10)","v":4},{"$f":"SUM(C7:C10)","v":4},"heures de fréquentation pour les quatre semaines"]
[]
[null,null,null,{"$f":"'Fréquentation TA2'!D13:G13","v":"Fréquentation : Après-midi"}]
[null,{"$f":"B6","v":"Prév"},{"$f":"C6","v":"Réel"},{"$f":"Renseignements!$B$17&\" \"&Renseignements!$C$17&\" \"&Renseignements!$D$17&\" \"&Renseignements!$E$17","v":"12 - 17 ans"}]
["Semaine 1",{"$f":"SUM(Prévisionnel!I18,Prévisionnel!M18,Prévisionnel!Q18,Prévisionnel!U18,Prévisionnel!Y18)*Renseignements!B21","v":4},{"$f":"SUM(Réel!I18,Réel!M18,Réel!Q18,Réel!U18,Réel!Y18)*Renseignements!B21","v":0},{"$f":"D7","v":"heures de fréquentation pour cette semaine"}]
["Semaine 2",{"$f":"SUM(Prévisionnel!I18,Prévisionnel!M18,Prévisionnel!Q18,Prévisionnel!U18,Prévisionnel!Y18,Prévisionnel!AC18)*Renseignements!B21","v":4},{"$f":"SUM(Réel!I18,Réel!M18,Réel!Q18,Réel!U18,Réel!Y18,Réel!AC18)*Renseignements!B21","v":0},{"$f":"D7","v":"heures de fréquentation pour cette semaine"}]
["Semaine 3",{"$f":"SUM(Prévisionnel!AW18,Prévisionnel!BA18,Prévisionnel!BE18,Prévisionnel!BI18,Prévisionnel!BM18)*Renseignements!B21","v":0},{"$f":"SUM(Réel!AW18,Réel!BA18,Réel!BE18,Réel!BI18,Réel!BM18)*Renseignements!B21","v":0},{"$f":"D7","v":"heures de fréquentation pour cette semaine"}]
["Semaine 4",{"$f":"SUM(Prévisionnel!BQ18,Prévisionnel!BU18,Prévisionnel!BY18,Prévisionnel!CC18,Prévisionnel!CG18)*Renseignements!B21","v":0},{"$f":"SUM(Réel!BQ18,Réel!BU18,Réel!BY18,Réel!CC18,Réel!CG18)*Renseignements!B21","v":0},{"$f":"D7","v":"heures de fréquentation pour cette semaine"}]
["Globale",{"$f":"SUM(B15:B18)","v":8},{"$f":"SUM(C15:C18)","v":0},{"$f":"D11","v":"heures de fréquentation pour les quatre semaines"}]
[]
[null,null,null,{"$f":"'Fréquentation TA2'!D21:G21","v":"Fréquentation : Soirée"}]
[null,{"$f":"B6","v":"Prév"},{"$f":"C6","v":"Réel"},{"$f":"Renseignements!$B$17&\" \"&Renseignements!$C$17&\" \"&Renseignements!$D$17&\" \"&Renseignements!$E$17","v":"12 - 17 ans"}]
["Semaine 1",{"$f":"SUM(Prévisionnel!J18,Prévisionnel!N18,Prévisionnel!R18,Prévisionnel!V18,Prévisionnel!Z18)*Renseignements!B22","v":0},{"$f":"SUM(Réel!J18,Réel!N18,Réel!R18,Réel!V18,Réel!Z18)*Renseignements!B22","v":0},{"$f":"D7","v":"heures de fréquentation pour cette semaine"}]
["Semaine 2",{"$f":"SUM(Prévisionnel!AD18,Prévisionnel!AH18,Prévisionnel!AL18,Prévisionnel!AP18,Prévisionnel!AT18)*Renseignements!B22","v":0},{"$f":"SUM(Réel!AD18,Réel!AH18,Réel!AL18,Réel!AP18,Réel!AT18)*Renseignements!B22","v":0},{"$f":"D7","v":"heures de fréquentation pour cette semaine"}]
["Semaine 3",{"$f":"SUM(Prévisionnel!AX18,Prévisionnel!BB18,Prévisionnel!BF18,Prévisionnel!BJ18,Prévisionnel!BN18)*Renseignements!B22","v":0},{"$f":"SUM(Réel!AX18,Réel!BB18,Réel!BF18,Réel!BJ18,Réel!BN18)*Renseignements!B22","v":0},{"$f":"D7","v":"heures de fréquentation pour cette semaine"}]
["Semaine 4",{"$f":"SUM(Prévisionnel!BR18,Prévisionnel!BV18,Prévisionnel!BZ18,Prévisionnel!CD18,Prévisionnel!CH18)*Renseignements!B22","v":0},{"$f":"SUM(Réel!BR18,Réel!BV18,Réel!BZ18,Réel!CD18,Réel!CH18)*Renseignements!B22","v":0},{"$f":"D7","v":"heures de fréquentation pour cette semaine"}]
["Globale",{"$f":"SUM(B23:B26)","v":0},{"$f":"SUM(C23:C26)","v":0},{"$f":"D11","v":"heures de fréquentation pour les quatre semaines"}]
[]
[null,null,null,{"$f":"'Fréquentation TA2'!D29:G29","v":"Fréquentation : Séjour"}]
[null,{"$f":"B14","v":"Prév"},{"$f":"C14","v":"Réel"},{"$f":"Renseignements!$B$17&\" \"&Renseignements!$C$17&\" \"&Renseignements!$D$17&\" \"&Renseignements!$E$17","v":"12 - 17 ans"}]
["Semaine 1",{"$f":"SUM(Prévisionnel!K26,Prévisionnel!O26,Prévisionnel!S26,Prévisionnel!W26,Prévisionnel!AA26)*Renseignements!B24","v":0},{"$f":"SUM(Réel!K26,Réel!O26,Réel!S26,Réel!W26,Réel!AA26)*Renseignements!B24","v":0},{"$f":"D23","v":"heures de fréquentation pour cette semaine"}]
["Semaine 2",{"$f":"SUM(Prévisionnel!AE26,Prévisionnel!AI26,Prévisionnel!AM26,Prévisionnel!AQ26,Prévisionnel!AU26)*Renseignements!B24","v":0},{"$f":"SUM(Réel!AE26,Réel!AI26,Réel!AM26,Réel!AQ26,Réel!AU26)*Renseignements!B24","v":0},{"$f":"D23","v":"heures de fréquentation pour cette semaine"}]
["Semaine 3",{"$f":"SUM(Prévisionnel!AY26,Prévisionnel!BC26,Prévisionnel!BG26,Prévisionnel!BK26,Prévisionnel!BO26)*Renseignements!B24","v":0},{"$f":"SUM(Réel!AY26,Réel!BC26,Réel!BG26,Réel!BK26,Réel!BO26)*Renseignements!B24","v":0},{"$f":"D23","v":"heures de fréquentation pour cette semaine"}]
["Semaine 4",{"$f":"SUM(Prévisionnel!BS26,Prévisionnel!BW26,Prévisionnel!CA26,Prévisionnel!CE26,Prévisionnel!CI26)*Renseignements!B24","v":0},{"$f":"SUM(Réel!BS26,Réel!BW26,Réel!CA26,Réel!CE26,Réel!CI26)*Renseignements!B24","v":0},{"$f":"D23","v":"heures de fréquentation pour cette semaine"}]
["Globale",{"$f":"SUM(B31:B34)","v":0},{"$f":"SUM(C31:C34)","v":0},{"$f":"D19","v":"heures de fréquentation pour les quatre semaines"}]
[]
["Général (Matin + après-midi + soirée)"]
[null,{"$f":"SUM(B11,B19,B27)","v":12},{"$f":"SUM(C11,C19,C27)","v":4},"heures de fréquentation"]
["Général (Séjour)"]
[null,{"$f":"B35","v":0},{"$f":"C35","v":0},{"$f":"D38","v":"heures de fréquentation"}]
[{"$f":"\"Général\" &\" \"& Renseignements!B11","v":"Général Vacances de Février"}]
[null,{"$f":"SUM(B38+B40)","v":12},{"$f":"SUM(C38+C40)","v":4},{"$f":"D38","v":"heures de fréquentation"}]

{"sheet":"Prév-Réel","index":10,"n_rows":0,"n_cols":0,"rows_kept":0,"cut":false,"hidden":false,"merged":[]}

{"sheet":"Récap","index":12,"n_rows":50,"n_cols":23,"rows_kept":50,"cut":false,"hidden":false,"merged":[[4,16,4,20],[1,0,1,4],[2,0,2,4],[4,1,4,5],[4,6,4,10],[4,11,4,15]]}
[]
["Période :"]
[{"$f":"Renseignements!B11","v":"Vacances de Février"}]
[]
[null,"Semaine 1",null,null,null,null,"Semaine 2",null,null,null,null,"Semaine 3",null,null,null,null,"Semaine 4"]
[null,{"$f":"Réel!H8","v":"2016-10-24"},{"$f":"Réel!L8","v":"2016-10-25"},{"$f":"Réel!P8","v":"2016-10-26"},{"$f":"Réel!T8","v":"2016-10-27"},{"$f":"Réel!X8","v":"2016-10-28"},{"$f":"Réel!AB8","v":"2016-10-29"},{"$f":"Réel!AF8","v":"2016-10-30"},{"$f":"Réel!AJ8","v":"2016-10-31"},{"$f":"Réel!AN8","v":"2016-11-01"},{"$f":"Réel!AR8","v":"2016-11-02"},{"$f":"Réel!AV8","v":"2016-11-03"},{"$f":"Réel!BT8","v":"2016-11-09"},{"$f":"Réel!BX8","v":"2016-11-10"},{"$f":"Réel!CB8","v":"2016-11-11"},{"$f":"Réel!CF8","v":"2016-11-12"},"2016-11-10","2016-11-11","2016-11-12","2016-11-13","2016-11-14","Sommes","Heures"]
["Matin",{"$f":"Réel!H15","v":1},{"$f":"Réel!L15","v":0},{"$f":"Réel!P15","v":0},{"$f":"Réel!T15","v":0},{"$f":"Réel!X15","v":0},{"$f":"Réel!AB15","v":0},{"$f":"Réel!AF15","v":0},{"$f":"Réel!AJ15","v":0},{"$f":"Réel!AN15","v":0},{"$f":"Réel!AR15","v":0},{"$f":"Réel!AV15","v":0},{"$f":"Réel!AZ15","v":0},{"$f":"Réel!BD15","v":0},{"$f":"Réel!BH15","v":0},{"$f":"Réel!BL15","v":0},{"$f":"Réel!BP15","v":0},{"$f":"Réel!BT15","v":0},{"$f":"Réel!BX15","v":0},{"$f":"Réel!CB15","v":0},{"$f":"Réel!CF15","v":0},{"$f":"SUM(B7:U7)","v":1},{"$f":"V7*Renseignements!$B$20","v":4}]
[{"$f":"Réel!F16","v":"4 - 5 ans"},{"$f":"Réel!H16","v":0},{"$f":"Réel!L16","v":0},{"$f":"Réel!P16","v":0},{"$f":"Réel!T16","v":0},{"$f":"Réel!X16","v":0},{"$f":"Réel!AB16","v":0},{"$f":"Réel!AF16","v":0},{"$f":"Réel!AJ16","v":0},{"$f":"Réel!AN16","v":0},{"$f":"Réel!AR16","v":0},{"$f":"Réel!AV16","v":0},{"$f":"Réel!AZ16","v":0},{"$f":"Réel!BD16","v":0},{"$f":"Réel!BH16","v":0},{"$f":"Réel!BL16","v":0},{"$f":"Réel!BP16","v":0},{"$f":"Réel!BT16","v":0},{"$f":"Réel!BX16","v":0},{"$f":"Réel!CB16","v":0},{"$f":"Réel!CF16","v":0},{"$f":"SUM(B8:U8)","v":0},{"$f":"V8*Renseignements!$B$20","v":0}]
["G",{"$f":"Réel!$H$21","v":0},{"$f":"Réel!$L$21","v":0},{"$f":"Réel!$P$21","v":0},{"$f":"Réel!$T$21","v":0},{"$f":"Réel!$X$21","v":0},{"$f":"Réel!$AB$21","v":0},{"$f":"Réel!$AF$21","v":0},{"$f":"Réel!$AJ$21","v":0},{"$f":"Réel!$AN$21","v":0},{"$f":"Réel!$AR$21","v":0},{"$f":"Réel!$AV$21","v":0},{"$f":"Réel!$AZ$21","v":0},{"$f":"Réel!$BD$21","v":0},{"$f":"Réel!$BH$21","v":0},{"$f":"Réel!$BL$21","v":0},{"$f":"Réel!$BP$21","v":0},{"$f":"Réel!$BT$21","v":0},{"$f":"Réel!$BX$21","v":0},{"$f":"Réel!$CB$21","v":0},{"$f":"Réel!$CF$21","v":0},0,{"$f":"V9*Renseignements!$B$20","v":0}]
["F",{"$f":"Réel!H26","v":0},{"$f":"Réel!L26","v":0},{"$f":"Réel!P26","v":0},{"$f":"Réel!T26","v":0},{"$f":"Réel!X26","v":0},{"$f":"Réel!AB26","v":0},{"$f":"Réel!AF26","v":0},{"$f":"Réel!AJ26","v":0},{"$f":"Réel!AN26","v":0},{"$f":"Réel!AR26","v":0},{"$f":"Réel!AV26","v":0},{"$f":"Réel!AZ26","v":0},{"$f":"Réel!BD26","v":0},{"$f":"Réel!BH26","v":0},{"$f":"Réel!BL26","v":0},{"$f":"Réel!BP26","v":0},{"$f":"Réel!BT26","v":0},{"$f":"Réel!BX26","v":0},{"$f":"Réel!CB26","v":0},{"$f":"Réel!CF26","v":0},0,{"$f":"V10*Renseignements!$B$20","v":0}]
[{"$f":"Réel!F17","v":"6 - 11 ans"},{"$f":"Réel!H17","v":0},{"$f":"Réel!L17","v":0},{"$f":"Réel!P17","v":0},{"$f":"Réel!T17","v":0},{"$f":"Réel!X17","v":0},{"$f":"Réel!AB17","v":0},{"$f":"Réel!AF17","v":0},{"$f":"Réel!AJ17","v":0},{"$f":"Réel!AN17","v":0},{"$f":"Réel!AR17","v":0},{"$f":"Réel!AV17","v":0},{"$f":"Réel!AZ17","v":0},{"$f":"Réel!BD17","v":0},{"$f":"Réel!BH17","v":0},{"$f":"Réel!BL17","v":0},{"$f":"Réel!BP17","v":0},{"$f":"Réel!BT17","v":0},{"$f":"Réel!BX17","v":0},{"$f":"Réel!CB17","v":0},{"$f":"Réel!CF17","v":0},0,{"$f":"V11*Renseignements!$B$20","v":0}]
[{"$f":"A9","v":"G"},{"$f":"Réel!H22","v":0},{"$f":"Réel!L22","v":0},{"$f":"Réel!P22","v":0},{"$f":"Réel!T22","v":0},{"$f":"Réel!X22","v":0},{"$f":"Réel!AB22","v":0},{"$f":"Réel!AF22","v":0},{"$f":"Réel!AJ22","v":0},{"$f":"Réel!AN22","v":0},{"$f":"Réel!AR22","v":0},{"$f":"Réel!AV22","v":0},{"$f":"Réel!AZ22","v":0},{"$f":"Réel!BD22","v":0},{"$f":"Réel!BH22","v":0},{"$f":"Réel!BL22","v":0},{"$f":"Réel!BP22","v":0},{"$f":"Réel!BT22","v":0},{"$f":"Réel!BX22","v":0},{"$f":"Réel!CB22","v":0},{"$f":"Réel!CF22","v":0},0,{"$f":"V12*Renseignements!$B$20","v":0}]
[{"$f":"A10","v":"F"},{"$f":"Réel!H27","v":0},{"$f":"Réel!L27","v":0},{"$f":"Réel!P27","v":0},{"$f":"Réel!T27","v":0},{"$f":"Réel!X27","v":0},{"$f":"Réel!AB27","v":0},{"$f":"Réel!AF27","v":0},{"$f":"Réel!AJ27","v":0},{"$f":"Réel!AN27","v":0},{"$f":"Réel!AR27","v":0},{"$f":"Réel!AV27","v":0},{"$f":"Réel!AZ27","v":0},{"$f":"Réel!BD27","v":0},{"$f":"Réel!BH27","v":0},{"$f":"Réel!BL27","v":0},{"$f":"Réel!BP27","v":0},{"$f":"Réel!BT27","v":0},{"$f":"Réel!BX27","v":0},{"$f":"Réel!CB27","v":0},{"$f":"Réel!CF27","v":0},0,{"$f":"V13*Renseignements!$B$20","v":0}]
[{"$f":"Réel!F18","v":"12 - 17 ans"},{"$f":"Réel!H18","v":1},{"$f":"Réel!L18","v":0},{"$f":"Réel!P18","v":0},{"$f":"Réel!T18","v":0},{"$f":"Réel!X18","v":0},{"$f":"Réel!AB18","v":0},{"$f":"Réel!AF18","v":0},{"$f":"Réel!AJ18","v":0},{"$f":"Réel!AN18","v":0},{"$f":"Réel!AR18","v":0},{"$f":"Réel!AV18","v":0},{"$f":"Réel!AZ18","v":0},{"$f":"Réel!BD18","v":0},{"$f":"Réel!BH18","v":0},{"$f":"Réel!BL18","v":0},{"$f":"Réel!BP18","v":0},{"$f":"Réel!BT18","v":0},{"$f":"Réel!BX18","v":0},{"$f":"Réel!CB18","v":0},{"$f":"Réel!CF18","v":0},1,{"$f":"V14*Renseignements!$B$20","v":4}]
[{"$f":"A9","v":"G"},{"$f":"Réel!H23","v":0},{"$f":"Réel!L23","v":0},{"$f":"Réel!P23","v":0},{"$f":"Réel!T23","v":0},{"$f":"Réel!X23","v":0},{"$f":"Réel!AB23","v":0},{"$f":"Réel!AF23","v":0},{"$f":"Réel!AJ23","v":0},{"$f":"Réel!AN23","v":0},{"$f":"Réel!AR23","v":0},{"$f":"Réel!AV23","v":0},{"$f":"Réel!AZ23","v":0},{"$f":"Réel!BD23","v":0},{"$f":"Réel!BH23","v":0},{"$f":"Réel!BL23","v":0},{"$f":"Réel!BP23","v":0},{"$f":"Réel!BT23","v":0},{"$f":"Réel!BX23","v":0},{"$f":"Réel!CB23","v":0},{"$f":"Réel!CF23","v":0},0,{"$f":"V15*Renseignements!$B$20","v":0}]
[{"$f":"A10","v":"F"},{"$f":"Réel!H28","v":1},{"$f":"Réel!L28","v":0},{"$f":"Réel!P28","v":0},{"$f":"Réel!T28","v":0},{"$f":"Réel!X28","v":0},{"$f":"Réel!AB28","v":0},{"$f":"Réel!AF28","v":0},{"$f":"Réel!AJ28","v":0},{"$f":"Réel!AN28","v":0},{"$f":"Réel!AR28","v":0},{"$f":"Réel!AV28","v":0},{"$f":"Réel!AZ28","v":0},{"$f":"Réel!BD28","v":0},{"$f":"Réel!BH28","v":0},{"$f":"Réel!BL28","v":0},{"$f":"Réel!BP28","v":0},{"$f":"Réel!BT28","v":0},{"$f":"Réel!BX28","v":0},{"$f":"Réel!CB28","v":0},{"$f":"Réel!CF28","v":0},1,{"$f":"V16*Renseignements!$B$20","v":4}]
[{"$f":"Réel!F19","v":"Autres"},{"$f":"Réel!H19","v":0},{"$f":"Réel!L19","v":0},{"$f":"Réel!P19","v":0},{"$f":"Réel!T19","v":0},{"$f":"Réel!X19","v":0},{"$f":"Réel!AB19","v":0},{"$f":"Réel!AF19","v":0},{"$f":"Réel!AJ19","v":0},{"$f":"Réel!AN19","v":0},{"$f":"Réel!AR19","v":0},{"$f":"Réel!AV19","v":0},{"$f":"Réel!AZ19","v":0},{"$f":"Réel!BD19","v":0},{"$f":"Réel!BH19","v":0},{"$f":"Réel!BL19","v":0},{"$f":"Réel!BP19","v":0},{"$f":"Réel!BT19","v":0},{"$f":"Réel!BX19","v":0},{"$f":"Réel!CB19","v":0},{"$f":"Réel!CF19","v":0},0,{"$f":"V17*Renseignements!$B$20","v":0}]
["Après-midi",{"$f":"Réel!I15","v":0},{"$f":"Réel!M15","v":0},{"$f":"Réel!Q15","v":0},{"$f":"Réel!U15","v":0},{"$f":"Réel!Y15","v":0},{"$f":"Réel!AC15","v":0},{"$f":"Réel!AG15","v":0},{"$f":"Réel!AK15","v":0},{"$f":"Réel!AO15","v":0},{"$f":"Réel!AS15","v":0},{"$f":"Réel!AW15","v":0},{"$f":"Réel!BA15","v":0},{"$f":"Réel!BE15","v":0},{"$f":"Réel!BI15","v":0},{"$f":"Réel!BM15","v":0},{"$f":"Réel!BQ15","v":0},{"$f":"Réel!BU15","v":0},{"$f":"Réel!BY15","v":0},{"$f":"Réel!CC15","v":0},{"$f":"Réel!CG15","v":0},0,{"$f":"V18*Renseignements!$B$21","v":0}]
[{"$f":"Réel!F16","v":"4 - 5 ans"},{"$f":"Réel!I16","v":0},{"$f":"Réel!M16","v":0},{"$f":"Réel!Q16","v":0},{"$f":"Réel!U16","v":0},{"$f":"Réel!Y16","v":0},{"$f":"Réel!AC16","v":0},{"$f":"Réel!AG16","v":0},{"$f":"Réel!AK16","v":0},{"$f":"Réel!AO16","v":0},{"$f":"Réel!AS16","v":0},{"$f":"Réel!AW16","v":0},{"$f":"Réel!BA16","v":0},{"$f":"Réel!BE16","v":0},{"$f":"Réel!BI16","v":0},{"$f":"Réel!BM16","v":0},{"$f":"Réel!BQ16","v":0},{"$f":"Réel!BU16","v":0},{"$f":"Réel!BY16","v":0},{"$f":"Réel!CC16","v":0},{"$f":"Réel!CG16","v":0},0,{"$f":"V19*Renseignements!$B$21","v":0}]
[{"$f":"A9","v":"G"},{"$f":"Réel!I21","v":0},{"$f":"Réel!M21","v":0},{"$f":"Réel!Q21","v":0},{"$f":"Réel!U21","v":0},{"$f":"Réel!Y21","v":0},{"$f":"Réel!AC21","v":0},{"$f":"Réel!AG21","v":0},{"$f":"Réel!AK21","v":0},{"$f":"Réel!AO21","v":0},{"$f":"Réel!AS21","v":0},{"$f":"Réel!AW21","v":0},{"$f":"Réel!BA21","v":0},{"$f":"Réel!BE21","v":0},{"$f":"Réel!BI21","v":0},{"$f":"Réel!BM21","v":0},{"$f":"Réel!BQ21","v":0},{"$f":"Réel!BU21","v":0},{"$f":"Réel!BY21","v":0},{"$f":"Réel!CC21","v":0},{"$f":"Réel!CG21","v":0},0,{"$f":"V20*Renseignements!$B$21","v":0}]
[{"$f":"A10","v":"F"},{"$f":"Réel!I26","v":0},{"$f":"Réel!M26","v":0},{"$f":"Réel!Q26","v":0},{"$f":"Réel!U26","v":0},{"$f":"Réel!Y26","v":0},{"$f":"Réel!AC26","v":0},{"$f":"Réel!AG26","v":0},{"$f":"Réel!AK26","v":0},{"$f":"Réel!AO26","v":0},{"$f":"Réel!AS26","v":0},{"$f":"Réel!AW26","v":0},{"$f":"Réel!BA26","v":0},{"$f":"Réel!BE26","v":0},{"$f":"Réel!BI26","v":0},{"$f":"Réel!BM26","v":0},{"$f":"Réel!BQ26","v":0},{"$f":"Réel!BU26","v":0},{"$f":"Réel!BY26","v":0},{"$f":"Réel!CC26","v":0},{"$f":"Réel!CG26","v":0},0,{"$f":"V21*Renseignements!$B$21","v":0}]
[{"$f":"Réel!F17","v":"6 - 11 ans"},{"$f":"Réel!I17","v":0},{"$f":"Réel!M17","v":0},{"$f":"Réel!Q17","v":0},{"$f":"Réel!U17","v":0},{"$f":"Réel!Y17","v":0},{"$f":"Réel!AC17","v":0},{"$f":"Réel!AG17","v":0},{"$f":"Réel!AK17","v":0},{"$f":"Réel!AO17","v":0},{"$f":"Réel!AS17","v":0},{"$f":"Réel!AW17","v":0},{"$f":"Réel!BA17","v":0},{"$f":"Réel!BE17","v":0},{"$f":"Réel!BI17","v":0},{"$f":"Réel!BM17","v":0},{"$f":"Réel!BQ17","v":0},{"$f":"Réel!BU17","v":0},{"$f":"Réel!BY17","v":0},{"$f":"Réel!CC17","v":0},{"$f":"Réel!CG17","v":0},0,{"$f":"V22*Renseignements!$B$21","v":0}]
[{"$f":"A9","v":"G"},{"$f":"Réel!I22","v":0},{"$f":"Réel!M22","v":0},{"$f":"Réel!Q22","v":0},{"$f":"Réel!U22","v":0},{"$f":"Réel!Y22","v":0},{"$f":"Réel!AC22","v":0},{"$f":"Réel!AG22","v":0},{"$f":"Réel!AK22","v":0},{"$f":"Réel!AO22","v":0},{"$f":"Réel!AS22","v":0},{"$f":"Réel!AW22","v":0},{"$f":"Réel!BA22","v":0},{"$f":"Réel!BE22","v":0},{"$f":"Réel!BI22","v":0},{"$f":"Réel!BM22","v":0},{"$f":"Réel!BQ22","v":0},{"$f":"Réel!BU22","v":0},{"$f":"Réel!BY22","v":0},{"$f":"Réel!CC22","v":0},{"$f":"Réel!CG22","v":0},0,{"$f":"V23*Renseignements!$B$21","v":0}]
[{"$f":"A10","v":"F"},{"$f":"Réel!I27","v":0},{"$f":"Réel!M27","v":0},{"$f":"Réel!Q27","v":0},{"$f":"Réel!U27","v":0},{"$f":"Réel!Y27","v":0},{"$f":"Réel!AC27","v":0},{"$f":"Réel!AG27","v":0},{"$f":"Réel!AK27","v":0},{"$f":"Réel!AO27","v":0},{"$f":"Réel!AS27","v":0},{"$f":"Réel!AW27","v":0},{"$f":"Réel!BA27","v":0},{"$f":"Réel!BE27","v":0},{"$f":"Réel!BI27","v":0},{"$f":"Réel!BM27","v":0},{"$f":"Réel!BQ27","v":0},{"$f":"Réel!BU27","v":0},{"$f":"Réel!BY27","v":0},{"$f":"Réel!CC27","v":0},{"$f":"Réel!CG27","v":0},0,{"$f":"V24*Renseignements!$B$21","v":0}]
[{"$f":"Réel!F18","v":"12 - 17 ans"},{"$f":"Réel!I18","v":0},{"$f":"Réel!M18","v":0},{"$f":"Réel!Q18","v":0},{"$f":"Réel!U18","v":0},{"$f":"Réel!Y18","v":0},{"$f":"Réel!AC18","v":0},{"$f":"Réel!AG18","v":0},{"$f":"Réel!AK18","v":0},{"$f":"Réel!AO18","v":0},{"$f":"Réel!AS18","v":0},{"$f":"Réel!AW18","v":0},{"$f":"Réel!BA18","v":0},{"$f":"Réel!BE18","v":0},{"$f":"Réel!BI18","v":0},{"$f":"Réel!BM18","v":0},{"$f":"Réel!BQ18","v":0},{"$f":"Réel!BU18","v":0},{"$f":"Réel!BY18","v":0},{"$f":"Réel!CC18","v":0},{"$f":"Réel!CG18","v":0},0,{"$f":"V25*Renseignements!$B$21","v":0}]
[{"$f":"A9","v":"G"},{"$f":"Réel!I23","v":0},{"$f":"Réel!M23","v":0},{"$f":"Réel!Q23","v":0},{"$f":"Réel!U23","v":0},{"$f":"Réel!Y23","v":0},{"$f":"Réel!AC23","v":0},{"$f":"Réel!AG23","v":0},{"$f":"Réel!AK23","v":0},{"$f":"Réel!AO23","v":0},{"$f":"Réel!AS23","v":0},{"$f":"Réel!AW23","v":0},{"$f":"Réel!BA23","v":0},{"$f":"Réel!BE23","v":0},{"$f":"Réel!BI23","v":0},{"$f":"Réel!BM23","v":0},{"$f":"Réel!BQ23","v":0},{"$f":"Réel!BU23","v":0},{"$f":"Réel!BY23","v":0},{"$f":"Réel!CC23","v":0},{"$f":"Réel!CG23","v":0},0,{"$f":"V26*Renseignements!$B$21","v":0}]
[{"$f":"A10","v":"F"},{"$f":"Réel!I28","v":0},{"$f":"Réel!M28","v":0},{"$f":"Réel!Q28","v":0},{"$f":"Réel!U28","v":0},{"$f":"Réel!Y28","v":0},{"$f":"Réel!AC28","v":0},{"$f":"Réel!AG28","v":0},{"$f":"Réel!AK28","v":0},{"$f":"Réel!AO28","v":0},{"$f":"Réel!AS28","v":0},{"$f":"Réel!AW28","v":0},{"$f":"Réel!BA28","v":0},{"$f":"Réel!BE28","v":0},{"$f":"Réel!BI28","v":0},{"$f":"Réel!BM28","v":0},{"$f":"Réel!BQ28","v":0},{"$f":"Réel!BU28","v":0},{"$f":"Réel!BY28","v":0},{"$f":"Réel!CC28","v":0},{"$f":"Réel!CG28","v":0},0,{"$f":"V27*Renseignements!$B$21","v":0}]
[{"$f":"Réel!F19","v":"Autres"},{"$f":"Réel!I19","v":0},{"$f":"Réel!M19","v":0},{"$f":"Réel!Q19","v":0},{"$f":"Réel!U19","v":0},{"$f":"Réel!Y19","v":0},{"$f":"Réel!AC19","v":0},{"$f":"Réel!AG19","v":0},{"$f":"Réel!AK19","v":0},{"$f":"Réel!AO19","v":0},{"$f":"Réel!AS19","v":0},{"$f":"Réel!AW19","v":0},{"$f":"Réel!BA19","v":0},{"$f":"Réel!BE19","v":0},{"$f":"Réel!BI19","v":0},{"$f":"Réel!BM19","v":0},{"$f":"Réel!BQ19","v":0},{"$f":"Réel!BU19","v":0},{"$f":"Réel!BY19","v":0},{"$f":"Réel!CC19","v":0},{"$f":"Réel!CG19","v":0},0,{"$f":"V28*Renseignements!$B$21","v":0}]
["Soirée",{"$f":"Réel!J15","v":0},{"$f":"Réel!N15","v":0},{"$f":"Réel!R15","v":0},{"$f":"Réel!V15","v":0},{"$f":"Réel!Z15","v":0},{"$f":"Réel!AD15","v":0},{"$f":"Réel!AH15","v":0},{"$f":"Réel!AL15","v":0},{"$f":"Réel!AP15","v":0},{"$f":"Réel!AT15","v":0},{"$f":"Réel!AX15","v":0},{"$f":"Réel!BB15","v":0},{"$f":"Réel!BF15","v":0},{"$f":"Réel!BJ15","v":0},{"$f":"Réel!BN15","v":0},{"$f":"Réel!BR15","v":0},{"$f":"Réel!BV15","v":0},{"$f":"Réel!BZ15","v":0},{"$f":"Réel!CD15","v":0},{"$f":"Réel!CH15","v":0},0,{"$f":"V29*Renseignements!$B$22","v":0}]
[{"$f":"Réel!F16","v":"4 - 5 ans"},{"$f":"Réel!J16","v":0},{"$f":"Réel!N16","v":0},{"$f":"Réel!R16","v":0},{"$f":"Réel!V16","v":0},{"$f":"Réel!Z16","v":0},{"$f":"Réel!AD16","v":0},{"$f":"Réel!AH16","v":0},{"$f":"Réel!AL16","v":0},{"$f":"Réel!AP16","v":0},{"$f":"Réel!AT16","v":0},{"$f":"Réel!AX16","v":0},{"$f":"Réel!BB16","v":0},{"$f":"Réel!BF16","v":0},{"$f":"Réel!BJ16","v":0},{"$f":"Réel!BN16","v":0},{"$f":"Réel!BR16","v":0},{"$f":"Réel!BV16","v":0},{"$f":"Réel!BZ16","v":0},{"$f":"Réel!CD16","v":0},{"$f":"Réel!CH16","v":0},0,{"$f":"V30*Renseignements!$B$22","v":0}]
[{"$f":"A9","v":"G"},{"$f":"Réel!J21","v":0},{"$f":"Réel!N21","v":0},{"$f":"Réel!R21","v":0},{"$f":"Réel!V21","v":0},{"$f":"Réel!Z21","v":0},{"$f":"Réel!AD21","v":0},{"$f":"Réel!AH21","v":0},{"$f":"Réel!AL21","v":0},{"$f":"Réel!AP21","v":0},{"$f":"Réel!AT21","v":0},{"$f":"Réel!AX21","v":0},{"$f":"Réel!BB21","v":0},{"$f":"Réel!BF21","v":0},{"$f":"Réel!BJ21","v":0},{"$f":"Réel!BN21","v":0},{"$f":"Réel!BR21","v":0},{"$f":"Réel!BV21","v":0},{"$f":"Réel!BZ21","v":0},{"$f":"Réel!CD21","v":0},{"$f":"Réel!CH21","v":0},0,{"$f":"V31*Renseignements!$B$22","v":0}]
[{"$f":"A10","v":"F"},{"$f":"Réel!J18","v":0},{"$f":"Réel!N18","v":0},{"$f":"Réel!R18","v":0},{"$f":"Réel!V18","v":0},{"$f":"Réel!Z18","v":0},{"$f":"Réel!AD18","v":0},{"$f":"Réel!AH18","v":0},{"$f":"Réel!AL18","v":0},{"$f":"Réel!AP18","v":0},{"$f":"Réel!AT18","v":0},{"$f":"Réel!AX18","v":0},{"$f":"Réel!BB18","v":0},{"$f":"Réel!BF18","v":0},{"$f":"Réel!BJ18","v":0},{"$f":"Réel!BN18","v":0},{"$f":"Réel!BR18","v":0},{"$f":"Réel!BV18","v":0},{"$f":"Réel!BZ18","v":0},{"$f":"Réel!CD18","v":0},{"$f":"Réel!CH18","v":0},0,{"$f":"V32*Renseignements!$B$22","v":0}]
[{"$f":"Réel!F17","v":"6 - 11 ans"},{"$f":"Réel!J17","v":0},{"$f":"Réel!N17","v":0},{"$f":"Réel!R17","v":0},{"$f":"Réel!V17","v":0},{"$f":"Réel!Z17","v":0},{"$f":"Réel!AD17","v":0},{"$f":"Réel!AH17","v":0},{"$f":"Réel!AL17","v":0},{"$f":"Réel!AP17","v":0},{"$f":"Réel!AT17","v":0},{"$f":"Réel!AX17","v":0},{"$f":"Réel!BB17","v":0},{"$f":"Réel!BF17","v":0},{"$f":"Réel!BJ17","v":0},{"$f":"Réel!BN17","v":0},{"$f":"Réel!BR17","v":0},{"$f":"Réel!BV17","v":0},{"$f":"Réel!BZ17","v":0},{"$f":"Réel!CD17","v":0},{"$f":"Réel!CH17","v":0},0,{"$f":"V33*Renseignements!$B$22","v":0}]
[{"$f":"A31","v":"G"},{"$f":"Réel!J22","v":0},{"$f":"Réel!N22","v":0},{"$f":"Réel!R22","v":0},{"$f":"Réel!V22","v":0},{"$f":"Réel!Z22","v":0},{"$f":"Réel!AD22","v":0},{"$f":"Réel!AH22","v":0},{"$f":"Réel!AL22","v":0},{"$f":"Réel!AP22","v":0},{"$f":"Réel!AT22","v":0},{"$f":"Réel!AX22","v":0},{"$f":"Réel!BB22","v":0},{"$f":"Réel!BF22","v":0},{"$f":"Réel!BJ22","v":0},{"$f":"Réel!BN22","v":0},{"$f":"Réel!BR22","v":0},{"$f":"Réel!BV22","v":0},{"$f":"Réel!BZ22","v":0},{"$f":"Réel!CD22","v":0},{"$f":"Réel!CH22","v":0},0,{"$f":"V34*Renseignements!$B$22","v":0}]
[{"$f":"A32","v":"F"},{"$f":"Réel!J27","v":0},{"$f":"Réel!N27","v":0},{"$f":"Réel!R27","v":0},{"$f":"Réel!V27","v":0},{"$f":"Réel!Z27","v":0},{"$f":"Réel!AD27","v":0},{"$f":"Réel!AH27","v":0},{"$f":"Réel!AL27","v":0},{"$f":"Réel!AP27","v":0},{"$f":"Réel!AT27","v":0},{"$f":"Réel!AX27","v":0},{"$f":"Réel!BB27","v":0},{"$f":"Réel!BF27","v":0},{"$f":"Réel!BJ27","v":0},{"$f":"Réel!BN27","v":0},{"$f":"Réel!BR27","v":0},{"$f":"Réel!BV27","v":0},{"$f":"Réel!BZ27","v":0},{"$f":"Réel!CD27","v":0},{"$f":"Réel!CH27","v":0},0,{"$f":"V35*Renseignements!$B$22","v":0}]
[{"$f":"Réel!F18","v":"12 - 17 ans"},{"$f":"Réel!J18","v":0},{"$f":"Réel!N18","v":0},{"$f":"Réel!R18","v":0},{"$f":"Réel!V18","v":0},{"$f":"Réel!Z18","v":0},{"$f":"Réel!AD18","v":0},{"$f":"Réel!AH18","v":0},{"$f":"Réel!AL18","v":0},{"$f":"Réel!AP18","v":0},{"$f":"Réel!AT18","v":0},{"$f":"Réel!AX18","v":0},{"$f":"Réel!BB18","v":0},{"$f":"Réel!BF18","v":0},{"$f":"Réel!BJ18","v":0},{"$f":"Réel!BN18","v":0},{"$f":"Réel!BR18","v":0},{"$f":"Réel!BV18","v":0},{"$f":"Réel!BZ18","v":0},{"$f":"Réel!CD18","v":0},{"$f":"Réel!CH18","v":0},0,{"$f":"V36*Renseignements!$B$22","v":0}]
[{"$f":"A31","v":"G"},{"$f":"Réel!J23","v":0},{"$f":"Réel!N23","v":0},{"$f":"Réel!R23","v":0},{"$f":"Réel!V23","v":0},{"$f":"Réel!Z23","v":0},{"$f":"Réel!AD23","v":0},{"$f":"Réel!AH23","v":0},{"$f":"Réel!AL23","v":0},{"$f":"Réel!AP23","v":0},{"$f":"Réel!AT23","v":0},{"$f":"Réel!AX23","v":0},{"$f":"Réel!BB23","v":0},{"$f":"Réel!BF23","v":0},{"$f":"Réel!BJ23","v":0},{"$f":"Réel!BN23","v":0},{"$f":"Réel!BR23","v":0},{"$f":"Réel!BV23","v":0},{"$f":"Réel!BZ23","v":0},{"$f":"Réel!CD23","v":0},{"$f":"Réel!CH23","v":0},0,{"$f":"V37*Renseignements!$B$22","v":0}]
[{"$f":"A32","v":"F"},{"$f":"Réel!J28","v":0},{"$f":"Réel!N28","v":0},{"$f":"Réel!R28","v":0},{"$f":"Réel!V28","v":0},{"$f":"Réel!Z28","v":0},{"$f":"Réel!AD28","v":0},{"$f":"Réel!AH28","v":0},{"$f":"Réel!AL28","v":0},{"$f":"Réel!AP28","v":0},{"$f":"Réel!AT28","v":0},{"$f":"Réel!AX28","v":0},{"$f":"Réel!BB28","v":0},{"$f":"Réel!BF28","v":0},{"$f":"Réel!BJ28","v":0},{"$f":"Réel!BN28","v":0},{"$f":"Réel!BR28","v":0},{"$f":"Réel!BV28","v":0},{"$f":"Réel!BZ28","v":0},{"$f":"Réel!CD28","v":0},{"$f":"Réel!CH28","v":0},0,{"$f":"V38*Renseignements!$B$22","v":0}]
[{"$f":"Réel!F19","v":"Autres"},{"$f":"Réel!J19","v":0},{"$f":"Réel!N19","v":0},{"$f":"Réel!R19","v":0},{"$f":"Réel!V19","v":0},{"$f":"Réel!Z19","v":0},{"$f":"Réel!AD19","v":0},{"$f":"Réel!AH19","v":0},{"$f":"Réel!AL19","v":0},{"$f":"Réel!AP19","v":0},{"$f":"Réel!AT19","v":0},{"$f":"Réel!AX19","v":0},{"$f":"Réel!BB19","v":0},{"$f":"Réel!BF19","v":0},{"$f":"Réel!BJ19","v":0},{"$f":"Réel!BN19","v":0},{"$f":"Réel!BR19","v":0},{"$f":"Réel!BV19","v":0},{"$f":"Réel!BZ19","v":0},{"$f":"Réel!CD19","v":0},{"$f":"Réel!CH19","v":0},0,{"$f":"V39*Renseignements!$B$22","v":0}]
["Séjour",{"$f":"Réel!K15","v":0},{"$f":"Réel!O15","v":0},{"$f":"Réel!S15","v":0},{"$f":"Réel!W15","v":0},{"$f":"Réel!AA15","v":0},{"$f":"Réel!AE15","v":0},{"$f":"Réel!AI15","v":0},{"$f":"Réel!AM15","v":0},{"$f":"Réel!AQ15","v":0},{"$f":"Réel!AU15","v":0},{"$f":"Réel!AY15","v":0},{"$f":"Réel!BC15","v":0},{"$f":"Réel!BG15","v":0},{"$f":"Réel!BK15","v":0},{"$f":"Réel!BO15","v":0},{"$f":"Réel!BS15","v":0},{"$f":"Réel!BW15","v":0},{"$f":"Réel!CA15","v":0},{"$f":"Réel!CE15","v":0},{"$f":"Réel!CI15","v":0},0,{"$f":"V40*Renseignements!$B$24","v":0}]
[{"$f":"Réel!F16","v":"4 - 5 ans"},{"$f":"Réel!K16","v":0},{"$f":"Réel!O16","v":0},{"$f":"Réel!S16","v":0},{"$f":"Réel!W16","v":0},{"$f":"Réel!AA16","v":0},{"$f":"Réel!AE16","v":0},{"$f":"Réel!AI16","v":0},{"$f":"Réel!AM16","v":0},{"$f":"Réel!AQ16","v":0},{"$f":"Réel!AU16","v":0},{"$f":"Réel!AY16","v":0},{"$f":"Réel!BC16","v":0},{"$f":"Réel!BG16","v":0},{"$f":"Réel!BK16","v":0},{"$f":"Réel!BO16","v":0},{"$f":"Réel!BS16","v":0},{"$f":"Réel!BW16","v":0},{"$f":"Réel!CA16","v":0},{"$f":"Réel!CE16","v":0},{"$f":"Réel!CI16","v":0},0,{"$f":"V41*Renseignements!$B$24","v":0}]
[{"$f":"A37","v":"G"},{"$f":"Réel!K21","v":0},{"$f":"Réel!O21","v":0},{"$f":"Réel!S21","v":0},{"$f":"Réel!W21","v":0},{"$f":"Réel!AA21","v":0},{"$f":"Réel!AE21","v":0},{"$f":"Réel!AI21","v":0},{"$f":"Réel!AM21","v":0},{"$f":"Réel!AQ21","v":0},{"$f":"Réel!AU21","v":0},{"$f":"Réel!AY21","v":0},{"$f":"Réel!BC21","v":0},{"$f":"Réel!BG21","v":0},{"$f":"Réel!BK21","v":0},{"$f":"Réel!BO21","v":0},{"$f":"Réel!BS21","v":0},{"$f":"Réel!BW21","v":0},{"$f":"Réel!CA21","v":0},{"$f":"Réel!CE21","v":0},{"$f":"Réel!CI21","v":0},0,{"$f":"V42*Renseignements!$B$24","v":0}]
[{"$f":"A38","v":"F"},{"$f":"Réel!K18","v":0},{"$f":"Réel!O18","v":0},{"$f":"Réel!S18","v":0},{"$f":"Réel!W18","v":0},{"$f":"Réel!AA18","v":0},{"$f":"Réel!AE18","v":0},{"$f":"Réel!AI18","v":0},{"$f":"Réel!AM18","v":0},{"$f":"Réel!AQ18","v":0},{"$f":"Réel!AU18","v":0},{"$f":"Réel!AY18","v":0},{"$f":"Réel!BC18","v":0},{"$f":"Réel!BG18","v":0},{"$f":"Réel!BK18","v":0},{"$f":"Réel!BO18","v":0},{"$f":"Réel!BS18","v":0},{"$f":"Réel!BW18","v":0},{"$f":"Réel!CA18","v":0},{"$f":"Réel!CE18","v":0},{"$f":"Réel!CI18","v":0},0,{"$f":"V43*Renseignements!$B$24","v":0}]
[{"$f":"Réel!F17","v":"6 - 11 ans"},{"$f":"Réel!K17","v":0},{"$f":"Réel!O17","v":0},{"$f":"Réel!S17","v":0},{"$f":"Réel!W17","v":0},{"$f":"Réel!AA17","v":0},{"$f":"Réel!AE17","v":0},{"$f":"Réel!AI17","v":0},{"$f":"Réel!AM17","v":0},{"$f":"Réel!AQ17","v":0},{"$f":"Réel!AU17","v":0},{"$f":"Réel!AY17","v":0},{"$f":"Réel!BC17","v":0},{"$f":"Réel!BG17","v":0},{"$f":"Réel!BK17","v":0},{"$f":"Réel!BO17","v":0},{"$f":"Réel!BS17","v":0},{"$f":"Réel!BW17","v":0},{"$f":"Réel!CA17","v":0},{"$f":"Réel!CE17","v":0},{"$f":"Réel!CI17","v":0},0,{"$f":"V44*Renseignements!$B$24","v":0}]
[{"$f":"A37","v":"G"},{"$f":"Réel!K22","v":0},{"$f":"Réel!O22","v":0},{"$f":"Réel!S22","v":0},{"$f":"Réel!W22","v":0},{"$f":"Réel!AA22","v":0},{"$f":"Réel!AE22","v":0},{"$f":"Réel!AI22","v":0},{"$f":"Réel!AM22","v":0},{"$f":"Réel!AQ22","v":0},{"$f":"Réel!AU22","v":0},{"$f":"Réel!AY22","v":0},{"$f":"Réel!BC22","v":0},{"$f":"Réel!BG22","v":0},{"$f":"Réel!BK22","v":0},{"$f":"Réel!BO22","v":0},{"$f":"Réel!BS22","v":0},{"$f":"Réel!BW22","v":0},{"$f":"Réel!CA22","v":0},{"$f":"Réel!CE22","v":0},{"$f":"Réel!CI22","v":0},0,{"$f":"V45*Renseignements!$B$24","v":0}]
[{"$f":"A38","v":"F"},{"$f":"Réel!K27","v":0},{"$f":"Réel!O27","v":0},{"$f":"Réel!S27","v":0},{"$f":"Réel!W27","v":0},{"$f":"Réel!AA27","v":0},{"$f":"Réel!AE27","v":0},{"$f":"Réel!AI27","v":0},{"$f":"Réel!AM27","v":0},{"$f":"Réel!AQ27","v":0},{"$f":"Réel!AU27","v":0},{"$f":"Réel!AY27","v":0},{"$f":"Réel!BC27","v":0},{"$f":"Réel!BG27","v":0},{"$f":"Réel!BK27","v":0},{"$f":"Réel!BO27","v":0},{"$f":"Réel!BS27","v":0},{"$f":"Réel!BW27","v":0},{"$f":"Réel!CA27","v":0},{"$f":"Réel!CE27","v":0},{"$f":"Réel!CI27","v":0},0,{"$f":"V46*Renseignements!$B$24","v":0}]
[{"$f":"Réel!F18","v":"12 - 17 ans"},{"$f":"Réel!K18","v":0},{"$f":"Réel!O18","v":0},{"$f":"Réel!S18","v":0},{"$f":"Réel!W18","v":0},{"$f":"Réel!AA18","v":0},{"$f":"Réel!AE18","v":0},{"$f":"Réel!AI18","v":0},{"$f":"Réel!AM18","v":0},{"$f":"Réel!AQ18","v":0},{"$f":"Réel!AU18","v":0},{"$f":"Réel!AY18","v":0},{"$f":"Réel!BC18","v":0},{"$f":"Réel!BG18","v":0},{"$f":"Réel!BK18","v":0},{"$f":"Réel!BO18","v":0},{"$f":"Réel!BS18","v":0},{"$f":"Réel!BW18","v":0},{"$f":"Réel!CA18","v":0},{"$f":"Réel!CE18","v":0},{"$f":"Réel!CI18","v":0},0,{"$f":"V47*Renseignements!$B$24","v":0}]
[{"$f":"A37","v":"G"},{"$f":"Réel!K23","v":0},{"$f":"Réel!O23","v":0},{"$f":"Réel!S23","v":0},{"$f":"Réel!W23","v":0},{"$f":"Réel!AA23","v":0},{"$f":"Réel!AE23","v":0},{"$f":"Réel!AI23","v":0},{"$f":"Réel!AM23","v":0},{"$f":"Réel!AQ23","v":0},{"$f":"Réel!AU23","v":0},{"$f":"Réel!AY23","v":0},{"$f":"Réel!BC23","v":0},{"$f":"Réel!BG23","v":0},{"$f":"Réel!BK23","v":0},{"$f":"Réel!BO23","v":0},{"$f":"Réel!BS23","v":0},{"$f":"Réel!BW23","v":0},{"$f":"Réel!CA23","v":0},{"$f":"Réel!CE23","v":0},{"$f":"Réel!CI23","v":0},0,{"$f":"V48*Renseignements!$B$24","v":0}]
[{"$f":"A38","v":"F"},{"$f":"Réel!K28","v":0},{"$f":"Réel!O28","v":0},{"$f":"Réel!S28","v":0},{"$f":"Réel!W28","v":0},{"$f":"Réel!AA28","v":0},{"$f":"Réel!AE28","v":0},{"$f":"Réel!AI28","v":0},{"$f":"Réel!AM28","v":0},{"$f":"Réel!AQ28","v":0},{"$f":"Réel!AU28","v":0},{"$f":"Réel!AY28","v":0},{"$f":"Réel!BC28","v":0},{"$f":"Réel!BG28","v":0},{"$f":"Réel!BK28","v":0},{"$f":"Réel!BO28","v":0},{"$f":"Réel!BS28","v":0},{"$f":"Réel!BW28","v":0},{"$f":"Réel!CA28","v":0},{"$f":"Réel!CE28","v":0},{"$f":"Réel!CI28","v":0},0,{"$f":"V49*Renseignements!$B$24","v":0}]
[{"$f":"Réel!F19","v":"Autres"},{"$f":"Réel!K19","v":0},{"$f":"Réel!O19","v":0},{"$f":"Réel!S19","v":0},{"$f":"Réel!W19","v":0},{"$f":"Réel!AA19","v":0},{"$f":"Réel!AE19","v":0},{"$f":"Réel!AI19","v":0},{"$f":"Réel!AM19","v":0},{"$f":"Réel!AQ19","v":0},{"$f":"Réel!AU19","v":0},{"$f":"Réel!AY19","v":0},{"$f":"Réel!BC19","v":0},{"$f":"Réel!BG19","v":0},{"$f":"Réel!BK19","v":0},{"$f":"Réel!BO19","v":0},{"$f":"Réel!BS19","v":0},{"$f":"Réel!BW19","v":0},{"$f":"Réel!CA19","v":0},{"$f":"Réel!CE19","v":0},{"$f":"Réel!CI19","v":0},0,{"$f":"V50*Renseignements!$B$24","v":0}]

{"sheet":"Calculs","index":13,"n_rows":0,"n_cols":0,"rows_kept":0,"cut":false,"hidden":false,"merged":[]}