{"text_format":"1","workbook":"xlsx","n_sheets":2,"sheets":["16-06","pms230"],"not_rendered":{"charts":0,"images":0,"macros":1,"external_links":0,"defined_names":4,"comments":0,"pivot_tables":0},"unopened":[],"bounds":{"document_bytes":16777216,"sheet_cells":100000,"rows_first":2000,"rows_last":500,"rows_between":2000,"halvings":0,"cell_chars":16384,"cell_head_chars":4096},"cells_cut":0,"cells_raw":0,"read":"whole","date_system":"1900"}

{"sheet":"16-06","index":0,"n_rows":359,"n_cols":26,"rows_kept":359,"cut":false,"hidden":false,"merged":[[1,0,1,1],[3,7,3,11],[4,7,4,9],[5,0,5,2],[5,7,5,13]]}
[]
["16/06/2017"]
[]
[]
[null,null,null,null,null,null,null,null,null,null,null,null,null,null,null,null,null,null,null,null,null,null,null,null,"Poste N°-","Poste"]
[null,null,null,null,null,null,null,null,null,null,null,null,null,null,null,null,null,null,null,null,null,null,null,null,"352AM0","Assemblage"]
[null,null,null,null,null,null,null,null,null,null,null,null,null,null,null,null,null,null,null,null,null,null,null,null,"352AM1","Assemblage"]
[null,null,null,null,null,null,null,null,null,null,null,null,null,null,null,null,null,null,null,null,null,null,null,null,"352AM2","Assemblage"]
[null,null,null,null,null,null,null,null,null,null,null,null,null,null,null,null,null,null,null,null,null,null,null,null,"352AM3","Assemblage"]
[null,null,null,null,null,{"$f":"SUBTOTAL(9,F12:F359)","v":1105},null,null,{"$f":"SUBTOTAL(9,I12:I359)","v":137.09999999999988},null,null,null,null,null,null,null,null,null,null,null,null,null,null,null,"352CH0","Coupe"]
["  N° OF","N° Article     ","Nom                      "," Début","Fin Or",",","St.Cp","St.Op","Tps (h)","Remarques           ","Pdc-1 ","Pdc   ","Pdc+1 ","Qté f ","TEMP","Postes","Etat","Urgence","Pdc j+1","livré","Cause","Action","pilote","Date","352CL1","Préparation"]
["2005700","F0448782","HOUSSE DOSSIER","280617","020717",4,"44","40",0.49,"","","352CH0","352PA1","","0,49",{"$f":"VLOOKUP(L12,$Y$6:$Z$21,2,FALSE)","v":"Coupe"},"Index en cours",null,{"$f":"VLOOKUP(A12,'pms230'!A2:L64,12,0)","v":"352CH0"},{"$f":"IF(L12=S12,0,1)","v":0},null,null,null,null,"352CM0","Préparation"]
["2003740","F0451631","POCHETTE GILET SAUVETAGE","070617","140617",150,"99","70",1.2,"","","352CH0","352SM0","90","1,20",{"$f":"VLOOKUP(L13,$Y$6:$Z$21,2,FALSE)","v":"Coupe"},"Index livré ",null,{"$f":"VLOOKUP(A13,'pms230'!A3:L65,12,0)","v":{"$error":"#N/A"}},{"$f":"IF(L13=S13,0,1)","v":{"$error":"#N/A"}},null,null,null,null,"352CP1","Coupe"]
["2005312","F0448782","HOUSSE DOSSIER","120617","140617",5,"49","70",0.37,"","","352CH0","352PA1","3","0,37",{"$f":"VLOOKUP(L14,$Y$6:$Z$21,2,FALSE)","v":"Coupe"},"Index en cours",null,{"$f":"VLOOKUP(A14,'pms230'!A4:L66,12,0)","v":"352CH0"},{"$f":"IF(L14=S14,0,1)","v":0},null,null,null,null,"352CP2","Coupe"]
["2006105","F0483055","HOUSSE DOSSIER","050717","050717",1,"44","40",0.3,"","","352CH0","352PT0","","0,30",{"$f":"VLOOKUP(L15,$Y$6:$Z$21,2,FALSE)","v":"Coupe"},"Index en cours",null,{"$f":"VLOOKUP(A15,'pms230'!A5:L67,12,0)","v":"352CH0"},0,null,null,null,null,"352EQU","Préparation"]
["2006697","F0489891","HOUSSE DOSSIER","280617","280617",1,"44","40",0.32,"","","352CH0","352PT0","","0,32",{"$f":"VLOOKUP(L16,$Y$6:$Z$21,2,FALSE)","v":"Coupe"},"Index en cours",null,{"$f":"VLOOKUP(A16,'pms230'!A6:L68,12,0)","v":"352CH0"},0,null,null,null,null,"352FC1","Préparation"]
[null,null,null,"150617","150617",null,"99","40",null,"","",null,"352PT0",null,"0,10",null,null,null,{"$f":"VLOOKUP(A17,'pms230'!A7:L69,12,0)","v":{"$error":"#N/A"}},{"$error":"#N/A"},null,null,null,null,"352GA0","Garnissage"]
["2004758","F0450726","SANGLE GDS","150617","160617",50,"22","40",1.8,"","","352CH0","352AM0","","1,80",{"$f":"VLOOKUP(L18,$Y$6:$Z$21,2,FALSE)","v":"Coupe"},"Index en cours",null,{"$f":"VLOOKUP(A18,'pms230'!A8:L70,12,0)","v":"352CH0"},0,null,null,null,null,"352HA2","Habillage"]
["999319","F347040","HOUS DOSSIER STD TRONQUEE","310517","040617",31,"99","40",1.3,"","","352CH0","352PT0","","1,30",{"$f":"VLOOKUP(L19,$Y$6:$Z$21,2,FALSE)","v":"Coupe"},"indus",null,{"$f":"VLOOKUP(A19,'pms230'!A9:L71,12,0)","v":"352CH0"},0,null,null,null,null,"352PA1","Préparation"]
["2005582","F0526368","HOUSSE ARRIERE CAPOT T1","160617","190617",25,"99","40",2.75,"","","352CH0","352AM0","","2,75",{"$f":"VLOOKUP(L20,$Y$6:$Z$21,2,FALSE)","v":"Coupe"},"Indus",null,{"$f":"VLOOKUP(A20,'pms230'!A10:L72,12,0)","v":"352CH0"},0,null,null,null,null,"352PT0","Préparation"]
["2005583","F0526368","HOUSSE ARRIERE CAPOT T1","160617","190617",25,"99","40",2.75,"","","352CH0","352AM0","","2,75",{"$f":"VLOOKUP(L21,$Y$6:$Z$21,2,FALSE)","v":"Coupe"},"Indus",null,{"$f":"VLOOKUP(A21,'pms230'!A11:L73,12,0)","v":"352CH0"},0,null,null,null,null,"352SM0","Préparation"]
["2003249","F0464148","HOUSSE ASSISE STD 18\"1 T2","130617","130617",1,"44","40",0.28000000000000003,"","","352CH0","352PT0","","0,28",{"$f":"VLOOKUP(L22,$Y$6:$Z$21,2,FALSE)","v":"Coupe"},"Index en cours",null,{"$f":"VLOOKUP(A22,'pms230'!A12:L74,12,0)","v":"352CH0"},0]
["2006708","F0497816","HOUSSE FOND DOSSIER L3 G","200617","200617",1,"99","40",0.09,"","","352CH0","352PT0","","0,09",{"$f":"VLOOKUP(L23,$Y$6:$Z$21,2,FALSE)","v":"Coupe"},"Index livré ",null,{"$f":"VLOOKUP(A23,'pms230'!A13:L75,12,0)","v":{"$error":"#N/A"}},{"$error":"#N/A"}]
["2006538","F0441273","ENS SANGLE","190717","190717",8,"99","40",1.05,"","","352CH0","352AM3","","1,05",{"$f":"VLOOKUP(L24,$Y$6:$Z$21,2,FALSE)","v":"Coupe"},"Index livré ",null,{"$f":"VLOOKUP(A24,'pms230'!A14:L76,12,0)","v":"352CH0"},0]
["2006799","F0483055","HOUSSE DOSSIER","220617","230617",6,"22","40",0.55000000000000004,"","","352CH0","352PT0","","0,55",{"$f":"VLOOKUP(L25,$Y$6:$Z$21,2,FALSE)","v":"Coupe"},"Index en cours",null,{"$f":"VLOOKUP(A25,'pms230'!A15:L77,12,0)","v":"352CH0"},0]
["2005798","F0410694","HOUSSE ARR. DOSSIER RDT","260617","280617",50,"99","70",0.2,"","","352CH0","352PT0","40","0,20",{"$f":"VLOOKUP(L26,$Y$6:$Z$21,2,FALSE)","v":"Coupe"},"Index livré ",null,{"$f":"VLOOKUP(A26,'pms230'!A16:L78,12,0)","v":"352CH0"},0]
["2005820","F0480875","HOUSSE DOSSIER","270617","300617",19,"22","40",1.2,"","","352CH0","352PT0","","1,20",{"$f":"VLOOKUP(L27,$Y$6:$Z$21,2,FALSE)","v":"Coupe"},"Index en cours",null,{"$f":"VLOOKUP(A27,'pms230'!A17:L79,12,0)","v":"352CH0"},0]
["2005909","F0526368","HOUSSE ARRIERE CAPOT T1","050717","050717",1,"99","40",0.35,"","","352CH0","352AM0","","0,35",{"$f":"VLOOKUP(L28,$Y$6:$Z$21,2,FALSE)","v":"Coupe"},"Indus",null,{"$f":"VLOOKUP(A28,'pms230'!A18:L80,12,0)","v":"352CH0"},0]
["2004220","F305250","HOUSSE DOSSIER AFL 5834","010617","150617",45,"99","40",11.95,"","","352CP1","352PA1","","1,95",{"$f":"VLOOKUP(L29,$Y$6:$Z$21,2,FALSE)","v":"Coupe"},"Index livré ",null,{"$f":"VLOOKUP(A29,'pms230'!A19:L81,12,0)","v":{"$error":"#N/A"}},{"$error":"#N/A"}]
["2004221","F305250","HOUSSE DOSSIER AFL 5834","020617","160617",45,"44","40",11.95,"","","352CP1","352PA1","","1,95",{"$f":"VLOOKUP(L30,$Y$6:$Z$21,2,FALSE)","v":"Coupe"},"Index en cours",null,{"$f":"VLOOKUP(A30,'pms230'!A20:L82,12,0)","v":{"$error":"#N/A"}},{"$error":"#N/A"}]
["2004124","F0518301","HOUSSE FOND DOSSIER","050717","060717",2,"99","40",0.47,"","","352CP1","352PA1","","0,47",{"$f":"VLOOKUP(L31,$Y$6:$Z$21,2,FALSE)","v":"Coupe"},"Index livré ",null,{"$f":"VLOOKUP(A31,'pms230'!A21:L83,12,0)","v":{"$error":"#N/A"}},{"$error":"#N/A"}]
["2004126","F0518303","HOUSSE FOND DOSSIER","050717","060717",2,"99","40",0.47,"","","352CP1","352PA1","","0,47",{"$f":"VLOOKUP(L32,$Y$6:$Z$21,2,FALSE)","v":"Coupe"},"Index livré ",null,{"$f":"VLOOKUP(A32,'pms230'!A22:L84,12,0)","v":{"$error":"#N/A"}},{"$error":"#N/A"}]
["2004128","F0518305","HOUSSE FOND DOSSIER","050717","060717",2,"99","40",0.47,"","","352CP1","352PA1","","0,47",{"$f":"VLOOKUP(L33,$Y$6:$Z$21,2,FALSE)","v":"Coupe"},"Index livré ",null,{"$f":"VLOOKUP(A33,'pms230'!A23:L85,12,0)","v":{"$error":"#N/A"}},{"$error":"#N/A"}]
["2004222","F305248","HOUSSE ASSISE AFL 5834","070617","160617",40,"44","40",7.05,"","","352CP1","352PA1","","7,05",{"$f":"VLOOKUP(L34,$Y$6:$Z$21,2,FALSE)","v":"Coupe"},"Index en cours",null,{"$f":"VLOOKUP(A34,'pms230'!A24:L86,12,0)","v":{"$error":"#N/A"}},{"$error":"#N/A"}]
["2004223","F305249","HOUSSE DOSSIER AFL 5834","020617","150617",40,"44","40",10.65,"","","352CP1","352PA1","","0,65",{"$f":"VLOOKUP(L35,$Y$6:$Z$21,2,FALSE)","v":"Coupe"},"Index en cours",null,{"$f":"VLOOKUP(A35,'pms230'!A25:L87,12,0)","v":{"$error":"#N/A"}},{"$error":"#N/A"}]
["2004224","F305249","HOUSSE DOSSIER AFL 5834","020617","150617",40,"44","70",10.4,"","","352CP1","352PA1","","0,40",{"$f":"VLOOKUP(L36,$Y$6:$Z$21,2,FALSE)","v":"Coupe"},"Index en cours",null,{"$f":"VLOOKUP(A36,'pms230'!A26:L88,12,0)","v":{"$error":"#N/A"}},{"$error":"#N/A"}]
["999768","F335525","HOUS H.DOS CULLGPL4178AIC","150617","160617",1,"99","40",0.51,"","","352CP1","352PA1","","0,51",{"$f":"VLOOKUP(L37,$Y$6:$Z$21,2,FALSE)","v":"Coupe"},"Index livré ",null,{"$f":"VLOOKUP(A37,'pms230'!A27:L89,12,0)","v":{"$error":"#N/A"}},{"$error":"#N/A"}]
["999842","F0417791","HOUSSE ASSISE CULT3394-1","220517","230517",2,"99","70",0.57999999999999996,"","","352CP1","352PA1","1","0,58",{"$f":"VLOOKUP(L38,$Y$6:$Z$21,2,FALSE)","v":"Coupe"},"Index livré ",null,{"$f":"VLOOKUP(A38,'pms230'!A28:L90,12,0)","v":{"$error":"#N/A"}},{"$error":"#N/A"}]
["996662","F241940","HOUSSE H.DOS CUDA23-45","200617","220617",14,"99","40",3.88,"","","352CP1","352PA1","","3,88",{"$f":"VLOOKUP(L39,$Y$6:$Z$21,2,FALSE)","v":"Coupe"},"Index livré ",null,{"$f":"VLOOKUP(A39,'pms230'!A29:L91,12,0)","v":{"$error":"#N/A"}},{"$error":"#N/A"}]
["996628","F0485456","HOUSSE FLANC","260517","300517",14,"99","70",2.77,"","","352CP1","352PA1","","2,77",{"$f":"VLOOKUP(L40,$Y$6:$Z$21,2,FALSE)","v":"Coupe"},"Index livré ",null,{"$f":"VLOOKUP(A40,'pms230'!A30:L92,12,0)","v":{"$error":"#N/A"}},{"$error":"#N/A"}]
["2006767","F287417","HOUSSE B.DOS CUDA23-59","230617","260617",1,"44","40",0.57999999999999996,"","","352CP1","352PA1","","0,58",{"$f":"VLOOKUP(L41,$Y$6:$Z$21,2,FALSE)","v":"Coupe"},"Index en cours",null,{"$f":"VLOOKUP(A41,'pms230'!A31:L93,12,0)","v":{"$error":"#N/A"}},{"$error":"#N/A"}]
["995947","F329920","SANGLE BOITIER GDS (RED.)","260617","270617",10,"99","40",0.46,"","","352CP1","352AM0","","0,46",{"$f":"VLOOKUP(L42,$Y$6:$Z$21,2,FALSE)","v":"Coupe"},"Index livré ",null,{"$f":"VLOOKUP(A42,'pms230'!A32:L94,12,0)","v":{"$error":"#N/A"}},{"$error":"#N/A"}]
["2006784","F329920","SANGLE BOITIER GDS (RED.)","280617","290617",10,"44","40",0.46,"","","352CP1","352AM0","","0,46",{"$f":"VLOOKUP(L43,$Y$6:$Z$21,2,FALSE)","v":"Coupe"},"Index en cours",null,{"$f":"VLOOKUP(A43,'pms230'!A33:L95,12,0)","v":{"$error":"#N/A"}},{"$error":"#N/A"}]
["990902","F0501096","ENS MANCHETTE","020517","080517",28,"49","70",2.33,"","352CM0","352CP1","352PA1","8","2,33",{"$f":"VLOOKUP(L44,$Y$6:$Z$21,2,FALSE)","v":"Coupe"},"Index en cours",null,{"$f":"VLOOKUP(A44,'pms230'!A34:L96,12,0)","v":{"$error":"#N/A"}},{"$error":"#N/A"}]
["2006660","F0526429","HOUSSE ASSISE","300617","030717",4,"22","40",1.25,"","","352CP1","352PA1","","1,25",{"$f":"VLOOKUP(L45,$Y$6:$Z$21,2,FALSE)","v":"Coupe"},"Index en cours",null,{"$f":"VLOOKUP(A45,'pms230'!A35:L97,12,0)","v":{"$error":"#N/A"}},{"$error":"#N/A"}]
["2006661","F0526430","HOUSSE ASSISE","300617","030717",4,"22","40",1.25,"","","352CP1","352PA1","","1,25",{"$f":"VLOOKUP(L46,$Y$6:$Z$21,2,FALSE)","v":"Coupe"},"Index en cours",null,{"$f":"VLOOKUP(A46,'pms230'!A36:L98,12,0)","v":{"$error":"#N/A"}},{"$error":"#N/A"}]
["2006540","F0417808","LANGUETTE","300617","030717",39,"99","40",0.52,"","","352CP1","352AM3","","0,52",{"$f":"VLOOKUP(L47,$Y$6:$Z$21,2,FALSE)","v":"Coupe"},"Index livré ",null,{"$f":"VLOOKUP(A47,'pms230'!A37:L99,12,0)","v":{"$error":"#N/A"}},{"$error":"#N/A"}]
["2006276","F0525057","HOUSSE ASSISE","260517","260617",26,"99","40",2.19,"Basculement coupe au","","352CP2","352PA1","","2,19",{"$f":"VLOOKUP(L48,$Y$6:$Z$21,2,FALSE)","v":"Coupe"},"Index livré ",null,{"$f":"VLOOKUP(A48,'pms230'!A38:L100,12,0)","v":{"$error":"#N/A"}},{"$error":"#N/A"}]
["2004136","F0483082","HOUSSE ASSISE","070717","100717",5,"99","40",1.91,"MDSQ : Basculement c","","352CP2","352AM2","","1,91",{"$f":"VLOOKUP(L49,$Y$6:$Z$21,2,FALSE)","v":"Coupe"},"Index livré ",null,{"$f":"VLOOKUP(A49,'pms230'!A39:L101,12,0)","v":{"$error":"#N/A"}},{"$error":"#N/A"}]
["2004213","F0429323","HOUSSE TETIERE + ETIQ","260517","190617",15,"99","70",0.2,"MDSQ : Basculement c","","352CP2","352PA1","7","0,20",{"$f":"VLOOKUP(L50,$Y$6:$Z$21,2,FALSE)","v":"Coupe"},"Index livré ",null,{"$f":"VLOOKUP(A50,'pms230'!A40:L102,12,0)","v":{"$error":"#N/A"}},{"$error":"#N/A"}]
["2006642","F0525058","HOUSSE ASSISE","260517","260617",13,"22","40",1.34,"Basculement coupe au","","352CP2","352PA1","","1,34",{"$f":"VLOOKUP(L51,$Y$6:$Z$21,2,FALSE)","v":"Coupe"},"Index en cours",null,{"$f":"VLOOKUP(A51,'pms230'!A41:L103,12,0)","v":{"$error":"#N/A"}},{"$error":"#N/A"}]
["2004056","F0525073","HOUSSE DOSSIER","260517","220617",4,"99","40",0.86,"Basculement COupe au","","352CP2","352PA1","","0,86",{"$f":"VLOOKUP(L52,$Y$6:$Z$21,2,FALSE)","v":"Coupe"},"Index livré ",null,{"$f":"VLOOKUP(A52,'pms230'!A42:L104,12,0)","v":{"$error":"#N/A"}},{"$error":"#N/A"}]
["2006645","F0525059","HOUSSE ASSISE","260517","260617",5,"22","40",0.82,"Basculement coupe au","","352CP2","352PA1","","0,82",{"$f":"VLOOKUP(L53,$Y$6:$Z$21,2,FALSE)","v":"Coupe"},"Index en cours",null,{"$f":"VLOOKUP(A53,'pms230'!A43:L105,12,0)","v":{"$error":"#N/A"}},{"$error":"#N/A"}]
["2006646","F0525061","HOUSSE ASSISE","260517","260617",5,"22","40",0.82,"Basculement coupe au","","352CP2","352PA1","","0,82",{"$f":"VLOOKUP(L54,$Y$6:$Z$21,2,FALSE)","v":"Coupe"},"Index en cours",null,{"$f":"VLOOKUP(A54,'pms230'!A44:L106,12,0)","v":{"$error":"#N/A"}},{"$error":"#N/A"}]
["2004229","F0497809","HOUSSE DOSSIER L4","260517","030717",6,"99","40",0.79,"","","352CP2","352PT0","","0,79",{"$f":"VLOOKUP(L55,$Y$6:$Z$21,2,FALSE)","v":"Coupe"},"Indus",null,{"$f":"VLOOKUP(A55,'pms230'!A45:L107,12,0)","v":{"$error":"#N/A"}},{"$error":"#N/A"}]
["2006657","F0525054","HOUSSE ASSISE","260517","230617",4,"99","40",0.76,"Basculement coupe au","","352CP2","352PA1","","0,76",{"$f":"VLOOKUP(L56,$Y$6:$Z$21,2,FALSE)","v":"Coupe"},"Index livré ",null,{"$f":"VLOOKUP(A56,'pms230'!A46:L108,12,0)","v":{"$error":"#N/A"}},{"$error":"#N/A"}]
["2006113","F0465135","MANCHETTE FIXE D","250517","300617",18,"99","70",0.57999999999999996,"Basculement coupe Au","352CM0","352CP2","352PA1","11","0,58",{"$f":"VLOOKUP(L57,$Y$6:$Z$21,2,FALSE)","v":"Coupe"},"Index livré ",null,{"$f":"VLOOKUP(A57,'pms230'!A47:L109,12,0)","v":{"$error":"#N/A"}},{"$error":"#N/A"}]
["2006656","F0525053","HOUSSE ASSISE","260517","270617",3,"99","40",0.69,"Basculement coupe au","","352CP2","352PA1","","0,69",{"$f":"VLOOKUP(L58,$Y$6:$Z$21,2,FALSE)","v":"Coupe"},"Index livré ",null,{"$f":"VLOOKUP(A58,'pms230'!A48:L110,12,0)","v":{"$error":"#N/A"}},{"$error":"#N/A"}]
["2006651","F0525066","HOUSSE ASSISE","260517","270617",3,"22","40",0.69,"Basculement coupe au","","352CP2","352PA1","","0,69",{"$f":"VLOOKUP(L59,$Y$6:$Z$21,2,FALSE)","v":"Coupe"},"Index en cours",null,{"$f":"VLOOKUP(A59,'pms230'!A49:L111,12,0)","v":{"$error":"#N/A"}},{"$error":"#N/A"}]
["2006658","F0525055","HOUSSE ASSISE","260517","270617",2,"99","40",0.63,"Basculement coupe au","","352CP2","352PA1","","0,63",{"$f":"VLOOKUP(L60,$Y$6:$Z$21,2,FALSE)","v":"Coupe"},"Index livré ",null,{"$f":"VLOOKUP(A60,'pms230'!A50:L112,12,0)","v":{"$error":"#N/A"}},{"$error":"#N/A"}]
{"$rows_left_out":300}
{"sheet":"pms230","index":1,"n_rows":64,"n_cols":15,"rows_kept":64,"cut":false,"hidden":false,"merged":[]}
["  N° OF","N° Article     ","Nom                      "," Début","Fin Or","  Qté ","St.Cp","St.Op","Tps (h)","Remarques           ","Pdc-1 ","Pdc   ","Pdc+1 ","Qté f ","TEMP"]
["2006661","F0526430","HOUSSE ASSISE","300617","030717","4","99","40","1,25","","","352CP1","352PA1","","1,25"]
["2004220","F305250","HOUSSE DOSSIER AFL 5834","010617","150617","45","99","40","11,95","","","352CP1","352PA1","","1,95"]
["2004221","F305250","HOUSSE DOSSIER AFL 5834","020617","160617","45","44","40","11,95","","","352CP1","352PA1","","1,95"]
["2004124","F0518301","HOUSSE FOND DOSSIER","050717","060717","2","99","40","0,47","","","352CP1","352PA1","","0,47"]
["2004126","F0518303","HOUSSE FOND DOSSIER","050717","060717","2","99","40","0,47","","","352CP1","352PA1","","0,47"]
["2004128","F0518305","HOUSSE FOND DOSSIER","050717","060717","2","99","40","0,47","","","352CP1","352PA1","","0,47"]
["2004222","F305248","HOUSSE ASSISE AFL 5834","070617","160617","40","44","40","7,05","","","352CP1","352PA1","","7,05"]
["2004223","F305249","HOUSSE DOSSIER AFL 5834","020617","150617","40","44","40","10,65","","","352CP1","352PA1","","0,65"]
["2004224","F305249","HOUSSE DOSSIER AFL 5834","020617","150617","40","44","70","10,40","","","352CP1","352PA1","","0,40"]
["999768","F335525","HOUS H.DOS CULLGPL4178AIC","150617","160617","1","99","40","0,51","","","352CP1","352PA1","","0,51"]
["999842","F0417791","HOUSSE ASSISE CULT3394-1","220517","230517","2","99","70","0,58","","","352CP1","352PA1","1","0,58"]
["996662","F241940","HOUSSE H.DOS CUDA23-45","200617","220617","14","99","40","3,88","","","352CP1","352PA1","","3,88"]
["996628","F0485456","HOUSSE FLANC","260517","300517","14","99","70","2,77","","","352CP1","352PA1","","2,77"]
["2006767","F287417","HOUSSE B.DOS CUDA23-59","230617","260617","1","99","40","0,58","","","352CP1","352PA1","","0,58"]
["995947","F329920","SANGLE BOITIER GDS (RED.)","260617","270617","10","99","40","0,46","","","352CP1","352AM0","","0,46"]
["2006784","F329920","SANGLE BOITIER GDS (RED.)","280617","290617","10","22","40","0,46","","","352CP1","352AM0","","0,46"]
["990902","F0501096","ENS MANCHETTE","020517","080517","28","49","70","2,33","","352CM0","352CP1","352PA1","8","2,33"]
["2006660","F0526429","HOUSSE ASSISE","300617","030717","4","99","40","1,25","","","352CP1","352PA1","","1,25"]
["2006540","F0417808","LANGUETTE","300617","030717","39","99","40","0,52","","","352CP1","352AM3","","0,52"]
["2006276","F0525057","HOUSSE ASSISE","260517","260617","26","99","40","2,19","Basculement coupe au","","352CP2","352PA1","","2,19"]
["2004136","F0483082","HOUSSE ASSISE","070717","100717","5","99","40","1,91","MDSQ : Basculement c","","352CP2","352AM2","","1,91"]
["2004213","F0429323","HOUSSE TETIERE + ETIQ","260517","190617","15","99","70","0,20","MDSQ : Basculement c","","352CP2","352PA1","7","0,20"]
["2006642","F0525058","HOUSSE ASSISE","260517","260617","13","99","40","1,34","Basculement coupe au","","352CP2","352PA1","","1,34"]
["2004056","F0525073","HOUSSE DOSSIER","260517","220617","4","99","40","0,86","Basculement COupe au","","352CP2","352PA1","","0,86"]
["2006645","F0525059","HOUSSE ASSISE","260517","260617","5","99","40","0,82","Basculement coupe au","","352CP2","352PA1","","0,82"]
["2006646","F0525061","HOUSSE ASSISE","260517","260617","5","99","40","0,82","Basculement coupe au","","352CP2","352PA1","","0,82"]
["2004229","F0497809","HOUSSE DOSSIER L4","260517","030717","6","99","40","0,79","","","352CP2","352PT0","","0,79"]
["2006657","F0525054","HOUSSE ASSISE","260517","230617","4","99","40","0,76","Basculement coupe au","","352CP2","352PA1","","0,76"]
["2006113","F0465135","MANCHETTE FIXE D","250517","300617","18","99","70","0,58","Basculement coupe Au","352CM0","352CP2","352PA1","11","0,58"]
["2006656","F0525053","HOUSSE ASSISE","260517","270617","3","99","40","0,69","Basculement coupe au","","352CP2","352PA1","","0,69"]
["2006651","F0525066","HOUSSE ASSISE","260517","270617","3","99","40","0,69","Basculement coupe au","","352CP2","352PA1","","0,69"]
["2006658","F0525055","HOUSSE ASSISE","260517","270617","2","99","40","0,63","Basculement coupe au","","352CP2","352PA1","","0,63"]
["2006659","F0525056","HOUSSE ASSISE","260517","230617","2","99","40","0,63","Basculement coupe au","","352CP2","352PA1","","0,63"]
["2006648","F0525060","HOUSSE ASSISE","260517","260617","2","99","40","0,63","Basculement coupe au","","352CP2","352PA1","","0,63"]
["2006649","F0525062","HOUSSE ASSISE","260517","260617","2","99","40","0,63","Basculement coupe au","","352CP2","352PA1","","0,63"]
["2006652","F0525063","HOUSSE ASSISE","260517","270617","2","99","40","0,63","Basculement coupe au","","352CP2","352PA1","","0,63"]
["2006653","F0525067","HOUSSE ASSISE","260517","270617","2","99","40","0,63","Basculement coupe au","","352CP2","352PA1","","0,63"]
["2004230","F0497810","HOUSSE DOSSIER L5","260517","030717","4","99","40","0,58","","","352CP2","352PT0","","0,58"]
["2006655","F0525065","HOUSSE ASSISE","260517","270617","1","99","40","0,56","Basculement coupe au","","352CP2","352PA1","","0,56"]
["2006654","F0525068","HOUSSE ASSISE","260517","270617","1","99","40","0,56","Basculement coupe au","","352CP2","352PA1","","0,56"]
["2004232","F0497813","HOUSSE DOSSIER L5 D","260517","030717","1","99","40","0,25","","","352CP2","352PT0","","0,25"]
["2004231","F0497814","HOUSSE DOSSIER L5 G","260517","030717","1","99","40","0,25","","","352CP2","352PT0","","0,25"]
["2003814","F0475354","HOUSSE DOSSIER LGE","260517","270617","1","99","40","0,14","","352SCA","352CP2","352PA1","","0,14"]
["996116","F0508057","HOUSSE FOND DOSSIER","220617","230617","2","99","70","1,02","MDSQ : Basculement c","","352CP2","352SM0","1","1,02"]
["2005700","F0448782","HOUSSE DOSSIER","280617","020717","4","44","40","0,49","","","352CH0","352PA1","","0,49"]
["2007051","F0452673","POCHETTE GILET SAUVETAGE","090617","230617","150","33","40","7,75","","","352CH0","352SM0","","7,75"]
["2007052","F0452673","POCHETTE GILET SAUVETAGE","090617","230617","150","22","40","7,75","","","352CH0","352SM0","","7,75"]
["2007053","F0452673","POCHETTE GILET SAUVETAGE","090617","230617","150","22","40","7,75","","","352CH0","352SM0","","7,75"]
["2007054","F0452673","POCHETTE GILET SAUVETAGE","090617","230617","150","22","40","7,75","","","352CH0","352SM0","","7,75"]
["2005312","F0448782","HOUSSE DOSSIER","120617","140617","5","49","70","0,37","","","352CH0","352PA1","3","0,37"]
["2006105","F0483055","HOUSSE DOSSIER","050717","050717","1","44","40","0,30","","","352CH0","352PT0","","0,30"]
["2006697","F0489891","HOUSSE DOSSIER","280617","280617","1","99","40","0,32","","","352CH0","352PT0","","0,32"]
["2006590","FRETOUCRNCE1","ARTICLE RETOUCHE RNC EXTE","150617","150617","2","99","40","0,10","","","352CH0","352PT0","","0,10"]
["2004758","F0450726","SANGLE GDS","150617","160617","50","22","40","1,80","","","352CH0","352AM0","","1,80"]
["999319","F347040","HOUS DOSSIER STD TRONQUEE","310517","040617","31","99","40","1,30","","","352CH0","352PT0","","1,30"]
["2005582","F0526368","HOUSSE ARRIERE CAPOT T1","160617","190617","25","99","40","2,75","","","352CH0","352AM0","","2,75"]
["2005583","F0526368","HOUSSE ARRIERE CAPOT T1","160617","190617","25","99","40","2,75","","","352CH0","352AM0","","2,75"]
["2003249","F0464148","HOUSSE ASSISE STD 18\"1 T2","130617","130617","1","99","40","0,28","","","352CH0","352PT0","","0,28"]
["2006538","F0441273","ENS SANGLE","190717","190717","8","99","40","1,05","","","352CH0","352AM3","","1,05"]
{"$rows_left_out":4}