{"text_format":"1","workbook":"xlsx","n_sheets":2,"sheets":["CALCUL","Tables"],"not_rendered":{"charts":0,"images":0,"macros":1,"external_links":1,"defined_names":5,"comments":0,"pivot_tables":0},"unopened":[],"bounds":{"document_bytes":16777216,"sheet_cells":100000,"rows_first":2000,"rows_last":500,"rows_between":2000,"halvings":0,"cell_chars":16384,"cell_head_chars":4096},"cells_cut":0,"cells_raw":0,"read":"whole","date_system":"1900"}

{"sheet":"CALCUL","index":0,"n_rows":12,"n_cols":27,"rows_kept":12,"cut":false,"hidden":false,"merged":[[8,12,8,14],[10,12,10,14],[3,1,4,1],[3,17,4,17],[3,2,4,2],[3,3,3,8],[3,15,4,15],[3,16,4,16],[3,9,3,14]]}
[{"$f":"ROW()","v":1},null,null,null,null,null,null,null,null,null,null,null,null,null,null,null,null,null,null,null,null,null,null,null,null,null,7]
[{"$f":"ROW()","v":2}]
[{"$f":"ROW()","v":3}]
[{"$f":"ROW()","v":4},"EDITIONS","FORMATS","LOCALES",null,null,null,null,null,"VILLAGES",null,null,null,null,null,"TOTAL BRUT","REMISE","TOTAL NET"]
[{"$f":"ROW()","v":5},null,null,"Semaine","Qté","Sous-total","V.S.D.","Qté","Sous-total","Semaine","Qté","Sous-total","V.S.D.","Qté","Sous-total"]
[{"$f":"ROW()","v":6},"ALES","Double écran (L 192 x H 66)",{"$f":"IF(C6=\"\",\"\",IF(B6=Tables!$B$1,VLOOKUP(C6,Tables!$B$4:$F$37,2,FALSE),IF(B6=Tables!$H$1,VLOOKUP(C6,Tables!$H$3:$L$76,2,FALSE),IF(B6=Tables!$M$1,VLOOKUP(C6,Tables!$M$3:$Q$38,2,FALSE),IF(B6=Tables!$M$40,VLOOKUP(C6,Tables!$M$42:$Q$58,2,FALSE),IF(B6=Tables!$B$78,VLOOKUP(C6,Tables!$B$80:$F$136,2,FALSE),IF(B6=Tables!$G$78,VLOOKUP(C6,Tables!$G$80:$K$114,2,FALSE),IF(B6=Tables!$L$78,VLOOKUP(C6,Tables!$L$80:$P$128,2,FALSE),IF(B6=Tables!$B$138,VLOOKUP(C6,Tables!$B$140:$F$177,2,FALSE),IF(B6=Tables!$G$138,VLOOKUP(C6,Tables!$G$140:$K$184,2,FALSE),IF(B6=Tables!$L$138,VLOOKUP(C6,Tables!$L$140:$P$171,2,FALSE),IF(B6=Tables!$B$186,VLOOKUP(C6,Tables!$B$188:$F$220,2,FALSE),IF(B6=Tables!$G$186,VLOOKUP(C6,Tables!$G$188:$K$224,2,FALSE),IF(B6=Tables!$L$186,VLOOKUP(C6,Tables!$L$188:$P$221,2,FALSE),IF(B6=Tables!$G$186,VLOOKUP(C6,Tables!$G$188:$K$224,2,FALSE),IF(B6=Tables!$B$226,VLOOKUP(C6,Tables!$B$228:$F$256,2,FALSE),IF(B6=Tables!$G$226,VLOOKUP(C6,Tables!$G$228:$K$263,2,FALSE),IF(B6=Tables!$M$226,VLOOKUP(C6,Tables!$M$228:$Q$259,2,FALSE),IF(B6=Tables!$B$265,VLOOKUP(C6,Tables!$B$267:$F$305,2,FALSE),IF(B6=Tables!$H$265,VLOOKUP(C6,Tables!$H$267:$L$338,2,FALSE),IF(B6=Tables!$N$265,VLOOKUP(C6,Tables!$N$267:$R$302,2,FALSE),IF(B6=Tables!$B$308,VLOOKUP(C6,Tables!$B$310:$F$343,2,FALSE),IF(B6=Tables!$N$308,VLOOKUP(C6,Tables!$N$310:$R$332,2,FALSE),IF(B6=Tables!$B$346,VLOOKUP(C6,Tables!$B$348:$F$417,2,FALSE),\"\"))))))))))))))))))))))))","v":3},4,{"$f":"IFERROR(D6*E6,\"\")","v":12},{"$f":"IF($C$6=\"\",\"\",IF(B6=Tables!$B$1,VLOOKUP($C$6,Tables!$B$4:$F$37,3,FALSE),IF($B$6=Tables!$H$1,VLOOKUP($C$6,Tables!$H$3:$L$76,3,FALSE),IF($B$6=Tables!$M$1,VLOOKUP($C$6,Tables!$M$3:$Q$38,3,FALSE),IF($B$6=Tables!$M$40,VLOOKUP($C$6,Tables!$M$42:Q58,3,FALSE),IF($B$6=Tables!$B$78,VLOOKUP($C$6,Tables!$B$80:$F$136,3,FALSE),IF($B$6=Tables!$G$78,VLOOKUP($C$6,Tables!$G$80:$K$114,3,FALSE),IF($B$6=Tables!$L$78,VLOOKUP($C$6,Tables!$L$80:$P$128,3,FALSE),IF($B$6=Tables!$B$138,VLOOKUP($C$6,Tables!$B$140:$F$177,3,FALSE),IF($B$6=Tables!$G$138,VLOOKUP($C$6,Tables!$G$140:$K$184,3,FALSE),IF($B$6=Tables!$L$138,VLOOKUP($C$6,Tables!$L$140:$P$171,3,FALSE),IF($B$6=Tables!$B$186,VLOOKUP($C$6,Tables!$B$188:$F$220,3,FALSE),IF($B$6=Tables!$G$186,VLOOKUP($C$6,Tables!$G$188:$K$224,3,FALSE),IF($B$6=Tables!$L$186,VLOOKUP($C$6,Tables!$L$188:$P$221,3,FALSE),IF($B$6=Tables!$G$186,VLOOKUP($C$6,Tables!$G$188:$K$224,3,FALSE),IF($B$6=Tables!$B$226,VLOOKUP($C$6,Tables!$B$228:$F$256,3,FALSE),IF($B$6=Tables!$G$226,VLOOKUP($C$6,Tables!$G$228:$K$263,3,FALSE),IF($B$6=Tables!$M$226,VLOOKUP($C$6,Tables!$M$228:$Q$259,3,FALSE),IF($B$6=Tables!$B$265,VLOOKUP($C$6,Tables!$B$267:$F$305,3,FALSE),IF($B$6=Tables!$H$265,VLOOKUP($C$6,Tables!$H$267:$L$338,3,FALSE),IF($B$6=Tables!$N$265,VLOOKUP($C$6,Tables!$N$267:$R$302,3,FALSE),IF($B$6=Tables!$B$308,VLOOKUP($C$6,Tables!$B$310:$F$343,3,FALSE),IF($B$6=Tables!$N$308,VLOOKUP($C$6,Tables!$N$310:$R$332,3,FALSE),IF($B$6=Tables!$B$346,VLOOKUP($C$6,Tables!$B$348:$F$417,3,FALSE),\"\"))))))))))))))))))))))))","v":3},3,{"$f":"IFERROR(G6*H6,\"\")","v":9},{"$f":"IF(C6=\"\",\"\",IF(B6=Tables!$B$1,VLOOKUP(C6,Tables!$B$4:$F$37,4,FALSE),IF(B6=Tables!$H$1,VLOOKUP(C6,Tables!$H$3:$L$76,4,FALSE),IF(B6=Tables!$M$1,VLOOKUP(C6,Tables!$M$3:$Q$38,4,FALSE),IF(B6=Tables!$M$40,VLOOKUP(C6,Tables!$M$42:$Q$58,4,FALSE),IF(B6=Tables!$B$78,VLOOKUP(C6,Tables!$B$79:$F$136,4,FALSE),IF(B6=Tables!$G$78,VLOOKUP(C6,Tables!$G$80:$K$114,4,FALSE),IF(B6=Tables!$L$78,VLOOKUP(C6,Tables!$L$80:$P$128,4,FALSE),IF(B6=Tables!$B$138,VLOOKUP(C6,Tables!$B$140:$F$177,4,FALSE),IF(B6=Tables!$G$138,VLOOKUP(C6,Tables!$G$140:$K$184,4,FALSE),IF(B6=Tables!$L$138,VLOOKUP(C6,Tables!$L$140:$P$171,4,FALSE),IF(B6=Tables!$B$186,VLOOKUP(C6,Tables!$B$188:$F$220,4,FALSE),IF(B6=Tables!$G$186,VLOOKUP(C6,Tables!$G$188:$K$224,4,FALSE),IF(B6=Tables!$L$186,VLOOKUP(C6,Tables!$L$188:$P$221,4,FALSE),IF(B6=Tables!$G$186,VLOOKUP(C6,Tables!$G$188:$K$224,4,FALSE),IF(B6=Tables!$B$226,VLOOKUP(C6,Tables!$B$228:$F$256,4,FALSE),IF(B6=Tables!$G$226,VLOOKUP(C6,Tables!$G$228:$K$263,4,FALSE),IF(B6=Tables!$M$226,VLOOKUP(C6,Tables!$M$228:$Q$259,4,FALSE),IF(B6=Tables!$B$265,VLOOKUP(C6,Tables!$B$267:$F$305,4,FALSE),IF(B6=Tables!$H$265,VLOOKUP(C6,Tables!$H$267:$L$338,4,FALSE),IF(B6=Tables!N$265,VLOOKUP(C6,Tables!$N$267:$R$302,4,FALSE),IF(B6=Tables!$B$308,VLOOKUP(C6,Tables!$B$310:$F$343,4,FALSE),IF(B6=Tables!$N$308,VLOOKUP(C6,Tables!$N$310:$R$332,4,FALSE),IF(B6=Tables!B$346,VLOOKUP(C6,Tables!$B$348:$F$417,4,FALSE),\"\"))))))))))))))))))))))))","v":0},2,{"$f":"IFERROR(J6*K6,\"\")","v":0},{"$f":"IF(C6=\"\",\"\",IF(B6=Tables!$B$1,VLOOKUP(C6,Tables!$B$4:$F$37,5,FALSE),IF(B6=Tables!$H$1,VLOOKUP(C6,Tables!$H$3:$L$76,5,FALSE),IF(B6=Tables!$M$1,VLOOKUP(C6,Tables!$M$3:$Q$38,5,FALSE),IF(B6=Tables!$M$40,VLOOKUP(C6,Tables!$M$42:$Q$58,5,FALSE),IF(B6=Tables!$B$78,VLOOKUP(C6,Tables!$B$79:$F$136,5,FALSE),IF(B6=Tables!$G$78,VLOOKUP(C6,Tables!$G$80:$K$114,5,FALSE),IF(B6=Tables!$L$78,VLOOKUP(C6,Tables!$L$80:$P$128,5,FALSE),IF(B6=Tables!$B$138,VLOOKUP(C6,Tables!$B$140:$F$177,5,FALSE),IF(B6=Tables!$G$138,VLOOKUP(C6,Tables!$G$140:$K$184,5,FALSE),IF(B6=Tables!$L$138,VLOOKUP(C6,Tables!$L$140:$P$171,5,FALSE),IF(B6=Tables!$B$186,VLOOKUP(C6,Tables!$B$188:$F$220,5,FALSE),IF(B6=Tables!$G$186,VLOOKUP(C6,Tables!$G$188:$K$224,5,FALSE),IF(B6=Tables!$L$186,VLOOKUP(C6,Tables!$L$188:$P$221,5,FALSE),IF(B6=Tables!$G$186,VLOOKUP(C6,Tables!$G$188:$K$224,5,FALSE),IF(B6=Tables!$B$226,VLOOKUP(C6,Tables!$B$228:$F$256,5,FALSE),IF(B6=Tables!$G$226,VLOOKUP(C6,Tables!$G$228:$K$263,5,FALSE),IF(B6=Tables!$M$226,VLOOKUP(C6,Tables!$M$228:$Q$259,5,FALSE),IF(B6=Tables!$B$265,VLOOKUP(C6,Tables!$B$267:$F$305,5,FALSE),IF(B6=Tables!$H$265,VLOOKUP(C6,Tables!$H$267:$L$338,5,FALSE),IF($B$6=Tables!N$265,VLOOKUP(C6,Tables!$N$267:$R$302,5,FALSE),IF(B6=Tables!$B$308,VLOOKUP(C6,Tables!$B$310:$F$343,5,FALSE),IF(B6=Tables!$N$308,VLOOKUP(C6,Tables!$N$310:$R$332,5,FALSE),IF(B6=Tables!$B$346,VLOOKUP(C6,Tables!$B$348:$F$417,5,FALSE),\"\"))))))))))))))))))))))))","v":0},null,{"$f":"IFERROR(M6*N6,\"\")","v":0},{"$f":"IFERROR(F6+I6+L6+O6,\"\")","v":21},0.04,{"$f":"IFERROR(P6-(Q6*P6),\"\")","v":20.16}]
[{"$f":"ROW()","v":7},"AVEYRON DEP","Double écran (L 192 x H 66)",{"$f":"IF(C7=\"\",\"\",IF(B7=Tables!$B$1,VLOOKUP(C7,Tables!$B$4:$F$37,2,FALSE),IF(B7=Tables!$H$1,VLOOKUP(C7,Tables!$H$3:$L$76,2,FALSE),IF(B7=Tables!$M$1,VLOOKUP(C7,Tables!$M$3:$Q$38,2,FALSE),IF(B7=Tables!$M$40,VLOOKUP(C7,Tables!$M$42:$Q$58,2,FALSE),IF(B7=Tables!$B$78,VLOOKUP(C7,Tables!$B$80:$F$136,2,FALSE),IF(B7=Tables!$G$78,VLOOKUP(C7,Tables!$G$80:$K$114,2,FALSE),IF(B7=Tables!$L$78,VLOOKUP(C7,Tables!$L$80:$P$128,2,FALSE),IF(B7=Tables!$B$138,VLOOKUP(C7,Tables!$B$140:$F$177,2,FALSE),IF(B7=Tables!$G$138,VLOOKUP(C7,Tables!$G$140:$K$184,2,FALSE),IF(B7=Tables!$L$138,VLOOKUP(C7,Tables!$L$140:$P$171,2,FALSE),IF(B7=Tables!$B$186,VLOOKUP(C7,Tables!$B$188:$F$220,2,FALSE),IF(B7=Tables!$G$186,VLOOKUP(C7,Tables!$G$188:$K$224,2,FALSE),IF(B7=Tables!$L$186,VLOOKUP(C7,Tables!$L$188:$P$221,2,FALSE),IF(B7=Tables!$G$186,VLOOKUP(C7,Tables!$G$188:$K$224,2,FALSE),IF(B7=Tables!$B$226,VLOOKUP(C7,Tables!$B$228:$F$256,2,FALSE),IF(B7=Tables!$G$226,VLOOKUP(C7,Tables!$G$228:$K$263,2,FALSE),IF(B7=Tables!$M$226,VLOOKUP(C7,Tables!$M$228:$Q$259,2,FALSE),IF(B7=Tables!$B$265,VLOOKUP(C7,Tables!$B$267:$F$305,2,FALSE),IF(B7=Tables!$H$265,VLOOKUP(C7,Tables!$H$267:$L$338,2,FALSE),IF(B7=Tables!$N$265,VLOOKUP(C7,Tables!$N$267:$R$302,2,FALSE),IF(B7=Tables!$B$308,VLOOKUP(C7,Tables!$B$310:$F$343,2,FALSE),IF(B7=Tables!$N$308,VLOOKUP(C7,Tables!$N$310:$R$332,2,FALSE),IF(B7=Tables!$B$346,VLOOKUP(C7,Tables!$B$348:$F$417,2,FALSE),\"\"))))))))))))))))))))))))","v":3},5,{"$f":"IFERROR(D7*E7,\"\")","v":15},{"$f":"IF($C$6=\"\",\"\",IF(B7=Tables!$B$1,VLOOKUP($C$6,Tables!$B$4:$F$37,3,FALSE),IF($B$6=Tables!$H$1,VLOOKUP($C$6,Tables!$H$3:$L$76,3,FALSE),IF($B$6=Tables!$M$1,VLOOKUP($C$6,Tables!$M$3:$Q$38,3,FALSE),IF($B$6=Tables!$M$40,VLOOKUP($C$6,Tables!$M$42:Q59,3,FALSE),IF($B$6=Tables!$B$78,VLOOKUP($C$6,Tables!$B$80:$F$136,3,FALSE),IF($B$6=Tables!$G$78,VLOOKUP($C$6,Tables!$G$80:$K$114,3,FALSE),IF($B$6=Tables!$L$78,VLOOKUP($C$6,Tables!$L$80:$P$128,3,FALSE),IF($B$6=Tables!$B$138,VLOOKUP($C$6,Tables!$B$140:$F$177,3,FALSE),IF($B$6=Tables!$G$138,VLOOKUP($C$6,Tables!$G$140:$K$184,3,FALSE),IF($B$6=Tables!$L$138,VLOOKUP($C$6,Tables!$L$140:$P$171,3,FALSE),IF($B$6=Tables!$B$186,VLOOKUP($C$6,Tables!$B$188:$F$220,3,FALSE),IF($B$6=Tables!$G$186,VLOOKUP($C$6,Tables!$G$188:$K$224,3,FALSE),IF($B$6=Tables!$L$186,VLOOKUP($C$6,Tables!$L$188:$P$221,3,FALSE),IF($B$6=Tables!$G$186,VLOOKUP($C$6,Tables!$G$188:$K$224,3,FALSE),IF($B$6=Tables!$B$226,VLOOKUP($C$6,Tables!$B$228:$F$256,3,FALSE),IF($B$6=Tables!$G$226,VLOOKUP($C$6,Tables!$G$228:$K$263,3,FALSE),IF($B$6=Tables!$M$226,VLOOKUP($C$6,Tables!$M$228:$Q$259,3,FALSE),IF($B$6=Tables!$B$265,VLOOKUP($C$6,Tables!$B$267:$F$305,3,FALSE),IF($B$6=Tables!$H$265,VLOOKUP($C$6,Tables!$H$267:$L$338,3,FALSE),IF($B$6=Tables!$N$265,VLOOKUP($C$6,Tables!$N$267:$R$302,3,FALSE),IF($B$6=Tables!$B$308,VLOOKUP($C$6,Tables!$B$310:$F$343,3,FALSE),IF($B$6=Tables!$N$308,VLOOKUP($C$6,Tables!$N$310:$R$332,3,FALSE),IF($B$6=Tables!$B$346,VLOOKUP($C$6,Tables!$B$348:$F$417,3,FALSE),\"\"))))))))))))))))))))))))","v":""},null,{"$f":"IFERROR(G7*H7,0)","v":0},{"$f":"IF(C7=\"\",\"\",IF(B7=Tables!$B$1,VLOOKUP(C7,Tables!$B$4:$F$37,4,FALSE),IF(B7=Tables!$H$1,VLOOKUP(C7,Tables!$H$3:$L$76,4,FALSE),IF(B7=Tables!$M$1,VLOOKUP(C7,Tables!$M$3:$Q$38,4,FALSE),IF(B7=Tables!$M$40,VLOOKUP(C7,Tables!$M$42:$Q$58,4,FALSE),IF(B7=Tables!$B$78,VLOOKUP(C7,Tables!$B$79:$F$136,4,FALSE),IF(B7=Tables!$G$78,VLOOKUP(C7,Tables!$G$80:$K$114,4,FALSE),IF(B7=Tables!$L$78,VLOOKUP(C7,Tables!$L$80:$P$128,4,FALSE),IF(B7=Tables!$B$138,VLOOKUP(C7,Tables!$B$140:$F$177,4,FALSE),IF(B7=Tables!$G$138,VLOOKUP(C7,Tables!$G$140:$K$184,4,FALSE),IF(B7=Tables!$L$138,VLOOKUP(C7,Tables!$L$140:$P$171,4,FALSE),IF(B7=Tables!$B$186,VLOOKUP(C7,Tables!$B$188:$F$220,4,FALSE),IF(B7=Tables!$G$186,VLOOKUP(C7,Tables!$G$188:$K$224,4,FALSE),IF(B7=Tables!$L$186,VLOOKUP(C7,Tables!$L$188:$P$221,4,FALSE),IF(B7=Tables!$G$186,VLOOKUP(C7,Tables!$G$188:$K$224,4,FALSE),IF(B7=Tables!$B$226,VLOOKUP(C7,Tables!$B$228:$F$256,4,FALSE),IF(B7=Tables!$G$226,VLOOKUP(C7,Tables!$G$228:$K$263,4,FALSE),IF(B7=Tables!$M$226,VLOOKUP(C7,Tables!$M$228:$Q$259,4,FALSE),IF(B7=Tables!$B$265,VLOOKUP(C7,Tables!$B$267:$F$305,4,FALSE),IF(B7=Tables!$H$265,VLOOKUP(C7,Tables!$H$267:$L$338,4,FALSE),IF(B7=Tables!N$265,VLOOKUP(C7,Tables!$N$267:$R$302,4,FALSE),IF(B7=Tables!$B$308,VLOOKUP(C7,Tables!$B$310:$F$343,4,FALSE),IF(B7=Tables!$N$308,VLOOKUP(C7,Tables!$N$310:$R$332,4,FALSE),IF(B7=Tables!B$346,VLOOKUP(C7,Tables!$B$348:$F$417,4,FALSE),\"\"))))))))))))))))))))))))","v":0},null,{"$f":"IFERROR(J7*K7,0)","v":0},{"$f":"IF(C7=\"\",\"\",IF(B7=Tables!$B$1,VLOOKUP(C7,Tables!$B$4:$F$37,5,FALSE),IF(B7=Tables!$H$1,VLOOKUP(C7,Tables!$H$3:$L$76,5,FALSE),IF(B7=Tables!$M$1,VLOOKUP(C7,Tables!$M$3:$Q$38,5,FALSE),IF(B7=Tables!$M$40,VLOOKUP(C7,Tables!$M$42:$Q$58,5,FALSE),IF(B7=Tables!$B$78,VLOOKUP(C7,Tables!$B$79:$F$136,5,FALSE),IF(B7=Tables!$G$78,VLOOKUP(C7,Tables!$G$80:$K$114,5,FALSE),IF(B7=Tables!$L$78,VLOOKUP(C7,Tables!$L$80:$P$128,5,FALSE),IF(B7=Tables!$B$138,VLOOKUP(C7,Tables!$B$140:$F$177,5,FALSE),IF(B7=Tables!$G$138,VLOOKUP(C7,Tables!$G$140:$K$184,5,FALSE),IF(B7=Tables!$L$138,VLOOKUP(C7,Tables!$L$140:$P$171,5,FALSE),IF(B7=Tables!$B$186,VLOOKUP(C7,Tables!$B$188:$F$220,5,FALSE),IF(B7=Tables!$G$186,VLOOKUP(C7,Tables!$G$188:$K$224,5,FALSE),IF(B7=Tables!$L$186,VLOOKUP(C7,Tables!$L$188:$P$221,5,FALSE),IF(B7=Tables!$G$186,VLOOKUP(C7,Tables!$G$188:$K$224,5,FALSE),IF(B7=Tables!$B$226,VLOOKUP(C7,Tables!$B$228:$F$256,5,FALSE),IF(B7=Tables!$G$226,VLOOKUP(C7,Tables!$G$228:$K$263,5,FALSE),IF(B7=Tables!$M$226,VLOOKUP(C7,Tables!$M$228:$Q$259,5,FALSE),IF(B7=Tables!$B$265,VLOOKUP(C7,Tables!$B$267:$F$305,5,FALSE),IF(B7=Tables!$H$265,VLOOKUP(C7,Tables!$H$267:$L$338,5,FALSE),IF($B$6=Tables!N$265,VLOOKUP(C7,Tables!$N$267:$R$302,5,FALSE),IF(B7=Tables!$B$308,VLOOKUP(C7,Tables!$B$310:$F$343,5,FALSE),IF(B7=Tables!$N$308,VLOOKUP(C7,Tables!$N$310:$R$332,5,FALSE),IF(B7=Tables!$B$346,VLOOKUP(C7,Tables!$B$348:$F$417,5,FALSE),\"\"))))))))))))))))))))))))","v":0},null,{"$f":"IFERROR(M7*N7,0)","v":0},{"$f":"IFERROR(F7+I7+L7+O7,\"\")","v":15},null,{"$f":"IFERROR(P7-(Q7*P7),\"\")","v":15}]
[]
[null,null,null,null,null,null,null,null,null,null,null,null,"POURCENTAGE AUTO PAR LIGNE   ",null,null,{"$f":"SUM($P$6:INDIRECT(ADDRESS($AA$1,16,1,1)))","v":36},{"$f":"IFERROR((R9-P9)/P9,0)","v":-2.3333333333333428E-2},{"$f":"SUM(R6:INDIRECT(ADDRESS($AA$1,18,1,1)))","v":35.159999999999997}]
[]
[null,null,null,null,null,null,null,null,null,null,null,null,"POURCENTAGE GLOBAL MANUEL   ",null,null,{"$f":"P9","v":36},null,{"$f":"P11-(P11*Q11)","v":36}]
[null,null,null,null,null,null,null,null,null,null,null,null,null,null,null,null,"                          "]

{"sheet":"Tables","index":1,"n_rows":417,"n_cols":33,"rows_kept":417,"cut":false,"hidden":false,"merged":[]}
[null,"ALES",null,null,null,null,null,"AUDE DEP",null,null,null,null,"AUDE INDEP ML"]
[]
[null,"PAGES LOCALES",null,null,null,null,null,"DEUXIEME CAHIER QUADRI DEPARTEMENTAL 24 h / CARCASSONNE",null,null,null,null,"PAGES LOCALES"]
[null,"Ecran de base (L 94 x H 66)",1,1,null,null,null,"Ecran de base (L 94 x H 66) CARCA",1,1,null,null,"Ecran de base (L 94 x H 66)",1,1]
[null,"Double écran (L 94 x H 137)",2,2,null,null,null,"Double écran (L 94 x H 137) CARCA",2,2,null,null,"Double écran (L 94 x H 137)",2,2]
[null,"Double écran (L 192 x H 66)",3,3,null,null,null,"Double écran (L 192 x H 66) CARCA",3,3,null,null,"Double écran (L 192 x H 66)",3,3]
[null,"Bandeau (L 290 X H 66)",4,4,null,null,null,"Bandeau (L 290 X H 66) CARCA",4,4,null,null,"Bandeau (L 290 X H 66)",4,4,null,null,null,null,null,null,null,null,null,null,"ALES",null,null,1,null,0.01,null,-0.01]
[null,"Demie-chandelle (L 290 X H 66)",5,5,null,null,null,"Demie-chandelle (L 94 X H 208) CARCA",5,5,null,null,"Demie-chandellle (L 94 x H 208)",5,5,null,null,null,null,null,null,null,null,null,null,"AUDE DEP",null,null,2,null,0.02,null,-0.02]
[null,"4 x 4 (L 192 X H 137)",6,6,null,null,null,"4 x 4 (L 192 X H 137) CARCA",6,6,null,null,"4 x 4 (L 192 X H 137)",6,6,null,null,null,null,null,null,null,null,null,null,"AUDE INDEP ML",null,null,3,null,0.03,null,-0.03]
[null,"Quart de page (L 143 X H 208)",7,7,null,null,null,"Quart de page (L 143 X H 208) CARCA",7,7,null,null,"Quart de page (L 143 X H 208)",7,7,null,null,null,null,null,null,null,null,null,null,"AVEYRON CPA ML",null,null,4,null,0.04,null,-0.04]
[null,"Double bandeau (L 290 x H 137)",8,8,null,null,null,"Double bandeau (L 290 x H 137) CARCA",8,8,null,null,"Double bandeau (L 290 X H 137)",8,8,null,null,null,null,null,null,null,null,null,null,"AVEYRON DEP",null,null,5,null,0.05,null,-0.05]
[null,"Grand 6 (L 192 X H 208)",9,9,null,null,null,"Grand 6 (L 192 X H 208) CARCA",9,9,null,null,"Grand 6 (L 192 X H 208)",9,9,null,null,null,null,null,null,null,null,null,null,"BAGNOLS",null,null,6,null,0.06,null,-0.06]
[null,"Chandelle (L 94 X H 421)",10,10,null,null,null,"Chandelle (L 94 X H 421) CARCA",10,10,null,null,"Chandelle (L 94 X H 421)",10,10,null,null,null,null,null,null,null,null,null,null,"BEZIERS",null,null,7,null,7.0000000000000007E-2,null,-7.0000000000000007E-2]
[null,"Grand 8 (L 192 X H 279)",11,11,null,null,null,"Demi-page (L 290 X H 208) CARCA",11,11,null,null,"Grand 8 (L 192 X H 279)",11,11,null,null,null,null,null,null,null,null,null,null,"CARCASSONNE",null,null,8,null,0.08,null,-0.08]
[null,"Demi-page (L 290 X H 208)",12,12,null,null,null,"Double chandelle (L 192 X H 421) CARCA",12,12,null,null,"Demi-page (L 290 X H 208)",12,12,null,null,null,null,null,null,null,null,null,null,"DIRECT MATIN",null,null,9,null,0.09,null,-0.09]
[null,"Double chandelle (L 192 X H 421)",13,13,null,null,null,"Page (L 290 X H 421) CARCA",13,13,null,null,"Double chandelle (L 192 X H 421)",13,13,null,null,null,null,null,null,null,null,null,null,"GARD",null,null,10,null,0.1,null,-0.1]
[null,"Page (L 290 X H 421)",14,14,null,null,null,null,null,null,null,null,"Page (L 290 X H 421)",14,14,null,null,null,null,null,null,null,null,null,null,"HERAULT",null,null,11,null,0.11,null,-0.11]
[null,null,null,null,null,null,null,"DEUXIEME CAHIER QUADRI CASTELNAUDARY ET AUTRES PAGES ",null,null,null,null,null,null,null,null,null,null,null,null,null,null,null,null,null,"LODEVE",null,null,12,null,0.12,null,-0.12]
[null,"EMPLACEMENTS PRIVILEGIES",null,null,null,null,null,"Ecran de base (L 94 x H 66)",1,1,null,null,"EMPLACEMENTS PRIVILEGIES",null,null,null,null,null,null,null,null,null,null,null,null,"LOZERE",null,null,13,null,0.13,null,-0.13]
[null,"Corner de Une",1,1,null,null,null,"Double écran (L 94 x H 137)",2,2,null,null,"Manchette de Une",1,1,null,null,null,null,null,null,null,null,null,null,"LUNEL",null,null,14,null,0.14000000000000001,null,-0.14000000000000001]
[null,"Manchette de Une",2,2,null,null,null,"Double écran (L 192 x H 66)",3,3,null,null,"Ecran de Une",2,2,null,null,null,null,null,null,null,null,null,null,"MILLAU",null,null,15,null,0.15,null,-0.15]
[null,"Ecran de Une",3,3,null,null,null,"Bandeau (L 290 X H 66)",4,4,null,null,"Bandeau de Une",3,3,null,null,null,null,null,null,null,null,null,null,"MONTPELLIER REGION",null,null,16,null,0.16,null,-0.16]
[null,"Bandeau de Une",4,4,null,null,null,"Demie-chandelle (L 94 X H 208)",5,5,null,null,"4 x 4 page 2 ou 3 ou Der",4,4,null,null,null,null,null,null,null,null,null,null,"NARBONNE",null,null,17,null,0.17,null,-0.17]
[null,"4 x 4 page 2, 3 ou Der",5,5,null,null,null,"4 x 4 (L 192 X H 137)",6,6,null,null,"Double bandeau P3",5,5,null,null,null,null,null,null,null,null,null,null,"NIMES",null,null,18,null,0.18,null,-0.18]
[null,"Double bandeau P3",6,6,null,null,null,"Quart de page (L 143 X H 208)",7,7,null,null,"Corner de Une",6,6,null,null,null,null,null,null,null,null,null,null,"PO",null,null,19,null,0.19,null,-0.19]
[null,"Grand 6 page 4",7,7,null,null,null,"Double bandeau (L 290 x H 137)",8,8,null,null,"Grand 6 page 4",7,7,null,null,null,null,null,null,null,null,null,null,"RODEZ",null,null,20,null,0.2,null,-0.2]
[null,"Chandelle page 4",8,8,null,null,null,"Grand 6 (L 192 X H 208)",9,9,null,null,"Chandelle page 4",8,8,null,null,null,null,null,null,null,null,null,null,"SETE",null,null,21,null,0.21,null,-0.21]
[null,"Demi-page page 4",9,9,null,null,null,"Chandelle (L 94 X H 421)",10,10,null,null,"Demi-page page 4",9,9,null,null,null,null,null,null,null,null,null,null,"TOUTES EDITIONS",null,null,22,null,0.22,null,-0.22]
[null,"Double chandelle page 4",10,10,null,null,null,"Demi-page (L 290 X H 208)",11,11,null,null,"Double chandelle page 4",10,10,null,null,null,null,null,null,null,null,null,null,null,null,null,23,null,0.23,null,-0.23]
[null,"Page 4",11,11,null,null,null,"Double chandelle (L 192 X H 421)",12,12,null,null,"Page 4",11,11,null,null,null,null,null,null,null,null,null,null,null,null,null,24,null,0.24,null,-0.24]
[null,"Double écran page 5",12,12,null,null,null,"Page (L 290 X H 421)",13,13,null,null,"Ecran de base page 5",12,12,null,null,null,null,null,null,null,null,null,null,null,null,null,25,null,0.25,null,-0.25]
[null,"4 x 4 page 5",13,13,null,null,null,null,null,null,null,null,"Double écran page 5",13,13,null,null,null,null,null,null,null,null,null,null,null,null,null,26,null,0.26,null,-0.26]
[null,"Bandeau page 5",14,14,null,null,null,"EMPLACEMENTS PRIVILEGIES PREMIER CAHIER",null,null,null,null,"Bandeau page 5",14,14,null,null,null,null,null,null,null,null,null,null,null,null,null,27,null,0.27,null,-0.27]
[null,null,null,null,null,null,null,"Manchette de Une (L 69 x H 45) 1er",1,1,null,null,"4 x 4 page 5",15,15,null,null,null,null,null,null,null,null,null,null,null,null,null,28,null,0.28000000000000003,null,-0.28000000000000003]
[null,"PAGE TELEVISION",null,null,null,null,null,"Duo de Une (L 92 x H 100) 1er",2,2,null,null,null,null,null,null,null,null,null,null,null,null,null,null,null,null,null,null,29,null,0.28999999999999998,null,-0.28999999999999998]
[null,"Ecran",1,1,null,null,null,"Quadro de Une (L 188 x H 100) 1er",3,3,null,null,"PAGE TELEVISION",null,null,null,null,null,null,null,null,null,null,null,null,null,null,null,30,null,0.3,null,-0.3]
[null,"Double écran",1,1,null,null,null,"Duo en Der 1er",4,4,null,null,"Ecran",1,1,null,null,null,null,null,null,null,null,null,null,null,null,null,31,null,0.31,null,-0.31]
[null,null,null,null,null,null,null,"Quatro en Der 1er",5,5,null,null,"Double écran",1,1,null,null,null,null,null,null,null,null,null,null,null,null,null,32,null,0.32,null,-0.32]
[null,"AUDE INDEP ML",null,null,null,null,null,null,null,null,null,null,null,null,null,null,null,null,null,null,null,null,null,null,null,null,null,null,33,null,0.33,null,-0.33]
[null,null,null,null,null,null,null,"EMPLACEMENTS PRIVILEGIES DEUXIEME CAHIER",null,null,null,null,"AVEYRON CPA ML",null,null,null,null,null,null,null,null,null,null,null,null,null,null,null,34,null,0.34,null,-0.34]
{"$rows_left_out":377}