{"text_format":"1","workbook":"xlsx","n_sheets":7,"sheets":["Démarche à suivre","BL","Facture","Liste clients","Liste articles","Entrées et Sorties","Etat des stocks"],"not_rendered":{"charts":0,"images":0,"macros":1,"external_links":1,"defined_names":8,"comments":1,"pivot_tables":0},"unopened":[],"bounds":{"document_bytes":16777216,"sheet_cells":100000,"rows_first":2000,"rows_last":500,"rows_between":2000,"halvings":0,"cell_chars":16384,"cell_head_chars":4096},"cells_cut":0,"cells_raw":0,"read":"whole","date_system":"1900"}

{"sheet":"Démarche à suivre","index":0,"n_rows":23,"n_cols":2,"rows_kept":23,"cut":false,"hidden":false,"merged":[]}
[]
[null,"Démarche à suivre mettre à jour le fichier"]
[]
[null,"Ajouter vos nouveaux articles dans l'onglet Liste articles et les nouveaux clients dans l'onglet Liste Clients  -> OK"]
[null,"Il est déconseillé de supprimer des articles de votre base de données. Cela pourrait dérégler les calculs."]
[]
[null,"Aller dans l'onglet Etat de stocks. Les articles ajoutés à la base de données devraient s'aficher automatiquement.\nIl ne reste plus qu’à mentionner le stock initial des articles."]
[]
[null,"Lorsqu'on procède à l'achat d'articles déjà exitants dans la base: renseigner l'onglet Entrées et sorties en y indiquant l'entrée de stock"]
[]
[null,"Création d'un BL + facture automatique"]
[]
[null,"Compléter le BL (nom client, articles, quantités, remises)"]
[null,"Les formules sont protégées. Pour modifier un élément, cliquer sur le Bouton \"Modifier le BL\", sinon cliquer sur \"Valider le BL\" pour générer la facture correspondante."]
[null,"Un nouveau fichier Excel s'ouvre avec ce même BL. Attention à penser à l'enregistrer pour archivage. "]
{"$rows_left_out":9}
{"sheet":"BL","index":1,"n_rows":44,"n_cols":13,"rows_kept":44,"cut":false,"hidden":false,"merged":[[24,0,24,3],[25,0,25,3],[17,0,17,3],[18,0,18,3],[19,0,19,3],[20,0,20,3],[21,0,21,3],[3,14,16,15],[0,0,0,6],[5,4,5,6],[6,4,6,6],[7,4,7,6],[8,4,8,6],[14,1,14,2],[16,0,16,3],[26,0,26,3],[22,0,22,3],[41,1,41,2],[34,0,34,3],[35,0,35,3],[36,0,36,3],[37,0,37,3],[40,1,40,2],[33,0,33,3],[27,0,27,3],[32,0,32,3],[28,0,28,3],[29,0,29,3],[30,0,30,3],[31,0,31,3],[23,0,23,3]]}
[]
[]
[]
[null,null,null,"DATE : ",{"$f":"TODAY()+1","v":"2017-03-24"},null,null,null,null,null,null,null,"mot de passe : BS"]
[]
[null,null,null,"CLIENT : "]
[null,null,null,"Adresse",{"$f":"IF(E6=\"\",\"\",VLOOKUP(E6,'Liste clients'!$B$4:$F$502,3,FALSE))","v":""}]
[null,null,null,"Complément d'adresse",{"$f":"IF(E6=\"\",\"\",VLOOKUP(E6,'Liste clients'!$B$4:$F$502,4,FALSE))","v":""}]
[null,null,null,"Ville",{"$f":"IF(E6=\"\",\"\",VLOOKUP(E6,'Liste clients'!$B$4:$F$502,5,FALSE))","v":""}]
[]
[]
[]
["BON DE LIVRAISON"]
[]
["N°",""]
{"$rows_left_out":30}
{"sheet":"Facture","index":2,"n_rows":50,"n_cols":136,"rows_kept":50,"cut":false,"hidden":true,"merged":[[38,0,38,3],[36,0,36,3],[32,0,32,3],[19,0,19,3],[22,0,22,3],[25,0,25,3],[26,0,26,3],[27,0,27,3],[28,0,28,3],[29,0,29,3],[30,0,30,3],[31,0,31,3],[20,0,20,3],[21,0,21,3],[23,0,23,3],[6,15,14,19],[33,0,33,3],[34,0,34,3],[35,0,35,3],[37,0,37,3],[24,0,24,3],[7,4,7,6],[8,4,8,6],[9,4,9,6],[10,4,10,6]]}
[]
[]
[]
[]
[]
[]
[]
[null,null,null,"Client:",{"$f":"IF(BL!E6=\"\",\"\",BL!E6)","v":""}]
[null,null,null,"Adresse",{"$f":"IF(BL!E7=\"\",\"\",BL!E7)","v":""}]
[null,null,null,"Complément d'adresse",{"$f":"IF(BL!E8=\"\",\"\",BL!E8)","v":""}]
[null,null,null,"Ville",{"$f":"IF(BL!E9=\"\",\"\",BL!E9)","v":""}]
[]
["FACTURE"]
[null,null,null,"20/4/2017",null,null,null,18]
["       Date","              Numéro",null," Echéance",null,null,null,2]
{"$rows_left_out":36}
{"sheet":"Liste clients","index":3,"n_rows":20,"n_cols":7,"rows_kept":20,"cut":false,"hidden":false,"merged":[[1,1,1,5]]}
[]
[null,"LISTE CLIENTS"]
[]
[null,"Client","N°","Adresse","Complément adresse","Ville"]
[]
[]
[]
[]
[]
[]
[]
[]
[]
[]
[]
{"$rows_left_out":6}
{"sheet":"Liste articles","index":4,"n_rows":460,"n_cols":10,"rows_kept":460,"cut":false,"hidden":false,"merged":[[10,9,10,12],[1,1,1,12]]}
[]
[null,"LISTE ARTICLES"]
[]
[]
[null,"Article","Ref","Qté / carton","Prix de vente unitaire","Prix / carton","Poids / Carton (kg)",null,null,"> Vérifier l'état des stocks"]
[null,"Jambon de Parme BIO x 0,70 gr x 10 pz ",{"$f":"IF(B6=\"\",\"\",B6)","v":"Jambon de Parme BIO x 0,70 gr x 10 pz "},10,4.95,49.5,0.7]
[null,"Jambon Cru National BIO RESERVE x 0,70gr x 10 pz ",{"$f":"IF(B7=\"\",\"\",B7)","v":"Jambon Cru National BIO RESERVE x 0,70gr x 10 pz "},10,3.95,39.5,0.7]
[null,"Salami Milano BIO x 0,70 gr x 10 pz ","Salami Milano BIO x 0,70 gr x 10 pz ",10,2.5,25,0.7,null,null,"> Renseigner le stock initial"]
[null,"Bresaola di Suino BIO x 0,70 gr x 10 pz ","Bresaola di Suino BIO x 0,70 gr x 10 pz ",10,3.6,36,0.7]
[null,"Mortadella Bologna BIO IGP x 100 gr x 10 pz ","Mortadella Bologna BIO IGP x 100 gr x 10 pz ",10,2.5,25,1]
[null,"Jambon Cuit BIO x 100 gr x 10 pz ","Jambon Cuit BIO x 100 gr x 10 pz ",10,3.45,34.5,1]
[null," Tagliatelles fraîches aux œufs"," Tagliatelles fraîches aux œufs",6,1.45,8.6999999999999993,1.5]
[null," Pâtes fraîches au petit épeautre de Provence"," Pâtes fraîches au petit épeautre de Provence",6,1.51,9.06,1.5]
[null," Ravioli frais aux petits légumes de Méditerranée"," Ravioli frais aux petits légumes de Méditerranée",6,2.2799999999999998,13.68,1.5]
[null," Ravioli frais potimarron & emmenthal"," Ravioli frais potimarron & emmenthal",6,2.54,15.24,1.5]
{"$rows_left_out":446}
{"sheet":"Entrées et Sorties","index":5,"n_rows":179,"n_cols":9,"rows_kept":179,"cut":false,"hidden":false,"merged":[[14,10,14,11],[15,10,15,11],[1,0,1,8]]}
[]
["JOURNAL D'ENTRÉES ET SORTIES"]
[]
[null,"Date","Article","Ref","Entrée","Sortie",null,null,"> Vérifier l'état des stocks"]
[null,null,{"$f":"IF(BL!A16=\"\",\"\",BL!A16)","v":""},""]
[null,null,null,"",{"$f":"IF(B6=\"\",\"\",BL!D17)","v":""},null,null,null,"> Accéder à la liste des articles"]
[null,null,null,"",{"$f":"IF(B7=\"\",\"\",BL!D18)","v":""}]
[null,null,null,""]
[null,null,null,""]
[null,null,null,""]
[null,null,null,""]
[null,null,null,""]
[null,null,null,""]
[null,null,null,""]
[null,null,null,""]
{"$rows_left_out":165}
{"sheet":"Etat des stocks","index":6,"n_rows":464,"n_cols":10,"rows_kept":464,"cut":false,"hidden":false,"merged":[[9,9,9,12],[1,1,1,8]]}
[]
[null,"ÉTAT DES STOCKS"]
[]
[]
[null,"Article","Ref","Stock initial","Entrées","Sorties","Stock Final",null,null,"> Accéder à la liste des articles"]
[null,{"$f":"IF('Liste articles'!B6=\"\",\"\",'Liste articles'!B6)","v":"Jambon de Parme BIO x 0,70 gr x 10 pz "},{"$f":"IF('Liste articles'!C6=\"\",\"\",'Liste articles'!C6)","v":"Jambon de Parme BIO x 0,70 gr x 10 pz "},null,{"$f":"IF(B6=\"\",\"\",SUMIFS('Entrées et Sorties'!E$5:E$397,'Entrées et Sorties'!D$5:D$397,C6))","v":0},{"$f":"IF(C6=\"\",\"\",SUMIFS('Entrées et Sorties'!F$5:F$497,'Entrées et Sorties'!D$5:D$497,C6))","v":0},{"$f":"IF(C6=\"\",\"\",D6+E6-F6)","v":0}]
[null,{"$f":"IF('Liste articles'!B7=\"\",\"\",'Liste articles'!B7)","v":"Jambon Cru National BIO RESERVE x 0,70gr x 10 pz "},{"$f":"IF('Liste articles'!C7=\"\",\"\",'Liste articles'!C7)","v":"Jambon Cru National BIO RESERVE x 0,70gr x 10 pz "},null,{"$f":"IF(B7=\"\",\"\",SUMIFS('Entrées et Sorties'!E$5:E$397,'Entrées et Sorties'!D$5:D$397,C7))","v":0},{"$f":"IF(C7=\"\",\"\",SUMIFS('Entrées et Sorties'!F$5:F$497,'Entrées et Sorties'!D$5:D$497,C7))","v":0},{"$f":"IF(C7=\"\",\"\",D7+E7-F7)","v":0}]
[null,{"$f":"IF('Liste articles'!B8=\"\",\"\",'Liste articles'!B8)","v":"Salami Milano BIO x 0,70 gr x 10 pz "},{"$f":"IF('Liste articles'!C8=\"\",\"\",'Liste articles'!C8)","v":"Salami Milano BIO x 0,70 gr x 10 pz "},null,{"$f":"IF(B8=\"\",\"\",SUMIFS('Entrées et Sorties'!E$5:E$397,'Entrées et Sorties'!D$5:D$397,C8))","v":0},{"$f":"IF(C8=\"\",\"\",SUMIFS('Entrées et Sorties'!F$5:F$497,'Entrées et Sorties'!D$5:D$497,C8))","v":0},0]
[null,{"$f":"IF('Liste articles'!B9=\"\",\"\",'Liste articles'!B9)","v":"Bresaola di Suino BIO x 0,70 gr x 10 pz "},{"$f":"IF('Liste articles'!C9=\"\",\"\",'Liste articles'!C9)","v":"Bresaola di Suino BIO x 0,70 gr x 10 pz "},null,{"$f":"IF(B9=\"\",\"\",SUMIFS('Entrées et Sorties'!E$5:E$397,'Entrées et Sorties'!D$5:D$397,C9))","v":0},{"$f":"IF(C9=\"\",\"\",SUMIFS('Entrées et Sorties'!F$5:F$497,'Entrées et Sorties'!D$5:D$497,C9))","v":0},0]
[null,{"$f":"IF('Liste articles'!B10=\"\",\"\",'Liste articles'!B10)","v":"Mortadella Bologna BIO IGP x 100 gr x 10 pz "},{"$f":"IF('Liste articles'!C10=\"\",\"\",'Liste articles'!C10)","v":"Mortadella Bologna BIO IGP x 100 gr x 10 pz "},null,{"$f":"IF(B10=\"\",\"\",SUMIFS('Entrées et Sorties'!E$5:E$397,'Entrées et Sorties'!D$5:D$397,C10))","v":0},{"$f":"IF(C10=\"\",\"\",SUMIFS('Entrées et Sorties'!F$5:F$497,'Entrées et Sorties'!D$5:D$497,C10))","v":0},0]
[null,{"$f":"IF('Liste articles'!B11=\"\",\"\",'Liste articles'!B11)","v":"Jambon Cuit BIO x 100 gr x 10 pz "},{"$f":"IF('Liste articles'!C11=\"\",\"\",'Liste articles'!C11)","v":"Jambon Cuit BIO x 100 gr x 10 pz "},null,{"$f":"IF(B11=\"\",\"\",SUMIFS('Entrées et Sorties'!E$5:E$397,'Entrées et Sorties'!D$5:D$397,C11))","v":0},{"$f":"IF(C11=\"\",\"\",SUMIFS('Entrées et Sorties'!F$5:F$497,'Entrées et Sorties'!D$5:D$497,C11))","v":0},0]
[null,{"$f":"IF('Liste articles'!B12=\"\",\"\",'Liste articles'!B12)","v":" Tagliatelles fraîches aux œufs"},{"$f":"IF('Liste articles'!C12=\"\",\"\",'Liste articles'!C12)","v":" Tagliatelles fraîches aux œufs"},null,{"$f":"IF(B12=\"\",\"\",SUMIFS('Entrées et Sorties'!E$5:E$397,'Entrées et Sorties'!D$5:D$397,C12))","v":0},{"$f":"IF(C12=\"\",\"\",SUMIFS('Entrées et Sorties'!F$5:F$497,'Entrées et Sorties'!D$5:D$497,C12))","v":0},0]
[null,{"$f":"IF('Liste articles'!B13=\"\",\"\",'Liste articles'!B13)","v":" Pâtes fraîches au petit épeautre de Provence"},{"$f":"IF('Liste articles'!C13=\"\",\"\",'Liste articles'!C13)","v":" Pâtes fraîches au petit épeautre de Provence"},null,{"$f":"IF(B13=\"\",\"\",SUMIFS('Entrées et Sorties'!E$5:E$397,'Entrées et Sorties'!D$5:D$397,C13))","v":0},{"$f":"IF(C13=\"\",\"\",SUMIFS('Entrées et Sorties'!F$5:F$497,'Entrées et Sorties'!D$5:D$497,C13))","v":0},{"$f":"IF(C13=\"\",\"\",D13+E13-F13)","v":0}]
[null,{"$f":"IF('Liste articles'!B14=\"\",\"\",'Liste articles'!B14)","v":" Ravioli frais aux petits légumes de Méditerranée"},{"$f":"IF('Liste articles'!C14=\"\",\"\",'Liste articles'!C14)","v":" Ravioli frais aux petits légumes de Méditerranée"},null,{"$f":"IF(B14=\"\",\"\",SUMIFS('Entrées et Sorties'!E$5:E$397,'Entrées et Sorties'!D$5:D$397,C14))","v":0},{"$f":"IF(C14=\"\",\"\",SUMIFS('Entrées et Sorties'!F$5:F$497,'Entrées et Sorties'!D$5:D$497,C14))","v":0},0]
[null,{"$f":"IF('Liste articles'!B15=\"\",\"\",'Liste articles'!B15)","v":" Ravioli frais potimarron & emmenthal"},{"$f":"IF('Liste articles'!C15=\"\",\"\",'Liste articles'!C15)","v":" Ravioli frais potimarron & emmenthal"},null,{"$f":"IF(B15=\"\",\"\",SUMIFS('Entrées et Sorties'!E$5:E$397,'Entrées et Sorties'!D$5:D$397,C15))","v":0},{"$f":"IF(C15=\"\",\"\",SUMIFS('Entrées et Sorties'!F$5:F$497,'Entrées et Sorties'!D$5:D$497,C15))","v":0},0]
{"$rows_left_out":449}