{"text_format":"1","workbook":"xlsx","n_sheets":7,"sheets":["Démarche à suivre","BL","Facture","Liste clients","Liste articles","Entrées et Sorties","Etat des stocks"],"not_rendered":{"charts":0,"images":0,"macros":1,"external_links":1,"defined_names":8,"comments":1,"pivot_tables":0},"unopened":[],"bounds":{"document_bytes":16777216,"sheet_cells":100000,"rows_first":2000,"rows_last":500,"rows_between":2000,"halvings":0,"cell_chars":16384,"cell_head_chars":4096},"cells_cut":0,"cells_raw":0,"read":"whole","date_system":"1900"}

{"sheet":"Démarche à suivre","index":0,"n_rows":23,"n_cols":2,"rows_kept":23,"cut":false,"hidden":false,"merged":[]}
[]
[null,"Démarche à suivre mettre à jour le fichier"]
[]
[null,"Ajouter vos nouveaux articles dans l'onglet Liste articles et les nouveaux clients dans l'onglet Liste Clients  -> OK"]
[null,"Il est déconseillé de supprimer des articles de votre base de données. Cela pourrait dérégler les calculs."]
[]
[null,"Aller dans l'onglet Etat de stocks. Les articles ajoutés à la base de données devraient s'aficher automatiquement.\nIl ne reste plus qu’à mentionner le stock initial des articles."]
[]
[null,"Lorsqu'on procède à l'achat d'articles déjà exitants dans la base: renseigner l'onglet Entrées et sorties en y indiquant l'entrée de stock"]
[]
[null,"Création d'un BL + facture automatique"]
[]
[null,"Compléter le BL (nom client, articles, quantités, remises)"]
[null,"Les formules sont protégées. Pour modifier un élément, cliquer sur le Bouton \"Modifier le BL\", sinon cliquer sur \"Valider le BL\" pour générer la facture correspondante."]
[null,"Un nouveau fichier Excel s'ouvre avec ce même BL. Attention à penser à l'enregistrer pour archivage. "]
[null,"La validation d'un BL entraîne automatiquement la mise à jour des stocks -> ETAPE A FINALISER : l'onglet Entrées et sorties devrait être complété automatiquement"]
[]
[null,"Un nouvel onglet avec la facture correspondant au BL apparaît dans le fichier."]
[null,"Pour modifier un élément, cliquer sur le Bouton \"Modifier la facture\", sinon cliquer sur \"Valider la facture\" pour générer la facture correspondante."]
[null,"Un nouveau fichier Excel s'ouvre avec cette même facture. Attention à penser à l'enregistrer pour archivage. "]
[]
[null,"Dès que les données ont été validées (avec l'ouverture d'un dupicata dans un nouveau fichier), les onglets BL et facture sont à nouveau vierges."]
[null,"Il est nécessaire de valider la facture avant de créer un nouveau BL"]

{"sheet":"BL","index":1,"n_rows":44,"n_cols":13,"rows_kept":44,"cut":false,"hidden":false,"merged":[[24,0,24,3],[25,0,25,3],[17,0,17,3],[18,0,18,3],[19,0,19,3],[20,0,20,3],[21,0,21,3],[3,14,16,15],[0,0,0,6],[5,4,5,6],[6,4,6,6],[7,4,7,6],[8,4,8,6],[14,1,14,2],[16,0,16,3],[26,0,26,3],[22,0,22,3],[41,1,41,2],[34,0,34,3],[35,0,35,3],[36,0,36,3],[37,0,37,3],[40,1,40,2],[33,0,33,3],[27,0,27,3],[32,0,32,3],[28,0,28,3],[29,0,29,3],[30,0,30,3],[31,0,31,3],[23,0,23,3]]}
[]
[]
[]
[null,null,null,"DATE : ",{"$f":"TODAY()+1","v":"2017-03-24"},null,null,null,null,null,null,null,"mot de passe : BS"]
[]
[null,null,null,"CLIENT : "]
[null,null,null,"Adresse",{"$f":"IF(E6=\"\",\"\",VLOOKUP(E6,'Liste clients'!$B$4:$F$502,3,FALSE))","v":""}]
[null,null,null,"Complément d'adresse",{"$f":"IF(E6=\"\",\"\",VLOOKUP(E6,'Liste clients'!$B$4:$F$502,4,FALSE))","v":""}]
[null,null,null,"Ville",{"$f":"IF(E6=\"\",\"\",VLOOKUP(E6,'Liste clients'!$B$4:$F$502,5,FALSE))","v":""}]
[]
[]
[]
["BON DE LIVRAISON"]
[]
["N°",""]
[]
["DESIGNATION",null,null,null,"Qté","Prix unitaire par produit","poids (Kg)"]
["Bresaola di Suino BIO x 0,70 gr x 10 pz ",null,null,null,1,{"$f":"IF(A18=\"\",\"\",VLOOKUP(A18,'Liste articles'!$B$5:$G$328,4,FALSE))","v":3.6},{"$f":"IF(A18=\"\",\"\",VLOOKUP(A18,'Liste articles'!$B$5:$G$173,6,FALSE)*E18)","v":0.7}]
["Bresaola di Suino BIO x 0,70 gr x 10 pz ",null,null,null,2,{"$f":"IF(A19=\"\",\"\",VLOOKUP(A19,'Liste articles'!$B$5:$G$328,4,FALSE))","v":3.6},{"$f":"IF(A19=\"\",\"\",VLOOKUP(A19,'Liste articles'!$B$5:$G$173,6,FALSE)*E19)","v":1.4}]
["Bresaola di Suino BIO x 0,70 gr x 10 pz ",null,null,null,3,{"$f":"IF(A20=\"\",\"\",VLOOKUP(A20,'Liste articles'!$B$5:$G$328,4,FALSE))","v":3.6},{"$f":"IF(A20=\"\",\"\",VLOOKUP(A20,'Liste articles'!$B$5:$G$173,6,FALSE)*E20)","v":2.0999999999999996}]
[null,null,null,null,null,{"$f":"IF(A21=\"\",\"\",VLOOKUP(A21,'Liste articles'!$B$5:$G$328,4,FALSE))","v":""},{"$f":"IF(A21=\"\",\"\",VLOOKUP(A21,'Liste articles'!$B$5:$G$173,6,FALSE)*E21)","v":""}]
[null,null,null,null,null,{"$f":"IF(A22=\"\",\"\",VLOOKUP(A22,'Liste articles'!$B$5:$G$328,4,FALSE))","v":""},{"$f":"IF(A22=\"\",\"\",VLOOKUP(A22,'Liste articles'!$B$5:$G$173,6,FALSE)*E22)","v":""}]
[null,null,null,null,null,{"$f":"IF(A23=\"\",\"\",VLOOKUP(A23,'Liste articles'!$B$5:$G$328,4,FALSE))","v":""},{"$f":"IF(A23=\"\",\"\",VLOOKUP(A23,'Liste articles'!$B$5:$G$173,6,FALSE)*E23)","v":""}]
[null,null,null,null,null,{"$f":"IF(A24=\"\",\"\",VLOOKUP(A24,'Liste articles'!$B$5:$G$328,4,FALSE))","v":""},{"$f":"IF(A24=\"\",\"\",VLOOKUP(A24,'Liste articles'!$B$5:$G$173,6,FALSE)*E24)","v":""}]
[null,null,null,null,null,{"$f":"IF(A25=\"\",\"\",VLOOKUP(A25,'Liste articles'!$B$5:$G$328,4,FALSE))","v":""},{"$f":"IF(A25=\"\",\"\",VLOOKUP(A25,'Liste articles'!$B$5:$G$173,6,FALSE)*E25)","v":""}]
[null,null,null,null,null,{"$f":"IF(A26=\"\",\"\",VLOOKUP(A26,'Liste articles'!$B$5:$G$328,4,FALSE))","v":""},{"$f":"IF(A26=\"\",\"\",VLOOKUP(A26,'Liste articles'!$B$5:$G$173,6,FALSE)*E26)","v":""}]
[null,null,null,null,null,{"$f":"IF(A27=\"\",\"\",VLOOKUP(A27,'Liste articles'!$B$5:$G$328,4,FALSE))","v":""},{"$f":"IF(A27=\"\",\"\",VLOOKUP(A27,'Liste articles'!$B$5:$G$173,6,FALSE)*E27)","v":""}]
[null,null,null,null,null,{"$f":"IF(A28=\"\",\"\",VLOOKUP(A28,'Liste articles'!$B$5:$G$328,4,FALSE))","v":""},{"$f":"IF(A28=\"\",\"\",VLOOKUP(A28,'Liste articles'!$B$5:$G$173,6,FALSE)*E28)","v":""}]
[null,null,null,null,null,{"$f":"IF(A29=\"\",\"\",VLOOKUP(A29,'Liste articles'!$B$5:$G$328,4,FALSE))","v":""},{"$f":"IF(A29=\"\",\"\",VLOOKUP(A29,'Liste articles'!$B$5:$G$173,6,FALSE)*E29)","v":""}]
[null,null,null,null,null,{"$f":"IF(A30=\"\",\"\",VLOOKUP(A30,'Liste articles'!$B$5:$G$328,4,FALSE))","v":""},{"$f":"IF(A30=\"\",\"\",VLOOKUP(A30,'Liste articles'!$B$5:$G$173,6,FALSE)*E30)","v":""}]
[null,null,null,null,null,{"$f":"IF(A31=\"\",\"\",VLOOKUP(A31,'Liste articles'!$B$5:$G$328,4,FALSE))","v":""},{"$f":"IF(A31=\"\",\"\",VLOOKUP(A31,'Liste articles'!$B$5:$G$173,6,FALSE)*E31)","v":""}]
[null,null,null,null,null,{"$f":"IF(A32=\"\",\"\",VLOOKUP(A32,'Liste articles'!$B$5:$G$328,4,FALSE))","v":""},{"$f":"IF(A32=\"\",\"\",VLOOKUP(A32,'Liste articles'!$B$5:$G$173,6,FALSE)*E32)","v":""}]
[null,null,null,null,null,{"$f":"IF(A33=\"\",\"\",VLOOKUP(A33,'Liste articles'!$B$5:$G$328,4,FALSE))","v":""},{"$f":"IF(A33=\"\",\"\",VLOOKUP(A33,'Liste articles'!$B$5:$G$173,6,FALSE)*E33)","v":""}]
[null,null,null,null,null,{"$f":"IF(A34=\"\",\"\",VLOOKUP(A34,'Liste articles'!$B$5:$G$328,4,FALSE))","v":""},{"$f":"IF(A34=\"\",\"\",VLOOKUP(A34,'Liste articles'!$B$5:$G$173,6,FALSE)*E34)","v":""}]
[null,null,null,null,null,{"$f":"IF(A35=\"\",\"\",VLOOKUP(A35,'Liste articles'!$B$5:$G$328,4,FALSE))","v":""},{"$f":"IF(A35=\"\",\"\",VLOOKUP(A35,'Liste articles'!$B$5:$G$173,6,FALSE)*E35)","v":""}]
[null,null,null,null,null,{"$f":"IF(A36=\"\",\"\",VLOOKUP(A36,'Liste articles'!$B$5:$G$328,4,FALSE))","v":""},{"$f":"IF(A36=\"\",\"\",VLOOKUP(A36,'Liste articles'!$B$5:$G$173,6,FALSE)*E36)","v":""}]
[null,null,null,null,null,{"$f":"IF(A37=\"\",\"\",VLOOKUP(A37,'Liste articles'!$B$5:$G$328,4,FALSE))","v":""},{"$f":"IF(A37=\"\",\"\",VLOOKUP(A37,'Liste articles'!$B$5:$G$173,6,FALSE)*E37)","v":""}]
[null,null,null,null,null,{"$f":"IF(A38=\"\",\"\",VLOOKUP(A38,'Liste articles'!$B$5:$G$328,4,FALSE))","v":""},{"$f":"IF(A38=\"\",\"\",VLOOKUP(A38,'Liste articles'!$B$5:$G$173,6,FALSE)*E38)","v":""}]
[null,null,null,null,{"$f":"SUM(E18:E38)","v":6},null,{"$f":"SUM(G18:G38)","v":4.1999999999999993}]
[]
["Remise : "]
["Montant (€):"]
[]
["SIGNATURE :"]

{"sheet":"Facture","index":2,"n_rows":50,"n_cols":136,"rows_kept":50,"cut":false,"hidden":true,"merged":[[38,0,38,3],[36,0,36,3],[32,0,32,3],[19,0,19,3],[22,0,22,3],[25,0,25,3],[26,0,26,3],[27,0,27,3],[28,0,28,3],[29,0,29,3],[30,0,30,3],[31,0,31,3],[20,0,20,3],[21,0,21,3],[23,0,23,3],[6,15,14,19],[33,0,33,3],[34,0,34,3],[35,0,35,3],[37,0,37,3],[24,0,24,3],[7,4,7,6],[8,4,8,6],[9,4,9,6],[10,4,10,6]]}
[]
[]
[]
[]
[]
[]
[]
[null,null,null,"Client:",{"$f":"IF(BL!E6=\"\",\"\",BL!E6)","v":""}]
[null,null,null,"Adresse",{"$f":"IF(BL!E7=\"\",\"\",BL!E7)","v":""}]
[null,null,null,"Complément d'adresse",{"$f":"IF(BL!E8=\"\",\"\",BL!E8)","v":""}]
[null,null,null,"Ville",{"$f":"IF(BL!E9=\"\",\"\",BL!E9)","v":""}]
[]
["FACTURE"]
[null,null,null,"20/4/2017",null,null,null,18]
["       Date","              Numéro",null," Echéance",null,null,null,2]
[null,null,null,{"$f":"D14","v":"20/4/2017"},null,null,null,2017]
["bon de livraison du",null,{"$f":"BL!$E$4","v":"2017-03-24"}]
["Désignation",null,null,null,"Qté","P.U. HT \npar carton","Montant H T"]
[{"$f":"IF(BL!A18=\"\",\"\",BL!A18)","v":"Bresaola di Suino BIO x 0,70 gr x 10 pz "},null,null,null,{"$f":"IF(BL!E18=\"\",\"\",BL!E18)","v":1},{"$f":"IF(A19=\"\",\"\",VLOOKUP(A19,'Liste articles'!B:M,5,FALSE))","v":36},{"$f":"IF(E19=\"\",\"\",E19*F19)","v":36},{"$f":"IF(C19=\"\",\"\",VLOOKUP(C19,'Liste articles'!1:1048576,6,FALSE))","v":""},null,null,null,null,null,null,null,null,null,null,null,null,null,null,null,null,null,null,null,null,null,null,null,null,null,null,null,null,null,null,null,null,null,null,null,null,null,null,null,null,null,null,null,null,null,null,{"$f":"IF(AX19=\"\",\"\",VLOOKUP(AX19,'Liste articles'!1:1048576,6,FALSE))","v":""},{"$f":"IF(AY19=\"\",\"\",VLOOKUP(AY19,'Liste articles'!1:1048576,6,FALSE))","v":""},{"$f":"IF(AZ19=\"\",\"\",VLOOKUP(AZ19,'Liste articles'!1:1048576,6,FALSE))","v":""},{"$f":"IF(BA19=\"\",\"\",VLOOKUP(BA19,'Liste articles'!1:1048576,6,FALSE))","v":""},{"$f":"IF(BB19=\"\",\"\",VLOOKUP(BB19,'Liste articles'!1:1048576,6,FALSE))","v":""},{"$f":"IF(BC19=\"\",\"\",VLOOKUP(BC19,'Liste articles'!1:1048576,6,FALSE))","v":""},{"$f":"IF(BD19=\"\",\"\",VLOOKUP(BD19,'Liste articles'!1:1048576,6,FALSE))","v":""},{"$f":"IF(BE19=\"\",\"\",VLOOKUP(BE19,'Liste articles'!1:1048576,6,FALSE))","v":""},{"$f":"IF(BF19=\"\",\"\",VLOOKUP(BF19,'Liste articles'!1:1048576,6,FALSE))","v":""},{"$f":"IF(BG19=\"\",\"\",VLOOKUP(BG19,'Liste articles'!1:1048576,6,FALSE))","v":""},{"$f":"IF(BH19=\"\",\"\",VLOOKUP(BH19,'Liste articles'!1:1048576,6,FALSE))","v":""},{"$f":"IF(BI19=\"\",\"\",VLOOKUP(BI19,'Liste articles'!1:1048576,6,FALSE))","v":""},{"$f":"IF(BJ19=\"\",\"\",VLOOKUP(BJ19,'Liste articles'!1:1048576,6,FALSE))","v":""},{"$f":"IF(BK19=\"\",\"\",VLOOKUP(BK19,'Liste articles'!1:1048576,6,FALSE))","v":""},{"$f":"IF(BL19=\"\",\"\",VLOOKUP(BL19,'Liste articles'!1:1048576,6,FALSE))","v":""},{"$f":"IF(BM19=\"\",\"\",VLOOKUP(BM19,'Liste articles'!1:1048576,6,FALSE))","v":""},{"$f":"IF(BN19=\"\",\"\",VLOOKUP(BN19,'Liste articles'!1:1048576,6,FALSE))","v":""},{"$f":"IF(BO19=\"\",\"\",VLOOKUP(BO19,'Liste articles'!1:1048576,6,FALSE))","v":""},{"$f":"IF(BP19=\"\",\"\",VLOOKUP(BP19,'Liste articles'!1:1048576,6,FALSE))","v":""},{"$f":"IF(BQ19=\"\",\"\",VLOOKUP(BQ19,'Liste articles'!1:1048576,6,FALSE))","v":""},{"$f":"IF(BR19=\"\",\"\",VLOOKUP(BR19,'Liste articles'!1:1048576,6,FALSE))","v":""},{"$f":"IF(BS19=\"\",\"\",VLOOKUP(BS19,'Liste articles'!1:1048576,6,FALSE))","v":""},{"$f":"IF(BT19=\"\",\"\",VLOOKUP(BT19,'Liste articles'!1:1048576,6,FALSE))","v":""},{"$f":"IF(BU19=\"\",\"\",VLOOKUP(BU19,'Liste articles'!1:1048576,6,FALSE))","v":""},{"$f":"IF(BV19=\"\",\"\",VLOOKUP(BV19,'Liste articles'!1:1048576,6,FALSE))","v":""},{"$f":"IF(BW19=\"\",\"\",VLOOKUP(BW19,'Liste articles'!1:1048576,6,FALSE))","v":""},{"$f":"IF(BX19=\"\",\"\",VLOOKUP(BX19,'Liste articles'!1:1048576,6,FALSE))","v":""},{"$f":"IF(BY19=\"\",\"\",VLOOKUP(BY19,'Liste articles'!1:1048576,6,FALSE))","v":""},{"$f":"IF(BZ19=\"\",\"\",VLOOKUP(BZ19,'Liste articles'!1:1048576,6,FALSE))","v":""},{"$f":"IF(CA19=\"\",\"\",VLOOKUP(CA19,'Liste articles'!1:1048576,6,FALSE))","v":""},{"$f":"IF(CB19=\"\",\"\",VLOOKUP(CB19,'Liste articles'!1:1048576,6,FALSE))","v":""},{"$f":"IF(CC19=\"\",\"\",VLOOKUP(CC19,'Liste articles'!1:1048576,6,FALSE))","v":""},{"$f":"IF(CD19=\"\",\"\",VLOOKUP(CD19,'Liste articles'!1:1048576,6,FALSE))","v":""},{"$f":"IF(CE19=\"\",\"\",VLOOKUP(CE19,'Liste articles'!1:1048576,6,FALSE))","v":""},{"$f":"IF(CF19=\"\",\"\",VLOOKUP(CF19,'Liste articles'!1:1048576,6,FALSE))","v":""},{"$f":"IF(CG19=\"\",\"\",VLOOKUP(CG19,'Liste articles'!1:1048576,6,FALSE))","v":""},{"$f":"IF(CH19=\"\",\"\",VLOOKUP(CH19,'Liste articles'!1:1048576,6,FALSE))","v":""},{"$f":"IF(CI19=\"\",\"\",VLOOKUP(CI19,'Liste articles'!1:1048576,6,FALSE))","v":""},{"$f":"IF(CJ19=\"\",\"\",VLOOKUP(CJ19,'Liste articles'!1:1048576,6,FALSE))","v":""},{"$f":"IF(CK19=\"\",\"\",VLOOKUP(CK19,'Liste articles'!1:1048576,6,FALSE))","v":""},{"$f":"IF(CL19=\"\",\"\",VLOOKUP(CL19,'Liste articles'!1:1048576,6,FALSE))","v":""},{"$f":"IF(CM19=\"\",\"\",VLOOKUP(CM19,'Liste articles'!1:1048576,6,FALSE))","v":""},{"$f":"IF(CN19=\"\",\"\",VLOOKUP(CN19,'Liste articles'!1:1048576,6,FALSE))","v":""},{"$f":"IF(CO19=\"\",\"\",VLOOKUP(CO19,'Liste articles'!1:1048576,6,FALSE))","v":""},{"$f":"IF(CP19=\"\",\"\",VLOOKUP(CP19,'Liste articles'!1:1048576,6,FALSE))","v":""},{"$f":"IF(CQ19=\"\",\"\",VLOOKUP(CQ19,'Liste articles'!1:1048576,6,FALSE))","v":""},{"$f":"IF(CR19=\"\",\"\",VLOOKUP(CR19,'Liste articles'!1:1048576,6,FALSE))","v":""},{"$f":"IF(CS19=\"\",\"\",VLOOKUP(CS19,'Liste articles'!1:1048576,6,FALSE))","v":""},{"$f":"IF(CT19=\"\",\"\",VLOOKUP(CT19,'Liste articles'!1:1048576,6,FALSE))","v":""},{"$f":"IF(CU19=\"\",\"\",VLOOKUP(CU19,'Liste articles'!1:1048576,6,FALSE))","v":""},{"$f":"IF(CV19=\"\",\"\",VLOOKUP(CV19,'Liste articles'!1:1048576,6,FALSE))","v":""},{"$f":"IF(CW19=\"\",\"\",VLOOKUP(CW19,'Liste articles'!1:1048576,6,FALSE))","v":""},{"$f":"IF(CX19=\"\",\"\",VLOOKUP(CX19,'Liste articles'!1:1048576,6,FALSE))","v":""},{"$f":"IF(CY19=\"\",\"\",VLOOKUP(CY19,'Liste articles'!1:1048576,6,FALSE))","v":""},{"$f":"IF(CZ19=\"\",\"\",VLOOKUP(CZ19,'Liste articles'!1:1048576,6,FALSE))","v":""},{"$f":"IF(DA19=\"\",\"\",VLOOKUP(DA19,'Liste articles'!1:1048576,6,FALSE))","v":""},{"$f":"IF(DB19=\"\",\"\",VLOOKUP(DB19,'Liste articles'!1:1048576,6,FALSE))","v":""},{"$f":"IF(DC19=\"\",\"\",VLOOKUP(DC19,'Liste articles'!1:1048576,6,FALSE))","v":""},{"$f":"IF(DD19=\"\",\"\",VLOOKUP(DD19,'Liste articles'!1:1048576,6,FALSE))","v":""},{"$f":"IF(DE19=\"\",\"\",VLOOKUP(DE19,'Liste articles'!1:1048576,6,FALSE))","v":""},{"$f":"IF(DF19=\"\",\"\",VLOOKUP(DF19,'Liste articles'!1:1048576,6,FALSE))","v":""},{"$f":"IF(DG19=\"\",\"\",VLOOKUP(DG19,'Liste articles'!1:1048576,6,FALSE))","v":""},{"$f":"IF(DH19=\"\",\"\",VLOOKUP(DH19,'Liste articles'!1:1048576,6,FALSE))","v":""},{"$f":"IF(DI19=\"\",\"\",VLOOKUP(DI19,'Liste articles'!1:1048576,6,FALSE))","v":""},{"$f":"IF(DJ19=\"\",\"\",VLOOKUP(DJ19,'Liste articles'!1:1048576,6,FALSE))","v":""},{"$f":"IF(DK19=\"\",\"\",VLOOKUP(DK19,'Liste articles'!1:1048576,6,FALSE))","v":""},{"$f":"IF(DL19=\"\",\"\",VLOOKUP(DL19,'Liste articles'!1:1048576,6,FALSE))","v":""},{"$f":"IF(DM19=\"\",\"\",VLOOKUP(DM19,'Liste articles'!1:1048576,6,FALSE))","v":""},{"$f":"IF(DN19=\"\",\"\",VLOOKUP(DN19,'Liste articles'!1:1048576,6,FALSE))","v":""},{"$f":"IF(DO19=\"\",\"\",VLOOKUP(DO19,'Liste articles'!1:1048576,6,FALSE))","v":""},{"$f":"IF(DP19=\"\",\"\",VLOOKUP(DP19,'Liste articles'!1:1048576,6,FALSE))","v":""},{"$f":"IF(DQ19=\"\",\"\",VLOOKUP(DQ19,'Liste articles'!1:1048576,6,FALSE))","v":""},{"$f":"IF(DR19=\"\",\"\",VLOOKUP(DR19,'Liste articles'!1:1048576,6,FALSE))","v":""},{"$f":"IF(DS19=\"\",\"\",VLOOKUP(DS19,'Liste articles'!1:1048576,6,FALSE))","v":""},{"$f":"IF(DT19=\"\",\"\",VLOOKUP(DT19,'Liste articles'!1:1048576,6,FALSE))","v":""},{"$f":"IF(DU19=\"\",\"\",VLOOKUP(DU19,'Liste articles'!1:1048576,6,FALSE))","v":""},{"$f":"IF(DV19=\"\",\"\",VLOOKUP(DV19,'Liste articles'!1:1048576,6,FALSE))","v":""},{"$f":"IF(DW19=\"\",\"\",VLOOKUP(DW19,'Liste articles'!1:1048576,6,FALSE))","v":""},{"$f":"IF(DX19=\"\",\"\",VLOOKUP(DX19,'Liste articles'!1:1048576,6,FALSE))","v":""},{"$f":"IF(DY19=\"\",\"\",VLOOKUP(DY19,'Liste articles'!1:1048576,6,FALSE))","v":""},{"$f":"IF(DZ19=\"\",\"\",VLOOKUP(DZ19,'Liste articles'!1:1048576,6,FALSE))","v":""},{"$f":"IF(EA19=\"\",\"\",VLOOKUP(EA19,'Liste articles'!1:1048576,6,FALSE))","v":""}]
[{"$f":"IF(BL!A19=\"\",\"\",BL!A19)","v":"Bresaola di Suino BIO x 0,70 gr x 10 pz "},null,null,null,{"$f":"IF(BL!E19=\"\",\"\",BL!E19)","v":2},{"$f":"IF(A20=\"\",\"\",VLOOKUP(A20,'Liste articles'!B:M,5,FALSE))","v":36},{"$f":"IF(E20=\"\",\"\",E20*F20)","v":72},{"$f":"IF(C20=\"\",\"\",VLOOKUP(C20,'Liste articles'!#REF!,6,FALSE))","v":""},null,null,null,null,null,null,null,null,null,null,null,null,null,null,null,null,null,null,null,null,null,null,null,null,null,null,null,null,null,null,null,null,null,null,null,null,null,null,null,null,null,null,null,null,null,null,{"$f":"IF(AX20=\"\",\"\",VLOOKUP(AX20,'Liste articles'!#REF!,6,FALSE))","v":""},{"$f":"IF(AY20=\"\",\"\",VLOOKUP(AY20,'Liste articles'!#REF!,6,FALSE))","v":""},{"$f":"IF(AZ20=\"\",\"\",VLOOKUP(AZ20,'Liste articles'!#REF!,6,FALSE))","v":""},{"$f":"IF(BA20=\"\",\"\",VLOOKUP(BA20,'Liste articles'!#REF!,6,FALSE))","v":""},{"$f":"IF(BB20=\"\",\"\",VLOOKUP(BB20,'Liste articles'!#REF!,6,FALSE))","v":""},{"$f":"IF(BC20=\"\",\"\",VLOOKUP(BC20,'Liste articles'!#REF!,6,FALSE))","v":""},{"$f":"IF(BD20=\"\",\"\",VLOOKUP(BD20,'Liste articles'!#REF!,6,FALSE))","v":""},{"$f":"IF(BE20=\"\",\"\",VLOOKUP(BE20,'Liste articles'!#REF!,6,FALSE))","v":""},{"$f":"IF(BF20=\"\",\"\",VLOOKUP(BF20,'Liste articles'!#REF!,6,FALSE))","v":""},{"$f":"IF(BG20=\"\",\"\",VLOOKUP(BG20,'Liste articles'!#REF!,6,FALSE))","v":""},{"$f":"IF(BH20=\"\",\"\",VLOOKUP(BH20,'Liste articles'!#REF!,6,FALSE))","v":""},{"$f":"IF(BI20=\"\",\"\",VLOOKUP(BI20,'Liste articles'!#REF!,6,FALSE))","v":""},{"$f":"IF(BJ20=\"\",\"\",VLOOKUP(BJ20,'Liste articles'!#REF!,6,FALSE))","v":""},{"$f":"IF(BK20=\"\",\"\",VLOOKUP(BK20,'Liste articles'!#REF!,6,FALSE))","v":""},{"$f":"IF(BL20=\"\",\"\",VLOOKUP(BL20,'Liste articles'!#REF!,6,FALSE))","v":""},{"$f":"IF(BM20=\"\",\"\",VLOOKUP(BM20,'Liste articles'!#REF!,6,FALSE))","v":""},{"$f":"IF(BN20=\"\",\"\",VLOOKUP(BN20,'Liste articles'!#REF!,6,FALSE))","v":""},{"$f":"IF(BO20=\"\",\"\",VLOOKUP(BO20,'Liste articles'!#REF!,6,FALSE))","v":""},{"$f":"IF(BP20=\"\",\"\",VLOOKUP(BP20,'Liste articles'!#REF!,6,FALSE))","v":""},{"$f":"IF(BQ20=\"\",\"\",VLOOKUP(BQ20,'Liste articles'!#REF!,6,FALSE))","v":""},{"$f":"IF(BR20=\"\",\"\",VLOOKUP(BR20,'Liste articles'!#REF!,6,FALSE))","v":""},{"$f":"IF(BS20=\"\",\"\",VLOOKUP(BS20,'Liste articles'!#REF!,6,FALSE))","v":""},{"$f":"IF(BT20=\"\",\"\",VLOOKUP(BT20,'Liste articles'!#REF!,6,FALSE))","v":""},{"$f":"IF(BU20=\"\",\"\",VLOOKUP(BU20,'Liste articles'!#REF!,6,FALSE))","v":""},{"$f":"IF(BV20=\"\",\"\",VLOOKUP(BV20,'Liste articles'!#REF!,6,FALSE))","v":""},{"$f":"IF(BW20=\"\",\"\",VLOOKUP(BW20,'Liste articles'!#REF!,6,FALSE))","v":""},{"$f":"IF(BX20=\"\",\"\",VLOOKUP(BX20,'Liste articles'!#REF!,6,FALSE))","v":""},{"$f":"IF(BY20=\"\",\"\",VLOOKUP(BY20,'Liste articles'!#REF!,6,FALSE))","v":""},{"$f":"IF(BZ20=\"\",\"\",VLOOKUP(BZ20,'Liste articles'!#REF!,6,FALSE))","v":""},{"$f":"IF(CA20=\"\",\"\",VLOOKUP(CA20,'Liste articles'!#REF!,6,FALSE))","v":""},{"$f":"IF(CB20=\"\",\"\",VLOOKUP(CB20,'Liste articles'!#REF!,6,FALSE))","v":""},{"$f":"IF(CC20=\"\",\"\",VLOOKUP(CC20,'Liste articles'!#REF!,6,FALSE))","v":""},{"$f":"IF(CD20=\"\",\"\",VLOOKUP(CD20,'Liste articles'!#REF!,6,FALSE))","v":""},{"$f":"IF(CE20=\"\",\"\",VLOOKUP(CE20,'Liste articles'!#REF!,6,FALSE))","v":""},{"$f":"IF(CF20=\"\",\"\",VLOOKUP(CF20,'Liste articles'!#REF!,6,FALSE))","v":""},{"$f":"IF(CG20=\"\",\"\",VLOOKUP(CG20,'Liste articles'!#REF!,6,FALSE))","v":""},{"$f":"IF(CH20=\"\",\"\",VLOOKUP(CH20,'Liste articles'!#REF!,6,FALSE))","v":""},{"$f":"IF(CI20=\"\",\"\",VLOOKUP(CI20,'Liste articles'!#REF!,6,FALSE))","v":""},{"$f":"IF(CJ20=\"\",\"\",VLOOKUP(CJ20,'Liste articles'!#REF!,6,FALSE))","v":""},{"$f":"IF(CK20=\"\",\"\",VLOOKUP(CK20,'Liste articles'!#REF!,6,FALSE))","v":""},{"$f":"IF(CL20=\"\",\"\",VLOOKUP(CL20,'Liste articles'!#REF!,6,FALSE))","v":""},{"$f":"IF(CM20=\"\",\"\",VLOOKUP(CM20,'Liste articles'!#REF!,6,FALSE))","v":""},{"$f":"IF(CN20=\"\",\"\",VLOOKUP(CN20,'Liste articles'!#REF!,6,FALSE))","v":""},{"$f":"IF(CO20=\"\",\"\",VLOOKUP(CO20,'Liste articles'!#REF!,6,FALSE))","v":""},{"$f":"IF(CP20=\"\",\"\",VLOOKUP(CP20,'Liste articles'!#REF!,6,FALSE))","v":""},{"$f":"IF(CQ20=\"\",\"\",VLOOKUP(CQ20,'Liste articles'!#REF!,6,FALSE))","v":""},{"$f":"IF(CR20=\"\",\"\",VLOOKUP(CR20,'Liste articles'!#REF!,6,FALSE))","v":""},{"$f":"IF(CS20=\"\",\"\",VLOOKUP(CS20,'Liste articles'!#REF!,6,FALSE))","v":""},{"$f":"IF(CT20=\"\",\"\",VLOOKUP(CT20,'Liste articles'!#REF!,6,FALSE))","v":""},{"$f":"IF(CU20=\"\",\"\",VLOOKUP(CU20,'Liste articles'!#REF!,6,FALSE))","v":""},{"$f":"IF(CV20=\"\",\"\",VLOOKUP(CV20,'Liste articles'!#REF!,6,FALSE))","v":""},{"$f":"IF(CW20=\"\",\"\",VLOOKUP(CW20,'Liste articles'!#REF!,6,FALSE))","v":""},{"$f":"IF(CX20=\"\",\"\",VLOOKUP(CX20,'Liste articles'!#REF!,6,FALSE))","v":""},{"$f":"IF(CY20=\"\",\"\",VLOOKUP(CY20,'Liste articles'!#REF!,6,FALSE))","v":""},{"$f":"IF(CZ20=\"\",\"\",VLOOKUP(CZ20,'Liste articles'!#REF!,6,FALSE))","v":""},{"$f":"IF(DA20=\"\",\"\",VLOOKUP(DA20,'Liste articles'!#REF!,6,FALSE))","v":""},{"$f":"IF(DB20=\"\",\"\",VLOOKUP(DB20,'Liste articles'!#REF!,6,FALSE))","v":""},{"$f":"IF(DC20=\"\",\"\",VLOOKUP(DC20,'Liste articles'!#REF!,6,FALSE))","v":""},{"$f":"IF(DD20=\"\",\"\",VLOOKUP(DD20,'Liste articles'!#REF!,6,FALSE))","v":""},{"$f":"IF(DE20=\"\",\"\",VLOOKUP(DE20,'Liste articles'!#REF!,6,FALSE))","v":""},{"$f":"IF(DF20=\"\",\"\",VLOOKUP(DF20,'Liste articles'!#REF!,6,FALSE))","v":""},{"$f":"IF(DG20=\"\",\"\",VLOOKUP(DG20,'Liste articles'!#REF!,6,FALSE))","v":""},{"$f":"IF(DH20=\"\",\"\",VLOOKUP(DH20,'Liste articles'!#REF!,6,FALSE))","v":""},{"$f":"IF(DI20=\"\",\"\",VLOOKUP(DI20,'Liste articles'!#REF!,6,FALSE))","v":""},{"$f":"IF(DJ20=\"\",\"\",VLOOKUP(DJ20,'Liste articles'!#REF!,6,FALSE))","v":""},{"$f":"IF(DK20=\"\",\"\",VLOOKUP(DK20,'Liste articles'!#REF!,6,FALSE))","v":""},{"$f":"IF(DL20=\"\",\"\",VLOOKUP(DL20,'Liste articles'!#REF!,6,FALSE))","v":""},{"$f":"IF(DM20=\"\",\"\",VLOOKUP(DM20,'Liste articles'!#REF!,6,FALSE))","v":""},{"$f":"IF(DN20=\"\",\"\",VLOOKUP(DN20,'Liste articles'!#REF!,6,FALSE))","v":""},{"$f":"IF(DO20=\"\",\"\",VLOOKUP(DO20,'Liste articles'!#REF!,6,FALSE))","v":""},{"$f":"IF(DP20=\"\",\"\",VLOOKUP(DP20,'Liste articles'!#REF!,6,FALSE))","v":""},{"$f":"IF(DQ20=\"\",\"\",VLOOKUP(DQ20,'Liste articles'!#REF!,6,FALSE))","v":""},{"$f":"IF(DR20=\"\",\"\",VLOOKUP(DR20,'Liste articles'!#REF!,6,FALSE))","v":""},{"$f":"IF(DS20=\"\",\"\",VLOOKUP(DS20,'Liste articles'!#REF!,6,FALSE))","v":""},{"$f":"IF(DT20=\"\",\"\",VLOOKUP(DT20,'Liste articles'!#REF!,6,FALSE))","v":""},{"$f":"IF(DU20=\"\",\"\",VLOOKUP(DU20,'Liste articles'!#REF!,6,FALSE))","v":""},{"$f":"IF(DV20=\"\",\"\",VLOOKUP(DV20,'Liste articles'!#REF!,6,FALSE))","v":""},{"$f":"IF(DW20=\"\",\"\",VLOOKUP(DW20,'Liste articles'!#REF!,6,FALSE))","v":""},{"$f":"IF(DX20=\"\",\"\",VLOOKUP(DX20,'Liste articles'!#REF!,6,FALSE))","v":""},{"$f":"IF(DY20=\"\",\"\",VLOOKUP(DY20,'Liste articles'!#REF!,6,FALSE))","v":""},{"$f":"IF(DZ20=\"\",\"\",VLOOKUP(DZ20,'Liste articles'!#REF!,6,FALSE))","v":""},{"$f":"IF(EA20=\"\",\"\",VLOOKUP(EA20,'Liste articles'!#REF!,6,FALSE))","v":""}]
[{"$f":"IF(BL!A20=\"\",\"\",BL!A20)","v":"Bresaola di Suino BIO x 0,70 gr x 10 pz "},null,null,null,{"$f":"IF(BL!E20=\"\",\"\",BL!E20)","v":3},{"$f":"IF(A21=\"\",\"\",VLOOKUP(A21,'Liste articles'!B:M,5,FALSE))","v":36},108,{"$f":"IF(C21=\"\",\"\",VLOOKUP(C21,'Liste articles'!#REF!,6,FALSE))","v":""},null,null,null,null,null,null,null,null,null,null,null,null,null,null,null,null,null,null,null,null,null,null,null,null,null,null,null,null,null,null,null,null,null,null,null,null,null,null,null,null,null,null,null,null,null,null,{"$f":"IF(AX21=\"\",\"\",VLOOKUP(AX21,'Liste articles'!#REF!,6,FALSE))","v":""},{"$f":"IF(AY21=\"\",\"\",VLOOKUP(AY21,'Liste articles'!#REF!,6,FALSE))","v":""},{"$f":"IF(AZ21=\"\",\"\",VLOOKUP(AZ21,'Liste articles'!#REF!,6,FALSE))","v":""},{"$f":"IF(BA21=\"\",\"\",VLOOKUP(BA21,'Liste articles'!#REF!,6,FALSE))","v":""},{"$f":"IF(BB21=\"\",\"\",VLOOKUP(BB21,'Liste articles'!#REF!,6,FALSE))","v":""},{"$f":"IF(BC21=\"\",\"\",VLOOKUP(BC21,'Liste articles'!#REF!,6,FALSE))","v":""},{"$f":"IF(BD21=\"\",\"\",VLOOKUP(BD21,'Liste articles'!#REF!,6,FALSE))","v":""},{"$f":"IF(BE21=\"\",\"\",VLOOKUP(BE21,'Liste articles'!#REF!,6,FALSE))","v":""},{"$f":"IF(BF21=\"\",\"\",VLOOKUP(BF21,'Liste articles'!#REF!,6,FALSE))","v":""},{"$f":"IF(BG21=\"\",\"\",VLOOKUP(BG21,'Liste articles'!#REF!,6,FALSE))","v":""},{"$f":"IF(BH21=\"\",\"\",VLOOKUP(BH21,'Liste articles'!#REF!,6,FALSE))","v":""},{"$f":"IF(BI21=\"\",\"\",VLOOKUP(BI21,'Liste articles'!#REF!,6,FALSE))","v":""},{"$f":"IF(BJ21=\"\",\"\",VLOOKUP(BJ21,'Liste articles'!#REF!,6,FALSE))","v":""},{"$f":"IF(BK21=\"\",\"\",VLOOKUP(BK21,'Liste articles'!#REF!,6,FALSE))","v":""},{"$f":"IF(BL21=\"\",\"\",VLOOKUP(BL21,'Liste articles'!#REF!,6,FALSE))","v":""},{"$f":"IF(BM21=\"\",\"\",VLOOKUP(BM21,'Liste articles'!#REF!,6,FALSE))","v":""},{"$f":"IF(BN21=\"\",\"\",VLOOKUP(BN21,'Liste articles'!#REF!,6,FALSE))","v":""},{"$f":"IF(BO21=\"\",\"\",VLOOKUP(BO21,'Liste articles'!#REF!,6,FALSE))","v":""},{"$f":"IF(BP21=\"\",\"\",VLOOKUP(BP21,'Liste articles'!#REF!,6,FALSE))","v":""},{"$f":"IF(BQ21=\"\",\"\",VLOOKUP(BQ21,'Liste articles'!#REF!,6,FALSE))","v":""},{"$f":"IF(BR21=\"\",\"\",VLOOKUP(BR21,'Liste articles'!#REF!,6,FALSE))","v":""},{"$f":"IF(BS21=\"\",\"\",VLOOKUP(BS21,'Liste articles'!#REF!,6,FALSE))","v":""},{"$f":"IF(BT21=\"\",\"\",VLOOKUP(BT21,'Liste articles'!#REF!,6,FALSE))","v":""},{"$f":"IF(BU21=\"\",\"\",VLOOKUP(BU21,'Liste articles'!#REF!,6,FALSE))","v":""},{"$f":"IF(BV21=\"\",\"\",VLOOKUP(BV21,'Liste articles'!#REF!,6,FALSE))","v":""},{"$f":"IF(BW21=\"\",\"\",VLOOKUP(BW21,'Liste articles'!#REF!,6,FALSE))","v":""},{"$f":"IF(BX21=\"\",\"\",VLOOKUP(BX21,'Liste articles'!#REF!,6,FALSE))","v":""},{"$f":"IF(BY21=\"\",\"\",VLOOKUP(BY21,'Liste articles'!#REF!,6,FALSE))","v":""},{"$f":"IF(BZ21=\"\",\"\",VLOOKUP(BZ21,'Liste articles'!#REF!,6,FALSE))","v":""},{"$f":"IF(CA21=\"\",\"\",VLOOKUP(CA21,'Liste articles'!#REF!,6,FALSE))","v":""},{"$f":"IF(CB21=\"\",\"\",VLOOKUP(CB21,'Liste articles'!#REF!,6,FALSE))","v":""},{"$f":"IF(CC21=\"\",\"\",VLOOKUP(CC21,'Liste articles'!#REF!,6,FALSE))","v":""},{"$f":"IF(CD21=\"\",\"\",VLOOKUP(CD21,'Liste articles'!#REF!,6,FALSE))","v":""},{"$f":"IF(CE21=\"\",\"\",VLOOKUP(CE21,'Liste articles'!#REF!,6,FALSE))","v":""},{"$f":"IF(CF21=\"\",\"\",VLOOKUP(CF21,'Liste articles'!#REF!,6,FALSE))","v":""},{"$f":"IF(CG21=\"\",\"\",VLOOKUP(CG21,'Liste articles'!#REF!,6,FALSE))","v":""},{"$f":"IF(CH21=\"\",\"\",VLOOKUP(CH21,'Liste articles'!#REF!,6,FALSE))","v":""},{"$f":"IF(CI21=\"\",\"\",VLOOKUP(CI21,'Liste articles'!#REF!,6,FALSE))","v":""},{"$f":"IF(CJ21=\"\",\"\",VLOOKUP(CJ21,'Liste articles'!#REF!,6,FALSE))","v":""},{"$f":"IF(CK21=\"\",\"\",VLOOKUP(CK21,'Liste articles'!#REF!,6,FALSE))","v":""},{"$f":"IF(CL21=\"\",\"\",VLOOKUP(CL21,'Liste articles'!#REF!,6,FALSE))","v":""},{"$f":"IF(CM21=\"\",\"\",VLOOKUP(CM21,'Liste articles'!#REF!,6,FALSE))","v":""},{"$f":"IF(CN21=\"\",\"\",VLOOKUP(CN21,'Liste articles'!#REF!,6,FALSE))","v":""},{"$f":"IF(CO21=\"\",\"\",VLOOKUP(CO21,'Liste articles'!#REF!,6,FALSE))","v":""},{"$f":"IF(CP21=\"\",\"\",VLOOKUP(CP21,'Liste articles'!#REF!,6,FALSE))","v":""},{"$f":"IF(CQ21=\"\",\"\",VLOOKUP(CQ21,'Liste articles'!#REF!,6,FALSE))","v":""},{"$f":"IF(CR21=\"\",\"\",VLOOKUP(CR21,'Liste articles'!#REF!,6,FALSE))","v":""},{"$f":"IF(CS21=\"\",\"\",VLOOKUP(CS21,'Liste articles'!#REF!,6,FALSE))","v":""},{"$f":"IF(CT21=\"\",\"\",VLOOKUP(CT21,'Liste articles'!#REF!,6,FALSE))","v":""},{"$f":"IF(CU21=\"\",\"\",VLOOKUP(CU21,'Liste articles'!#REF!,6,FALSE))","v":""},{"$f":"IF(CV21=\"\",\"\",VLOOKUP(CV21,'Liste articles'!#REF!,6,FALSE))","v":""},{"$f":"IF(CW21=\"\",\"\",VLOOKUP(CW21,'Liste articles'!#REF!,6,FALSE))","v":""},{"$f":"IF(CX21=\"\",\"\",VLOOKUP(CX21,'Liste articles'!#REF!,6,FALSE))","v":""},{"$f":"IF(CY21=\"\",\"\",VLOOKUP(CY21,'Liste articles'!#REF!,6,FALSE))","v":""},{"$f":"IF(CZ21=\"\",\"\",VLOOKUP(CZ21,'Liste articles'!#REF!,6,FALSE))","v":""},{"$f":"IF(DA21=\"\",\"\",VLOOKUP(DA21,'Liste articles'!#REF!,6,FALSE))","v":""},{"$f":"IF(DB21=\"\",\"\",VLOOKUP(DB21,'Liste articles'!#REF!,6,FALSE))","v":""},{"$f":"IF(DC21=\"\",\"\",VLOOKUP(DC21,'Liste articles'!#REF!,6,FALSE))","v":""},{"$f":"IF(DD21=\"\",\"\",VLOOKUP(DD21,'Liste articles'!#REF!,6,FALSE))","v":""},{"$f":"IF(DE21=\"\",\"\",VLOOKUP(DE21,'Liste articles'!#REF!,6,FALSE))","v":""},{"$f":"IF(DF21=\"\",\"\",VLOOKUP(DF21,'Liste articles'!#REF!,6,FALSE))","v":""},{"$f":"IF(DG21=\"\",\"\",VLOOKUP(DG21,'Liste articles'!#REF!,6,FALSE))","v":""},{"$f":"IF(DH21=\"\",\"\",VLOOKUP(DH21,'Liste articles'!#REF!,6,FALSE))","v":""},{"$f":"IF(DI21=\"\",\"\",VLOOKUP(DI21,'Liste articles'!#REF!,6,FALSE))","v":""},{"$f":"IF(DJ21=\"\",\"\",VLOOKUP(DJ21,'Liste articles'!#REF!,6,FALSE))","v":""},{"$f":"IF(DK21=\"\",\"\",VLOOKUP(DK21,'Liste articles'!#REF!,6,FALSE))","v":""},{"$f":"IF(DL21=\"\",\"\",VLOOKUP(DL21,'Liste articles'!#REF!,6,FALSE))","v":""},{"$f":"IF(DM21=\"\",\"\",VLOOKUP(DM21,'Liste articles'!#REF!,6,FALSE))","v":""},{"$f":"IF(DN21=\"\",\"\",VLOOKUP(DN21,'Liste articles'!#REF!,6,FALSE))","v":""},{"$f":"IF(DO21=\"\",\"\",VLOOKUP(DO21,'Liste articles'!#REF!,6,FALSE))","v":""},{"$f":"IF(DP21=\"\",\"\",VLOOKUP(DP21,'Liste articles'!#REF!,6,FALSE))","v":""},{"$f":"IF(DQ21=\"\",\"\",VLOOKUP(DQ21,'Liste articles'!#REF!,6,FALSE))","v":""},{"$f":"IF(DR21=\"\",\"\",VLOOKUP(DR21,'Liste articles'!#REF!,6,FALSE))","v":""},{"$f":"IF(DS21=\"\",\"\",VLOOKUP(DS21,'Liste articles'!#REF!,6,FALSE))","v":""},{"$f":"IF(DT21=\"\",\"\",VLOOKUP(DT21,'Liste articles'!#REF!,6,FALSE))","v":""},{"$f":"IF(DU21=\"\",\"\",VLOOKUP(DU21,'Liste articles'!#REF!,6,FALSE))","v":""},{"$f":"IF(DV21=\"\",\"\",VLOOKUP(DV21,'Liste articles'!#REF!,6,FALSE))","v":""},{"$f":"IF(DW21=\"\",\"\",VLOOKUP(DW21,'Liste articles'!#REF!,6,FALSE))","v":""},{"$f":"IF(DX21=\"\",\"\",VLOOKUP(DX21,'Liste articles'!#REF!,6,FALSE))","v":""},{"$f":"IF(DY21=\"\",\"\",VLOOKUP(DY21,'Liste articles'!#REF!,6,FALSE))","v":""},{"$f":"IF(DZ21=\"\",\"\",VLOOKUP(DZ21,'Liste articles'!#REF!,6,FALSE))","v":""},{"$f":"IF(EA21=\"\",\"\",VLOOKUP(EA21,'Liste articles'!#REF!,6,FALSE))","v":""}]
[{"$f":"IF(BL!A21=\"\",\"\",BL!A21)","v":""},null,null,null,{"$f":"IF(BL!E21=\"\",\"\",BL!E21)","v":""},{"$f":"IF(A22=\"\",\"\",VLOOKUP(A22,'Liste articles'!B:M,5,FALSE))","v":""},"",{"$f":"IF(C22=\"\",\"\",VLOOKUP(C22,'Liste articles'!#REF!,6,FALSE))","v":""},null,null,null,null,null,null,null,null,null,null,null,null,null,null,null,null,null,null,null,null,null,null,null,null,null,null,null,null,null,null,null,null,null,null,null,null,null,null,null,null,null,null,null,null,null,null,{"$f":"IF(AX22=\"\",\"\",VLOOKUP(AX22,'Liste articles'!#REF!,6,FALSE))","v":""},{"$f":"IF(AY22=\"\",\"\",VLOOKUP(AY22,'Liste articles'!#REF!,6,FALSE))","v":""},{"$f":"IF(AZ22=\"\",\"\",VLOOKUP(AZ22,'Liste articles'!#REF!,6,FALSE))","v":""},{"$f":"IF(BA22=\"\",\"\",VLOOKUP(BA22,'Liste articles'!#REF!,6,FALSE))","v":""},{"$f":"IF(BB22=\"\",\"\",VLOOKUP(BB22,'Liste articles'!#REF!,6,FALSE))","v":""},{"$f":"IF(BC22=\"\",\"\",VLOOKUP(BC22,'Liste articles'!#REF!,6,FALSE))","v":""},{"$f":"IF(BD22=\"\",\"\",VLOOKUP(BD22,'Liste articles'!#REF!,6,FALSE))","v":""},{"$f":"IF(BE22=\"\",\"\",VLOOKUP(BE22,'Liste articles'!#REF!,6,FALSE))","v":""},{"$f":"IF(BF22=\"\",\"\",VLOOKUP(BF22,'Liste articles'!#REF!,6,FALSE))","v":""},{"$f":"IF(BG22=\"\",\"\",VLOOKUP(BG22,'Liste articles'!#REF!,6,FALSE))","v":""},{"$f":"IF(BH22=\"\",\"\",VLOOKUP(BH22,'Liste articles'!#REF!,6,FALSE))","v":""},{"$f":"IF(BI22=\"\",\"\",VLOOKUP(BI22,'Liste articles'!#REF!,6,FALSE))","v":""},{"$f":"IF(BJ22=\"\",\"\",VLOOKUP(BJ22,'Liste articles'!#REF!,6,FALSE))","v":""},{"$f":"IF(BK22=\"\",\"\",VLOOKUP(BK22,'Liste articles'!#REF!,6,FALSE))","v":""},{"$f":"IF(BL22=\"\",\"\",VLOOKUP(BL22,'Liste articles'!#REF!,6,FALSE))","v":""},{"$f":"IF(BM22=\"\",\"\",VLOOKUP(BM22,'Liste articles'!#REF!,6,FALSE))","v":""},{"$f":"IF(BN22=\"\",\"\",VLOOKUP(BN22,'Liste articles'!#REF!,6,FALSE))","v":""},{"$f":"IF(BO22=\"\",\"\",VLOOKUP(BO22,'Liste articles'!#REF!,6,FALSE))","v":""},{"$f":"IF(BP22=\"\",\"\",VLOOKUP(BP22,'Liste articles'!#REF!,6,FALSE))","v":""},{"$f":"IF(BQ22=\"\",\"\",VLOOKUP(BQ22,'Liste articles'!#REF!,6,FALSE))","v":""},{"$f":"IF(BR22=\"\",\"\",VLOOKUP(BR22,'Liste articles'!#REF!,6,FALSE))","v":""},{"$f":"IF(BS22=\"\",\"\",VLOOKUP(BS22,'Liste articles'!#REF!,6,FALSE))","v":""},{"$f":"IF(BT22=\"\",\"\",VLOOKUP(BT22,'Liste articles'!#REF!,6,FALSE))","v":""},{"$f":"IF(BU22=\"\",\"\",VLOOKUP(BU22,'Liste articles'!#REF!,6,FALSE))","v":""},{"$f":"IF(BV22=\"\",\"\",VLOOKUP(BV22,'Liste articles'!#REF!,6,FALSE))","v":""},{"$f":"IF(BW22=\"\",\"\",VLOOKUP(BW22,'Liste articles'!#REF!,6,FALSE))","v":""},{"$f":"IF(BX22=\"\",\"\",VLOOKUP(BX22,'Liste articles'!#REF!,6,FALSE))","v":""},{"$f":"IF(BY22=\"\",\"\",VLOOKUP(BY22,'Liste articles'!#REF!,6,FALSE))","v":""},{"$f":"IF(BZ22=\"\",\"\",VLOOKUP(BZ22,'Liste articles'!#REF!,6,FALSE))","v":""},{"$f":"IF(CA22=\"\",\"\",VLOOKUP(CA22,'Liste articles'!#REF!,6,FALSE))","v":""},{"$f":"IF(CB22=\"\",\"\",VLOOKUP(CB22,'Liste articles'!#REF!,6,FALSE))","v":""},{"$f":"IF(CC22=\"\",\"\",VLOOKUP(CC22,'Liste articles'!#REF!,6,FALSE))","v":""},{"$f":"IF(CD22=\"\",\"\",VLOOKUP(CD22,'Liste articles'!#REF!,6,FALSE))","v":""},{"$f":"IF(CE22=\"\",\"\",VLOOKUP(CE22,'Liste articles'!#REF!,6,FALSE))","v":""},{"$f":"IF(CF22=\"\",\"\",VLOOKUP(CF22,'Liste articles'!#REF!,6,FALSE))","v":""},{"$f":"IF(CG22=\"\",\"\",VLOOKUP(CG22,'Liste articles'!#REF!,6,FALSE))","v":""},{"$f":"IF(CH22=\"\",\"\",VLOOKUP(CH22,'Liste articles'!#REF!,6,FALSE))","v":""},{"$f":"IF(CI22=\"\",\"\",VLOOKUP(CI22,'Liste articles'!#REF!,6,FALSE))","v":""},{"$f":"IF(CJ22=\"\",\"\",VLOOKUP(CJ22,'Liste articles'!#REF!,6,FALSE))","v":""},{"$f":"IF(CK22=\"\",\"\",VLOOKUP(CK22,'Liste articles'!#REF!,6,FALSE))","v":""},{"$f":"IF(CL22=\"\",\"\",VLOOKUP(CL22,'Liste articles'!#REF!,6,FALSE))","v":""},{"$f":"IF(CM22=\"\",\"\",VLOOKUP(CM22,'Liste articles'!#REF!,6,FALSE))","v":""},{"$f":"IF(CN22=\"\",\"\",VLOOKUP(CN22,'Liste articles'!#REF!,6,FALSE))","v":""},{"$f":"IF(CO22=\"\",\"\",VLOOKUP(CO22,'Liste articles'!#REF!,6,FALSE))","v":""},{"$f":"IF(CP22=\"\",\"\",VLOOKUP(CP22,'Liste articles'!#REF!,6,FALSE))","v":""},{"$f":"IF(CQ22=\"\",\"\",VLOOKUP(CQ22,'Liste articles'!#REF!,6,FALSE))","v":""},{"$f":"IF(CR22=\"\",\"\",VLOOKUP(CR22,'Liste articles'!#REF!,6,FALSE))","v":""},{"$f":"IF(CS22=\"\",\"\",VLOOKUP(CS22,'Liste articles'!#REF!,6,FALSE))","v":""},{"$f":"IF(CT22=\"\",\"\",VLOOKUP(CT22,'Liste articles'!#REF!,6,FALSE))","v":""},{"$f":"IF(CU22=\"\",\"\",VLOOKUP(CU22,'Liste articles'!#REF!,6,FALSE))","v":""},{"$f":"IF(CV22=\"\",\"\",VLOOKUP(CV22,'Liste articles'!#REF!,6,FALSE))","v":""},{"$f":"IF(CW22=\"\",\"\",VLOOKUP(CW22,'Liste articles'!#REF!,6,FALSE))","v":""},{"$f":"IF(CX22=\"\",\"\",VLOOKUP(CX22,'Liste articles'!#REF!,6,FALSE))","v":""},{"$f":"IF(CY22=\"\",\"\",VLOOKUP(CY22,'Liste articles'!#REF!,6,FALSE))","v":""},{"$f":"IF(CZ22=\"\",\"\",VLOOKUP(CZ22,'Liste articles'!#REF!,6,FALSE))","v":""},{"$f":"IF(DA22=\"\",\"\",VLOOKUP(DA22,'Liste articles'!#REF!,6,FALSE))","v":""},{"$f":"IF(DB22=\"\",\"\",VLOOKUP(DB22,'Liste articles'!#REF!,6,FALSE))","v":""},{"$f":"IF(DC22=\"\",\"\",VLOOKUP(DC22,'Liste articles'!#REF!,6,FALSE))","v":""},{"$f":"IF(DD22=\"\",\"\",VLOOKUP(DD22,'Liste articles'!#REF!,6,FALSE))","v":""},{"$f":"IF(DE22=\"\",\"\",VLOOKUP(DE22,'Liste articles'!#REF!,6,FALSE))","v":""},{"$f":"IF(DF22=\"\",\"\",VLOOKUP(DF22,'Liste articles'!#REF!,6,FALSE))","v":""},{"$f":"IF(DG22=\"\",\"\",VLOOKUP(DG22,'Liste articles'!#REF!,6,FALSE))","v":""},{"$f":"IF(DH22=\"\",\"\",VLOOKUP(DH22,'Liste articles'!#REF!,6,FALSE))","v":""},{"$f":"IF(DI22=\"\",\"\",VLOOKUP(DI22,'Liste articles'!#REF!,6,FALSE))","v":""},{"$f":"IF(DJ22=\"\",\"\",VLOOKUP(DJ22,'Liste articles'!#REF!,6,FALSE))","v":""},{"$f":"IF(DK22=\"\",\"\",VLOOKUP(DK22,'Liste articles'!#REF!,6,FALSE))","v":""},{"$f":"IF(DL22=\"\",\"\",VLOOKUP(DL22,'Liste articles'!#REF!,6,FALSE))","v":""},{"$f":"IF(DM22=\"\",\"\",VLOOKUP(DM22,'Liste articles'!#REF!,6,FALSE))","v":""},{"$f":"IF(DN22=\"\",\"\",VLOOKUP(DN22,'Liste articles'!#REF!,6,FALSE))","v":""},{"$f":"IF(DO22=\"\",\"\",VLOOKUP(DO22,'Liste articles'!#REF!,6,FALSE))","v":""},{"$f":"IF(DP22=\"\",\"\",VLOOKUP(DP22,'Liste articles'!#REF!,6,FALSE))","v":""},{"$f":"IF(DQ22=\"\",\"\",VLOOKUP(DQ22,'Liste articles'!#REF!,6,FALSE))","v":""},{"$f":"IF(DR22=\"\",\"\",VLOOKUP(DR22,'Liste articles'!#REF!,6,FALSE))","v":""},{"$f":"IF(DS22=\"\",\"\",VLOOKUP(DS22,'Liste articles'!#REF!,6,FALSE))","v":""},{"$f":"IF(DT22=\"\",\"\",VLOOKUP(DT22,'Liste articles'!#REF!,6,FALSE))","v":""},{"$f":"IF(DU22=\"\",\"\",VLOOKUP(DU22,'Liste articles'!#REF!,6,FALSE))","v":""},{"$f":"IF(DV22=\"\",\"\",VLOOKUP(DV22,'Liste articles'!#REF!,6,FALSE))","v":""},{"$f":"IF(DW22=\"\",\"\",VLOOKUP(DW22,'Liste articles'!#REF!,6,FALSE))","v":""},{"$f":"IF(DX22=\"\",\"\",VLOOKUP(DX22,'Liste articles'!#REF!,6,FALSE))","v":""},{"$f":"IF(DY22=\"\",\"\",VLOOKUP(DY22,'Liste articles'!#REF!,6,FALSE))","v":""},{"$f":"IF(DZ22=\"\",\"\",VLOOKUP(DZ22,'Liste articles'!#REF!,6,FALSE))","v":""},{"$f":"IF(EA22=\"\",\"\",VLOOKUP(EA22,'Liste articles'!#REF!,6,FALSE))","v":""}]
[{"$f":"IF(BL!A22=\"\",\"\",BL!A22)","v":""},null,null,null,{"$f":"IF(BL!E22=\"\",\"\",BL!E22)","v":""},{"$f":"IF(A23=\"\",\"\",VLOOKUP(A23,'Liste articles'!B:M,5,FALSE))","v":""},"",{"$f":"IF(C23=\"\",\"\",VLOOKUP(C23,'Liste articles'!#REF!,6,FALSE))","v":""},null,null,null,null,null,null,null,null,null,null,null,null,null,null,null,null,null,null,null,null,null,null,null,null,null,null,null,null,null,null,null,null,null,null,null,null,null,null,null,null,null,null,null,null,null,null,{"$f":"IF(AX23=\"\",\"\",VLOOKUP(AX23,'Liste articles'!#REF!,6,FALSE))","v":""},{"$f":"IF(AY23=\"\",\"\",VLOOKUP(AY23,'Liste articles'!#REF!,6,FALSE))","v":""},{"$f":"IF(AZ23=\"\",\"\",VLOOKUP(AZ23,'Liste articles'!#REF!,6,FALSE))","v":""},{"$f":"IF(BA23=\"\",\"\",VLOOKUP(BA23,'Liste articles'!#REF!,6,FALSE))","v":""},{"$f":"IF(BB23=\"\",\"\",VLOOKUP(BB23,'Liste articles'!#REF!,6,FALSE))","v":""},{"$f":"IF(BC23=\"\",\"\",VLOOKUP(BC23,'Liste articles'!#REF!,6,FALSE))","v":""},{"$f":"IF(BD23=\"\",\"\",VLOOKUP(BD23,'Liste articles'!#REF!,6,FALSE))","v":""},{"$f":"IF(BE23=\"\",\"\",VLOOKUP(BE23,'Liste articles'!#REF!,6,FALSE))","v":""},{"$f":"IF(BF23=\"\",\"\",VLOOKUP(BF23,'Liste articles'!#REF!,6,FALSE))","v":""},{"$f":"IF(BG23=\"\",\"\",VLOOKUP(BG23,'Liste articles'!#REF!,6,FALSE))","v":""},{"$f":"IF(BH23=\"\",\"\",VLOOKUP(BH23,'Liste articles'!#REF!,6,FALSE))","v":""},{"$f":"IF(BI23=\"\",\"\",VLOOKUP(BI23,'Liste articles'!#REF!,6,FALSE))","v":""},{"$f":"IF(BJ23=\"\",\"\",VLOOKUP(BJ23,'Liste articles'!#REF!,6,FALSE))","v":""},{"$f":"IF(BK23=\"\",\"\",VLOOKUP(BK23,'Liste articles'!#REF!,6,FALSE))","v":""},{"$f":"IF(BL23=\"\",\"\",VLOOKUP(BL23,'Liste articles'!#REF!,6,FALSE))","v":""},{"$f":"IF(BM23=\"\",\"\",VLOOKUP(BM23,'Liste articles'!#REF!,6,FALSE))","v":""},{"$f":"IF(BN23=\"\",\"\",VLOOKUP(BN23,'Liste articles'!#REF!,6,FALSE))","v":""},{"$f":"IF(BO23=\"\",\"\",VLOOKUP(BO23,'Liste articles'!#REF!,6,FALSE))","v":""},{"$f":"IF(BP23=\"\",\"\",VLOOKUP(BP23,'Liste articles'!#REF!,6,FALSE))","v":""},{"$f":"IF(BQ23=\"\",\"\",VLOOKUP(BQ23,'Liste articles'!#REF!,6,FALSE))","v":""},{"$f":"IF(BR23=\"\",\"\",VLOOKUP(BR23,'Liste articles'!#REF!,6,FALSE))","v":""},{"$f":"IF(BS23=\"\",\"\",VLOOKUP(BS23,'Liste articles'!#REF!,6,FALSE))","v":""},{"$f":"IF(BT23=\"\",\"\",VLOOKUP(BT23,'Liste articles'!#REF!,6,FALSE))","v":""},{"$f":"IF(BU23=\"\",\"\",VLOOKUP(BU23,'Liste articles'!#REF!,6,FALSE))","v":""},{"$f":"IF(BV23=\"\",\"\",VLOOKUP(BV23,'Liste articles'!#REF!,6,FALSE))","v":""},{"$f":"IF(BW23=\"\",\"\",VLOOKUP(BW23,'Liste articles'!#REF!,6,FALSE))","v":""},{"$f":"IF(BX23=\"\",\"\",VLOOKUP(BX23,'Liste articles'!#REF!,6,FALSE))","v":""},{"$f":"IF(BY23=\"\",\"\",VLOOKUP(BY23,'Liste articles'!#REF!,6,FALSE))","v":""},{"$f":"IF(BZ23=\"\",\"\",VLOOKUP(BZ23,'Liste articles'!#REF!,6,FALSE))","v":""},{"$f":"IF(CA23=\"\",\"\",VLOOKUP(CA23,'Liste articles'!#REF!,6,FALSE))","v":""},{"$f":"IF(CB23=\"\",\"\",VLOOKUP(CB23,'Liste articles'!#REF!,6,FALSE))","v":""},{"$f":"IF(CC23=\"\",\"\",VLOOKUP(CC23,'Liste articles'!#REF!,6,FALSE))","v":""},{"$f":"IF(CD23=\"\",\"\",VLOOKUP(CD23,'Liste articles'!#REF!,6,FALSE))","v":""},{"$f":"IF(CE23=\"\",\"\",VLOOKUP(CE23,'Liste articles'!#REF!,6,FALSE))","v":""},{"$f":"IF(CF23=\"\",\"\",VLOOKUP(CF23,'Liste articles'!#REF!,6,FALSE))","v":""},{"$f":"IF(CG23=\"\",\"\",VLOOKUP(CG23,'Liste articles'!#REF!,6,FALSE))","v":""},{"$f":"IF(CH23=\"\",\"\",VLOOKUP(CH23,'Liste articles'!#REF!,6,FALSE))","v":""},{"$f":"IF(CI23=\"\",\"\",VLOOKUP(CI23,'Liste articles'!#REF!,6,FALSE))","v":""},{"$f":"IF(CJ23=\"\",\"\",VLOOKUP(CJ23,'Liste articles'!#REF!,6,FALSE))","v":""},{"$f":"IF(CK23=\"\",\"\",VLOOKUP(CK23,'Liste articles'!#REF!,6,FALSE))","v":""},{"$f":"IF(CL23=\"\",\"\",VLOOKUP(CL23,'Liste articles'!#REF!,6,FALSE))","v":""},{"$f":"IF(CM23=\"\",\"\",VLOOKUP(CM23,'Liste articles'!#REF!,6,FALSE))","v":""},{"$f":"IF(CN23=\"\",\"\",VLOOKUP(CN23,'Liste articles'!#REF!,6,FALSE))","v":""},{"$f":"IF(CO23=\"\",\"\",VLOOKUP(CO23,'Liste articles'!#REF!,6,FALSE))","v":""},{"$f":"IF(CP23=\"\",\"\",VLOOKUP(CP23,'Liste articles'!#REF!,6,FALSE))","v":""},{"$f":"IF(CQ23=\"\",\"\",VLOOKUP(CQ23,'Liste articles'!#REF!,6,FALSE))","v":""},{"$f":"IF(CR23=\"\",\"\",VLOOKUP(CR23,'Liste articles'!#REF!,6,FALSE))","v":""},{"$f":"IF(CS23=\"\",\"\",VLOOKUP(CS23,'Liste articles'!#REF!,6,FALSE))","v":""},{"$f":"IF(CT23=\"\",\"\",VLOOKUP(CT23,'Liste articles'!#REF!,6,FALSE))","v":""},{"$f":"IF(CU23=\"\",\"\",VLOOKUP(CU23,'Liste articles'!#REF!,6,FALSE))","v":""},{"$f":"IF(CV23=\"\",\"\",VLOOKUP(CV23,'Liste articles'!#REF!,6,FALSE))","v":""},{"$f":"IF(CW23=\"\",\"\",VLOOKUP(CW23,'Liste articles'!#REF!,6,FALSE))","v":""},{"$f":"IF(CX23=\"\",\"\",VLOOKUP(CX23,'Liste articles'!#REF!,6,FALSE))","v":""},{"$f":"IF(CY23=\"\",\"\",VLOOKUP(CY23,'Liste articles'!#REF!,6,FALSE))","v":""},{"$f":"IF(CZ23=\"\",\"\",VLOOKUP(CZ23,'Liste articles'!#REF!,6,FALSE))","v":""},{"$f":"IF(DA23=\"\",\"\",VLOOKUP(DA23,'Liste articles'!#REF!,6,FALSE))","v":""},{"$f":"IF(DB23=\"\",\"\",VLOOKUP(DB23,'Liste articles'!#REF!,6,FALSE))","v":""},{"$f":"IF(DC23=\"\",\"\",VLOOKUP(DC23,'Liste articles'!#REF!,6,FALSE))","v":""},{"$f":"IF(DD23=\"\",\"\",VLOOKUP(DD23,'Liste articles'!#REF!,6,FALSE))","v":""},{"$f":"IF(DE23=\"\",\"\",VLOOKUP(DE23,'Liste articles'!#REF!,6,FALSE))","v":""},{"$f":"IF(DF23=\"\",\"\",VLOOKUP(DF23,'Liste articles'!#REF!,6,FALSE))","v":""},{"$f":"IF(DG23=\"\",\"\",VLOOKUP(DG23,'Liste articles'!#REF!,6,FALSE))","v":""},{"$f":"IF(DH23=\"\",\"\",VLOOKUP(DH23,'Liste articles'!#REF!,6,FALSE))","v":""},{"$f":"IF(DI23=\"\",\"\",VLOOKUP(DI23,'Liste articles'!#REF!,6,FALSE))","v":""},{"$f":"IF(DJ23=\"\",\"\",VLOOKUP(DJ23,'Liste articles'!#REF!,6,FALSE))","v":""},{"$f":"IF(DK23=\"\",\"\",VLOOKUP(DK23,'Liste articles'!#REF!,6,FALSE))","v":""},{"$f":"IF(DL23=\"\",\"\",VLOOKUP(DL23,'Liste articles'!#REF!,6,FALSE))","v":""},{"$f":"IF(DM23=\"\",\"\",VLOOKUP(DM23,'Liste articles'!#REF!,6,FALSE))","v":""},{"$f":"IF(DN23=\"\",\"\",VLOOKUP(DN23,'Liste articles'!#REF!,6,FALSE))","v":""},{"$f":"IF(DO23=\"\",\"\",VLOOKUP(DO23,'Liste articles'!#REF!,6,FALSE))","v":""},{"$f":"IF(DP23=\"\",\"\",VLOOKUP(DP23,'Liste articles'!#REF!,6,FALSE))","v":""},{"$f":"IF(DQ23=\"\",\"\",VLOOKUP(DQ23,'Liste articles'!#REF!,6,FALSE))","v":""},{"$f":"IF(DR23=\"\",\"\",VLOOKUP(DR23,'Liste articles'!#REF!,6,FALSE))","v":""},{"$f":"IF(DS23=\"\",\"\",VLOOKUP(DS23,'Liste articles'!#REF!,6,FALSE))","v":""},{"$f":"IF(DT23=\"\",\"\",VLOOKUP(DT23,'Liste articles'!#REF!,6,FALSE))","v":""},{"$f":"IF(DU23=\"\",\"\",VLOOKUP(DU23,'Liste articles'!#REF!,6,FALSE))","v":""},{"$f":"IF(DV23=\"\",\"\",VLOOKUP(DV23,'Liste articles'!#REF!,6,FALSE))","v":""},{"$f":"IF(DW23=\"\",\"\",VLOOKUP(DW23,'Liste articles'!#REF!,6,FALSE))","v":""},{"$f":"IF(DX23=\"\",\"\",VLOOKUP(DX23,'Liste articles'!#REF!,6,FALSE))","v":""},{"$f":"IF(DY23=\"\",\"\",VLOOKUP(DY23,'Liste articles'!#REF!,6,FALSE))","v":""},{"$f":"IF(DZ23=\"\",\"\",VLOOKUP(DZ23,'Liste articles'!#REF!,6,FALSE))","v":""},{"$f":"IF(EA23=\"\",\"\",VLOOKUP(EA23,'Liste articles'!#REF!,6,FALSE))","v":""}]
[{"$f":"IF(BL!A23=\"\",\"\",BL!A23)","v":""},null,null,null,{"$f":"IF(BL!E23=\"\",\"\",BL!E23)","v":""},{"$f":"IF(A24=\"\",\"\",VLOOKUP(A24,'Liste articles'!B:M,5,FALSE))","v":""},"",{"$f":"IF(C24=\"\",\"\",VLOOKUP(C24,'Liste articles'!#REF!,6,FALSE))","v":""},null,null,null,null,null,null,null,null,null,null,null,null,null,null,null,null,null,null,null,null,null,null,null,null,null,null,null,null,null,null,null,null,null,null,null,null,null,null,null,null,null,null,null,null,null,null,{"$f":"IF(AX24=\"\",\"\",VLOOKUP(AX24,'Liste articles'!#REF!,6,FALSE))","v":""},{"$f":"IF(AY24=\"\",\"\",VLOOKUP(AY24,'Liste articles'!#REF!,6,FALSE))","v":""},{"$f":"IF(AZ24=\"\",\"\",VLOOKUP(AZ24,'Liste articles'!#REF!,6,FALSE))","v":""},{"$f":"IF(BA24=\"\",\"\",VLOOKUP(BA24,'Liste articles'!#REF!,6,FALSE))","v":""},{"$f":"IF(BB24=\"\",\"\",VLOOKUP(BB24,'Liste articles'!#REF!,6,FALSE))","v":""},{"$f":"IF(BC24=\"\",\"\",VLOOKUP(BC24,'Liste articles'!#REF!,6,FALSE))","v":""},{"$f":"IF(BD24=\"\",\"\",VLOOKUP(BD24,'Liste articles'!#REF!,6,FALSE))","v":""},{"$f":"IF(BE24=\"\",\"\",VLOOKUP(BE24,'Liste articles'!#REF!,6,FALSE))","v":""},{"$f":"IF(BF24=\"\",\"\",VLOOKUP(BF24,'Liste articles'!#REF!,6,FALSE))","v":""},{"$f":"IF(BG24=\"\",\"\",VLOOKUP(BG24,'Liste articles'!#REF!,6,FALSE))","v":""},{"$f":"IF(BH24=\"\",\"\",VLOOKUP(BH24,'Liste articles'!#REF!,6,FALSE))","v":""},{"$f":"IF(BI24=\"\",\"\",VLOOKUP(BI24,'Liste articles'!#REF!,6,FALSE))","v":""},{"$f":"IF(BJ24=\"\",\"\",VLOOKUP(BJ24,'Liste articles'!#REF!,6,FALSE))","v":""},{"$f":"IF(BK24=\"\",\"\",VLOOKUP(BK24,'Liste articles'!#REF!,6,FALSE))","v":""},{"$f":"IF(BL24=\"\",\"\",VLOOKUP(BL24,'Liste articles'!#REF!,6,FALSE))","v":""},{"$f":"IF(BM24=\"\",\"\",VLOOKUP(BM24,'Liste articles'!#REF!,6,FALSE))","v":""},{"$f":"IF(BN24=\"\",\"\",VLOOKUP(BN24,'Liste articles'!#REF!,6,FALSE))","v":""},{"$f":"IF(BO24=\"\",\"\",VLOOKUP(BO24,'Liste articles'!#REF!,6,FALSE))","v":""},{"$f":"IF(BP24=\"\",\"\",VLOOKUP(BP24,'Liste articles'!#REF!,6,FALSE))","v":""},{"$f":"IF(BQ24=\"\",\"\",VLOOKUP(BQ24,'Liste articles'!#REF!,6,FALSE))","v":""},{"$f":"IF(BR24=\"\",\"\",VLOOKUP(BR24,'Liste articles'!#REF!,6,FALSE))","v":""},{"$f":"IF(BS24=\"\",\"\",VLOOKUP(BS24,'Liste articles'!#REF!,6,FALSE))","v":""},{"$f":"IF(BT24=\"\",\"\",VLOOKUP(BT24,'Liste articles'!#REF!,6,FALSE))","v":""},{"$f":"IF(BU24=\"\",\"\",VLOOKUP(BU24,'Liste articles'!#REF!,6,FALSE))","v":""},{"$f":"IF(BV24=\"\",\"\",VLOOKUP(BV24,'Liste articles'!#REF!,6,FALSE))","v":""},{"$f":"IF(BW24=\"\",\"\",VLOOKUP(BW24,'Liste articles'!#REF!,6,FALSE))","v":""},{"$f":"IF(BX24=\"\",\"\",VLOOKUP(BX24,'Liste articles'!#REF!,6,FALSE))","v":""},{"$f":"IF(BY24=\"\",\"\",VLOOKUP(BY24,'Liste articles'!#REF!,6,FALSE))","v":""},{"$f":"IF(BZ24=\"\",\"\",VLOOKUP(BZ24,'Liste articles'!#REF!,6,FALSE))","v":""},{"$f":"IF(CA24=\"\",\"\",VLOOKUP(CA24,'Liste articles'!#REF!,6,FALSE))","v":""},{"$f":"IF(CB24=\"\",\"\",VLOOKUP(CB24,'Liste articles'!#REF!,6,FALSE))","v":""},{"$f":"IF(CC24=\"\",\"\",VLOOKUP(CC24,'Liste articles'!#REF!,6,FALSE))","v":""},{"$f":"IF(CD24=\"\",\"\",VLOOKUP(CD24,'Liste articles'!#REF!,6,FALSE))","v":""},{"$f":"IF(CE24=\"\",\"\",VLOOKUP(CE24,'Liste articles'!#REF!,6,FALSE))","v":""},{"$f":"IF(CF24=\"\",\"\",VLOOKUP(CF24,'Liste articles'!#REF!,6,FALSE))","v":""},{"$f":"IF(CG24=\"\",\"\",VLOOKUP(CG24,'Liste articles'!#REF!,6,FALSE))","v":""},{"$f":"IF(CH24=\"\",\"\",VLOOKUP(CH24,'Liste articles'!#REF!,6,FALSE))","v":""},{"$f":"IF(CI24=\"\",\"\",VLOOKUP(CI24,'Liste articles'!#REF!,6,FALSE))","v":""},{"$f":"IF(CJ24=\"\",\"\",VLOOKUP(CJ24,'Liste articles'!#REF!,6,FALSE))","v":""},{"$f":"IF(CK24=\"\",\"\",VLOOKUP(CK24,'Liste articles'!#REF!,6,FALSE))","v":""},{"$f":"IF(CL24=\"\",\"\",VLOOKUP(CL24,'Liste articles'!#REF!,6,FALSE))","v":""},{"$f":"IF(CM24=\"\",\"\",VLOOKUP(CM24,'Liste articles'!#REF!,6,FALSE))","v":""},{"$f":"IF(CN24=\"\",\"\",VLOOKUP(CN24,'Liste articles'!#REF!,6,FALSE))","v":""},{"$f":"IF(CO24=\"\",\"\",VLOOKUP(CO24,'Liste articles'!#REF!,6,FALSE))","v":""},{"$f":"IF(CP24=\"\",\"\",VLOOKUP(CP24,'Liste articles'!#REF!,6,FALSE))","v":""},{"$f":"IF(CQ24=\"\",\"\",VLOOKUP(CQ24,'Liste articles'!#REF!,6,FALSE))","v":""},{"$f":"IF(CR24=\"\",\"\",VLOOKUP(CR24,'Liste articles'!#REF!,6,FALSE))","v":""},{"$f":"IF(CS24=\"\",\"\",VLOOKUP(CS24,'Liste articles'!#REF!,6,FALSE))","v":""},{"$f":"IF(CT24=\"\",\"\",VLOOKUP(CT24,'Liste articles'!#REF!,6,FALSE))","v":""},{"$f":"IF(CU24=\"\",\"\",VLOOKUP(CU24,'Liste articles'!#REF!,6,FALSE))","v":""},{"$f":"IF(CV24=\"\",\"\",VLOOKUP(CV24,'Liste articles'!#REF!,6,FALSE))","v":""},{"$f":"IF(CW24=\"\",\"\",VLOOKUP(CW24,'Liste articles'!#REF!,6,FALSE))","v":""},{"$f":"IF(CX24=\"\",\"\",VLOOKUP(CX24,'Liste articles'!#REF!,6,FALSE))","v":""},{"$f":"IF(CY24=\"\",\"\",VLOOKUP(CY24,'Liste articles'!#REF!,6,FALSE))","v":""},{"$f":"IF(CZ24=\"\",\"\",VLOOKUP(CZ24,'Liste articles'!#REF!,6,FALSE))","v":""},{"$f":"IF(DA24=\"\",\"\",VLOOKUP(DA24,'Liste articles'!#REF!,6,FALSE))","v":""},{"$f":"IF(DB24=\"\",\"\",VLOOKUP(DB24,'Liste articles'!#REF!,6,FALSE))","v":""},{"$f":"IF(DC24=\"\",\"\",VLOOKUP(DC24,'Liste articles'!#REF!,6,FALSE))","v":""},{"$f":"IF(DD24=\"\",\"\",VLOOKUP(DD24,'Liste articles'!#REF!,6,FALSE))","v":""},{"$f":"IF(DE24=\"\",\"\",VLOOKUP(DE24,'Liste articles'!#REF!,6,FALSE))","v":""},{"$f":"IF(DF24=\"\",\"\",VLOOKUP(DF24,'Liste articles'!#REF!,6,FALSE))","v":""},{"$f":"IF(DG24=\"\",\"\",VLOOKUP(DG24,'Liste articles'!#REF!,6,FALSE))","v":""},{"$f":"IF(DH24=\"\",\"\",VLOOKUP(DH24,'Liste articles'!#REF!,6,FALSE))","v":""},{"$f":"IF(DI24=\"\",\"\",VLOOKUP(DI24,'Liste articles'!#REF!,6,FALSE))","v":""},{"$f":"IF(DJ24=\"\",\"\",VLOOKUP(DJ24,'Liste articles'!#REF!,6,FALSE))","v":""},{"$f":"IF(DK24=\"\",\"\",VLOOKUP(DK24,'Liste articles'!#REF!,6,FALSE))","v":""},{"$f":"IF(DL24=\"\",\"\",VLOOKUP(DL24,'Liste articles'!#REF!,6,FALSE))","v":""},{"$f":"IF(DM24=\"\",\"\",VLOOKUP(DM24,'Liste articles'!#REF!,6,FALSE))","v":""},{"$f":"IF(DN24=\"\",\"\",VLOOKUP(DN24,'Liste articles'!#REF!,6,FALSE))","v":""},{"$f":"IF(DO24=\"\",\"\",VLOOKUP(DO24,'Liste articles'!#REF!,6,FALSE))","v":""},{"$f":"IF(DP24=\"\",\"\",VLOOKUP(DP24,'Liste articles'!#REF!,6,FALSE))","v":""},{"$f":"IF(DQ24=\"\",\"\",VLOOKUP(DQ24,'Liste articles'!#REF!,6,FALSE))","v":""},{"$f":"IF(DR24=\"\",\"\",VLOOKUP(DR24,'Liste articles'!#REF!,6,FALSE))","v":""},{"$f":"IF(DS24=\"\",\"\",VLOOKUP(DS24,'Liste articles'!#REF!,6,FALSE))","v":""},{"$f":"IF(DT24=\"\",\"\",VLOOKUP(DT24,'Liste articles'!#REF!,6,FALSE))","v":""},{"$f":"IF(DU24=\"\",\"\",VLOOKUP(DU24,'Liste articles'!#REF!,6,FALSE))","v":""},{"$f":"IF(DV24=\"\",\"\",VLOOKUP(DV24,'Liste articles'!#REF!,6,FALSE))","v":""},{"$f":"IF(DW24=\"\",\"\",VLOOKUP(DW24,'Liste articles'!#REF!,6,FALSE))","v":""},{"$f":"IF(DX24=\"\",\"\",VLOOKUP(DX24,'Liste articles'!#REF!,6,FALSE))","v":""},{"$f":"IF(DY24=\"\",\"\",VLOOKUP(DY24,'Liste articles'!#REF!,6,FALSE))","v":""},{"$f":"IF(DZ24=\"\",\"\",VLOOKUP(DZ24,'Liste articles'!#REF!,6,FALSE))","v":""},{"$f":"IF(EA24=\"\",\"\",VLOOKUP(EA24,'Liste articles'!#REF!,6,FALSE))","v":""}]
[{"$f":"IF(BL!A24=\"\",\"\",BL!A24)","v":""},null,null,null,{"$f":"IF(BL!E24=\"\",\"\",BL!E24)","v":""},{"$f":"IF(A25=\"\",\"\",VLOOKUP(A25,'Liste articles'!B:M,5,FALSE))","v":""},"",{"$f":"IF(C25=\"\",\"\",VLOOKUP(C25,'Liste articles'!#REF!,6,FALSE))","v":""},null,null,null,null,null,null,null,null,null,null,null,null,null,null,null,null,null,null,null,null,null,null,null,null,null,null,null,null,null,null,null,null,null,null,null,null,null,null,null,null,null,null,null,null,null,null,{"$f":"IF(AX25=\"\",\"\",VLOOKUP(AX25,'Liste articles'!#REF!,6,FALSE))","v":""},{"$f":"IF(AY25=\"\",\"\",VLOOKUP(AY25,'Liste articles'!#REF!,6,FALSE))","v":""},{"$f":"IF(AZ25=\"\",\"\",VLOOKUP(AZ25,'Liste articles'!#REF!,6,FALSE))","v":""},{"$f":"IF(BA25=\"\",\"\",VLOOKUP(BA25,'Liste articles'!#REF!,6,FALSE))","v":""},{"$f":"IF(BB25=\"\",\"\",VLOOKUP(BB25,'Liste articles'!#REF!,6,FALSE))","v":""},{"$f":"IF(BC25=\"\",\"\",VLOOKUP(BC25,'Liste articles'!#REF!,6,FALSE))","v":""},{"$f":"IF(BD25=\"\",\"\",VLOOKUP(BD25,'Liste articles'!#REF!,6,FALSE))","v":""},{"$f":"IF(BE25=\"\",\"\",VLOOKUP(BE25,'Liste articles'!#REF!,6,FALSE))","v":""},{"$f":"IF(BF25=\"\",\"\",VLOOKUP(BF25,'Liste articles'!#REF!,6,FALSE))","v":""},{"$f":"IF(BG25=\"\",\"\",VLOOKUP(BG25,'Liste articles'!#REF!,6,FALSE))","v":""},{"$f":"IF(BH25=\"\",\"\",VLOOKUP(BH25,'Liste articles'!#REF!,6,FALSE))","v":""},{"$f":"IF(BI25=\"\",\"\",VLOOKUP(BI25,'Liste articles'!#REF!,6,FALSE))","v":""},{"$f":"IF(BJ25=\"\",\"\",VLOOKUP(BJ25,'Liste articles'!#REF!,6,FALSE))","v":""},{"$f":"IF(BK25=\"\",\"\",VLOOKUP(BK25,'Liste articles'!#REF!,6,FALSE))","v":""},{"$f":"IF(BL25=\"\",\"\",VLOOKUP(BL25,'Liste articles'!#REF!,6,FALSE))","v":""},{"$f":"IF(BM25=\"\",\"\",VLOOKUP(BM25,'Liste articles'!#REF!,6,FALSE))","v":""},{"$f":"IF(BN25=\"\",\"\",VLOOKUP(BN25,'Liste articles'!#REF!,6,FALSE))","v":""},{"$f":"IF(BO25=\"\",\"\",VLOOKUP(BO25,'Liste articles'!#REF!,6,FALSE))","v":""},{"$f":"IF(BP25=\"\",\"\",VLOOKUP(BP25,'Liste articles'!#REF!,6,FALSE))","v":""},{"$f":"IF(BQ25=\"\",\"\",VLOOKUP(BQ25,'Liste articles'!#REF!,6,FALSE))","v":""},{"$f":"IF(BR25=\"\",\"\",VLOOKUP(BR25,'Liste articles'!#REF!,6,FALSE))","v":""},{"$f":"IF(BS25=\"\",\"\",VLOOKUP(BS25,'Liste articles'!#REF!,6,FALSE))","v":""},{"$f":"IF(BT25=\"\",\"\",VLOOKUP(BT25,'Liste articles'!#REF!,6,FALSE))","v":""},{"$f":"IF(BU25=\"\",\"\",VLOOKUP(BU25,'Liste articles'!#REF!,6,FALSE))","v":""},{"$f":"IF(BV25=\"\",\"\",VLOOKUP(BV25,'Liste articles'!#REF!,6,FALSE))","v":""},{"$f":"IF(BW25=\"\",\"\",VLOOKUP(BW25,'Liste articles'!#REF!,6,FALSE))","v":""},{"$f":"IF(BX25=\"\",\"\",VLOOKUP(BX25,'Liste articles'!#REF!,6,FALSE))","v":""},{"$f":"IF(BY25=\"\",\"\",VLOOKUP(BY25,'Liste articles'!#REF!,6,FALSE))","v":""},{"$f":"IF(BZ25=\"\",\"\",VLOOKUP(BZ25,'Liste articles'!#REF!,6,FALSE))","v":""},{"$f":"IF(CA25=\"\",\"\",VLOOKUP(CA25,'Liste articles'!#REF!,6,FALSE))","v":""},{"$f":"IF(CB25=\"\",\"\",VLOOKUP(CB25,'Liste articles'!#REF!,6,FALSE))","v":""},{"$f":"IF(CC25=\"\",\"\",VLOOKUP(CC25,'Liste articles'!#REF!,6,FALSE))","v":""},{"$f":"IF(CD25=\"\",\"\",VLOOKUP(CD25,'Liste articles'!#REF!,6,FALSE))","v":""},{"$f":"IF(CE25=\"\",\"\",VLOOKUP(CE25,'Liste articles'!#REF!,6,FALSE))","v":""},{"$f":"IF(CF25=\"\",\"\",VLOOKUP(CF25,'Liste articles'!#REF!,6,FALSE))","v":""},{"$f":"IF(CG25=\"\",\"\",VLOOKUP(CG25,'Liste articles'!#REF!,6,FALSE))","v":""},{"$f":"IF(CH25=\"\",\"\",VLOOKUP(CH25,'Liste articles'!#REF!,6,FALSE))","v":""},{"$f":"IF(CI25=\"\",\"\",VLOOKUP(CI25,'Liste articles'!#REF!,6,FALSE))","v":""},{"$f":"IF(CJ25=\"\",\"\",VLOOKUP(CJ25,'Liste articles'!#REF!,6,FALSE))","v":""},{"$f":"IF(CK25=\"\",\"\",VLOOKUP(CK25,'Liste articles'!#REF!,6,FALSE))","v":""},{"$f":"IF(CL25=\"\",\"\",VLOOKUP(CL25,'Liste articles'!#REF!,6,FALSE))","v":""},{"$f":"IF(CM25=\"\",\"\",VLOOKUP(CM25,'Liste articles'!#REF!,6,FALSE))","v":""},{"$f":"IF(CN25=\"\",\"\",VLOOKUP(CN25,'Liste articles'!#REF!,6,FALSE))","v":""},{"$f":"IF(CO25=\"\",\"\",VLOOKUP(CO25,'Liste articles'!#REF!,6,FALSE))","v":""},{"$f":"IF(CP25=\"\",\"\",VLOOKUP(CP25,'Liste articles'!#REF!,6,FALSE))","v":""},{"$f":"IF(CQ25=\"\",\"\",VLOOKUP(CQ25,'Liste articles'!#REF!,6,FALSE))","v":""},{"$f":"IF(CR25=\"\",\"\",VLOOKUP(CR25,'Liste articles'!#REF!,6,FALSE))","v":""},{"$f":"IF(CS25=\"\",\"\",VLOOKUP(CS25,'Liste articles'!#REF!,6,FALSE))","v":""},{"$f":"IF(CT25=\"\",\"\",VLOOKUP(CT25,'Liste articles'!#REF!,6,FALSE))","v":""},{"$f":"IF(CU25=\"\",\"\",VLOOKUP(CU25,'Liste articles'!#REF!,6,FALSE))","v":""},{"$f":"IF(CV25=\"\",\"\",VLOOKUP(CV25,'Liste articles'!#REF!,6,FALSE))","v":""},{"$f":"IF(CW25=\"\",\"\",VLOOKUP(CW25,'Liste articles'!#REF!,6,FALSE))","v":""},{"$f":"IF(CX25=\"\",\"\",VLOOKUP(CX25,'Liste articles'!#REF!,6,FALSE))","v":""},{"$f":"IF(CY25=\"\",\"\",VLOOKUP(CY25,'Liste articles'!#REF!,6,FALSE))","v":""},{"$f":"IF(CZ25=\"\",\"\",VLOOKUP(CZ25,'Liste articles'!#REF!,6,FALSE))","v":""},{"$f":"IF(DA25=\"\",\"\",VLOOKUP(DA25,'Liste articles'!#REF!,6,FALSE))","v":""},{"$f":"IF(DB25=\"\",\"\",VLOOKUP(DB25,'Liste articles'!#REF!,6,FALSE))","v":""},{"$f":"IF(DC25=\"\",\"\",VLOOKUP(DC25,'Liste articles'!#REF!,6,FALSE))","v":""},{"$f":"IF(DD25=\"\",\"\",VLOOKUP(DD25,'Liste articles'!#REF!,6,FALSE))","v":""},{"$f":"IF(DE25=\"\",\"\",VLOOKUP(DE25,'Liste articles'!#REF!,6,FALSE))","v":""},{"$f":"IF(DF25=\"\",\"\",VLOOKUP(DF25,'Liste articles'!#REF!,6,FALSE))","v":""},{"$f":"IF(DG25=\"\",\"\",VLOOKUP(DG25,'Liste articles'!#REF!,6,FALSE))","v":""},{"$f":"IF(DH25=\"\",\"\",VLOOKUP(DH25,'Liste articles'!#REF!,6,FALSE))","v":""},{"$f":"IF(DI25=\"\",\"\",VLOOKUP(DI25,'Liste articles'!#REF!,6,FALSE))","v":""},{"$f":"IF(DJ25=\"\",\"\",VLOOKUP(DJ25,'Liste articles'!#REF!,6,FALSE))","v":""},{"$f":"IF(DK25=\"\",\"\",VLOOKUP(DK25,'Liste articles'!#REF!,6,FALSE))","v":""},{"$f":"IF(DL25=\"\",\"\",VLOOKUP(DL25,'Liste articles'!#REF!,6,FALSE))","v":""},{"$f":"IF(DM25=\"\",\"\",VLOOKUP(DM25,'Liste articles'!#REF!,6,FALSE))","v":""},{"$f":"IF(DN25=\"\",\"\",VLOOKUP(DN25,'Liste articles'!#REF!,6,FALSE))","v":""},{"$f":"IF(DO25=\"\",\"\",VLOOKUP(DO25,'Liste articles'!#REF!,6,FALSE))","v":""},{"$f":"IF(DP25=\"\",\"\",VLOOKUP(DP25,'Liste articles'!#REF!,6,FALSE))","v":""},{"$f":"IF(DQ25=\"\",\"\",VLOOKUP(DQ25,'Liste articles'!#REF!,6,FALSE))","v":""},{"$f":"IF(DR25=\"\",\"\",VLOOKUP(DR25,'Liste articles'!#REF!,6,FALSE))","v":""},{"$f":"IF(DS25=\"\",\"\",VLOOKUP(DS25,'Liste articles'!#REF!,6,FALSE))","v":""},{"$f":"IF(DT25=\"\",\"\",VLOOKUP(DT25,'Liste articles'!#REF!,6,FALSE))","v":""},{"$f":"IF(DU25=\"\",\"\",VLOOKUP(DU25,'Liste articles'!#REF!,6,FALSE))","v":""},{"$f":"IF(DV25=\"\",\"\",VLOOKUP(DV25,'Liste articles'!#REF!,6,FALSE))","v":""},{"$f":"IF(DW25=\"\",\"\",VLOOKUP(DW25,'Liste articles'!#REF!,6,FALSE))","v":""},{"$f":"IF(DX25=\"\",\"\",VLOOKUP(DX25,'Liste articles'!#REF!,6,FALSE))","v":""},{"$f":"IF(DY25=\"\",\"\",VLOOKUP(DY25,'Liste articles'!#REF!,6,FALSE))","v":""},{"$f":"IF(DZ25=\"\",\"\",VLOOKUP(DZ25,'Liste articles'!#REF!,6,FALSE))","v":""},{"$f":"IF(EA25=\"\",\"\",VLOOKUP(EA25,'Liste articles'!#REF!,6,FALSE))","v":""}]
[{"$f":"IF(BL!A25=\"\",\"\",BL!A25)","v":""},null,null,null,{"$f":"IF(BL!E25=\"\",\"\",BL!E25)","v":""},{"$f":"IF(A26=\"\",\"\",VLOOKUP(A26,'Liste articles'!B:M,5,FALSE))","v":""},"",{"$f":"IF(C26=\"\",\"\",VLOOKUP(C26,'Liste articles'!#REF!,6,FALSE))","v":""},null,null,null,null,null,null,null,null,null,null,null,null,null,null,null,null,null,null,null,null,null,null,null,null,null,null,null,null,null,null,null,null,null,null,null,null,null,null,null,null,null,null,null,null,null,null,{"$f":"IF(AX26=\"\",\"\",VLOOKUP(AX26,'Liste articles'!#REF!,6,FALSE))","v":""},{"$f":"IF(AY26=\"\",\"\",VLOOKUP(AY26,'Liste articles'!#REF!,6,FALSE))","v":""},{"$f":"IF(AZ26=\"\",\"\",VLOOKUP(AZ26,'Liste articles'!#REF!,6,FALSE))","v":""},{"$f":"IF(BA26=\"\",\"\",VLOOKUP(BA26,'Liste articles'!#REF!,6,FALSE))","v":""},{"$f":"IF(BB26=\"\",\"\",VLOOKUP(BB26,'Liste articles'!#REF!,6,FALSE))","v":""},{"$f":"IF(BC26=\"\",\"\",VLOOKUP(BC26,'Liste articles'!#REF!,6,FALSE))","v":""},{"$f":"IF(BD26=\"\",\"\",VLOOKUP(BD26,'Liste articles'!#REF!,6,FALSE))","v":""},{"$f":"IF(BE26=\"\",\"\",VLOOKUP(BE26,'Liste articles'!#REF!,6,FALSE))","v":""},{"$f":"IF(BF26=\"\",\"\",VLOOKUP(BF26,'Liste articles'!#REF!,6,FALSE))","v":""},{"$f":"IF(BG26=\"\",\"\",VLOOKUP(BG26,'Liste articles'!#REF!,6,FALSE))","v":""},{"$f":"IF(BH26=\"\",\"\",VLOOKUP(BH26,'Liste articles'!#REF!,6,FALSE))","v":""},{"$f":"IF(BI26=\"\",\"\",VLOOKUP(BI26,'Liste articles'!#REF!,6,FALSE))","v":""},{"$f":"IF(BJ26=\"\",\"\",VLOOKUP(BJ26,'Liste articles'!#REF!,6,FALSE))","v":""},{"$f":"IF(BK26=\"\",\"\",VLOOKUP(BK26,'Liste articles'!#REF!,6,FALSE))","v":""},{"$f":"IF(BL26=\"\",\"\",VLOOKUP(BL26,'Liste articles'!#REF!,6,FALSE))","v":""},{"$f":"IF(BM26=\"\",\"\",VLOOKUP(BM26,'Liste articles'!#REF!,6,FALSE))","v":""},{"$f":"IF(BN26=\"\",\"\",VLOOKUP(BN26,'Liste articles'!#REF!,6,FALSE))","v":""},{"$f":"IF(BO26=\"\",\"\",VLOOKUP(BO26,'Liste articles'!#REF!,6,FALSE))","v":""},{"$f":"IF(BP26=\"\",\"\",VLOOKUP(BP26,'Liste articles'!#REF!,6,FALSE))","v":""},{"$f":"IF(BQ26=\"\",\"\",VLOOKUP(BQ26,'Liste articles'!#REF!,6,FALSE))","v":""},{"$f":"IF(BR26=\"\",\"\",VLOOKUP(BR26,'Liste articles'!#REF!,6,FALSE))","v":""},{"$f":"IF(BS26=\"\",\"\",VLOOKUP(BS26,'Liste articles'!#REF!,6,FALSE))","v":""},{"$f":"IF(BT26=\"\",\"\",VLOOKUP(BT26,'Liste articles'!#REF!,6,FALSE))","v":""},{"$f":"IF(BU26=\"\",\"\",VLOOKUP(BU26,'Liste articles'!#REF!,6,FALSE))","v":""},{"$f":"IF(BV26=\"\",\"\",VLOOKUP(BV26,'Liste articles'!#REF!,6,FALSE))","v":""},{"$f":"IF(BW26=\"\",\"\",VLOOKUP(BW26,'Liste articles'!#REF!,6,FALSE))","v":""},{"$f":"IF(BX26=\"\",\"\",VLOOKUP(BX26,'Liste articles'!#REF!,6,FALSE))","v":""},{"$f":"IF(BY26=\"\",\"\",VLOOKUP(BY26,'Liste articles'!#REF!,6,FALSE))","v":""},{"$f":"IF(BZ26=\"\",\"\",VLOOKUP(BZ26,'Liste articles'!#REF!,6,FALSE))","v":""},{"$f":"IF(CA26=\"\",\"\",VLOOKUP(CA26,'Liste articles'!#REF!,6,FALSE))","v":""},{"$f":"IF(CB26=\"\",\"\",VLOOKUP(CB26,'Liste articles'!#REF!,6,FALSE))","v":""},{"$f":"IF(CC26=\"\",\"\",VLOOKUP(CC26,'Liste articles'!#REF!,6,FALSE))","v":""},{"$f":"IF(CD26=\"\",\"\",VLOOKUP(CD26,'Liste articles'!#REF!,6,FALSE))","v":""},{"$f":"IF(CE26=\"\",\"\",VLOOKUP(CE26,'Liste articles'!#REF!,6,FALSE))","v":""},{"$f":"IF(CF26=\"\",\"\",VLOOKUP(CF26,'Liste articles'!#REF!,6,FALSE))","v":""},{"$f":"IF(CG26=\"\",\"\",VLOOKUP(CG26,'Liste articles'!#REF!,6,FALSE))","v":""},{"$f":"IF(CH26=\"\",\"\",VLOOKUP(CH26,'Liste articles'!#REF!,6,FALSE))","v":""},{"$f":"IF(CI26=\"\",\"\",VLOOKUP(CI26,'Liste articles'!#REF!,6,FALSE))","v":""},{"$f":"IF(CJ26=\"\",\"\",VLOOKUP(CJ26,'Liste articles'!#REF!,6,FALSE))","v":""},{"$f":"IF(CK26=\"\",\"\",VLOOKUP(CK26,'Liste articles'!#REF!,6,FALSE))","v":""},{"$f":"IF(CL26=\"\",\"\",VLOOKUP(CL26,'Liste articles'!#REF!,6,FALSE))","v":""},{"$f":"IF(CM26=\"\",\"\",VLOOKUP(CM26,'Liste articles'!#REF!,6,FALSE))","v":""},{"$f":"IF(CN26=\"\",\"\",VLOOKUP(CN26,'Liste articles'!#REF!,6,FALSE))","v":""},{"$f":"IF(CO26=\"\",\"\",VLOOKUP(CO26,'Liste articles'!#REF!,6,FALSE))","v":""},{"$f":"IF(CP26=\"\",\"\",VLOOKUP(CP26,'Liste articles'!#REF!,6,FALSE))","v":""},{"$f":"IF(CQ26=\"\",\"\",VLOOKUP(CQ26,'Liste articles'!#REF!,6,FALSE))","v":""},{"$f":"IF(CR26=\"\",\"\",VLOOKUP(CR26,'Liste articles'!#REF!,6,FALSE))","v":""},{"$f":"IF(CS26=\"\",\"\",VLOOKUP(CS26,'Liste articles'!#REF!,6,FALSE))","v":""},{"$f":"IF(CT26=\"\",\"\",VLOOKUP(CT26,'Liste articles'!#REF!,6,FALSE))","v":""},{"$f":"IF(CU26=\"\",\"\",VLOOKUP(CU26,'Liste articles'!#REF!,6,FALSE))","v":""},{"$f":"IF(CV26=\"\",\"\",VLOOKUP(CV26,'Liste articles'!#REF!,6,FALSE))","v":""},{"$f":"IF(CW26=\"\",\"\",VLOOKUP(CW26,'Liste articles'!#REF!,6,FALSE))","v":""},{"$f":"IF(CX26=\"\",\"\",VLOOKUP(CX26,'Liste articles'!#REF!,6,FALSE))","v":""},{"$f":"IF(CY26=\"\",\"\",VLOOKUP(CY26,'Liste articles'!#REF!,6,FALSE))","v":""},{"$f":"IF(CZ26=\"\",\"\",VLOOKUP(CZ26,'Liste articles'!#REF!,6,FALSE))","v":""},{"$f":"IF(DA26=\"\",\"\",VLOOKUP(DA26,'Liste articles'!#REF!,6,FALSE))","v":""},{"$f":"IF(DB26=\"\",\"\",VLOOKUP(DB26,'Liste articles'!#REF!,6,FALSE))","v":""},{"$f":"IF(DC26=\"\",\"\",VLOOKUP(DC26,'Liste articles'!#REF!,6,FALSE))","v":""},{"$f":"IF(DD26=\"\",\"\",VLOOKUP(DD26,'Liste articles'!#REF!,6,FALSE))","v":""},{"$f":"IF(DE26=\"\",\"\",VLOOKUP(DE26,'Liste articles'!#REF!,6,FALSE))","v":""},{"$f":"IF(DF26=\"\",\"\",VLOOKUP(DF26,'Liste articles'!#REF!,6,FALSE))","v":""},{"$f":"IF(DG26=\"\",\"\",VLOOKUP(DG26,'Liste articles'!#REF!,6,FALSE))","v":""},{"$f":"IF(DH26=\"\",\"\",VLOOKUP(DH26,'Liste articles'!#REF!,6,FALSE))","v":""},{"$f":"IF(DI26=\"\",\"\",VLOOKUP(DI26,'Liste articles'!#REF!,6,FALSE))","v":""},{"$f":"IF(DJ26=\"\",\"\",VLOOKUP(DJ26,'Liste articles'!#REF!,6,FALSE))","v":""},{"$f":"IF(DK26=\"\",\"\",VLOOKUP(DK26,'Liste articles'!#REF!,6,FALSE))","v":""},{"$f":"IF(DL26=\"\",\"\",VLOOKUP(DL26,'Liste articles'!#REF!,6,FALSE))","v":""},{"$f":"IF(DM26=\"\",\"\",VLOOKUP(DM26,'Liste articles'!#REF!,6,FALSE))","v":""},{"$f":"IF(DN26=\"\",\"\",VLOOKUP(DN26,'Liste articles'!#REF!,6,FALSE))","v":""},{"$f":"IF(DO26=\"\",\"\",VLOOKUP(DO26,'Liste articles'!#REF!,6,FALSE))","v":""},{"$f":"IF(DP26=\"\",\"\",VLOOKUP(DP26,'Liste articles'!#REF!,6,FALSE))","v":""},{"$f":"IF(DQ26=\"\",\"\",VLOOKUP(DQ26,'Liste articles'!#REF!,6,FALSE))","v":""},{"$f":"IF(DR26=\"\",\"\",VLOOKUP(DR26,'Liste articles'!#REF!,6,FALSE))","v":""},{"$f":"IF(DS26=\"\",\"\",VLOOKUP(DS26,'Liste articles'!#REF!,6,FALSE))","v":""},{"$f":"IF(DT26=\"\",\"\",VLOOKUP(DT26,'Liste articles'!#REF!,6,FALSE))","v":""},{"$f":"IF(DU26=\"\",\"\",VLOOKUP(DU26,'Liste articles'!#REF!,6,FALSE))","v":""},{"$f":"IF(DV26=\"\",\"\",VLOOKUP(DV26,'Liste articles'!#REF!,6,FALSE))","v":""},{"$f":"IF(DW26=\"\",\"\",VLOOKUP(DW26,'Liste articles'!#REF!,6,FALSE))","v":""},{"$f":"IF(DX26=\"\",\"\",VLOOKUP(DX26,'Liste articles'!#REF!,6,FALSE))","v":""},{"$f":"IF(DY26=\"\",\"\",VLOOKUP(DY26,'Liste articles'!#REF!,6,FALSE))","v":""},{"$f":"IF(DZ26=\"\",\"\",VLOOKUP(DZ26,'Liste articles'!#REF!,6,FALSE))","v":""},{"$f":"IF(EA26=\"\",\"\",VLOOKUP(EA26,'Liste articles'!#REF!,6,FALSE))","v":""}]
[{"$f":"IF(BL!A26=\"\",\"\",BL!A26)","v":""},null,null,null,{"$f":"IF(BL!E26=\"\",\"\",BL!E26)","v":""},{"$f":"IF(A27=\"\",\"\",VLOOKUP(A27,'Liste articles'!B:M,5,FALSE))","v":""},"",{"$f":"IF(C27=\"\",\"\",VLOOKUP(C27,'Liste articles'!#REF!,6,FALSE))","v":""},null,null,null,null,null,null,null,null,null,null,null,null,null,null,null,null,null,null,null,null,null,null,null,null,null,null,null,null,null,null,null,null,null,null,null,null,null,null,null,null,null,null,null,null,null,null,{"$f":"IF(AX27=\"\",\"\",VLOOKUP(AX27,'Liste articles'!#REF!,6,FALSE))","v":""},{"$f":"IF(AY27=\"\",\"\",VLOOKUP(AY27,'Liste articles'!#REF!,6,FALSE))","v":""},{"$f":"IF(AZ27=\"\",\"\",VLOOKUP(AZ27,'Liste articles'!#REF!,6,FALSE))","v":""},{"$f":"IF(BA27=\"\",\"\",VLOOKUP(BA27,'Liste articles'!#REF!,6,FALSE))","v":""},{"$f":"IF(BB27=\"\",\"\",VLOOKUP(BB27,'Liste articles'!#REF!,6,FALSE))","v":""},{"$f":"IF(BC27=\"\",\"\",VLOOKUP(BC27,'Liste articles'!#REF!,6,FALSE))","v":""},{"$f":"IF(BD27=\"\",\"\",VLOOKUP(BD27,'Liste articles'!#REF!,6,FALSE))","v":""},{"$f":"IF(BE27=\"\",\"\",VLOOKUP(BE27,'Liste articles'!#REF!,6,FALSE))","v":""},{"$f":"IF(BF27=\"\",\"\",VLOOKUP(BF27,'Liste articles'!#REF!,6,FALSE))","v":""},{"$f":"IF(BG27=\"\",\"\",VLOOKUP(BG27,'Liste articles'!#REF!,6,FALSE))","v":""},{"$f":"IF(BH27=\"\",\"\",VLOOKUP(BH27,'Liste articles'!#REF!,6,FALSE))","v":""},{"$f":"IF(BI27=\"\",\"\",VLOOKUP(BI27,'Liste articles'!#REF!,6,FALSE))","v":""},{"$f":"IF(BJ27=\"\",\"\",VLOOKUP(BJ27,'Liste articles'!#REF!,6,FALSE))","v":""},{"$f":"IF(BK27=\"\",\"\",VLOOKUP(BK27,'Liste articles'!#REF!,6,FALSE))","v":""},{"$f":"IF(BL27=\"\",\"\",VLOOKUP(BL27,'Liste articles'!#REF!,6,FALSE))","v":""},{"$f":"IF(BM27=\"\",\"\",VLOOKUP(BM27,'Liste articles'!#REF!,6,FALSE))","v":""},{"$f":"IF(BN27=\"\",\"\",VLOOKUP(BN27,'Liste articles'!#REF!,6,FALSE))","v":""},{"$f":"IF(BO27=\"\",\"\",VLOOKUP(BO27,'Liste articles'!#REF!,6,FALSE))","v":""},{"$f":"IF(BP27=\"\",\"\",VLOOKUP(BP27,'Liste articles'!#REF!,6,FALSE))","v":""},{"$f":"IF(BQ27=\"\",\"\",VLOOKUP(BQ27,'Liste articles'!#REF!,6,FALSE))","v":""},{"$f":"IF(BR27=\"\",\"\",VLOOKUP(BR27,'Liste articles'!#REF!,6,FALSE))","v":""},{"$f":"IF(BS27=\"\",\"\",VLOOKUP(BS27,'Liste articles'!#REF!,6,FALSE))","v":""},{"$f":"IF(BT27=\"\",\"\",VLOOKUP(BT27,'Liste articles'!#REF!,6,FALSE))","v":""},{"$f":"IF(BU27=\"\",\"\",VLOOKUP(BU27,'Liste articles'!#REF!,6,FALSE))","v":""},{"$f":"IF(BV27=\"\",\"\",VLOOKUP(BV27,'Liste articles'!#REF!,6,FALSE))","v":""},{"$f":"IF(BW27=\"\",\"\",VLOOKUP(BW27,'Liste articles'!#REF!,6,FALSE))","v":""},{"$f":"IF(BX27=\"\",\"\",VLOOKUP(BX27,'Liste articles'!#REF!,6,FALSE))","v":""},{"$f":"IF(BY27=\"\",\"\",VLOOKUP(BY27,'Liste articles'!#REF!,6,FALSE))","v":""},{"$f":"IF(BZ27=\"\",\"\",VLOOKUP(BZ27,'Liste articles'!#REF!,6,FALSE))","v":""},{"$f":"IF(CA27=\"\",\"\",VLOOKUP(CA27,'Liste articles'!#REF!,6,FALSE))","v":""},{"$f":"IF(CB27=\"\",\"\",VLOOKUP(CB27,'Liste articles'!#REF!,6,FALSE))","v":""},{"$f":"IF(CC27=\"\",\"\",VLOOKUP(CC27,'Liste articles'!#REF!,6,FALSE))","v":""},{"$f":"IF(CD27=\"\",\"\",VLOOKUP(CD27,'Liste articles'!#REF!,6,FALSE))","v":""},{"$f":"IF(CE27=\"\",\"\",VLOOKUP(CE27,'Liste articles'!#REF!,6,FALSE))","v":""},{"$f":"IF(CF27=\"\",\"\",VLOOKUP(CF27,'Liste articles'!#REF!,6,FALSE))","v":""},{"$f":"IF(CG27=\"\",\"\",VLOOKUP(CG27,'Liste articles'!#REF!,6,FALSE))","v":""},{"$f":"IF(CH27=\"\",\"\",VLOOKUP(CH27,'Liste articles'!#REF!,6,FALSE))","v":""},{"$f":"IF(CI27=\"\",\"\",VLOOKUP(CI27,'Liste articles'!#REF!,6,FALSE))","v":""},{"$f":"IF(CJ27=\"\",\"\",VLOOKUP(CJ27,'Liste articles'!#REF!,6,FALSE))","v":""},{"$f":"IF(CK27=\"\",\"\",VLOOKUP(CK27,'Liste articles'!#REF!,6,FALSE))","v":""},{"$f":"IF(CL27=\"\",\"\",VLOOKUP(CL27,'Liste articles'!#REF!,6,FALSE))","v":""},{"$f":"IF(CM27=\"\",\"\",VLOOKUP(CM27,'Liste articles'!#REF!,6,FALSE))","v":""},{"$f":"IF(CN27=\"\",\"\",VLOOKUP(CN27,'Liste articles'!#REF!,6,FALSE))","v":""},{"$f":"IF(CO27=\"\",\"\",VLOOKUP(CO27,'Liste articles'!#REF!,6,FALSE))","v":""},{"$f":"IF(CP27=\"\",\"\",VLOOKUP(CP27,'Liste articles'!#REF!,6,FALSE))","v":""},{"$f":"IF(CQ27=\"\",\"\",VLOOKUP(CQ27,'Liste articles'!#REF!,6,FALSE))","v":""},{"$f":"IF(CR27=\"\",\"\",VLOOKUP(CR27,'Liste articles'!#REF!,6,FALSE))","v":""},{"$f":"IF(CS27=\"\",\"\",VLOOKUP(CS27,'Liste articles'!#REF!,6,FALSE))","v":""},{"$f":"IF(CT27=\"\",\"\",VLOOKUP(CT27,'Liste articles'!#REF!,6,FALSE))","v":""},{"$f":"IF(CU27=\"\",\"\",VLOOKUP(CU27,'Liste articles'!#REF!,6,FALSE))","v":""},{"$f":"IF(CV27=\"\",\"\",VLOOKUP(CV27,'Liste articles'!#REF!,6,FALSE))","v":""},{"$f":"IF(CW27=\"\",\"\",VLOOKUP(CW27,'Liste articles'!#REF!,6,FALSE))","v":""},{"$f":"IF(CX27=\"\",\"\",VLOOKUP(CX27,'Liste articles'!#REF!,6,FALSE))","v":""},{"$f":"IF(CY27=\"\",\"\",VLOOKUP(CY27,'Liste articles'!#REF!,6,FALSE))","v":""},{"$f":"IF(CZ27=\"\",\"\",VLOOKUP(CZ27,'Liste articles'!#REF!,6,FALSE))","v":""},{"$f":"IF(DA27=\"\",\"\",VLOOKUP(DA27,'Liste articles'!#REF!,6,FALSE))","v":""},{"$f":"IF(DB27=\"\",\"\",VLOOKUP(DB27,'Liste articles'!#REF!,6,FALSE))","v":""},{"$f":"IF(DC27=\"\",\"\",VLOOKUP(DC27,'Liste articles'!#REF!,6,FALSE))","v":""},{"$f":"IF(DD27=\"\",\"\",VLOOKUP(DD27,'Liste articles'!#REF!,6,FALSE))","v":""},{"$f":"IF(DE27=\"\",\"\",VLOOKUP(DE27,'Liste articles'!#REF!,6,FALSE))","v":""},{"$f":"IF(DF27=\"\",\"\",VLOOKUP(DF27,'Liste articles'!#REF!,6,FALSE))","v":""},{"$f":"IF(DG27=\"\",\"\",VLOOKUP(DG27,'Liste articles'!#REF!,6,FALSE))","v":""},{"$f":"IF(DH27=\"\",\"\",VLOOKUP(DH27,'Liste articles'!#REF!,6,FALSE))","v":""},{"$f":"IF(DI27=\"\",\"\",VLOOKUP(DI27,'Liste articles'!#REF!,6,FALSE))","v":""},{"$f":"IF(DJ27=\"\",\"\",VLOOKUP(DJ27,'Liste articles'!#REF!,6,FALSE))","v":""},{"$f":"IF(DK27=\"\",\"\",VLOOKUP(DK27,'Liste articles'!#REF!,6,FALSE))","v":""},{"$f":"IF(DL27=\"\",\"\",VLOOKUP(DL27,'Liste articles'!#REF!,6,FALSE))","v":""},{"$f":"IF(DM27=\"\",\"\",VLOOKUP(DM27,'Liste articles'!#REF!,6,FALSE))","v":""},{"$f":"IF(DN27=\"\",\"\",VLOOKUP(DN27,'Liste articles'!#REF!,6,FALSE))","v":""},{"$f":"IF(DO27=\"\",\"\",VLOOKUP(DO27,'Liste articles'!#REF!,6,FALSE))","v":""},{"$f":"IF(DP27=\"\",\"\",VLOOKUP(DP27,'Liste articles'!#REF!,6,FALSE))","v":""},{"$f":"IF(DQ27=\"\",\"\",VLOOKUP(DQ27,'Liste articles'!#REF!,6,FALSE))","v":""},{"$f":"IF(DR27=\"\",\"\",VLOOKUP(DR27,'Liste articles'!#REF!,6,FALSE))","v":""},{"$f":"IF(DS27=\"\",\"\",VLOOKUP(DS27,'Liste articles'!#REF!,6,FALSE))","v":""},{"$f":"IF(DT27=\"\",\"\",VLOOKUP(DT27,'Liste articles'!#REF!,6,FALSE))","v":""},{"$f":"IF(DU27=\"\",\"\",VLOOKUP(DU27,'Liste articles'!#REF!,6,FALSE))","v":""},{"$f":"IF(DV27=\"\",\"\",VLOOKUP(DV27,'Liste articles'!#REF!,6,FALSE))","v":""},{"$f":"IF(DW27=\"\",\"\",VLOOKUP(DW27,'Liste articles'!#REF!,6,FALSE))","v":""},{"$f":"IF(DX27=\"\",\"\",VLOOKUP(DX27,'Liste articles'!#REF!,6,FALSE))","v":""},{"$f":"IF(DY27=\"\",\"\",VLOOKUP(DY27,'Liste articles'!#REF!,6,FALSE))","v":""},{"$f":"IF(DZ27=\"\",\"\",VLOOKUP(DZ27,'Liste articles'!#REF!,6,FALSE))","v":""},{"$f":"IF(EA27=\"\",\"\",VLOOKUP(EA27,'Liste articles'!#REF!,6,FALSE))","v":""}]
[{"$f":"IF(BL!A27=\"\",\"\",BL!A27)","v":""},null,null,null,{"$f":"IF(BL!E27=\"\",\"\",BL!E27)","v":""},{"$f":"IF(A28=\"\",\"\",VLOOKUP(A28,'Liste articles'!B:M,5,FALSE))","v":""},"",{"$f":"IF(C28=\"\",\"\",VLOOKUP(C28,'Liste articles'!#REF!,6,FALSE))","v":""},null,null,null,null,null,null,null,null,null,null,null,null,null,null,null,null,null,null,null,null,null,null,null,null,null,null,null,null,null,null,null,null,null,null,null,null,null,null,null,null,null,null,null,null,null,null,{"$f":"IF(AX28=\"\",\"\",VLOOKUP(AX28,'Liste articles'!#REF!,6,FALSE))","v":""},{"$f":"IF(AY28=\"\",\"\",VLOOKUP(AY28,'Liste articles'!#REF!,6,FALSE))","v":""},{"$f":"IF(AZ28=\"\",\"\",VLOOKUP(AZ28,'Liste articles'!#REF!,6,FALSE))","v":""},{"$f":"IF(BA28=\"\",\"\",VLOOKUP(BA28,'Liste articles'!#REF!,6,FALSE))","v":""},{"$f":"IF(BB28=\"\",\"\",VLOOKUP(BB28,'Liste articles'!#REF!,6,FALSE))","v":""},{"$f":"IF(BC28=\"\",\"\",VLOOKUP(BC28,'Liste articles'!#REF!,6,FALSE))","v":""},{"$f":"IF(BD28=\"\",\"\",VLOOKUP(BD28,'Liste articles'!#REF!,6,FALSE))","v":""},{"$f":"IF(BE28=\"\",\"\",VLOOKUP(BE28,'Liste articles'!#REF!,6,FALSE))","v":""},{"$f":"IF(BF28=\"\",\"\",VLOOKUP(BF28,'Liste articles'!#REF!,6,FALSE))","v":""},{"$f":"IF(BG28=\"\",\"\",VLOOKUP(BG28,'Liste articles'!#REF!,6,FALSE))","v":""},{"$f":"IF(BH28=\"\",\"\",VLOOKUP(BH28,'Liste articles'!#REF!,6,FALSE))","v":""},{"$f":"IF(BI28=\"\",\"\",VLOOKUP(BI28,'Liste articles'!#REF!,6,FALSE))","v":""},{"$f":"IF(BJ28=\"\",\"\",VLOOKUP(BJ28,'Liste articles'!#REF!,6,FALSE))","v":""},{"$f":"IF(BK28=\"\",\"\",VLOOKUP(BK28,'Liste articles'!#REF!,6,FALSE))","v":""},{"$f":"IF(BL28=\"\",\"\",VLOOKUP(BL28,'Liste articles'!#REF!,6,FALSE))","v":""},{"$f":"IF(BM28=\"\",\"\",VLOOKUP(BM28,'Liste articles'!#REF!,6,FALSE))","v":""},{"$f":"IF(BN28=\"\",\"\",VLOOKUP(BN28,'Liste articles'!#REF!,6,FALSE))","v":""},{"$f":"IF(BO28=\"\",\"\",VLOOKUP(BO28,'Liste articles'!#REF!,6,FALSE))","v":""},{"$f":"IF(BP28=\"\",\"\",VLOOKUP(BP28,'Liste articles'!#REF!,6,FALSE))","v":""},{"$f":"IF(BQ28=\"\",\"\",VLOOKUP(BQ28,'Liste articles'!#REF!,6,FALSE))","v":""},{"$f":"IF(BR28=\"\",\"\",VLOOKUP(BR28,'Liste articles'!#REF!,6,FALSE))","v":""},{"$f":"IF(BS28=\"\",\"\",VLOOKUP(BS28,'Liste articles'!#REF!,6,FALSE))","v":""},{"$f":"IF(BT28=\"\",\"\",VLOOKUP(BT28,'Liste articles'!#REF!,6,FALSE))","v":""},{"$f":"IF(BU28=\"\",\"\",VLOOKUP(BU28,'Liste articles'!#REF!,6,FALSE))","v":""},{"$f":"IF(BV28=\"\",\"\",VLOOKUP(BV28,'Liste articles'!#REF!,6,FALSE))","v":""},{"$f":"IF(BW28=\"\",\"\",VLOOKUP(BW28,'Liste articles'!#REF!,6,FALSE))","v":""},{"$f":"IF(BX28=\"\",\"\",VLOOKUP(BX28,'Liste articles'!#REF!,6,FALSE))","v":""},{"$f":"IF(BY28=\"\",\"\",VLOOKUP(BY28,'Liste articles'!#REF!,6,FALSE))","v":""},{"$f":"IF(BZ28=\"\",\"\",VLOOKUP(BZ28,'Liste articles'!#REF!,6,FALSE))","v":""},{"$f":"IF(CA28=\"\",\"\",VLOOKUP(CA28,'Liste articles'!#REF!,6,FALSE))","v":""},{"$f":"IF(CB28=\"\",\"\",VLOOKUP(CB28,'Liste articles'!#REF!,6,FALSE))","v":""},{"$f":"IF(CC28=\"\",\"\",VLOOKUP(CC28,'Liste articles'!#REF!,6,FALSE))","v":""},{"$f":"IF(CD28=\"\",\"\",VLOOKUP(CD28,'Liste articles'!#REF!,6,FALSE))","v":""},{"$f":"IF(CE28=\"\",\"\",VLOOKUP(CE28,'Liste articles'!#REF!,6,FALSE))","v":""},{"$f":"IF(CF28=\"\",\"\",VLOOKUP(CF28,'Liste articles'!#REF!,6,FALSE))","v":""},{"$f":"IF(CG28=\"\",\"\",VLOOKUP(CG28,'Liste articles'!#REF!,6,FALSE))","v":""},{"$f":"IF(CH28=\"\",\"\",VLOOKUP(CH28,'Liste articles'!#REF!,6,FALSE))","v":""},{"$f":"IF(CI28=\"\",\"\",VLOOKUP(CI28,'Liste articles'!#REF!,6,FALSE))","v":""},{"$f":"IF(CJ28=\"\",\"\",VLOOKUP(CJ28,'Liste articles'!#REF!,6,FALSE))","v":""},{"$f":"IF(CK28=\"\",\"\",VLOOKUP(CK28,'Liste articles'!#REF!,6,FALSE))","v":""},{"$f":"IF(CL28=\"\",\"\",VLOOKUP(CL28,'Liste articles'!#REF!,6,FALSE))","v":""},{"$f":"IF(CM28=\"\",\"\",VLOOKUP(CM28,'Liste articles'!#REF!,6,FALSE))","v":""},{"$f":"IF(CN28=\"\",\"\",VLOOKUP(CN28,'Liste articles'!#REF!,6,FALSE))","v":""},{"$f":"IF(CO28=\"\",\"\",VLOOKUP(CO28,'Liste articles'!#REF!,6,FALSE))","v":""},{"$f":"IF(CP28=\"\",\"\",VLOOKUP(CP28,'Liste articles'!#REF!,6,FALSE))","v":""},{"$f":"IF(CQ28=\"\",\"\",VLOOKUP(CQ28,'Liste articles'!#REF!,6,FALSE))","v":""},{"$f":"IF(CR28=\"\",\"\",VLOOKUP(CR28,'Liste articles'!#REF!,6,FALSE))","v":""},{"$f":"IF(CS28=\"\",\"\",VLOOKUP(CS28,'Liste articles'!#REF!,6,FALSE))","v":""},{"$f":"IF(CT28=\"\",\"\",VLOOKUP(CT28,'Liste articles'!#REF!,6,FALSE))","v":""},{"$f":"IF(CU28=\"\",\"\",VLOOKUP(CU28,'Liste articles'!#REF!,6,FALSE))","v":""},{"$f":"IF(CV28=\"\",\"\",VLOOKUP(CV28,'Liste articles'!#REF!,6,FALSE))","v":""},{"$f":"IF(CW28=\"\",\"\",VLOOKUP(CW28,'Liste articles'!#REF!,6,FALSE))","v":""},{"$f":"IF(CX28=\"\",\"\",VLOOKUP(CX28,'Liste articles'!#REF!,6,FALSE))","v":""},{"$f":"IF(CY28=\"\",\"\",VLOOKUP(CY28,'Liste articles'!#REF!,6,FALSE))","v":""},{"$f":"IF(CZ28=\"\",\"\",VLOOKUP(CZ28,'Liste articles'!#REF!,6,FALSE))","v":""},{"$f":"IF(DA28=\"\",\"\",VLOOKUP(DA28,'Liste articles'!#REF!,6,FALSE))","v":""},{"$f":"IF(DB28=\"\",\"\",VLOOKUP(DB28,'Liste articles'!#REF!,6,FALSE))","v":""},{"$f":"IF(DC28=\"\",\"\",VLOOKUP(DC28,'Liste articles'!#REF!,6,FALSE))","v":""},{"$f":"IF(DD28=\"\",\"\",VLOOKUP(DD28,'Liste articles'!#REF!,6,FALSE))","v":""},{"$f":"IF(DE28=\"\",\"\",VLOOKUP(DE28,'Liste articles'!#REF!,6,FALSE))","v":""},{"$f":"IF(DF28=\"\",\"\",VLOOKUP(DF28,'Liste articles'!#REF!,6,FALSE))","v":""},{"$f":"IF(DG28=\"\",\"\",VLOOKUP(DG28,'Liste articles'!#REF!,6,FALSE))","v":""},{"$f":"IF(DH28=\"\",\"\",VLOOKUP(DH28,'Liste articles'!#REF!,6,FALSE))","v":""},{"$f":"IF(DI28=\"\",\"\",VLOOKUP(DI28,'Liste articles'!#REF!,6,FALSE))","v":""},{"$f":"IF(DJ28=\"\",\"\",VLOOKUP(DJ28,'Liste articles'!#REF!,6,FALSE))","v":""},{"$f":"IF(DK28=\"\",\"\",VLOOKUP(DK28,'Liste articles'!#REF!,6,FALSE))","v":""},{"$f":"IF(DL28=\"\",\"\",VLOOKUP(DL28,'Liste articles'!#REF!,6,FALSE))","v":""},{"$f":"IF(DM28=\"\",\"\",VLOOKUP(DM28,'Liste articles'!#REF!,6,FALSE))","v":""},{"$f":"IF(DN28=\"\",\"\",VLOOKUP(DN28,'Liste articles'!#REF!,6,FALSE))","v":""},{"$f":"IF(DO28=\"\",\"\",VLOOKUP(DO28,'Liste articles'!#REF!,6,FALSE))","v":""},{"$f":"IF(DP28=\"\",\"\",VLOOKUP(DP28,'Liste articles'!#REF!,6,FALSE))","v":""},{"$f":"IF(DQ28=\"\",\"\",VLOOKUP(DQ28,'Liste articles'!#REF!,6,FALSE))","v":""},{"$f":"IF(DR28=\"\",\"\",VLOOKUP(DR28,'Liste articles'!#REF!,6,FALSE))","v":""},{"$f":"IF(DS28=\"\",\"\",VLOOKUP(DS28,'Liste articles'!#REF!,6,FALSE))","v":""},{"$f":"IF(DT28=\"\",\"\",VLOOKUP(DT28,'Liste articles'!#REF!,6,FALSE))","v":""},{"$f":"IF(DU28=\"\",\"\",VLOOKUP(DU28,'Liste articles'!#REF!,6,FALSE))","v":""},{"$f":"IF(DV28=\"\",\"\",VLOOKUP(DV28,'Liste articles'!#REF!,6,FALSE))","v":""},{"$f":"IF(DW28=\"\",\"\",VLOOKUP(DW28,'Liste articles'!#REF!,6,FALSE))","v":""},{"$f":"IF(DX28=\"\",\"\",VLOOKUP(DX28,'Liste articles'!#REF!,6,FALSE))","v":""},{"$f":"IF(DY28=\"\",\"\",VLOOKUP(DY28,'Liste articles'!#REF!,6,FALSE))","v":""},{"$f":"IF(DZ28=\"\",\"\",VLOOKUP(DZ28,'Liste articles'!#REF!,6,FALSE))","v":""},{"$f":"IF(EA28=\"\",\"\",VLOOKUP(EA28,'Liste articles'!#REF!,6,FALSE))","v":""}]
[{"$f":"IF(BL!A28=\"\",\"\",BL!A28)","v":""},null,null,null,{"$f":"IF(BL!E28=\"\",\"\",BL!E28)","v":""},{"$f":"IF(A29=\"\",\"\",VLOOKUP(A29,'Liste articles'!B:M,5,FALSE))","v":""},"",{"$f":"IF(C29=\"\",\"\",VLOOKUP(C29,'Liste articles'!#REF!,6,FALSE))","v":""},null,null,null,null,null,null,null,null,null,null,null,null,null,null,null,null,null,null,null,null,null,null,null,null,null,null,null,null,null,null,null,null,null,null,null,null,null,null,null,null,null,null,null,null,null,null,{"$f":"IF(AX29=\"\",\"\",VLOOKUP(AX29,'Liste articles'!#REF!,6,FALSE))","v":""},{"$f":"IF(AY29=\"\",\"\",VLOOKUP(AY29,'Liste articles'!#REF!,6,FALSE))","v":""},{"$f":"IF(AZ29=\"\",\"\",VLOOKUP(AZ29,'Liste articles'!#REF!,6,FALSE))","v":""},{"$f":"IF(BA29=\"\",\"\",VLOOKUP(BA29,'Liste articles'!#REF!,6,FALSE))","v":""},{"$f":"IF(BB29=\"\",\"\",VLOOKUP(BB29,'Liste articles'!#REF!,6,FALSE))","v":""},{"$f":"IF(BC29=\"\",\"\",VLOOKUP(BC29,'Liste articles'!#REF!,6,FALSE))","v":""},{"$f":"IF(BD29=\"\",\"\",VLOOKUP(BD29,'Liste articles'!#REF!,6,FALSE))","v":""},{"$f":"IF(BE29=\"\",\"\",VLOOKUP(BE29,'Liste articles'!#REF!,6,FALSE))","v":""},{"$f":"IF(BF29=\"\",\"\",VLOOKUP(BF29,'Liste articles'!#REF!,6,FALSE))","v":""},{"$f":"IF(BG29=\"\",\"\",VLOOKUP(BG29,'Liste articles'!#REF!,6,FALSE))","v":""},{"$f":"IF(BH29=\"\",\"\",VLOOKUP(BH29,'Liste articles'!#REF!,6,FALSE))","v":""},{"$f":"IF(BI29=\"\",\"\",VLOOKUP(BI29,'Liste articles'!#REF!,6,FALSE))","v":""},{"$f":"IF(BJ29=\"\",\"\",VLOOKUP(BJ29,'Liste articles'!#REF!,6,FALSE))","v":""},{"$f":"IF(BK29=\"\",\"\",VLOOKUP(BK29,'Liste articles'!#REF!,6,FALSE))","v":""},{"$f":"IF(BL29=\"\",\"\",VLOOKUP(BL29,'Liste articles'!#REF!,6,FALSE))","v":""},{"$f":"IF(BM29=\"\",\"\",VLOOKUP(BM29,'Liste articles'!#REF!,6,FALSE))","v":""},{"$f":"IF(BN29=\"\",\"\",VLOOKUP(BN29,'Liste articles'!#REF!,6,FALSE))","v":""},{"$f":"IF(BO29=\"\",\"\",VLOOKUP(BO29,'Liste articles'!#REF!,6,FALSE))","v":""},{"$f":"IF(BP29=\"\",\"\",VLOOKUP(BP29,'Liste articles'!#REF!,6,FALSE))","v":""},{"$f":"IF(BQ29=\"\",\"\",VLOOKUP(BQ29,'Liste articles'!#REF!,6,FALSE))","v":""},{"$f":"IF(BR29=\"\",\"\",VLOOKUP(BR29,'Liste articles'!#REF!,6,FALSE))","v":""},{"$f":"IF(BS29=\"\",\"\",VLOOKUP(BS29,'Liste articles'!#REF!,6,FALSE))","v":""},{"$f":"IF(BT29=\"\",\"\",VLOOKUP(BT29,'Liste articles'!#REF!,6,FALSE))","v":""},{"$f":"IF(BU29=\"\",\"\",VLOOKUP(BU29,'Liste articles'!#REF!,6,FALSE))","v":""},{"$f":"IF(BV29=\"\",\"\",VLOOKUP(BV29,'Liste articles'!#REF!,6,FALSE))","v":""},{"$f":"IF(BW29=\"\",\"\",VLOOKUP(BW29,'Liste articles'!#REF!,6,FALSE))","v":""},{"$f":"IF(BX29=\"\",\"\",VLOOKUP(BX29,'Liste articles'!#REF!,6,FALSE))","v":""},{"$f":"IF(BY29=\"\",\"\",VLOOKUP(BY29,'Liste articles'!#REF!,6,FALSE))","v":""},{"$f":"IF(BZ29=\"\",\"\",VLOOKUP(BZ29,'Liste articles'!#REF!,6,FALSE))","v":""},{"$f":"IF(CA29=\"\",\"\",VLOOKUP(CA29,'Liste articles'!#REF!,6,FALSE))","v":""},{"$f":"IF(CB29=\"\",\"\",VLOOKUP(CB29,'Liste articles'!#REF!,6,FALSE))","v":""},{"$f":"IF(CC29=\"\",\"\",VLOOKUP(CC29,'Liste articles'!#REF!,6,FALSE))","v":""},{"$f":"IF(CD29=\"\",\"\",VLOOKUP(CD29,'Liste articles'!#REF!,6,FALSE))","v":""},{"$f":"IF(CE29=\"\",\"\",VLOOKUP(CE29,'Liste articles'!#REF!,6,FALSE))","v":""},{"$f":"IF(CF29=\"\",\"\",VLOOKUP(CF29,'Liste articles'!#REF!,6,FALSE))","v":""},{"$f":"IF(CG29=\"\",\"\",VLOOKUP(CG29,'Liste articles'!#REF!,6,FALSE))","v":""},{"$f":"IF(CH29=\"\",\"\",VLOOKUP(CH29,'Liste articles'!#REF!,6,FALSE))","v":""},{"$f":"IF(CI29=\"\",\"\",VLOOKUP(CI29,'Liste articles'!#REF!,6,FALSE))","v":""},{"$f":"IF(CJ29=\"\",\"\",VLOOKUP(CJ29,'Liste articles'!#REF!,6,FALSE))","v":""},{"$f":"IF(CK29=\"\",\"\",VLOOKUP(CK29,'Liste articles'!#REF!,6,FALSE))","v":""},{"$f":"IF(CL29=\"\",\"\",VLOOKUP(CL29,'Liste articles'!#REF!,6,FALSE))","v":""},{"$f":"IF(CM29=\"\",\"\",VLOOKUP(CM29,'Liste articles'!#REF!,6,FALSE))","v":""},{"$f":"IF(CN29=\"\",\"\",VLOOKUP(CN29,'Liste articles'!#REF!,6,FALSE))","v":""},{"$f":"IF(CO29=\"\",\"\",VLOOKUP(CO29,'Liste articles'!#REF!,6,FALSE))","v":""},{"$f":"IF(CP29=\"\",\"\",VLOOKUP(CP29,'Liste articles'!#REF!,6,FALSE))","v":""},{"$f":"IF(CQ29=\"\",\"\",VLOOKUP(CQ29,'Liste articles'!#REF!,6,FALSE))","v":""},{"$f":"IF(CR29=\"\",\"\",VLOOKUP(CR29,'Liste articles'!#REF!,6,FALSE))","v":""},{"$f":"IF(CS29=\"\",\"\",VLOOKUP(CS29,'Liste articles'!#REF!,6,FALSE))","v":""},{"$f":"IF(CT29=\"\",\"\",VLOOKUP(CT29,'Liste articles'!#REF!,6,FALSE))","v":""},{"$f":"IF(CU29=\"\",\"\",VLOOKUP(CU29,'Liste articles'!#REF!,6,FALSE))","v":""},{"$f":"IF(CV29=\"\",\"\",VLOOKUP(CV29,'Liste articles'!#REF!,6,FALSE))","v":""},{"$f":"IF(CW29=\"\",\"\",VLOOKUP(CW29,'Liste articles'!#REF!,6,FALSE))","v":""},{"$f":"IF(CX29=\"\",\"\",VLOOKUP(CX29,'Liste articles'!#REF!,6,FALSE))","v":""},{"$f":"IF(CY29=\"\",\"\",VLOOKUP(CY29,'Liste articles'!#REF!,6,FALSE))","v":""},{"$f":"IF(CZ29=\"\",\"\",VLOOKUP(CZ29,'Liste articles'!#REF!,6,FALSE))","v":""},{"$f":"IF(DA29=\"\",\"\",VLOOKUP(DA29,'Liste articles'!#REF!,6,FALSE))","v":""},{"$f":"IF(DB29=\"\",\"\",VLOOKUP(DB29,'Liste articles'!#REF!,6,FALSE))","v":""},{"$f":"IF(DC29=\"\",\"\",VLOOKUP(DC29,'Liste articles'!#REF!,6,FALSE))","v":""},{"$f":"IF(DD29=\"\",\"\",VLOOKUP(DD29,'Liste articles'!#REF!,6,FALSE))","v":""},{"$f":"IF(DE29=\"\",\"\",VLOOKUP(DE29,'Liste articles'!#REF!,6,FALSE))","v":""},{"$f":"IF(DF29=\"\",\"\",VLOOKUP(DF29,'Liste articles'!#REF!,6,FALSE))","v":""},{"$f":"IF(DG29=\"\",\"\",VLOOKUP(DG29,'Liste articles'!#REF!,6,FALSE))","v":""},{"$f":"IF(DH29=\"\",\"\",VLOOKUP(DH29,'Liste articles'!#REF!,6,FALSE))","v":""},{"$f":"IF(DI29=\"\",\"\",VLOOKUP(DI29,'Liste articles'!#REF!,6,FALSE))","v":""},{"$f":"IF(DJ29=\"\",\"\",VLOOKUP(DJ29,'Liste articles'!#REF!,6,FALSE))","v":""},{"$f":"IF(DK29=\"\",\"\",VLOOKUP(DK29,'Liste articles'!#REF!,6,FALSE))","v":""},{"$f":"IF(DL29=\"\",\"\",VLOOKUP(DL29,'Liste articles'!#REF!,6,FALSE))","v":""},{"$f":"IF(DM29=\"\",\"\",VLOOKUP(DM29,'Liste articles'!#REF!,6,FALSE))","v":""},{"$f":"IF(DN29=\"\",\"\",VLOOKUP(DN29,'Liste articles'!#REF!,6,FALSE))","v":""},{"$f":"IF(DO29=\"\",\"\",VLOOKUP(DO29,'Liste articles'!#REF!,6,FALSE))","v":""},{"$f":"IF(DP29=\"\",\"\",VLOOKUP(DP29,'Liste articles'!#REF!,6,FALSE))","v":""},{"$f":"IF(DQ29=\"\",\"\",VLOOKUP(DQ29,'Liste articles'!#REF!,6,FALSE))","v":""},{"$f":"IF(DR29=\"\",\"\",VLOOKUP(DR29,'Liste articles'!#REF!,6,FALSE))","v":""},{"$f":"IF(DS29=\"\",\"\",VLOOKUP(DS29,'Liste articles'!#REF!,6,FALSE))","v":""},{"$f":"IF(DT29=\"\",\"\",VLOOKUP(DT29,'Liste articles'!#REF!,6,FALSE))","v":""},{"$f":"IF(DU29=\"\",\"\",VLOOKUP(DU29,'Liste articles'!#REF!,6,FALSE))","v":""},{"$f":"IF(DV29=\"\",\"\",VLOOKUP(DV29,'Liste articles'!#REF!,6,FALSE))","v":""},{"$f":"IF(DW29=\"\",\"\",VLOOKUP(DW29,'Liste articles'!#REF!,6,FALSE))","v":""},{"$f":"IF(DX29=\"\",\"\",VLOOKUP(DX29,'Liste articles'!#REF!,6,FALSE))","v":""},{"$f":"IF(DY29=\"\",\"\",VLOOKUP(DY29,'Liste articles'!#REF!,6,FALSE))","v":""},{"$f":"IF(DZ29=\"\",\"\",VLOOKUP(DZ29,'Liste articles'!#REF!,6,FALSE))","v":""},{"$f":"IF(EA29=\"\",\"\",VLOOKUP(EA29,'Liste articles'!#REF!,6,FALSE))","v":""}]
[{"$f":"IF(BL!A29=\"\",\"\",BL!A29)","v":""},null,null,null,{"$f":"IF(BL!E29=\"\",\"\",BL!E29)","v":""},{"$f":"IF(A30=\"\",\"\",VLOOKUP(A30,'Liste articles'!B:M,5,FALSE))","v":""},"",{"$f":"IF(C30=\"\",\"\",VLOOKUP(C30,'Liste articles'!#REF!,6,FALSE))","v":""},null,null,null,null,null,null,null,null,null,null,null,null,null,null,null,null,null,null,null,null,null,null,null,null,null,null,null,null,null,null,null,null,null,null,null,null,null,null,null,null,null,null,null,null,null,null,{"$f":"IF(AX30=\"\",\"\",VLOOKUP(AX30,'Liste articles'!#REF!,6,FALSE))","v":""},{"$f":"IF(AY30=\"\",\"\",VLOOKUP(AY30,'Liste articles'!#REF!,6,FALSE))","v":""},{"$f":"IF(AZ30=\"\",\"\",VLOOKUP(AZ30,'Liste articles'!#REF!,6,FALSE))","v":""},{"$f":"IF(BA30=\"\",\"\",VLOOKUP(BA30,'Liste articles'!#REF!,6,FALSE))","v":""},{"$f":"IF(BB30=\"\",\"\",VLOOKUP(BB30,'Liste articles'!#REF!,6,FALSE))","v":""},{"$f":"IF(BC30=\"\",\"\",VLOOKUP(BC30,'Liste articles'!#REF!,6,FALSE))","v":""},{"$f":"IF(BD30=\"\",\"\",VLOOKUP(BD30,'Liste articles'!#REF!,6,FALSE))","v":""},{"$f":"IF(BE30=\"\",\"\",VLOOKUP(BE30,'Liste articles'!#REF!,6,FALSE))","v":""},{"$f":"IF(BF30=\"\",\"\",VLOOKUP(BF30,'Liste articles'!#REF!,6,FALSE))","v":""},{"$f":"IF(BG30=\"\",\"\",VLOOKUP(BG30,'Liste articles'!#REF!,6,FALSE))","v":""},{"$f":"IF(BH30=\"\",\"\",VLOOKUP(BH30,'Liste articles'!#REF!,6,FALSE))","v":""},{"$f":"IF(BI30=\"\",\"\",VLOOKUP(BI30,'Liste articles'!#REF!,6,FALSE))","v":""},{"$f":"IF(BJ30=\"\",\"\",VLOOKUP(BJ30,'Liste articles'!#REF!,6,FALSE))","v":""},{"$f":"IF(BK30=\"\",\"\",VLOOKUP(BK30,'Liste articles'!#REF!,6,FALSE))","v":""},{"$f":"IF(BL30=\"\",\"\",VLOOKUP(BL30,'Liste articles'!#REF!,6,FALSE))","v":""},{"$f":"IF(BM30=\"\",\"\",VLOOKUP(BM30,'Liste articles'!#REF!,6,FALSE))","v":""},{"$f":"IF(BN30=\"\",\"\",VLOOKUP(BN30,'Liste articles'!#REF!,6,FALSE))","v":""},{"$f":"IF(BO30=\"\",\"\",VLOOKUP(BO30,'Liste articles'!#REF!,6,FALSE))","v":""},{"$f":"IF(BP30=\"\",\"\",VLOOKUP(BP30,'Liste articles'!#REF!,6,FALSE))","v":""},{"$f":"IF(BQ30=\"\",\"\",VLOOKUP(BQ30,'Liste articles'!#REF!,6,FALSE))","v":""},{"$f":"IF(BR30=\"\",\"\",VLOOKUP(BR30,'Liste articles'!#REF!,6,FALSE))","v":""},{"$f":"IF(BS30=\"\",\"\",VLOOKUP(BS30,'Liste articles'!#REF!,6,FALSE))","v":""},{"$f":"IF(BT30=\"\",\"\",VLOOKUP(BT30,'Liste articles'!#REF!,6,FALSE))","v":""},{"$f":"IF(BU30=\"\",\"\",VLOOKUP(BU30,'Liste articles'!#REF!,6,FALSE))","v":""},{"$f":"IF(BV30=\"\",\"\",VLOOKUP(BV30,'Liste articles'!#REF!,6,FALSE))","v":""},{"$f":"IF(BW30=\"\",\"\",VLOOKUP(BW30,'Liste articles'!#REF!,6,FALSE))","v":""},{"$f":"IF(BX30=\"\",\"\",VLOOKUP(BX30,'Liste articles'!#REF!,6,FALSE))","v":""},{"$f":"IF(BY30=\"\",\"\",VLOOKUP(BY30,'Liste articles'!#REF!,6,FALSE))","v":""},{"$f":"IF(BZ30=\"\",\"\",VLOOKUP(BZ30,'Liste articles'!#REF!,6,FALSE))","v":""},{"$f":"IF(CA30=\"\",\"\",VLOOKUP(CA30,'Liste articles'!#REF!,6,FALSE))","v":""},{"$f":"IF(CB30=\"\",\"\",VLOOKUP(CB30,'Liste articles'!#REF!,6,FALSE))","v":""},{"$f":"IF(CC30=\"\",\"\",VLOOKUP(CC30,'Liste articles'!#REF!,6,FALSE))","v":""},{"$f":"IF(CD30=\"\",\"\",VLOOKUP(CD30,'Liste articles'!#REF!,6,FALSE))","v":""},{"$f":"IF(CE30=\"\",\"\",VLOOKUP(CE30,'Liste articles'!#REF!,6,FALSE))","v":""},{"$f":"IF(CF30=\"\",\"\",VLOOKUP(CF30,'Liste articles'!#REF!,6,FALSE))","v":""},{"$f":"IF(CG30=\"\",\"\",VLOOKUP(CG30,'Liste articles'!#REF!,6,FALSE))","v":""},{"$f":"IF(CH30=\"\",\"\",VLOOKUP(CH30,'Liste articles'!#REF!,6,FALSE))","v":""},{"$f":"IF(CI30=\"\",\"\",VLOOKUP(CI30,'Liste articles'!#REF!,6,FALSE))","v":""},{"$f":"IF(CJ30=\"\",\"\",VLOOKUP(CJ30,'Liste articles'!#REF!,6,FALSE))","v":""},{"$f":"IF(CK30=\"\",\"\",VLOOKUP(CK30,'Liste articles'!#REF!,6,FALSE))","v":""},{"$f":"IF(CL30=\"\",\"\",VLOOKUP(CL30,'Liste articles'!#REF!,6,FALSE))","v":""},{"$f":"IF(CM30=\"\",\"\",VLOOKUP(CM30,'Liste articles'!#REF!,6,FALSE))","v":""},{"$f":"IF(CN30=\"\",\"\",VLOOKUP(CN30,'Liste articles'!#REF!,6,FALSE))","v":""},{"$f":"IF(CO30=\"\",\"\",VLOOKUP(CO30,'Liste articles'!#REF!,6,FALSE))","v":""},{"$f":"IF(CP30=\"\",\"\",VLOOKUP(CP30,'Liste articles'!#REF!,6,FALSE))","v":""},{"$f":"IF(CQ30=\"\",\"\",VLOOKUP(CQ30,'Liste articles'!#REF!,6,FALSE))","v":""},{"$f":"IF(CR30=\"\",\"\",VLOOKUP(CR30,'Liste articles'!#REF!,6,FALSE))","v":""},{"$f":"IF(CS30=\"\",\"\",VLOOKUP(CS30,'Liste articles'!#REF!,6,FALSE))","v":""},{"$f":"IF(CT30=\"\",\"\",VLOOKUP(CT30,'Liste articles'!#REF!,6,FALSE))","v":""},{"$f":"IF(CU30=\"\",\"\",VLOOKUP(CU30,'Liste articles'!#REF!,6,FALSE))","v":""},{"$f":"IF(CV30=\"\",\"\",VLOOKUP(CV30,'Liste articles'!#REF!,6,FALSE))","v":""},{"$f":"IF(CW30=\"\",\"\",VLOOKUP(CW30,'Liste articles'!#REF!,6,FALSE))","v":""},{"$f":"IF(CX30=\"\",\"\",VLOOKUP(CX30,'Liste articles'!#REF!,6,FALSE))","v":""},{"$f":"IF(CY30=\"\",\"\",VLOOKUP(CY30,'Liste articles'!#REF!,6,FALSE))","v":""},{"$f":"IF(CZ30=\"\",\"\",VLOOKUP(CZ30,'Liste articles'!#REF!,6,FALSE))","v":""},{"$f":"IF(DA30=\"\",\"\",VLOOKUP(DA30,'Liste articles'!#REF!,6,FALSE))","v":""},{"$f":"IF(DB30=\"\",\"\",VLOOKUP(DB30,'Liste articles'!#REF!,6,FALSE))","v":""},{"$f":"IF(DC30=\"\",\"\",VLOOKUP(DC30,'Liste articles'!#REF!,6,FALSE))","v":""},{"$f":"IF(DD30=\"\",\"\",VLOOKUP(DD30,'Liste articles'!#REF!,6,FALSE))","v":""},{"$f":"IF(DE30=\"\",\"\",VLOOKUP(DE30,'Liste articles'!#REF!,6,FALSE))","v":""},{"$f":"IF(DF30=\"\",\"\",VLOOKUP(DF30,'Liste articles'!#REF!,6,FALSE))","v":""},{"$f":"IF(DG30=\"\",\"\",VLOOKUP(DG30,'Liste articles'!#REF!,6,FALSE))","v":""},{"$f":"IF(DH30=\"\",\"\",VLOOKUP(DH30,'Liste articles'!#REF!,6,FALSE))","v":""},{"$f":"IF(DI30=\"\",\"\",VLOOKUP(DI30,'Liste articles'!#REF!,6,FALSE))","v":""},{"$f":"IF(DJ30=\"\",\"\",VLOOKUP(DJ30,'Liste articles'!#REF!,6,FALSE))","v":""},{"$f":"IF(DK30=\"\",\"\",VLOOKUP(DK30,'Liste articles'!#REF!,6,FALSE))","v":""},{"$f":"IF(DL30=\"\",\"\",VLOOKUP(DL30,'Liste articles'!#REF!,6,FALSE))","v":""},{"$f":"IF(DM30=\"\",\"\",VLOOKUP(DM30,'Liste articles'!#REF!,6,FALSE))","v":""},{"$f":"IF(DN30=\"\",\"\",VLOOKUP(DN30,'Liste articles'!#REF!,6,FALSE))","v":""},{"$f":"IF(DO30=\"\",\"\",VLOOKUP(DO30,'Liste articles'!#REF!,6,FALSE))","v":""},{"$f":"IF(DP30=\"\",\"\",VLOOKUP(DP30,'Liste articles'!#REF!,6,FALSE))","v":""},{"$f":"IF(DQ30=\"\",\"\",VLOOKUP(DQ30,'Liste articles'!#REF!,6,FALSE))","v":""},{"$f":"IF(DR30=\"\",\"\",VLOOKUP(DR30,'Liste articles'!#REF!,6,FALSE))","v":""},{"$f":"IF(DS30=\"\",\"\",VLOOKUP(DS30,'Liste articles'!#REF!,6,FALSE))","v":""},{"$f":"IF(DT30=\"\",\"\",VLOOKUP(DT30,'Liste articles'!#REF!,6,FALSE))","v":""},{"$f":"IF(DU30=\"\",\"\",VLOOKUP(DU30,'Liste articles'!#REF!,6,FALSE))","v":""},{"$f":"IF(DV30=\"\",\"\",VLOOKUP(DV30,'Liste articles'!#REF!,6,FALSE))","v":""},{"$f":"IF(DW30=\"\",\"\",VLOOKUP(DW30,'Liste articles'!#REF!,6,FALSE))","v":""},{"$f":"IF(DX30=\"\",\"\",VLOOKUP(DX30,'Liste articles'!#REF!,6,FALSE))","v":""},{"$f":"IF(DY30=\"\",\"\",VLOOKUP(DY30,'Liste articles'!#REF!,6,FALSE))","v":""},{"$f":"IF(DZ30=\"\",\"\",VLOOKUP(DZ30,'Liste articles'!#REF!,6,FALSE))","v":""},{"$f":"IF(EA30=\"\",\"\",VLOOKUP(EA30,'Liste articles'!#REF!,6,FALSE))","v":""}]
[{"$f":"IF(BL!A30=\"\",\"\",BL!A30)","v":""},null,null,null,{"$f":"IF(BL!E30=\"\",\"\",BL!E30)","v":""},{"$f":"IF(A31=\"\",\"\",VLOOKUP(A31,'Liste articles'!B:M,5,FALSE))","v":""},"",{"$f":"IF(C31=\"\",\"\",VLOOKUP(C31,'Liste articles'!#REF!,6,FALSE))","v":""},null,null,null,null,null,null,null,null,null,null,null,null,null,null,null,null,null,null,null,null,null,null,null,null,null,null,null,null,null,null,null,null,null,null,null,null,null,null,null,null,null,null,null,null,null,null,{"$f":"IF(AX31=\"\",\"\",VLOOKUP(AX31,'Liste articles'!#REF!,6,FALSE))","v":""},{"$f":"IF(AY31=\"\",\"\",VLOOKUP(AY31,'Liste articles'!#REF!,6,FALSE))","v":""},{"$f":"IF(AZ31=\"\",\"\",VLOOKUP(AZ31,'Liste articles'!#REF!,6,FALSE))","v":""},{"$f":"IF(BA31=\"\",\"\",VLOOKUP(BA31,'Liste articles'!#REF!,6,FALSE))","v":""},{"$f":"IF(BB31=\"\",\"\",VLOOKUP(BB31,'Liste articles'!#REF!,6,FALSE))","v":""},{"$f":"IF(BC31=\"\",\"\",VLOOKUP(BC31,'Liste articles'!#REF!,6,FALSE))","v":""},{"$f":"IF(BD31=\"\",\"\",VLOOKUP(BD31,'Liste articles'!#REF!,6,FALSE))","v":""},{"$f":"IF(BE31=\"\",\"\",VLOOKUP(BE31,'Liste articles'!#REF!,6,FALSE))","v":""},{"$f":"IF(BF31=\"\",\"\",VLOOKUP(BF31,'Liste articles'!#REF!,6,FALSE))","v":""},{"$f":"IF(BG31=\"\",\"\",VLOOKUP(BG31,'Liste articles'!#REF!,6,FALSE))","v":""},{"$f":"IF(BH31=\"\",\"\",VLOOKUP(BH31,'Liste articles'!#REF!,6,FALSE))","v":""},{"$f":"IF(BI31=\"\",\"\",VLOOKUP(BI31,'Liste articles'!#REF!,6,FALSE))","v":""},{"$f":"IF(BJ31=\"\",\"\",VLOOKUP(BJ31,'Liste articles'!#REF!,6,FALSE))","v":""},{"$f":"IF(BK31=\"\",\"\",VLOOKUP(BK31,'Liste articles'!#REF!,6,FALSE))","v":""},{"$f":"IF(BL31=\"\",\"\",VLOOKUP(BL31,'Liste articles'!#REF!,6,FALSE))","v":""},{"$f":"IF(BM31=\"\",\"\",VLOOKUP(BM31,'Liste articles'!#REF!,6,FALSE))","v":""},{"$f":"IF(BN31=\"\",\"\",VLOOKUP(BN31,'Liste articles'!#REF!,6,FALSE))","v":""},{"$f":"IF(BO31=\"\",\"\",VLOOKUP(BO31,'Liste articles'!#REF!,6,FALSE))","v":""},{"$f":"IF(BP31=\"\",\"\",VLOOKUP(BP31,'Liste articles'!#REF!,6,FALSE))","v":""},{"$f":"IF(BQ31=\"\",\"\",VLOOKUP(BQ31,'Liste articles'!#REF!,6,FALSE))","v":""},{"$f":"IF(BR31=\"\",\"\",VLOOKUP(BR31,'Liste articles'!#REF!,6,FALSE))","v":""},{"$f":"IF(BS31=\"\",\"\",VLOOKUP(BS31,'Liste articles'!#REF!,6,FALSE))","v":""},{"$f":"IF(BT31=\"\",\"\",VLOOKUP(BT31,'Liste articles'!#REF!,6,FALSE))","v":""},{"$f":"IF(BU31=\"\",\"\",VLOOKUP(BU31,'Liste articles'!#REF!,6,FALSE))","v":""},{"$f":"IF(BV31=\"\",\"\",VLOOKUP(BV31,'Liste articles'!#REF!,6,FALSE))","v":""},{"$f":"IF(BW31=\"\",\"\",VLOOKUP(BW31,'Liste articles'!#REF!,6,FALSE))","v":""},{"$f":"IF(BX31=\"\",\"\",VLOOKUP(BX31,'Liste articles'!#REF!,6,FALSE))","v":""},{"$f":"IF(BY31=\"\",\"\",VLOOKUP(BY31,'Liste articles'!#REF!,6,FALSE))","v":""},{"$f":"IF(BZ31=\"\",\"\",VLOOKUP(BZ31,'Liste articles'!#REF!,6,FALSE))","v":""},{"$f":"IF(CA31=\"\",\"\",VLOOKUP(CA31,'Liste articles'!#REF!,6,FALSE))","v":""},{"$f":"IF(CB31=\"\",\"\",VLOOKUP(CB31,'Liste articles'!#REF!,6,FALSE))","v":""},{"$f":"IF(CC31=\"\",\"\",VLOOKUP(CC31,'Liste articles'!#REF!,6,FALSE))","v":""},{"$f":"IF(CD31=\"\",\"\",VLOOKUP(CD31,'Liste articles'!#REF!,6,FALSE))","v":""},{"$f":"IF(CE31=\"\",\"\",VLOOKUP(CE31,'Liste articles'!#REF!,6,FALSE))","v":""},{"$f":"IF(CF31=\"\",\"\",VLOOKUP(CF31,'Liste articles'!#REF!,6,FALSE))","v":""},{"$f":"IF(CG31=\"\",\"\",VLOOKUP(CG31,'Liste articles'!#REF!,6,FALSE))","v":""},{"$f":"IF(CH31=\"\",\"\",VLOOKUP(CH31,'Liste articles'!#REF!,6,FALSE))","v":""},{"$f":"IF(CI31=\"\",\"\",VLOOKUP(CI31,'Liste articles'!#REF!,6,FALSE))","v":""},{"$f":"IF(CJ31=\"\",\"\",VLOOKUP(CJ31,'Liste articles'!#REF!,6,FALSE))","v":""},{"$f":"IF(CK31=\"\",\"\",VLOOKUP(CK31,'Liste articles'!#REF!,6,FALSE))","v":""},{"$f":"IF(CL31=\"\",\"\",VLOOKUP(CL31,'Liste articles'!#REF!,6,FALSE))","v":""},{"$f":"IF(CM31=\"\",\"\",VLOOKUP(CM31,'Liste articles'!#REF!,6,FALSE))","v":""},{"$f":"IF(CN31=\"\",\"\",VLOOKUP(CN31,'Liste articles'!#REF!,6,FALSE))","v":""},{"$f":"IF(CO31=\"\",\"\",VLOOKUP(CO31,'Liste articles'!#REF!,6,FALSE))","v":""},{"$f":"IF(CP31=\"\",\"\",VLOOKUP(CP31,'Liste articles'!#REF!,6,FALSE))","v":""},{"$f":"IF(CQ31=\"\",\"\",VLOOKUP(CQ31,'Liste articles'!#REF!,6,FALSE))","v":""},{"$f":"IF(CR31=\"\",\"\",VLOOKUP(CR31,'Liste articles'!#REF!,6,FALSE))","v":""},{"$f":"IF(CS31=\"\",\"\",VLOOKUP(CS31,'Liste articles'!#REF!,6,FALSE))","v":""},{"$f":"IF(CT31=\"\",\"\",VLOOKUP(CT31,'Liste articles'!#REF!,6,FALSE))","v":""},{"$f":"IF(CU31=\"\",\"\",VLOOKUP(CU31,'Liste articles'!#REF!,6,FALSE))","v":""},{"$f":"IF(CV31=\"\",\"\",VLOOKUP(CV31,'Liste articles'!#REF!,6,FALSE))","v":""},{"$f":"IF(CW31=\"\",\"\",VLOOKUP(CW31,'Liste articles'!#REF!,6,FALSE))","v":""},{"$f":"IF(CX31=\"\",\"\",VLOOKUP(CX31,'Liste articles'!#REF!,6,FALSE))","v":""},{"$f":"IF(CY31=\"\",\"\",VLOOKUP(CY31,'Liste articles'!#REF!,6,FALSE))","v":""},{"$f":"IF(CZ31=\"\",\"\",VLOOKUP(CZ31,'Liste articles'!#REF!,6,FALSE))","v":""},{"$f":"IF(DA31=\"\",\"\",VLOOKUP(DA31,'Liste articles'!#REF!,6,FALSE))","v":""},{"$f":"IF(DB31=\"\",\"\",VLOOKUP(DB31,'Liste articles'!#REF!,6,FALSE))","v":""},{"$f":"IF(DC31=\"\",\"\",VLOOKUP(DC31,'Liste articles'!#REF!,6,FALSE))","v":""},{"$f":"IF(DD31=\"\",\"\",VLOOKUP(DD31,'Liste articles'!#REF!,6,FALSE))","v":""},{"$f":"IF(DE31=\"\",\"\",VLOOKUP(DE31,'Liste articles'!#REF!,6,FALSE))","v":""},{"$f":"IF(DF31=\"\",\"\",VLOOKUP(DF31,'Liste articles'!#REF!,6,FALSE))","v":""},{"$f":"IF(DG31=\"\",\"\",VLOOKUP(DG31,'Liste articles'!#REF!,6,FALSE))","v":""},{"$f":"IF(DH31=\"\",\"\",VLOOKUP(DH31,'Liste articles'!#REF!,6,FALSE))","v":""},{"$f":"IF(DI31=\"\",\"\",VLOOKUP(DI31,'Liste articles'!#REF!,6,FALSE))","v":""},{"$f":"IF(DJ31=\"\",\"\",VLOOKUP(DJ31,'Liste articles'!#REF!,6,FALSE))","v":""},{"$f":"IF(DK31=\"\",\"\",VLOOKUP(DK31,'Liste articles'!#REF!,6,FALSE))","v":""},{"$f":"IF(DL31=\"\",\"\",VLOOKUP(DL31,'Liste articles'!#REF!,6,FALSE))","v":""},{"$f":"IF(DM31=\"\",\"\",VLOOKUP(DM31,'Liste articles'!#REF!,6,FALSE))","v":""},{"$f":"IF(DN31=\"\",\"\",VLOOKUP(DN31,'Liste articles'!#REF!,6,FALSE))","v":""},{"$f":"IF(DO31=\"\",\"\",VLOOKUP(DO31,'Liste articles'!#REF!,6,FALSE))","v":""},{"$f":"IF(DP31=\"\",\"\",VLOOKUP(DP31,'Liste articles'!#REF!,6,FALSE))","v":""},{"$f":"IF(DQ31=\"\",\"\",VLOOKUP(DQ31,'Liste articles'!#REF!,6,FALSE))","v":""},{"$f":"IF(DR31=\"\",\"\",VLOOKUP(DR31,'Liste articles'!#REF!,6,FALSE))","v":""},{"$f":"IF(DS31=\"\",\"\",VLOOKUP(DS31,'Liste articles'!#REF!,6,FALSE))","v":""},{"$f":"IF(DT31=\"\",\"\",VLOOKUP(DT31,'Liste articles'!#REF!,6,FALSE))","v":""},{"$f":"IF(DU31=\"\",\"\",VLOOKUP(DU31,'Liste articles'!#REF!,6,FALSE))","v":""},{"$f":"IF(DV31=\"\",\"\",VLOOKUP(DV31,'Liste articles'!#REF!,6,FALSE))","v":""},{"$f":"IF(DW31=\"\",\"\",VLOOKUP(DW31,'Liste articles'!#REF!,6,FALSE))","v":""},{"$f":"IF(DX31=\"\",\"\",VLOOKUP(DX31,'Liste articles'!#REF!,6,FALSE))","v":""},{"$f":"IF(DY31=\"\",\"\",VLOOKUP(DY31,'Liste articles'!#REF!,6,FALSE))","v":""},{"$f":"IF(DZ31=\"\",\"\",VLOOKUP(DZ31,'Liste articles'!#REF!,6,FALSE))","v":""},{"$f":"IF(EA31=\"\",\"\",VLOOKUP(EA31,'Liste articles'!#REF!,6,FALSE))","v":""}]
[{"$f":"IF(BL!A31=\"\",\"\",BL!A31)","v":""},null,null,null,{"$f":"IF(BL!E31=\"\",\"\",BL!E31)","v":""},{"$f":"IF(A32=\"\",\"\",VLOOKUP(A32,'Liste articles'!B:M,5,FALSE))","v":""},"",{"$f":"IF(C32=\"\",\"\",VLOOKUP(C32,'Liste articles'!#REF!,6,FALSE))","v":""},null,null,null,null,null,null,null,null,null,null,null,null,null,null,null,null,null,null,null,null,null,null,null,null,null,null,null,null,null,null,null,null,null,null,null,null,null,null,null,null,null,null,null,null,null,null,{"$f":"IF(AX32=\"\",\"\",VLOOKUP(AX32,'Liste articles'!#REF!,6,FALSE))","v":""},{"$f":"IF(AY32=\"\",\"\",VLOOKUP(AY32,'Liste articles'!#REF!,6,FALSE))","v":""},{"$f":"IF(AZ32=\"\",\"\",VLOOKUP(AZ32,'Liste articles'!#REF!,6,FALSE))","v":""},{"$f":"IF(BA32=\"\",\"\",VLOOKUP(BA32,'Liste articles'!#REF!,6,FALSE))","v":""},{"$f":"IF(BB32=\"\",\"\",VLOOKUP(BB32,'Liste articles'!#REF!,6,FALSE))","v":""},{"$f":"IF(BC32=\"\",\"\",VLOOKUP(BC32,'Liste articles'!#REF!,6,FALSE))","v":""},{"$f":"IF(BD32=\"\",\"\",VLOOKUP(BD32,'Liste articles'!#REF!,6,FALSE))","v":""},{"$f":"IF(BE32=\"\",\"\",VLOOKUP(BE32,'Liste articles'!#REF!,6,FALSE))","v":""},{"$f":"IF(BF32=\"\",\"\",VLOOKUP(BF32,'Liste articles'!#REF!,6,FALSE))","v":""},{"$f":"IF(BG32=\"\",\"\",VLOOKUP(BG32,'Liste articles'!#REF!,6,FALSE))","v":""},{"$f":"IF(BH32=\"\",\"\",VLOOKUP(BH32,'Liste articles'!#REF!,6,FALSE))","v":""},{"$f":"IF(BI32=\"\",\"\",VLOOKUP(BI32,'Liste articles'!#REF!,6,FALSE))","v":""},{"$f":"IF(BJ32=\"\",\"\",VLOOKUP(BJ32,'Liste articles'!#REF!,6,FALSE))","v":""},{"$f":"IF(BK32=\"\",\"\",VLOOKUP(BK32,'Liste articles'!#REF!,6,FALSE))","v":""},{"$f":"IF(BL32=\"\",\"\",VLOOKUP(BL32,'Liste articles'!#REF!,6,FALSE))","v":""},{"$f":"IF(BM32=\"\",\"\",VLOOKUP(BM32,'Liste articles'!#REF!,6,FALSE))","v":""},{"$f":"IF(BN32=\"\",\"\",VLOOKUP(BN32,'Liste articles'!#REF!,6,FALSE))","v":""},{"$f":"IF(BO32=\"\",\"\",VLOOKUP(BO32,'Liste articles'!#REF!,6,FALSE))","v":""},{"$f":"IF(BP32=\"\",\"\",VLOOKUP(BP32,'Liste articles'!#REF!,6,FALSE))","v":""},{"$f":"IF(BQ32=\"\",\"\",VLOOKUP(BQ32,'Liste articles'!#REF!,6,FALSE))","v":""},{"$f":"IF(BR32=\"\",\"\",VLOOKUP(BR32,'Liste articles'!#REF!,6,FALSE))","v":""},{"$f":"IF(BS32=\"\",\"\",VLOOKUP(BS32,'Liste articles'!#REF!,6,FALSE))","v":""},{"$f":"IF(BT32=\"\",\"\",VLOOKUP(BT32,'Liste articles'!#REF!,6,FALSE))","v":""},{"$f":"IF(BU32=\"\",\"\",VLOOKUP(BU32,'Liste articles'!#REF!,6,FALSE))","v":""},{"$f":"IF(BV32=\"\",\"\",VLOOKUP(BV32,'Liste articles'!#REF!,6,FALSE))","v":""},{"$f":"IF(BW32=\"\",\"\",VLOOKUP(BW32,'Liste articles'!#REF!,6,FALSE))","v":""},{"$f":"IF(BX32=\"\",\"\",VLOOKUP(BX32,'Liste articles'!#REF!,6,FALSE))","v":""},{"$f":"IF(BY32=\"\",\"\",VLOOKUP(BY32,'Liste articles'!#REF!,6,FALSE))","v":""},{"$f":"IF(BZ32=\"\",\"\",VLOOKUP(BZ32,'Liste articles'!#REF!,6,FALSE))","v":""},{"$f":"IF(CA32=\"\",\"\",VLOOKUP(CA32,'Liste articles'!#REF!,6,FALSE))","v":""},{"$f":"IF(CB32=\"\",\"\",VLOOKUP(CB32,'Liste articles'!#REF!,6,FALSE))","v":""},{"$f":"IF(CC32=\"\",\"\",VLOOKUP(CC32,'Liste articles'!#REF!,6,FALSE))","v":""},{"$f":"IF(CD32=\"\",\"\",VLOOKUP(CD32,'Liste articles'!#REF!,6,FALSE))","v":""},{"$f":"IF(CE32=\"\",\"\",VLOOKUP(CE32,'Liste articles'!#REF!,6,FALSE))","v":""},{"$f":"IF(CF32=\"\",\"\",VLOOKUP(CF32,'Liste articles'!#REF!,6,FALSE))","v":""},{"$f":"IF(CG32=\"\",\"\",VLOOKUP(CG32,'Liste articles'!#REF!,6,FALSE))","v":""},{"$f":"IF(CH32=\"\",\"\",VLOOKUP(CH32,'Liste articles'!#REF!,6,FALSE))","v":""},{"$f":"IF(CI32=\"\",\"\",VLOOKUP(CI32,'Liste articles'!#REF!,6,FALSE))","v":""},{"$f":"IF(CJ32=\"\",\"\",VLOOKUP(CJ32,'Liste articles'!#REF!,6,FALSE))","v":""},{"$f":"IF(CK32=\"\",\"\",VLOOKUP(CK32,'Liste articles'!#REF!,6,FALSE))","v":""},{"$f":"IF(CL32=\"\",\"\",VLOOKUP(CL32,'Liste articles'!#REF!,6,FALSE))","v":""},{"$f":"IF(CM32=\"\",\"\",VLOOKUP(CM32,'Liste articles'!#REF!,6,FALSE))","v":""},{"$f":"IF(CN32=\"\",\"\",VLOOKUP(CN32,'Liste articles'!#REF!,6,FALSE))","v":""},{"$f":"IF(CO32=\"\",\"\",VLOOKUP(CO32,'Liste articles'!#REF!,6,FALSE))","v":""},{"$f":"IF(CP32=\"\",\"\",VLOOKUP(CP32,'Liste articles'!#REF!,6,FALSE))","v":""},{"$f":"IF(CQ32=\"\",\"\",VLOOKUP(CQ32,'Liste articles'!#REF!,6,FALSE))","v":""},{"$f":"IF(CR32=\"\",\"\",VLOOKUP(CR32,'Liste articles'!#REF!,6,FALSE))","v":""},{"$f":"IF(CS32=\"\",\"\",VLOOKUP(CS32,'Liste articles'!#REF!,6,FALSE))","v":""},{"$f":"IF(CT32=\"\",\"\",VLOOKUP(CT32,'Liste articles'!#REF!,6,FALSE))","v":""},{"$f":"IF(CU32=\"\",\"\",VLOOKUP(CU32,'Liste articles'!#REF!,6,FALSE))","v":""},{"$f":"IF(CV32=\"\",\"\",VLOOKUP(CV32,'Liste articles'!#REF!,6,FALSE))","v":""},{"$f":"IF(CW32=\"\",\"\",VLOOKUP(CW32,'Liste articles'!#REF!,6,FALSE))","v":""},{"$f":"IF(CX32=\"\",\"\",VLOOKUP(CX32,'Liste articles'!#REF!,6,FALSE))","v":""},{"$f":"IF(CY32=\"\",\"\",VLOOKUP(CY32,'Liste articles'!#REF!,6,FALSE))","v":""},{"$f":"IF(CZ32=\"\",\"\",VLOOKUP(CZ32,'Liste articles'!#REF!,6,FALSE))","v":""},{"$f":"IF(DA32=\"\",\"\",VLOOKUP(DA32,'Liste articles'!#REF!,6,FALSE))","v":""},{"$f":"IF(DB32=\"\",\"\",VLOOKUP(DB32,'Liste articles'!#REF!,6,FALSE))","v":""},{"$f":"IF(DC32=\"\",\"\",VLOOKUP(DC32,'Liste articles'!#REF!,6,FALSE))","v":""},{"$f":"IF(DD32=\"\",\"\",VLOOKUP(DD32,'Liste articles'!#REF!,6,FALSE))","v":""},{"$f":"IF(DE32=\"\",\"\",VLOOKUP(DE32,'Liste articles'!#REF!,6,FALSE))","v":""},{"$f":"IF(DF32=\"\",\"\",VLOOKUP(DF32,'Liste articles'!#REF!,6,FALSE))","v":""},{"$f":"IF(DG32=\"\",\"\",VLOOKUP(DG32,'Liste articles'!#REF!,6,FALSE))","v":""},{"$f":"IF(DH32=\"\",\"\",VLOOKUP(DH32,'Liste articles'!#REF!,6,FALSE))","v":""},{"$f":"IF(DI32=\"\",\"\",VLOOKUP(DI32,'Liste articles'!#REF!,6,FALSE))","v":""},{"$f":"IF(DJ32=\"\",\"\",VLOOKUP(DJ32,'Liste articles'!#REF!,6,FALSE))","v":""},{"$f":"IF(DK32=\"\",\"\",VLOOKUP(DK32,'Liste articles'!#REF!,6,FALSE))","v":""},{"$f":"IF(DL32=\"\",\"\",VLOOKUP(DL32,'Liste articles'!#REF!,6,FALSE))","v":""},{"$f":"IF(DM32=\"\",\"\",VLOOKUP(DM32,'Liste articles'!#REF!,6,FALSE))","v":""},{"$f":"IF(DN32=\"\",\"\",VLOOKUP(DN32,'Liste articles'!#REF!,6,FALSE))","v":""},{"$f":"IF(DO32=\"\",\"\",VLOOKUP(DO32,'Liste articles'!#REF!,6,FALSE))","v":""},{"$f":"IF(DP32=\"\",\"\",VLOOKUP(DP32,'Liste articles'!#REF!,6,FALSE))","v":""},{"$f":"IF(DQ32=\"\",\"\",VLOOKUP(DQ32,'Liste articles'!#REF!,6,FALSE))","v":""},{"$f":"IF(DR32=\"\",\"\",VLOOKUP(DR32,'Liste articles'!#REF!,6,FALSE))","v":""},{"$f":"IF(DS32=\"\",\"\",VLOOKUP(DS32,'Liste articles'!#REF!,6,FALSE))","v":""},{"$f":"IF(DT32=\"\",\"\",VLOOKUP(DT32,'Liste articles'!#REF!,6,FALSE))","v":""},{"$f":"IF(DU32=\"\",\"\",VLOOKUP(DU32,'Liste articles'!#REF!,6,FALSE))","v":""},{"$f":"IF(DV32=\"\",\"\",VLOOKUP(DV32,'Liste articles'!#REF!,6,FALSE))","v":""},{"$f":"IF(DW32=\"\",\"\",VLOOKUP(DW32,'Liste articles'!#REF!,6,FALSE))","v":""},{"$f":"IF(DX32=\"\",\"\",VLOOKUP(DX32,'Liste articles'!#REF!,6,FALSE))","v":""},{"$f":"IF(DY32=\"\",\"\",VLOOKUP(DY32,'Liste articles'!#REF!,6,FALSE))","v":""},{"$f":"IF(DZ32=\"\",\"\",VLOOKUP(DZ32,'Liste articles'!#REF!,6,FALSE))","v":""},{"$f":"IF(EA32=\"\",\"\",VLOOKUP(EA32,'Liste articles'!#REF!,6,FALSE))","v":""}]
[{"$f":"IF(BL!A32=\"\",\"\",BL!A32)","v":""},null,null,null,{"$f":"IF(BL!E32=\"\",\"\",BL!E32)","v":""},{"$f":"IF(A33=\"\",\"\",VLOOKUP(A33,'Liste articles'!B:M,5,FALSE))","v":""},"",{"$f":"IF(C33=\"\",\"\",VLOOKUP(C33,'Liste articles'!#REF!,6,FALSE))","v":""},null,null,null,null,null,null,null,null,null,null,null,null,null,null,null,null,null,null,null,null,null,null,null,null,null,null,null,null,null,null,null,null,null,null,null,null,null,null,null,null,null,null,null,null,null,null,{"$f":"IF(AX33=\"\",\"\",VLOOKUP(AX33,'Liste articles'!#REF!,6,FALSE))","v":""},{"$f":"IF(AY33=\"\",\"\",VLOOKUP(AY33,'Liste articles'!#REF!,6,FALSE))","v":""},{"$f":"IF(AZ33=\"\",\"\",VLOOKUP(AZ33,'Liste articles'!#REF!,6,FALSE))","v":""},{"$f":"IF(BA33=\"\",\"\",VLOOKUP(BA33,'Liste articles'!#REF!,6,FALSE))","v":""},{"$f":"IF(BB33=\"\",\"\",VLOOKUP(BB33,'Liste articles'!#REF!,6,FALSE))","v":""},{"$f":"IF(BC33=\"\",\"\",VLOOKUP(BC33,'Liste articles'!#REF!,6,FALSE))","v":""},{"$f":"IF(BD33=\"\",\"\",VLOOKUP(BD33,'Liste articles'!#REF!,6,FALSE))","v":""},{"$f":"IF(BE33=\"\",\"\",VLOOKUP(BE33,'Liste articles'!#REF!,6,FALSE))","v":""},{"$f":"IF(BF33=\"\",\"\",VLOOKUP(BF33,'Liste articles'!#REF!,6,FALSE))","v":""},{"$f":"IF(BG33=\"\",\"\",VLOOKUP(BG33,'Liste articles'!#REF!,6,FALSE))","v":""},{"$f":"IF(BH33=\"\",\"\",VLOOKUP(BH33,'Liste articles'!#REF!,6,FALSE))","v":""},{"$f":"IF(BI33=\"\",\"\",VLOOKUP(BI33,'Liste articles'!#REF!,6,FALSE))","v":""},{"$f":"IF(BJ33=\"\",\"\",VLOOKUP(BJ33,'Liste articles'!#REF!,6,FALSE))","v":""},{"$f":"IF(BK33=\"\",\"\",VLOOKUP(BK33,'Liste articles'!#REF!,6,FALSE))","v":""},{"$f":"IF(BL33=\"\",\"\",VLOOKUP(BL33,'Liste articles'!#REF!,6,FALSE))","v":""},{"$f":"IF(BM33=\"\",\"\",VLOOKUP(BM33,'Liste articles'!#REF!,6,FALSE))","v":""},{"$f":"IF(BN33=\"\",\"\",VLOOKUP(BN33,'Liste articles'!#REF!,6,FALSE))","v":""},{"$f":"IF(BO33=\"\",\"\",VLOOKUP(BO33,'Liste articles'!#REF!,6,FALSE))","v":""},{"$f":"IF(BP33=\"\",\"\",VLOOKUP(BP33,'Liste articles'!#REF!,6,FALSE))","v":""},{"$f":"IF(BQ33=\"\",\"\",VLOOKUP(BQ33,'Liste articles'!#REF!,6,FALSE))","v":""},{"$f":"IF(BR33=\"\",\"\",VLOOKUP(BR33,'Liste articles'!#REF!,6,FALSE))","v":""},{"$f":"IF(BS33=\"\",\"\",VLOOKUP(BS33,'Liste articles'!#REF!,6,FALSE))","v":""},{"$f":"IF(BT33=\"\",\"\",VLOOKUP(BT33,'Liste articles'!#REF!,6,FALSE))","v":""},{"$f":"IF(BU33=\"\",\"\",VLOOKUP(BU33,'Liste articles'!#REF!,6,FALSE))","v":""},{"$f":"IF(BV33=\"\",\"\",VLOOKUP(BV33,'Liste articles'!#REF!,6,FALSE))","v":""},{"$f":"IF(BW33=\"\",\"\",VLOOKUP(BW33,'Liste articles'!#REF!,6,FALSE))","v":""},{"$f":"IF(BX33=\"\",\"\",VLOOKUP(BX33,'Liste articles'!#REF!,6,FALSE))","v":""},{"$f":"IF(BY33=\"\",\"\",VLOOKUP(BY33,'Liste articles'!#REF!,6,FALSE))","v":""},{"$f":"IF(BZ33=\"\",\"\",VLOOKUP(BZ33,'Liste articles'!#REF!,6,FALSE))","v":""},{"$f":"IF(CA33=\"\",\"\",VLOOKUP(CA33,'Liste articles'!#REF!,6,FALSE))","v":""},{"$f":"IF(CB33=\"\",\"\",VLOOKUP(CB33,'Liste articles'!#REF!,6,FALSE))","v":""},{"$f":"IF(CC33=\"\",\"\",VLOOKUP(CC33,'Liste articles'!#REF!,6,FALSE))","v":""},{"$f":"IF(CD33=\"\",\"\",VLOOKUP(CD33,'Liste articles'!#REF!,6,FALSE))","v":""},{"$f":"IF(CE33=\"\",\"\",VLOOKUP(CE33,'Liste articles'!#REF!,6,FALSE))","v":""},{"$f":"IF(CF33=\"\",\"\",VLOOKUP(CF33,'Liste articles'!#REF!,6,FALSE))","v":""},{"$f":"IF(CG33=\"\",\"\",VLOOKUP(CG33,'Liste articles'!#REF!,6,FALSE))","v":""},{"$f":"IF(CH33=\"\",\"\",VLOOKUP(CH33,'Liste articles'!#REF!,6,FALSE))","v":""},{"$f":"IF(CI33=\"\",\"\",VLOOKUP(CI33,'Liste articles'!#REF!,6,FALSE))","v":""},{"$f":"IF(CJ33=\"\",\"\",VLOOKUP(CJ33,'Liste articles'!#REF!,6,FALSE))","v":""},{"$f":"IF(CK33=\"\",\"\",VLOOKUP(CK33,'Liste articles'!#REF!,6,FALSE))","v":""},{"$f":"IF(CL33=\"\",\"\",VLOOKUP(CL33,'Liste articles'!#REF!,6,FALSE))","v":""},{"$f":"IF(CM33=\"\",\"\",VLOOKUP(CM33,'Liste articles'!#REF!,6,FALSE))","v":""},{"$f":"IF(CN33=\"\",\"\",VLOOKUP(CN33,'Liste articles'!#REF!,6,FALSE))","v":""},{"$f":"IF(CO33=\"\",\"\",VLOOKUP(CO33,'Liste articles'!#REF!,6,FALSE))","v":""},{"$f":"IF(CP33=\"\",\"\",VLOOKUP(CP33,'Liste articles'!#REF!,6,FALSE))","v":""},{"$f":"IF(CQ33=\"\",\"\",VLOOKUP(CQ33,'Liste articles'!#REF!,6,FALSE))","v":""},{"$f":"IF(CR33=\"\",\"\",VLOOKUP(CR33,'Liste articles'!#REF!,6,FALSE))","v":""},{"$f":"IF(CS33=\"\",\"\",VLOOKUP(CS33,'Liste articles'!#REF!,6,FALSE))","v":""},{"$f":"IF(CT33=\"\",\"\",VLOOKUP(CT33,'Liste articles'!#REF!,6,FALSE))","v":""},{"$f":"IF(CU33=\"\",\"\",VLOOKUP(CU33,'Liste articles'!#REF!,6,FALSE))","v":""},{"$f":"IF(CV33=\"\",\"\",VLOOKUP(CV33,'Liste articles'!#REF!,6,FALSE))","v":""},{"$f":"IF(CW33=\"\",\"\",VLOOKUP(CW33,'Liste articles'!#REF!,6,FALSE))","v":""},{"$f":"IF(CX33=\"\",\"\",VLOOKUP(CX33,'Liste articles'!#REF!,6,FALSE))","v":""},{"$f":"IF(CY33=\"\",\"\",VLOOKUP(CY33,'Liste articles'!#REF!,6,FALSE))","v":""},{"$f":"IF(CZ33=\"\",\"\",VLOOKUP(CZ33,'Liste articles'!#REF!,6,FALSE))","v":""},{"$f":"IF(DA33=\"\",\"\",VLOOKUP(DA33,'Liste articles'!#REF!,6,FALSE))","v":""},{"$f":"IF(DB33=\"\",\"\",VLOOKUP(DB33,'Liste articles'!#REF!,6,FALSE))","v":""},{"$f":"IF(DC33=\"\",\"\",VLOOKUP(DC33,'Liste articles'!#REF!,6,FALSE))","v":""},{"$f":"IF(DD33=\"\",\"\",VLOOKUP(DD33,'Liste articles'!#REF!,6,FALSE))","v":""},{"$f":"IF(DE33=\"\",\"\",VLOOKUP(DE33,'Liste articles'!#REF!,6,FALSE))","v":""},{"$f":"IF(DF33=\"\",\"\",VLOOKUP(DF33,'Liste articles'!#REF!,6,FALSE))","v":""},{"$f":"IF(DG33=\"\",\"\",VLOOKUP(DG33,'Liste articles'!#REF!,6,FALSE))","v":""},{"$f":"IF(DH33=\"\",\"\",VLOOKUP(DH33,'Liste articles'!#REF!,6,FALSE))","v":""},{"$f":"IF(DI33=\"\",\"\",VLOOKUP(DI33,'Liste articles'!#REF!,6,FALSE))","v":""},{"$f":"IF(DJ33=\"\",\"\",VLOOKUP(DJ33,'Liste articles'!#REF!,6,FALSE))","v":""},{"$f":"IF(DK33=\"\",\"\",VLOOKUP(DK33,'Liste articles'!#REF!,6,FALSE))","v":""},{"$f":"IF(DL33=\"\",\"\",VLOOKUP(DL33,'Liste articles'!#REF!,6,FALSE))","v":""},{"$f":"IF(DM33=\"\",\"\",VLOOKUP(DM33,'Liste articles'!#REF!,6,FALSE))","v":""},{"$f":"IF(DN33=\"\",\"\",VLOOKUP(DN33,'Liste articles'!#REF!,6,FALSE))","v":""},{"$f":"IF(DO33=\"\",\"\",VLOOKUP(DO33,'Liste articles'!#REF!,6,FALSE))","v":""},{"$f":"IF(DP33=\"\",\"\",VLOOKUP(DP33,'Liste articles'!#REF!,6,FALSE))","v":""},{"$f":"IF(DQ33=\"\",\"\",VLOOKUP(DQ33,'Liste articles'!#REF!,6,FALSE))","v":""},{"$f":"IF(DR33=\"\",\"\",VLOOKUP(DR33,'Liste articles'!#REF!,6,FALSE))","v":""},{"$f":"IF(DS33=\"\",\"\",VLOOKUP(DS33,'Liste articles'!#REF!,6,FALSE))","v":""},{"$f":"IF(DT33=\"\",\"\",VLOOKUP(DT33,'Liste articles'!#REF!,6,FALSE))","v":""},{"$f":"IF(DU33=\"\",\"\",VLOOKUP(DU33,'Liste articles'!#REF!,6,FALSE))","v":""},{"$f":"IF(DV33=\"\",\"\",VLOOKUP(DV33,'Liste articles'!#REF!,6,FALSE))","v":""},{"$f":"IF(DW33=\"\",\"\",VLOOKUP(DW33,'Liste articles'!#REF!,6,FALSE))","v":""},{"$f":"IF(DX33=\"\",\"\",VLOOKUP(DX33,'Liste articles'!#REF!,6,FALSE))","v":""},{"$f":"IF(DY33=\"\",\"\",VLOOKUP(DY33,'Liste articles'!#REF!,6,FALSE))","v":""},{"$f":"IF(DZ33=\"\",\"\",VLOOKUP(DZ33,'Liste articles'!#REF!,6,FALSE))","v":""},{"$f":"IF(EA33=\"\",\"\",VLOOKUP(EA33,'Liste articles'!#REF!,6,FALSE))","v":""}]
[{"$f":"IF(BL!A33=\"\",\"\",BL!A33)","v":""},null,null,null,{"$f":"IF(BL!E33=\"\",\"\",BL!E33)","v":""},{"$f":"IF(A34=\"\",\"\",VLOOKUP(A34,'Liste articles'!B:M,5,FALSE))","v":""},"",{"$f":"IF(C34=\"\",\"\",VLOOKUP(C34,'Liste articles'!#REF!,6,FALSE))","v":""},null,null,null,null,null,null,null,null,null,null,null,null,null,null,null,null,null,null,null,null,null,null,null,null,null,null,null,null,null,null,null,null,null,null,null,null,null,null,null,null,null,null,null,null,null,null,{"$f":"IF(AX34=\"\",\"\",VLOOKUP(AX34,'Liste articles'!#REF!,6,FALSE))","v":""},{"$f":"IF(AY34=\"\",\"\",VLOOKUP(AY34,'Liste articles'!#REF!,6,FALSE))","v":""},{"$f":"IF(AZ34=\"\",\"\",VLOOKUP(AZ34,'Liste articles'!#REF!,6,FALSE))","v":""},{"$f":"IF(BA34=\"\",\"\",VLOOKUP(BA34,'Liste articles'!#REF!,6,FALSE))","v":""},{"$f":"IF(BB34=\"\",\"\",VLOOKUP(BB34,'Liste articles'!#REF!,6,FALSE))","v":""},{"$f":"IF(BC34=\"\",\"\",VLOOKUP(BC34,'Liste articles'!#REF!,6,FALSE))","v":""},{"$f":"IF(BD34=\"\",\"\",VLOOKUP(BD34,'Liste articles'!#REF!,6,FALSE))","v":""},{"$f":"IF(BE34=\"\",\"\",VLOOKUP(BE34,'Liste articles'!#REF!,6,FALSE))","v":""},{"$f":"IF(BF34=\"\",\"\",VLOOKUP(BF34,'Liste articles'!#REF!,6,FALSE))","v":""},{"$f":"IF(BG34=\"\",\"\",VLOOKUP(BG34,'Liste articles'!#REF!,6,FALSE))","v":""},{"$f":"IF(BH34=\"\",\"\",VLOOKUP(BH34,'Liste articles'!#REF!,6,FALSE))","v":""},{"$f":"IF(BI34=\"\",\"\",VLOOKUP(BI34,'Liste articles'!#REF!,6,FALSE))","v":""},{"$f":"IF(BJ34=\"\",\"\",VLOOKUP(BJ34,'Liste articles'!#REF!,6,FALSE))","v":""},{"$f":"IF(BK34=\"\",\"\",VLOOKUP(BK34,'Liste articles'!#REF!,6,FALSE))","v":""},{"$f":"IF(BL34=\"\",\"\",VLOOKUP(BL34,'Liste articles'!#REF!,6,FALSE))","v":""},{"$f":"IF(BM34=\"\",\"\",VLOOKUP(BM34,'Liste articles'!#REF!,6,FALSE))","v":""},{"$f":"IF(BN34=\"\",\"\",VLOOKUP(BN34,'Liste articles'!#REF!,6,FALSE))","v":""},{"$f":"IF(BO34=\"\",\"\",VLOOKUP(BO34,'Liste articles'!#REF!,6,FALSE))","v":""},{"$f":"IF(BP34=\"\",\"\",VLOOKUP(BP34,'Liste articles'!#REF!,6,FALSE))","v":""},{"$f":"IF(BQ34=\"\",\"\",VLOOKUP(BQ34,'Liste articles'!#REF!,6,FALSE))","v":""},{"$f":"IF(BR34=\"\",\"\",VLOOKUP(BR34,'Liste articles'!#REF!,6,FALSE))","v":""},{"$f":"IF(BS34=\"\",\"\",VLOOKUP(BS34,'Liste articles'!#REF!,6,FALSE))","v":""},{"$f":"IF(BT34=\"\",\"\",VLOOKUP(BT34,'Liste articles'!#REF!,6,FALSE))","v":""},{"$f":"IF(BU34=\"\",\"\",VLOOKUP(BU34,'Liste articles'!#REF!,6,FALSE))","v":""},{"$f":"IF(BV34=\"\",\"\",VLOOKUP(BV34,'Liste articles'!#REF!,6,FALSE))","v":""},{"$f":"IF(BW34=\"\",\"\",VLOOKUP(BW34,'Liste articles'!#REF!,6,FALSE))","v":""},{"$f":"IF(BX34=\"\",\"\",VLOOKUP(BX34,'Liste articles'!#REF!,6,FALSE))","v":""},{"$f":"IF(BY34=\"\",\"\",VLOOKUP(BY34,'Liste articles'!#REF!,6,FALSE))","v":""},{"$f":"IF(BZ34=\"\",\"\",VLOOKUP(BZ34,'Liste articles'!#REF!,6,FALSE))","v":""},{"$f":"IF(CA34=\"\",\"\",VLOOKUP(CA34,'Liste articles'!#REF!,6,FALSE))","v":""},{"$f":"IF(CB34=\"\",\"\",VLOOKUP(CB34,'Liste articles'!#REF!,6,FALSE))","v":""},{"$f":"IF(CC34=\"\",\"\",VLOOKUP(CC34,'Liste articles'!#REF!,6,FALSE))","v":""},{"$f":"IF(CD34=\"\",\"\",VLOOKUP(CD34,'Liste articles'!#REF!,6,FALSE))","v":""},{"$f":"IF(CE34=\"\",\"\",VLOOKUP(CE34,'Liste articles'!#REF!,6,FALSE))","v":""},{"$f":"IF(CF34=\"\",\"\",VLOOKUP(CF34,'Liste articles'!#REF!,6,FALSE))","v":""},{"$f":"IF(CG34=\"\",\"\",VLOOKUP(CG34,'Liste articles'!#REF!,6,FALSE))","v":""},{"$f":"IF(CH34=\"\",\"\",VLOOKUP(CH34,'Liste articles'!#REF!,6,FALSE))","v":""},{"$f":"IF(CI34=\"\",\"\",VLOOKUP(CI34,'Liste articles'!#REF!,6,FALSE))","v":""},{"$f":"IF(CJ34=\"\",\"\",VLOOKUP(CJ34,'Liste articles'!#REF!,6,FALSE))","v":""},{"$f":"IF(CK34=\"\",\"\",VLOOKUP(CK34,'Liste articles'!#REF!,6,FALSE))","v":""},{"$f":"IF(CL34=\"\",\"\",VLOOKUP(CL34,'Liste articles'!#REF!,6,FALSE))","v":""},{"$f":"IF(CM34=\"\",\"\",VLOOKUP(CM34,'Liste articles'!#REF!,6,FALSE))","v":""},{"$f":"IF(CN34=\"\",\"\",VLOOKUP(CN34,'Liste articles'!#REF!,6,FALSE))","v":""},{"$f":"IF(CO34=\"\",\"\",VLOOKUP(CO34,'Liste articles'!#REF!,6,FALSE))","v":""},{"$f":"IF(CP34=\"\",\"\",VLOOKUP(CP34,'Liste articles'!#REF!,6,FALSE))","v":""},{"$f":"IF(CQ34=\"\",\"\",VLOOKUP(CQ34,'Liste articles'!#REF!,6,FALSE))","v":""},{"$f":"IF(CR34=\"\",\"\",VLOOKUP(CR34,'Liste articles'!#REF!,6,FALSE))","v":""},{"$f":"IF(CS34=\"\",\"\",VLOOKUP(CS34,'Liste articles'!#REF!,6,FALSE))","v":""},{"$f":"IF(CT34=\"\",\"\",VLOOKUP(CT34,'Liste articles'!#REF!,6,FALSE))","v":""},{"$f":"IF(CU34=\"\",\"\",VLOOKUP(CU34,'Liste articles'!#REF!,6,FALSE))","v":""},{"$f":"IF(CV34=\"\",\"\",VLOOKUP(CV34,'Liste articles'!#REF!,6,FALSE))","v":""},{"$f":"IF(CW34=\"\",\"\",VLOOKUP(CW34,'Liste articles'!#REF!,6,FALSE))","v":""},{"$f":"IF(CX34=\"\",\"\",VLOOKUP(CX34,'Liste articles'!#REF!,6,FALSE))","v":""},{"$f":"IF(CY34=\"\",\"\",VLOOKUP(CY34,'Liste articles'!#REF!,6,FALSE))","v":""},{"$f":"IF(CZ34=\"\",\"\",VLOOKUP(CZ34,'Liste articles'!#REF!,6,FALSE))","v":""},{"$f":"IF(DA34=\"\",\"\",VLOOKUP(DA34,'Liste articles'!#REF!,6,FALSE))","v":""},{"$f":"IF(DB34=\"\",\"\",VLOOKUP(DB34,'Liste articles'!#REF!,6,FALSE))","v":""},{"$f":"IF(DC34=\"\",\"\",VLOOKUP(DC34,'Liste articles'!#REF!,6,FALSE))","v":""},{"$f":"IF(DD34=\"\",\"\",VLOOKUP(DD34,'Liste articles'!#REF!,6,FALSE))","v":""},{"$f":"IF(DE34=\"\",\"\",VLOOKUP(DE34,'Liste articles'!#REF!,6,FALSE))","v":""},{"$f":"IF(DF34=\"\",\"\",VLOOKUP(DF34,'Liste articles'!#REF!,6,FALSE))","v":""},{"$f":"IF(DG34=\"\",\"\",VLOOKUP(DG34,'Liste articles'!#REF!,6,FALSE))","v":""},{"$f":"IF(DH34=\"\",\"\",VLOOKUP(DH34,'Liste articles'!#REF!,6,FALSE))","v":""},{"$f":"IF(DI34=\"\",\"\",VLOOKUP(DI34,'Liste articles'!#REF!,6,FALSE))","v":""},{"$f":"IF(DJ34=\"\",\"\",VLOOKUP(DJ34,'Liste articles'!#REF!,6,FALSE))","v":""},{"$f":"IF(DK34=\"\",\"\",VLOOKUP(DK34,'Liste articles'!#REF!,6,FALSE))","v":""},{"$f":"IF(DL34=\"\",\"\",VLOOKUP(DL34,'Liste articles'!#REF!,6,FALSE))","v":""},{"$f":"IF(DM34=\"\",\"\",VLOOKUP(DM34,'Liste articles'!#REF!,6,FALSE))","v":""},{"$f":"IF(DN34=\"\",\"\",VLOOKUP(DN34,'Liste articles'!#REF!,6,FALSE))","v":""},{"$f":"IF(DO34=\"\",\"\",VLOOKUP(DO34,'Liste articles'!#REF!,6,FALSE))","v":""},{"$f":"IF(DP34=\"\",\"\",VLOOKUP(DP34,'Liste articles'!#REF!,6,FALSE))","v":""},{"$f":"IF(DQ34=\"\",\"\",VLOOKUP(DQ34,'Liste articles'!#REF!,6,FALSE))","v":""},{"$f":"IF(DR34=\"\",\"\",VLOOKUP(DR34,'Liste articles'!#REF!,6,FALSE))","v":""},{"$f":"IF(DS34=\"\",\"\",VLOOKUP(DS34,'Liste articles'!#REF!,6,FALSE))","v":""},{"$f":"IF(DT34=\"\",\"\",VLOOKUP(DT34,'Liste articles'!#REF!,6,FALSE))","v":""},{"$f":"IF(DU34=\"\",\"\",VLOOKUP(DU34,'Liste articles'!#REF!,6,FALSE))","v":""},{"$f":"IF(DV34=\"\",\"\",VLOOKUP(DV34,'Liste articles'!#REF!,6,FALSE))","v":""},{"$f":"IF(DW34=\"\",\"\",VLOOKUP(DW34,'Liste articles'!#REF!,6,FALSE))","v":""},{"$f":"IF(DX34=\"\",\"\",VLOOKUP(DX34,'Liste articles'!#REF!,6,FALSE))","v":""},{"$f":"IF(DY34=\"\",\"\",VLOOKUP(DY34,'Liste articles'!#REF!,6,FALSE))","v":""},{"$f":"IF(DZ34=\"\",\"\",VLOOKUP(DZ34,'Liste articles'!#REF!,6,FALSE))","v":""},{"$f":"IF(EA34=\"\",\"\",VLOOKUP(EA34,'Liste articles'!#REF!,6,FALSE))","v":""}]
[{"$f":"IF(BL!A34=\"\",\"\",BL!A34)","v":""},null,null,null,{"$f":"IF(BL!E34=\"\",\"\",BL!E34)","v":""},{"$f":"IF(A35=\"\",\"\",VLOOKUP(A35,'Liste articles'!B:M,5,FALSE))","v":""},"",{"$f":"IF(C35=\"\",\"\",VLOOKUP(C35,'Liste articles'!#REF!,6,FALSE))","v":""},null,null,null,null,null,null,null,null,null,null,null,null,null,null,null,null,null,null,null,null,null,null,null,null,null,null,null,null,null,null,null,null,null,null,null,null,null,null,null,null,null,null,null,null,null,null,{"$f":"IF(AX35=\"\",\"\",VLOOKUP(AX35,'Liste articles'!#REF!,6,FALSE))","v":""},{"$f":"IF(AY35=\"\",\"\",VLOOKUP(AY35,'Liste articles'!#REF!,6,FALSE))","v":""},{"$f":"IF(AZ35=\"\",\"\",VLOOKUP(AZ35,'Liste articles'!#REF!,6,FALSE))","v":""},{"$f":"IF(BA35=\"\",\"\",VLOOKUP(BA35,'Liste articles'!#REF!,6,FALSE))","v":""},{"$f":"IF(BB35=\"\",\"\",VLOOKUP(BB35,'Liste articles'!#REF!,6,FALSE))","v":""},{"$f":"IF(BC35=\"\",\"\",VLOOKUP(BC35,'Liste articles'!#REF!,6,FALSE))","v":""},{"$f":"IF(BD35=\"\",\"\",VLOOKUP(BD35,'Liste articles'!#REF!,6,FALSE))","v":""},{"$f":"IF(BE35=\"\",\"\",VLOOKUP(BE35,'Liste articles'!#REF!,6,FALSE))","v":""},{"$f":"IF(BF35=\"\",\"\",VLOOKUP(BF35,'Liste articles'!#REF!,6,FALSE))","v":""},{"$f":"IF(BG35=\"\",\"\",VLOOKUP(BG35,'Liste articles'!#REF!,6,FALSE))","v":""},{"$f":"IF(BH35=\"\",\"\",VLOOKUP(BH35,'Liste articles'!#REF!,6,FALSE))","v":""},{"$f":"IF(BI35=\"\",\"\",VLOOKUP(BI35,'Liste articles'!#REF!,6,FALSE))","v":""},{"$f":"IF(BJ35=\"\",\"\",VLOOKUP(BJ35,'Liste articles'!#REF!,6,FALSE))","v":""},{"$f":"IF(BK35=\"\",\"\",VLOOKUP(BK35,'Liste articles'!#REF!,6,FALSE))","v":""},{"$f":"IF(BL35=\"\",\"\",VLOOKUP(BL35,'Liste articles'!#REF!,6,FALSE))","v":""},{"$f":"IF(BM35=\"\",\"\",VLOOKUP(BM35,'Liste articles'!#REF!,6,FALSE))","v":""},{"$f":"IF(BN35=\"\",\"\",VLOOKUP(BN35,'Liste articles'!#REF!,6,FALSE))","v":""},{"$f":"IF(BO35=\"\",\"\",VLOOKUP(BO35,'Liste articles'!#REF!,6,FALSE))","v":""},{"$f":"IF(BP35=\"\",\"\",VLOOKUP(BP35,'Liste articles'!#REF!,6,FALSE))","v":""},{"$f":"IF(BQ35=\"\",\"\",VLOOKUP(BQ35,'Liste articles'!#REF!,6,FALSE))","v":""},{"$f":"IF(BR35=\"\",\"\",VLOOKUP(BR35,'Liste articles'!#REF!,6,FALSE))","v":""},{"$f":"IF(BS35=\"\",\"\",VLOOKUP(BS35,'Liste articles'!#REF!,6,FALSE))","v":""},{"$f":"IF(BT35=\"\",\"\",VLOOKUP(BT35,'Liste articles'!#REF!,6,FALSE))","v":""},{"$f":"IF(BU35=\"\",\"\",VLOOKUP(BU35,'Liste articles'!#REF!,6,FALSE))","v":""},{"$f":"IF(BV35=\"\",\"\",VLOOKUP(BV35,'Liste articles'!#REF!,6,FALSE))","v":""},{"$f":"IF(BW35=\"\",\"\",VLOOKUP(BW35,'Liste articles'!#REF!,6,FALSE))","v":""},{"$f":"IF(BX35=\"\",\"\",VLOOKUP(BX35,'Liste articles'!#REF!,6,FALSE))","v":""},{"$f":"IF(BY35=\"\",\"\",VLOOKUP(BY35,'Liste articles'!#REF!,6,FALSE))","v":""},{"$f":"IF(BZ35=\"\",\"\",VLOOKUP(BZ35,'Liste articles'!#REF!,6,FALSE))","v":""},{"$f":"IF(CA35=\"\",\"\",VLOOKUP(CA35,'Liste articles'!#REF!,6,FALSE))","v":""},{"$f":"IF(CB35=\"\",\"\",VLOOKUP(CB35,'Liste articles'!#REF!,6,FALSE))","v":""},{"$f":"IF(CC35=\"\",\"\",VLOOKUP(CC35,'Liste articles'!#REF!,6,FALSE))","v":""},{"$f":"IF(CD35=\"\",\"\",VLOOKUP(CD35,'Liste articles'!#REF!,6,FALSE))","v":""},{"$f":"IF(CE35=\"\",\"\",VLOOKUP(CE35,'Liste articles'!#REF!,6,FALSE))","v":""},{"$f":"IF(CF35=\"\",\"\",VLOOKUP(CF35,'Liste articles'!#REF!,6,FALSE))","v":""},{"$f":"IF(CG35=\"\",\"\",VLOOKUP(CG35,'Liste articles'!#REF!,6,FALSE))","v":""},{"$f":"IF(CH35=\"\",\"\",VLOOKUP(CH35,'Liste articles'!#REF!,6,FALSE))","v":""},{"$f":"IF(CI35=\"\",\"\",VLOOKUP(CI35,'Liste articles'!#REF!,6,FALSE))","v":""},{"$f":"IF(CJ35=\"\",\"\",VLOOKUP(CJ35,'Liste articles'!#REF!,6,FALSE))","v":""},{"$f":"IF(CK35=\"\",\"\",VLOOKUP(CK35,'Liste articles'!#REF!,6,FALSE))","v":""},{"$f":"IF(CL35=\"\",\"\",VLOOKUP(CL35,'Liste articles'!#REF!,6,FALSE))","v":""},{"$f":"IF(CM35=\"\",\"\",VLOOKUP(CM35,'Liste articles'!#REF!,6,FALSE))","v":""},{"$f":"IF(CN35=\"\",\"\",VLOOKUP(CN35,'Liste articles'!#REF!,6,FALSE))","v":""},{"$f":"IF(CO35=\"\",\"\",VLOOKUP(CO35,'Liste articles'!#REF!,6,FALSE))","v":""},{"$f":"IF(CP35=\"\",\"\",VLOOKUP(CP35,'Liste articles'!#REF!,6,FALSE))","v":""},{"$f":"IF(CQ35=\"\",\"\",VLOOKUP(CQ35,'Liste articles'!#REF!,6,FALSE))","v":""},{"$f":"IF(CR35=\"\",\"\",VLOOKUP(CR35,'Liste articles'!#REF!,6,FALSE))","v":""},{"$f":"IF(CS35=\"\",\"\",VLOOKUP(CS35,'Liste articles'!#REF!,6,FALSE))","v":""},{"$f":"IF(CT35=\"\",\"\",VLOOKUP(CT35,'Liste articles'!#REF!,6,FALSE))","v":""},{"$f":"IF(CU35=\"\",\"\",VLOOKUP(CU35,'Liste articles'!#REF!,6,FALSE))","v":""},{"$f":"IF(CV35=\"\",\"\",VLOOKUP(CV35,'Liste articles'!#REF!,6,FALSE))","v":""},{"$f":"IF(CW35=\"\",\"\",VLOOKUP(CW35,'Liste articles'!#REF!,6,FALSE))","v":""},{"$f":"IF(CX35=\"\",\"\",VLOOKUP(CX35,'Liste articles'!#REF!,6,FALSE))","v":""},{"$f":"IF(CY35=\"\",\"\",VLOOKUP(CY35,'Liste articles'!#REF!,6,FALSE))","v":""},{"$f":"IF(CZ35=\"\",\"\",VLOOKUP(CZ35,'Liste articles'!#REF!,6,FALSE))","v":""},{"$f":"IF(DA35=\"\",\"\",VLOOKUP(DA35,'Liste articles'!#REF!,6,FALSE))","v":""},{"$f":"IF(DB35=\"\",\"\",VLOOKUP(DB35,'Liste articles'!#REF!,6,FALSE))","v":""},{"$f":"IF(DC35=\"\",\"\",VLOOKUP(DC35,'Liste articles'!#REF!,6,FALSE))","v":""},{"$f":"IF(DD35=\"\",\"\",VLOOKUP(DD35,'Liste articles'!#REF!,6,FALSE))","v":""},{"$f":"IF(DE35=\"\",\"\",VLOOKUP(DE35,'Liste articles'!#REF!,6,FALSE))","v":""},{"$f":"IF(DF35=\"\",\"\",VLOOKUP(DF35,'Liste articles'!#REF!,6,FALSE))","v":""},{"$f":"IF(DG35=\"\",\"\",VLOOKUP(DG35,'Liste articles'!#REF!,6,FALSE))","v":""},{"$f":"IF(DH35=\"\",\"\",VLOOKUP(DH35,'Liste articles'!#REF!,6,FALSE))","v":""},{"$f":"IF(DI35=\"\",\"\",VLOOKUP(DI35,'Liste articles'!#REF!,6,FALSE))","v":""},{"$f":"IF(DJ35=\"\",\"\",VLOOKUP(DJ35,'Liste articles'!#REF!,6,FALSE))","v":""},{"$f":"IF(DK35=\"\",\"\",VLOOKUP(DK35,'Liste articles'!#REF!,6,FALSE))","v":""},{"$f":"IF(DL35=\"\",\"\",VLOOKUP(DL35,'Liste articles'!#REF!,6,FALSE))","v":""},{"$f":"IF(DM35=\"\",\"\",VLOOKUP(DM35,'Liste articles'!#REF!,6,FALSE))","v":""},{"$f":"IF(DN35=\"\",\"\",VLOOKUP(DN35,'Liste articles'!#REF!,6,FALSE))","v":""},{"$f":"IF(DO35=\"\",\"\",VLOOKUP(DO35,'Liste articles'!#REF!,6,FALSE))","v":""},{"$f":"IF(DP35=\"\",\"\",VLOOKUP(DP35,'Liste articles'!#REF!,6,FALSE))","v":""},{"$f":"IF(DQ35=\"\",\"\",VLOOKUP(DQ35,'Liste articles'!#REF!,6,FALSE))","v":""},{"$f":"IF(DR35=\"\",\"\",VLOOKUP(DR35,'Liste articles'!#REF!,6,FALSE))","v":""},{"$f":"IF(DS35=\"\",\"\",VLOOKUP(DS35,'Liste articles'!#REF!,6,FALSE))","v":""},{"$f":"IF(DT35=\"\",\"\",VLOOKUP(DT35,'Liste articles'!#REF!,6,FALSE))","v":""},{"$f":"IF(DU35=\"\",\"\",VLOOKUP(DU35,'Liste articles'!#REF!,6,FALSE))","v":""},{"$f":"IF(DV35=\"\",\"\",VLOOKUP(DV35,'Liste articles'!#REF!,6,FALSE))","v":""},{"$f":"IF(DW35=\"\",\"\",VLOOKUP(DW35,'Liste articles'!#REF!,6,FALSE))","v":""},{"$f":"IF(DX35=\"\",\"\",VLOOKUP(DX35,'Liste articles'!#REF!,6,FALSE))","v":""},{"$f":"IF(DY35=\"\",\"\",VLOOKUP(DY35,'Liste articles'!#REF!,6,FALSE))","v":""},{"$f":"IF(DZ35=\"\",\"\",VLOOKUP(DZ35,'Liste articles'!#REF!,6,FALSE))","v":""},{"$f":"IF(EA35=\"\",\"\",VLOOKUP(EA35,'Liste articles'!#REF!,6,FALSE))","v":""}]
[{"$f":"IF(BL!A35=\"\",\"\",BL!A35)","v":""},null,null,null,{"$f":"IF(BL!E35=\"\",\"\",BL!E35)","v":""},{"$f":"IF(A36=\"\",\"\",VLOOKUP(A36,'Liste articles'!B:M,5,FALSE))","v":""},"",{"$f":"IF(C36=\"\",\"\",VLOOKUP(C36,'Liste articles'!#REF!,6,FALSE))","v":""},null,null,null,null,null,null,null,null,null,null,null,null,null,null,null,null,null,null,null,null,null,null,null,null,null,null,null,null,null,null,null,null,null,null,null,null,null,null,null,null,null,null,null,null,null,null,{"$f":"IF(AX36=\"\",\"\",VLOOKUP(AX36,'Liste articles'!#REF!,6,FALSE))","v":""},{"$f":"IF(AY36=\"\",\"\",VLOOKUP(AY36,'Liste articles'!#REF!,6,FALSE))","v":""},{"$f":"IF(AZ36=\"\",\"\",VLOOKUP(AZ36,'Liste articles'!#REF!,6,FALSE))","v":""},{"$f":"IF(BA36=\"\",\"\",VLOOKUP(BA36,'Liste articles'!#REF!,6,FALSE))","v":""},{"$f":"IF(BB36=\"\",\"\",VLOOKUP(BB36,'Liste articles'!#REF!,6,FALSE))","v":""},{"$f":"IF(BC36=\"\",\"\",VLOOKUP(BC36,'Liste articles'!#REF!,6,FALSE))","v":""},{"$f":"IF(BD36=\"\",\"\",VLOOKUP(BD36,'Liste articles'!#REF!,6,FALSE))","v":""},{"$f":"IF(BE36=\"\",\"\",VLOOKUP(BE36,'Liste articles'!#REF!,6,FALSE))","v":""},{"$f":"IF(BF36=\"\",\"\",VLOOKUP(BF36,'Liste articles'!#REF!,6,FALSE))","v":""},{"$f":"IF(BG36=\"\",\"\",VLOOKUP(BG36,'Liste articles'!#REF!,6,FALSE))","v":""},{"$f":"IF(BH36=\"\",\"\",VLOOKUP(BH36,'Liste articles'!#REF!,6,FALSE))","v":""},{"$f":"IF(BI36=\"\",\"\",VLOOKUP(BI36,'Liste articles'!#REF!,6,FALSE))","v":""},{"$f":"IF(BJ36=\"\",\"\",VLOOKUP(BJ36,'Liste articles'!#REF!,6,FALSE))","v":""},{"$f":"IF(BK36=\"\",\"\",VLOOKUP(BK36,'Liste articles'!#REF!,6,FALSE))","v":""},{"$f":"IF(BL36=\"\",\"\",VLOOKUP(BL36,'Liste articles'!#REF!,6,FALSE))","v":""},{"$f":"IF(BM36=\"\",\"\",VLOOKUP(BM36,'Liste articles'!#REF!,6,FALSE))","v":""},{"$f":"IF(BN36=\"\",\"\",VLOOKUP(BN36,'Liste articles'!#REF!,6,FALSE))","v":""},{"$f":"IF(BO36=\"\",\"\",VLOOKUP(BO36,'Liste articles'!#REF!,6,FALSE))","v":""},{"$f":"IF(BP36=\"\",\"\",VLOOKUP(BP36,'Liste articles'!#REF!,6,FALSE))","v":""},{"$f":"IF(BQ36=\"\",\"\",VLOOKUP(BQ36,'Liste articles'!#REF!,6,FALSE))","v":""},{"$f":"IF(BR36=\"\",\"\",VLOOKUP(BR36,'Liste articles'!#REF!,6,FALSE))","v":""},{"$f":"IF(BS36=\"\",\"\",VLOOKUP(BS36,'Liste articles'!#REF!,6,FALSE))","v":""},{"$f":"IF(BT36=\"\",\"\",VLOOKUP(BT36,'Liste articles'!#REF!,6,FALSE))","v":""},{"$f":"IF(BU36=\"\",\"\",VLOOKUP(BU36,'Liste articles'!#REF!,6,FALSE))","v":""},{"$f":"IF(BV36=\"\",\"\",VLOOKUP(BV36,'Liste articles'!#REF!,6,FALSE))","v":""},{"$f":"IF(BW36=\"\",\"\",VLOOKUP(BW36,'Liste articles'!#REF!,6,FALSE))","v":""},{"$f":"IF(BX36=\"\",\"\",VLOOKUP(BX36,'Liste articles'!#REF!,6,FALSE))","v":""},{"$f":"IF(BY36=\"\",\"\",VLOOKUP(BY36,'Liste articles'!#REF!,6,FALSE))","v":""},{"$f":"IF(BZ36=\"\",\"\",VLOOKUP(BZ36,'Liste articles'!#REF!,6,FALSE))","v":""},{"$f":"IF(CA36=\"\",\"\",VLOOKUP(CA36,'Liste articles'!#REF!,6,FALSE))","v":""},{"$f":"IF(CB36=\"\",\"\",VLOOKUP(CB36,'Liste articles'!#REF!,6,FALSE))","v":""},{"$f":"IF(CC36=\"\",\"\",VLOOKUP(CC36,'Liste articles'!#REF!,6,FALSE))","v":""},{"$f":"IF(CD36=\"\",\"\",VLOOKUP(CD36,'Liste articles'!#REF!,6,FALSE))","v":""},{"$f":"IF(CE36=\"\",\"\",VLOOKUP(CE36,'Liste articles'!#REF!,6,FALSE))","v":""},{"$f":"IF(CF36=\"\",\"\",VLOOKUP(CF36,'Liste articles'!#REF!,6,FALSE))","v":""},{"$f":"IF(CG36=\"\",\"\",VLOOKUP(CG36,'Liste articles'!#REF!,6,FALSE))","v":""},{"$f":"IF(CH36=\"\",\"\",VLOOKUP(CH36,'Liste articles'!#REF!,6,FALSE))","v":""},{"$f":"IF(CI36=\"\",\"\",VLOOKUP(CI36,'Liste articles'!#REF!,6,FALSE))","v":""},{"$f":"IF(CJ36=\"\",\"\",VLOOKUP(CJ36,'Liste articles'!#REF!,6,FALSE))","v":""},{"$f":"IF(CK36=\"\",\"\",VLOOKUP(CK36,'Liste articles'!#REF!,6,FALSE))","v":""},{"$f":"IF(CL36=\"\",\"\",VLOOKUP(CL36,'Liste articles'!#REF!,6,FALSE))","v":""},{"$f":"IF(CM36=\"\",\"\",VLOOKUP(CM36,'Liste articles'!#REF!,6,FALSE))","v":""},{"$f":"IF(CN36=\"\",\"\",VLOOKUP(CN36,'Liste articles'!#REF!,6,FALSE))","v":""},{"$f":"IF(CO36=\"\",\"\",VLOOKUP(CO36,'Liste articles'!#REF!,6,FALSE))","v":""},{"$f":"IF(CP36=\"\",\"\",VLOOKUP(CP36,'Liste articles'!#REF!,6,FALSE))","v":""},{"$f":"IF(CQ36=\"\",\"\",VLOOKUP(CQ36,'Liste articles'!#REF!,6,FALSE))","v":""},{"$f":"IF(CR36=\"\",\"\",VLOOKUP(CR36,'Liste articles'!#REF!,6,FALSE))","v":""},{"$f":"IF(CS36=\"\",\"\",VLOOKUP(CS36,'Liste articles'!#REF!,6,FALSE))","v":""},{"$f":"IF(CT36=\"\",\"\",VLOOKUP(CT36,'Liste articles'!#REF!,6,FALSE))","v":""},{"$f":"IF(CU36=\"\",\"\",VLOOKUP(CU36,'Liste articles'!#REF!,6,FALSE))","v":""},{"$f":"IF(CV36=\"\",\"\",VLOOKUP(CV36,'Liste articles'!#REF!,6,FALSE))","v":""},{"$f":"IF(CW36=\"\",\"\",VLOOKUP(CW36,'Liste articles'!#REF!,6,FALSE))","v":""},{"$f":"IF(CX36=\"\",\"\",VLOOKUP(CX36,'Liste articles'!#REF!,6,FALSE))","v":""},{"$f":"IF(CY36=\"\",\"\",VLOOKUP(CY36,'Liste articles'!#REF!,6,FALSE))","v":""},{"$f":"IF(CZ36=\"\",\"\",VLOOKUP(CZ36,'Liste articles'!#REF!,6,FALSE))","v":""},{"$f":"IF(DA36=\"\",\"\",VLOOKUP(DA36,'Liste articles'!#REF!,6,FALSE))","v":""},{"$f":"IF(DB36=\"\",\"\",VLOOKUP(DB36,'Liste articles'!#REF!,6,FALSE))","v":""},{"$f":"IF(DC36=\"\",\"\",VLOOKUP(DC36,'Liste articles'!#REF!,6,FALSE))","v":""},{"$f":"IF(DD36=\"\",\"\",VLOOKUP(DD36,'Liste articles'!#REF!,6,FALSE))","v":""},{"$f":"IF(DE36=\"\",\"\",VLOOKUP(DE36,'Liste articles'!#REF!,6,FALSE))","v":""},{"$f":"IF(DF36=\"\",\"\",VLOOKUP(DF36,'Liste articles'!#REF!,6,FALSE))","v":""},{"$f":"IF(DG36=\"\",\"\",VLOOKUP(DG36,'Liste articles'!#REF!,6,FALSE))","v":""},{"$f":"IF(DH36=\"\",\"\",VLOOKUP(DH36,'Liste articles'!#REF!,6,FALSE))","v":""},{"$f":"IF(DI36=\"\",\"\",VLOOKUP(DI36,'Liste articles'!#REF!,6,FALSE))","v":""},{"$f":"IF(DJ36=\"\",\"\",VLOOKUP(DJ36,'Liste articles'!#REF!,6,FALSE))","v":""},{"$f":"IF(DK36=\"\",\"\",VLOOKUP(DK36,'Liste articles'!#REF!,6,FALSE))","v":""},{"$f":"IF(DL36=\"\",\"\",VLOOKUP(DL36,'Liste articles'!#REF!,6,FALSE))","v":""},{"$f":"IF(DM36=\"\",\"\",VLOOKUP(DM36,'Liste articles'!#REF!,6,FALSE))","v":""},{"$f":"IF(DN36=\"\",\"\",VLOOKUP(DN36,'Liste articles'!#REF!,6,FALSE))","v":""},{"$f":"IF(DO36=\"\",\"\",VLOOKUP(DO36,'Liste articles'!#REF!,6,FALSE))","v":""},{"$f":"IF(DP36=\"\",\"\",VLOOKUP(DP36,'Liste articles'!#REF!,6,FALSE))","v":""},{"$f":"IF(DQ36=\"\",\"\",VLOOKUP(DQ36,'Liste articles'!#REF!,6,FALSE))","v":""},{"$f":"IF(DR36=\"\",\"\",VLOOKUP(DR36,'Liste articles'!#REF!,6,FALSE))","v":""},{"$f":"IF(DS36=\"\",\"\",VLOOKUP(DS36,'Liste articles'!#REF!,6,FALSE))","v":""},{"$f":"IF(DT36=\"\",\"\",VLOOKUP(DT36,'Liste articles'!#REF!,6,FALSE))","v":""},{"$f":"IF(DU36=\"\",\"\",VLOOKUP(DU36,'Liste articles'!#REF!,6,FALSE))","v":""},{"$f":"IF(DV36=\"\",\"\",VLOOKUP(DV36,'Liste articles'!#REF!,6,FALSE))","v":""},{"$f":"IF(DW36=\"\",\"\",VLOOKUP(DW36,'Liste articles'!#REF!,6,FALSE))","v":""},{"$f":"IF(DX36=\"\",\"\",VLOOKUP(DX36,'Liste articles'!#REF!,6,FALSE))","v":""},{"$f":"IF(DY36=\"\",\"\",VLOOKUP(DY36,'Liste articles'!#REF!,6,FALSE))","v":""},{"$f":"IF(DZ36=\"\",\"\",VLOOKUP(DZ36,'Liste articles'!#REF!,6,FALSE))","v":""},{"$f":"IF(EA36=\"\",\"\",VLOOKUP(EA36,'Liste articles'!#REF!,6,FALSE))","v":""}]
[{"$f":"IF(BL!A36=\"\",\"\",BL!A36)","v":""},null,null,null,{"$f":"IF(BL!E36=\"\",\"\",BL!E36)","v":""},{"$f":"IF(A37=\"\",\"\",VLOOKUP(A37,'Liste articles'!B:M,5,FALSE))","v":""},"",{"$f":"IF(C37=\"\",\"\",VLOOKUP(C37,'Liste articles'!#REF!,6,FALSE))","v":""},null,null,null,null,null,null,null,null,null,null,null,null,null,null,null,null,null,null,null,null,null,null,null,null,null,null,null,null,null,null,null,null,null,null,null,null,null,null,null,null,null,null,null,null,null,null,{"$f":"IF(AX37=\"\",\"\",VLOOKUP(AX37,'Liste articles'!#REF!,6,FALSE))","v":""},{"$f":"IF(AY37=\"\",\"\",VLOOKUP(AY37,'Liste articles'!#REF!,6,FALSE))","v":""},{"$f":"IF(AZ37=\"\",\"\",VLOOKUP(AZ37,'Liste articles'!#REF!,6,FALSE))","v":""},{"$f":"IF(BA37=\"\",\"\",VLOOKUP(BA37,'Liste articles'!#REF!,6,FALSE))","v":""},{"$f":"IF(BB37=\"\",\"\",VLOOKUP(BB37,'Liste articles'!#REF!,6,FALSE))","v":""},{"$f":"IF(BC37=\"\",\"\",VLOOKUP(BC37,'Liste articles'!#REF!,6,FALSE))","v":""},{"$f":"IF(BD37=\"\",\"\",VLOOKUP(BD37,'Liste articles'!#REF!,6,FALSE))","v":""},{"$f":"IF(BE37=\"\",\"\",VLOOKUP(BE37,'Liste articles'!#REF!,6,FALSE))","v":""},{"$f":"IF(BF37=\"\",\"\",VLOOKUP(BF37,'Liste articles'!#REF!,6,FALSE))","v":""},{"$f":"IF(BG37=\"\",\"\",VLOOKUP(BG37,'Liste articles'!#REF!,6,FALSE))","v":""},{"$f":"IF(BH37=\"\",\"\",VLOOKUP(BH37,'Liste articles'!#REF!,6,FALSE))","v":""},{"$f":"IF(BI37=\"\",\"\",VLOOKUP(BI37,'Liste articles'!#REF!,6,FALSE))","v":""},{"$f":"IF(BJ37=\"\",\"\",VLOOKUP(BJ37,'Liste articles'!#REF!,6,FALSE))","v":""},{"$f":"IF(BK37=\"\",\"\",VLOOKUP(BK37,'Liste articles'!#REF!,6,FALSE))","v":""},{"$f":"IF(BL37=\"\",\"\",VLOOKUP(BL37,'Liste articles'!#REF!,6,FALSE))","v":""},{"$f":"IF(BM37=\"\",\"\",VLOOKUP(BM37,'Liste articles'!#REF!,6,FALSE))","v":""},{"$f":"IF(BN37=\"\",\"\",VLOOKUP(BN37,'Liste articles'!#REF!,6,FALSE))","v":""},{"$f":"IF(BO37=\"\",\"\",VLOOKUP(BO37,'Liste articles'!#REF!,6,FALSE))","v":""},{"$f":"IF(BP37=\"\",\"\",VLOOKUP(BP37,'Liste articles'!#REF!,6,FALSE))","v":""},{"$f":"IF(BQ37=\"\",\"\",VLOOKUP(BQ37,'Liste articles'!#REF!,6,FALSE))","v":""},{"$f":"IF(BR37=\"\",\"\",VLOOKUP(BR37,'Liste articles'!#REF!,6,FALSE))","v":""},{"$f":"IF(BS37=\"\",\"\",VLOOKUP(BS37,'Liste articles'!#REF!,6,FALSE))","v":""},{"$f":"IF(BT37=\"\",\"\",VLOOKUP(BT37,'Liste articles'!#REF!,6,FALSE))","v":""},{"$f":"IF(BU37=\"\",\"\",VLOOKUP(BU37,'Liste articles'!#REF!,6,FALSE))","v":""},{"$f":"IF(BV37=\"\",\"\",VLOOKUP(BV37,'Liste articles'!#REF!,6,FALSE))","v":""},{"$f":"IF(BW37=\"\",\"\",VLOOKUP(BW37,'Liste articles'!#REF!,6,FALSE))","v":""},{"$f":"IF(BX37=\"\",\"\",VLOOKUP(BX37,'Liste articles'!#REF!,6,FALSE))","v":""},{"$f":"IF(BY37=\"\",\"\",VLOOKUP(BY37,'Liste articles'!#REF!,6,FALSE))","v":""},{"$f":"IF(BZ37=\"\",\"\",VLOOKUP(BZ37,'Liste articles'!#REF!,6,FALSE))","v":""},{"$f":"IF(CA37=\"\",\"\",VLOOKUP(CA37,'Liste articles'!#REF!,6,FALSE))","v":""},{"$f":"IF(CB37=\"\",\"\",VLOOKUP(CB37,'Liste articles'!#REF!,6,FALSE))","v":""},{"$f":"IF(CC37=\"\",\"\",VLOOKUP(CC37,'Liste articles'!#REF!,6,FALSE))","v":""},{"$f":"IF(CD37=\"\",\"\",VLOOKUP(CD37,'Liste articles'!#REF!,6,FALSE))","v":""},{"$f":"IF(CE37=\"\",\"\",VLOOKUP(CE37,'Liste articles'!#REF!,6,FALSE))","v":""},{"$f":"IF(CF37=\"\",\"\",VLOOKUP(CF37,'Liste articles'!#REF!,6,FALSE))","v":""},{"$f":"IF(CG37=\"\",\"\",VLOOKUP(CG37,'Liste articles'!#REF!,6,FALSE))","v":""},{"$f":"IF(CH37=\"\",\"\",VLOOKUP(CH37,'Liste articles'!#REF!,6,FALSE))","v":""},{"$f":"IF(CI37=\"\",\"\",VLOOKUP(CI37,'Liste articles'!#REF!,6,FALSE))","v":""},{"$f":"IF(CJ37=\"\",\"\",VLOOKUP(CJ37,'Liste articles'!#REF!,6,FALSE))","v":""},{"$f":"IF(CK37=\"\",\"\",VLOOKUP(CK37,'Liste articles'!#REF!,6,FALSE))","v":""},{"$f":"IF(CL37=\"\",\"\",VLOOKUP(CL37,'Liste articles'!#REF!,6,FALSE))","v":""},{"$f":"IF(CM37=\"\",\"\",VLOOKUP(CM37,'Liste articles'!#REF!,6,FALSE))","v":""},{"$f":"IF(CN37=\"\",\"\",VLOOKUP(CN37,'Liste articles'!#REF!,6,FALSE))","v":""},{"$f":"IF(CO37=\"\",\"\",VLOOKUP(CO37,'Liste articles'!#REF!,6,FALSE))","v":""},{"$f":"IF(CP37=\"\",\"\",VLOOKUP(CP37,'Liste articles'!#REF!,6,FALSE))","v":""},{"$f":"IF(CQ37=\"\",\"\",VLOOKUP(CQ37,'Liste articles'!#REF!,6,FALSE))","v":""},{"$f":"IF(CR37=\"\",\"\",VLOOKUP(CR37,'Liste articles'!#REF!,6,FALSE))","v":""},{"$f":"IF(CS37=\"\",\"\",VLOOKUP(CS37,'Liste articles'!#REF!,6,FALSE))","v":""},{"$f":"IF(CT37=\"\",\"\",VLOOKUP(CT37,'Liste articles'!#REF!,6,FALSE))","v":""},{"$f":"IF(CU37=\"\",\"\",VLOOKUP(CU37,'Liste articles'!#REF!,6,FALSE))","v":""},{"$f":"IF(CV37=\"\",\"\",VLOOKUP(CV37,'Liste articles'!#REF!,6,FALSE))","v":""},{"$f":"IF(CW37=\"\",\"\",VLOOKUP(CW37,'Liste articles'!#REF!,6,FALSE))","v":""},{"$f":"IF(CX37=\"\",\"\",VLOOKUP(CX37,'Liste articles'!#REF!,6,FALSE))","v":""},{"$f":"IF(CY37=\"\",\"\",VLOOKUP(CY37,'Liste articles'!#REF!,6,FALSE))","v":""},{"$f":"IF(CZ37=\"\",\"\",VLOOKUP(CZ37,'Liste articles'!#REF!,6,FALSE))","v":""},{"$f":"IF(DA37=\"\",\"\",VLOOKUP(DA37,'Liste articles'!#REF!,6,FALSE))","v":""},{"$f":"IF(DB37=\"\",\"\",VLOOKUP(DB37,'Liste articles'!#REF!,6,FALSE))","v":""},{"$f":"IF(DC37=\"\",\"\",VLOOKUP(DC37,'Liste articles'!#REF!,6,FALSE))","v":""},{"$f":"IF(DD37=\"\",\"\",VLOOKUP(DD37,'Liste articles'!#REF!,6,FALSE))","v":""},{"$f":"IF(DE37=\"\",\"\",VLOOKUP(DE37,'Liste articles'!#REF!,6,FALSE))","v":""},{"$f":"IF(DF37=\"\",\"\",VLOOKUP(DF37,'Liste articles'!#REF!,6,FALSE))","v":""},{"$f":"IF(DG37=\"\",\"\",VLOOKUP(DG37,'Liste articles'!#REF!,6,FALSE))","v":""},{"$f":"IF(DH37=\"\",\"\",VLOOKUP(DH37,'Liste articles'!#REF!,6,FALSE))","v":""},{"$f":"IF(DI37=\"\",\"\",VLOOKUP(DI37,'Liste articles'!#REF!,6,FALSE))","v":""},{"$f":"IF(DJ37=\"\",\"\",VLOOKUP(DJ37,'Liste articles'!#REF!,6,FALSE))","v":""},{"$f":"IF(DK37=\"\",\"\",VLOOKUP(DK37,'Liste articles'!#REF!,6,FALSE))","v":""},{"$f":"IF(DL37=\"\",\"\",VLOOKUP(DL37,'Liste articles'!#REF!,6,FALSE))","v":""},{"$f":"IF(DM37=\"\",\"\",VLOOKUP(DM37,'Liste articles'!#REF!,6,FALSE))","v":""},{"$f":"IF(DN37=\"\",\"\",VLOOKUP(DN37,'Liste articles'!#REF!,6,FALSE))","v":""},{"$f":"IF(DO37=\"\",\"\",VLOOKUP(DO37,'Liste articles'!#REF!,6,FALSE))","v":""},{"$f":"IF(DP37=\"\",\"\",VLOOKUP(DP37,'Liste articles'!#REF!,6,FALSE))","v":""},{"$f":"IF(DQ37=\"\",\"\",VLOOKUP(DQ37,'Liste articles'!#REF!,6,FALSE))","v":""},{"$f":"IF(DR37=\"\",\"\",VLOOKUP(DR37,'Liste articles'!#REF!,6,FALSE))","v":""},{"$f":"IF(DS37=\"\",\"\",VLOOKUP(DS37,'Liste articles'!#REF!,6,FALSE))","v":""},{"$f":"IF(DT37=\"\",\"\",VLOOKUP(DT37,'Liste articles'!#REF!,6,FALSE))","v":""},{"$f":"IF(DU37=\"\",\"\",VLOOKUP(DU37,'Liste articles'!#REF!,6,FALSE))","v":""},{"$f":"IF(DV37=\"\",\"\",VLOOKUP(DV37,'Liste articles'!#REF!,6,FALSE))","v":""},{"$f":"IF(DW37=\"\",\"\",VLOOKUP(DW37,'Liste articles'!#REF!,6,FALSE))","v":""},{"$f":"IF(DX37=\"\",\"\",VLOOKUP(DX37,'Liste articles'!#REF!,6,FALSE))","v":""},{"$f":"IF(DY37=\"\",\"\",VLOOKUP(DY37,'Liste articles'!#REF!,6,FALSE))","v":""},{"$f":"IF(DZ37=\"\",\"\",VLOOKUP(DZ37,'Liste articles'!#REF!,6,FALSE))","v":""},{"$f":"IF(EA37=\"\",\"\",VLOOKUP(EA37,'Liste articles'!#REF!,6,FALSE))","v":""}]
[{"$f":"IF(BL!A37=\"\",\"\",BL!A37)","v":""},null,null,null,{"$f":"IF(BL!E37=\"\",\"\",BL!E37)","v":""},{"$f":"IF(A38=\"\",\"\",VLOOKUP(A38,'Liste articles'!B:M,5,FALSE))","v":""},"",{"$f":"IF(C38=\"\",\"\",VLOOKUP(C38,'Liste articles'!#REF!,6,FALSE))","v":""},null,null,null,null,null,null,null,null,null,null,null,null,null,null,null,null,null,null,null,null,null,null,null,null,null,null,null,null,null,null,null,null,null,null,null,null,null,null,null,null,null,null,null,null,null,null,{"$f":"IF(AX38=\"\",\"\",VLOOKUP(AX38,'Liste articles'!#REF!,6,FALSE))","v":""},{"$f":"IF(AY38=\"\",\"\",VLOOKUP(AY38,'Liste articles'!#REF!,6,FALSE))","v":""},{"$f":"IF(AZ38=\"\",\"\",VLOOKUP(AZ38,'Liste articles'!#REF!,6,FALSE))","v":""},{"$f":"IF(BA38=\"\",\"\",VLOOKUP(BA38,'Liste articles'!#REF!,6,FALSE))","v":""},{"$f":"IF(BB38=\"\",\"\",VLOOKUP(BB38,'Liste articles'!#REF!,6,FALSE))","v":""},{"$f":"IF(BC38=\"\",\"\",VLOOKUP(BC38,'Liste articles'!#REF!,6,FALSE))","v":""},{"$f":"IF(BD38=\"\",\"\",VLOOKUP(BD38,'Liste articles'!#REF!,6,FALSE))","v":""},{"$f":"IF(BE38=\"\",\"\",VLOOKUP(BE38,'Liste articles'!#REF!,6,FALSE))","v":""},{"$f":"IF(BF38=\"\",\"\",VLOOKUP(BF38,'Liste articles'!#REF!,6,FALSE))","v":""},{"$f":"IF(BG38=\"\",\"\",VLOOKUP(BG38,'Liste articles'!#REF!,6,FALSE))","v":""},{"$f":"IF(BH38=\"\",\"\",VLOOKUP(BH38,'Liste articles'!#REF!,6,FALSE))","v":""},{"$f":"IF(BI38=\"\",\"\",VLOOKUP(BI38,'Liste articles'!#REF!,6,FALSE))","v":""},{"$f":"IF(BJ38=\"\",\"\",VLOOKUP(BJ38,'Liste articles'!#REF!,6,FALSE))","v":""},{"$f":"IF(BK38=\"\",\"\",VLOOKUP(BK38,'Liste articles'!#REF!,6,FALSE))","v":""},{"$f":"IF(BL38=\"\",\"\",VLOOKUP(BL38,'Liste articles'!#REF!,6,FALSE))","v":""},{"$f":"IF(BM38=\"\",\"\",VLOOKUP(BM38,'Liste articles'!#REF!,6,FALSE))","v":""},{"$f":"IF(BN38=\"\",\"\",VLOOKUP(BN38,'Liste articles'!#REF!,6,FALSE))","v":""},{"$f":"IF(BO38=\"\",\"\",VLOOKUP(BO38,'Liste articles'!#REF!,6,FALSE))","v":""},{"$f":"IF(BP38=\"\",\"\",VLOOKUP(BP38,'Liste articles'!#REF!,6,FALSE))","v":""},{"$f":"IF(BQ38=\"\",\"\",VLOOKUP(BQ38,'Liste articles'!#REF!,6,FALSE))","v":""},{"$f":"IF(BR38=\"\",\"\",VLOOKUP(BR38,'Liste articles'!#REF!,6,FALSE))","v":""},{"$f":"IF(BS38=\"\",\"\",VLOOKUP(BS38,'Liste articles'!#REF!,6,FALSE))","v":""},{"$f":"IF(BT38=\"\",\"\",VLOOKUP(BT38,'Liste articles'!#REF!,6,FALSE))","v":""},{"$f":"IF(BU38=\"\",\"\",VLOOKUP(BU38,'Liste articles'!#REF!,6,FALSE))","v":""},{"$f":"IF(BV38=\"\",\"\",VLOOKUP(BV38,'Liste articles'!#REF!,6,FALSE))","v":""},{"$f":"IF(BW38=\"\",\"\",VLOOKUP(BW38,'Liste articles'!#REF!,6,FALSE))","v":""},{"$f":"IF(BX38=\"\",\"\",VLOOKUP(BX38,'Liste articles'!#REF!,6,FALSE))","v":""},{"$f":"IF(BY38=\"\",\"\",VLOOKUP(BY38,'Liste articles'!#REF!,6,FALSE))","v":""},{"$f":"IF(BZ38=\"\",\"\",VLOOKUP(BZ38,'Liste articles'!#REF!,6,FALSE))","v":""},{"$f":"IF(CA38=\"\",\"\",VLOOKUP(CA38,'Liste articles'!#REF!,6,FALSE))","v":""},{"$f":"IF(CB38=\"\",\"\",VLOOKUP(CB38,'Liste articles'!#REF!,6,FALSE))","v":""},{"$f":"IF(CC38=\"\",\"\",VLOOKUP(CC38,'Liste articles'!#REF!,6,FALSE))","v":""},{"$f":"IF(CD38=\"\",\"\",VLOOKUP(CD38,'Liste articles'!#REF!,6,FALSE))","v":""},{"$f":"IF(CE38=\"\",\"\",VLOOKUP(CE38,'Liste articles'!#REF!,6,FALSE))","v":""},{"$f":"IF(CF38=\"\",\"\",VLOOKUP(CF38,'Liste articles'!#REF!,6,FALSE))","v":""},{"$f":"IF(CG38=\"\",\"\",VLOOKUP(CG38,'Liste articles'!#REF!,6,FALSE))","v":""},{"$f":"IF(CH38=\"\",\"\",VLOOKUP(CH38,'Liste articles'!#REF!,6,FALSE))","v":""},{"$f":"IF(CI38=\"\",\"\",VLOOKUP(CI38,'Liste articles'!#REF!,6,FALSE))","v":""},{"$f":"IF(CJ38=\"\",\"\",VLOOKUP(CJ38,'Liste articles'!#REF!,6,FALSE))","v":""},{"$f":"IF(CK38=\"\",\"\",VLOOKUP(CK38,'Liste articles'!#REF!,6,FALSE))","v":""},{"$f":"IF(CL38=\"\",\"\",VLOOKUP(CL38,'Liste articles'!#REF!,6,FALSE))","v":""},{"$f":"IF(CM38=\"\",\"\",VLOOKUP(CM38,'Liste articles'!#REF!,6,FALSE))","v":""},{"$f":"IF(CN38=\"\",\"\",VLOOKUP(CN38,'Liste articles'!#REF!,6,FALSE))","v":""},{"$f":"IF(CO38=\"\",\"\",VLOOKUP(CO38,'Liste articles'!#REF!,6,FALSE))","v":""},{"$f":"IF(CP38=\"\",\"\",VLOOKUP(CP38,'Liste articles'!#REF!,6,FALSE))","v":""},{"$f":"IF(CQ38=\"\",\"\",VLOOKUP(CQ38,'Liste articles'!#REF!,6,FALSE))","v":""},{"$f":"IF(CR38=\"\",\"\",VLOOKUP(CR38,'Liste articles'!#REF!,6,FALSE))","v":""},{"$f":"IF(CS38=\"\",\"\",VLOOKUP(CS38,'Liste articles'!#REF!,6,FALSE))","v":""},{"$f":"IF(CT38=\"\",\"\",VLOOKUP(CT38,'Liste articles'!#REF!,6,FALSE))","v":""},{"$f":"IF(CU38=\"\",\"\",VLOOKUP(CU38,'Liste articles'!#REF!,6,FALSE))","v":""},{"$f":"IF(CV38=\"\",\"\",VLOOKUP(CV38,'Liste articles'!#REF!,6,FALSE))","v":""},{"$f":"IF(CW38=\"\",\"\",VLOOKUP(CW38,'Liste articles'!#REF!,6,FALSE))","v":""},{"$f":"IF(CX38=\"\",\"\",VLOOKUP(CX38,'Liste articles'!#REF!,6,FALSE))","v":""},{"$f":"IF(CY38=\"\",\"\",VLOOKUP(CY38,'Liste articles'!#REF!,6,FALSE))","v":""},{"$f":"IF(CZ38=\"\",\"\",VLOOKUP(CZ38,'Liste articles'!#REF!,6,FALSE))","v":""},{"$f":"IF(DA38=\"\",\"\",VLOOKUP(DA38,'Liste articles'!#REF!,6,FALSE))","v":""},{"$f":"IF(DB38=\"\",\"\",VLOOKUP(DB38,'Liste articles'!#REF!,6,FALSE))","v":""},{"$f":"IF(DC38=\"\",\"\",VLOOKUP(DC38,'Liste articles'!#REF!,6,FALSE))","v":""},{"$f":"IF(DD38=\"\",\"\",VLOOKUP(DD38,'Liste articles'!#REF!,6,FALSE))","v":""},{"$f":"IF(DE38=\"\",\"\",VLOOKUP(DE38,'Liste articles'!#REF!,6,FALSE))","v":""},{"$f":"IF(DF38=\"\",\"\",VLOOKUP(DF38,'Liste articles'!#REF!,6,FALSE))","v":""},{"$f":"IF(DG38=\"\",\"\",VLOOKUP(DG38,'Liste articles'!#REF!,6,FALSE))","v":""},{"$f":"IF(DH38=\"\",\"\",VLOOKUP(DH38,'Liste articles'!#REF!,6,FALSE))","v":""},{"$f":"IF(DI38=\"\",\"\",VLOOKUP(DI38,'Liste articles'!#REF!,6,FALSE))","v":""},{"$f":"IF(DJ38=\"\",\"\",VLOOKUP(DJ38,'Liste articles'!#REF!,6,FALSE))","v":""},{"$f":"IF(DK38=\"\",\"\",VLOOKUP(DK38,'Liste articles'!#REF!,6,FALSE))","v":""},{"$f":"IF(DL38=\"\",\"\",VLOOKUP(DL38,'Liste articles'!#REF!,6,FALSE))","v":""},{"$f":"IF(DM38=\"\",\"\",VLOOKUP(DM38,'Liste articles'!#REF!,6,FALSE))","v":""},{"$f":"IF(DN38=\"\",\"\",VLOOKUP(DN38,'Liste articles'!#REF!,6,FALSE))","v":""},{"$f":"IF(DO38=\"\",\"\",VLOOKUP(DO38,'Liste articles'!#REF!,6,FALSE))","v":""},{"$f":"IF(DP38=\"\",\"\",VLOOKUP(DP38,'Liste articles'!#REF!,6,FALSE))","v":""},{"$f":"IF(DQ38=\"\",\"\",VLOOKUP(DQ38,'Liste articles'!#REF!,6,FALSE))","v":""},{"$f":"IF(DR38=\"\",\"\",VLOOKUP(DR38,'Liste articles'!#REF!,6,FALSE))","v":""},{"$f":"IF(DS38=\"\",\"\",VLOOKUP(DS38,'Liste articles'!#REF!,6,FALSE))","v":""},{"$f":"IF(DT38=\"\",\"\",VLOOKUP(DT38,'Liste articles'!#REF!,6,FALSE))","v":""},{"$f":"IF(DU38=\"\",\"\",VLOOKUP(DU38,'Liste articles'!#REF!,6,FALSE))","v":""},{"$f":"IF(DV38=\"\",\"\",VLOOKUP(DV38,'Liste articles'!#REF!,6,FALSE))","v":""},{"$f":"IF(DW38=\"\",\"\",VLOOKUP(DW38,'Liste articles'!#REF!,6,FALSE))","v":""},{"$f":"IF(DX38=\"\",\"\",VLOOKUP(DX38,'Liste articles'!#REF!,6,FALSE))","v":""},{"$f":"IF(DY38=\"\",\"\",VLOOKUP(DY38,'Liste articles'!#REF!,6,FALSE))","v":""},{"$f":"IF(DZ38=\"\",\"\",VLOOKUP(DZ38,'Liste articles'!#REF!,6,FALSE))","v":""},{"$f":"IF(EA38=\"\",\"\",VLOOKUP(EA38,'Liste articles'!#REF!,6,FALSE))","v":""}]
[{"$f":"IF(BL!A38=\"\",\"\",BL!A38)","v":""},null,null,null,{"$f":"IF(BL!E38=\"\",\"\",BL!E38)","v":""},{"$f":"IF(A39=\"\",\"\",VLOOKUP(A39,'Liste articles'!B:M,5,FALSE))","v":""},"",{"$f":"IF(C39=\"\",\"\",VLOOKUP(C39,'Liste articles'!#REF!,6,FALSE))","v":""},null,null,null,null,null,null,null,null,null,null,null,null,null,null,null,null,null,null,null,null,null,null,null,null,null,null,null,null,null,null,null,null,null,null,null,null,null,null,null,null,null,null,null,null,null,null,{"$f":"IF(AX39=\"\",\"\",VLOOKUP(AX39,'Liste articles'!#REF!,6,FALSE))","v":""},{"$f":"IF(AY39=\"\",\"\",VLOOKUP(AY39,'Liste articles'!#REF!,6,FALSE))","v":""},{"$f":"IF(AZ39=\"\",\"\",VLOOKUP(AZ39,'Liste articles'!#REF!,6,FALSE))","v":""},{"$f":"IF(BA39=\"\",\"\",VLOOKUP(BA39,'Liste articles'!#REF!,6,FALSE))","v":""},{"$f":"IF(BB39=\"\",\"\",VLOOKUP(BB39,'Liste articles'!#REF!,6,FALSE))","v":""},{"$f":"IF(BC39=\"\",\"\",VLOOKUP(BC39,'Liste articles'!#REF!,6,FALSE))","v":""},{"$f":"IF(BD39=\"\",\"\",VLOOKUP(BD39,'Liste articles'!#REF!,6,FALSE))","v":""},{"$f":"IF(BE39=\"\",\"\",VLOOKUP(BE39,'Liste articles'!#REF!,6,FALSE))","v":""},{"$f":"IF(BF39=\"\",\"\",VLOOKUP(BF39,'Liste articles'!#REF!,6,FALSE))","v":""},{"$f":"IF(BG39=\"\",\"\",VLOOKUP(BG39,'Liste articles'!#REF!,6,FALSE))","v":""},{"$f":"IF(BH39=\"\",\"\",VLOOKUP(BH39,'Liste articles'!#REF!,6,FALSE))","v":""},{"$f":"IF(BI39=\"\",\"\",VLOOKUP(BI39,'Liste articles'!#REF!,6,FALSE))","v":""},{"$f":"IF(BJ39=\"\",\"\",VLOOKUP(BJ39,'Liste articles'!#REF!,6,FALSE))","v":""},{"$f":"IF(BK39=\"\",\"\",VLOOKUP(BK39,'Liste articles'!#REF!,6,FALSE))","v":""},{"$f":"IF(BL39=\"\",\"\",VLOOKUP(BL39,'Liste articles'!#REF!,6,FALSE))","v":""},{"$f":"IF(BM39=\"\",\"\",VLOOKUP(BM39,'Liste articles'!#REF!,6,FALSE))","v":""},{"$f":"IF(BN39=\"\",\"\",VLOOKUP(BN39,'Liste articles'!#REF!,6,FALSE))","v":""},{"$f":"IF(BO39=\"\",\"\",VLOOKUP(BO39,'Liste articles'!#REF!,6,FALSE))","v":""},{"$f":"IF(BP39=\"\",\"\",VLOOKUP(BP39,'Liste articles'!#REF!,6,FALSE))","v":""},{"$f":"IF(BQ39=\"\",\"\",VLOOKUP(BQ39,'Liste articles'!#REF!,6,FALSE))","v":""},{"$f":"IF(BR39=\"\",\"\",VLOOKUP(BR39,'Liste articles'!#REF!,6,FALSE))","v":""},{"$f":"IF(BS39=\"\",\"\",VLOOKUP(BS39,'Liste articles'!#REF!,6,FALSE))","v":""},{"$f":"IF(BT39=\"\",\"\",VLOOKUP(BT39,'Liste articles'!#REF!,6,FALSE))","v":""},{"$f":"IF(BU39=\"\",\"\",VLOOKUP(BU39,'Liste articles'!#REF!,6,FALSE))","v":""},{"$f":"IF(BV39=\"\",\"\",VLOOKUP(BV39,'Liste articles'!#REF!,6,FALSE))","v":""},{"$f":"IF(BW39=\"\",\"\",VLOOKUP(BW39,'Liste articles'!#REF!,6,FALSE))","v":""},{"$f":"IF(BX39=\"\",\"\",VLOOKUP(BX39,'Liste articles'!#REF!,6,FALSE))","v":""},{"$f":"IF(BY39=\"\",\"\",VLOOKUP(BY39,'Liste articles'!#REF!,6,FALSE))","v":""},{"$f":"IF(BZ39=\"\",\"\",VLOOKUP(BZ39,'Liste articles'!#REF!,6,FALSE))","v":""},{"$f":"IF(CA39=\"\",\"\",VLOOKUP(CA39,'Liste articles'!#REF!,6,FALSE))","v":""},{"$f":"IF(CB39=\"\",\"\",VLOOKUP(CB39,'Liste articles'!#REF!,6,FALSE))","v":""},{"$f":"IF(CC39=\"\",\"\",VLOOKUP(CC39,'Liste articles'!#REF!,6,FALSE))","v":""},{"$f":"IF(CD39=\"\",\"\",VLOOKUP(CD39,'Liste articles'!#REF!,6,FALSE))","v":""},{"$f":"IF(CE39=\"\",\"\",VLOOKUP(CE39,'Liste articles'!#REF!,6,FALSE))","v":""},{"$f":"IF(CF39=\"\",\"\",VLOOKUP(CF39,'Liste articles'!#REF!,6,FALSE))","v":""},{"$f":"IF(CG39=\"\",\"\",VLOOKUP(CG39,'Liste articles'!#REF!,6,FALSE))","v":""},{"$f":"IF(CH39=\"\",\"\",VLOOKUP(CH39,'Liste articles'!#REF!,6,FALSE))","v":""},{"$f":"IF(CI39=\"\",\"\",VLOOKUP(CI39,'Liste articles'!#REF!,6,FALSE))","v":""},{"$f":"IF(CJ39=\"\",\"\",VLOOKUP(CJ39,'Liste articles'!#REF!,6,FALSE))","v":""},{"$f":"IF(CK39=\"\",\"\",VLOOKUP(CK39,'Liste articles'!#REF!,6,FALSE))","v":""},{"$f":"IF(CL39=\"\",\"\",VLOOKUP(CL39,'Liste articles'!#REF!,6,FALSE))","v":""},{"$f":"IF(CM39=\"\",\"\",VLOOKUP(CM39,'Liste articles'!#REF!,6,FALSE))","v":""},{"$f":"IF(CN39=\"\",\"\",VLOOKUP(CN39,'Liste articles'!#REF!,6,FALSE))","v":""},{"$f":"IF(CO39=\"\",\"\",VLOOKUP(CO39,'Liste articles'!#REF!,6,FALSE))","v":""},{"$f":"IF(CP39=\"\",\"\",VLOOKUP(CP39,'Liste articles'!#REF!,6,FALSE))","v":""},{"$f":"IF(CQ39=\"\",\"\",VLOOKUP(CQ39,'Liste articles'!#REF!,6,FALSE))","v":""},{"$f":"IF(CR39=\"\",\"\",VLOOKUP(CR39,'Liste articles'!#REF!,6,FALSE))","v":""},{"$f":"IF(CS39=\"\",\"\",VLOOKUP(CS39,'Liste articles'!#REF!,6,FALSE))","v":""},{"$f":"IF(CT39=\"\",\"\",VLOOKUP(CT39,'Liste articles'!#REF!,6,FALSE))","v":""},{"$f":"IF(CU39=\"\",\"\",VLOOKUP(CU39,'Liste articles'!#REF!,6,FALSE))","v":""},{"$f":"IF(CV39=\"\",\"\",VLOOKUP(CV39,'Liste articles'!#REF!,6,FALSE))","v":""},{"$f":"IF(CW39=\"\",\"\",VLOOKUP(CW39,'Liste articles'!#REF!,6,FALSE))","v":""},{"$f":"IF(CX39=\"\",\"\",VLOOKUP(CX39,'Liste articles'!#REF!,6,FALSE))","v":""},{"$f":"IF(CY39=\"\",\"\",VLOOKUP(CY39,'Liste articles'!#REF!,6,FALSE))","v":""},{"$f":"IF(CZ39=\"\",\"\",VLOOKUP(CZ39,'Liste articles'!#REF!,6,FALSE))","v":""},{"$f":"IF(DA39=\"\",\"\",VLOOKUP(DA39,'Liste articles'!#REF!,6,FALSE))","v":""},{"$f":"IF(DB39=\"\",\"\",VLOOKUP(DB39,'Liste articles'!#REF!,6,FALSE))","v":""},{"$f":"IF(DC39=\"\",\"\",VLOOKUP(DC39,'Liste articles'!#REF!,6,FALSE))","v":""},{"$f":"IF(DD39=\"\",\"\",VLOOKUP(DD39,'Liste articles'!#REF!,6,FALSE))","v":""},{"$f":"IF(DE39=\"\",\"\",VLOOKUP(DE39,'Liste articles'!#REF!,6,FALSE))","v":""},{"$f":"IF(DF39=\"\",\"\",VLOOKUP(DF39,'Liste articles'!#REF!,6,FALSE))","v":""},{"$f":"IF(DG39=\"\",\"\",VLOOKUP(DG39,'Liste articles'!#REF!,6,FALSE))","v":""},{"$f":"IF(DH39=\"\",\"\",VLOOKUP(DH39,'Liste articles'!#REF!,6,FALSE))","v":""},{"$f":"IF(DI39=\"\",\"\",VLOOKUP(DI39,'Liste articles'!#REF!,6,FALSE))","v":""},{"$f":"IF(DJ39=\"\",\"\",VLOOKUP(DJ39,'Liste articles'!#REF!,6,FALSE))","v":""},{"$f":"IF(DK39=\"\",\"\",VLOOKUP(DK39,'Liste articles'!#REF!,6,FALSE))","v":""},{"$f":"IF(DL39=\"\",\"\",VLOOKUP(DL39,'Liste articles'!#REF!,6,FALSE))","v":""},{"$f":"IF(DM39=\"\",\"\",VLOOKUP(DM39,'Liste articles'!#REF!,6,FALSE))","v":""},{"$f":"IF(DN39=\"\",\"\",VLOOKUP(DN39,'Liste articles'!#REF!,6,FALSE))","v":""},{"$f":"IF(DO39=\"\",\"\",VLOOKUP(DO39,'Liste articles'!#REF!,6,FALSE))","v":""},{"$f":"IF(DP39=\"\",\"\",VLOOKUP(DP39,'Liste articles'!#REF!,6,FALSE))","v":""},{"$f":"IF(DQ39=\"\",\"\",VLOOKUP(DQ39,'Liste articles'!#REF!,6,FALSE))","v":""},{"$f":"IF(DR39=\"\",\"\",VLOOKUP(DR39,'Liste articles'!#REF!,6,FALSE))","v":""},{"$f":"IF(DS39=\"\",\"\",VLOOKUP(DS39,'Liste articles'!#REF!,6,FALSE))","v":""},{"$f":"IF(DT39=\"\",\"\",VLOOKUP(DT39,'Liste articles'!#REF!,6,FALSE))","v":""},{"$f":"IF(DU39=\"\",\"\",VLOOKUP(DU39,'Liste articles'!#REF!,6,FALSE))","v":""},{"$f":"IF(DV39=\"\",\"\",VLOOKUP(DV39,'Liste articles'!#REF!,6,FALSE))","v":""},{"$f":"IF(DW39=\"\",\"\",VLOOKUP(DW39,'Liste articles'!#REF!,6,FALSE))","v":""},{"$f":"IF(DX39=\"\",\"\",VLOOKUP(DX39,'Liste articles'!#REF!,6,FALSE))","v":""},{"$f":"IF(DY39=\"\",\"\",VLOOKUP(DY39,'Liste articles'!#REF!,6,FALSE))","v":""},{"$f":"IF(DZ39=\"\",\"\",VLOOKUP(DZ39,'Liste articles'!#REF!,6,FALSE))","v":""},{"$f":"IF(EA39=\"\",\"\",VLOOKUP(EA39,'Liste articles'!#REF!,6,FALSE))","v":""}]
[]
["Montant HT","TVA","Montant TVA",null,"",null,{"$f":"SUM(G19:G39)","v":216}]
[null,null,null,null,{"$f":"IF(BL!$B$42=\"\",\"\",\"remise\")","v":""},null,{"$f":"IF(BL!$B$42=\"\",\"\",BL!$B$42)","v":""}]
[null,null,null,null,null,null,2]
[null,null,null,null,"Net HT",null,{"$f":"G41-_xlfn.NUMBERVALUE(G42)","v":216}]
[null,null,null,null,"Total TVA",null,2]
["\"En cas de retard de paiement, une pénalité sera ",null,null,null,"MONTANT A PAYER TTC:",null,{"$f":"G44","v":216}]
["facturée sur la base d'un taux de 11,5%."]
["si paiement après échéance : 40 €"]
["Pas d'escompte en cas de paiement anticipé.\"",null,null,null,"(loi n 92.1442 du 31/12/1992)"]
["TVA NON APPLICABLE ARTICLE 293B DU CGI "]

{"sheet":"Liste clients","index":3,"n_rows":20,"n_cols":7,"rows_kept":20,"cut":false,"hidden":false,"merged":[[1,1,1,5]]}
[]
[null,"LISTE CLIENTS"]
[]
[null,"Client","N°","Adresse","Complément adresse","Ville"]
[]
[]
[]
[]
[]
[]
[]
[]
[]
[]
[]
[]
[]
[]
[null,null,null,null,null,null,{"$f":"IF(E19=\"\",\"\",E19*F19)","v":""}]
[null,null,null,null,null,null,{"$f":"IF(E20=\"\",\"\",E20*F20)","v":""}]

{"sheet":"Liste articles","index":4,"n_rows":460,"n_cols":10,"rows_kept":460,"cut":false,"hidden":false,"merged":[[10,9,10,12],[1,1,1,12]]}
[]
[null,"LISTE ARTICLES"]
[]
[]
[null,"Article","Ref","Qté / carton","Prix de vente unitaire","Prix / carton","Poids / Carton (kg)",null,null,"> Vérifier l'état des stocks"]
[null,"Jambon de Parme BIO x 0,70 gr x 10 pz ",{"$f":"IF(B6=\"\",\"\",B6)","v":"Jambon de Parme BIO x 0,70 gr x 10 pz "},10,4.95,49.5,0.7]
[null,"Jambon Cru National BIO RESERVE x 0,70gr x 10 pz ",{"$f":"IF(B7=\"\",\"\",B7)","v":"Jambon Cru National BIO RESERVE x 0,70gr x 10 pz "},10,3.95,39.5,0.7]
[null,"Salami Milano BIO x 0,70 gr x 10 pz ","Salami Milano BIO x 0,70 gr x 10 pz ",10,2.5,25,0.7,null,null,"> Renseigner le stock initial"]
[null,"Bresaola di Suino BIO x 0,70 gr x 10 pz ","Bresaola di Suino BIO x 0,70 gr x 10 pz ",10,3.6,36,0.7]
[null,"Mortadella Bologna BIO IGP x 100 gr x 10 pz ","Mortadella Bologna BIO IGP x 100 gr x 10 pz ",10,2.5,25,1]
[null,"Jambon Cuit BIO x 100 gr x 10 pz ","Jambon Cuit BIO x 100 gr x 10 pz ",10,3.45,34.5,1]
[null," Tagliatelles fraîches aux œufs"," Tagliatelles fraîches aux œufs",6,1.45,8.6999999999999993,1.5]
[null," Pâtes fraîches au petit épeautre de Provence"," Pâtes fraîches au petit épeautre de Provence",6,1.51,9.06,1.5]
[null," Ravioli frais aux petits légumes de Méditerranée"," Ravioli frais aux petits légumes de Méditerranée",6,2.2799999999999998,13.68,1.5]
[null," Ravioli frais potimarron & emmenthal"," Ravioli frais potimarron & emmenthal",6,2.54,15.24,1.5]
[null," Ravioles Fromages, Ail & Fines Herbes "," Ravioles Fromages, Ail & Fines Herbes ",6,2.67,16.02,1.5]
[null," Ravioles aux 3 fromages"," Ravioles aux 3 fromages",4,3.06,12.24,1.1200000000000001]
[null," Ravioli frais tofu & basilic - recette sans œuf"," Ravioli frais tofu & basilic - recette sans œuf",6,2.16,12.96,1.5]
[null," Demi-lune tomate fromage de brebis    "," Demi-lune tomate fromage de brebis    ",6,2.82,16.920000000000002,1.5]
[null," Cappelletti frais aux épinards & emmenthal"," Cappelletti frais aux épinards & emmenthal",6,2.4900000000000002,14.94,1.5]
[null," Ravioli frais saumon fumé                     "," Ravioli frais saumon fumé                     ",6,3.02,18.12,1.5]
[null," Gnocchi frais Nature recette traditionnelle"," Gnocchi frais Nature recette traditionnelle",6,1.87,11.22,1.8]
[null," Gnocchi frais Tomate & Basilic"," Gnocchi frais Tomate & Basilic",6,2.08,12.48,1.8]
[null," Quenelles fraîches natures "," Quenelles fraîches natures ",6,2.54,15.24,1.68]
[null," Steak de tofu potimarron"," Steak de tofu potimarron",6,2.79,16.739999999999998,1]
[null," Steak de tofu noisettes"," Steak de tofu noisettes",6,2.79,16.739999999999998,1]
[null," Steak de tofu indienne"," Steak de tofu indienne",6,2.79,16.739999999999998,1]
[null," Steak de tofu provençale"," Steak de tofu provençale",6,2.79,16.739999999999998,1]
[null," Steak de tofu aubergine parmesan"," Steak de tofu aubergine parmesan",6,2.79,16.739999999999998,1]
[null," Steak de tofu épinard emmenthal"," Steak de tofu épinard emmenthal",6,2.79,16.739999999999998,1]
[null," Steak de tofu tomate chèvre         "," Steak de tofu tomate chèvre         ",6,2.79,16.739999999999998,1]
[null," Tofu nature"," Tofu nature",6,2.04,12.24,1.5]
[null," Tofu basilic"," Tofu basilic",6,2.79,16.739999999999998,1.2]
[null," Tofu fumé"," Tofu fumé",6,2.65,15.9,1.2]
[null," Haché végétal cuisiné à la provençale    "," Haché végétal cuisiné à la provençale    ",6,2.65,15.9,1.5]
[null," Polenta emmental                                "," Polenta emmental                                ",6,2.35,14.1,1.5]
[null," Panisse Nature"," Panisse Nature",6,2.04,12.24,1.5]
[null," Caviar d'Aubergine"," Caviar d'Aubergine",8,2.48,19.84,0.7]
[null," Houmous  (purée de pois chiches)                                                    "," Houmous  (purée de pois chiches)                                                    ",8,2.25,18,0.7]
[null," Délice de Tomates séchées  au Basilic"," Délice de Tomates séchées  au Basilic",8,2.33,18.64,0.7]
[null," Tapenade aux olives noires                                                       "," Tapenade aux olives noires                                                       ",8,2.95,23.6,0.7]
[null," Fromage frais en faisselle Lait de vache"," Fromage frais en faisselle Lait de vache",6,2.58,15.48,2.4]
[null," Faisselle de brebis au lait cru                     "," Faisselle de brebis au lait cru                     ",4,3.16,12.64,1.7]
[null," Chèvre frais  au lait cru"," Chèvre frais  au lait cru",6,1.96,11.76,0.7]
[null," Brebis frais au lait cru"," Brebis frais au lait cru",6,1.88,11.28,0.7]
[null," Brebis affinée au lait cru                    "," Brebis affinée au lait cru                    ",6,3.54,21.24,0.7]
[null," Bleu de brebis au lait cru  "," Bleu de brebis au lait cru  ",6,3.28,19.68,0.7]
[null," Délice crémeux fromage de vache affiné"," Délice crémeux fromage de vache affiné",6,5.54,33.24,0.7]
[null,"POELEE FORESTIERE FONDANT DE BŒUF AU MARRON","POELEE FORESTIERE FONDANT DE BŒUF AU MARRON",6,2.98,17.88,1.2]
[null,"TAJINE DE BOULGOUR AU BROCOLIS ET TOFU","TAJINE DE BOULGOUR AU BROCOLIS ET TOFU",6,2.98,17.88,1.2]
[null,"CASSOLETTE AUX QUATRES LEGUMES PERSILLES","CASSOLETTE AUX QUATRES LEGUMES PERSILLES",6,2.74,16.440000000000001,1.2]
[null,"PUREE DE BUTTERNUT FRICASEE DE POULET","PUREE DE BUTTERNUT FRICASEE DE POULET",6,2.84,17.04,1]
[null,"FLEURETTE DE CHOU-FLEUR RIZ BŒUF AU ROMARIN","FLEURETTE DE CHOU-FLEUR RIZ BŒUF AU ROMARIN",6,2.84,17.04,1]
[null,"MOUlINE DE PANAIS TOUCHE DE MUSCADE","MOUlINE DE PANAIS TOUCHE DE MUSCADE",6,2.68,16.079999999999998,1]
[null,"DOUCEUR DE CAROTTES AU THYM","DOUCEUR DE CAROTTES AU THYM",6,2.48,14.88,1]
[null,"MOUSSELINE DE PATATE DOUCE","MOUSSELINE DE PATATE DOUCE",6,2.48,14.88,1]
[null,"PUREE D'HARICOT VERT ","PUREE D'HARICOT VERT ",6,2.48,14.88,1]
[null,null,""]
[null,null,""]
[null,null,""]
[null,null,""]
[null,null,""]
[null,null,""]
[null,null,""]
[null,null,""]
[null,null,""]
[null,null,""]
[null,null,""]
[null,null,""]
[null,null,""]
[null,null,{"$f":"IF(B71=\"\",\"\",B71)","v":""}]
[null,null,""]
[null,null,""]
[null,null,""]
[null,null,""]
[null,null,""]
[null,null,""]
[null,null,""]
[null,null,""]
[null,null,""]
[null,null,""]
[null,null,""]
[null,null,""]
[null,null,""]
[null,null,""]
[null,null,""]
[null,null,""]
[null,null,""]
[null,null,""]
[null,null,""]
[null,null,""]
[null,null,""]
[null,null,""]
[null,null,""]
[null,null,""]
[null,null,""]
[null,null,""]
[null,null,""]
[null,null,""]
[null,null,""]
[null,null,""]
[null,null,""]
[null,null,""]
[null,null,""]
[null,null,""]
[null,null,""]
[null,null,""]
[null,null,""]
[null,null,""]
[null,null,""]
[null,null,""]
[null,null,""]
[null,null,""]
[null,null,""]
[null,null,""]
[null,null,""]
[null,null,""]
[null,null,""]
[null,null,""]
[null,null,""]
[null,null,""]
[null,null,""]
[null,null,""]
[null,null,""]
[null,null,""]
[null,null,""]
[null,null,""]
[null,null,""]
[null,null,""]
[null,null,""]
[null,null,""]
[null,null,""]
[null,null,""]
[null,null,""]
[null,null,{"$f":"IF(B135=\"\",\"\",B135)","v":""}]
[null,null,""]
[null,null,""]
[null,null,""]
[null,null,""]
[null,null,""]
[null,null,""]
[null,null,""]
[null,null,""]
[null,null,""]
[null,null,""]
[null,null,""]
[null,null,""]
[null,null,""]
[null,null,""]
[null,null,""]
[null,null,""]
[null,null,""]
[null,null,""]
[null,null,""]
[null,null,""]
[null,null,""]
[null,null,""]
[null,null,""]
[null,null,""]
[null,null,""]
[null,null,""]
[null,null,""]
[null,null,""]
[null,null,""]
[null,null,""]
[null,null,""]
[null,null,""]
[null,null,""]
[null,null,""]
[null,null,""]
[null,null,""]
[null,null,""]
[null,null,""]
[null,null,""]
[null,null,""]
[null,null,""]
[null,null,""]
[null,null,""]
[null,null,""]
[null,null,""]
[null,null,""]
[null,null,""]
[null,null,""]
[null,null,""]
[null,null,""]
[null,null,""]
[null,null,""]
[null,null,""]
[null,null,""]
[null,null,""]
[null,null,""]
[null,null,""]
[null,null,""]
[null,null,""]
[null,null,""]
[null,null,""]
[null,null,""]
[null,null,""]
[null,null,{"$f":"IF(B199=\"\",\"\",B199)","v":""}]
[null,null,""]
[null,null,""]
[null,null,""]
[null,null,""]
[null,null,""]
[null,null,""]
[null,null,""]
[null,null,""]
[null,null,""]
[null,null,""]
[null,null,""]
[null,null,""]
[null,null,""]
[null,null,""]
[null,null,""]
[null,null,""]
[null,null,""]
[null,null,""]
[null,null,""]
[null,null,""]
[null,null,""]
[null,null,""]
[null,null,""]
[null,null,""]
[null,null,""]
[null,null,""]
[null,null,""]
[null,null,""]
[null,null,""]
[null,null,""]
[null,null,""]
[null,null,""]
[null,null,""]
[null,null,""]
[null,null,""]
[null,null,""]
[null,null,""]
[null,null,""]
[null,null,""]
[null,null,""]
[null,null,""]
[null,null,""]
[null,null,""]
[null,null,""]
[null,null,""]
[null,null,""]
[null,null,""]
[null,null,""]
[null,null,""]
[null,null,""]
[null,null,""]
[null,null,""]
[null,null,""]
[null,null,""]
[null,null,""]
[null,null,""]
[null,null,""]
[null,null,""]
[null,null,""]
[null,null,""]
[null,null,""]
[null,null,""]
[null,null,""]
[null,null,{"$f":"IF(B263=\"\",\"\",B263)","v":""}]
[null,null,""]
[null,null,""]
[null,null,""]
[null,null,""]
[null,null,""]
[null,null,""]
[null,null,""]
[null,null,""]
[null,null,""]
[null,null,""]
[null,null,""]
[null,null,""]
[null,null,""]
[null,null,""]
[null,null,""]
[null,null,""]
[null,null,""]
[null,null,""]
[null,null,""]
[null,null,""]
[null,null,""]
[null,null,""]
[null,null,""]
[null,null,""]
[null,null,""]
[null,null,""]
[null,null,""]
[null,null,""]
[null,null,""]
[null,null,""]
[null,null,""]
[null,null,""]
[null,null,""]
[null,null,""]
[null,null,""]
[null,null,""]
[null,null,""]
[null,null,""]
[null,null,""]
[null,null,""]
[null,null,""]
[null,null,""]
[null,null,""]
[null,null,""]
[null,null,""]
[null,null,""]
[null,null,""]
[null,null,""]
[null,null,""]
[null,null,""]
[null,null,""]
[null,null,""]
[null,null,""]
[null,null,""]
[null,null,""]
[null,null,""]
[null,null,""]
[null,null,""]
[null,null,""]
[null,null,""]
[null,null,""]
[null,null,""]
[null,null,""]
[null,null,{"$f":"IF(B327=\"\",\"\",B327)","v":""}]
[null,null,""]
[null,null,""]
[null,null,""]
[null,null,""]
[null,null,""]
[null,null,""]
[null,null,""]
[null,null,""]
[null,null,""]
[null,null,""]
[null,null,""]
[null,null,""]
[null,null,""]
[null,null,""]
[null,null,""]
[null,null,""]
[null,null,""]
[null,null,""]
[null,null,""]
[null,null,""]
[null,null,""]
[null,null,""]
[null,null,""]
[null,null,""]
[null,null,""]
[null,null,""]
[null,null,""]
[null,null,""]
[null,null,""]
[null,null,""]
[null,null,""]
[null,null,""]
[null,null,""]
[null,null,""]
[null,null,""]
[null,null,""]
[null,null,""]
[null,null,""]
[null,null,""]
[null,null,""]
[null,null,""]
[null,null,""]
[null,null,""]
[null,null,""]
[null,null,""]
[null,null,""]
[null,null,""]
[null,null,""]
[null,null,""]
[null,null,""]
[null,null,""]
[null,null,""]
[null,null,""]
[null,null,""]
[null,null,""]
[null,null,""]
[null,null,""]
[null,null,""]
[null,null,""]
[null,null,""]
[null,null,""]
[null,null,""]
[null,null,""]
[null,null,{"$f":"IF(B391=\"\",\"\",B391)","v":""}]
[null,null,""]
[null,null,""]
[null,null,""]
[null,null,""]
[null,null,""]
[null,null,""]
[null,null,""]
[null,null,""]
[null,null,""]
[null,null,""]
[null,null,""]
[null,null,""]
[null,null,""]
[null,null,""]
[null,null,""]
[null,null,""]
[null,null,""]
[null,null,""]
[null,null,""]
[null,null,""]
[null,null,""]
[null,null,""]
[null,null,""]
[null,null,""]
[null,null,""]
[null,null,""]
[null,null,""]
[null,null,""]
[null,null,""]
[null,null,""]
[null,null,""]
[null,null,""]
[null,null,""]
[null,null,""]
[null,null,""]
[null,null,""]
[null,null,""]
[null,null,""]
[null,null,""]
[null,null,""]
[null,null,""]
[null,null,""]
[null,null,""]
[null,null,""]
[null,null,""]
[null,null,""]
[null,null,""]
[null,null,""]
[null,null,""]
[null,null,""]
[null,null,""]
[null,null,""]
[null,null,""]
[null,null,""]
[null,null,""]
[null,null,""]
[null,null,""]
[null,null,""]
[null,null,""]
[null,null,""]
[null,null,""]
[null,null,""]
[null,null,""]
[null,null,{"$f":"IF(B455=\"\",\"\",B455)","v":""}]
[null,null,""]
[null,null,""]
[null,null,""]
[null,null,""]
[null,null,""]

{"sheet":"Entrées et Sorties","index":5,"n_rows":179,"n_cols":9,"rows_kept":179,"cut":false,"hidden":false,"merged":[[14,10,14,11],[15,10,15,11],[1,0,1,8]]}
[]
["JOURNAL D'ENTRÉES ET SORTIES"]
[]
[null,"Date","Article","Ref","Entrée","Sortie",null,null,"> Vérifier l'état des stocks"]
[null,null,{"$f":"IF(BL!A16=\"\",\"\",BL!A16)","v":""},""]
[null,null,null,"",{"$f":"IF(B6=\"\",\"\",BL!D17)","v":""},null,null,null,"> Accéder à la liste des articles"]
[null,null,null,"",{"$f":"IF(B7=\"\",\"\",BL!D18)","v":""}]
[null,null,null,""]
[null,null,null,""]
[null,null,null,""]
[null,null,null,""]
[null,null,null,""]
[null,null,null,""]
[null,null,null,""]
[null,null,null,""]
[null,null,null,""]
[null,null,null,""]
[null,null,null,""]
[null,null,null,""]
[null,null,null,""]
[null,null,null,""]
[null,null,null,""]
[null,null,null,""]
[null,null,null,""]
[null,null,null,""]
[null,null,null,""]
[null,null,null,""]
[null,null,null,""]
[null,null,null,""]
[null,null,null,""]
[null,null,null,""]
[null,null,null,""]
[null,null,null,""]
[null,null,null,""]
[null,null,null,""]
[null,null,null,""]
[null,null,null,""]
[null,null,null,""]
[null,null,null,""]
[null,null,null,""]
[null,null,null,""]
[null,null,null,""]
[null,null,null,""]
[null,null,null,""]
[null,null,null,""]
[null,null,null,""]
[null,null,null,""]
[null,null,null,""]
[null,null,null,""]
[null,null,null,""]
[null,null,null,""]
[null,null,null,""]
[null,null,null,""]
[null,null,null,""]
[null,null,null,""]
[null,null,null,""]
[null,null,null,""]
[null,null,null,""]
[null,null,null,""]
[null,null,null,""]
[null,null,null,""]
[null,null,null,""]
[null,null,null,""]
[null,null,null,""]
[null,null,null,""]
[null,null,null,""]
[null,null,null,""]
[null,null,null,""]
[null,null,null,""]
[null,null,null,""]
[null,null,null,""]
[null,null,null,""]
[null,null,null,""]
[null,null,null,""]
[null,null,null,""]
[null,null,null,""]
[null,null,null,""]
[null,null,null,""]
[null,null,null,""]
[null,null,null,""]
[null,null,null,""]
[null,null,null,""]
[null,null,null,""]
[null,null,null,""]
[null,null,null,""]
[null,null,null,""]
[null,null,null,""]
[null,null,null,""]
[null,null,null,""]
[null,null,null,""]
[null,null,null,""]
[null,null,null,""]
[null,null,null,""]
[null,null,null,""]
[null,null,null,""]
[null,null,null,""]
[null,null,null,""]
[null,null,null,""]
[null,null,null,""]
[null,null,null,""]
[null,null,null,""]
[null,null,null,""]
[null,null,null,""]
[null,null,null,""]
[null,null,null,""]
[null,null,null,""]
[null,null,null,""]
[null,null,null,""]
[null,null,null,""]
[null,null,null,""]
[null,null,null,""]
[null,null,null,""]
[null,null,null,""]
[null,null,null,""]
[null,null,null,""]
[null,null,null,""]
[null,null,null,""]
[null,null,null,""]
[null,null,null,""]
[null,null,null,""]
[null,null,null,""]
[null,null,null,""]
[null,null,null,""]
[null,null,null,""]
[null,null,null,""]
[null,null,null,""]
[null,null,null,""]
[null,null,null,""]
[null,null,null,""]
[null,null,null,""]
[null,null,null,""]
[null,null,null,""]
[null,null,null,""]
[null,null,null,""]
[null,null,null,""]
[null,null,null,""]
[null,null,null,""]
[null,null,null,""]
[null,null,null,""]
[null,null,null,""]
[null,null,null,""]
[null,null,null,""]
[null,null,null,""]
[null,null,null,""]
[null,null,null,""]
[null,null,null,""]
[null,null,null,""]
[null,null,null,""]
[null,null,null,""]
[null,null,null,""]
[null,null,null,""]
[null,null,null,""]
[null,null,null,""]
[null,null,null,""]
[null,null,null,""]
[null,null,null,""]
[null,null,null,""]
[null,null,null,""]
[null,null,null,""]
[null,null,null,""]
[null,null,null,""]
[null,null,null,""]
[null,null,null,""]
[null,null,null,""]
[null,null,null,""]
[null,null,null,""]
[null,null,null,""]
[null,null,null,""]
[null,null,null,""]
[null,null,null,""]
[null,null,null,""]
[null,null,null,""]
[null,null,null,""]
[null,null,null,""]
[null,null,null,""]
[null,null,null,""]
[null,null,null,""]
[null,null,null,""]
[null,null,null,""]

{"sheet":"Etat des stocks","index":6,"n_rows":464,"n_cols":10,"rows_kept":464,"cut":false,"hidden":false,"merged":[[9,9,9,12],[1,1,1,8]]}
[]
[null,"ÉTAT DES STOCKS"]
[]
[]
[null,"Article","Ref","Stock initial","Entrées","Sorties","Stock Final",null,null,"> Accéder à la liste des articles"]
[null,{"$f":"IF('Liste articles'!B6=\"\",\"\",'Liste articles'!B6)","v":"Jambon de Parme BIO x 0,70 gr x 10 pz "},{"$f":"IF('Liste articles'!C6=\"\",\"\",'Liste articles'!C6)","v":"Jambon de Parme BIO x 0,70 gr x 10 pz "},null,{"$f":"IF(B6=\"\",\"\",SUMIFS('Entrées et Sorties'!E$5:E$397,'Entrées et Sorties'!D$5:D$397,C6))","v":0},{"$f":"IF(C6=\"\",\"\",SUMIFS('Entrées et Sorties'!F$5:F$497,'Entrées et Sorties'!D$5:D$497,C6))","v":0},{"$f":"IF(C6=\"\",\"\",D6+E6-F6)","v":0}]
[null,{"$f":"IF('Liste articles'!B7=\"\",\"\",'Liste articles'!B7)","v":"Jambon Cru National BIO RESERVE x 0,70gr x 10 pz "},{"$f":"IF('Liste articles'!C7=\"\",\"\",'Liste articles'!C7)","v":"Jambon Cru National BIO RESERVE x 0,70gr x 10 pz "},null,{"$f":"IF(B7=\"\",\"\",SUMIFS('Entrées et Sorties'!E$5:E$397,'Entrées et Sorties'!D$5:D$397,C7))","v":0},{"$f":"IF(C7=\"\",\"\",SUMIFS('Entrées et Sorties'!F$5:F$497,'Entrées et Sorties'!D$5:D$497,C7))","v":0},{"$f":"IF(C7=\"\",\"\",D7+E7-F7)","v":0}]
[null,{"$f":"IF('Liste articles'!B8=\"\",\"\",'Liste articles'!B8)","v":"Salami Milano BIO x 0,70 gr x 10 pz "},{"$f":"IF('Liste articles'!C8=\"\",\"\",'Liste articles'!C8)","v":"Salami Milano BIO x 0,70 gr x 10 pz "},null,{"$f":"IF(B8=\"\",\"\",SUMIFS('Entrées et Sorties'!E$5:E$397,'Entrées et Sorties'!D$5:D$397,C8))","v":0},{"$f":"IF(C8=\"\",\"\",SUMIFS('Entrées et Sorties'!F$5:F$497,'Entrées et Sorties'!D$5:D$497,C8))","v":0},0]
[null,{"$f":"IF('Liste articles'!B9=\"\",\"\",'Liste articles'!B9)","v":"Bresaola di Suino BIO x 0,70 gr x 10 pz "},{"$f":"IF('Liste articles'!C9=\"\",\"\",'Liste articles'!C9)","v":"Bresaola di Suino BIO x 0,70 gr x 10 pz "},null,{"$f":"IF(B9=\"\",\"\",SUMIFS('Entrées et Sorties'!E$5:E$397,'Entrées et Sorties'!D$5:D$397,C9))","v":0},{"$f":"IF(C9=\"\",\"\",SUMIFS('Entrées et Sorties'!F$5:F$497,'Entrées et Sorties'!D$5:D$497,C9))","v":0},0]
[null,{"$f":"IF('Liste articles'!B10=\"\",\"\",'Liste articles'!B10)","v":"Mortadella Bologna BIO IGP x 100 gr x 10 pz "},{"$f":"IF('Liste articles'!C10=\"\",\"\",'Liste articles'!C10)","v":"Mortadella Bologna BIO IGP x 100 gr x 10 pz "},null,{"$f":"IF(B10=\"\",\"\",SUMIFS('Entrées et Sorties'!E$5:E$397,'Entrées et Sorties'!D$5:D$397,C10))","v":0},{"$f":"IF(C10=\"\",\"\",SUMIFS('Entrées et Sorties'!F$5:F$497,'Entrées et Sorties'!D$5:D$497,C10))","v":0},0]
[null,{"$f":"IF('Liste articles'!B11=\"\",\"\",'Liste articles'!B11)","v":"Jambon Cuit BIO x 100 gr x 10 pz "},{"$f":"IF('Liste articles'!C11=\"\",\"\",'Liste articles'!C11)","v":"Jambon Cuit BIO x 100 gr x 10 pz "},null,{"$f":"IF(B11=\"\",\"\",SUMIFS('Entrées et Sorties'!E$5:E$397,'Entrées et Sorties'!D$5:D$397,C11))","v":0},{"$f":"IF(C11=\"\",\"\",SUMIFS('Entrées et Sorties'!F$5:F$497,'Entrées et Sorties'!D$5:D$497,C11))","v":0},0]
[null,{"$f":"IF('Liste articles'!B12=\"\",\"\",'Liste articles'!B12)","v":" Tagliatelles fraîches aux œufs"},{"$f":"IF('Liste articles'!C12=\"\",\"\",'Liste articles'!C12)","v":" Tagliatelles fraîches aux œufs"},null,{"$f":"IF(B12=\"\",\"\",SUMIFS('Entrées et Sorties'!E$5:E$397,'Entrées et Sorties'!D$5:D$397,C12))","v":0},{"$f":"IF(C12=\"\",\"\",SUMIFS('Entrées et Sorties'!F$5:F$497,'Entrées et Sorties'!D$5:D$497,C12))","v":0},0]
[null,{"$f":"IF('Liste articles'!B13=\"\",\"\",'Liste articles'!B13)","v":" Pâtes fraîches au petit épeautre de Provence"},{"$f":"IF('Liste articles'!C13=\"\",\"\",'Liste articles'!C13)","v":" Pâtes fraîches au petit épeautre de Provence"},null,{"$f":"IF(B13=\"\",\"\",SUMIFS('Entrées et Sorties'!E$5:E$397,'Entrées et Sorties'!D$5:D$397,C13))","v":0},{"$f":"IF(C13=\"\",\"\",SUMIFS('Entrées et Sorties'!F$5:F$497,'Entrées et Sorties'!D$5:D$497,C13))","v":0},{"$f":"IF(C13=\"\",\"\",D13+E13-F13)","v":0}]
[null,{"$f":"IF('Liste articles'!B14=\"\",\"\",'Liste articles'!B14)","v":" Ravioli frais aux petits légumes de Méditerranée"},{"$f":"IF('Liste articles'!C14=\"\",\"\",'Liste articles'!C14)","v":" Ravioli frais aux petits légumes de Méditerranée"},null,{"$f":"IF(B14=\"\",\"\",SUMIFS('Entrées et Sorties'!E$5:E$397,'Entrées et Sorties'!D$5:D$397,C14))","v":0},{"$f":"IF(C14=\"\",\"\",SUMIFS('Entrées et Sorties'!F$5:F$497,'Entrées et Sorties'!D$5:D$497,C14))","v":0},0]
[null,{"$f":"IF('Liste articles'!B15=\"\",\"\",'Liste articles'!B15)","v":" Ravioli frais potimarron & emmenthal"},{"$f":"IF('Liste articles'!C15=\"\",\"\",'Liste articles'!C15)","v":" Ravioli frais potimarron & emmenthal"},null,{"$f":"IF(B15=\"\",\"\",SUMIFS('Entrées et Sorties'!E$5:E$397,'Entrées et Sorties'!D$5:D$397,C15))","v":0},{"$f":"IF(C15=\"\",\"\",SUMIFS('Entrées et Sorties'!F$5:F$497,'Entrées et Sorties'!D$5:D$497,C15))","v":0},0]
[null,{"$f":"IF('Liste articles'!B16=\"\",\"\",'Liste articles'!B16)","v":" Ravioles Fromages, Ail & Fines Herbes "},{"$f":"IF('Liste articles'!C16=\"\",\"\",'Liste articles'!C16)","v":" Ravioles Fromages, Ail & Fines Herbes "},null,{"$f":"IF(B16=\"\",\"\",SUMIFS('Entrées et Sorties'!E$5:E$397,'Entrées et Sorties'!D$5:D$397,C16))","v":0},{"$f":"IF(C16=\"\",\"\",SUMIFS('Entrées et Sorties'!F$5:F$497,'Entrées et Sorties'!D$5:D$497,C16))","v":0},0]
[null,{"$f":"IF('Liste articles'!B17=\"\",\"\",'Liste articles'!B17)","v":" Ravioles aux 3 fromages"},{"$f":"IF('Liste articles'!C17=\"\",\"\",'Liste articles'!C17)","v":" Ravioles aux 3 fromages"},null,{"$f":"IF(B17=\"\",\"\",SUMIFS('Entrées et Sorties'!E$5:E$397,'Entrées et Sorties'!D$5:D$397,C17))","v":0},{"$f":"IF(C17=\"\",\"\",SUMIFS('Entrées et Sorties'!F$5:F$497,'Entrées et Sorties'!D$5:D$497,C17))","v":0},0]
[null,{"$f":"IF('Liste articles'!B18=\"\",\"\",'Liste articles'!B18)","v":" Ravioli frais tofu & basilic - recette sans œuf"},{"$f":"IF('Liste articles'!C18=\"\",\"\",'Liste articles'!C18)","v":" Ravioli frais tofu & basilic - recette sans œuf"},null,{"$f":"IF(B18=\"\",\"\",SUMIFS('Entrées et Sorties'!E$5:E$397,'Entrées et Sorties'!D$5:D$397,C18))","v":0},{"$f":"IF(C18=\"\",\"\",SUMIFS('Entrées et Sorties'!F$5:F$497,'Entrées et Sorties'!D$5:D$497,C18))","v":0},0]
[null,{"$f":"IF('Liste articles'!B19=\"\",\"\",'Liste articles'!B19)","v":" Demi-lune tomate fromage de brebis    "},{"$f":"IF('Liste articles'!C19=\"\",\"\",'Liste articles'!C19)","v":" Demi-lune tomate fromage de brebis    "},null,{"$f":"IF(B19=\"\",\"\",SUMIFS('Entrées et Sorties'!E$5:E$397,'Entrées et Sorties'!D$5:D$397,C19))","v":0},{"$f":"IF(C19=\"\",\"\",SUMIFS('Entrées et Sorties'!F$5:F$497,'Entrées et Sorties'!D$5:D$497,C19))","v":0},0]
[null,{"$f":"IF('Liste articles'!B20=\"\",\"\",'Liste articles'!B20)","v":" Cappelletti frais aux épinards & emmenthal"},{"$f":"IF('Liste articles'!C20=\"\",\"\",'Liste articles'!C20)","v":" Cappelletti frais aux épinards & emmenthal"},null,{"$f":"IF(B20=\"\",\"\",SUMIFS('Entrées et Sorties'!E$5:E$397,'Entrées et Sorties'!D$5:D$397,C20))","v":0},{"$f":"IF(C20=\"\",\"\",SUMIFS('Entrées et Sorties'!F$5:F$497,'Entrées et Sorties'!D$5:D$497,C20))","v":0},0]
[null,{"$f":"IF('Liste articles'!B21=\"\",\"\",'Liste articles'!B21)","v":" Ravioli frais saumon fumé                     "},{"$f":"IF('Liste articles'!C21=\"\",\"\",'Liste articles'!C21)","v":" Ravioli frais saumon fumé                     "},null,{"$f":"IF(B21=\"\",\"\",SUMIFS('Entrées et Sorties'!E$5:E$397,'Entrées et Sorties'!D$5:D$397,C21))","v":0},{"$f":"IF(C21=\"\",\"\",SUMIFS('Entrées et Sorties'!F$5:F$497,'Entrées et Sorties'!D$5:D$497,C21))","v":0},0]
[null,{"$f":"IF('Liste articles'!B22=\"\",\"\",'Liste articles'!B22)","v":" Gnocchi frais Nature recette traditionnelle"},{"$f":"IF('Liste articles'!C22=\"\",\"\",'Liste articles'!C22)","v":" Gnocchi frais Nature recette traditionnelle"},null,{"$f":"IF(B22=\"\",\"\",SUMIFS('Entrées et Sorties'!E$5:E$397,'Entrées et Sorties'!D$5:D$397,C22))","v":0},{"$f":"IF(C22=\"\",\"\",SUMIFS('Entrées et Sorties'!F$5:F$497,'Entrées et Sorties'!D$5:D$497,C22))","v":0},0]
[null,{"$f":"IF('Liste articles'!B23=\"\",\"\",'Liste articles'!B23)","v":" Gnocchi frais Tomate & Basilic"},{"$f":"IF('Liste articles'!C23=\"\",\"\",'Liste articles'!C23)","v":" Gnocchi frais Tomate & Basilic"},null,{"$f":"IF(B23=\"\",\"\",SUMIFS('Entrées et Sorties'!E$5:E$397,'Entrées et Sorties'!D$5:D$397,C23))","v":0},{"$f":"IF(C23=\"\",\"\",SUMIFS('Entrées et Sorties'!F$5:F$497,'Entrées et Sorties'!D$5:D$497,C23))","v":0},0]
[null,{"$f":"IF('Liste articles'!B24=\"\",\"\",'Liste articles'!B24)","v":" Quenelles fraîches natures "},{"$f":"IF('Liste articles'!C24=\"\",\"\",'Liste articles'!C24)","v":" Quenelles fraîches natures "},null,{"$f":"IF(B24=\"\",\"\",SUMIFS('Entrées et Sorties'!E$5:E$397,'Entrées et Sorties'!D$5:D$397,C24))","v":0},{"$f":"IF(C24=\"\",\"\",SUMIFS('Entrées et Sorties'!F$5:F$497,'Entrées et Sorties'!D$5:D$497,C24))","v":0},0]
[null,{"$f":"IF('Liste articles'!B25=\"\",\"\",'Liste articles'!B25)","v":" Steak de tofu potimarron"},{"$f":"IF('Liste articles'!C25=\"\",\"\",'Liste articles'!C25)","v":" Steak de tofu potimarron"},null,{"$f":"IF(B25=\"\",\"\",SUMIFS('Entrées et Sorties'!E$5:E$397,'Entrées et Sorties'!D$5:D$397,C25))","v":0},{"$f":"IF(C25=\"\",\"\",SUMIFS('Entrées et Sorties'!F$5:F$497,'Entrées et Sorties'!D$5:D$497,C25))","v":0},0]
[null,{"$f":"IF('Liste articles'!B26=\"\",\"\",'Liste articles'!B26)","v":" Steak de tofu noisettes"},{"$f":"IF('Liste articles'!C26=\"\",\"\",'Liste articles'!C26)","v":" Steak de tofu noisettes"},null,{"$f":"IF(B26=\"\",\"\",SUMIFS('Entrées et Sorties'!E$5:E$397,'Entrées et Sorties'!D$5:D$397,C26))","v":0},{"$f":"IF(C26=\"\",\"\",SUMIFS('Entrées et Sorties'!F$5:F$497,'Entrées et Sorties'!D$5:D$497,C26))","v":0},0]
[null,{"$f":"IF('Liste articles'!B27=\"\",\"\",'Liste articles'!B27)","v":" Steak de tofu indienne"},{"$f":"IF('Liste articles'!C27=\"\",\"\",'Liste articles'!C27)","v":" Steak de tofu indienne"},null,{"$f":"IF(B27=\"\",\"\",SUMIFS('Entrées et Sorties'!E$5:E$397,'Entrées et Sorties'!D$5:D$397,C27))","v":0},{"$f":"IF(C27=\"\",\"\",SUMIFS('Entrées et Sorties'!F$5:F$497,'Entrées et Sorties'!D$5:D$497,C27))","v":0},0]
[null,{"$f":"IF('Liste articles'!B28=\"\",\"\",'Liste articles'!B28)","v":" Steak de tofu provençale"},{"$f":"IF('Liste articles'!C28=\"\",\"\",'Liste articles'!C28)","v":" Steak de tofu provençale"},null,{"$f":"IF(B28=\"\",\"\",SUMIFS('Entrées et Sorties'!E$5:E$397,'Entrées et Sorties'!D$5:D$397,C28))","v":0},{"$f":"IF(C28=\"\",\"\",SUMIFS('Entrées et Sorties'!F$5:F$497,'Entrées et Sorties'!D$5:D$497,C28))","v":0},0]
[null,{"$f":"IF('Liste articles'!B29=\"\",\"\",'Liste articles'!B29)","v":" Steak de tofu aubergine parmesan"},{"$f":"IF('Liste articles'!C29=\"\",\"\",'Liste articles'!C29)","v":" Steak de tofu aubergine parmesan"},null,{"$f":"IF(B29=\"\",\"\",SUMIFS('Entrées et Sorties'!E$5:E$397,'Entrées et Sorties'!D$5:D$397,C29))","v":0},{"$f":"IF(C29=\"\",\"\",SUMIFS('Entrées et Sorties'!F$5:F$497,'Entrées et Sorties'!D$5:D$497,C29))","v":0},0]
[null,{"$f":"IF('Liste articles'!B30=\"\",\"\",'Liste articles'!B30)","v":" Steak de tofu épinard emmenthal"},{"$f":"IF('Liste articles'!C30=\"\",\"\",'Liste articles'!C30)","v":" Steak de tofu épinard emmenthal"},null,{"$f":"IF(B30=\"\",\"\",SUMIFS('Entrées et Sorties'!E$5:E$397,'Entrées et Sorties'!D$5:D$397,C30))","v":0},{"$f":"IF(C30=\"\",\"\",SUMIFS('Entrées et Sorties'!F$5:F$497,'Entrées et Sorties'!D$5:D$497,C30))","v":0},0]
[null,{"$f":"IF('Liste articles'!B31=\"\",\"\",'Liste articles'!B31)","v":" Steak de tofu tomate chèvre         "},{"$f":"IF('Liste articles'!C31=\"\",\"\",'Liste articles'!C31)","v":" Steak de tofu tomate chèvre         "},null,{"$f":"IF(B31=\"\",\"\",SUMIFS('Entrées et Sorties'!E$5:E$397,'Entrées et Sorties'!D$5:D$397,C31))","v":0},{"$f":"IF(C31=\"\",\"\",SUMIFS('Entrées et Sorties'!F$5:F$497,'Entrées et Sorties'!D$5:D$497,C31))","v":0},0]
[null,{"$f":"IF('Liste articles'!B32=\"\",\"\",'Liste articles'!B32)","v":" Tofu nature"},{"$f":"IF('Liste articles'!C32=\"\",\"\",'Liste articles'!C32)","v":" Tofu nature"},null,{"$f":"IF(B32=\"\",\"\",SUMIFS('Entrées et Sorties'!E$5:E$397,'Entrées et Sorties'!D$5:D$397,C32))","v":0},{"$f":"IF(C32=\"\",\"\",SUMIFS('Entrées et Sorties'!F$5:F$497,'Entrées et Sorties'!D$5:D$497,C32))","v":0},0]
[null,{"$f":"IF('Liste articles'!B33=\"\",\"\",'Liste articles'!B33)","v":" Tofu basilic"},{"$f":"IF('Liste articles'!C33=\"\",\"\",'Liste articles'!C33)","v":" Tofu basilic"},null,{"$f":"IF(B33=\"\",\"\",SUMIFS('Entrées et Sorties'!E$5:E$397,'Entrées et Sorties'!D$5:D$397,C33))","v":0},{"$f":"IF(C33=\"\",\"\",SUMIFS('Entrées et Sorties'!F$5:F$497,'Entrées et Sorties'!D$5:D$497,C33))","v":0},0]
[null,{"$f":"IF('Liste articles'!B34=\"\",\"\",'Liste articles'!B34)","v":" Tofu fumé"},{"$f":"IF('Liste articles'!C34=\"\",\"\",'Liste articles'!C34)","v":" Tofu fumé"},null,{"$f":"IF(B34=\"\",\"\",SUMIFS('Entrées et Sorties'!E$5:E$397,'Entrées et Sorties'!D$5:D$397,C34))","v":0},{"$f":"IF(C34=\"\",\"\",SUMIFS('Entrées et Sorties'!F$5:F$497,'Entrées et Sorties'!D$5:D$497,C34))","v":0},0]
[null,{"$f":"IF('Liste articles'!B35=\"\",\"\",'Liste articles'!B35)","v":" Haché végétal cuisiné à la provençale    "},{"$f":"IF('Liste articles'!C35=\"\",\"\",'Liste articles'!C35)","v":" Haché végétal cuisiné à la provençale    "},null,{"$f":"IF(B35=\"\",\"\",SUMIFS('Entrées et Sorties'!E$5:E$397,'Entrées et Sorties'!D$5:D$397,C35))","v":0},{"$f":"IF(C35=\"\",\"\",SUMIFS('Entrées et Sorties'!F$5:F$497,'Entrées et Sorties'!D$5:D$497,C35))","v":0},0]
[null,{"$f":"IF('Liste articles'!B36=\"\",\"\",'Liste articles'!B36)","v":" Polenta emmental                                "},{"$f":"IF('Liste articles'!C36=\"\",\"\",'Liste articles'!C36)","v":" Polenta emmental                                "},null,{"$f":"IF(B36=\"\",\"\",SUMIFS('Entrées et Sorties'!E$5:E$397,'Entrées et Sorties'!D$5:D$397,C36))","v":0},{"$f":"IF(C36=\"\",\"\",SUMIFS('Entrées et Sorties'!F$5:F$497,'Entrées et Sorties'!D$5:D$497,C36))","v":0},0]
[null,{"$f":"IF('Liste articles'!B37=\"\",\"\",'Liste articles'!B37)","v":" Panisse Nature"},{"$f":"IF('Liste articles'!C37=\"\",\"\",'Liste articles'!C37)","v":" Panisse Nature"},null,{"$f":"IF(B37=\"\",\"\",SUMIFS('Entrées et Sorties'!E$5:E$397,'Entrées et Sorties'!D$5:D$397,C37))","v":0},{"$f":"IF(C37=\"\",\"\",SUMIFS('Entrées et Sorties'!F$5:F$497,'Entrées et Sorties'!D$5:D$497,C37))","v":0},0]
[null,{"$f":"IF('Liste articles'!B38=\"\",\"\",'Liste articles'!B38)","v":" Caviar d'Aubergine"},{"$f":"IF('Liste articles'!C38=\"\",\"\",'Liste articles'!C38)","v":" Caviar d'Aubergine"},null,{"$f":"IF(B38=\"\",\"\",SUMIFS('Entrées et Sorties'!E$5:E$397,'Entrées et Sorties'!D$5:D$397,C38))","v":0},{"$f":"IF(C38=\"\",\"\",SUMIFS('Entrées et Sorties'!F$5:F$497,'Entrées et Sorties'!D$5:D$497,C38))","v":0},0]
[null,{"$f":"IF('Liste articles'!B39=\"\",\"\",'Liste articles'!B39)","v":" Houmous  (purée de pois chiches)                                                    "},{"$f":"IF('Liste articles'!C39=\"\",\"\",'Liste articles'!C39)","v":" Houmous  (purée de pois chiches)                                                    "},null,{"$f":"IF(B39=\"\",\"\",SUMIFS('Entrées et Sorties'!E$5:E$397,'Entrées et Sorties'!D$5:D$397,C39))","v":0},{"$f":"IF(C39=\"\",\"\",SUMIFS('Entrées et Sorties'!F$5:F$497,'Entrées et Sorties'!D$5:D$497,C39))","v":0},0]
[null,{"$f":"IF('Liste articles'!B40=\"\",\"\",'Liste articles'!B40)","v":" Délice de Tomates séchées  au Basilic"},{"$f":"IF('Liste articles'!C40=\"\",\"\",'Liste articles'!C40)","v":" Délice de Tomates séchées  au Basilic"},null,{"$f":"IF(B40=\"\",\"\",SUMIFS('Entrées et Sorties'!E$5:E$397,'Entrées et Sorties'!D$5:D$397,C40))","v":0},{"$f":"IF(C40=\"\",\"\",SUMIFS('Entrées et Sorties'!F$5:F$497,'Entrées et Sorties'!D$5:D$497,C40))","v":0},0]
[null,{"$f":"IF('Liste articles'!B41=\"\",\"\",'Liste articles'!B41)","v":" Tapenade aux olives noires                                                       "},{"$f":"IF('Liste articles'!C41=\"\",\"\",'Liste articles'!C41)","v":" Tapenade aux olives noires                                                       "},null,{"$f":"IF(B41=\"\",\"\",SUMIFS('Entrées et Sorties'!E$5:E$397,'Entrées et Sorties'!D$5:D$397,C41))","v":0},{"$f":"IF(C41=\"\",\"\",SUMIFS('Entrées et Sorties'!F$5:F$497,'Entrées et Sorties'!D$5:D$497,C41))","v":0},0]
[null,{"$f":"IF('Liste articles'!B42=\"\",\"\",'Liste articles'!B42)","v":" Fromage frais en faisselle Lait de vache"},{"$f":"IF('Liste articles'!C42=\"\",\"\",'Liste articles'!C42)","v":" Fromage frais en faisselle Lait de vache"},null,{"$f":"IF(B42=\"\",\"\",SUMIFS('Entrées et Sorties'!E$5:E$397,'Entrées et Sorties'!D$5:D$397,C42))","v":0},{"$f":"IF(C42=\"\",\"\",SUMIFS('Entrées et Sorties'!F$5:F$497,'Entrées et Sorties'!D$5:D$497,C42))","v":0},0]
[null,{"$f":"IF('Liste articles'!B43=\"\",\"\",'Liste articles'!B43)","v":" Faisselle de brebis au lait cru                     "},{"$f":"IF('Liste articles'!C43=\"\",\"\",'Liste articles'!C43)","v":" Faisselle de brebis au lait cru                     "},null,{"$f":"IF(B43=\"\",\"\",SUMIFS('Entrées et Sorties'!E$5:E$397,'Entrées et Sorties'!D$5:D$397,C43))","v":0},{"$f":"IF(C43=\"\",\"\",SUMIFS('Entrées et Sorties'!F$5:F$497,'Entrées et Sorties'!D$5:D$497,C43))","v":0},0]
[null,{"$f":"IF('Liste articles'!B44=\"\",\"\",'Liste articles'!B44)","v":" Chèvre frais  au lait cru"},{"$f":"IF('Liste articles'!C44=\"\",\"\",'Liste articles'!C44)","v":" Chèvre frais  au lait cru"},null,{"$f":"IF(B44=\"\",\"\",SUMIFS('Entrées et Sorties'!E$5:E$397,'Entrées et Sorties'!D$5:D$397,C44))","v":0},{"$f":"IF(C44=\"\",\"\",SUMIFS('Entrées et Sorties'!F$5:F$497,'Entrées et Sorties'!D$5:D$497,C44))","v":0},0]
[null,{"$f":"IF('Liste articles'!B45=\"\",\"\",'Liste articles'!B45)","v":" Brebis frais au lait cru"},{"$f":"IF('Liste articles'!C45=\"\",\"\",'Liste articles'!C45)","v":" Brebis frais au lait cru"},null,{"$f":"IF(B45=\"\",\"\",SUMIFS('Entrées et Sorties'!E$5:E$397,'Entrées et Sorties'!D$5:D$397,C45))","v":0},{"$f":"IF(C45=\"\",\"\",SUMIFS('Entrées et Sorties'!F$5:F$497,'Entrées et Sorties'!D$5:D$497,C45))","v":0},0]
[null,{"$f":"IF('Liste articles'!B46=\"\",\"\",'Liste articles'!B46)","v":" Brebis affinée au lait cru                    "},{"$f":"IF('Liste articles'!C46=\"\",\"\",'Liste articles'!C46)","v":" Brebis affinée au lait cru                    "},null,{"$f":"IF(B46=\"\",\"\",SUMIFS('Entrées et Sorties'!E$5:E$397,'Entrées et Sorties'!D$5:D$397,C46))","v":0},{"$f":"IF(C46=\"\",\"\",SUMIFS('Entrées et Sorties'!F$5:F$497,'Entrées et Sorties'!D$5:D$497,C46))","v":0},0]
[null,{"$f":"IF('Liste articles'!B47=\"\",\"\",'Liste articles'!B47)","v":" Bleu de brebis au lait cru  "},{"$f":"IF('Liste articles'!C47=\"\",\"\",'Liste articles'!C47)","v":" Bleu de brebis au lait cru  "},null,{"$f":"IF(B47=\"\",\"\",SUMIFS('Entrées et Sorties'!E$5:E$397,'Entrées et Sorties'!D$5:D$397,C47))","v":0},{"$f":"IF(C47=\"\",\"\",SUMIFS('Entrées et Sorties'!F$5:F$497,'Entrées et Sorties'!D$5:D$497,C47))","v":0},0]
[null,{"$f":"IF('Liste articles'!B48=\"\",\"\",'Liste articles'!B48)","v":" Délice crémeux fromage de vache affiné"},{"$f":"IF('Liste articles'!C48=\"\",\"\",'Liste articles'!C48)","v":" Délice crémeux fromage de vache affiné"},null,{"$f":"IF(B48=\"\",\"\",SUMIFS('Entrées et Sorties'!E$5:E$397,'Entrées et Sorties'!D$5:D$397,C48))","v":0},{"$f":"IF(C48=\"\",\"\",SUMIFS('Entrées et Sorties'!F$5:F$497,'Entrées et Sorties'!D$5:D$497,C48))","v":0},0]
[null,{"$f":"IF('Liste articles'!B49=\"\",\"\",'Liste articles'!B49)","v":"POELEE FORESTIERE FONDANT DE BŒUF AU MARRON"},{"$f":"IF('Liste articles'!C49=\"\",\"\",'Liste articles'!C49)","v":"POELEE FORESTIERE FONDANT DE BŒUF AU MARRON"},null,{"$f":"IF(B49=\"\",\"\",SUMIFS('Entrées et Sorties'!E$5:E$397,'Entrées et Sorties'!D$5:D$397,C49))","v":0},{"$f":"IF(C49=\"\",\"\",SUMIFS('Entrées et Sorties'!F$5:F$497,'Entrées et Sorties'!D$5:D$497,C49))","v":0},0]
[null,{"$f":"IF('Liste articles'!B50=\"\",\"\",'Liste articles'!B50)","v":"TAJINE DE BOULGOUR AU BROCOLIS ET TOFU"},{"$f":"IF('Liste articles'!C50=\"\",\"\",'Liste articles'!C50)","v":"TAJINE DE BOULGOUR AU BROCOLIS ET TOFU"},null,{"$f":"IF(B50=\"\",\"\",SUMIFS('Entrées et Sorties'!E$5:E$397,'Entrées et Sorties'!D$5:D$397,C50))","v":0},{"$f":"IF(C50=\"\",\"\",SUMIFS('Entrées et Sorties'!F$5:F$497,'Entrées et Sorties'!D$5:D$497,C50))","v":0},0]
[null,{"$f":"IF('Liste articles'!B51=\"\",\"\",'Liste articles'!B51)","v":"CASSOLETTE AUX QUATRES LEGUMES PERSILLES"},{"$f":"IF('Liste articles'!C51=\"\",\"\",'Liste articles'!C51)","v":"CASSOLETTE AUX QUATRES LEGUMES PERSILLES"},null,{"$f":"IF(B51=\"\",\"\",SUMIFS('Entrées et Sorties'!E$5:E$397,'Entrées et Sorties'!D$5:D$397,C51))","v":0},{"$f":"IF(C51=\"\",\"\",SUMIFS('Entrées et Sorties'!F$5:F$497,'Entrées et Sorties'!D$5:D$497,C51))","v":0},0]
[null,{"$f":"IF('Liste articles'!B52=\"\",\"\",'Liste articles'!B52)","v":"PUREE DE BUTTERNUT FRICASEE DE POULET"},{"$f":"IF('Liste articles'!C52=\"\",\"\",'Liste articles'!C52)","v":"PUREE DE BUTTERNUT FRICASEE DE POULET"},null,{"$f":"IF(B52=\"\",\"\",SUMIFS('Entrées et Sorties'!E$5:E$397,'Entrées et Sorties'!D$5:D$397,C52))","v":0},{"$f":"IF(C52=\"\",\"\",SUMIFS('Entrées et Sorties'!F$5:F$497,'Entrées et Sorties'!D$5:D$497,C52))","v":0},0]
[null,{"$f":"IF('Liste articles'!B53=\"\",\"\",'Liste articles'!B53)","v":"FLEURETTE DE CHOU-FLEUR RIZ BŒUF AU ROMARIN"},{"$f":"IF('Liste articles'!C53=\"\",\"\",'Liste articles'!C53)","v":"FLEURETTE DE CHOU-FLEUR RIZ BŒUF AU ROMARIN"},null,{"$f":"IF(B53=\"\",\"\",SUMIFS('Entrées et Sorties'!E$5:E$397,'Entrées et Sorties'!D$5:D$397,C53))","v":0},{"$f":"IF(C53=\"\",\"\",SUMIFS('Entrées et Sorties'!F$5:F$497,'Entrées et Sorties'!D$5:D$497,C53))","v":0},0]
[null,{"$f":"IF('Liste articles'!B54=\"\",\"\",'Liste articles'!B54)","v":"MOUlINE DE PANAIS TOUCHE DE MUSCADE"},{"$f":"IF('Liste articles'!C54=\"\",\"\",'Liste articles'!C54)","v":"MOUlINE DE PANAIS TOUCHE DE MUSCADE"},null,{"$f":"IF(B54=\"\",\"\",SUMIFS('Entrées et Sorties'!E$5:E$397,'Entrées et Sorties'!D$5:D$397,C54))","v":0},{"$f":"IF(C54=\"\",\"\",SUMIFS('Entrées et Sorties'!F$5:F$497,'Entrées et Sorties'!D$5:D$497,C54))","v":0},0]
[null,{"$f":"IF('Liste articles'!B55=\"\",\"\",'Liste articles'!B55)","v":"DOUCEUR DE CAROTTES AU THYM"},{"$f":"IF('Liste articles'!C55=\"\",\"\",'Liste articles'!C55)","v":"DOUCEUR DE CAROTTES AU THYM"},null,{"$f":"IF(B55=\"\",\"\",SUMIFS('Entrées et Sorties'!E$5:E$397,'Entrées et Sorties'!D$5:D$397,C55))","v":0},{"$f":"IF(C55=\"\",\"\",SUMIFS('Entrées et Sorties'!F$5:F$497,'Entrées et Sorties'!D$5:D$497,C55))","v":0},0]
[null,{"$f":"IF('Liste articles'!B56=\"\",\"\",'Liste articles'!B56)","v":"MOUSSELINE DE PATATE DOUCE"},{"$f":"IF('Liste articles'!C56=\"\",\"\",'Liste articles'!C56)","v":"MOUSSELINE DE PATATE DOUCE"},null,{"$f":"IF(B56=\"\",\"\",SUMIFS('Entrées et Sorties'!E$5:E$397,'Entrées et Sorties'!D$5:D$397,C56))","v":0},{"$f":"IF(C56=\"\",\"\",SUMIFS('Entrées et Sorties'!F$5:F$497,'Entrées et Sorties'!D$5:D$497,C56))","v":0},0]
[null,{"$f":"IF('Liste articles'!B57=\"\",\"\",'Liste articles'!B57)","v":"PUREE D'HARICOT VERT "},{"$f":"IF('Liste articles'!C57=\"\",\"\",'Liste articles'!C57)","v":"PUREE D'HARICOT VERT "},null,{"$f":"IF(B57=\"\",\"\",SUMIFS('Entrées et Sorties'!E$5:E$397,'Entrées et Sorties'!D$5:D$397,C57))","v":0},{"$f":"IF(C57=\"\",\"\",SUMIFS('Entrées et Sorties'!F$5:F$497,'Entrées et Sorties'!D$5:D$497,C57))","v":0},0]
[null,{"$f":"IF('Liste articles'!B58=\"\",\"\",'Liste articles'!B58)","v":""},{"$f":"IF('Liste articles'!C58=\"\",\"\",'Liste articles'!C58)","v":""},null,{"$f":"IF(B58=\"\",\"\",SUMIFS('Entrées et Sorties'!E$5:E$397,'Entrées et Sorties'!D$5:D$397,C58))","v":""},{"$f":"IF(C58=\"\",\"\",SUMIFS('Entrées et Sorties'!F$5:F$497,'Entrées et Sorties'!D$5:D$497,C58))","v":""},""]
[null,{"$f":"IF('Liste articles'!B59=\"\",\"\",'Liste articles'!B59)","v":""},{"$f":"IF('Liste articles'!C59=\"\",\"\",'Liste articles'!C59)","v":""},null,{"$f":"IF(B59=\"\",\"\",SUMIFS('Entrées et Sorties'!E$5:E$397,'Entrées et Sorties'!D$5:D$397,C59))","v":""},{"$f":"IF(C59=\"\",\"\",SUMIFS('Entrées et Sorties'!F$5:F$497,'Entrées et Sorties'!D$5:D$497,C59))","v":""},""]
[null,{"$f":"IF('Liste articles'!B60=\"\",\"\",'Liste articles'!B60)","v":""},{"$f":"IF('Liste articles'!C60=\"\",\"\",'Liste articles'!C60)","v":""},null,{"$f":"IF(B60=\"\",\"\",SUMIFS('Entrées et Sorties'!E$5:E$397,'Entrées et Sorties'!D$5:D$397,C60))","v":""},{"$f":"IF(C60=\"\",\"\",SUMIFS('Entrées et Sorties'!F$5:F$497,'Entrées et Sorties'!D$5:D$497,C60))","v":""},""]
[null,{"$f":"IF('Liste articles'!B61=\"\",\"\",'Liste articles'!B61)","v":""},{"$f":"IF('Liste articles'!C61=\"\",\"\",'Liste articles'!C61)","v":""},null,{"$f":"IF(B61=\"\",\"\",SUMIFS('Entrées et Sorties'!E$5:E$397,'Entrées et Sorties'!D$5:D$397,C61))","v":""},{"$f":"IF(C61=\"\",\"\",SUMIFS('Entrées et Sorties'!F$5:F$497,'Entrées et Sorties'!D$5:D$497,C61))","v":""},""]
[null,{"$f":"IF('Liste articles'!B62=\"\",\"\",'Liste articles'!B62)","v":""},{"$f":"IF('Liste articles'!C62=\"\",\"\",'Liste articles'!C62)","v":""},null,{"$f":"IF(B62=\"\",\"\",SUMIFS('Entrées et Sorties'!E$5:E$397,'Entrées et Sorties'!D$5:D$397,C62))","v":""},{"$f":"IF(C62=\"\",\"\",SUMIFS('Entrées et Sorties'!F$5:F$497,'Entrées et Sorties'!D$5:D$497,C62))","v":""},""]
[null,{"$f":"IF('Liste articles'!B63=\"\",\"\",'Liste articles'!B63)","v":""},{"$f":"IF('Liste articles'!C63=\"\",\"\",'Liste articles'!C63)","v":""},null,{"$f":"IF(B63=\"\",\"\",SUMIFS('Entrées et Sorties'!E$5:E$397,'Entrées et Sorties'!D$5:D$397,C63))","v":""},{"$f":"IF(C63=\"\",\"\",SUMIFS('Entrées et Sorties'!F$5:F$497,'Entrées et Sorties'!D$5:D$497,C63))","v":""},""]
[null,{"$f":"IF('Liste articles'!B64=\"\",\"\",'Liste articles'!B64)","v":""},{"$f":"IF('Liste articles'!C64=\"\",\"\",'Liste articles'!C64)","v":""},null,{"$f":"IF(B64=\"\",\"\",SUMIFS('Entrées et Sorties'!E$5:E$397,'Entrées et Sorties'!D$5:D$397,C64))","v":""},{"$f":"IF(C64=\"\",\"\",SUMIFS('Entrées et Sorties'!F$5:F$497,'Entrées et Sorties'!D$5:D$497,C64))","v":""},""]
[null,{"$f":"IF('Liste articles'!B65=\"\",\"\",'Liste articles'!B65)","v":""},{"$f":"IF('Liste articles'!C65=\"\",\"\",'Liste articles'!C65)","v":""},null,{"$f":"IF(B65=\"\",\"\",SUMIFS('Entrées et Sorties'!E$5:E$397,'Entrées et Sorties'!D$5:D$397,C65))","v":""},{"$f":"IF(C65=\"\",\"\",SUMIFS('Entrées et Sorties'!F$5:F$497,'Entrées et Sorties'!D$5:D$497,C65))","v":""},""]
[null,{"$f":"IF('Liste articles'!B66=\"\",\"\",'Liste articles'!B66)","v":""},{"$f":"IF('Liste articles'!C66=\"\",\"\",'Liste articles'!C66)","v":""},null,{"$f":"IF(B66=\"\",\"\",SUMIFS('Entrées et Sorties'!E$5:E$397,'Entrées et Sorties'!D$5:D$397,C66))","v":""},{"$f":"IF(C66=\"\",\"\",SUMIFS('Entrées et Sorties'!F$5:F$497,'Entrées et Sorties'!D$5:D$497,C66))","v":""},""]
[null,{"$f":"IF('Liste articles'!B67=\"\",\"\",'Liste articles'!B67)","v":""},{"$f":"IF('Liste articles'!C67=\"\",\"\",'Liste articles'!C67)","v":""},null,{"$f":"IF(B67=\"\",\"\",SUMIFS('Entrées et Sorties'!E$5:E$397,'Entrées et Sorties'!D$5:D$397,C67))","v":""},{"$f":"IF(C67=\"\",\"\",SUMIFS('Entrées et Sorties'!F$5:F$497,'Entrées et Sorties'!D$5:D$497,C67))","v":""},""]
[null,{"$f":"IF('Liste articles'!B68=\"\",\"\",'Liste articles'!B68)","v":""},{"$f":"IF('Liste articles'!C68=\"\",\"\",'Liste articles'!C68)","v":""},null,{"$f":"IF(B68=\"\",\"\",SUMIFS('Entrées et Sorties'!E$5:E$397,'Entrées et Sorties'!D$5:D$397,C68))","v":""},{"$f":"IF(C68=\"\",\"\",SUMIFS('Entrées et Sorties'!F$5:F$497,'Entrées et Sorties'!D$5:D$497,C68))","v":""},""]
[null,{"$f":"IF('Liste articles'!B69=\"\",\"\",'Liste articles'!B69)","v":""},{"$f":"IF('Liste articles'!C69=\"\",\"\",'Liste articles'!C69)","v":""},null,{"$f":"IF(B69=\"\",\"\",SUMIFS('Entrées et Sorties'!E$5:E$397,'Entrées et Sorties'!D$5:D$397,C69))","v":""},{"$f":"IF(C69=\"\",\"\",SUMIFS('Entrées et Sorties'!F$5:F$497,'Entrées et Sorties'!D$5:D$497,C69))","v":""},""]
[null,{"$f":"IF('Liste articles'!B70=\"\",\"\",'Liste articles'!B70)","v":""},{"$f":"IF('Liste articles'!C70=\"\",\"\",'Liste articles'!C70)","v":""},null,{"$f":"IF(B70=\"\",\"\",SUMIFS('Entrées et Sorties'!E$5:E$397,'Entrées et Sorties'!D$5:D$397,C70))","v":""},{"$f":"IF(C70=\"\",\"\",SUMIFS('Entrées et Sorties'!F$5:F$497,'Entrées et Sorties'!D$5:D$497,C70))","v":""},""]
[null,{"$f":"IF('Liste articles'!B71=\"\",\"\",'Liste articles'!B71)","v":""},{"$f":"IF('Liste articles'!C71=\"\",\"\",'Liste articles'!C71)","v":""},null,{"$f":"IF(B71=\"\",\"\",SUMIFS('Entrées et Sorties'!E$5:E$397,'Entrées et Sorties'!D$5:D$397,C71))","v":""},{"$f":"IF(C71=\"\",\"\",SUMIFS('Entrées et Sorties'!F$5:F$497,'Entrées et Sorties'!D$5:D$497,C71))","v":""},""]
[null,{"$f":"IF('Liste articles'!B72=\"\",\"\",'Liste articles'!B72)","v":""},{"$f":"IF('Liste articles'!C72=\"\",\"\",'Liste articles'!C72)","v":""},null,{"$f":"IF(B72=\"\",\"\",SUMIFS('Entrées et Sorties'!E$5:E$397,'Entrées et Sorties'!D$5:D$397,C72))","v":""},{"$f":"IF(C72=\"\",\"\",SUMIFS('Entrées et Sorties'!F$5:F$497,'Entrées et Sorties'!D$5:D$497,C72))","v":""},""]
[null,{"$f":"IF('Liste articles'!B73=\"\",\"\",'Liste articles'!B73)","v":""},{"$f":"IF('Liste articles'!C73=\"\",\"\",'Liste articles'!C73)","v":""},null,{"$f":"IF(B73=\"\",\"\",SUMIFS('Entrées et Sorties'!E$5:E$397,'Entrées et Sorties'!D$5:D$397,C73))","v":""},{"$f":"IF(C73=\"\",\"\",SUMIFS('Entrées et Sorties'!F$5:F$497,'Entrées et Sorties'!D$5:D$497,C73))","v":""},""]
[null,{"$f":"IF('Liste articles'!B74=\"\",\"\",'Liste articles'!B74)","v":""},{"$f":"IF('Liste articles'!C74=\"\",\"\",'Liste articles'!C74)","v":""},null,{"$f":"IF(B74=\"\",\"\",SUMIFS('Entrées et Sorties'!E$5:E$397,'Entrées et Sorties'!D$5:D$397,C74))","v":""},{"$f":"IF(C74=\"\",\"\",SUMIFS('Entrées et Sorties'!F$5:F$497,'Entrées et Sorties'!D$5:D$497,C74))","v":""},{"$f":"IF(C74=\"\",\"\",D74+E74-F74)","v":""}]
[null,{"$f":"IF('Liste articles'!B75=\"\",\"\",'Liste articles'!B75)","v":""},{"$f":"IF('Liste articles'!C75=\"\",\"\",'Liste articles'!C75)","v":""},null,{"$f":"IF(B75=\"\",\"\",SUMIFS('Entrées et Sorties'!E$5:E$397,'Entrées et Sorties'!D$5:D$397,C75))","v":""},{"$f":"IF(C75=\"\",\"\",SUMIFS('Entrées et Sorties'!F$5:F$497,'Entrées et Sorties'!D$5:D$497,C75))","v":""},""]
[null,{"$f":"IF('Liste articles'!B76=\"\",\"\",'Liste articles'!B76)","v":""},{"$f":"IF('Liste articles'!C76=\"\",\"\",'Liste articles'!C76)","v":""},null,{"$f":"IF(B76=\"\",\"\",SUMIFS('Entrées et Sorties'!E$5:E$397,'Entrées et Sorties'!D$5:D$397,C76))","v":""},{"$f":"IF(C76=\"\",\"\",SUMIFS('Entrées et Sorties'!F$5:F$497,'Entrées et Sorties'!D$5:D$497,C76))","v":""},""]
[null,{"$f":"IF('Liste articles'!B77=\"\",\"\",'Liste articles'!B77)","v":""},{"$f":"IF('Liste articles'!C77=\"\",\"\",'Liste articles'!C77)","v":""},null,{"$f":"IF(B77=\"\",\"\",SUMIFS('Entrées et Sorties'!E$5:E$397,'Entrées et Sorties'!D$5:D$397,C77))","v":""},{"$f":"IF(C77=\"\",\"\",SUMIFS('Entrées et Sorties'!F$5:F$497,'Entrées et Sorties'!D$5:D$497,C77))","v":""},""]
[null,{"$f":"IF('Liste articles'!B78=\"\",\"\",'Liste articles'!B78)","v":""},{"$f":"IF('Liste articles'!C78=\"\",\"\",'Liste articles'!C78)","v":""},null,{"$f":"IF(B78=\"\",\"\",SUMIFS('Entrées et Sorties'!E$5:E$397,'Entrées et Sorties'!D$5:D$397,C78))","v":""},{"$f":"IF(C78=\"\",\"\",SUMIFS('Entrées et Sorties'!F$5:F$497,'Entrées et Sorties'!D$5:D$497,C78))","v":""},""]
[null,{"$f":"IF('Liste articles'!B79=\"\",\"\",'Liste articles'!B79)","v":""},{"$f":"IF('Liste articles'!C79=\"\",\"\",'Liste articles'!C79)","v":""},null,{"$f":"IF(B79=\"\",\"\",SUMIFS('Entrées et Sorties'!E$5:E$397,'Entrées et Sorties'!D$5:D$397,C79))","v":""},{"$f":"IF(C79=\"\",\"\",SUMIFS('Entrées et Sorties'!F$5:F$497,'Entrées et Sorties'!D$5:D$497,C79))","v":""},""]
[null,{"$f":"IF('Liste articles'!B80=\"\",\"\",'Liste articles'!B80)","v":""},{"$f":"IF('Liste articles'!C80=\"\",\"\",'Liste articles'!C80)","v":""},null,{"$f":"IF(B80=\"\",\"\",SUMIFS('Entrées et Sorties'!E$5:E$397,'Entrées et Sorties'!D$5:D$397,C80))","v":""},{"$f":"IF(C80=\"\",\"\",SUMIFS('Entrées et Sorties'!F$5:F$497,'Entrées et Sorties'!D$5:D$497,C80))","v":""},""]
[null,{"$f":"IF('Liste articles'!B81=\"\",\"\",'Liste articles'!B81)","v":""},{"$f":"IF('Liste articles'!C81=\"\",\"\",'Liste articles'!C81)","v":""},null,{"$f":"IF(B81=\"\",\"\",SUMIFS('Entrées et Sorties'!E$5:E$397,'Entrées et Sorties'!D$5:D$397,C81))","v":""},{"$f":"IF(C81=\"\",\"\",SUMIFS('Entrées et Sorties'!F$5:F$497,'Entrées et Sorties'!D$5:D$497,C81))","v":""},""]
[null,{"$f":"IF('Liste articles'!B82=\"\",\"\",'Liste articles'!B82)","v":""},{"$f":"IF('Liste articles'!C82=\"\",\"\",'Liste articles'!C82)","v":""},null,{"$f":"IF(B82=\"\",\"\",SUMIFS('Entrées et Sorties'!E$5:E$397,'Entrées et Sorties'!D$5:D$397,C82))","v":""},{"$f":"IF(C82=\"\",\"\",SUMIFS('Entrées et Sorties'!F$5:F$497,'Entrées et Sorties'!D$5:D$497,C82))","v":""},""]
[null,{"$f":"IF('Liste articles'!B83=\"\",\"\",'Liste articles'!B83)","v":""},{"$f":"IF('Liste articles'!C83=\"\",\"\",'Liste articles'!C83)","v":""},null,{"$f":"IF(B83=\"\",\"\",SUMIFS('Entrées et Sorties'!E$5:E$397,'Entrées et Sorties'!D$5:D$397,C83))","v":""},{"$f":"IF(C83=\"\",\"\",SUMIFS('Entrées et Sorties'!F$5:F$497,'Entrées et Sorties'!D$5:D$497,C83))","v":""},""]
[null,{"$f":"IF('Liste articles'!B84=\"\",\"\",'Liste articles'!B84)","v":""},{"$f":"IF('Liste articles'!C84=\"\",\"\",'Liste articles'!C84)","v":""},null,{"$f":"IF(B84=\"\",\"\",SUMIFS('Entrées et Sorties'!E$5:E$397,'Entrées et Sorties'!D$5:D$397,C84))","v":""},{"$f":"IF(C84=\"\",\"\",SUMIFS('Entrées et Sorties'!F$5:F$497,'Entrées et Sorties'!D$5:D$497,C84))","v":""},""]
[null,{"$f":"IF('Liste articles'!B85=\"\",\"\",'Liste articles'!B85)","v":""},{"$f":"IF('Liste articles'!C85=\"\",\"\",'Liste articles'!C85)","v":""},null,{"$f":"IF(B85=\"\",\"\",SUMIFS('Entrées et Sorties'!E$5:E$397,'Entrées et Sorties'!D$5:D$397,C85))","v":""},{"$f":"IF(C85=\"\",\"\",SUMIFS('Entrées et Sorties'!F$5:F$497,'Entrées et Sorties'!D$5:D$497,C85))","v":""},""]
[null,{"$f":"IF('Liste articles'!B86=\"\",\"\",'Liste articles'!B86)","v":""},{"$f":"IF('Liste articles'!C86=\"\",\"\",'Liste articles'!C86)","v":""},null,{"$f":"IF(B86=\"\",\"\",SUMIFS('Entrées et Sorties'!E$5:E$397,'Entrées et Sorties'!D$5:D$397,C86))","v":""},{"$f":"IF(C86=\"\",\"\",SUMIFS('Entrées et Sorties'!F$5:F$497,'Entrées et Sorties'!D$5:D$497,C86))","v":""},""]
[null,{"$f":"IF('Liste articles'!B87=\"\",\"\",'Liste articles'!B87)","v":""},{"$f":"IF('Liste articles'!C87=\"\",\"\",'Liste articles'!C87)","v":""},null,{"$f":"IF(B87=\"\",\"\",SUMIFS('Entrées et Sorties'!E$5:E$397,'Entrées et Sorties'!D$5:D$397,C87))","v":""},{"$f":"IF(C87=\"\",\"\",SUMIFS('Entrées et Sorties'!F$5:F$497,'Entrées et Sorties'!D$5:D$497,C87))","v":""},""]
[null,{"$f":"IF('Liste articles'!B88=\"\",\"\",'Liste articles'!B88)","v":""},{"$f":"IF('Liste articles'!C88=\"\",\"\",'Liste articles'!C88)","v":""},null,{"$f":"IF(B88=\"\",\"\",SUMIFS('Entrées et Sorties'!E$5:E$397,'Entrées et Sorties'!D$5:D$397,C88))","v":""},{"$f":"IF(C88=\"\",\"\",SUMIFS('Entrées et Sorties'!F$5:F$497,'Entrées et Sorties'!D$5:D$497,C88))","v":""},""]
[null,{"$f":"IF('Liste articles'!B89=\"\",\"\",'Liste articles'!B89)","v":""},{"$f":"IF('Liste articles'!C89=\"\",\"\",'Liste articles'!C89)","v":""},null,{"$f":"IF(B89=\"\",\"\",SUMIFS('Entrées et Sorties'!E$5:E$397,'Entrées et Sorties'!D$5:D$397,C89))","v":""},{"$f":"IF(C89=\"\",\"\",SUMIFS('Entrées et Sorties'!F$5:F$497,'Entrées et Sorties'!D$5:D$497,C89))","v":""},""]
[null,{"$f":"IF('Liste articles'!B90=\"\",\"\",'Liste articles'!B90)","v":""},{"$f":"IF('Liste articles'!C90=\"\",\"\",'Liste articles'!C90)","v":""},null,{"$f":"IF(B90=\"\",\"\",SUMIFS('Entrées et Sorties'!E$5:E$397,'Entrées et Sorties'!D$5:D$397,C90))","v":""},{"$f":"IF(C90=\"\",\"\",SUMIFS('Entrées et Sorties'!F$5:F$497,'Entrées et Sorties'!D$5:D$497,C90))","v":""},""]
[null,{"$f":"IF('Liste articles'!B91=\"\",\"\",'Liste articles'!B91)","v":""},{"$f":"IF('Liste articles'!C91=\"\",\"\",'Liste articles'!C91)","v":""},null,{"$f":"IF(B91=\"\",\"\",SUMIFS('Entrées et Sorties'!E$5:E$397,'Entrées et Sorties'!D$5:D$397,C91))","v":""},{"$f":"IF(C91=\"\",\"\",SUMIFS('Entrées et Sorties'!F$5:F$497,'Entrées et Sorties'!D$5:D$497,C91))","v":""},""]
[null,{"$f":"IF('Liste articles'!B92=\"\",\"\",'Liste articles'!B92)","v":""},{"$f":"IF('Liste articles'!C92=\"\",\"\",'Liste articles'!C92)","v":""},null,{"$f":"IF(B92=\"\",\"\",SUMIFS('Entrées et Sorties'!E$5:E$397,'Entrées et Sorties'!D$5:D$397,C92))","v":""},{"$f":"IF(C92=\"\",\"\",SUMIFS('Entrées et Sorties'!F$5:F$497,'Entrées et Sorties'!D$5:D$497,C92))","v":""},""]
[null,{"$f":"IF('Liste articles'!B93=\"\",\"\",'Liste articles'!B93)","v":""},{"$f":"IF('Liste articles'!C93=\"\",\"\",'Liste articles'!C93)","v":""},null,{"$f":"IF(B93=\"\",\"\",SUMIFS('Entrées et Sorties'!E$5:E$397,'Entrées et Sorties'!D$5:D$397,C93))","v":""},{"$f":"IF(C93=\"\",\"\",SUMIFS('Entrées et Sorties'!F$5:F$497,'Entrées et Sorties'!D$5:D$497,C93))","v":""},""]
[null,{"$f":"IF('Liste articles'!B94=\"\",\"\",'Liste articles'!B94)","v":""},{"$f":"IF('Liste articles'!C94=\"\",\"\",'Liste articles'!C94)","v":""},null,{"$f":"IF(B94=\"\",\"\",SUMIFS('Entrées et Sorties'!E$5:E$397,'Entrées et Sorties'!D$5:D$397,C94))","v":""},{"$f":"IF(C94=\"\",\"\",SUMIFS('Entrées et Sorties'!F$5:F$497,'Entrées et Sorties'!D$5:D$497,C94))","v":""},""]
[null,{"$f":"IF('Liste articles'!B95=\"\",\"\",'Liste articles'!B95)","v":""},{"$f":"IF('Liste articles'!C95=\"\",\"\",'Liste articles'!C95)","v":""},null,{"$f":"IF(B95=\"\",\"\",SUMIFS('Entrées et Sorties'!E$5:E$397,'Entrées et Sorties'!D$5:D$397,C95))","v":""},{"$f":"IF(C95=\"\",\"\",SUMIFS('Entrées et Sorties'!F$5:F$497,'Entrées et Sorties'!D$5:D$497,C95))","v":""},""]
[null,{"$f":"IF('Liste articles'!B96=\"\",\"\",'Liste articles'!B96)","v":""},{"$f":"IF('Liste articles'!C96=\"\",\"\",'Liste articles'!C96)","v":""},null,{"$f":"IF(B96=\"\",\"\",SUMIFS('Entrées et Sorties'!E$5:E$397,'Entrées et Sorties'!D$5:D$397,C96))","v":""},{"$f":"IF(C96=\"\",\"\",SUMIFS('Entrées et Sorties'!F$5:F$497,'Entrées et Sorties'!D$5:D$497,C96))","v":""},""]
[null,{"$f":"IF('Liste articles'!B97=\"\",\"\",'Liste articles'!B97)","v":""},{"$f":"IF('Liste articles'!C97=\"\",\"\",'Liste articles'!C97)","v":""},null,{"$f":"IF(B97=\"\",\"\",SUMIFS('Entrées et Sorties'!E$5:E$397,'Entrées et Sorties'!D$5:D$397,C97))","v":""},{"$f":"IF(C97=\"\",\"\",SUMIFS('Entrées et Sorties'!F$5:F$497,'Entrées et Sorties'!D$5:D$497,C97))","v":""},""]
[null,{"$f":"IF('Liste articles'!B98=\"\",\"\",'Liste articles'!B98)","v":""},{"$f":"IF('Liste articles'!C98=\"\",\"\",'Liste articles'!C98)","v":""},null,{"$f":"IF(B98=\"\",\"\",SUMIFS('Entrées et Sorties'!E$5:E$397,'Entrées et Sorties'!D$5:D$397,C98))","v":""},{"$f":"IF(C98=\"\",\"\",SUMIFS('Entrées et Sorties'!F$5:F$497,'Entrées et Sorties'!D$5:D$497,C98))","v":""},""]
[null,{"$f":"IF('Liste articles'!B99=\"\",\"\",'Liste articles'!B99)","v":""},{"$f":"IF('Liste articles'!C99=\"\",\"\",'Liste articles'!C99)","v":""},null,{"$f":"IF(B99=\"\",\"\",SUMIFS('Entrées et Sorties'!E$5:E$397,'Entrées et Sorties'!D$5:D$397,C99))","v":""},{"$f":"IF(C99=\"\",\"\",SUMIFS('Entrées et Sorties'!F$5:F$497,'Entrées et Sorties'!D$5:D$497,C99))","v":""},""]
[null,{"$f":"IF('Liste articles'!B100=\"\",\"\",'Liste articles'!B100)","v":""},{"$f":"IF('Liste articles'!C100=\"\",\"\",'Liste articles'!C100)","v":""},null,{"$f":"IF(B100=\"\",\"\",SUMIFS('Entrées et Sorties'!E$5:E$397,'Entrées et Sorties'!D$5:D$397,C100))","v":""},{"$f":"IF(C100=\"\",\"\",SUMIFS('Entrées et Sorties'!F$5:F$497,'Entrées et Sorties'!D$5:D$497,C100))","v":""},""]
[null,{"$f":"IF('Liste articles'!B101=\"\",\"\",'Liste articles'!B101)","v":""},{"$f":"IF('Liste articles'!C101=\"\",\"\",'Liste articles'!C101)","v":""},null,{"$f":"IF(B101=\"\",\"\",SUMIFS('Entrées et Sorties'!E$5:E$397,'Entrées et Sorties'!D$5:D$397,C101))","v":""},{"$f":"IF(C101=\"\",\"\",SUMIFS('Entrées et Sorties'!F$5:F$497,'Entrées et Sorties'!D$5:D$497,C101))","v":""},""]
[null,{"$f":"IF('Liste articles'!B102=\"\",\"\",'Liste articles'!B102)","v":""},{"$f":"IF('Liste articles'!C102=\"\",\"\",'Liste articles'!C102)","v":""},null,{"$f":"IF(B102=\"\",\"\",SUMIFS('Entrées et Sorties'!E$5:E$397,'Entrées et Sorties'!D$5:D$397,C102))","v":""},{"$f":"IF(C102=\"\",\"\",SUMIFS('Entrées et Sorties'!F$5:F$497,'Entrées et Sorties'!D$5:D$497,C102))","v":""},""]
[null,{"$f":"IF('Liste articles'!B103=\"\",\"\",'Liste articles'!B103)","v":""},{"$f":"IF('Liste articles'!C103=\"\",\"\",'Liste articles'!C103)","v":""},null,{"$f":"IF(B103=\"\",\"\",SUMIFS('Entrées et Sorties'!E$5:E$397,'Entrées et Sorties'!D$5:D$397,C103))","v":""},{"$f":"IF(C103=\"\",\"\",SUMIFS('Entrées et Sorties'!F$5:F$497,'Entrées et Sorties'!D$5:D$497,C103))","v":""},""]
[null,{"$f":"IF('Liste articles'!B104=\"\",\"\",'Liste articles'!B104)","v":""},{"$f":"IF('Liste articles'!C104=\"\",\"\",'Liste articles'!C104)","v":""},null,{"$f":"IF(B104=\"\",\"\",SUMIFS('Entrées et Sorties'!E$5:E$397,'Entrées et Sorties'!D$5:D$397,C104))","v":""},{"$f":"IF(C104=\"\",\"\",SUMIFS('Entrées et Sorties'!F$5:F$497,'Entrées et Sorties'!D$5:D$497,C104))","v":""},""]
[null,{"$f":"IF('Liste articles'!B105=\"\",\"\",'Liste articles'!B105)","v":""},{"$f":"IF('Liste articles'!C105=\"\",\"\",'Liste articles'!C105)","v":""},null,{"$f":"IF(B105=\"\",\"\",SUMIFS('Entrées et Sorties'!E$5:E$397,'Entrées et Sorties'!D$5:D$397,C105))","v":""},{"$f":"IF(C105=\"\",\"\",SUMIFS('Entrées et Sorties'!F$5:F$497,'Entrées et Sorties'!D$5:D$497,C105))","v":""},""]
[null,{"$f":"IF('Liste articles'!B106=\"\",\"\",'Liste articles'!B106)","v":""},{"$f":"IF('Liste articles'!C106=\"\",\"\",'Liste articles'!C106)","v":""},null,{"$f":"IF(B106=\"\",\"\",SUMIFS('Entrées et Sorties'!E$5:E$397,'Entrées et Sorties'!D$5:D$397,C106))","v":""},{"$f":"IF(C106=\"\",\"\",SUMIFS('Entrées et Sorties'!F$5:F$497,'Entrées et Sorties'!D$5:D$497,C106))","v":""},""]
[null,{"$f":"IF('Liste articles'!B107=\"\",\"\",'Liste articles'!B107)","v":""},{"$f":"IF('Liste articles'!C107=\"\",\"\",'Liste articles'!C107)","v":""},null,{"$f":"IF(B107=\"\",\"\",SUMIFS('Entrées et Sorties'!E$5:E$397,'Entrées et Sorties'!D$5:D$397,C107))","v":""},{"$f":"IF(C107=\"\",\"\",SUMIFS('Entrées et Sorties'!F$5:F$497,'Entrées et Sorties'!D$5:D$497,C107))","v":""},""]
[null,{"$f":"IF('Liste articles'!B108=\"\",\"\",'Liste articles'!B108)","v":""},{"$f":"IF('Liste articles'!C108=\"\",\"\",'Liste articles'!C108)","v":""},null,{"$f":"IF(B108=\"\",\"\",SUMIFS('Entrées et Sorties'!E$5:E$397,'Entrées et Sorties'!D$5:D$397,C108))","v":""},{"$f":"IF(C108=\"\",\"\",SUMIFS('Entrées et Sorties'!F$5:F$497,'Entrées et Sorties'!D$5:D$497,C108))","v":""},""]
[null,{"$f":"IF('Liste articles'!B109=\"\",\"\",'Liste articles'!B109)","v":""},{"$f":"IF('Liste articles'!C109=\"\",\"\",'Liste articles'!C109)","v":""},null,{"$f":"IF(B109=\"\",\"\",SUMIFS('Entrées et Sorties'!E$5:E$397,'Entrées et Sorties'!D$5:D$397,C109))","v":""},{"$f":"IF(C109=\"\",\"\",SUMIFS('Entrées et Sorties'!F$5:F$497,'Entrées et Sorties'!D$5:D$497,C109))","v":""},""]
[null,{"$f":"IF('Liste articles'!B110=\"\",\"\",'Liste articles'!B110)","v":""},{"$f":"IF('Liste articles'!C110=\"\",\"\",'Liste articles'!C110)","v":""},null,{"$f":"IF(B110=\"\",\"\",SUMIFS('Entrées et Sorties'!E$5:E$397,'Entrées et Sorties'!D$5:D$397,C110))","v":""},{"$f":"IF(C110=\"\",\"\",SUMIFS('Entrées et Sorties'!F$5:F$497,'Entrées et Sorties'!D$5:D$497,C110))","v":""},""]
[null,{"$f":"IF('Liste articles'!B111=\"\",\"\",'Liste articles'!B111)","v":""},{"$f":"IF('Liste articles'!C111=\"\",\"\",'Liste articles'!C111)","v":""},null,{"$f":"IF(B111=\"\",\"\",SUMIFS('Entrées et Sorties'!E$5:E$397,'Entrées et Sorties'!D$5:D$397,C111))","v":""},{"$f":"IF(C111=\"\",\"\",SUMIFS('Entrées et Sorties'!F$5:F$497,'Entrées et Sorties'!D$5:D$497,C111))","v":""},""]
[null,{"$f":"IF('Liste articles'!B112=\"\",\"\",'Liste articles'!B112)","v":""},{"$f":"IF('Liste articles'!C112=\"\",\"\",'Liste articles'!C112)","v":""},null,{"$f":"IF(B112=\"\",\"\",SUMIFS('Entrées et Sorties'!E$5:E$397,'Entrées et Sorties'!D$5:D$397,C112))","v":""},{"$f":"IF(C112=\"\",\"\",SUMIFS('Entrées et Sorties'!F$5:F$497,'Entrées et Sorties'!D$5:D$497,C112))","v":""},""]
[null,{"$f":"IF('Liste articles'!B113=\"\",\"\",'Liste articles'!B113)","v":""},{"$f":"IF('Liste articles'!C113=\"\",\"\",'Liste articles'!C113)","v":""},null,{"$f":"IF(B113=\"\",\"\",SUMIFS('Entrées et Sorties'!E$5:E$397,'Entrées et Sorties'!D$5:D$397,C113))","v":""},{"$f":"IF(C113=\"\",\"\",SUMIFS('Entrées et Sorties'!F$5:F$497,'Entrées et Sorties'!D$5:D$497,C113))","v":""},""]
[null,{"$f":"IF('Liste articles'!B114=\"\",\"\",'Liste articles'!B114)","v":""},{"$f":"IF('Liste articles'!C114=\"\",\"\",'Liste articles'!C114)","v":""},null,{"$f":"IF(B114=\"\",\"\",SUMIFS('Entrées et Sorties'!E$5:E$397,'Entrées et Sorties'!D$5:D$397,C114))","v":""},{"$f":"IF(C114=\"\",\"\",SUMIFS('Entrées et Sorties'!F$5:F$497,'Entrées et Sorties'!D$5:D$497,C114))","v":""},""]
[null,{"$f":"IF('Liste articles'!B115=\"\",\"\",'Liste articles'!B115)","v":""},{"$f":"IF('Liste articles'!C115=\"\",\"\",'Liste articles'!C115)","v":""},null,{"$f":"IF(B115=\"\",\"\",SUMIFS('Entrées et Sorties'!E$5:E$397,'Entrées et Sorties'!D$5:D$397,C115))","v":""},{"$f":"IF(C115=\"\",\"\",SUMIFS('Entrées et Sorties'!F$5:F$497,'Entrées et Sorties'!D$5:D$497,C115))","v":""},""]
[null,{"$f":"IF('Liste articles'!B116=\"\",\"\",'Liste articles'!B116)","v":""},{"$f":"IF('Liste articles'!C116=\"\",\"\",'Liste articles'!C116)","v":""},null,{"$f":"IF(B116=\"\",\"\",SUMIFS('Entrées et Sorties'!E$5:E$397,'Entrées et Sorties'!D$5:D$397,C116))","v":""},{"$f":"IF(C116=\"\",\"\",SUMIFS('Entrées et Sorties'!F$5:F$497,'Entrées et Sorties'!D$5:D$497,C116))","v":""},""]
[null,{"$f":"IF('Liste articles'!B117=\"\",\"\",'Liste articles'!B117)","v":""},{"$f":"IF('Liste articles'!C117=\"\",\"\",'Liste articles'!C117)","v":""},null,{"$f":"IF(B117=\"\",\"\",SUMIFS('Entrées et Sorties'!E$5:E$397,'Entrées et Sorties'!D$5:D$397,C117))","v":""},{"$f":"IF(C117=\"\",\"\",SUMIFS('Entrées et Sorties'!F$5:F$497,'Entrées et Sorties'!D$5:D$497,C117))","v":""},""]
[null,{"$f":"IF('Liste articles'!B118=\"\",\"\",'Liste articles'!B118)","v":""},{"$f":"IF('Liste articles'!C118=\"\",\"\",'Liste articles'!C118)","v":""},null,{"$f":"IF(B118=\"\",\"\",SUMIFS('Entrées et Sorties'!E$5:E$397,'Entrées et Sorties'!D$5:D$397,C118))","v":""},{"$f":"IF(C118=\"\",\"\",SUMIFS('Entrées et Sorties'!F$5:F$497,'Entrées et Sorties'!D$5:D$497,C118))","v":""},""]
[null,{"$f":"IF('Liste articles'!B119=\"\",\"\",'Liste articles'!B119)","v":""},{"$f":"IF('Liste articles'!C119=\"\",\"\",'Liste articles'!C119)","v":""},null,{"$f":"IF(B119=\"\",\"\",SUMIFS('Entrées et Sorties'!E$5:E$397,'Entrées et Sorties'!D$5:D$397,C119))","v":""},{"$f":"IF(C119=\"\",\"\",SUMIFS('Entrées et Sorties'!F$5:F$497,'Entrées et Sorties'!D$5:D$497,C119))","v":""},""]
[null,{"$f":"IF('Liste articles'!B120=\"\",\"\",'Liste articles'!B120)","v":""},{"$f":"IF('Liste articles'!C120=\"\",\"\",'Liste articles'!C120)","v":""},null,{"$f":"IF(B120=\"\",\"\",SUMIFS('Entrées et Sorties'!E$5:E$397,'Entrées et Sorties'!D$5:D$397,C120))","v":""},{"$f":"IF(C120=\"\",\"\",SUMIFS('Entrées et Sorties'!F$5:F$497,'Entrées et Sorties'!D$5:D$497,C120))","v":""},""]
[null,{"$f":"IF('Liste articles'!B121=\"\",\"\",'Liste articles'!B121)","v":""},{"$f":"IF('Liste articles'!C121=\"\",\"\",'Liste articles'!C121)","v":""},null,{"$f":"IF(B121=\"\",\"\",SUMIFS('Entrées et Sorties'!E$5:E$397,'Entrées et Sorties'!D$5:D$397,C121))","v":""},{"$f":"IF(C121=\"\",\"\",SUMIFS('Entrées et Sorties'!F$5:F$497,'Entrées et Sorties'!D$5:D$497,C121))","v":""},""]
[null,{"$f":"IF('Liste articles'!B122=\"\",\"\",'Liste articles'!B122)","v":""},{"$f":"IF('Liste articles'!C122=\"\",\"\",'Liste articles'!C122)","v":""},null,{"$f":"IF(B122=\"\",\"\",SUMIFS('Entrées et Sorties'!E$5:E$397,'Entrées et Sorties'!D$5:D$397,C122))","v":""},{"$f":"IF(C122=\"\",\"\",SUMIFS('Entrées et Sorties'!F$5:F$497,'Entrées et Sorties'!D$5:D$497,C122))","v":""},""]
[null,{"$f":"IF('Liste articles'!B123=\"\",\"\",'Liste articles'!B123)","v":""},{"$f":"IF('Liste articles'!C123=\"\",\"\",'Liste articles'!C123)","v":""},null,{"$f":"IF(B123=\"\",\"\",SUMIFS('Entrées et Sorties'!E$5:E$397,'Entrées et Sorties'!D$5:D$397,C123))","v":""},{"$f":"IF(C123=\"\",\"\",SUMIFS('Entrées et Sorties'!F$5:F$497,'Entrées et Sorties'!D$5:D$497,C123))","v":""},""]
[null,{"$f":"IF('Liste articles'!B124=\"\",\"\",'Liste articles'!B124)","v":""},{"$f":"IF('Liste articles'!C124=\"\",\"\",'Liste articles'!C124)","v":""},null,{"$f":"IF(B124=\"\",\"\",SUMIFS('Entrées et Sorties'!E$5:E$397,'Entrées et Sorties'!D$5:D$397,C124))","v":""},{"$f":"IF(C124=\"\",\"\",SUMIFS('Entrées et Sorties'!F$5:F$497,'Entrées et Sorties'!D$5:D$497,C124))","v":""},""]
[null,{"$f":"IF('Liste articles'!B125=\"\",\"\",'Liste articles'!B125)","v":""},{"$f":"IF('Liste articles'!C125=\"\",\"\",'Liste articles'!C125)","v":""},null,{"$f":"IF(B125=\"\",\"\",SUMIFS('Entrées et Sorties'!E$5:E$397,'Entrées et Sorties'!D$5:D$397,C125))","v":""},{"$f":"IF(C125=\"\",\"\",SUMIFS('Entrées et Sorties'!F$5:F$497,'Entrées et Sorties'!D$5:D$497,C125))","v":""},""]
[null,{"$f":"IF('Liste articles'!B126=\"\",\"\",'Liste articles'!B126)","v":""},{"$f":"IF('Liste articles'!C126=\"\",\"\",'Liste articles'!C126)","v":""},null,{"$f":"IF(B126=\"\",\"\",SUMIFS('Entrées et Sorties'!E$5:E$397,'Entrées et Sorties'!D$5:D$397,C126))","v":""},{"$f":"IF(C126=\"\",\"\",SUMIFS('Entrées et Sorties'!F$5:F$497,'Entrées et Sorties'!D$5:D$497,C126))","v":""},""]
[null,{"$f":"IF('Liste articles'!B127=\"\",\"\",'Liste articles'!B127)","v":""},{"$f":"IF('Liste articles'!C127=\"\",\"\",'Liste articles'!C127)","v":""},null,{"$f":"IF(B127=\"\",\"\",SUMIFS('Entrées et Sorties'!E$5:E$397,'Entrées et Sorties'!D$5:D$397,C127))","v":""},{"$f":"IF(C127=\"\",\"\",SUMIFS('Entrées et Sorties'!F$5:F$497,'Entrées et Sorties'!D$5:D$497,C127))","v":""},""]
[null,{"$f":"IF('Liste articles'!B128=\"\",\"\",'Liste articles'!B128)","v":""},{"$f":"IF('Liste articles'!C128=\"\",\"\",'Liste articles'!C128)","v":""},null,{"$f":"IF(B128=\"\",\"\",SUMIFS('Entrées et Sorties'!E$5:E$397,'Entrées et Sorties'!D$5:D$397,C128))","v":""},{"$f":"IF(C128=\"\",\"\",SUMIFS('Entrées et Sorties'!F$5:F$497,'Entrées et Sorties'!D$5:D$497,C128))","v":""},""]
[null,{"$f":"IF('Liste articles'!B129=\"\",\"\",'Liste articles'!B129)","v":""},{"$f":"IF('Liste articles'!C129=\"\",\"\",'Liste articles'!C129)","v":""},null,{"$f":"IF(B129=\"\",\"\",SUMIFS('Entrées et Sorties'!E$5:E$397,'Entrées et Sorties'!D$5:D$397,C129))","v":""},{"$f":"IF(C129=\"\",\"\",SUMIFS('Entrées et Sorties'!F$5:F$497,'Entrées et Sorties'!D$5:D$497,C129))","v":""},""]
[null,{"$f":"IF('Liste articles'!B130=\"\",\"\",'Liste articles'!B130)","v":""},{"$f":"IF('Liste articles'!C130=\"\",\"\",'Liste articles'!C130)","v":""},null,{"$f":"IF(B130=\"\",\"\",SUMIFS('Entrées et Sorties'!E$5:E$397,'Entrées et Sorties'!D$5:D$397,C130))","v":""},{"$f":"IF(C130=\"\",\"\",SUMIFS('Entrées et Sorties'!F$5:F$497,'Entrées et Sorties'!D$5:D$497,C130))","v":""},""]
[null,{"$f":"IF('Liste articles'!B131=\"\",\"\",'Liste articles'!B131)","v":""},{"$f":"IF('Liste articles'!C131=\"\",\"\",'Liste articles'!C131)","v":""},null,{"$f":"IF(B131=\"\",\"\",SUMIFS('Entrées et Sorties'!E$5:E$397,'Entrées et Sorties'!D$5:D$397,C131))","v":""},{"$f":"IF(C131=\"\",\"\",SUMIFS('Entrées et Sorties'!F$5:F$497,'Entrées et Sorties'!D$5:D$497,C131))","v":""},""]
[null,{"$f":"IF('Liste articles'!B132=\"\",\"\",'Liste articles'!B132)","v":""},{"$f":"IF('Liste articles'!C132=\"\",\"\",'Liste articles'!C132)","v":""},null,{"$f":"IF(B132=\"\",\"\",SUMIFS('Entrées et Sorties'!E$5:E$397,'Entrées et Sorties'!D$5:D$397,C132))","v":""},{"$f":"IF(C132=\"\",\"\",SUMIFS('Entrées et Sorties'!F$5:F$497,'Entrées et Sorties'!D$5:D$497,C132))","v":""},""]
[null,{"$f":"IF('Liste articles'!B133=\"\",\"\",'Liste articles'!B133)","v":""},{"$f":"IF('Liste articles'!C133=\"\",\"\",'Liste articles'!C133)","v":""},null,{"$f":"IF(B133=\"\",\"\",SUMIFS('Entrées et Sorties'!E$5:E$397,'Entrées et Sorties'!D$5:D$397,C133))","v":""},{"$f":"IF(C133=\"\",\"\",SUMIFS('Entrées et Sorties'!F$5:F$497,'Entrées et Sorties'!D$5:D$497,C133))","v":""},""]
[null,{"$f":"IF('Liste articles'!B134=\"\",\"\",'Liste articles'!B134)","v":""},{"$f":"IF('Liste articles'!C134=\"\",\"\",'Liste articles'!C134)","v":""},null,{"$f":"IF(B134=\"\",\"\",SUMIFS('Entrées et Sorties'!E$5:E$397,'Entrées et Sorties'!D$5:D$397,C134))","v":""},{"$f":"IF(C134=\"\",\"\",SUMIFS('Entrées et Sorties'!F$5:F$497,'Entrées et Sorties'!D$5:D$497,C134))","v":""},""]
[null,{"$f":"IF('Liste articles'!B135=\"\",\"\",'Liste articles'!B135)","v":""},{"$f":"IF('Liste articles'!C135=\"\",\"\",'Liste articles'!C135)","v":""},null,{"$f":"IF(B135=\"\",\"\",SUMIFS('Entrées et Sorties'!E$5:E$397,'Entrées et Sorties'!D$5:D$397,C135))","v":""},{"$f":"IF(C135=\"\",\"\",SUMIFS('Entrées et Sorties'!F$5:F$497,'Entrées et Sorties'!D$5:D$497,C135))","v":""},""]
[null,{"$f":"IF('Liste articles'!B136=\"\",\"\",'Liste articles'!B136)","v":""},{"$f":"IF('Liste articles'!C136=\"\",\"\",'Liste articles'!C136)","v":""},null,{"$f":"IF(B136=\"\",\"\",SUMIFS('Entrées et Sorties'!E$5:E$397,'Entrées et Sorties'!D$5:D$397,C136))","v":""},{"$f":"IF(C136=\"\",\"\",SUMIFS('Entrées et Sorties'!F$5:F$497,'Entrées et Sorties'!D$5:D$497,C136))","v":""},""]
[null,{"$f":"IF('Liste articles'!B137=\"\",\"\",'Liste articles'!B137)","v":""},{"$f":"IF('Liste articles'!C137=\"\",\"\",'Liste articles'!C137)","v":""},null,{"$f":"IF(B137=\"\",\"\",SUMIFS('Entrées et Sorties'!E$5:E$397,'Entrées et Sorties'!D$5:D$397,C137))","v":""},{"$f":"IF(C137=\"\",\"\",SUMIFS('Entrées et Sorties'!F$5:F$497,'Entrées et Sorties'!D$5:D$497,C137))","v":""},""]
[null,{"$f":"IF('Liste articles'!B138=\"\",\"\",'Liste articles'!B138)","v":""},{"$f":"IF('Liste articles'!C138=\"\",\"\",'Liste articles'!C138)","v":""},null,{"$f":"IF(B138=\"\",\"\",SUMIFS('Entrées et Sorties'!E$5:E$397,'Entrées et Sorties'!D$5:D$397,C138))","v":""},{"$f":"IF(C138=\"\",\"\",SUMIFS('Entrées et Sorties'!F$5:F$497,'Entrées et Sorties'!D$5:D$497,C138))","v":""},{"$f":"IF(C138=\"\",\"\",D138+E138-F138)","v":""}]
[null,{"$f":"IF('Liste articles'!B139=\"\",\"\",'Liste articles'!B139)","v":""},{"$f":"IF('Liste articles'!C139=\"\",\"\",'Liste articles'!C139)","v":""},null,{"$f":"IF(B139=\"\",\"\",SUMIFS('Entrées et Sorties'!E$5:E$397,'Entrées et Sorties'!D$5:D$397,C139))","v":""},{"$f":"IF(C139=\"\",\"\",SUMIFS('Entrées et Sorties'!F$5:F$497,'Entrées et Sorties'!D$5:D$497,C139))","v":""},""]
[null,{"$f":"IF('Liste articles'!B140=\"\",\"\",'Liste articles'!B140)","v":""},{"$f":"IF('Liste articles'!C140=\"\",\"\",'Liste articles'!C140)","v":""},null,{"$f":"IF(B140=\"\",\"\",SUMIFS('Entrées et Sorties'!E$5:E$397,'Entrées et Sorties'!D$5:D$397,C140))","v":""},{"$f":"IF(C140=\"\",\"\",SUMIFS('Entrées et Sorties'!F$5:F$497,'Entrées et Sorties'!D$5:D$497,C140))","v":""},""]
[null,{"$f":"IF('Liste articles'!B141=\"\",\"\",'Liste articles'!B141)","v":""},{"$f":"IF('Liste articles'!C141=\"\",\"\",'Liste articles'!C141)","v":""},null,{"$f":"IF(B141=\"\",\"\",SUMIFS('Entrées et Sorties'!E$5:E$397,'Entrées et Sorties'!D$5:D$397,C141))","v":""},{"$f":"IF(C141=\"\",\"\",SUMIFS('Entrées et Sorties'!F$5:F$497,'Entrées et Sorties'!D$5:D$497,C141))","v":""},""]
[null,{"$f":"IF('Liste articles'!B142=\"\",\"\",'Liste articles'!B142)","v":""},{"$f":"IF('Liste articles'!C142=\"\",\"\",'Liste articles'!C142)","v":""},null,{"$f":"IF(B142=\"\",\"\",SUMIFS('Entrées et Sorties'!E$5:E$397,'Entrées et Sorties'!D$5:D$397,C142))","v":""},{"$f":"IF(C142=\"\",\"\",SUMIFS('Entrées et Sorties'!F$5:F$497,'Entrées et Sorties'!D$5:D$497,C142))","v":""},""]
[null,{"$f":"IF('Liste articles'!B143=\"\",\"\",'Liste articles'!B143)","v":""},{"$f":"IF('Liste articles'!C143=\"\",\"\",'Liste articles'!C143)","v":""},null,{"$f":"IF(B143=\"\",\"\",SUMIFS('Entrées et Sorties'!E$5:E$397,'Entrées et Sorties'!D$5:D$397,C143))","v":""},{"$f":"IF(C143=\"\",\"\",SUMIFS('Entrées et Sorties'!F$5:F$497,'Entrées et Sorties'!D$5:D$497,C143))","v":""},""]
[null,{"$f":"IF('Liste articles'!B144=\"\",\"\",'Liste articles'!B144)","v":""},{"$f":"IF('Liste articles'!C144=\"\",\"\",'Liste articles'!C144)","v":""},null,{"$f":"IF(B144=\"\",\"\",SUMIFS('Entrées et Sorties'!E$5:E$397,'Entrées et Sorties'!D$5:D$397,C144))","v":""},{"$f":"IF(C144=\"\",\"\",SUMIFS('Entrées et Sorties'!F$5:F$497,'Entrées et Sorties'!D$5:D$497,C144))","v":""},""]
[null,{"$f":"IF('Liste articles'!B145=\"\",\"\",'Liste articles'!B145)","v":""},{"$f":"IF('Liste articles'!C145=\"\",\"\",'Liste articles'!C145)","v":""},null,{"$f":"IF(B145=\"\",\"\",SUMIFS('Entrées et Sorties'!E$5:E$397,'Entrées et Sorties'!D$5:D$397,C145))","v":""},{"$f":"IF(C145=\"\",\"\",SUMIFS('Entrées et Sorties'!F$5:F$497,'Entrées et Sorties'!D$5:D$497,C145))","v":""},""]
[null,{"$f":"IF('Liste articles'!B146=\"\",\"\",'Liste articles'!B146)","v":""},{"$f":"IF('Liste articles'!C146=\"\",\"\",'Liste articles'!C146)","v":""},null,{"$f":"IF(B146=\"\",\"\",SUMIFS('Entrées et Sorties'!E$5:E$397,'Entrées et Sorties'!D$5:D$397,C146))","v":""},{"$f":"IF(C146=\"\",\"\",SUMIFS('Entrées et Sorties'!F$5:F$497,'Entrées et Sorties'!D$5:D$497,C146))","v":""},""]
[null,{"$f":"IF('Liste articles'!B147=\"\",\"\",'Liste articles'!B147)","v":""},{"$f":"IF('Liste articles'!C147=\"\",\"\",'Liste articles'!C147)","v":""},null,{"$f":"IF(B147=\"\",\"\",SUMIFS('Entrées et Sorties'!E$5:E$397,'Entrées et Sorties'!D$5:D$397,C147))","v":""},{"$f":"IF(C147=\"\",\"\",SUMIFS('Entrées et Sorties'!F$5:F$497,'Entrées et Sorties'!D$5:D$497,C147))","v":""},""]
[null,{"$f":"IF('Liste articles'!B148=\"\",\"\",'Liste articles'!B148)","v":""},{"$f":"IF('Liste articles'!C148=\"\",\"\",'Liste articles'!C148)","v":""},null,{"$f":"IF(B148=\"\",\"\",SUMIFS('Entrées et Sorties'!E$5:E$397,'Entrées et Sorties'!D$5:D$397,C148))","v":""},{"$f":"IF(C148=\"\",\"\",SUMIFS('Entrées et Sorties'!F$5:F$497,'Entrées et Sorties'!D$5:D$497,C148))","v":""},""]
[null,{"$f":"IF('Liste articles'!B149=\"\",\"\",'Liste articles'!B149)","v":""},{"$f":"IF('Liste articles'!C149=\"\",\"\",'Liste articles'!C149)","v":""},null,{"$f":"IF(B149=\"\",\"\",SUMIFS('Entrées et Sorties'!E$5:E$397,'Entrées et Sorties'!D$5:D$397,C149))","v":""},{"$f":"IF(C149=\"\",\"\",SUMIFS('Entrées et Sorties'!F$5:F$497,'Entrées et Sorties'!D$5:D$497,C149))","v":""},""]
[null,{"$f":"IF('Liste articles'!B150=\"\",\"\",'Liste articles'!B150)","v":""},{"$f":"IF('Liste articles'!C150=\"\",\"\",'Liste articles'!C150)","v":""},null,{"$f":"IF(B150=\"\",\"\",SUMIFS('Entrées et Sorties'!E$5:E$397,'Entrées et Sorties'!D$5:D$397,C150))","v":""},{"$f":"IF(C150=\"\",\"\",SUMIFS('Entrées et Sorties'!F$5:F$497,'Entrées et Sorties'!D$5:D$497,C150))","v":""},""]
[null,{"$f":"IF('Liste articles'!B151=\"\",\"\",'Liste articles'!B151)","v":""},{"$f":"IF('Liste articles'!C151=\"\",\"\",'Liste articles'!C151)","v":""},null,{"$f":"IF(B151=\"\",\"\",SUMIFS('Entrées et Sorties'!E$5:E$397,'Entrées et Sorties'!D$5:D$397,C151))","v":""},{"$f":"IF(C151=\"\",\"\",SUMIFS('Entrées et Sorties'!F$5:F$497,'Entrées et Sorties'!D$5:D$497,C151))","v":""},""]
[null,{"$f":"IF('Liste articles'!B152=\"\",\"\",'Liste articles'!B152)","v":""},{"$f":"IF('Liste articles'!C152=\"\",\"\",'Liste articles'!C152)","v":""},null,{"$f":"IF(B152=\"\",\"\",SUMIFS('Entrées et Sorties'!E$5:E$397,'Entrées et Sorties'!D$5:D$397,C152))","v":""},{"$f":"IF(C152=\"\",\"\",SUMIFS('Entrées et Sorties'!F$5:F$497,'Entrées et Sorties'!D$5:D$497,C152))","v":""},""]
[null,{"$f":"IF('Liste articles'!B153=\"\",\"\",'Liste articles'!B153)","v":""},{"$f":"IF('Liste articles'!C153=\"\",\"\",'Liste articles'!C153)","v":""},null,{"$f":"IF(B153=\"\",\"\",SUMIFS('Entrées et Sorties'!E$5:E$397,'Entrées et Sorties'!D$5:D$397,C153))","v":""},{"$f":"IF(C153=\"\",\"\",SUMIFS('Entrées et Sorties'!F$5:F$497,'Entrées et Sorties'!D$5:D$497,C153))","v":""},""]
[null,{"$f":"IF('Liste articles'!B154=\"\",\"\",'Liste articles'!B154)","v":""},{"$f":"IF('Liste articles'!C154=\"\",\"\",'Liste articles'!C154)","v":""},null,{"$f":"IF(B154=\"\",\"\",SUMIFS('Entrées et Sorties'!E$5:E$397,'Entrées et Sorties'!D$5:D$397,C154))","v":""},{"$f":"IF(C154=\"\",\"\",SUMIFS('Entrées et Sorties'!F$5:F$497,'Entrées et Sorties'!D$5:D$497,C154))","v":""},""]
[null,{"$f":"IF('Liste articles'!B155=\"\",\"\",'Liste articles'!B155)","v":""},{"$f":"IF('Liste articles'!C155=\"\",\"\",'Liste articles'!C155)","v":""},null,{"$f":"IF(B155=\"\",\"\",SUMIFS('Entrées et Sorties'!E$5:E$397,'Entrées et Sorties'!D$5:D$397,C155))","v":""},{"$f":"IF(C155=\"\",\"\",SUMIFS('Entrées et Sorties'!F$5:F$497,'Entrées et Sorties'!D$5:D$497,C155))","v":""},""]
[null,{"$f":"IF('Liste articles'!B156=\"\",\"\",'Liste articles'!B156)","v":""},{"$f":"IF('Liste articles'!C156=\"\",\"\",'Liste articles'!C156)","v":""},null,{"$f":"IF(B156=\"\",\"\",SUMIFS('Entrées et Sorties'!E$5:E$397,'Entrées et Sorties'!D$5:D$397,C156))","v":""},{"$f":"IF(C156=\"\",\"\",SUMIFS('Entrées et Sorties'!F$5:F$497,'Entrées et Sorties'!D$5:D$497,C156))","v":""},""]
[null,{"$f":"IF('Liste articles'!B157=\"\",\"\",'Liste articles'!B157)","v":""},{"$f":"IF('Liste articles'!C157=\"\",\"\",'Liste articles'!C157)","v":""},null,{"$f":"IF(B157=\"\",\"\",SUMIFS('Entrées et Sorties'!E$5:E$397,'Entrées et Sorties'!D$5:D$397,C157))","v":""},{"$f":"IF(C157=\"\",\"\",SUMIFS('Entrées et Sorties'!F$5:F$497,'Entrées et Sorties'!D$5:D$497,C157))","v":""},""]
[null,{"$f":"IF('Liste articles'!B158=\"\",\"\",'Liste articles'!B158)","v":""},{"$f":"IF('Liste articles'!C158=\"\",\"\",'Liste articles'!C158)","v":""},null,{"$f":"IF(B158=\"\",\"\",SUMIFS('Entrées et Sorties'!E$5:E$397,'Entrées et Sorties'!D$5:D$397,C158))","v":""},{"$f":"IF(C158=\"\",\"\",SUMIFS('Entrées et Sorties'!F$5:F$497,'Entrées et Sorties'!D$5:D$497,C158))","v":""},""]
[null,{"$f":"IF('Liste articles'!B159=\"\",\"\",'Liste articles'!B159)","v":""},{"$f":"IF('Liste articles'!C159=\"\",\"\",'Liste articles'!C159)","v":""},null,{"$f":"IF(B159=\"\",\"\",SUMIFS('Entrées et Sorties'!E$5:E$397,'Entrées et Sorties'!D$5:D$397,C159))","v":""},{"$f":"IF(C159=\"\",\"\",SUMIFS('Entrées et Sorties'!F$5:F$497,'Entrées et Sorties'!D$5:D$497,C159))","v":""},""]
[null,{"$f":"IF('Liste articles'!B160=\"\",\"\",'Liste articles'!B160)","v":""},{"$f":"IF('Liste articles'!C160=\"\",\"\",'Liste articles'!C160)","v":""},null,{"$f":"IF(B160=\"\",\"\",SUMIFS('Entrées et Sorties'!E$5:E$397,'Entrées et Sorties'!D$5:D$397,C160))","v":""},{"$f":"IF(C160=\"\",\"\",SUMIFS('Entrées et Sorties'!F$5:F$497,'Entrées et Sorties'!D$5:D$497,C160))","v":""},""]
[null,{"$f":"IF('Liste articles'!B161=\"\",\"\",'Liste articles'!B161)","v":""},{"$f":"IF('Liste articles'!C161=\"\",\"\",'Liste articles'!C161)","v":""},null,{"$f":"IF(B161=\"\",\"\",SUMIFS('Entrées et Sorties'!E$5:E$397,'Entrées et Sorties'!D$5:D$397,C161))","v":""},{"$f":"IF(C161=\"\",\"\",SUMIFS('Entrées et Sorties'!F$5:F$497,'Entrées et Sorties'!D$5:D$497,C161))","v":""},""]
[null,{"$f":"IF('Liste articles'!B162=\"\",\"\",'Liste articles'!B162)","v":""},{"$f":"IF('Liste articles'!C162=\"\",\"\",'Liste articles'!C162)","v":""},null,{"$f":"IF(B162=\"\",\"\",SUMIFS('Entrées et Sorties'!E$5:E$397,'Entrées et Sorties'!D$5:D$397,C162))","v":""},{"$f":"IF(C162=\"\",\"\",SUMIFS('Entrées et Sorties'!F$5:F$497,'Entrées et Sorties'!D$5:D$497,C162))","v":""},""]
[null,{"$f":"IF('Liste articles'!B163=\"\",\"\",'Liste articles'!B163)","v":""},{"$f":"IF('Liste articles'!C163=\"\",\"\",'Liste articles'!C163)","v":""},null,{"$f":"IF(B163=\"\",\"\",SUMIFS('Entrées et Sorties'!E$5:E$397,'Entrées et Sorties'!D$5:D$397,C163))","v":""},{"$f":"IF(C163=\"\",\"\",SUMIFS('Entrées et Sorties'!F$5:F$497,'Entrées et Sorties'!D$5:D$497,C163))","v":""},""]
[null,{"$f":"IF('Liste articles'!B164=\"\",\"\",'Liste articles'!B164)","v":""},{"$f":"IF('Liste articles'!C164=\"\",\"\",'Liste articles'!C164)","v":""},null,{"$f":"IF(B164=\"\",\"\",SUMIFS('Entrées et Sorties'!E$5:E$397,'Entrées et Sorties'!D$5:D$397,C164))","v":""},{"$f":"IF(C164=\"\",\"\",SUMIFS('Entrées et Sorties'!F$5:F$497,'Entrées et Sorties'!D$5:D$497,C164))","v":""},""]
[null,{"$f":"IF('Liste articles'!B165=\"\",\"\",'Liste articles'!B165)","v":""},{"$f":"IF('Liste articles'!C165=\"\",\"\",'Liste articles'!C165)","v":""},null,{"$f":"IF(B165=\"\",\"\",SUMIFS('Entrées et Sorties'!E$5:E$397,'Entrées et Sorties'!D$5:D$397,C165))","v":""},{"$f":"IF(C165=\"\",\"\",SUMIFS('Entrées et Sorties'!F$5:F$497,'Entrées et Sorties'!D$5:D$497,C165))","v":""},""]
[null,{"$f":"IF('Liste articles'!B166=\"\",\"\",'Liste articles'!B166)","v":""},{"$f":"IF('Liste articles'!C166=\"\",\"\",'Liste articles'!C166)","v":""},null,{"$f":"IF(B166=\"\",\"\",SUMIFS('Entrées et Sorties'!E$5:E$397,'Entrées et Sorties'!D$5:D$397,C166))","v":""},{"$f":"IF(C166=\"\",\"\",SUMIFS('Entrées et Sorties'!F$5:F$497,'Entrées et Sorties'!D$5:D$497,C166))","v":""},""]
[null,{"$f":"IF('Liste articles'!B167=\"\",\"\",'Liste articles'!B167)","v":""},{"$f":"IF('Liste articles'!C167=\"\",\"\",'Liste articles'!C167)","v":""},null,{"$f":"IF(B167=\"\",\"\",SUMIFS('Entrées et Sorties'!E$5:E$397,'Entrées et Sorties'!D$5:D$397,C167))","v":""},{"$f":"IF(C167=\"\",\"\",SUMIFS('Entrées et Sorties'!F$5:F$497,'Entrées et Sorties'!D$5:D$497,C167))","v":""},""]
[null,{"$f":"IF('Liste articles'!B168=\"\",\"\",'Liste articles'!B168)","v":""},{"$f":"IF('Liste articles'!C168=\"\",\"\",'Liste articles'!C168)","v":""},null,{"$f":"IF(B168=\"\",\"\",SUMIFS('Entrées et Sorties'!E$5:E$397,'Entrées et Sorties'!D$5:D$397,C168))","v":""},{"$f":"IF(C168=\"\",\"\",SUMIFS('Entrées et Sorties'!F$5:F$497,'Entrées et Sorties'!D$5:D$497,C168))","v":""},""]
[null,{"$f":"IF('Liste articles'!B169=\"\",\"\",'Liste articles'!B169)","v":""},{"$f":"IF('Liste articles'!C169=\"\",\"\",'Liste articles'!C169)","v":""},null,{"$f":"IF(B169=\"\",\"\",SUMIFS('Entrées et Sorties'!E$5:E$397,'Entrées et Sorties'!D$5:D$397,C169))","v":""},{"$f":"IF(C169=\"\",\"\",SUMIFS('Entrées et Sorties'!F$5:F$497,'Entrées et Sorties'!D$5:D$497,C169))","v":""},""]
[null,{"$f":"IF('Liste articles'!B170=\"\",\"\",'Liste articles'!B170)","v":""},{"$f":"IF('Liste articles'!C170=\"\",\"\",'Liste articles'!C170)","v":""},null,{"$f":"IF(B170=\"\",\"\",SUMIFS('Entrées et Sorties'!E$5:E$397,'Entrées et Sorties'!D$5:D$397,C170))","v":""},{"$f":"IF(C170=\"\",\"\",SUMIFS('Entrées et Sorties'!F$5:F$497,'Entrées et Sorties'!D$5:D$497,C170))","v":""},""]
[null,{"$f":"IF('Liste articles'!B171=\"\",\"\",'Liste articles'!B171)","v":""},{"$f":"IF('Liste articles'!C171=\"\",\"\",'Liste articles'!C171)","v":""},null,{"$f":"IF(B171=\"\",\"\",SUMIFS('Entrées et Sorties'!E$5:E$397,'Entrées et Sorties'!D$5:D$397,C171))","v":""},{"$f":"IF(C171=\"\",\"\",SUMIFS('Entrées et Sorties'!F$5:F$497,'Entrées et Sorties'!D$5:D$497,C171))","v":""},""]
[null,{"$f":"IF('Liste articles'!B172=\"\",\"\",'Liste articles'!B172)","v":""},{"$f":"IF('Liste articles'!C172=\"\",\"\",'Liste articles'!C172)","v":""},null,{"$f":"IF(B172=\"\",\"\",SUMIFS('Entrées et Sorties'!E$5:E$397,'Entrées et Sorties'!D$5:D$397,C172))","v":""},{"$f":"IF(C172=\"\",\"\",SUMIFS('Entrées et Sorties'!F$5:F$497,'Entrées et Sorties'!D$5:D$497,C172))","v":""},""]
[null,{"$f":"IF('Liste articles'!B173=\"\",\"\",'Liste articles'!B173)","v":""},{"$f":"IF('Liste articles'!C173=\"\",\"\",'Liste articles'!C173)","v":""},null,{"$f":"IF(B173=\"\",\"\",SUMIFS('Entrées et Sorties'!E$5:E$397,'Entrées et Sorties'!D$5:D$397,C173))","v":""},{"$f":"IF(C173=\"\",\"\",SUMIFS('Entrées et Sorties'!F$5:F$497,'Entrées et Sorties'!D$5:D$497,C173))","v":""},""]
[null,{"$f":"IF('Liste articles'!B174=\"\",\"\",'Liste articles'!B174)","v":""},{"$f":"IF('Liste articles'!C174=\"\",\"\",'Liste articles'!C174)","v":""},null,{"$f":"IF(B174=\"\",\"\",SUMIFS('Entrées et Sorties'!E$5:E$397,'Entrées et Sorties'!D$5:D$397,C174))","v":""},{"$f":"IF(C174=\"\",\"\",SUMIFS('Entrées et Sorties'!F$5:F$497,'Entrées et Sorties'!D$5:D$497,C174))","v":""},""]
[null,{"$f":"IF('Liste articles'!B175=\"\",\"\",'Liste articles'!B175)","v":""},{"$f":"IF('Liste articles'!C175=\"\",\"\",'Liste articles'!C175)","v":""},null,{"$f":"IF(B175=\"\",\"\",SUMIFS('Entrées et Sorties'!E$5:E$397,'Entrées et Sorties'!D$5:D$397,C175))","v":""},{"$f":"IF(C175=\"\",\"\",SUMIFS('Entrées et Sorties'!F$5:F$497,'Entrées et Sorties'!D$5:D$497,C175))","v":""},""]
[null,{"$f":"IF('Liste articles'!B176=\"\",\"\",'Liste articles'!B176)","v":""},{"$f":"IF('Liste articles'!C176=\"\",\"\",'Liste articles'!C176)","v":""},null,{"$f":"IF(B176=\"\",\"\",SUMIFS('Entrées et Sorties'!E$5:E$397,'Entrées et Sorties'!D$5:D$397,C176))","v":""},{"$f":"IF(C176=\"\",\"\",SUMIFS('Entrées et Sorties'!F$5:F$497,'Entrées et Sorties'!D$5:D$497,C176))","v":""},""]
[null,{"$f":"IF('Liste articles'!B177=\"\",\"\",'Liste articles'!B177)","v":""},{"$f":"IF('Liste articles'!C177=\"\",\"\",'Liste articles'!C177)","v":""},null,{"$f":"IF(B177=\"\",\"\",SUMIFS('Entrées et Sorties'!E$5:E$397,'Entrées et Sorties'!D$5:D$397,C177))","v":""},{"$f":"IF(C177=\"\",\"\",SUMIFS('Entrées et Sorties'!F$5:F$497,'Entrées et Sorties'!D$5:D$497,C177))","v":""},""]
[null,{"$f":"IF('Liste articles'!B178=\"\",\"\",'Liste articles'!B178)","v":""},{"$f":"IF('Liste articles'!C178=\"\",\"\",'Liste articles'!C178)","v":""},null,{"$f":"IF(B178=\"\",\"\",SUMIFS('Entrées et Sorties'!E$5:E$397,'Entrées et Sorties'!D$5:D$397,C178))","v":""},{"$f":"IF(C178=\"\",\"\",SUMIFS('Entrées et Sorties'!F$5:F$497,'Entrées et Sorties'!D$5:D$497,C178))","v":""},""]
[null,{"$f":"IF('Liste articles'!B179=\"\",\"\",'Liste articles'!B179)","v":""},{"$f":"IF('Liste articles'!C179=\"\",\"\",'Liste articles'!C179)","v":""},null,{"$f":"IF(B179=\"\",\"\",SUMIFS('Entrées et Sorties'!E$5:E$397,'Entrées et Sorties'!D$5:D$397,C179))","v":""},{"$f":"IF(C179=\"\",\"\",SUMIFS('Entrées et Sorties'!F$5:F$497,'Entrées et Sorties'!D$5:D$497,C179))","v":""},""]
[null,{"$f":"IF('Liste articles'!B180=\"\",\"\",'Liste articles'!B180)","v":""},{"$f":"IF('Liste articles'!C180=\"\",\"\",'Liste articles'!C180)","v":""},null,{"$f":"IF(B180=\"\",\"\",SUMIFS('Entrées et Sorties'!E$5:E$397,'Entrées et Sorties'!D$5:D$397,C180))","v":""},{"$f":"IF(C180=\"\",\"\",SUMIFS('Entrées et Sorties'!F$5:F$497,'Entrées et Sorties'!D$5:D$497,C180))","v":""},""]
[null,{"$f":"IF('Liste articles'!B181=\"\",\"\",'Liste articles'!B181)","v":""},{"$f":"IF('Liste articles'!C181=\"\",\"\",'Liste articles'!C181)","v":""},null,{"$f":"IF(B181=\"\",\"\",SUMIFS('Entrées et Sorties'!E$5:E$397,'Entrées et Sorties'!D$5:D$397,C181))","v":""},{"$f":"IF(C181=\"\",\"\",SUMIFS('Entrées et Sorties'!F$5:F$497,'Entrées et Sorties'!D$5:D$497,C181))","v":""},""]
[null,{"$f":"IF('Liste articles'!B182=\"\",\"\",'Liste articles'!B182)","v":""},{"$f":"IF('Liste articles'!C182=\"\",\"\",'Liste articles'!C182)","v":""},null,{"$f":"IF(B182=\"\",\"\",SUMIFS('Entrées et Sorties'!E$5:E$397,'Entrées et Sorties'!D$5:D$397,C182))","v":""},{"$f":"IF(C182=\"\",\"\",SUMIFS('Entrées et Sorties'!F$5:F$497,'Entrées et Sorties'!D$5:D$497,C182))","v":""},""]
[null,{"$f":"IF('Liste articles'!B183=\"\",\"\",'Liste articles'!B183)","v":""},{"$f":"IF('Liste articles'!C183=\"\",\"\",'Liste articles'!C183)","v":""},null,{"$f":"IF(B183=\"\",\"\",SUMIFS('Entrées et Sorties'!E$5:E$397,'Entrées et Sorties'!D$5:D$397,C183))","v":""},{"$f":"IF(C183=\"\",\"\",SUMIFS('Entrées et Sorties'!F$5:F$497,'Entrées et Sorties'!D$5:D$497,C183))","v":""},""]
[null,{"$f":"IF('Liste articles'!B184=\"\",\"\",'Liste articles'!B184)","v":""},{"$f":"IF('Liste articles'!C184=\"\",\"\",'Liste articles'!C184)","v":""},null,{"$f":"IF(B184=\"\",\"\",SUMIFS('Entrées et Sorties'!E$5:E$397,'Entrées et Sorties'!D$5:D$397,C184))","v":""},{"$f":"IF(C184=\"\",\"\",SUMIFS('Entrées et Sorties'!F$5:F$497,'Entrées et Sorties'!D$5:D$497,C184))","v":""},""]
[null,{"$f":"IF('Liste articles'!B185=\"\",\"\",'Liste articles'!B185)","v":""},{"$f":"IF('Liste articles'!C185=\"\",\"\",'Liste articles'!C185)","v":""},null,{"$f":"IF(B185=\"\",\"\",SUMIFS('Entrées et Sorties'!E$5:E$397,'Entrées et Sorties'!D$5:D$397,C185))","v":""},{"$f":"IF(C185=\"\",\"\",SUMIFS('Entrées et Sorties'!F$5:F$497,'Entrées et Sorties'!D$5:D$497,C185))","v":""},""]
[null,{"$f":"IF('Liste articles'!B186=\"\",\"\",'Liste articles'!B186)","v":""},{"$f":"IF('Liste articles'!C186=\"\",\"\",'Liste articles'!C186)","v":""},null,{"$f":"IF(B186=\"\",\"\",SUMIFS('Entrées et Sorties'!E$5:E$397,'Entrées et Sorties'!D$5:D$397,C186))","v":""},{"$f":"IF(C186=\"\",\"\",SUMIFS('Entrées et Sorties'!F$5:F$497,'Entrées et Sorties'!D$5:D$497,C186))","v":""},""]
[null,{"$f":"IF('Liste articles'!B187=\"\",\"\",'Liste articles'!B187)","v":""},{"$f":"IF('Liste articles'!C187=\"\",\"\",'Liste articles'!C187)","v":""},null,{"$f":"IF(B187=\"\",\"\",SUMIFS('Entrées et Sorties'!E$5:E$397,'Entrées et Sorties'!D$5:D$397,C187))","v":""},{"$f":"IF(C187=\"\",\"\",SUMIFS('Entrées et Sorties'!F$5:F$497,'Entrées et Sorties'!D$5:D$497,C187))","v":""},""]
[null,{"$f":"IF('Liste articles'!B188=\"\",\"\",'Liste articles'!B188)","v":""},{"$f":"IF('Liste articles'!C188=\"\",\"\",'Liste articles'!C188)","v":""},null,{"$f":"IF(B188=\"\",\"\",SUMIFS('Entrées et Sorties'!E$5:E$397,'Entrées et Sorties'!D$5:D$397,C188))","v":""},{"$f":"IF(C188=\"\",\"\",SUMIFS('Entrées et Sorties'!F$5:F$497,'Entrées et Sorties'!D$5:D$497,C188))","v":""},""]
[null,{"$f":"IF('Liste articles'!B189=\"\",\"\",'Liste articles'!B189)","v":""},{"$f":"IF('Liste articles'!C189=\"\",\"\",'Liste articles'!C189)","v":""},null,{"$f":"IF(B189=\"\",\"\",SUMIFS('Entrées et Sorties'!E$5:E$397,'Entrées et Sorties'!D$5:D$397,C189))","v":""},{"$f":"IF(C189=\"\",\"\",SUMIFS('Entrées et Sorties'!F$5:F$497,'Entrées et Sorties'!D$5:D$497,C189))","v":""},""]
[null,{"$f":"IF('Liste articles'!B190=\"\",\"\",'Liste articles'!B190)","v":""},{"$f":"IF('Liste articles'!C190=\"\",\"\",'Liste articles'!C190)","v":""},null,{"$f":"IF(B190=\"\",\"\",SUMIFS('Entrées et Sorties'!E$5:E$397,'Entrées et Sorties'!D$5:D$397,C190))","v":""},{"$f":"IF(C190=\"\",\"\",SUMIFS('Entrées et Sorties'!F$5:F$497,'Entrées et Sorties'!D$5:D$497,C190))","v":""},""]
[null,{"$f":"IF('Liste articles'!B191=\"\",\"\",'Liste articles'!B191)","v":""},{"$f":"IF('Liste articles'!C191=\"\",\"\",'Liste articles'!C191)","v":""},null,{"$f":"IF(B191=\"\",\"\",SUMIFS('Entrées et Sorties'!E$5:E$397,'Entrées et Sorties'!D$5:D$397,C191))","v":""},{"$f":"IF(C191=\"\",\"\",SUMIFS('Entrées et Sorties'!F$5:F$497,'Entrées et Sorties'!D$5:D$497,C191))","v":""},""]
[null,{"$f":"IF('Liste articles'!B192=\"\",\"\",'Liste articles'!B192)","v":""},{"$f":"IF('Liste articles'!C192=\"\",\"\",'Liste articles'!C192)","v":""},null,{"$f":"IF(B192=\"\",\"\",SUMIFS('Entrées et Sorties'!E$5:E$397,'Entrées et Sorties'!D$5:D$397,C192))","v":""},{"$f":"IF(C192=\"\",\"\",SUMIFS('Entrées et Sorties'!F$5:F$497,'Entrées et Sorties'!D$5:D$497,C192))","v":""},""]
[null,{"$f":"IF('Liste articles'!B193=\"\",\"\",'Liste articles'!B193)","v":""},{"$f":"IF('Liste articles'!C193=\"\",\"\",'Liste articles'!C193)","v":""},null,{"$f":"IF(B193=\"\",\"\",SUMIFS('Entrées et Sorties'!E$5:E$397,'Entrées et Sorties'!D$5:D$397,C193))","v":""},{"$f":"IF(C193=\"\",\"\",SUMIFS('Entrées et Sorties'!F$5:F$497,'Entrées et Sorties'!D$5:D$497,C193))","v":""},""]
[null,{"$f":"IF('Liste articles'!B194=\"\",\"\",'Liste articles'!B194)","v":""},{"$f":"IF('Liste articles'!C194=\"\",\"\",'Liste articles'!C194)","v":""},null,{"$f":"IF(B194=\"\",\"\",SUMIFS('Entrées et Sorties'!E$5:E$397,'Entrées et Sorties'!D$5:D$397,C194))","v":""},{"$f":"IF(C194=\"\",\"\",SUMIFS('Entrées et Sorties'!F$5:F$497,'Entrées et Sorties'!D$5:D$497,C194))","v":""},""]
[null,null,{"$f":"IF('Liste articles'!C195=\"\",\"\",'Liste articles'!C195)","v":""},null,{"$f":"IF(B195=\"\",\"\",SUMIFS('Entrées et Sorties'!E$5:E$397,'Entrées et Sorties'!D$5:D$397,C195))","v":""},{"$f":"IF(C195=\"\",\"\",SUMIFS('Entrées et Sorties'!F$5:F$497,'Entrées et Sorties'!D$5:D$497,C195))","v":""},""]
[null,null,{"$f":"IF('Liste articles'!C196=\"\",\"\",'Liste articles'!C196)","v":""},null,{"$f":"IF(B196=\"\",\"\",SUMIFS('Entrées et Sorties'!E$5:E$397,'Entrées et Sorties'!D$5:D$397,C196))","v":""},{"$f":"IF(C196=\"\",\"\",SUMIFS('Entrées et Sorties'!F$5:F$497,'Entrées et Sorties'!D$5:D$497,C196))","v":""},""]
[null,null,{"$f":"IF('Liste articles'!C197=\"\",\"\",'Liste articles'!C197)","v":""},null,{"$f":"IF(B197=\"\",\"\",SUMIFS('Entrées et Sorties'!E$5:E$397,'Entrées et Sorties'!D$5:D$397,C197))","v":""},{"$f":"IF(C197=\"\",\"\",SUMIFS('Entrées et Sorties'!F$5:F$497,'Entrées et Sorties'!D$5:D$497,C197))","v":""},""]
[null,null,{"$f":"IF('Liste articles'!C198=\"\",\"\",'Liste articles'!C198)","v":""},null,{"$f":"IF(B198=\"\",\"\",SUMIFS('Entrées et Sorties'!E$5:E$397,'Entrées et Sorties'!D$5:D$397,C198))","v":""},{"$f":"IF(C198=\"\",\"\",SUMIFS('Entrées et Sorties'!F$5:F$497,'Entrées et Sorties'!D$5:D$497,C198))","v":""},""]
[null,null,{"$f":"IF('Liste articles'!C199=\"\",\"\",'Liste articles'!C199)","v":""},null,{"$f":"IF(B199=\"\",\"\",SUMIFS('Entrées et Sorties'!E$5:E$397,'Entrées et Sorties'!D$5:D$397,C199))","v":""},{"$f":"IF(C199=\"\",\"\",SUMIFS('Entrées et Sorties'!F$5:F$497,'Entrées et Sorties'!D$5:D$497,C199))","v":""},""]
[null,null,{"$f":"IF('Liste articles'!C200=\"\",\"\",'Liste articles'!C200)","v":""},null,{"$f":"IF(B200=\"\",\"\",SUMIFS('Entrées et Sorties'!E$5:E$397,'Entrées et Sorties'!D$5:D$397,C200))","v":""},{"$f":"IF(C200=\"\",\"\",SUMIFS('Entrées et Sorties'!F$5:F$497,'Entrées et Sorties'!D$5:D$497,C200))","v":""},""]
[null,null,{"$f":"IF('Liste articles'!C201=\"\",\"\",'Liste articles'!C201)","v":""},null,{"$f":"IF(B201=\"\",\"\",SUMIFS('Entrées et Sorties'!E$5:E$397,'Entrées et Sorties'!D$5:D$397,C201))","v":""},{"$f":"IF(C201=\"\",\"\",SUMIFS('Entrées et Sorties'!F$5:F$497,'Entrées et Sorties'!D$5:D$497,C201))","v":""},""]
[null,null,{"$f":"IF('Liste articles'!C202=\"\",\"\",'Liste articles'!C202)","v":""},null,{"$f":"IF(B202=\"\",\"\",SUMIFS('Entrées et Sorties'!E$5:E$397,'Entrées et Sorties'!D$5:D$397,C202))","v":""},{"$f":"IF(C202=\"\",\"\",SUMIFS('Entrées et Sorties'!F$5:F$497,'Entrées et Sorties'!D$5:D$497,C202))","v":""},{"$f":"IF(C202=\"\",\"\",D202+E202-F202)","v":""}]
[null,null,{"$f":"IF('Liste articles'!C203=\"\",\"\",'Liste articles'!C203)","v":""},null,{"$f":"IF(B203=\"\",\"\",SUMIFS('Entrées et Sorties'!E$5:E$397,'Entrées et Sorties'!D$5:D$397,C203))","v":""},{"$f":"IF(C203=\"\",\"\",SUMIFS('Entrées et Sorties'!F$5:F$497,'Entrées et Sorties'!D$5:D$497,C203))","v":""},""]
[null,null,{"$f":"IF('Liste articles'!C204=\"\",\"\",'Liste articles'!C204)","v":""},null,{"$f":"IF(B204=\"\",\"\",SUMIFS('Entrées et Sorties'!E$5:E$397,'Entrées et Sorties'!D$5:D$397,C204))","v":""},{"$f":"IF(C204=\"\",\"\",SUMIFS('Entrées et Sorties'!F$5:F$497,'Entrées et Sorties'!D$5:D$497,C204))","v":""},""]
[null,null,{"$f":"IF('Liste articles'!C205=\"\",\"\",'Liste articles'!C205)","v":""},null,{"$f":"IF(B205=\"\",\"\",SUMIFS('Entrées et Sorties'!E$5:E$397,'Entrées et Sorties'!D$5:D$397,C205))","v":""},{"$f":"IF(C205=\"\",\"\",SUMIFS('Entrées et Sorties'!F$5:F$497,'Entrées et Sorties'!D$5:D$497,C205))","v":""},""]
[null,null,{"$f":"IF('Liste articles'!C206=\"\",\"\",'Liste articles'!C206)","v":""},null,{"$f":"IF(B206=\"\",\"\",SUMIFS('Entrées et Sorties'!E$5:E$397,'Entrées et Sorties'!D$5:D$397,C206))","v":""},{"$f":"IF(C206=\"\",\"\",SUMIFS('Entrées et Sorties'!F$5:F$497,'Entrées et Sorties'!D$5:D$497,C206))","v":""},""]
[null,null,{"$f":"IF('Liste articles'!C207=\"\",\"\",'Liste articles'!C207)","v":""},null,{"$f":"IF(B207=\"\",\"\",SUMIFS('Entrées et Sorties'!E$5:E$397,'Entrées et Sorties'!D$5:D$397,C207))","v":""},{"$f":"IF(C207=\"\",\"\",SUMIFS('Entrées et Sorties'!F$5:F$497,'Entrées et Sorties'!D$5:D$497,C207))","v":""},""]
[null,null,{"$f":"IF('Liste articles'!C208=\"\",\"\",'Liste articles'!C208)","v":""},null,{"$f":"IF(B208=\"\",\"\",SUMIFS('Entrées et Sorties'!E$5:E$397,'Entrées et Sorties'!D$5:D$397,C208))","v":""},{"$f":"IF(C208=\"\",\"\",SUMIFS('Entrées et Sorties'!F$5:F$497,'Entrées et Sorties'!D$5:D$497,C208))","v":""},""]
[null,null,{"$f":"IF('Liste articles'!C209=\"\",\"\",'Liste articles'!C209)","v":""},null,{"$f":"IF(B209=\"\",\"\",SUMIFS('Entrées et Sorties'!E$5:E$397,'Entrées et Sorties'!D$5:D$397,C209))","v":""},{"$f":"IF(C209=\"\",\"\",SUMIFS('Entrées et Sorties'!F$5:F$497,'Entrées et Sorties'!D$5:D$497,C209))","v":""},""]
[null,null,{"$f":"IF('Liste articles'!C210=\"\",\"\",'Liste articles'!C210)","v":""},null,{"$f":"IF(B210=\"\",\"\",SUMIFS('Entrées et Sorties'!E$5:E$397,'Entrées et Sorties'!D$5:D$397,C210))","v":""},{"$f":"IF(C210=\"\",\"\",SUMIFS('Entrées et Sorties'!F$5:F$497,'Entrées et Sorties'!D$5:D$497,C210))","v":""},""]
[null,null,{"$f":"IF('Liste articles'!C211=\"\",\"\",'Liste articles'!C211)","v":""},null,{"$f":"IF(B211=\"\",\"\",SUMIFS('Entrées et Sorties'!E$5:E$397,'Entrées et Sorties'!D$5:D$397,C211))","v":""},{"$f":"IF(C211=\"\",\"\",SUMIFS('Entrées et Sorties'!F$5:F$497,'Entrées et Sorties'!D$5:D$497,C211))","v":""},""]
[null,null,{"$f":"IF('Liste articles'!C212=\"\",\"\",'Liste articles'!C212)","v":""},null,{"$f":"IF(B212=\"\",\"\",SUMIFS('Entrées et Sorties'!E$5:E$397,'Entrées et Sorties'!D$5:D$397,C212))","v":""},{"$f":"IF(C212=\"\",\"\",SUMIFS('Entrées et Sorties'!F$5:F$497,'Entrées et Sorties'!D$5:D$497,C212))","v":""},""]
[null,null,{"$f":"IF('Liste articles'!C213=\"\",\"\",'Liste articles'!C213)","v":""},null,{"$f":"IF(B213=\"\",\"\",SUMIFS('Entrées et Sorties'!E$5:E$397,'Entrées et Sorties'!D$5:D$397,C213))","v":""},{"$f":"IF(C213=\"\",\"\",SUMIFS('Entrées et Sorties'!F$5:F$497,'Entrées et Sorties'!D$5:D$497,C213))","v":""},""]
[null,null,{"$f":"IF('Liste articles'!C214=\"\",\"\",'Liste articles'!C214)","v":""},null,{"$f":"IF(B214=\"\",\"\",SUMIFS('Entrées et Sorties'!E$5:E$397,'Entrées et Sorties'!D$5:D$397,C214))","v":""},{"$f":"IF(C214=\"\",\"\",SUMIFS('Entrées et Sorties'!F$5:F$497,'Entrées et Sorties'!D$5:D$497,C214))","v":""},""]
[null,null,{"$f":"IF('Liste articles'!C215=\"\",\"\",'Liste articles'!C215)","v":""},null,{"$f":"IF(B215=\"\",\"\",SUMIFS('Entrées et Sorties'!E$5:E$397,'Entrées et Sorties'!D$5:D$397,C215))","v":""},{"$f":"IF(C215=\"\",\"\",SUMIFS('Entrées et Sorties'!F$5:F$497,'Entrées et Sorties'!D$5:D$497,C215))","v":""},""]
[null,null,{"$f":"IF('Liste articles'!C216=\"\",\"\",'Liste articles'!C216)","v":""},null,{"$f":"IF(B216=\"\",\"\",SUMIFS('Entrées et Sorties'!E$5:E$397,'Entrées et Sorties'!D$5:D$397,C216))","v":""},{"$f":"IF(C216=\"\",\"\",SUMIFS('Entrées et Sorties'!F$5:F$497,'Entrées et Sorties'!D$5:D$497,C216))","v":""},""]
[null,null,{"$f":"IF('Liste articles'!C217=\"\",\"\",'Liste articles'!C217)","v":""},null,{"$f":"IF(B217=\"\",\"\",SUMIFS('Entrées et Sorties'!E$5:E$397,'Entrées et Sorties'!D$5:D$397,C217))","v":""},{"$f":"IF(C217=\"\",\"\",SUMIFS('Entrées et Sorties'!F$5:F$497,'Entrées et Sorties'!D$5:D$497,C217))","v":""},""]
[null,null,{"$f":"IF('Liste articles'!C218=\"\",\"\",'Liste articles'!C218)","v":""},null,{"$f":"IF(B218=\"\",\"\",SUMIFS('Entrées et Sorties'!E$5:E$397,'Entrées et Sorties'!D$5:D$397,C218))","v":""},{"$f":"IF(C218=\"\",\"\",SUMIFS('Entrées et Sorties'!F$5:F$497,'Entrées et Sorties'!D$5:D$497,C218))","v":""},""]
[null,null,{"$f":"IF('Liste articles'!C219=\"\",\"\",'Liste articles'!C219)","v":""},null,{"$f":"IF(B219=\"\",\"\",SUMIFS('Entrées et Sorties'!E$5:E$397,'Entrées et Sorties'!D$5:D$397,C219))","v":""},{"$f":"IF(C219=\"\",\"\",SUMIFS('Entrées et Sorties'!F$5:F$497,'Entrées et Sorties'!D$5:D$497,C219))","v":""},""]
[null,null,{"$f":"IF('Liste articles'!C220=\"\",\"\",'Liste articles'!C220)","v":""},null,{"$f":"IF(B220=\"\",\"\",SUMIFS('Entrées et Sorties'!E$5:E$397,'Entrées et Sorties'!D$5:D$397,C220))","v":""},{"$f":"IF(C220=\"\",\"\",SUMIFS('Entrées et Sorties'!F$5:F$497,'Entrées et Sorties'!D$5:D$497,C220))","v":""},""]
[null,null,{"$f":"IF('Liste articles'!C221=\"\",\"\",'Liste articles'!C221)","v":""},null,{"$f":"IF(B221=\"\",\"\",SUMIFS('Entrées et Sorties'!E$5:E$397,'Entrées et Sorties'!D$5:D$397,C221))","v":""},{"$f":"IF(C221=\"\",\"\",SUMIFS('Entrées et Sorties'!F$5:F$497,'Entrées et Sorties'!D$5:D$497,C221))","v":""},""]
[null,null,{"$f":"IF('Liste articles'!C222=\"\",\"\",'Liste articles'!C222)","v":""},null,{"$f":"IF(B222=\"\",\"\",SUMIFS('Entrées et Sorties'!E$5:E$397,'Entrées et Sorties'!D$5:D$397,C222))","v":""},{"$f":"IF(C222=\"\",\"\",SUMIFS('Entrées et Sorties'!F$5:F$497,'Entrées et Sorties'!D$5:D$497,C222))","v":""},""]
[null,null,{"$f":"IF('Liste articles'!C223=\"\",\"\",'Liste articles'!C223)","v":""},null,{"$f":"IF(B223=\"\",\"\",SUMIFS('Entrées et Sorties'!E$5:E$397,'Entrées et Sorties'!D$5:D$397,C223))","v":""},{"$f":"IF(C223=\"\",\"\",SUMIFS('Entrées et Sorties'!F$5:F$497,'Entrées et Sorties'!D$5:D$497,C223))","v":""},""]
[null,null,{"$f":"IF('Liste articles'!C224=\"\",\"\",'Liste articles'!C224)","v":""},null,{"$f":"IF(B224=\"\",\"\",SUMIFS('Entrées et Sorties'!E$5:E$397,'Entrées et Sorties'!D$5:D$397,C224))","v":""},{"$f":"IF(C224=\"\",\"\",SUMIFS('Entrées et Sorties'!F$5:F$497,'Entrées et Sorties'!D$5:D$497,C224))","v":""},""]
[null,null,{"$f":"IF('Liste articles'!C225=\"\",\"\",'Liste articles'!C225)","v":""},null,{"$f":"IF(B225=\"\",\"\",SUMIFS('Entrées et Sorties'!E$5:E$397,'Entrées et Sorties'!D$5:D$397,C225))","v":""},{"$f":"IF(C225=\"\",\"\",SUMIFS('Entrées et Sorties'!F$5:F$497,'Entrées et Sorties'!D$5:D$497,C225))","v":""},""]
[null,null,{"$f":"IF('Liste articles'!C226=\"\",\"\",'Liste articles'!C226)","v":""},null,{"$f":"IF(B226=\"\",\"\",SUMIFS('Entrées et Sorties'!E$5:E$397,'Entrées et Sorties'!D$5:D$397,C226))","v":""},{"$f":"IF(C226=\"\",\"\",SUMIFS('Entrées et Sorties'!F$5:F$497,'Entrées et Sorties'!D$5:D$497,C226))","v":""},""]
[null,null,{"$f":"IF('Liste articles'!C227=\"\",\"\",'Liste articles'!C227)","v":""},null,{"$f":"IF(B227=\"\",\"\",SUMIFS('Entrées et Sorties'!E$5:E$397,'Entrées et Sorties'!D$5:D$397,C227))","v":""},{"$f":"IF(C227=\"\",\"\",SUMIFS('Entrées et Sorties'!F$5:F$497,'Entrées et Sorties'!D$5:D$497,C227))","v":""},""]
[null,null,{"$f":"IF('Liste articles'!C228=\"\",\"\",'Liste articles'!C228)","v":""},null,{"$f":"IF(B228=\"\",\"\",SUMIFS('Entrées et Sorties'!E$5:E$397,'Entrées et Sorties'!D$5:D$397,C228))","v":""},{"$f":"IF(C228=\"\",\"\",SUMIFS('Entrées et Sorties'!F$5:F$497,'Entrées et Sorties'!D$5:D$497,C228))","v":""},""]
[null,null,{"$f":"IF('Liste articles'!C229=\"\",\"\",'Liste articles'!C229)","v":""},null,{"$f":"IF(B229=\"\",\"\",SUMIFS('Entrées et Sorties'!E$5:E$397,'Entrées et Sorties'!D$5:D$397,C229))","v":""},{"$f":"IF(C229=\"\",\"\",SUMIFS('Entrées et Sorties'!F$5:F$497,'Entrées et Sorties'!D$5:D$497,C229))","v":""},""]
[null,null,{"$f":"IF('Liste articles'!C230=\"\",\"\",'Liste articles'!C230)","v":""},null,{"$f":"IF(B230=\"\",\"\",SUMIFS('Entrées et Sorties'!E$5:E$397,'Entrées et Sorties'!D$5:D$397,C230))","v":""},{"$f":"IF(C230=\"\",\"\",SUMIFS('Entrées et Sorties'!F$5:F$497,'Entrées et Sorties'!D$5:D$497,C230))","v":""},""]
[null,null,{"$f":"IF('Liste articles'!C231=\"\",\"\",'Liste articles'!C231)","v":""},null,{"$f":"IF(B231=\"\",\"\",SUMIFS('Entrées et Sorties'!E$5:E$397,'Entrées et Sorties'!D$5:D$397,C231))","v":""},{"$f":"IF(C231=\"\",\"\",SUMIFS('Entrées et Sorties'!F$5:F$497,'Entrées et Sorties'!D$5:D$497,C231))","v":""},""]
[null,null,{"$f":"IF('Liste articles'!C232=\"\",\"\",'Liste articles'!C232)","v":""},null,{"$f":"IF(B232=\"\",\"\",SUMIFS('Entrées et Sorties'!E$5:E$397,'Entrées et Sorties'!D$5:D$397,C232))","v":""},{"$f":"IF(C232=\"\",\"\",SUMIFS('Entrées et Sorties'!F$5:F$497,'Entrées et Sorties'!D$5:D$497,C232))","v":""},""]
[null,null,{"$f":"IF('Liste articles'!C233=\"\",\"\",'Liste articles'!C233)","v":""},null,{"$f":"IF(B233=\"\",\"\",SUMIFS('Entrées et Sorties'!E$5:E$397,'Entrées et Sorties'!D$5:D$397,C233))","v":""},{"$f":"IF(C233=\"\",\"\",SUMIFS('Entrées et Sorties'!F$5:F$497,'Entrées et Sorties'!D$5:D$497,C233))","v":""},""]
[null,null,{"$f":"IF('Liste articles'!C234=\"\",\"\",'Liste articles'!C234)","v":""},null,{"$f":"IF(B234=\"\",\"\",SUMIFS('Entrées et Sorties'!E$5:E$397,'Entrées et Sorties'!D$5:D$397,C234))","v":""},{"$f":"IF(C234=\"\",\"\",SUMIFS('Entrées et Sorties'!F$5:F$497,'Entrées et Sorties'!D$5:D$497,C234))","v":""},""]
[null,null,{"$f":"IF('Liste articles'!C235=\"\",\"\",'Liste articles'!C235)","v":""},null,{"$f":"IF(B235=\"\",\"\",SUMIFS('Entrées et Sorties'!E$5:E$397,'Entrées et Sorties'!D$5:D$397,C235))","v":""},{"$f":"IF(C235=\"\",\"\",SUMIFS('Entrées et Sorties'!F$5:F$497,'Entrées et Sorties'!D$5:D$497,C235))","v":""},""]
[null,null,{"$f":"IF('Liste articles'!C236=\"\",\"\",'Liste articles'!C236)","v":""},null,{"$f":"IF(B236=\"\",\"\",SUMIFS('Entrées et Sorties'!E$5:E$397,'Entrées et Sorties'!D$5:D$397,C236))","v":""},{"$f":"IF(C236=\"\",\"\",SUMIFS('Entrées et Sorties'!F$5:F$497,'Entrées et Sorties'!D$5:D$497,C236))","v":""},""]
[null,null,{"$f":"IF('Liste articles'!C237=\"\",\"\",'Liste articles'!C237)","v":""},null,{"$f":"IF(B237=\"\",\"\",SUMIFS('Entrées et Sorties'!E$5:E$397,'Entrées et Sorties'!D$5:D$397,C237))","v":""},{"$f":"IF(C237=\"\",\"\",SUMIFS('Entrées et Sorties'!F$5:F$497,'Entrées et Sorties'!D$5:D$497,C237))","v":""},""]
[null,null,{"$f":"IF('Liste articles'!C238=\"\",\"\",'Liste articles'!C238)","v":""},null,{"$f":"IF(B238=\"\",\"\",SUMIFS('Entrées et Sorties'!E$5:E$397,'Entrées et Sorties'!D$5:D$397,C238))","v":""},{"$f":"IF(C238=\"\",\"\",SUMIFS('Entrées et Sorties'!F$5:F$497,'Entrées et Sorties'!D$5:D$497,C238))","v":""},""]
[null,null,{"$f":"IF('Liste articles'!C239=\"\",\"\",'Liste articles'!C239)","v":""},null,{"$f":"IF(B239=\"\",\"\",SUMIFS('Entrées et Sorties'!E$5:E$397,'Entrées et Sorties'!D$5:D$397,C239))","v":""},{"$f":"IF(C239=\"\",\"\",SUMIFS('Entrées et Sorties'!F$5:F$497,'Entrées et Sorties'!D$5:D$497,C239))","v":""},""]
[null,null,{"$f":"IF('Liste articles'!C240=\"\",\"\",'Liste articles'!C240)","v":""},null,{"$f":"IF(B240=\"\",\"\",SUMIFS('Entrées et Sorties'!E$5:E$397,'Entrées et Sorties'!D$5:D$397,C240))","v":""},{"$f":"IF(C240=\"\",\"\",SUMIFS('Entrées et Sorties'!F$5:F$497,'Entrées et Sorties'!D$5:D$497,C240))","v":""},""]
[null,null,{"$f":"IF('Liste articles'!C241=\"\",\"\",'Liste articles'!C241)","v":""},null,{"$f":"IF(B241=\"\",\"\",SUMIFS('Entrées et Sorties'!E$5:E$397,'Entrées et Sorties'!D$5:D$397,C241))","v":""},{"$f":"IF(C241=\"\",\"\",SUMIFS('Entrées et Sorties'!F$5:F$497,'Entrées et Sorties'!D$5:D$497,C241))","v":""},""]
[null,null,{"$f":"IF('Liste articles'!C242=\"\",\"\",'Liste articles'!C242)","v":""},null,{"$f":"IF(B242=\"\",\"\",SUMIFS('Entrées et Sorties'!E$5:E$397,'Entrées et Sorties'!D$5:D$397,C242))","v":""},{"$f":"IF(C242=\"\",\"\",SUMIFS('Entrées et Sorties'!F$5:F$497,'Entrées et Sorties'!D$5:D$497,C242))","v":""},""]
[null,null,{"$f":"IF('Liste articles'!C243=\"\",\"\",'Liste articles'!C243)","v":""},null,{"$f":"IF(B243=\"\",\"\",SUMIFS('Entrées et Sorties'!E$5:E$397,'Entrées et Sorties'!D$5:D$397,C243))","v":""},{"$f":"IF(C243=\"\",\"\",SUMIFS('Entrées et Sorties'!F$5:F$497,'Entrées et Sorties'!D$5:D$497,C243))","v":""},""]
[null,null,{"$f":"IF('Liste articles'!C244=\"\",\"\",'Liste articles'!C244)","v":""},null,{"$f":"IF(B244=\"\",\"\",SUMIFS('Entrées et Sorties'!E$5:E$397,'Entrées et Sorties'!D$5:D$397,C244))","v":""},{"$f":"IF(C244=\"\",\"\",SUMIFS('Entrées et Sorties'!F$5:F$497,'Entrées et Sorties'!D$5:D$497,C244))","v":""},""]
[null,null,{"$f":"IF('Liste articles'!C245=\"\",\"\",'Liste articles'!C245)","v":""},null,{"$f":"IF(B245=\"\",\"\",SUMIFS('Entrées et Sorties'!E$5:E$397,'Entrées et Sorties'!D$5:D$397,C245))","v":""},{"$f":"IF(C245=\"\",\"\",SUMIFS('Entrées et Sorties'!F$5:F$497,'Entrées et Sorties'!D$5:D$497,C245))","v":""},""]
[null,null,{"$f":"IF('Liste articles'!C246=\"\",\"\",'Liste articles'!C246)","v":""},null,{"$f":"IF(B246=\"\",\"\",SUMIFS('Entrées et Sorties'!E$5:E$397,'Entrées et Sorties'!D$5:D$397,C246))","v":""},{"$f":"IF(C246=\"\",\"\",SUMIFS('Entrées et Sorties'!F$5:F$497,'Entrées et Sorties'!D$5:D$497,C246))","v":""},""]
[null,null,{"$f":"IF('Liste articles'!C247=\"\",\"\",'Liste articles'!C247)","v":""},null,{"$f":"IF(B247=\"\",\"\",SUMIFS('Entrées et Sorties'!E$5:E$397,'Entrées et Sorties'!D$5:D$397,C247))","v":""},{"$f":"IF(C247=\"\",\"\",SUMIFS('Entrées et Sorties'!F$5:F$497,'Entrées et Sorties'!D$5:D$497,C247))","v":""},""]
[null,null,{"$f":"IF('Liste articles'!C248=\"\",\"\",'Liste articles'!C248)","v":""},null,{"$f":"IF(B248=\"\",\"\",SUMIFS('Entrées et Sorties'!E$5:E$397,'Entrées et Sorties'!D$5:D$397,C248))","v":""},{"$f":"IF(C248=\"\",\"\",SUMIFS('Entrées et Sorties'!F$5:F$497,'Entrées et Sorties'!D$5:D$497,C248))","v":""},""]
[null,null,{"$f":"IF('Liste articles'!C249=\"\",\"\",'Liste articles'!C249)","v":""},null,{"$f":"IF(B249=\"\",\"\",SUMIFS('Entrées et Sorties'!E$5:E$397,'Entrées et Sorties'!D$5:D$397,C249))","v":""},{"$f":"IF(C249=\"\",\"\",SUMIFS('Entrées et Sorties'!F$5:F$497,'Entrées et Sorties'!D$5:D$497,C249))","v":""},""]
[null,null,{"$f":"IF('Liste articles'!C250=\"\",\"\",'Liste articles'!C250)","v":""},null,{"$f":"IF(B250=\"\",\"\",SUMIFS('Entrées et Sorties'!E$5:E$397,'Entrées et Sorties'!D$5:D$397,C250))","v":""},{"$f":"IF(C250=\"\",\"\",SUMIFS('Entrées et Sorties'!F$5:F$497,'Entrées et Sorties'!D$5:D$497,C250))","v":""},""]
[null,null,{"$f":"IF('Liste articles'!C251=\"\",\"\",'Liste articles'!C251)","v":""},null,{"$f":"IF(B251=\"\",\"\",SUMIFS('Entrées et Sorties'!E$5:E$397,'Entrées et Sorties'!D$5:D$397,C251))","v":""},{"$f":"IF(C251=\"\",\"\",SUMIFS('Entrées et Sorties'!F$5:F$497,'Entrées et Sorties'!D$5:D$497,C251))","v":""},""]
[null,null,{"$f":"IF('Liste articles'!C252=\"\",\"\",'Liste articles'!C252)","v":""},null,{"$f":"IF(B252=\"\",\"\",SUMIFS('Entrées et Sorties'!E$5:E$397,'Entrées et Sorties'!D$5:D$397,C252))","v":""},{"$f":"IF(C252=\"\",\"\",SUMIFS('Entrées et Sorties'!F$5:F$497,'Entrées et Sorties'!D$5:D$497,C252))","v":""},""]
[null,null,{"$f":"IF('Liste articles'!C253=\"\",\"\",'Liste articles'!C253)","v":""},null,{"$f":"IF(B253=\"\",\"\",SUMIFS('Entrées et Sorties'!E$5:E$397,'Entrées et Sorties'!D$5:D$397,C253))","v":""},{"$f":"IF(C253=\"\",\"\",SUMIFS('Entrées et Sorties'!F$5:F$497,'Entrées et Sorties'!D$5:D$497,C253))","v":""},""]
[null,null,{"$f":"IF('Liste articles'!C254=\"\",\"\",'Liste articles'!C254)","v":""},null,{"$f":"IF(B254=\"\",\"\",SUMIFS('Entrées et Sorties'!E$5:E$397,'Entrées et Sorties'!D$5:D$397,C254))","v":""},{"$f":"IF(C254=\"\",\"\",SUMIFS('Entrées et Sorties'!F$5:F$497,'Entrées et Sorties'!D$5:D$497,C254))","v":""},""]
[null,null,{"$f":"IF('Liste articles'!C255=\"\",\"\",'Liste articles'!C255)","v":""},null,{"$f":"IF(B255=\"\",\"\",SUMIFS('Entrées et Sorties'!E$5:E$397,'Entrées et Sorties'!D$5:D$397,C255))","v":""},{"$f":"IF(C255=\"\",\"\",SUMIFS('Entrées et Sorties'!F$5:F$497,'Entrées et Sorties'!D$5:D$497,C255))","v":""},""]
[null,null,{"$f":"IF('Liste articles'!C256=\"\",\"\",'Liste articles'!C256)","v":""},null,{"$f":"IF(B256=\"\",\"\",SUMIFS('Entrées et Sorties'!E$5:E$397,'Entrées et Sorties'!D$5:D$397,C256))","v":""},{"$f":"IF(C256=\"\",\"\",SUMIFS('Entrées et Sorties'!F$5:F$497,'Entrées et Sorties'!D$5:D$497,C256))","v":""},""]
[null,null,{"$f":"IF('Liste articles'!C257=\"\",\"\",'Liste articles'!C257)","v":""},null,{"$f":"IF(B257=\"\",\"\",SUMIFS('Entrées et Sorties'!E$5:E$397,'Entrées et Sorties'!D$5:D$397,C257))","v":""},{"$f":"IF(C257=\"\",\"\",SUMIFS('Entrées et Sorties'!F$5:F$497,'Entrées et Sorties'!D$5:D$497,C257))","v":""},""]
[null,null,{"$f":"IF('Liste articles'!C258=\"\",\"\",'Liste articles'!C258)","v":""},null,{"$f":"IF(B258=\"\",\"\",SUMIFS('Entrées et Sorties'!E$5:E$397,'Entrées et Sorties'!D$5:D$397,C258))","v":""},{"$f":"IF(C258=\"\",\"\",SUMIFS('Entrées et Sorties'!F$5:F$497,'Entrées et Sorties'!D$5:D$497,C258))","v":""},""]
[null,null,{"$f":"IF('Liste articles'!C259=\"\",\"\",'Liste articles'!C259)","v":""},null,{"$f":"IF(B259=\"\",\"\",SUMIFS('Entrées et Sorties'!E$5:E$397,'Entrées et Sorties'!D$5:D$397,C259))","v":""},{"$f":"IF(C259=\"\",\"\",SUMIFS('Entrées et Sorties'!F$5:F$497,'Entrées et Sorties'!D$5:D$497,C259))","v":""},""]
[null,null,{"$f":"IF('Liste articles'!C260=\"\",\"\",'Liste articles'!C260)","v":""},null,{"$f":"IF(B260=\"\",\"\",SUMIFS('Entrées et Sorties'!E$5:E$397,'Entrées et Sorties'!D$5:D$397,C260))","v":""},{"$f":"IF(C260=\"\",\"\",SUMIFS('Entrées et Sorties'!F$5:F$497,'Entrées et Sorties'!D$5:D$497,C260))","v":""},""]
[null,null,{"$f":"IF('Liste articles'!C261=\"\",\"\",'Liste articles'!C261)","v":""},null,{"$f":"IF(B261=\"\",\"\",SUMIFS('Entrées et Sorties'!E$5:E$397,'Entrées et Sorties'!D$5:D$397,C261))","v":""},{"$f":"IF(C261=\"\",\"\",SUMIFS('Entrées et Sorties'!F$5:F$497,'Entrées et Sorties'!D$5:D$497,C261))","v":""},""]
[null,null,{"$f":"IF('Liste articles'!C262=\"\",\"\",'Liste articles'!C262)","v":""},null,{"$f":"IF(B262=\"\",\"\",SUMIFS('Entrées et Sorties'!E$5:E$397,'Entrées et Sorties'!D$5:D$397,C262))","v":""},{"$f":"IF(C262=\"\",\"\",SUMIFS('Entrées et Sorties'!F$5:F$497,'Entrées et Sorties'!D$5:D$497,C262))","v":""},""]
[null,null,{"$f":"IF('Liste articles'!C263=\"\",\"\",'Liste articles'!C263)","v":""},null,{"$f":"IF(B263=\"\",\"\",SUMIFS('Entrées et Sorties'!E$5:E$397,'Entrées et Sorties'!D$5:D$397,C263))","v":""},{"$f":"IF(C263=\"\",\"\",SUMIFS('Entrées et Sorties'!F$5:F$497,'Entrées et Sorties'!D$5:D$497,C263))","v":""},""]
[null,null,{"$f":"IF('Liste articles'!C264=\"\",\"\",'Liste articles'!C264)","v":""},null,{"$f":"IF(B264=\"\",\"\",SUMIFS('Entrées et Sorties'!E$5:E$397,'Entrées et Sorties'!D$5:D$397,C264))","v":""},{"$f":"IF(C264=\"\",\"\",SUMIFS('Entrées et Sorties'!F$5:F$497,'Entrées et Sorties'!D$5:D$497,C264))","v":""},""]
[null,null,{"$f":"IF('Liste articles'!C265=\"\",\"\",'Liste articles'!C265)","v":""},null,{"$f":"IF(B265=\"\",\"\",SUMIFS('Entrées et Sorties'!E$5:E$397,'Entrées et Sorties'!D$5:D$397,C265))","v":""},{"$f":"IF(C265=\"\",\"\",SUMIFS('Entrées et Sorties'!F$5:F$497,'Entrées et Sorties'!D$5:D$497,C265))","v":""},""]
[null,null,{"$f":"IF('Liste articles'!C266=\"\",\"\",'Liste articles'!C266)","v":""},null,{"$f":"IF(B266=\"\",\"\",SUMIFS('Entrées et Sorties'!E$5:E$397,'Entrées et Sorties'!D$5:D$397,C266))","v":""},{"$f":"IF(C266=\"\",\"\",SUMIFS('Entrées et Sorties'!F$5:F$497,'Entrées et Sorties'!D$5:D$497,C266))","v":""},{"$f":"IF(C266=\"\",\"\",D266+E266-F266)","v":""}]
[null,null,{"$f":"IF('Liste articles'!C267=\"\",\"\",'Liste articles'!C267)","v":""},null,{"$f":"IF(B267=\"\",\"\",SUMIFS('Entrées et Sorties'!E$5:E$397,'Entrées et Sorties'!D$5:D$397,C267))","v":""},{"$f":"IF(C267=\"\",\"\",SUMIFS('Entrées et Sorties'!F$5:F$497,'Entrées et Sorties'!D$5:D$497,C267))","v":""},""]
[null,null,{"$f":"IF('Liste articles'!C268=\"\",\"\",'Liste articles'!C268)","v":""},null,{"$f":"IF(B268=\"\",\"\",SUMIFS('Entrées et Sorties'!E$5:E$397,'Entrées et Sorties'!D$5:D$397,C268))","v":""},{"$f":"IF(C268=\"\",\"\",SUMIFS('Entrées et Sorties'!F$5:F$497,'Entrées et Sorties'!D$5:D$497,C268))","v":""},""]
[null,null,{"$f":"IF('Liste articles'!C269=\"\",\"\",'Liste articles'!C269)","v":""},null,{"$f":"IF(B269=\"\",\"\",SUMIFS('Entrées et Sorties'!E$5:E$397,'Entrées et Sorties'!D$5:D$397,C269))","v":""},{"$f":"IF(C269=\"\",\"\",SUMIFS('Entrées et Sorties'!F$5:F$497,'Entrées et Sorties'!D$5:D$497,C269))","v":""},""]
[null,null,{"$f":"IF('Liste articles'!C270=\"\",\"\",'Liste articles'!C270)","v":""},null,{"$f":"IF(B270=\"\",\"\",SUMIFS('Entrées et Sorties'!E$5:E$397,'Entrées et Sorties'!D$5:D$397,C270))","v":""},{"$f":"IF(C270=\"\",\"\",SUMIFS('Entrées et Sorties'!F$5:F$497,'Entrées et Sorties'!D$5:D$497,C270))","v":""},""]
[null,null,{"$f":"IF('Liste articles'!C271=\"\",\"\",'Liste articles'!C271)","v":""},null,{"$f":"IF(B271=\"\",\"\",SUMIFS('Entrées et Sorties'!E$5:E$397,'Entrées et Sorties'!D$5:D$397,C271))","v":""},{"$f":"IF(C271=\"\",\"\",SUMIFS('Entrées et Sorties'!F$5:F$497,'Entrées et Sorties'!D$5:D$497,C271))","v":""},""]
[null,null,{"$f":"IF('Liste articles'!C272=\"\",\"\",'Liste articles'!C272)","v":""},null,{"$f":"IF(B272=\"\",\"\",SUMIFS('Entrées et Sorties'!E$5:E$397,'Entrées et Sorties'!D$5:D$397,C272))","v":""},{"$f":"IF(C272=\"\",\"\",SUMIFS('Entrées et Sorties'!F$5:F$497,'Entrées et Sorties'!D$5:D$497,C272))","v":""},""]
[null,null,{"$f":"IF('Liste articles'!C273=\"\",\"\",'Liste articles'!C273)","v":""},null,{"$f":"IF(B273=\"\",\"\",SUMIFS('Entrées et Sorties'!E$5:E$397,'Entrées et Sorties'!D$5:D$397,C273))","v":""},{"$f":"IF(C273=\"\",\"\",SUMIFS('Entrées et Sorties'!F$5:F$497,'Entrées et Sorties'!D$5:D$497,C273))","v":""},""]
[null,null,{"$f":"IF('Liste articles'!C274=\"\",\"\",'Liste articles'!C274)","v":""},null,{"$f":"IF(B274=\"\",\"\",SUMIFS('Entrées et Sorties'!E$5:E$397,'Entrées et Sorties'!D$5:D$397,C274))","v":""},{"$f":"IF(C274=\"\",\"\",SUMIFS('Entrées et Sorties'!F$5:F$497,'Entrées et Sorties'!D$5:D$497,C274))","v":""},""]
[null,null,{"$f":"IF('Liste articles'!C275=\"\",\"\",'Liste articles'!C275)","v":""},null,{"$f":"IF(B275=\"\",\"\",SUMIFS('Entrées et Sorties'!E$5:E$397,'Entrées et Sorties'!D$5:D$397,C275))","v":""},{"$f":"IF(C275=\"\",\"\",SUMIFS('Entrées et Sorties'!F$5:F$497,'Entrées et Sorties'!D$5:D$497,C275))","v":""},""]
[null,null,{"$f":"IF('Liste articles'!C276=\"\",\"\",'Liste articles'!C276)","v":""},null,{"$f":"IF(B276=\"\",\"\",SUMIFS('Entrées et Sorties'!E$5:E$397,'Entrées et Sorties'!D$5:D$397,C276))","v":""},{"$f":"IF(C276=\"\",\"\",SUMIFS('Entrées et Sorties'!F$5:F$497,'Entrées et Sorties'!D$5:D$497,C276))","v":""},""]
[null,null,{"$f":"IF('Liste articles'!C277=\"\",\"\",'Liste articles'!C277)","v":""},null,{"$f":"IF(B277=\"\",\"\",SUMIFS('Entrées et Sorties'!E$5:E$397,'Entrées et Sorties'!D$5:D$397,C277))","v":""},{"$f":"IF(C277=\"\",\"\",SUMIFS('Entrées et Sorties'!F$5:F$497,'Entrées et Sorties'!D$5:D$497,C277))","v":""},""]
[null,null,{"$f":"IF('Liste articles'!C278=\"\",\"\",'Liste articles'!C278)","v":""},null,{"$f":"IF(B278=\"\",\"\",SUMIFS('Entrées et Sorties'!E$5:E$397,'Entrées et Sorties'!D$5:D$397,C278))","v":""},{"$f":"IF(C278=\"\",\"\",SUMIFS('Entrées et Sorties'!F$5:F$497,'Entrées et Sorties'!D$5:D$497,C278))","v":""},""]
[null,null,{"$f":"IF('Liste articles'!C279=\"\",\"\",'Liste articles'!C279)","v":""},null,{"$f":"IF(B279=\"\",\"\",SUMIFS('Entrées et Sorties'!E$5:E$397,'Entrées et Sorties'!D$5:D$397,C279))","v":""},{"$f":"IF(C279=\"\",\"\",SUMIFS('Entrées et Sorties'!F$5:F$497,'Entrées et Sorties'!D$5:D$497,C279))","v":""},""]
[null,null,{"$f":"IF('Liste articles'!C280=\"\",\"\",'Liste articles'!C280)","v":""},null,{"$f":"IF(B280=\"\",\"\",SUMIFS('Entrées et Sorties'!E$5:E$397,'Entrées et Sorties'!D$5:D$397,C280))","v":""},{"$f":"IF(C280=\"\",\"\",SUMIFS('Entrées et Sorties'!F$5:F$497,'Entrées et Sorties'!D$5:D$497,C280))","v":""},""]
[null,null,{"$f":"IF('Liste articles'!C281=\"\",\"\",'Liste articles'!C281)","v":""},null,{"$f":"IF(B281=\"\",\"\",SUMIFS('Entrées et Sorties'!E$5:E$397,'Entrées et Sorties'!D$5:D$397,C281))","v":""},{"$f":"IF(C281=\"\",\"\",SUMIFS('Entrées et Sorties'!F$5:F$497,'Entrées et Sorties'!D$5:D$497,C281))","v":""},""]
[null,null,{"$f":"IF('Liste articles'!C282=\"\",\"\",'Liste articles'!C282)","v":""},null,{"$f":"IF(B282=\"\",\"\",SUMIFS('Entrées et Sorties'!E$5:E$397,'Entrées et Sorties'!D$5:D$397,C282))","v":""},{"$f":"IF(C282=\"\",\"\",SUMIFS('Entrées et Sorties'!F$5:F$497,'Entrées et Sorties'!D$5:D$497,C282))","v":""},""]
[null,null,{"$f":"IF('Liste articles'!C283=\"\",\"\",'Liste articles'!C283)","v":""},null,{"$f":"IF(B283=\"\",\"\",SUMIFS('Entrées et Sorties'!E$5:E$397,'Entrées et Sorties'!D$5:D$397,C283))","v":""},{"$f":"IF(C283=\"\",\"\",SUMIFS('Entrées et Sorties'!F$5:F$497,'Entrées et Sorties'!D$5:D$497,C283))","v":""},""]
[null,null,{"$f":"IF('Liste articles'!C284=\"\",\"\",'Liste articles'!C284)","v":""},null,{"$f":"IF(B284=\"\",\"\",SUMIFS('Entrées et Sorties'!E$5:E$397,'Entrées et Sorties'!D$5:D$397,C284))","v":""},{"$f":"IF(C284=\"\",\"\",SUMIFS('Entrées et Sorties'!F$5:F$497,'Entrées et Sorties'!D$5:D$497,C284))","v":""},""]
[null,null,{"$f":"IF('Liste articles'!C285=\"\",\"\",'Liste articles'!C285)","v":""},null,{"$f":"IF(B285=\"\",\"\",SUMIFS('Entrées et Sorties'!E$5:E$397,'Entrées et Sorties'!D$5:D$397,C285))","v":""},{"$f":"IF(C285=\"\",\"\",SUMIFS('Entrées et Sorties'!F$5:F$497,'Entrées et Sorties'!D$5:D$497,C285))","v":""},""]
[null,null,{"$f":"IF('Liste articles'!C286=\"\",\"\",'Liste articles'!C286)","v":""},null,{"$f":"IF(B286=\"\",\"\",SUMIFS('Entrées et Sorties'!E$5:E$397,'Entrées et Sorties'!D$5:D$397,C286))","v":""},{"$f":"IF(C286=\"\",\"\",SUMIFS('Entrées et Sorties'!F$5:F$497,'Entrées et Sorties'!D$5:D$497,C286))","v":""},""]
[null,null,{"$f":"IF('Liste articles'!C287=\"\",\"\",'Liste articles'!C287)","v":""},null,{"$f":"IF(B287=\"\",\"\",SUMIFS('Entrées et Sorties'!E$5:E$397,'Entrées et Sorties'!D$5:D$397,C287))","v":""},{"$f":"IF(C287=\"\",\"\",SUMIFS('Entrées et Sorties'!F$5:F$497,'Entrées et Sorties'!D$5:D$497,C287))","v":""},""]
[null,null,{"$f":"IF('Liste articles'!C288=\"\",\"\",'Liste articles'!C288)","v":""},null,{"$f":"IF(B288=\"\",\"\",SUMIFS('Entrées et Sorties'!E$5:E$397,'Entrées et Sorties'!D$5:D$397,C288))","v":""},{"$f":"IF(C288=\"\",\"\",SUMIFS('Entrées et Sorties'!F$5:F$497,'Entrées et Sorties'!D$5:D$497,C288))","v":""},""]
[null,null,{"$f":"IF('Liste articles'!C289=\"\",\"\",'Liste articles'!C289)","v":""},null,{"$f":"IF(B289=\"\",\"\",SUMIFS('Entrées et Sorties'!E$5:E$397,'Entrées et Sorties'!D$5:D$397,C289))","v":""},{"$f":"IF(C289=\"\",\"\",SUMIFS('Entrées et Sorties'!F$5:F$497,'Entrées et Sorties'!D$5:D$497,C289))","v":""},""]
[null,null,{"$f":"IF('Liste articles'!C290=\"\",\"\",'Liste articles'!C290)","v":""},null,{"$f":"IF(B290=\"\",\"\",SUMIFS('Entrées et Sorties'!E$5:E$397,'Entrées et Sorties'!D$5:D$397,C290))","v":""},{"$f":"IF(C290=\"\",\"\",SUMIFS('Entrées et Sorties'!F$5:F$497,'Entrées et Sorties'!D$5:D$497,C290))","v":""},""]
[null,null,{"$f":"IF('Liste articles'!C291=\"\",\"\",'Liste articles'!C291)","v":""},null,{"$f":"IF(B291=\"\",\"\",SUMIFS('Entrées et Sorties'!E$5:E$397,'Entrées et Sorties'!D$5:D$397,C291))","v":""},{"$f":"IF(C291=\"\",\"\",SUMIFS('Entrées et Sorties'!F$5:F$497,'Entrées et Sorties'!D$5:D$497,C291))","v":""},""]
[null,null,{"$f":"IF('Liste articles'!C292=\"\",\"\",'Liste articles'!C292)","v":""},null,{"$f":"IF(B292=\"\",\"\",SUMIFS('Entrées et Sorties'!E$5:E$397,'Entrées et Sorties'!D$5:D$397,C292))","v":""},{"$f":"IF(C292=\"\",\"\",SUMIFS('Entrées et Sorties'!F$5:F$497,'Entrées et Sorties'!D$5:D$497,C292))","v":""},""]
[null,null,{"$f":"IF('Liste articles'!C293=\"\",\"\",'Liste articles'!C293)","v":""},null,{"$f":"IF(B293=\"\",\"\",SUMIFS('Entrées et Sorties'!E$5:E$397,'Entrées et Sorties'!D$5:D$397,C293))","v":""},{"$f":"IF(C293=\"\",\"\",SUMIFS('Entrées et Sorties'!F$5:F$497,'Entrées et Sorties'!D$5:D$497,C293))","v":""},""]
[null,null,{"$f":"IF('Liste articles'!C294=\"\",\"\",'Liste articles'!C294)","v":""},null,{"$f":"IF(B294=\"\",\"\",SUMIFS('Entrées et Sorties'!E$5:E$397,'Entrées et Sorties'!D$5:D$397,C294))","v":""},{"$f":"IF(C294=\"\",\"\",SUMIFS('Entrées et Sorties'!F$5:F$497,'Entrées et Sorties'!D$5:D$497,C294))","v":""},""]
[null,null,{"$f":"IF('Liste articles'!C295=\"\",\"\",'Liste articles'!C295)","v":""},null,{"$f":"IF(B295=\"\",\"\",SUMIFS('Entrées et Sorties'!E$5:E$397,'Entrées et Sorties'!D$5:D$397,C295))","v":""},{"$f":"IF(C295=\"\",\"\",SUMIFS('Entrées et Sorties'!F$5:F$497,'Entrées et Sorties'!D$5:D$497,C295))","v":""},""]
[null,null,{"$f":"IF('Liste articles'!C296=\"\",\"\",'Liste articles'!C296)","v":""},null,{"$f":"IF(B296=\"\",\"\",SUMIFS('Entrées et Sorties'!E$5:E$397,'Entrées et Sorties'!D$5:D$397,C296))","v":""},{"$f":"IF(C296=\"\",\"\",SUMIFS('Entrées et Sorties'!F$5:F$497,'Entrées et Sorties'!D$5:D$497,C296))","v":""},""]
[null,null,{"$f":"IF('Liste articles'!C297=\"\",\"\",'Liste articles'!C297)","v":""},null,{"$f":"IF(B297=\"\",\"\",SUMIFS('Entrées et Sorties'!E$5:E$397,'Entrées et Sorties'!D$5:D$397,C297))","v":""},{"$f":"IF(C297=\"\",\"\",SUMIFS('Entrées et Sorties'!F$5:F$497,'Entrées et Sorties'!D$5:D$497,C297))","v":""},""]
[null,null,{"$f":"IF('Liste articles'!C298=\"\",\"\",'Liste articles'!C298)","v":""},null,{"$f":"IF(B298=\"\",\"\",SUMIFS('Entrées et Sorties'!E$5:E$397,'Entrées et Sorties'!D$5:D$397,C298))","v":""},{"$f":"IF(C298=\"\",\"\",SUMIFS('Entrées et Sorties'!F$5:F$497,'Entrées et Sorties'!D$5:D$497,C298))","v":""},""]
[null,null,{"$f":"IF('Liste articles'!C299=\"\",\"\",'Liste articles'!C299)","v":""},null,{"$f":"IF(B299=\"\",\"\",SUMIFS('Entrées et Sorties'!E$5:E$397,'Entrées et Sorties'!D$5:D$397,C299))","v":""},{"$f":"IF(C299=\"\",\"\",SUMIFS('Entrées et Sorties'!F$5:F$497,'Entrées et Sorties'!D$5:D$497,C299))","v":""},""]
[null,null,{"$f":"IF('Liste articles'!C300=\"\",\"\",'Liste articles'!C300)","v":""},null,{"$f":"IF(B300=\"\",\"\",SUMIFS('Entrées et Sorties'!E$5:E$397,'Entrées et Sorties'!D$5:D$397,C300))","v":""},{"$f":"IF(C300=\"\",\"\",SUMIFS('Entrées et Sorties'!F$5:F$497,'Entrées et Sorties'!D$5:D$497,C300))","v":""},""]
[null,null,{"$f":"IF('Liste articles'!C301=\"\",\"\",'Liste articles'!C301)","v":""},null,{"$f":"IF(B301=\"\",\"\",SUMIFS('Entrées et Sorties'!E$5:E$397,'Entrées et Sorties'!D$5:D$397,C301))","v":""},{"$f":"IF(C301=\"\",\"\",SUMIFS('Entrées et Sorties'!F$5:F$497,'Entrées et Sorties'!D$5:D$497,C301))","v":""},""]
[null,null,{"$f":"IF('Liste articles'!C302=\"\",\"\",'Liste articles'!C302)","v":""},null,{"$f":"IF(B302=\"\",\"\",SUMIFS('Entrées et Sorties'!E$5:E$397,'Entrées et Sorties'!D$5:D$397,C302))","v":""},{"$f":"IF(C302=\"\",\"\",SUMIFS('Entrées et Sorties'!F$5:F$497,'Entrées et Sorties'!D$5:D$497,C302))","v":""},""]
[null,null,{"$f":"IF('Liste articles'!C303=\"\",\"\",'Liste articles'!C303)","v":""},null,{"$f":"IF(B303=\"\",\"\",SUMIFS('Entrées et Sorties'!E$5:E$397,'Entrées et Sorties'!D$5:D$397,C303))","v":""},{"$f":"IF(C303=\"\",\"\",SUMIFS('Entrées et Sorties'!F$5:F$497,'Entrées et Sorties'!D$5:D$497,C303))","v":""},""]
[null,null,{"$f":"IF('Liste articles'!C304=\"\",\"\",'Liste articles'!C304)","v":""},null,{"$f":"IF(B304=\"\",\"\",SUMIFS('Entrées et Sorties'!E$5:E$397,'Entrées et Sorties'!D$5:D$397,C304))","v":""},{"$f":"IF(C304=\"\",\"\",SUMIFS('Entrées et Sorties'!F$5:F$497,'Entrées et Sorties'!D$5:D$497,C304))","v":""},""]
[null,null,{"$f":"IF('Liste articles'!C305=\"\",\"\",'Liste articles'!C305)","v":""},null,{"$f":"IF(B305=\"\",\"\",SUMIFS('Entrées et Sorties'!E$5:E$397,'Entrées et Sorties'!D$5:D$397,C305))","v":""},{"$f":"IF(C305=\"\",\"\",SUMIFS('Entrées et Sorties'!F$5:F$497,'Entrées et Sorties'!D$5:D$497,C305))","v":""},""]
[null,null,{"$f":"IF('Liste articles'!C306=\"\",\"\",'Liste articles'!C306)","v":""},null,{"$f":"IF(B306=\"\",\"\",SUMIFS('Entrées et Sorties'!E$5:E$397,'Entrées et Sorties'!D$5:D$397,C306))","v":""},{"$f":"IF(C306=\"\",\"\",SUMIFS('Entrées et Sorties'!F$5:F$497,'Entrées et Sorties'!D$5:D$497,C306))","v":""},""]
[null,null,{"$f":"IF('Liste articles'!C307=\"\",\"\",'Liste articles'!C307)","v":""},null,{"$f":"IF(B307=\"\",\"\",SUMIFS('Entrées et Sorties'!E$5:E$397,'Entrées et Sorties'!D$5:D$397,C307))","v":""},{"$f":"IF(C307=\"\",\"\",SUMIFS('Entrées et Sorties'!F$5:F$497,'Entrées et Sorties'!D$5:D$497,C307))","v":""},""]
[null,null,{"$f":"IF('Liste articles'!C308=\"\",\"\",'Liste articles'!C308)","v":""},null,{"$f":"IF(B308=\"\",\"\",SUMIFS('Entrées et Sorties'!E$5:E$397,'Entrées et Sorties'!D$5:D$397,C308))","v":""},{"$f":"IF(C308=\"\",\"\",SUMIFS('Entrées et Sorties'!F$5:F$497,'Entrées et Sorties'!D$5:D$497,C308))","v":""},""]
[null,null,{"$f":"IF('Liste articles'!C309=\"\",\"\",'Liste articles'!C309)","v":""},null,{"$f":"IF(B309=\"\",\"\",SUMIFS('Entrées et Sorties'!E$5:E$397,'Entrées et Sorties'!D$5:D$397,C309))","v":""},{"$f":"IF(C309=\"\",\"\",SUMIFS('Entrées et Sorties'!F$5:F$497,'Entrées et Sorties'!D$5:D$497,C309))","v":""},""]
[null,null,{"$f":"IF('Liste articles'!C310=\"\",\"\",'Liste articles'!C310)","v":""},null,{"$f":"IF(B310=\"\",\"\",SUMIFS('Entrées et Sorties'!E$5:E$397,'Entrées et Sorties'!D$5:D$397,C310))","v":""},{"$f":"IF(C310=\"\",\"\",SUMIFS('Entrées et Sorties'!F$5:F$497,'Entrées et Sorties'!D$5:D$497,C310))","v":""},""]
[null,null,{"$f":"IF('Liste articles'!C311=\"\",\"\",'Liste articles'!C311)","v":""},null,{"$f":"IF(B311=\"\",\"\",SUMIFS('Entrées et Sorties'!E$5:E$397,'Entrées et Sorties'!D$5:D$397,C311))","v":""},{"$f":"IF(C311=\"\",\"\",SUMIFS('Entrées et Sorties'!F$5:F$497,'Entrées et Sorties'!D$5:D$497,C311))","v":""},""]
[null,null,{"$f":"IF('Liste articles'!C312=\"\",\"\",'Liste articles'!C312)","v":""},null,{"$f":"IF(B312=\"\",\"\",SUMIFS('Entrées et Sorties'!E$5:E$397,'Entrées et Sorties'!D$5:D$397,C312))","v":""},{"$f":"IF(C312=\"\",\"\",SUMIFS('Entrées et Sorties'!F$5:F$497,'Entrées et Sorties'!D$5:D$497,C312))","v":""},""]
[null,null,{"$f":"IF('Liste articles'!C313=\"\",\"\",'Liste articles'!C313)","v":""},null,{"$f":"IF(B313=\"\",\"\",SUMIFS('Entrées et Sorties'!E$5:E$397,'Entrées et Sorties'!D$5:D$397,C313))","v":""},{"$f":"IF(C313=\"\",\"\",SUMIFS('Entrées et Sorties'!F$5:F$497,'Entrées et Sorties'!D$5:D$497,C313))","v":""},""]
[null,null,{"$f":"IF('Liste articles'!C314=\"\",\"\",'Liste articles'!C314)","v":""},null,{"$f":"IF(B314=\"\",\"\",SUMIFS('Entrées et Sorties'!E$5:E$397,'Entrées et Sorties'!D$5:D$397,C314))","v":""},{"$f":"IF(C314=\"\",\"\",SUMIFS('Entrées et Sorties'!F$5:F$497,'Entrées et Sorties'!D$5:D$497,C314))","v":""},""]
[null,null,{"$f":"IF('Liste articles'!C315=\"\",\"\",'Liste articles'!C315)","v":""},null,{"$f":"IF(B315=\"\",\"\",SUMIFS('Entrées et Sorties'!E$5:E$397,'Entrées et Sorties'!D$5:D$397,C315))","v":""},{"$f":"IF(C315=\"\",\"\",SUMIFS('Entrées et Sorties'!F$5:F$497,'Entrées et Sorties'!D$5:D$497,C315))","v":""},""]
[null,null,{"$f":"IF('Liste articles'!C316=\"\",\"\",'Liste articles'!C316)","v":""},null,{"$f":"IF(B316=\"\",\"\",SUMIFS('Entrées et Sorties'!E$5:E$397,'Entrées et Sorties'!D$5:D$397,C316))","v":""},{"$f":"IF(C316=\"\",\"\",SUMIFS('Entrées et Sorties'!F$5:F$497,'Entrées et Sorties'!D$5:D$497,C316))","v":""},""]
[null,null,{"$f":"IF('Liste articles'!C317=\"\",\"\",'Liste articles'!C317)","v":""},null,{"$f":"IF(B317=\"\",\"\",SUMIFS('Entrées et Sorties'!E$5:E$397,'Entrées et Sorties'!D$5:D$397,C317))","v":""},{"$f":"IF(C317=\"\",\"\",SUMIFS('Entrées et Sorties'!F$5:F$497,'Entrées et Sorties'!D$5:D$497,C317))","v":""},""]
[null,null,{"$f":"IF('Liste articles'!C318=\"\",\"\",'Liste articles'!C318)","v":""},null,{"$f":"IF(B318=\"\",\"\",SUMIFS('Entrées et Sorties'!E$5:E$397,'Entrées et Sorties'!D$5:D$397,C318))","v":""},{"$f":"IF(C318=\"\",\"\",SUMIFS('Entrées et Sorties'!F$5:F$497,'Entrées et Sorties'!D$5:D$497,C318))","v":""},""]
[null,null,{"$f":"IF('Liste articles'!C319=\"\",\"\",'Liste articles'!C319)","v":""},null,{"$f":"IF(B319=\"\",\"\",SUMIFS('Entrées et Sorties'!E$5:E$397,'Entrées et Sorties'!D$5:D$397,C319))","v":""},{"$f":"IF(C319=\"\",\"\",SUMIFS('Entrées et Sorties'!F$5:F$497,'Entrées et Sorties'!D$5:D$497,C319))","v":""},""]
[null,null,{"$f":"IF('Liste articles'!C320=\"\",\"\",'Liste articles'!C320)","v":""},null,{"$f":"IF(B320=\"\",\"\",SUMIFS('Entrées et Sorties'!E$5:E$397,'Entrées et Sorties'!D$5:D$397,C320))","v":""},{"$f":"IF(C320=\"\",\"\",SUMIFS('Entrées et Sorties'!F$5:F$497,'Entrées et Sorties'!D$5:D$497,C320))","v":""},""]
[null,null,{"$f":"IF('Liste articles'!C321=\"\",\"\",'Liste articles'!C321)","v":""},null,{"$f":"IF(B321=\"\",\"\",SUMIFS('Entrées et Sorties'!E$5:E$397,'Entrées et Sorties'!D$5:D$397,C321))","v":""},{"$f":"IF(C321=\"\",\"\",SUMIFS('Entrées et Sorties'!F$5:F$497,'Entrées et Sorties'!D$5:D$497,C321))","v":""},""]
[null,null,{"$f":"IF('Liste articles'!C322=\"\",\"\",'Liste articles'!C322)","v":""},null,{"$f":"IF(B322=\"\",\"\",SUMIFS('Entrées et Sorties'!E$5:E$397,'Entrées et Sorties'!D$5:D$397,C322))","v":""},{"$f":"IF(C322=\"\",\"\",SUMIFS('Entrées et Sorties'!F$5:F$497,'Entrées et Sorties'!D$5:D$497,C322))","v":""},""]
[null,null,{"$f":"IF('Liste articles'!C323=\"\",\"\",'Liste articles'!C323)","v":""},null,{"$f":"IF(B323=\"\",\"\",SUMIFS('Entrées et Sorties'!E$5:E$397,'Entrées et Sorties'!D$5:D$397,C323))","v":""},{"$f":"IF(C323=\"\",\"\",SUMIFS('Entrées et Sorties'!F$5:F$497,'Entrées et Sorties'!D$5:D$497,C323))","v":""},""]
[null,null,{"$f":"IF('Liste articles'!C324=\"\",\"\",'Liste articles'!C324)","v":""},null,{"$f":"IF(B324=\"\",\"\",SUMIFS('Entrées et Sorties'!E$5:E$397,'Entrées et Sorties'!D$5:D$397,C324))","v":""},{"$f":"IF(C324=\"\",\"\",SUMIFS('Entrées et Sorties'!F$5:F$497,'Entrées et Sorties'!D$5:D$497,C324))","v":""},""]
[null,null,{"$f":"IF('Liste articles'!C325=\"\",\"\",'Liste articles'!C325)","v":""},null,{"$f":"IF(B325=\"\",\"\",SUMIFS('Entrées et Sorties'!E$5:E$397,'Entrées et Sorties'!D$5:D$397,C325))","v":""},{"$f":"IF(C325=\"\",\"\",SUMIFS('Entrées et Sorties'!F$5:F$497,'Entrées et Sorties'!D$5:D$497,C325))","v":""},""]
[null,null,{"$f":"IF('Liste articles'!C326=\"\",\"\",'Liste articles'!C326)","v":""},null,{"$f":"IF(B326=\"\",\"\",SUMIFS('Entrées et Sorties'!E$5:E$397,'Entrées et Sorties'!D$5:D$397,C326))","v":""},{"$f":"IF(C326=\"\",\"\",SUMIFS('Entrées et Sorties'!F$5:F$497,'Entrées et Sorties'!D$5:D$497,C326))","v":""},""]
[null,null,{"$f":"IF('Liste articles'!C327=\"\",\"\",'Liste articles'!C327)","v":""},null,{"$f":"IF(B327=\"\",\"\",SUMIFS('Entrées et Sorties'!E$5:E$397,'Entrées et Sorties'!D$5:D$397,C327))","v":""},{"$f":"IF(C327=\"\",\"\",SUMIFS('Entrées et Sorties'!F$5:F$497,'Entrées et Sorties'!D$5:D$497,C327))","v":""},""]
[null,null,{"$f":"IF('Liste articles'!C328=\"\",\"\",'Liste articles'!C328)","v":""},null,{"$f":"IF(B328=\"\",\"\",SUMIFS('Entrées et Sorties'!E$5:E$397,'Entrées et Sorties'!D$5:D$397,C328))","v":""},{"$f":"IF(C328=\"\",\"\",SUMIFS('Entrées et Sorties'!F$5:F$497,'Entrées et Sorties'!D$5:D$497,C328))","v":""},""]
[null,null,{"$f":"IF('Liste articles'!C329=\"\",\"\",'Liste articles'!C329)","v":""},null,{"$f":"IF(B329=\"\",\"\",SUMIFS('Entrées et Sorties'!E$5:E$397,'Entrées et Sorties'!D$5:D$397,C329))","v":""},{"$f":"IF(C329=\"\",\"\",SUMIFS('Entrées et Sorties'!F$5:F$497,'Entrées et Sorties'!D$5:D$497,C329))","v":""},""]
[null,null,{"$f":"IF('Liste articles'!C330=\"\",\"\",'Liste articles'!C330)","v":""},null,{"$f":"IF(B330=\"\",\"\",SUMIFS('Entrées et Sorties'!E$5:E$397,'Entrées et Sorties'!D$5:D$397,C330))","v":""},{"$f":"IF(C330=\"\",\"\",SUMIFS('Entrées et Sorties'!F$5:F$497,'Entrées et Sorties'!D$5:D$497,C330))","v":""},{"$f":"IF(C330=\"\",\"\",D330+E330-F330)","v":""}]
[null,null,{"$f":"IF('Liste articles'!C331=\"\",\"\",'Liste articles'!C331)","v":""},null,{"$f":"IF(B331=\"\",\"\",SUMIFS('Entrées et Sorties'!E$5:E$397,'Entrées et Sorties'!D$5:D$397,C331))","v":""},{"$f":"IF(C331=\"\",\"\",SUMIFS('Entrées et Sorties'!F$5:F$497,'Entrées et Sorties'!D$5:D$497,C331))","v":""},""]
[null,null,{"$f":"IF('Liste articles'!C332=\"\",\"\",'Liste articles'!C332)","v":""},null,{"$f":"IF(B332=\"\",\"\",SUMIFS('Entrées et Sorties'!E$5:E$397,'Entrées et Sorties'!D$5:D$397,C332))","v":""},{"$f":"IF(C332=\"\",\"\",SUMIFS('Entrées et Sorties'!F$5:F$497,'Entrées et Sorties'!D$5:D$497,C332))","v":""},""]
[null,null,{"$f":"IF('Liste articles'!C333=\"\",\"\",'Liste articles'!C333)","v":""},null,{"$f":"IF(B333=\"\",\"\",SUMIFS('Entrées et Sorties'!E$5:E$397,'Entrées et Sorties'!D$5:D$397,C333))","v":""},{"$f":"IF(C333=\"\",\"\",SUMIFS('Entrées et Sorties'!F$5:F$497,'Entrées et Sorties'!D$5:D$497,C333))","v":""},""]
[null,null,{"$f":"IF('Liste articles'!C334=\"\",\"\",'Liste articles'!C334)","v":""},null,{"$f":"IF(B334=\"\",\"\",SUMIFS('Entrées et Sorties'!E$5:E$397,'Entrées et Sorties'!D$5:D$397,C334))","v":""},{"$f":"IF(C334=\"\",\"\",SUMIFS('Entrées et Sorties'!F$5:F$497,'Entrées et Sorties'!D$5:D$497,C334))","v":""},""]
[null,null,{"$f":"IF('Liste articles'!C335=\"\",\"\",'Liste articles'!C335)","v":""},null,{"$f":"IF(B335=\"\",\"\",SUMIFS('Entrées et Sorties'!E$5:E$397,'Entrées et Sorties'!D$5:D$397,C335))","v":""},{"$f":"IF(C335=\"\",\"\",SUMIFS('Entrées et Sorties'!F$5:F$497,'Entrées et Sorties'!D$5:D$497,C335))","v":""},""]
[null,null,{"$f":"IF('Liste articles'!C336=\"\",\"\",'Liste articles'!C336)","v":""},null,{"$f":"IF(B336=\"\",\"\",SUMIFS('Entrées et Sorties'!E$5:E$397,'Entrées et Sorties'!D$5:D$397,C336))","v":""},{"$f":"IF(C336=\"\",\"\",SUMIFS('Entrées et Sorties'!F$5:F$497,'Entrées et Sorties'!D$5:D$497,C336))","v":""},""]
[null,null,{"$f":"IF('Liste articles'!C337=\"\",\"\",'Liste articles'!C337)","v":""},null,{"$f":"IF(B337=\"\",\"\",SUMIFS('Entrées et Sorties'!E$5:E$397,'Entrées et Sorties'!D$5:D$397,C337))","v":""},{"$f":"IF(C337=\"\",\"\",SUMIFS('Entrées et Sorties'!F$5:F$497,'Entrées et Sorties'!D$5:D$497,C337))","v":""},""]
[null,null,{"$f":"IF('Liste articles'!C338=\"\",\"\",'Liste articles'!C338)","v":""},null,{"$f":"IF(B338=\"\",\"\",SUMIFS('Entrées et Sorties'!E$5:E$397,'Entrées et Sorties'!D$5:D$397,C338))","v":""},{"$f":"IF(C338=\"\",\"\",SUMIFS('Entrées et Sorties'!F$5:F$497,'Entrées et Sorties'!D$5:D$497,C338))","v":""},""]
[null,null,{"$f":"IF('Liste articles'!C339=\"\",\"\",'Liste articles'!C339)","v":""},null,{"$f":"IF(B339=\"\",\"\",SUMIFS('Entrées et Sorties'!E$5:E$397,'Entrées et Sorties'!D$5:D$397,C339))","v":""},{"$f":"IF(C339=\"\",\"\",SUMIFS('Entrées et Sorties'!F$5:F$497,'Entrées et Sorties'!D$5:D$497,C339))","v":""},""]
[null,null,{"$f":"IF('Liste articles'!C340=\"\",\"\",'Liste articles'!C340)","v":""},null,{"$f":"IF(B340=\"\",\"\",SUMIFS('Entrées et Sorties'!E$5:E$397,'Entrées et Sorties'!D$5:D$397,C340))","v":""},{"$f":"IF(C340=\"\",\"\",SUMIFS('Entrées et Sorties'!F$5:F$497,'Entrées et Sorties'!D$5:D$497,C340))","v":""},""]
[null,null,{"$f":"IF('Liste articles'!C341=\"\",\"\",'Liste articles'!C341)","v":""},null,{"$f":"IF(B341=\"\",\"\",SUMIFS('Entrées et Sorties'!E$5:E$397,'Entrées et Sorties'!D$5:D$397,C341))","v":""},{"$f":"IF(C341=\"\",\"\",SUMIFS('Entrées et Sorties'!F$5:F$497,'Entrées et Sorties'!D$5:D$497,C341))","v":""},""]
[null,null,{"$f":"IF('Liste articles'!C342=\"\",\"\",'Liste articles'!C342)","v":""},null,{"$f":"IF(B342=\"\",\"\",SUMIFS('Entrées et Sorties'!E$5:E$397,'Entrées et Sorties'!D$5:D$397,C342))","v":""},{"$f":"IF(C342=\"\",\"\",SUMIFS('Entrées et Sorties'!F$5:F$497,'Entrées et Sorties'!D$5:D$497,C342))","v":""},""]
[null,null,{"$f":"IF('Liste articles'!C343=\"\",\"\",'Liste articles'!C343)","v":""},null,{"$f":"IF(B343=\"\",\"\",SUMIFS('Entrées et Sorties'!E$5:E$397,'Entrées et Sorties'!D$5:D$397,C343))","v":""},{"$f":"IF(C343=\"\",\"\",SUMIFS('Entrées et Sorties'!F$5:F$497,'Entrées et Sorties'!D$5:D$497,C343))","v":""},""]
[null,null,{"$f":"IF('Liste articles'!C344=\"\",\"\",'Liste articles'!C344)","v":""},null,{"$f":"IF(B344=\"\",\"\",SUMIFS('Entrées et Sorties'!E$5:E$397,'Entrées et Sorties'!D$5:D$397,C344))","v":""},{"$f":"IF(C344=\"\",\"\",SUMIFS('Entrées et Sorties'!F$5:F$497,'Entrées et Sorties'!D$5:D$497,C344))","v":""},""]
[null,null,{"$f":"IF('Liste articles'!C345=\"\",\"\",'Liste articles'!C345)","v":""},null,{"$f":"IF(B345=\"\",\"\",SUMIFS('Entrées et Sorties'!E$5:E$397,'Entrées et Sorties'!D$5:D$397,C345))","v":""},{"$f":"IF(C345=\"\",\"\",SUMIFS('Entrées et Sorties'!F$5:F$497,'Entrées et Sorties'!D$5:D$497,C345))","v":""},""]
[null,null,{"$f":"IF('Liste articles'!C346=\"\",\"\",'Liste articles'!C346)","v":""},null,{"$f":"IF(B346=\"\",\"\",SUMIFS('Entrées et Sorties'!E$5:E$397,'Entrées et Sorties'!D$5:D$397,C346))","v":""},{"$f":"IF(C346=\"\",\"\",SUMIFS('Entrées et Sorties'!F$5:F$497,'Entrées et Sorties'!D$5:D$497,C346))","v":""},""]
[null,null,{"$f":"IF('Liste articles'!C347=\"\",\"\",'Liste articles'!C347)","v":""},null,{"$f":"IF(B347=\"\",\"\",SUMIFS('Entrées et Sorties'!E$5:E$397,'Entrées et Sorties'!D$5:D$397,C347))","v":""},{"$f":"IF(C347=\"\",\"\",SUMIFS('Entrées et Sorties'!F$5:F$497,'Entrées et Sorties'!D$5:D$497,C347))","v":""},""]
[null,null,{"$f":"IF('Liste articles'!C348=\"\",\"\",'Liste articles'!C348)","v":""},null,{"$f":"IF(B348=\"\",\"\",SUMIFS('Entrées et Sorties'!E$5:E$397,'Entrées et Sorties'!D$5:D$397,C348))","v":""},{"$f":"IF(C348=\"\",\"\",SUMIFS('Entrées et Sorties'!F$5:F$497,'Entrées et Sorties'!D$5:D$497,C348))","v":""},""]
[null,null,{"$f":"IF('Liste articles'!C349=\"\",\"\",'Liste articles'!C349)","v":""},null,{"$f":"IF(B349=\"\",\"\",SUMIFS('Entrées et Sorties'!E$5:E$397,'Entrées et Sorties'!D$5:D$397,C349))","v":""},{"$f":"IF(C349=\"\",\"\",SUMIFS('Entrées et Sorties'!F$5:F$497,'Entrées et Sorties'!D$5:D$497,C349))","v":""},""]
[null,null,{"$f":"IF('Liste articles'!C350=\"\",\"\",'Liste articles'!C350)","v":""},null,{"$f":"IF(B350=\"\",\"\",SUMIFS('Entrées et Sorties'!E$5:E$397,'Entrées et Sorties'!D$5:D$397,C350))","v":""},{"$f":"IF(C350=\"\",\"\",SUMIFS('Entrées et Sorties'!F$5:F$497,'Entrées et Sorties'!D$5:D$497,C350))","v":""},""]
[null,null,{"$f":"IF('Liste articles'!C351=\"\",\"\",'Liste articles'!C351)","v":""},null,{"$f":"IF(B351=\"\",\"\",SUMIFS('Entrées et Sorties'!E$5:E$397,'Entrées et Sorties'!D$5:D$397,C351))","v":""},{"$f":"IF(C351=\"\",\"\",SUMIFS('Entrées et Sorties'!F$5:F$497,'Entrées et Sorties'!D$5:D$497,C351))","v":""},""]
[null,null,{"$f":"IF('Liste articles'!C352=\"\",\"\",'Liste articles'!C352)","v":""},null,{"$f":"IF(B352=\"\",\"\",SUMIFS('Entrées et Sorties'!E$5:E$397,'Entrées et Sorties'!D$5:D$397,C352))","v":""},{"$f":"IF(C352=\"\",\"\",SUMIFS('Entrées et Sorties'!F$5:F$497,'Entrées et Sorties'!D$5:D$497,C352))","v":""},""]
[null,null,{"$f":"IF('Liste articles'!C353=\"\",\"\",'Liste articles'!C353)","v":""},null,{"$f":"IF(B353=\"\",\"\",SUMIFS('Entrées et Sorties'!E$5:E$397,'Entrées et Sorties'!D$5:D$397,C353))","v":""},{"$f":"IF(C353=\"\",\"\",SUMIFS('Entrées et Sorties'!F$5:F$497,'Entrées et Sorties'!D$5:D$497,C353))","v":""},""]
[null,null,{"$f":"IF('Liste articles'!C354=\"\",\"\",'Liste articles'!C354)","v":""},null,{"$f":"IF(B354=\"\",\"\",SUMIFS('Entrées et Sorties'!E$5:E$397,'Entrées et Sorties'!D$5:D$397,C354))","v":""},{"$f":"IF(C354=\"\",\"\",SUMIFS('Entrées et Sorties'!F$5:F$497,'Entrées et Sorties'!D$5:D$497,C354))","v":""},""]
[null,null,{"$f":"IF('Liste articles'!C355=\"\",\"\",'Liste articles'!C355)","v":""},null,{"$f":"IF(B355=\"\",\"\",SUMIFS('Entrées et Sorties'!E$5:E$397,'Entrées et Sorties'!D$5:D$397,C355))","v":""},{"$f":"IF(C355=\"\",\"\",SUMIFS('Entrées et Sorties'!F$5:F$497,'Entrées et Sorties'!D$5:D$497,C355))","v":""},""]
[null,null,{"$f":"IF('Liste articles'!C356=\"\",\"\",'Liste articles'!C356)","v":""},null,{"$f":"IF(B356=\"\",\"\",SUMIFS('Entrées et Sorties'!E$5:E$397,'Entrées et Sorties'!D$5:D$397,C356))","v":""},{"$f":"IF(C356=\"\",\"\",SUMIFS('Entrées et Sorties'!F$5:F$497,'Entrées et Sorties'!D$5:D$497,C356))","v":""},""]
[null,null,{"$f":"IF('Liste articles'!C357=\"\",\"\",'Liste articles'!C357)","v":""},null,{"$f":"IF(B357=\"\",\"\",SUMIFS('Entrées et Sorties'!E$5:E$397,'Entrées et Sorties'!D$5:D$397,C357))","v":""},{"$f":"IF(C357=\"\",\"\",SUMIFS('Entrées et Sorties'!F$5:F$497,'Entrées et Sorties'!D$5:D$497,C357))","v":""},""]
[null,null,{"$f":"IF('Liste articles'!C358=\"\",\"\",'Liste articles'!C358)","v":""},null,{"$f":"IF(B358=\"\",\"\",SUMIFS('Entrées et Sorties'!E$5:E$397,'Entrées et Sorties'!D$5:D$397,C358))","v":""},{"$f":"IF(C358=\"\",\"\",SUMIFS('Entrées et Sorties'!F$5:F$497,'Entrées et Sorties'!D$5:D$497,C358))","v":""},""]
[null,null,{"$f":"IF('Liste articles'!C359=\"\",\"\",'Liste articles'!C359)","v":""},null,{"$f":"IF(B359=\"\",\"\",SUMIFS('Entrées et Sorties'!E$5:E$397,'Entrées et Sorties'!D$5:D$397,C359))","v":""},{"$f":"IF(C359=\"\",\"\",SUMIFS('Entrées et Sorties'!F$5:F$497,'Entrées et Sorties'!D$5:D$497,C359))","v":""},""]
[null,null,{"$f":"IF('Liste articles'!C360=\"\",\"\",'Liste articles'!C360)","v":""},null,{"$f":"IF(B360=\"\",\"\",SUMIFS('Entrées et Sorties'!E$5:E$397,'Entrées et Sorties'!D$5:D$397,C360))","v":""},{"$f":"IF(C360=\"\",\"\",SUMIFS('Entrées et Sorties'!F$5:F$497,'Entrées et Sorties'!D$5:D$497,C360))","v":""},""]
[null,null,{"$f":"IF('Liste articles'!C361=\"\",\"\",'Liste articles'!C361)","v":""},null,{"$f":"IF(B361=\"\",\"\",SUMIFS('Entrées et Sorties'!E$5:E$397,'Entrées et Sorties'!D$5:D$397,C361))","v":""},{"$f":"IF(C361=\"\",\"\",SUMIFS('Entrées et Sorties'!F$5:F$497,'Entrées et Sorties'!D$5:D$497,C361))","v":""},""]
[null,null,{"$f":"IF('Liste articles'!C362=\"\",\"\",'Liste articles'!C362)","v":""},null,{"$f":"IF(B362=\"\",\"\",SUMIFS('Entrées et Sorties'!E$5:E$397,'Entrées et Sorties'!D$5:D$397,C362))","v":""},{"$f":"IF(C362=\"\",\"\",SUMIFS('Entrées et Sorties'!F$5:F$497,'Entrées et Sorties'!D$5:D$497,C362))","v":""},""]
[null,null,{"$f":"IF('Liste articles'!C363=\"\",\"\",'Liste articles'!C363)","v":""},null,{"$f":"IF(B363=\"\",\"\",SUMIFS('Entrées et Sorties'!E$5:E$397,'Entrées et Sorties'!D$5:D$397,C363))","v":""},{"$f":"IF(C363=\"\",\"\",SUMIFS('Entrées et Sorties'!F$5:F$497,'Entrées et Sorties'!D$5:D$497,C363))","v":""},""]
[null,null,{"$f":"IF('Liste articles'!C364=\"\",\"\",'Liste articles'!C364)","v":""},null,{"$f":"IF(B364=\"\",\"\",SUMIFS('Entrées et Sorties'!E$5:E$397,'Entrées et Sorties'!D$5:D$397,C364))","v":""},{"$f":"IF(C364=\"\",\"\",SUMIFS('Entrées et Sorties'!F$5:F$497,'Entrées et Sorties'!D$5:D$497,C364))","v":""},""]
[null,null,{"$f":"IF('Liste articles'!C365=\"\",\"\",'Liste articles'!C365)","v":""},null,{"$f":"IF(B365=\"\",\"\",SUMIFS('Entrées et Sorties'!E$5:E$397,'Entrées et Sorties'!D$5:D$397,C365))","v":""},{"$f":"IF(C365=\"\",\"\",SUMIFS('Entrées et Sorties'!F$5:F$497,'Entrées et Sorties'!D$5:D$497,C365))","v":""},""]
[null,null,{"$f":"IF('Liste articles'!C366=\"\",\"\",'Liste articles'!C366)","v":""},null,{"$f":"IF(B366=\"\",\"\",SUMIFS('Entrées et Sorties'!E$5:E$397,'Entrées et Sorties'!D$5:D$397,C366))","v":""},{"$f":"IF(C366=\"\",\"\",SUMIFS('Entrées et Sorties'!F$5:F$497,'Entrées et Sorties'!D$5:D$497,C366))","v":""},""]
[null,null,{"$f":"IF('Liste articles'!C367=\"\",\"\",'Liste articles'!C367)","v":""},null,{"$f":"IF(B367=\"\",\"\",SUMIFS('Entrées et Sorties'!E$5:E$397,'Entrées et Sorties'!D$5:D$397,C367))","v":""},{"$f":"IF(C367=\"\",\"\",SUMIFS('Entrées et Sorties'!F$5:F$497,'Entrées et Sorties'!D$5:D$497,C367))","v":""},""]
[null,null,{"$f":"IF('Liste articles'!C368=\"\",\"\",'Liste articles'!C368)","v":""},null,{"$f":"IF(B368=\"\",\"\",SUMIFS('Entrées et Sorties'!E$5:E$397,'Entrées et Sorties'!D$5:D$397,C368))","v":""},{"$f":"IF(C368=\"\",\"\",SUMIFS('Entrées et Sorties'!F$5:F$497,'Entrées et Sorties'!D$5:D$497,C368))","v":""},""]
[null,null,{"$f":"IF('Liste articles'!C369=\"\",\"\",'Liste articles'!C369)","v":""},null,{"$f":"IF(B369=\"\",\"\",SUMIFS('Entrées et Sorties'!E$5:E$397,'Entrées et Sorties'!D$5:D$397,C369))","v":""},{"$f":"IF(C369=\"\",\"\",SUMIFS('Entrées et Sorties'!F$5:F$497,'Entrées et Sorties'!D$5:D$497,C369))","v":""},""]
[null,null,{"$f":"IF('Liste articles'!C370=\"\",\"\",'Liste articles'!C370)","v":""},null,{"$f":"IF(B370=\"\",\"\",SUMIFS('Entrées et Sorties'!E$5:E$397,'Entrées et Sorties'!D$5:D$397,C370))","v":""},{"$f":"IF(C370=\"\",\"\",SUMIFS('Entrées et Sorties'!F$5:F$497,'Entrées et Sorties'!D$5:D$497,C370))","v":""},""]
[null,null,{"$f":"IF('Liste articles'!C371=\"\",\"\",'Liste articles'!C371)","v":""},null,{"$f":"IF(B371=\"\",\"\",SUMIFS('Entrées et Sorties'!E$5:E$397,'Entrées et Sorties'!D$5:D$397,C371))","v":""},{"$f":"IF(C371=\"\",\"\",SUMIFS('Entrées et Sorties'!F$5:F$497,'Entrées et Sorties'!D$5:D$497,C371))","v":""},""]
[null,null,{"$f":"IF('Liste articles'!C372=\"\",\"\",'Liste articles'!C372)","v":""},null,{"$f":"IF(B372=\"\",\"\",SUMIFS('Entrées et Sorties'!E$5:E$397,'Entrées et Sorties'!D$5:D$397,C372))","v":""},{"$f":"IF(C372=\"\",\"\",SUMIFS('Entrées et Sorties'!F$5:F$497,'Entrées et Sorties'!D$5:D$497,C372))","v":""},""]
[null,null,{"$f":"IF('Liste articles'!C373=\"\",\"\",'Liste articles'!C373)","v":""},null,{"$f":"IF(B373=\"\",\"\",SUMIFS('Entrées et Sorties'!E$5:E$397,'Entrées et Sorties'!D$5:D$397,C373))","v":""},{"$f":"IF(C373=\"\",\"\",SUMIFS('Entrées et Sorties'!F$5:F$497,'Entrées et Sorties'!D$5:D$497,C373))","v":""},""]
[null,null,{"$f":"IF('Liste articles'!C374=\"\",\"\",'Liste articles'!C374)","v":""},null,{"$f":"IF(B374=\"\",\"\",SUMIFS('Entrées et Sorties'!E$5:E$397,'Entrées et Sorties'!D$5:D$397,C374))","v":""},{"$f":"IF(C374=\"\",\"\",SUMIFS('Entrées et Sorties'!F$5:F$497,'Entrées et Sorties'!D$5:D$497,C374))","v":""},""]
[null,null,{"$f":"IF('Liste articles'!C375=\"\",\"\",'Liste articles'!C375)","v":""},null,{"$f":"IF(B375=\"\",\"\",SUMIFS('Entrées et Sorties'!E$5:E$397,'Entrées et Sorties'!D$5:D$397,C375))","v":""},{"$f":"IF(C375=\"\",\"\",SUMIFS('Entrées et Sorties'!F$5:F$497,'Entrées et Sorties'!D$5:D$497,C375))","v":""},""]
[null,null,{"$f":"IF('Liste articles'!C376=\"\",\"\",'Liste articles'!C376)","v":""},null,{"$f":"IF(B376=\"\",\"\",SUMIFS('Entrées et Sorties'!E$5:E$397,'Entrées et Sorties'!D$5:D$397,C376))","v":""},{"$f":"IF(C376=\"\",\"\",SUMIFS('Entrées et Sorties'!F$5:F$497,'Entrées et Sorties'!D$5:D$497,C376))","v":""},""]
[null,null,{"$f":"IF('Liste articles'!C377=\"\",\"\",'Liste articles'!C377)","v":""},null,{"$f":"IF(B377=\"\",\"\",SUMIFS('Entrées et Sorties'!E$5:E$397,'Entrées et Sorties'!D$5:D$397,C377))","v":""},{"$f":"IF(C377=\"\",\"\",SUMIFS('Entrées et Sorties'!F$5:F$497,'Entrées et Sorties'!D$5:D$497,C377))","v":""},""]
[null,null,{"$f":"IF('Liste articles'!C378=\"\",\"\",'Liste articles'!C378)","v":""},null,{"$f":"IF(B378=\"\",\"\",SUMIFS('Entrées et Sorties'!E$5:E$397,'Entrées et Sorties'!D$5:D$397,C378))","v":""},{"$f":"IF(C378=\"\",\"\",SUMIFS('Entrées et Sorties'!F$5:F$497,'Entrées et Sorties'!D$5:D$497,C378))","v":""},""]
[null,null,{"$f":"IF('Liste articles'!C379=\"\",\"\",'Liste articles'!C379)","v":""},null,{"$f":"IF(B379=\"\",\"\",SUMIFS('Entrées et Sorties'!E$5:E$397,'Entrées et Sorties'!D$5:D$397,C379))","v":""},{"$f":"IF(C379=\"\",\"\",SUMIFS('Entrées et Sorties'!F$5:F$497,'Entrées et Sorties'!D$5:D$497,C379))","v":""},""]
[null,null,{"$f":"IF('Liste articles'!C380=\"\",\"\",'Liste articles'!C380)","v":""},null,{"$f":"IF(B380=\"\",\"\",SUMIFS('Entrées et Sorties'!E$5:E$397,'Entrées et Sorties'!D$5:D$397,C380))","v":""},{"$f":"IF(C380=\"\",\"\",SUMIFS('Entrées et Sorties'!F$5:F$497,'Entrées et Sorties'!D$5:D$497,C380))","v":""},""]
[null,null,{"$f":"IF('Liste articles'!C381=\"\",\"\",'Liste articles'!C381)","v":""},null,{"$f":"IF(B381=\"\",\"\",SUMIFS('Entrées et Sorties'!E$5:E$397,'Entrées et Sorties'!D$5:D$397,C381))","v":""},{"$f":"IF(C381=\"\",\"\",SUMIFS('Entrées et Sorties'!F$5:F$497,'Entrées et Sorties'!D$5:D$497,C381))","v":""},""]
[null,null,{"$f":"IF('Liste articles'!C382=\"\",\"\",'Liste articles'!C382)","v":""},null,{"$f":"IF(B382=\"\",\"\",SUMIFS('Entrées et Sorties'!E$5:E$397,'Entrées et Sorties'!D$5:D$397,C382))","v":""},{"$f":"IF(C382=\"\",\"\",SUMIFS('Entrées et Sorties'!F$5:F$497,'Entrées et Sorties'!D$5:D$497,C382))","v":""},""]
[null,null,{"$f":"IF('Liste articles'!C383=\"\",\"\",'Liste articles'!C383)","v":""},null,{"$f":"IF(B383=\"\",\"\",SUMIFS('Entrées et Sorties'!E$5:E$397,'Entrées et Sorties'!D$5:D$397,C383))","v":""},{"$f":"IF(C383=\"\",\"\",SUMIFS('Entrées et Sorties'!F$5:F$497,'Entrées et Sorties'!D$5:D$497,C383))","v":""},""]
[null,null,{"$f":"IF('Liste articles'!C384=\"\",\"\",'Liste articles'!C384)","v":""},null,{"$f":"IF(B384=\"\",\"\",SUMIFS('Entrées et Sorties'!E$5:E$397,'Entrées et Sorties'!D$5:D$397,C384))","v":""},{"$f":"IF(C384=\"\",\"\",SUMIFS('Entrées et Sorties'!F$5:F$497,'Entrées et Sorties'!D$5:D$497,C384))","v":""},""]
[null,null,{"$f":"IF('Liste articles'!C385=\"\",\"\",'Liste articles'!C385)","v":""},null,{"$f":"IF(B385=\"\",\"\",SUMIFS('Entrées et Sorties'!E$5:E$397,'Entrées et Sorties'!D$5:D$397,C385))","v":""},{"$f":"IF(C385=\"\",\"\",SUMIFS('Entrées et Sorties'!F$5:F$497,'Entrées et Sorties'!D$5:D$497,C385))","v":""},""]
[null,null,{"$f":"IF('Liste articles'!C386=\"\",\"\",'Liste articles'!C386)","v":""},null,{"$f":"IF(B386=\"\",\"\",SUMIFS('Entrées et Sorties'!E$5:E$397,'Entrées et Sorties'!D$5:D$397,C386))","v":""},{"$f":"IF(C386=\"\",\"\",SUMIFS('Entrées et Sorties'!F$5:F$497,'Entrées et Sorties'!D$5:D$497,C386))","v":""},""]
[null,null,{"$f":"IF('Liste articles'!C387=\"\",\"\",'Liste articles'!C387)","v":""},null,{"$f":"IF(B387=\"\",\"\",SUMIFS('Entrées et Sorties'!E$5:E$397,'Entrées et Sorties'!D$5:D$397,C387))","v":""},{"$f":"IF(C387=\"\",\"\",SUMIFS('Entrées et Sorties'!F$5:F$497,'Entrées et Sorties'!D$5:D$497,C387))","v":""},""]
[null,null,{"$f":"IF('Liste articles'!C388=\"\",\"\",'Liste articles'!C388)","v":""},null,{"$f":"IF(B388=\"\",\"\",SUMIFS('Entrées et Sorties'!E$5:E$397,'Entrées et Sorties'!D$5:D$397,C388))","v":""},{"$f":"IF(C388=\"\",\"\",SUMIFS('Entrées et Sorties'!F$5:F$497,'Entrées et Sorties'!D$5:D$497,C388))","v":""},""]
[null,null,{"$f":"IF('Liste articles'!C389=\"\",\"\",'Liste articles'!C389)","v":""},null,{"$f":"IF(B389=\"\",\"\",SUMIFS('Entrées et Sorties'!E$5:E$397,'Entrées et Sorties'!D$5:D$397,C389))","v":""},{"$f":"IF(C389=\"\",\"\",SUMIFS('Entrées et Sorties'!F$5:F$497,'Entrées et Sorties'!D$5:D$497,C389))","v":""},""]
[null,null,{"$f":"IF('Liste articles'!C390=\"\",\"\",'Liste articles'!C390)","v":""},null,{"$f":"IF(B390=\"\",\"\",SUMIFS('Entrées et Sorties'!E$5:E$397,'Entrées et Sorties'!D$5:D$397,C390))","v":""},{"$f":"IF(C390=\"\",\"\",SUMIFS('Entrées et Sorties'!F$5:F$497,'Entrées et Sorties'!D$5:D$497,C390))","v":""},""]
[null,null,{"$f":"IF('Liste articles'!C391=\"\",\"\",'Liste articles'!C391)","v":""},null,{"$f":"IF(B391=\"\",\"\",SUMIFS('Entrées et Sorties'!E$5:E$397,'Entrées et Sorties'!D$5:D$397,C391))","v":""},{"$f":"IF(C391=\"\",\"\",SUMIFS('Entrées et Sorties'!F$5:F$497,'Entrées et Sorties'!D$5:D$497,C391))","v":""},""]
[null,null,{"$f":"IF('Liste articles'!C392=\"\",\"\",'Liste articles'!C392)","v":""},null,{"$f":"IF(B392=\"\",\"\",SUMIFS('Entrées et Sorties'!E$5:E$397,'Entrées et Sorties'!D$5:D$397,C392))","v":""},{"$f":"IF(C392=\"\",\"\",SUMIFS('Entrées et Sorties'!F$5:F$497,'Entrées et Sorties'!D$5:D$497,C392))","v":""},""]
[null,null,{"$f":"IF('Liste articles'!C393=\"\",\"\",'Liste articles'!C393)","v":""},null,{"$f":"IF(B393=\"\",\"\",SUMIFS('Entrées et Sorties'!E$5:E$397,'Entrées et Sorties'!D$5:D$397,C393))","v":""},{"$f":"IF(C393=\"\",\"\",SUMIFS('Entrées et Sorties'!F$5:F$497,'Entrées et Sorties'!D$5:D$497,C393))","v":""},""]
[null,null,{"$f":"IF('Liste articles'!C394=\"\",\"\",'Liste articles'!C394)","v":""},null,{"$f":"IF(B394=\"\",\"\",SUMIFS('Entrées et Sorties'!E$5:E$397,'Entrées et Sorties'!D$5:D$397,C394))","v":""},{"$f":"IF(C394=\"\",\"\",SUMIFS('Entrées et Sorties'!F$5:F$497,'Entrées et Sorties'!D$5:D$497,C394))","v":""},{"$f":"IF(C394=\"\",\"\",D394+E394-F394)","v":""}]
[null,null,{"$f":"IF('Liste articles'!C395=\"\",\"\",'Liste articles'!C395)","v":""},null,{"$f":"IF(B395=\"\",\"\",SUMIFS('Entrées et Sorties'!E$5:E$397,'Entrées et Sorties'!D$5:D$397,C395))","v":""},{"$f":"IF(C395=\"\",\"\",SUMIFS('Entrées et Sorties'!F$5:F$497,'Entrées et Sorties'!D$5:D$497,C395))","v":""},""]
[null,null,{"$f":"IF('Liste articles'!C396=\"\",\"\",'Liste articles'!C396)","v":""},null,{"$f":"IF(B396=\"\",\"\",SUMIFS('Entrées et Sorties'!E$5:E$397,'Entrées et Sorties'!D$5:D$397,C396))","v":""},{"$f":"IF(C396=\"\",\"\",SUMIFS('Entrées et Sorties'!F$5:F$497,'Entrées et Sorties'!D$5:D$497,C396))","v":""},""]
[null,null,{"$f":"IF('Liste articles'!C397=\"\",\"\",'Liste articles'!C397)","v":""},null,{"$f":"IF(B397=\"\",\"\",SUMIFS('Entrées et Sorties'!E$5:E$397,'Entrées et Sorties'!D$5:D$397,C397))","v":""},{"$f":"IF(C397=\"\",\"\",SUMIFS('Entrées et Sorties'!F$5:F$497,'Entrées et Sorties'!D$5:D$497,C397))","v":""},""]
[null,null,{"$f":"IF('Liste articles'!C398=\"\",\"\",'Liste articles'!C398)","v":""},null,{"$f":"IF(B398=\"\",\"\",SUMIFS('Entrées et Sorties'!E$5:E$397,'Entrées et Sorties'!D$5:D$397,C398))","v":""},{"$f":"IF(C398=\"\",\"\",SUMIFS('Entrées et Sorties'!F$5:F$497,'Entrées et Sorties'!D$5:D$497,C398))","v":""},""]
[null,null,{"$f":"IF('Liste articles'!C399=\"\",\"\",'Liste articles'!C399)","v":""},null,{"$f":"IF(B399=\"\",\"\",SUMIFS('Entrées et Sorties'!E$5:E$397,'Entrées et Sorties'!D$5:D$397,C399))","v":""},{"$f":"IF(C399=\"\",\"\",SUMIFS('Entrées et Sorties'!F$5:F$497,'Entrées et Sorties'!D$5:D$497,C399))","v":""},""]
[null,null,{"$f":"IF('Liste articles'!C400=\"\",\"\",'Liste articles'!C400)","v":""},null,{"$f":"IF(B400=\"\",\"\",SUMIFS('Entrées et Sorties'!E$5:E$397,'Entrées et Sorties'!D$5:D$397,C400))","v":""},{"$f":"IF(C400=\"\",\"\",SUMIFS('Entrées et Sorties'!F$5:F$497,'Entrées et Sorties'!D$5:D$497,C400))","v":""},""]
[null,null,{"$f":"IF('Liste articles'!C401=\"\",\"\",'Liste articles'!C401)","v":""},null,{"$f":"IF(B401=\"\",\"\",SUMIFS('Entrées et Sorties'!E$5:E$397,'Entrées et Sorties'!D$5:D$397,C401))","v":""},{"$f":"IF(C401=\"\",\"\",SUMIFS('Entrées et Sorties'!F$5:F$497,'Entrées et Sorties'!D$5:D$497,C401))","v":""},""]
[null,null,{"$f":"IF('Liste articles'!C402=\"\",\"\",'Liste articles'!C402)","v":""},null,{"$f":"IF(B402=\"\",\"\",SUMIFS('Entrées et Sorties'!E$5:E$397,'Entrées et Sorties'!D$5:D$397,C402))","v":""},{"$f":"IF(C402=\"\",\"\",SUMIFS('Entrées et Sorties'!F$5:F$497,'Entrées et Sorties'!D$5:D$497,C402))","v":""},""]
[null,null,{"$f":"IF('Liste articles'!C403=\"\",\"\",'Liste articles'!C403)","v":""},null,{"$f":"IF(B403=\"\",\"\",SUMIFS('Entrées et Sorties'!E$5:E$397,'Entrées et Sorties'!D$5:D$397,C403))","v":""},{"$f":"IF(C403=\"\",\"\",SUMIFS('Entrées et Sorties'!F$5:F$497,'Entrées et Sorties'!D$5:D$497,C403))","v":""},""]
[null,null,{"$f":"IF('Liste articles'!C404=\"\",\"\",'Liste articles'!C404)","v":""},null,{"$f":"IF(B404=\"\",\"\",SUMIFS('Entrées et Sorties'!E$5:E$397,'Entrées et Sorties'!D$5:D$397,C404))","v":""},{"$f":"IF(C404=\"\",\"\",SUMIFS('Entrées et Sorties'!F$5:F$497,'Entrées et Sorties'!D$5:D$497,C404))","v":""},""]
[null,null,{"$f":"IF('Liste articles'!C405=\"\",\"\",'Liste articles'!C405)","v":""},null,{"$f":"IF(B405=\"\",\"\",SUMIFS('Entrées et Sorties'!E$5:E$397,'Entrées et Sorties'!D$5:D$397,C405))","v":""},{"$f":"IF(C405=\"\",\"\",SUMIFS('Entrées et Sorties'!F$5:F$497,'Entrées et Sorties'!D$5:D$497,C405))","v":""},""]
[null,null,{"$f":"IF('Liste articles'!C406=\"\",\"\",'Liste articles'!C406)","v":""},null,{"$f":"IF(B406=\"\",\"\",SUMIFS('Entrées et Sorties'!E$5:E$397,'Entrées et Sorties'!D$5:D$397,C406))","v":""},{"$f":"IF(C406=\"\",\"\",SUMIFS('Entrées et Sorties'!F$5:F$497,'Entrées et Sorties'!D$5:D$497,C406))","v":""},""]
[null,null,{"$f":"IF('Liste articles'!C407=\"\",\"\",'Liste articles'!C407)","v":""},null,{"$f":"IF(B407=\"\",\"\",SUMIFS('Entrées et Sorties'!E$5:E$397,'Entrées et Sorties'!D$5:D$397,C407))","v":""},{"$f":"IF(C407=\"\",\"\",SUMIFS('Entrées et Sorties'!F$5:F$497,'Entrées et Sorties'!D$5:D$497,C407))","v":""},""]
[null,null,{"$f":"IF('Liste articles'!C408=\"\",\"\",'Liste articles'!C408)","v":""},null,{"$f":"IF(B408=\"\",\"\",SUMIFS('Entrées et Sorties'!E$5:E$397,'Entrées et Sorties'!D$5:D$397,C408))","v":""},{"$f":"IF(C408=\"\",\"\",SUMIFS('Entrées et Sorties'!F$5:F$497,'Entrées et Sorties'!D$5:D$497,C408))","v":""},""]
[null,null,{"$f":"IF('Liste articles'!C409=\"\",\"\",'Liste articles'!C409)","v":""},null,{"$f":"IF(B409=\"\",\"\",SUMIFS('Entrées et Sorties'!E$5:E$397,'Entrées et Sorties'!D$5:D$397,C409))","v":""},{"$f":"IF(C409=\"\",\"\",SUMIFS('Entrées et Sorties'!F$5:F$497,'Entrées et Sorties'!D$5:D$497,C409))","v":""},""]
[null,null,{"$f":"IF('Liste articles'!C410=\"\",\"\",'Liste articles'!C410)","v":""},null,{"$f":"IF(B410=\"\",\"\",SUMIFS('Entrées et Sorties'!E$5:E$397,'Entrées et Sorties'!D$5:D$397,C410))","v":""},{"$f":"IF(C410=\"\",\"\",SUMIFS('Entrées et Sorties'!F$5:F$497,'Entrées et Sorties'!D$5:D$497,C410))","v":""},""]
[null,null,{"$f":"IF('Liste articles'!C411=\"\",\"\",'Liste articles'!C411)","v":""},null,{"$f":"IF(B411=\"\",\"\",SUMIFS('Entrées et Sorties'!E$5:E$397,'Entrées et Sorties'!D$5:D$397,C411))","v":""},{"$f":"IF(C411=\"\",\"\",SUMIFS('Entrées et Sorties'!F$5:F$497,'Entrées et Sorties'!D$5:D$497,C411))","v":""},""]
[null,null,{"$f":"IF('Liste articles'!C412=\"\",\"\",'Liste articles'!C412)","v":""},null,{"$f":"IF(B412=\"\",\"\",SUMIFS('Entrées et Sorties'!E$5:E$397,'Entrées et Sorties'!D$5:D$397,C412))","v":""},{"$f":"IF(C412=\"\",\"\",SUMIFS('Entrées et Sorties'!F$5:F$497,'Entrées et Sorties'!D$5:D$497,C412))","v":""},""]
[null,null,{"$f":"IF('Liste articles'!C413=\"\",\"\",'Liste articles'!C413)","v":""},null,{"$f":"IF(B413=\"\",\"\",SUMIFS('Entrées et Sorties'!E$5:E$397,'Entrées et Sorties'!D$5:D$397,C413))","v":""},{"$f":"IF(C413=\"\",\"\",SUMIFS('Entrées et Sorties'!F$5:F$497,'Entrées et Sorties'!D$5:D$497,C413))","v":""},""]
[null,null,{"$f":"IF('Liste articles'!C414=\"\",\"\",'Liste articles'!C414)","v":""},null,{"$f":"IF(B414=\"\",\"\",SUMIFS('Entrées et Sorties'!E$5:E$397,'Entrées et Sorties'!D$5:D$397,C414))","v":""},{"$f":"IF(C414=\"\",\"\",SUMIFS('Entrées et Sorties'!F$5:F$497,'Entrées et Sorties'!D$5:D$497,C414))","v":""},""]
[null,null,{"$f":"IF('Liste articles'!C415=\"\",\"\",'Liste articles'!C415)","v":""},null,{"$f":"IF(B415=\"\",\"\",SUMIFS('Entrées et Sorties'!E$5:E$397,'Entrées et Sorties'!D$5:D$397,C415))","v":""},{"$f":"IF(C415=\"\",\"\",SUMIFS('Entrées et Sorties'!F$5:F$497,'Entrées et Sorties'!D$5:D$497,C415))","v":""},""]
[null,null,{"$f":"IF('Liste articles'!C416=\"\",\"\",'Liste articles'!C416)","v":""},null,{"$f":"IF(B416=\"\",\"\",SUMIFS('Entrées et Sorties'!E$5:E$397,'Entrées et Sorties'!D$5:D$397,C416))","v":""},{"$f":"IF(C416=\"\",\"\",SUMIFS('Entrées et Sorties'!F$5:F$497,'Entrées et Sorties'!D$5:D$497,C416))","v":""},""]
[null,null,{"$f":"IF('Liste articles'!C417=\"\",\"\",'Liste articles'!C417)","v":""},null,{"$f":"IF(B417=\"\",\"\",SUMIFS('Entrées et Sorties'!E$5:E$397,'Entrées et Sorties'!D$5:D$397,C417))","v":""},{"$f":"IF(C417=\"\",\"\",SUMIFS('Entrées et Sorties'!F$5:F$497,'Entrées et Sorties'!D$5:D$497,C417))","v":""},""]
[null,null,{"$f":"IF('Liste articles'!C418=\"\",\"\",'Liste articles'!C418)","v":""},null,{"$f":"IF(B418=\"\",\"\",SUMIFS('Entrées et Sorties'!E$5:E$397,'Entrées et Sorties'!D$5:D$397,C418))","v":""},{"$f":"IF(C418=\"\",\"\",SUMIFS('Entrées et Sorties'!F$5:F$497,'Entrées et Sorties'!D$5:D$497,C418))","v":""},""]
[null,null,{"$f":"IF('Liste articles'!C419=\"\",\"\",'Liste articles'!C419)","v":""},null,{"$f":"IF(B419=\"\",\"\",SUMIFS('Entrées et Sorties'!E$5:E$397,'Entrées et Sorties'!D$5:D$397,C419))","v":""},{"$f":"IF(C419=\"\",\"\",SUMIFS('Entrées et Sorties'!F$5:F$497,'Entrées et Sorties'!D$5:D$497,C419))","v":""},""]
[null,null,{"$f":"IF('Liste articles'!C420=\"\",\"\",'Liste articles'!C420)","v":""},null,{"$f":"IF(B420=\"\",\"\",SUMIFS('Entrées et Sorties'!E$5:E$397,'Entrées et Sorties'!D$5:D$397,C420))","v":""},{"$f":"IF(C420=\"\",\"\",SUMIFS('Entrées et Sorties'!F$5:F$497,'Entrées et Sorties'!D$5:D$497,C420))","v":""},""]
[null,null,{"$f":"IF('Liste articles'!C421=\"\",\"\",'Liste articles'!C421)","v":""},null,{"$f":"IF(B421=\"\",\"\",SUMIFS('Entrées et Sorties'!E$5:E$397,'Entrées et Sorties'!D$5:D$397,C421))","v":""},{"$f":"IF(C421=\"\",\"\",SUMIFS('Entrées et Sorties'!F$5:F$497,'Entrées et Sorties'!D$5:D$497,C421))","v":""},""]
[null,null,{"$f":"IF('Liste articles'!C422=\"\",\"\",'Liste articles'!C422)","v":""},null,{"$f":"IF(B422=\"\",\"\",SUMIFS('Entrées et Sorties'!E$5:E$397,'Entrées et Sorties'!D$5:D$397,C422))","v":""},{"$f":"IF(C422=\"\",\"\",SUMIFS('Entrées et Sorties'!F$5:F$497,'Entrées et Sorties'!D$5:D$497,C422))","v":""},""]
[null,null,{"$f":"IF('Liste articles'!C423=\"\",\"\",'Liste articles'!C423)","v":""},null,{"$f":"IF(B423=\"\",\"\",SUMIFS('Entrées et Sorties'!E$5:E$397,'Entrées et Sorties'!D$5:D$397,C423))","v":""},{"$f":"IF(C423=\"\",\"\",SUMIFS('Entrées et Sorties'!F$5:F$497,'Entrées et Sorties'!D$5:D$497,C423))","v":""},""]
[null,null,{"$f":"IF('Liste articles'!C424=\"\",\"\",'Liste articles'!C424)","v":""},null,{"$f":"IF(B424=\"\",\"\",SUMIFS('Entrées et Sorties'!E$5:E$397,'Entrées et Sorties'!D$5:D$397,C424))","v":""},{"$f":"IF(C424=\"\",\"\",SUMIFS('Entrées et Sorties'!F$5:F$497,'Entrées et Sorties'!D$5:D$497,C424))","v":""},""]
[null,null,{"$f":"IF('Liste articles'!C425=\"\",\"\",'Liste articles'!C425)","v":""},null,{"$f":"IF(B425=\"\",\"\",SUMIFS('Entrées et Sorties'!E$5:E$397,'Entrées et Sorties'!D$5:D$397,C425))","v":""},{"$f":"IF(C425=\"\",\"\",SUMIFS('Entrées et Sorties'!F$5:F$497,'Entrées et Sorties'!D$5:D$497,C425))","v":""},""]
[null,null,{"$f":"IF('Liste articles'!C426=\"\",\"\",'Liste articles'!C426)","v":""},null,{"$f":"IF(B426=\"\",\"\",SUMIFS('Entrées et Sorties'!E$5:E$397,'Entrées et Sorties'!D$5:D$397,C426))","v":""},{"$f":"IF(C426=\"\",\"\",SUMIFS('Entrées et Sorties'!F$5:F$497,'Entrées et Sorties'!D$5:D$497,C426))","v":""},""]
[null,null,{"$f":"IF('Liste articles'!C427=\"\",\"\",'Liste articles'!C427)","v":""},null,{"$f":"IF(B427=\"\",\"\",SUMIFS('Entrées et Sorties'!E$5:E$397,'Entrées et Sorties'!D$5:D$397,C427))","v":""},{"$f":"IF(C427=\"\",\"\",SUMIFS('Entrées et Sorties'!F$5:F$497,'Entrées et Sorties'!D$5:D$497,C427))","v":""},""]
[null,null,{"$f":"IF('Liste articles'!C428=\"\",\"\",'Liste articles'!C428)","v":""},null,{"$f":"IF(B428=\"\",\"\",SUMIFS('Entrées et Sorties'!E$5:E$397,'Entrées et Sorties'!D$5:D$397,C428))","v":""},{"$f":"IF(C428=\"\",\"\",SUMIFS('Entrées et Sorties'!F$5:F$497,'Entrées et Sorties'!D$5:D$497,C428))","v":""},""]
[null,null,{"$f":"IF('Liste articles'!C429=\"\",\"\",'Liste articles'!C429)","v":""},null,{"$f":"IF(B429=\"\",\"\",SUMIFS('Entrées et Sorties'!E$5:E$397,'Entrées et Sorties'!D$5:D$397,C429))","v":""},{"$f":"IF(C429=\"\",\"\",SUMIFS('Entrées et Sorties'!F$5:F$497,'Entrées et Sorties'!D$5:D$497,C429))","v":""},""]
[null,null,{"$f":"IF('Liste articles'!C430=\"\",\"\",'Liste articles'!C430)","v":""},null,{"$f":"IF(B430=\"\",\"\",SUMIFS('Entrées et Sorties'!E$5:E$397,'Entrées et Sorties'!D$5:D$397,C430))","v":""},{"$f":"IF(C430=\"\",\"\",SUMIFS('Entrées et Sorties'!F$5:F$497,'Entrées et Sorties'!D$5:D$497,C430))","v":""},""]
[null,null,{"$f":"IF('Liste articles'!C431=\"\",\"\",'Liste articles'!C431)","v":""},null,{"$f":"IF(B431=\"\",\"\",SUMIFS('Entrées et Sorties'!E$5:E$397,'Entrées et Sorties'!D$5:D$397,C431))","v":""},{"$f":"IF(C431=\"\",\"\",SUMIFS('Entrées et Sorties'!F$5:F$497,'Entrées et Sorties'!D$5:D$497,C431))","v":""},""]
[null,null,{"$f":"IF('Liste articles'!C432=\"\",\"\",'Liste articles'!C432)","v":""},null,{"$f":"IF(B432=\"\",\"\",SUMIFS('Entrées et Sorties'!E$5:E$397,'Entrées et Sorties'!D$5:D$397,C432))","v":""},{"$f":"IF(C432=\"\",\"\",SUMIFS('Entrées et Sorties'!F$5:F$497,'Entrées et Sorties'!D$5:D$497,C432))","v":""},""]
[null,null,{"$f":"IF('Liste articles'!C433=\"\",\"\",'Liste articles'!C433)","v":""},null,{"$f":"IF(B433=\"\",\"\",SUMIFS('Entrées et Sorties'!E$5:E$397,'Entrées et Sorties'!D$5:D$397,C433))","v":""},{"$f":"IF(C433=\"\",\"\",SUMIFS('Entrées et Sorties'!F$5:F$497,'Entrées et Sorties'!D$5:D$497,C433))","v":""},""]
[null,null,{"$f":"IF('Liste articles'!C434=\"\",\"\",'Liste articles'!C434)","v":""},null,{"$f":"IF(B434=\"\",\"\",SUMIFS('Entrées et Sorties'!E$5:E$397,'Entrées et Sorties'!D$5:D$397,C434))","v":""},{"$f":"IF(C434=\"\",\"\",SUMIFS('Entrées et Sorties'!F$5:F$497,'Entrées et Sorties'!D$5:D$497,C434))","v":""},""]
[null,null,{"$f":"IF('Liste articles'!C435=\"\",\"\",'Liste articles'!C435)","v":""},null,{"$f":"IF(B435=\"\",\"\",SUMIFS('Entrées et Sorties'!E$5:E$397,'Entrées et Sorties'!D$5:D$397,C435))","v":""},{"$f":"IF(C435=\"\",\"\",SUMIFS('Entrées et Sorties'!F$5:F$497,'Entrées et Sorties'!D$5:D$497,C435))","v":""},""]
[null,null,{"$f":"IF('Liste articles'!C436=\"\",\"\",'Liste articles'!C436)","v":""},null,{"$f":"IF(B436=\"\",\"\",SUMIFS('Entrées et Sorties'!E$5:E$397,'Entrées et Sorties'!D$5:D$397,C436))","v":""},{"$f":"IF(C436=\"\",\"\",SUMIFS('Entrées et Sorties'!F$5:F$497,'Entrées et Sorties'!D$5:D$497,C436))","v":""},""]
[null,null,{"$f":"IF('Liste articles'!C437=\"\",\"\",'Liste articles'!C437)","v":""},null,{"$f":"IF(B437=\"\",\"\",SUMIFS('Entrées et Sorties'!E$5:E$397,'Entrées et Sorties'!D$5:D$397,C437))","v":""},{"$f":"IF(C437=\"\",\"\",SUMIFS('Entrées et Sorties'!F$5:F$497,'Entrées et Sorties'!D$5:D$497,C437))","v":""},""]
[null,null,{"$f":"IF('Liste articles'!C438=\"\",\"\",'Liste articles'!C438)","v":""},null,{"$f":"IF(B438=\"\",\"\",SUMIFS('Entrées et Sorties'!E$5:E$397,'Entrées et Sorties'!D$5:D$397,C438))","v":""},{"$f":"IF(C438=\"\",\"\",SUMIFS('Entrées et Sorties'!F$5:F$497,'Entrées et Sorties'!D$5:D$497,C438))","v":""},""]
[null,null,{"$f":"IF('Liste articles'!C439=\"\",\"\",'Liste articles'!C439)","v":""},null,{"$f":"IF(B439=\"\",\"\",SUMIFS('Entrées et Sorties'!E$5:E$397,'Entrées et Sorties'!D$5:D$397,C439))","v":""},{"$f":"IF(C439=\"\",\"\",SUMIFS('Entrées et Sorties'!F$5:F$497,'Entrées et Sorties'!D$5:D$497,C439))","v":""},""]
[null,null,{"$f":"IF('Liste articles'!C440=\"\",\"\",'Liste articles'!C440)","v":""},null,{"$f":"IF(B440=\"\",\"\",SUMIFS('Entrées et Sorties'!E$5:E$397,'Entrées et Sorties'!D$5:D$397,C440))","v":""},{"$f":"IF(C440=\"\",\"\",SUMIFS('Entrées et Sorties'!F$5:F$497,'Entrées et Sorties'!D$5:D$497,C440))","v":""},""]
[null,null,{"$f":"IF('Liste articles'!C441=\"\",\"\",'Liste articles'!C441)","v":""},null,{"$f":"IF(B441=\"\",\"\",SUMIFS('Entrées et Sorties'!E$5:E$397,'Entrées et Sorties'!D$5:D$397,C441))","v":""},{"$f":"IF(C441=\"\",\"\",SUMIFS('Entrées et Sorties'!F$5:F$497,'Entrées et Sorties'!D$5:D$497,C441))","v":""},""]
[null,null,{"$f":"IF('Liste articles'!C442=\"\",\"\",'Liste articles'!C442)","v":""},null,{"$f":"IF(B442=\"\",\"\",SUMIFS('Entrées et Sorties'!E$5:E$397,'Entrées et Sorties'!D$5:D$397,C442))","v":""},{"$f":"IF(C442=\"\",\"\",SUMIFS('Entrées et Sorties'!F$5:F$497,'Entrées et Sorties'!D$5:D$497,C442))","v":""},""]
[null,null,{"$f":"IF('Liste articles'!C443=\"\",\"\",'Liste articles'!C443)","v":""},null,{"$f":"IF(B443=\"\",\"\",SUMIFS('Entrées et Sorties'!E$5:E$397,'Entrées et Sorties'!D$5:D$397,C443))","v":""},{"$f":"IF(C443=\"\",\"\",SUMIFS('Entrées et Sorties'!F$5:F$497,'Entrées et Sorties'!D$5:D$497,C443))","v":""},""]
[null,null,{"$f":"IF('Liste articles'!C444=\"\",\"\",'Liste articles'!C444)","v":""},null,{"$f":"IF(B444=\"\",\"\",SUMIFS('Entrées et Sorties'!E$5:E$397,'Entrées et Sorties'!D$5:D$397,C444))","v":""},{"$f":"IF(C444=\"\",\"\",SUMIFS('Entrées et Sorties'!F$5:F$497,'Entrées et Sorties'!D$5:D$497,C444))","v":""},""]
[null,null,{"$f":"IF('Liste articles'!C445=\"\",\"\",'Liste articles'!C445)","v":""},null,{"$f":"IF(B445=\"\",\"\",SUMIFS('Entrées et Sorties'!E$5:E$397,'Entrées et Sorties'!D$5:D$397,C445))","v":""},{"$f":"IF(C445=\"\",\"\",SUMIFS('Entrées et Sorties'!F$5:F$497,'Entrées et Sorties'!D$5:D$497,C445))","v":""},""]
[null,null,{"$f":"IF('Liste articles'!C446=\"\",\"\",'Liste articles'!C446)","v":""},null,{"$f":"IF(B446=\"\",\"\",SUMIFS('Entrées et Sorties'!E$5:E$397,'Entrées et Sorties'!D$5:D$397,C446))","v":""},{"$f":"IF(C446=\"\",\"\",SUMIFS('Entrées et Sorties'!F$5:F$497,'Entrées et Sorties'!D$5:D$497,C446))","v":""},""]
[null,null,{"$f":"IF('Liste articles'!C447=\"\",\"\",'Liste articles'!C447)","v":""},null,{"$f":"IF(B447=\"\",\"\",SUMIFS('Entrées et Sorties'!E$5:E$397,'Entrées et Sorties'!D$5:D$397,C447))","v":""},{"$f":"IF(C447=\"\",\"\",SUMIFS('Entrées et Sorties'!F$5:F$497,'Entrées et Sorties'!D$5:D$497,C447))","v":""},""]
[null,null,{"$f":"IF('Liste articles'!C448=\"\",\"\",'Liste articles'!C448)","v":""},null,{"$f":"IF(B448=\"\",\"\",SUMIFS('Entrées et Sorties'!E$5:E$397,'Entrées et Sorties'!D$5:D$397,C448))","v":""},{"$f":"IF(C448=\"\",\"\",SUMIFS('Entrées et Sorties'!F$5:F$497,'Entrées et Sorties'!D$5:D$497,C448))","v":""},""]
[null,null,{"$f":"IF('Liste articles'!C449=\"\",\"\",'Liste articles'!C449)","v":""},null,{"$f":"IF(B449=\"\",\"\",SUMIFS('Entrées et Sorties'!E$5:E$397,'Entrées et Sorties'!D$5:D$397,C449))","v":""},{"$f":"IF(C449=\"\",\"\",SUMIFS('Entrées et Sorties'!F$5:F$497,'Entrées et Sorties'!D$5:D$497,C449))","v":""},""]
[null,null,{"$f":"IF('Liste articles'!C450=\"\",\"\",'Liste articles'!C450)","v":""},null,{"$f":"IF(B450=\"\",\"\",SUMIFS('Entrées et Sorties'!E$5:E$397,'Entrées et Sorties'!D$5:D$397,C450))","v":""},{"$f":"IF(C450=\"\",\"\",SUMIFS('Entrées et Sorties'!F$5:F$497,'Entrées et Sorties'!D$5:D$497,C450))","v":""},""]
[null,null,{"$f":"IF('Liste articles'!C451=\"\",\"\",'Liste articles'!C451)","v":""},null,{"$f":"IF(B451=\"\",\"\",SUMIFS('Entrées et Sorties'!E$5:E$397,'Entrées et Sorties'!D$5:D$397,C451))","v":""},{"$f":"IF(C451=\"\",\"\",SUMIFS('Entrées et Sorties'!F$5:F$497,'Entrées et Sorties'!D$5:D$497,C451))","v":""},""]
[null,null,{"$f":"IF('Liste articles'!C452=\"\",\"\",'Liste articles'!C452)","v":""},null,{"$f":"IF(B452=\"\",\"\",SUMIFS('Entrées et Sorties'!E$5:E$397,'Entrées et Sorties'!D$5:D$397,C452))","v":""},{"$f":"IF(C452=\"\",\"\",SUMIFS('Entrées et Sorties'!F$5:F$497,'Entrées et Sorties'!D$5:D$497,C452))","v":""},""]
[null,null,{"$f":"IF('Liste articles'!C453=\"\",\"\",'Liste articles'!C453)","v":""},null,{"$f":"IF(B453=\"\",\"\",SUMIFS('Entrées et Sorties'!E$5:E$397,'Entrées et Sorties'!D$5:D$397,C453))","v":""},{"$f":"IF(C453=\"\",\"\",SUMIFS('Entrées et Sorties'!F$5:F$497,'Entrées et Sorties'!D$5:D$497,C453))","v":""},""]
[null,null,{"$f":"IF('Liste articles'!C454=\"\",\"\",'Liste articles'!C454)","v":""},null,{"$f":"IF(B454=\"\",\"\",SUMIFS('Entrées et Sorties'!E$5:E$397,'Entrées et Sorties'!D$5:D$397,C454))","v":""},{"$f":"IF(C454=\"\",\"\",SUMIFS('Entrées et Sorties'!F$5:F$497,'Entrées et Sorties'!D$5:D$497,C454))","v":""},""]
[null,null,{"$f":"IF('Liste articles'!C455=\"\",\"\",'Liste articles'!C455)","v":""},null,{"$f":"IF(B455=\"\",\"\",SUMIFS('Entrées et Sorties'!E$5:E$397,'Entrées et Sorties'!D$5:D$397,C455))","v":""},{"$f":"IF(C455=\"\",\"\",SUMIFS('Entrées et Sorties'!F$5:F$497,'Entrées et Sorties'!D$5:D$497,C455))","v":""},""]
[null,null,{"$f":"IF('Liste articles'!C456=\"\",\"\",'Liste articles'!C456)","v":""},null,{"$f":"IF(B456=\"\",\"\",SUMIFS('Entrées et Sorties'!E$5:E$397,'Entrées et Sorties'!D$5:D$397,C456))","v":""},{"$f":"IF(C456=\"\",\"\",SUMIFS('Entrées et Sorties'!F$5:F$497,'Entrées et Sorties'!D$5:D$497,C456))","v":""},""]
[null,null,{"$f":"IF('Liste articles'!C457=\"\",\"\",'Liste articles'!C457)","v":""},null,{"$f":"IF(B457=\"\",\"\",SUMIFS('Entrées et Sorties'!E$5:E$397,'Entrées et Sorties'!D$5:D$397,C457))","v":""},{"$f":"IF(C457=\"\",\"\",SUMIFS('Entrées et Sorties'!F$5:F$497,'Entrées et Sorties'!D$5:D$497,C457))","v":""}]
[null,null,{"$f":"IF('Liste articles'!C458=\"\",\"\",'Liste articles'!C458)","v":""},null,{"$f":"IF(B458=\"\",\"\",SUMIFS('Entrées et Sorties'!E$5:E$397,'Entrées et Sorties'!D$5:D$397,C458))","v":""},{"$f":"IF(C458=\"\",\"\",SUMIFS('Entrées et Sorties'!F$5:F$497,'Entrées et Sorties'!D$5:D$497,C458))","v":""}]
[null,null,{"$f":"IF('Liste articles'!C459=\"\",\"\",'Liste articles'!C459)","v":""},null,{"$f":"IF(B459=\"\",\"\",SUMIFS('Entrées et Sorties'!E$5:E$397,'Entrées et Sorties'!D$5:D$397,C459))","v":""},{"$f":"IF(C459=\"\",\"\",SUMIFS('Entrées et Sorties'!F$5:F$497,'Entrées et Sorties'!D$5:D$497,C459))","v":""}]
[null,null,{"$f":"IF('Liste articles'!C460=\"\",\"\",'Liste articles'!C460)","v":""},null,{"$f":"IF(B460=\"\",\"\",SUMIFS('Entrées et Sorties'!E$5:E$397,'Entrées et Sorties'!D$5:D$397,C460))","v":""},{"$f":"IF(C460=\"\",\"\",SUMIFS('Entrées et Sorties'!F$5:F$497,'Entrées et Sorties'!D$5:D$497,C460))","v":""}]
[null,null,null,null,{"$f":"IF(B461=\"\",\"\",SUMIFS('Entrées et Sorties'!E$5:E$397,'Entrées et Sorties'!D$5:D$397,C461))","v":""},{"$f":"IF(C461=\"\",\"\",SUMIFS('Entrées et Sorties'!F$5:F$497,'Entrées et Sorties'!D$5:D$497,C461))","v":""}]
[null,null,null,null,{"$f":"IF(B462=\"\",\"\",SUMIFS('Entrées et Sorties'!E$5:E$397,'Entrées et Sorties'!D$5:D$397,C462))","v":""}]
[null,null,null,null,{"$f":"IF(B463=\"\",\"\",SUMIFS('Entrées et Sorties'!E$5:E$397,'Entrées et Sorties'!D$5:D$397,C463))","v":""}]
[null,null,null,null,{"$f":"IF(B464=\"\",\"\",SUMIFS('Entrées et Sorties'!E$5:E$397,'Entrées et Sorties'!D$5:D$397,C464))","v":""}]