{"text_format":"1","workbook":"xlsx","n_sheets":5,"sheets":["GESTION","BASE","SOLDE","BDX","Données"],"not_rendered":{"charts":0,"images":0,"macros":1,"external_links":0,"defined_names":6,"comments":2,"pivot_tables":0},"unopened":[],"bounds":{"document_bytes":16777216,"sheet_cells":100000,"rows_first":2000,"rows_last":500,"rows_between":2000,"halvings":0,"cell_chars":16384,"cell_head_chars":4096},"cells_cut":0,"cells_raw":0,"read":"whole","date_system":"1900"}

{"sheet":"GESTION","index":0,"n_rows":3,"n_cols":4,"rows_kept":3,"cut":false,"hidden":false,"merged":[]}
[null,"Date de la demande :","1900-01-01"]
[]
["Indiquer ici le n° de sortie à effectuer :","BDX 101",null,"Cliquer"]

{"sheet":"BASE","index":1,"n_rows":1095,"n_cols":10,"rows_kept":1095,"cut":false,"hidden":false,"merged":[]}
["N° Conteneur","Date entrée","CODE ART","LIBELLE",null,null,null,"BDX 100",null,"021900507"]
["CAXU 631779/0  ","2013-12-08","021100106","NED BARONNE                   ",null,null,null,"BDX 101",null,"022800100"]
["CAXU 631779/0  ","2013-12-08","021100107","NED EDELROOD 2007             ",null,null,null,"BDX 102",null,"0021100118 "]
["CAXU 631779/0  ","2013-12-08","021100108","NED CHARDONNAY 2008           ",null,null,null,"BDX 103",null,"021100106"]
["CAXU 631779/0  ","2013-12-08","021100113","NED SPECIAL LATE HARVEST      ",null,null,null,"BDX 104",null,"021100107"]
["CAXU 631779/0  ","2013-12-08","021100114","NED CHARDONNAY                ",null,null,null,"BDX 105",null,"021100108"]
["CAXU 631779/0  ","2013-12-08","021100115","NEDERBURG LYRIC               ",null,null,null,"BDX 106",null,"021100113"]
["CAXU 631779/0  ","2013-12-08","021100116","NEDERBURG CAB SAUV 2008       ",null,null,null,"BDX 107",null,"021100114"]
["CAXU 631779/0  ","2013-12-08","021100118","NEDERBURG ROSE 2009           ",null,null,null,"BDX 108",null,"021100115"]
["CAXU 631779/0  ","2013-12-08","021100119","NEDERBURG SHIRAZ              ",null,null,null,"BDX 109",null,"021100116"]
["CAXU 631779/0  ","2013-12-08","021100300","NEDERBURG 1ERE CUVEE BRUT     ",null,null,null,"BDX 110",null,"021100116    "]
["CAXU 631779/0  ","2013-12-08","021100301","NEDERBURG SAUVIGNON BLC       ",null,null,null,"BDX 111",null,"021100118"]
["CAXU 631779/0  ","2013-12-08","021100302","NEDERBURG ROSE                ",null,null,null,"BDX 112",null,"021100119"]
["CAXU 631779/0  ","2013-12-08","021100340","NED WINEMASTERS RHINE RIESLING",null,null,null,"BDX 113",null,"021100119 "]
["CAXU 631779/0  ","2013-12-08","021200307","ZONNEBLOEM SHIRAZ 2007        ",null,null,null,"BDX 114",null,"021100300"]
["CAXU 631779/0  ","2013-12-08","021200308","ZONNEBLOEM PINOTAGE           ",null,null,null,"BDX 115",null,"021100300 "]
["CAXU 631779/0  ","2013-12-08","021200309","ZONNEBLOEM CAB SAUV           ",null,null,null,"BDX 116",null,"021100301"]
["CAXU 631779/0  ","2013-12-08","021200311","ZONNEBLOEM SAUVIGNON BLC 2010 ",null,null,null,"BDX 117",null,"021100302"]
["CAXU 631779/0  ","2013-12-08","021200403","ZONNEBLOEM CHARDONNAY         ",null,null,null,"BDX 118",null,"021100340"]
["CAXU 631779/0  ","2013-12-08","021200404","ZONNEBLOEM SHIRAZ             ",null,null,null,"BDX 119",null,"021100340  "]
["CAXU 631779/0  ","2013-12-08","021200508","OBIKWA PINOTAGE SAVIN 2009    ",null,null,null,"BDX 120",null,"021101000"]
["CAXU 631779/0  ","2013-12-08","021200509","OBIKWA MERLOT                 ",null,null,null,"BDX 121",null,"021101002"]
["CAXU 631779/0  ","2013-12-08","021200511","OBIKWA CHARDONNAY             ",null,null,null,"BDX 122",null,"021101003"]
["CAXU 631779/0  ","2013-12-08","021200514","OBIKWA SAUVIGNON BLANC        ",null,null,null,"BDX 123",null,"021101009"]
["CAXU 631779/0  ","2013-12-08","021200515","OBIKWA PINOTAGE ROSE          ",null,null,null,"BDX 124",null,"021102017"]
["CAXU 631779/0  ","2013-12-08","021200516","OBIKWA CHENIN BLANC           ",null,null,null,"BDX 125",null,"021102018"]
["CAXU 631779/0  ","2013-12-08","021200517","OBIKWA CABERNET SAUVIGNON     ",null,null,null,"BDX 126",null,"021200307"]
["CAXU 631779/0  ","2013-12-08","021200518","OBIKWA PINOTAGE               ",null,null,null,"BDX 127",null,"021200308"]
["CAXU 631779/0  ","2013-12-08","021200614","LIBERTAS CAB SAUVIGNON        ",null,null,null,"BDX 128",null,"021200309"]
["CAXU 631779/0  ","2013-12-08","021200615","LIBERTAS CHARDONNAY           ",null,null,null,"BDX 129",null,"021200310"]
["CAXU 631779/0  ","2013-12-08","021200616","LIBERTAS CHENIN BLANC         ",null,null,null,"BDX 130",null,"021200311"]
["CAXU 631779/0  ","2013-12-08","021200617","LIBERTAS MERLOT 2009          ",null,null,null,"BDX 131",null,"021200403"]
["CAXU 631779/0  ","2013-12-08","021200618","LIBERTAS PINOTAGE             ",null,null,null,"BDX 132",null,"021200404"]
["CAXU 631779/0  ","2013-12-08","021200623","LIBERTAS MERLOT               ",null,null,null,"BDX 133",null,"021200410"]
["CAXU 631779/0  ","2013-12-08","021200701","TWO OCEANS SHIRAZ 2012   ",null,null,null,"BDX 134",null,"021200508"]
["CAXU 631779/0  ","2013-12-08","021200702","TWO OCEANS SAUVIGNON BLC 2013",null,null,null,"BDX 135",null,"021200509"]
["CAXU 631779/0  ","2013-12-08","021200703","TWO OCEANS CAB SAUV/MERLOT 08 ",null,null,null,"BDX 136",null,"021200511"]
["CAXU 631779/0  ","2013-12-08","021200713","TWO OCEANS SHIRAZ ROSE 2007   ",null,null,null,"BDX 137",null,"021200514"]
["CAXU 631779/0  ","2013-12-08","021200714","TWO OCEANS CAB SAUV/MERLOT 09 ",null,null,null,"BDX 138",null,"021200514  "]
["CAXU 631779/0  ","2013-12-08","021200715","TWO OCEANS SHIRAZ ROSE        ",null,null,null,"BDX 139",null,"021200515"]
["CAXU 631779/0  ","2013-12-08","021200716","TWO OCEANS CHARDONNAY 2009    ",null,null,null,"BDX 140",null,"021200516"]
["CAXU 631779/0  ","2013-12-08","021200717","TWO OCEANS FH&FRUITY WHITE    ",null,null,null,"BDX 141",null,"021200517"]
["CAXU 631779/0  ","2013-12-08","021200718","TWO OCEANS SOFT&FRUITY RED    ",null,null,null,"BDX 142",null,"021200517  "]
["CAXU 631779/0  ","2013-12-08","021201000","PLAISIR DE MERLE SHIRAZ 07    ",null,null,null,null,null,"021200518"]
["CAXU 631779/0  ","2013-12-08","021201001","PLAISIR DE MERLE SAUV BLC 07  ",null,null,null,null,null,"021200518    "]
["CAXU 631779/0  ","2013-12-08","021201002","PLAISIR DE MERLE CHARDONNAY 07",null,null,null,null,null,"021200614"]
["CAXU 631779/0  ","2013-12-08","021201003","PLAISIR DE MERLE CAB SAUV 06  ",null,null,null,null,null,"021200615"]
["CAXU 631779/0  ","2013-12-08","021201004","PLAISIR DE MERLE SAUV BLC     ",null,null,null,null,null,"021200616"]
["CAXU 631779/0  ","2013-12-08","022200566","NEETHLINGSHOF THE OWL POST 08 ",null,null,null,null,null,"021200617"]
["CAXU 631779/0  ","2013-12-08","022300337","DROSTDY HOF CLARET            ",null,null,null,null,null,"021200618"]
["CAXU 631779/0  ","2013-12-08","022300338","DROSTDY HOF ADELPRACHT        ",null,null,null,null,null,"021200623"]
["CAXU 631779/0  ","2013-12-08","022300339","DROSTDY HOF NATURAL SWEET ROSE",null,null,null,null,null,"021200650           "]
["CAXU 631779/0  ","2013-12-08","022300340","DROSTDY HOF CABERNET SAUV     ",null,null,null,null,null,"021200651           "]
["CAXU 631779/0  ","2013-12-08","022300341","DROSTDY HOF CHARDONNAY        ",null,null,null,null,null,"021200652           "]
["CAXU 631779/0  ","2013-12-08","022300342","DROSTDY HOF MERLOT            ",null,null,null,null,null,"021200701"]
["CAXU 631779/0  ","2013-12-08","022300400","FLEUR DU CAP CABERNET SAUV    ",null,null,null,null,null,"021200702"]
["CAXU 631779/0  ","2013-12-08","022300401","FLEUR DU CAP CHARDONNAY       ",null,null,null,null,null,"021200703"]
["CAXU 631779/0  ","2013-12-08","022300402","FLEUR DU CAP MERLOT 2008      ",null,null,null,null,null,"021200713"]
["CAXU 631779/0  ","2013-12-08","022300403","FLEUR DU CAP PINOTAGE         ",null,null,null,null,null,"021200714"]
["CAXU 631779/0  ","2013-12-08","022300404","FLEUR DU CAP SAUVIGNON BLC    ",null,null,null,null,null,"021200715"]
{"$rows_left_out":1036}
{"sheet":"SOLDE","index":2,"n_rows":1042,"n_cols":19,"rows_kept":1042,"cut":false,"hidden":false,"merged":[]}
["N° Conteneur","Date entrée","CODE ART","TC","LIBELLE","Nombre de bouteille / carton","Nombre de bouteilles","Nombre de cartons","Stock final Bouteile","Stock Final carton","SF","Durée sejour IST en mois","BDX 99","BDX 100","BDX 101","BDX 102","BDX 103","BDX 104","BDX 105"]
["GESU 666717/1","2016-04-20","DCJAA003418",null,"MAISON GRANDEAU LAUDUC - CH. LAUDUC CLASSIC 2014 BORDEAUX ROUGE",{"$f":"IFERROR(G2/H2,0)","v":0},0,0,{"$f":"G2","v":0},{"$f":"IF(H2<=0,\"soldé\",H2)","v":"soldé"},null,{"$f":"(TODAY()-B2)/30","v":10.433333333333334},{"$f":"IFERROR(IF(J2=\"soldé\",0,VLOOKUP(SOLDE!C798,#REF!,8,0)),0)","v":0}]
["GESU 666717/1","2016-04-20","DCJAA003753",null,"MAISON GRANDEAU LAUDUC - CH. LAUDUC CLASSIC 2015 BORDEAUX BLANC",0,0,0,0,"soldé",null,10.433333333333334,{"$f":"IFERROR(IF(J3=\"soldé\",0,VLOOKUP(SOLDE!C799,#REF!,8,0)),0)","v":0}]
["TCNU 458829/0","2016-05-26","021900110",null,"LACHETEAU - TOURAINE M MARTIN LE CLOUQUIN ROUGE 75 CL (x6)",6,240,40,240,40,null,9.2333333333333325,{"$f":"IFERROR(IF(J4=\"soldé\",0,VLOOKUP(SOLDE!C868,#REF!,8,0)),0)","v":0}]
["TCNU 458829/0","2016-05-26","021900210-12",null,"LACHETEAU - TOURAINE M MARTIN LE CLOUQUIN ROUGE 37,5 CL (x12) ",12,60,5,60,5,null,9.2333333333333325,{"$f":"IFERROR(IF(J5=\"soldé\",0,VLOOKUP(SOLDE!C869,#REF!,8,0)),0)","v":0}]
["TCNU 458829/0","2016-05-26","DBZAB716633",null,"ADVINI - IGP VAR 2015 / AMALIA ROSE",0,0,0,0,"soldé",null,9.2333333333333325,{"$f":"IFERROR(IF(J6=\"soldé\",0,VLOOKUP(SOLDE!C889,#REF!,8,0)),0)","v":0}]
["TCNU 458829/0","2016-05-26","021900505",null,"PERNOD RICARD - CHIVAS REGAL WHISKY 12 YO",12,180,15,180,15,null,9.2333333333333325,{"$f":"IFERROR(IF(J7=\"soldé\",0,VLOOKUP(SOLDE!C890,#REF!,8,0)),0)","v":0}]
["TCNU 458829/0","2016-05-26","DCJAA003418",null,"GRANDEAU LAUDUC - CHÂTEAU LAUDUC ROUGE",6,156,26,156,26,{"$f":"J8-M8-N8-O8-P8-Q8-R8","v":26},9.2333333333333325,{"$f":"IFERROR(IF(J8=\"soldé\",0,VLOOKUP(SOLDE!C891,#REF!,8,0)),0)","v":0}]
["TCNU 458829/0","2016-05-26","DCJAA003753",null,"GRANDEAU LAUDUC - CHÂTEAU LAUDUC CLASSIC BLANC",6,300,50,300,50,null,9.2333333333333325,{"$f":"IFERROR(IF(J9=\"soldé\",0,VLOOKUP(SOLDE!C892,#REF!,8,0)),0)","v":0}]
["TCNU 458829/0","2016-05-26","022800008",null,"BOUQUET DE LOIRE - COTEAUX DU LAYON CLAIR DE LUNE DOM. MATIGNON",6,30,5,30,5,null,9.2333333333333325,{"$f":"IFERROR(IF(J10=\"soldé\",0,VLOOKUP(SOLDE!C893,#REF!,8,0)),0)","v":0}]
["TCNU 458829/0","2016-05-26","DAVAA000602",null,"SIMMONET FEBVRE - IRANCY ",0,0,0,0,"soldé",null,9.2333333333333325,{"$f":"IFERROR(IF(J11=\"soldé\",0,VLOOKUP(SOLDE!C894,#REF!,8,0)),0)","v":0}]
["TCNU 458829/0","2016-05-26","022800100",null,"CIDRES BIGOUD - CIDRES LE BRUN",0,0,0,0,"soldé",null,9.2333333333333325,{"$f":"IFERROR(IF(J12=\"soldé\",0,VLOOKUP(SOLDE!C895,#REF!,8,0)),0)","v":0}]
["CMAU 702637/8","2016-07-21","022800100",null,"CIDRES BIGOUD - CIDRE LE BRUN ARTISANALE",12,216,18,216,18,{"$f":"J13-M13-N13-O13-P13-Q13-R13","v":18},7.3666666666666663,0]
["CMAU 702637/8","2016-07-21","DAEAA450558",null,"PAUL JABOULET - VENTOUS LES TRAVERSES ROUGE",6,120,20,120,20,null,7.3666666666666663,{"$f":"IFERROR(IF(J14=\"soldé\",0,VLOOKUP(SOLDE!C897,#REF!,8,0)),0)","v":0}]
["CMAU 702637/8","2016-07-21","DBZAE070037",null,"ADVNI - CANON DU MARECHAL ROSE ",0,0,0,0,"soldé",null,7.3666666666666663,{"$f":"IFERROR(IF(J15=\"soldé\",0,VLOOKUP(SOLDE!C898,#REF!,8,0)),0)","v":0}]
["CMAU 702637/8","2016-07-21","DBZAE260513",null,"ADVNI - CANON DU MARECHAL BLANC",0,0,0,0,"soldé",null,7.3666666666666663,{"$f":"IFERROR(IF(J16=\"soldé\",0,VLOOKUP(SOLDE!C899,#REF!,8,0)),0)","v":0}]
["CMAU 702637/8","2016-07-21","DBZAE602030",null,"ADVNI - CANON DU MARECHAL ROUGE ",0,0,0,0,"soldé",null,7.3666666666666663,{"$f":"IFERROR(IF(J17=\"soldé\",0,VLOOKUP(SOLDE!C900,#REF!,8,0)),0)","v":0}]
["GESU 138532/3","2016-07-25","021310256",null,"MAITRES VIGNERONS - GOURMANDISE ROSE",12,600,50,600,50,{"$f":"J18-M18-N18-O18-P18-Q18-R18","v":50},7.2333333333333334,0]
["GESU 138532/3","2016-07-25","021310317",null,"CPESO - SAINT CHINIAN ROUGE",6,30,5,30,5,null,7.2333333333333334,{"$f":"IFERROR(IF(J19=\"soldé\",0,VLOOKUP(SOLDE!C902,#REF!,8,0)),0)","v":0}]
["GESU 138532/3","2016-07-25","021310304",null,"CPESO - VDP CARCASSONNE ROSE",6,60,10,60,10,null,7.2333333333333334,{"$f":"IFERROR(IF(J20=\"soldé\",0,VLOOKUP(SOLDE!C903,#REF!,8,0)),0)","v":0}]
["GESU 138532/3","2016-07-25","GAAAA003508",null,"MIGUEL TORRES - SELECCION DE TORRES SL CELESTE CRIANZA",6,120,20,120,20,null,7.2333333333333334,{"$f":"IFERROR(IF(J21=\"soldé\",0,VLOOKUP(SOLDE!C904,#REF!,8,0)),0)","v":0}]
["GESU 138532/3","2016-07-25","021300002",null,"BOULARD BAUQUAIRE - CHAMPAGNE GRANDE RESERVE",6,186,31,186,31,null,7.2333333333333334,{"$f":"IFERROR(IF(J22=\"soldé\",0,VLOOKUP(SOLDE!C905,#REF!,8,0)),0)","v":0}]
["GESU 138532/3","2016-07-25","021300005",null,"BOULARD BAUQUAIRE - CHAMPAGNE GRANDE RESERVE DEMIES 37,50 CL",6,54,9,54,9,null,7.2333333333333334,{"$f":"IFERROR(IF(J23=\"soldé\",0,VLOOKUP(SOLDE!C906,#REF!,8,0)),0)","v":0}]
["GESU 138532/3","2016-07-25","021300020",null,"BOULARD BAUQUAIRE - BRUT CARTE NOIRE",6,60,10,60,10,null,7.2333333333333334,{"$f":"IFERROR(IF(J24=\"soldé\",0,VLOOKUP(SOLDE!C907,#REF!,8,0)),0)","v":0}]
["GESU 138532/3","2016-07-25","021305106",null,"Cie VINICOLE BARON EDMOND DE ROTHSCHILD - CHÂTEAU CLARKE 2008",12,84,7,84,7,null,7.2333333333333334,{"$f":"IFERROR(IF(J25=\"soldé\",0,VLOOKUP(SOLDE!C908,#REF!,8,0)),0)","v":0}]
["GESU 138532/3","2016-07-25","021300021",null,"CHAMPAGNE AYALA - BRUT MAJEUR",6,42,7,42,7,null,7.2333333333333334,{"$f":"IFERROR(IF(J26=\"soldé\",0,VLOOKUP(SOLDE!C909,#REF!,8,0)),0)","v":0}]
["GESU 138532/3","2016-07-25","022800001",null,"BOUQUET DE LOIRE - BOUQUET MERLOT",6,630,105,630,105,{"$f":"J27-M27-N27-O27-P27-Q27-R27","v":105},7.2333333333333334,0]
["GESU 138532/3","2016-07-25","022800003",null,"BOUQUET DE LOIRE - SYRAH ROSE",6,12,2,12,2,null,7.2333333333333334,{"$f":"IFERROR(IF(J28=\"soldé\",0,VLOOKUP(SOLDE!C911,#REF!,8,0)),0)","v":0}]
["GESU 138532/3","2016-07-25","022800007",null,"BOUQUET DE LOIRE - SAINT NICOLAS DE BOURGUEIL DOM GODEFROY",6,24,4,24,4,null,7.2333333333333334,{"$f":"IFERROR(IF(J29=\"soldé\",0,VLOOKUP(SOLDE!C912,#REF!,8,0)),0)","v":0}]
["GESU 138532/3","2016-07-25","DCJAA003418",null,"GRANDEAU LAUDUC - CHÂTEAU LAUDUC CLASSIC 2014 - BDX ROUGE",6,240,40,240,40,{"$f":"J30-M30-N30-O30-P30-Q30-R30","v":40},7.2333333333333334,0]
["GESU 138532/3","2016-07-25","060220100",null,"CHAMPAGNE BOLLINGER - SPECIAL CUVEE BRUT",6,66,11,66,11,null,7.2333333333333334,{"$f":"IFERROR(IF(J31=\"soldé\",0,VLOOKUP(SOLDE!C914,#REF!,8,0)),0)","v":0}]
["GESU 138532/3","2016-07-25","021500203",null,"PAUL JABOULET - COTES DU RHONE PARALLELE 45 ROUGE",6,240,40,240,40,{"$f":"J32-M32-N32-O32-P32-Q32-R32","v":40},7.2333333333333334,0]
["CLHU 470324/0","2016-08-02","021100301",null,"NEDERBURG SAUVIGNON BLANC",6,240,40,240,40,null,6.9666666666666668,{"$f":"IFERROR(IF(J33=\"soldé\",0,VLOOKUP(SOLDE!C916,#REF!,8,0)),0)","v":0}]
["CLHU 470324/0","2016-08-02","021100118",null,"NEDERBURG (FOUNDATION) - ROSE CABERNET FRANC/MERLOT/SHIRAZ",12,204,17,204,17,null,6.9666666666666668,{"$f":"IFERROR(IF(J34=\"soldé\",0,VLOOKUP(SOLDE!C917,#REF!,8,0)),0)","v":0}]
["CLHU 470324/0","2016-08-02","021100114",null,"NEDERBURG CHARDONNAY",6,558,93,558,93,null,6.9666666666666668,{"$f":"IFERROR(IF(J35=\"soldé\",0,VLOOKUP(SOLDE!C918,#REF!,8,0)),0)","v":0}]
["CLHU 470324/0","2016-08-02","022300600",null,"SAVANNA DRY CIDER 33 CL",24,744,31,744,31,{"$f":"J36-M36-N36-O36-P36-Q36-R36","v":31},6.9666666666666668,{"$f":"IFERROR(IF(J36=\"soldé\",0,VLOOKUP(SOLDE!C919,#REF!,8,0)),0)","v":0}]
["CLHU 470324/0","2016-08-02","021100119",null,"NEDERBURG SHIRAZ ",6,300,50,300,50,null,6.9666666666666668,{"$f":"IFERROR(IF(J37=\"soldé\",0,VLOOKUP(SOLDE!C920,#REF!,8,0)),0)","v":0}]
["CLHU 470324/0","2016-08-02","021200403",null,"ZONNEBLOEM CHARDONNAY",6,162,27,162,27,null,6.9666666666666668,{"$f":"IFERROR(IF(J38=\"soldé\",0,VLOOKUP(SOLDE!C921,#REF!,8,0)),0)","v":0}]
["CLHU 470324/0","2016-08-02","021200311",null,"ZONNEBLOEM SAUVIGNON BLANC",6,180,30,180,30,null,6.9666666666666668,{"$f":"IFERROR(IF(J39=\"soldé\",0,VLOOKUP(SOLDE!C922,#REF!,8,0)),0)","v":0}]
["CLHU 470324/0","2016-08-02","021201006",null,"PLAISIR DE MERLE PETIT PLAISIR SHIRAZ",6,270,45,270,45,null,6.9666666666666668,{"$f":"IFERROR(IF(J40=\"soldé\",0,VLOOKUP(SOLDE!C923,#REF!,8,0)),0)","v":0}]
["CLHU 470324/0","2016-08-02","021201005",null,"PLAISIR DE MERLE MCC GRAND BRUT",6,540,90,540,90,null,6.9666666666666668,{"$f":"IFERROR(IF(J41=\"soldé\",0,VLOOKUP(SOLDE!C924,#REF!,8,0)),0)","v":0}]
["CLHU 470324/0","2016-08-02","022300343",null,"DROSTDY HOF ROUGE",4,24,6,24,6,null,6.9666666666666668,{"$f":"IFERROR(IF(J42=\"soldé\",0,VLOOKUP(SOLDE!C925,#REF!,8,0)),0)","v":0}]
["CLHU 470324/0","2016-08-02","DABAA355257",null,"SARL CPESO - CHÂTEAU TREILLE DE CANDALE - BORDEAUX ROUGE",0,0,0,0,"soldé",null,6.9666666666666668,{"$f":"IFERROR(IF(J43=\"soldé\",0,VLOOKUP(SOLDE!C926,#REF!,8,0)),0)","v":0}]
["CLHU 470324/0","2016-08-02","021320101",null,"SARL CPESO - CHÂTEAU TREILLE DE CANDALE - BORDEAUX BLANC SEC",0,0,0,0,"soldé",null,6.9666666666666668,{"$f":"IFERROR(IF(J44=\"soldé\",0,VLOOKUP(SOLDE!C927,#REF!,8,0)),0)","v":0}]
["CLHU 470324/0","2016-08-02",null,null,"DECLARE DANS TCNU 458829/0",0,0,0,0,"soldé",null,6.9666666666666668,{"$f":"IFERROR(IF(J45=\"soldé\",0,VLOOKUP(SOLDE!C928,#REF!,8,0)),0)","v":0}]
["DR 23079 - TRANSFERT SOUS DOUANE","2016-07-11","021200509",null,"OBIKWA MERLOT",0,0,0,0,"soldé",null,7.7,{"$f":"IFERROR(IF(J46=\"soldé\",0,VLOOKUP(SOLDE!C929,#REF!,8,0)),0)","v":0}]
["DR 23079 - TRANSFERT SOUS DOUANE","2016-07-11","021200515",null,"OBIKWA ROSE",0,0,0,0,"soldé",null,7.7,{"$f":"IFERROR(IF(J47=\"soldé\",0,VLOOKUP(SOLDE!C930,#REF!,8,0)),0)","v":0}]
["DR 23079 - TRANSFERT SOUS DOUANE","2016-07-11","021200516",null,"OBIKWA CHENIN BLANC",0,0,0,0,"soldé",null,7.7,{"$f":"IFERROR(IF(J48=\"soldé\",0,VLOOKUP(SOLDE!C931,#REF!,8,0)),0)","v":0}]
["DR 23079 - TRANSFERT SOUS DOUANE","2016-07-11","021200518",null,"OBIKWA PINOTAGE",0,0,0,0,"soldé",null,7.7,{"$f":"IFERROR(IF(J49=\"soldé\",0,VLOOKUP(SOLDE!C932,#REF!,8,0)),0)","v":0}]
["DR 23080 - TRANSFERT SOUS DOUANE","2016-07-11","021200518",null,"OBIKWA PINOTAGE",0,0,0,0,"soldé",null,7.7,{"$f":"IFERROR(IF(J50=\"soldé\",0,VLOOKUP(SOLDE!C933,#REF!,8,0)),0)","v":0}]
["DR 23080 - TRANSFERT SOUS DOUANE","2016-07-11","021200516",null,"OBIKWA CHENIN BLANC",0,0,0,0,"soldé",null,7.7,{"$f":"IFERROR(IF(J51=\"soldé\",0,VLOOKUP(SOLDE!C934,#REF!,8,0)),0)","v":0}]
["TCLU 719886/9","2016-08-11","021900561",null,"LOUIS LATOUR - POMMARD",6,30,5,30,5,null,6.666666666666667,{"$f":"IFERROR(IF(J52=\"soldé\",0,VLOOKUP(SOLDE!C935,#REF!,8,0)),0)","v":0}]
["TCLU 719886/9","2016-08-11","021900558",null,"LOUIS LATOUR - GEVREY-CHAMBERTIN",0,0,0,0,"soldé",null,6.666666666666667,{"$f":"IFERROR(IF(J53=\"soldé\",0,VLOOKUP(SOLDE!C936,#REF!,8,0)),0)","v":0}]
["CMAU 598908/6","2017-01-17","021201006",null,"PLAISIR DE MERLE PETIT PLAISIR",6,66,11,66,11,null,1.3666666666666667,{"$f":"IFERROR(IF(J54=\"soldé\",0,VLOOKUP(SOLDE!C1028,#REF!,8,0)),0)","v":0}]
["CMAU 598908/6","2017-01-18","021200615",null,"LIBERTAS CHARDONNAY 2015",6,186,31,186,31,null,1.3333333333333333,{"$f":"IFERROR(IF(J55=\"soldé\",0,VLOOKUP(SOLDE!C1029,#REF!,8,0)),0)","v":0}]
["CMAU 598908/6","2017-01-29","021200718",null,"TWO OCEANS SOFT & FRUITY RED",12,36,3,36,3,null,0.96666666666666667,{"$f":"IFERROR(IF(J56=\"soldé\",0,VLOOKUP(SOLDE!C1040,#REF!,8,0)),0)","v":0}]
["CAXU 631779/0  ","2013-12-08","021100106",null,"NED BARONNE                   ",0,0,0,0,"soldé",null,39.233333333333334,{"$f":"IFERROR(IF(J57=\"soldé\",0,VLOOKUP(SOLDE!C2,#REF!,8,0)),0)","v":0}]
["CAXU 631779/0  ","2013-12-08","021100107",null,"NED EDELROOD 2007             ",0,0,0,0,"soldé",null,39.233333333333334,{"$f":"IFERROR(IF(J58=\"soldé\",0,VLOOKUP(SOLDE!C3,#REF!,8,0)),0)","v":0}]
["CAXU 631779/0  ","2013-12-08","021100108",null,"NED CHARDONNAY 2008           ",0,0,0,0,"soldé",null,39.233333333333334,{"$f":"IFERROR(IF(J59=\"soldé\",0,VLOOKUP(SOLDE!C4,#REF!,8,0)),0)","v":0}]
["CAXU 631779/0  ","2013-12-08","021100113",{"$f":"+A60","v":"CAXU 631779/0  "},"NED SPECIAL LATE HARVEST      ",0,0,0,0,"soldé",null,39.233333333333334,{"$f":"IFERROR(IF(J60=\"soldé\",0,VLOOKUP(SOLDE!C5,#REF!,8,0)),0)","v":0}]
{"$rows_left_out":983}
{"sheet":"BDX","index":3,"n_rows":7,"n_cols":5,"rows_kept":7,"cut":false,"hidden":false,"merged":[[0,8,0,12]]}
[]
[]
[]
[]
[]
["CODE ART","LIB ART","Bouteilles/Cartons","TC","DATE"]
["DCIAA211135",{"$f":"VLOOKUP(A7,SOLDE!C:F,3,0)","v":"DOMAINE R. DUBOIS - BOURGOGNE PASSETOUTGRAINS ROUGE"},null,"MSCU 394215/8","2014-06-06"]

{"sheet":"Données","index":4,"n_rows":5,"n_cols":3,"rows_kept":5,"cut":false,"hidden":false,"merged":[]}
[]
[null,"CAXU 631779/0  ","2013-12-08"]
[null,"MEDU 349062/4","2013-12-08"]
[null,"MSCU 394215/8","2014-06-06"]
[null,"MSCU 017755/9","2016-03-03"]