{"text_format":"1","workbook":"xlsx","n_sheets":5,"sheets":["GESTION","BASE","SOLDE","BDX","Données"],"not_rendered":{"charts":0,"images":0,"macros":1,"external_links":0,"defined_names":6,"comments":2,"pivot_tables":0},"unopened":[],"bounds":{"document_bytes":16777216,"sheet_cells":100000,"rows_first":2000,"rows_last":500,"rows_between":2000,"halvings":0,"cell_chars":16384,"cell_head_chars":4096},"cells_cut":0,"cells_raw":0,"read":"whole","date_system":"1900"}

{"sheet":"GESTION","index":0,"n_rows":3,"n_cols":4,"rows_kept":3,"cut":false,"hidden":false,"merged":[]}
[null,"Date de la demande :","1900-01-01"]
[]
["Indiquer ici le n° de sortie à effectuer :","BDX 101",null,"Cliquer"]

{"sheet":"BASE","index":1,"n_rows":1095,"n_cols":10,"rows_kept":1095,"cut":false,"hidden":false,"merged":[]}
["N° Conteneur","Date entrée","CODE ART","LIBELLE",null,null,null,"BDX 100",null,"021900507"]
["CAXU 631779/0  ","2013-12-08","021100106","NED BARONNE                   ",null,null,null,"BDX 101",null,"022800100"]
["CAXU 631779/0  ","2013-12-08","021100107","NED EDELROOD 2007             ",null,null,null,"BDX 102",null,"0021100118 "]
["CAXU 631779/0  ","2013-12-08","021100108","NED CHARDONNAY 2008           ",null,null,null,"BDX 103",null,"021100106"]
["CAXU 631779/0  ","2013-12-08","021100113","NED SPECIAL LATE HARVEST      ",null,null,null,"BDX 104",null,"021100107"]
["CAXU 631779/0  ","2013-12-08","021100114","NED CHARDONNAY                ",null,null,null,"BDX 105",null,"021100108"]
["CAXU 631779/0  ","2013-12-08","021100115","NEDERBURG LYRIC               ",null,null,null,"BDX 106",null,"021100113"]
["CAXU 631779/0  ","2013-12-08","021100116","NEDERBURG CAB SAUV 2008       ",null,null,null,"BDX 107",null,"021100114"]
["CAXU 631779/0  ","2013-12-08","021100118","NEDERBURG ROSE 2009           ",null,null,null,"BDX 108",null,"021100115"]
["CAXU 631779/0  ","2013-12-08","021100119","NEDERBURG SHIRAZ              ",null,null,null,"BDX 109",null,"021100116"]
["CAXU 631779/0  ","2013-12-08","021100300","NEDERBURG 1ERE CUVEE BRUT     ",null,null,null,"BDX 110",null,"021100116    "]
["CAXU 631779/0  ","2013-12-08","021100301","NEDERBURG SAUVIGNON BLC       ",null,null,null,"BDX 111",null,"021100118"]
["CAXU 631779/0  ","2013-12-08","021100302","NEDERBURG ROSE                ",null,null,null,"BDX 112",null,"021100119"]
["CAXU 631779/0  ","2013-12-08","021100340","NED WINEMASTERS RHINE RIESLING",null,null,null,"BDX 113",null,"021100119 "]
["CAXU 631779/0  ","2013-12-08","021200307","ZONNEBLOEM SHIRAZ 2007        ",null,null,null,"BDX 114",null,"021100300"]
["CAXU 631779/0  ","2013-12-08","021200308","ZONNEBLOEM PINOTAGE           ",null,null,null,"BDX 115",null,"021100300 "]
["CAXU 631779/0  ","2013-12-08","021200309","ZONNEBLOEM CAB SAUV           ",null,null,null,"BDX 116",null,"021100301"]
["CAXU 631779/0  ","2013-12-08","021200311","ZONNEBLOEM SAUVIGNON BLC 2010 ",null,null,null,"BDX 117",null,"021100302"]
["CAXU 631779/0  ","2013-12-08","021200403","ZONNEBLOEM CHARDONNAY         ",null,null,null,"BDX 118",null,"021100340"]
["CAXU 631779/0  ","2013-12-08","021200404","ZONNEBLOEM SHIRAZ             ",null,null,null,"BDX 119",null,"021100340  "]
["CAXU 631779/0  ","2013-12-08","021200508","OBIKWA PINOTAGE SAVIN 2009    ",null,null,null,"BDX 120",null,"021101000"]
["CAXU 631779/0  ","2013-12-08","021200509","OBIKWA MERLOT                 ",null,null,null,"BDX 121",null,"021101002"]
["CAXU 631779/0  ","2013-12-08","021200511","OBIKWA CHARDONNAY             ",null,null,null,"BDX 122",null,"021101003"]
["CAXU 631779/0  ","2013-12-08","021200514","OBIKWA SAUVIGNON BLANC        ",null,null,null,"BDX 123",null,"021101009"]
["CAXU 631779/0  ","2013-12-08","021200515","OBIKWA PINOTAGE ROSE          ",null,null,null,"BDX 124",null,"021102017"]
["CAXU 631779/0  ","2013-12-08","021200516","OBIKWA CHENIN BLANC           ",null,null,null,"BDX 125",null,"021102018"]
["CAXU 631779/0  ","2013-12-08","021200517","OBIKWA CABERNET SAUVIGNON     ",null,null,null,"BDX 126",null,"021200307"]
["CAXU 631779/0  ","2013-12-08","021200518","OBIKWA PINOTAGE               ",null,null,null,"BDX 127",null,"021200308"]
["CAXU 631779/0  ","2013-12-08","021200614","LIBERTAS CAB SAUVIGNON        ",null,null,null,"BDX 128",null,"021200309"]
["CAXU 631779/0  ","2013-12-08","021200615","LIBERTAS CHARDONNAY           ",null,null,null,"BDX 129",null,"021200310"]
["CAXU 631779/0  ","2013-12-08","021200616","LIBERTAS CHENIN BLANC         ",null,null,null,"BDX 130",null,"021200311"]
["CAXU 631779/0  ","2013-12-08","021200617","LIBERTAS MERLOT 2009          ",null,null,null,"BDX 131",null,"021200403"]
["CAXU 631779/0  ","2013-12-08","021200618","LIBERTAS PINOTAGE             ",null,null,null,"BDX 132",null,"021200404"]
["CAXU 631779/0  ","2013-12-08","021200623","LIBERTAS MERLOT               ",null,null,null,"BDX 133",null,"021200410"]
["CAXU 631779/0  ","2013-12-08","021200701","TWO OCEANS SHIRAZ 2012   ",null,null,null,"BDX 134",null,"021200508"]
["CAXU 631779/0  ","2013-12-08","021200702","TWO OCEANS SAUVIGNON BLC 2013",null,null,null,"BDX 135",null,"021200509"]
["CAXU 631779/0  ","2013-12-08","021200703","TWO OCEANS CAB SAUV/MERLOT 08 ",null,null,null,"BDX 136",null,"021200511"]
["CAXU 631779/0  ","2013-12-08","021200713","TWO OCEANS SHIRAZ ROSE 2007   ",null,null,null,"BDX 137",null,"021200514"]
["CAXU 631779/0  ","2013-12-08","021200714","TWO OCEANS CAB SAUV/MERLOT 09 ",null,null,null,"BDX 138",null,"021200514  "]
["CAXU 631779/0  ","2013-12-08","021200715","TWO OCEANS SHIRAZ ROSE        ",null,null,null,"BDX 139",null,"021200515"]
["CAXU 631779/0  ","2013-12-08","021200716","TWO OCEANS CHARDONNAY 2009    ",null,null,null,"BDX 140",null,"021200516"]
["CAXU 631779/0  ","2013-12-08","021200717","TWO OCEANS FH&FRUITY WHITE    ",null,null,null,"BDX 141",null,"021200517"]
["CAXU 631779/0  ","2013-12-08","021200718","TWO OCEANS SOFT&FRUITY RED    ",null,null,null,"BDX 142",null,"021200517  "]
["CAXU 631779/0  ","2013-12-08","021201000","PLAISIR DE MERLE SHIRAZ 07    ",null,null,null,null,null,"021200518"]
["CAXU 631779/0  ","2013-12-08","021201001","PLAISIR DE MERLE SAUV BLC 07  ",null,null,null,null,null,"021200518    "]
["CAXU 631779/0  ","2013-12-08","021201002","PLAISIR DE MERLE CHARDONNAY 07",null,null,null,null,null,"021200614"]
["CAXU 631779/0  ","2013-12-08","021201003","PLAISIR DE MERLE CAB SAUV 06  ",null,null,null,null,null,"021200615"]
["CAXU 631779/0  ","2013-12-08","021201004","PLAISIR DE MERLE SAUV BLC     ",null,null,null,null,null,"021200616"]
["CAXU 631779/0  ","2013-12-08","022200566","NEETHLINGSHOF THE OWL POST 08 ",null,null,null,null,null,"021200617"]
["CAXU 631779/0  ","2013-12-08","022300337","DROSTDY HOF CLARET            ",null,null,null,null,null,"021200618"]
["CAXU 631779/0  ","2013-12-08","022300338","DROSTDY HOF ADELPRACHT        ",null,null,null,null,null,"021200623"]
["CAXU 631779/0  ","2013-12-08","022300339","DROSTDY HOF NATURAL SWEET ROSE",null,null,null,null,null,"021200650           "]
["CAXU 631779/0  ","2013-12-08","022300340","DROSTDY HOF CABERNET SAUV     ",null,null,null,null,null,"021200651           "]
["CAXU 631779/0  ","2013-12-08","022300341","DROSTDY HOF CHARDONNAY        ",null,null,null,null,null,"021200652           "]
["CAXU 631779/0  ","2013-12-08","022300342","DROSTDY HOF MERLOT            ",null,null,null,null,null,"021200701"]
["CAXU 631779/0  ","2013-12-08","022300400","FLEUR DU CAP CABERNET SAUV    ",null,null,null,null,null,"021200702"]
["CAXU 631779/0  ","2013-12-08","022300401","FLEUR DU CAP CHARDONNAY       ",null,null,null,null,null,"021200703"]
["CAXU 631779/0  ","2013-12-08","022300402","FLEUR DU CAP MERLOT 2008      ",null,null,null,null,null,"021200713"]
["CAXU 631779/0  ","2013-12-08","022300403","FLEUR DU CAP PINOTAGE         ",null,null,null,null,null,"021200714"]
["CAXU 631779/0  ","2013-12-08","022300404","FLEUR DU CAP SAUVIGNON BLC    ",null,null,null,null,null,"021200715"]
["CAXU 631779/0  ","2013-12-08","022300405","FLEUR DU CAP SHIRAZ           ",null,null,null,null,null,"021200716"]
["CAXU 631779/0  ","2013-12-08","022300502","NEETHLINGSHOF CHARD NO WOOD   ",null,null,null,null,null,"021200717"]
["CAXU 631779/0  ","2013-12-08","022300503","NEETHLINGSHOF CARACAL         ",null,null,null,null,null,"021200718"]
["CAXU 631779/0  ","2013-12-08","022300505","NEETHLINGSHOF MALBEC          ",null,null,null,null,null,"021201000"]
["CAXU 631779/0  ","2013-12-08","022300567","NEETHLINGSHOF GEWURZTRAMIN    ",null,null,null,null,null,"021201001"]
["CAXU 631779/0  ","2013-12-08","022300568","NEETHLINGSHOF SHIRAZ          ",null,null,null,null,null,"021201002"]
["CAXU 631779/0  ","2013-12-08","022300600","SAVANNA DRY 33CL.             ",null,null,null,null,null,"021201003"]
[null,null,null,null,null,null,null,null,null,"021201004"]
["MEDU 349062/4","2013-12-08","021100106","NED BARONNE                   ",null,null,null,null,null,"021201005"]
["MEDU 349062/4","2013-12-08","021100107","NED EDELROOD 2007             ",null,null,null,null,null,"021201006"]
["MEDU 349062/4","2013-12-08","021100108","NED CHARDONNAY 2008           ",null,null,null,null,null,"021202001"]
["MEDU 349062/4","2013-12-08","021100113","NED SPECIAL LATE HARVEST      ",null,null,null,null,null,"021300001"]
["MEDU 349062/4","2013-12-08","021100114","NED CHARDONNAY                ",null,null,null,null,null,"021300002"]
["MEDU 349062/4","2013-12-08","021100115","NEDERBURG LYRIC               ",null,null,null,null,null,"021300004"]
["MEDU 349062/4","2013-12-08","021100116","NEDERBURG CAB SAUV 2008       ",null,null,null,null,null,"021300005"]
["MEDU 349062/4","2013-12-08","021100118","NEDERBURG ROSE 2009           ",null,null,null,null,null,"021300006"]
["MEDU 349062/4","2013-12-08","021100119","NEDERBURG SHIRAZ              ",null,null,null,null,null,"021300007"]
["MEDU 349062/4","2013-12-08","021100300","NEDERBURG 1ERE CUVEE BRUT     ",null,null,null,null,null,"021300008"]
["MEDU 349062/4","2013-12-08","021100301","NEDERBURG SAUVIGNON BLC       ",null,null,null,null,null,"021300009"]
["MEDU 349062/4","2013-12-08","021100302","NEDERBURG ROSE                ",null,null,null,null,null,"021300020"]
["MEDU 349062/4","2013-12-08","021100340","NED WINEMASTERS RHINE RIESLING",null,null,null,null,null,"021300021"]
["MEDU 349062/4","2013-12-08","021200307","ZONNEBLOEM SHIRAZ 2007        ",null,null,null,null,null,"021300022"]
["MEDU 349062/4","2013-12-08","021200308","ZONNEBLOEM PINOTAGE           ",null,null,null,null,null,"021300618"]
["MEDU 349062/4","2013-12-08","021200309","ZONNEBLOEM CAB SAUV           ",null,null,null,null,null,"021305011"]
["MEDU 349062/4","2013-12-08","021200311","ZONNEBLOEM SAUVIGNON BLC 2010 ",null,null,null,null,null,"021305012-12"]
["MEDU 349062/4","2013-12-08","021200403","ZONNEBLOEM CHARDONNAY         ",null,null,null,null,null,"021305105"]
["MEDU 349062/4","2013-12-08","021200404","ZONNEBLOEM SHIRAZ             ",null,null,null,null,null,"021305106"]
["MEDU 349062/4","2013-12-08","021200508","OBIKWA PINOTAGE SAVIN 2009    ",null,null,null,null,null,"021310010"]
["MEDU 349062/4","2013-12-08","021200509","OBIKWA MERLOT                 ",null,null,null,null,null,"021310010          "]
["MEDU 349062/4","2013-12-08","021200511","OBIKWA CHARDONNAY             ",null,null,null,null,null,"021310013"]
["MEDU 349062/4","2013-12-08","021200514","OBIKWA SAUVIGNON BLANC        ",null,null,null,null,null,"021310014"]
["MEDU 349062/4","2013-12-08","021200515","OBIKWA PINOTAGE ROSE          ",null,null,null,null,null,"021310015"]
["MEDU 349062/4","2013-12-08","021200516","OBIKWA CHENIN BLANC           ",null,null,null,null,null,"021310020"]
["MEDU 349062/4","2013-12-08","021200517","OBIKWA CABERNET SAUVIGNON     ",null,null,null,null,null,"021310114"]
["MEDU 349062/4","2013-12-08","021200518","OBIKWA PINOTAGE               ",null,null,null,null,null,"021310118"]
["MEDU 349062/4","2013-12-08","021200614","LIBERTAS CAB SAUVIGNON        ",null,null,null,null,null,"021310119"]
["MEDU 349062/4","2013-12-08","021200615","LIBERTAS CHARDONNAY           ",null,null,null,null,null,"021310201"]
["MEDU 349062/4","2013-12-08","021200616","LIBERTAS CHENIN BLANC         ",null,null,null,null,null,"021310207"]
["MEDU 349062/4","2013-12-08","021200617","LIBERTAS MERLOT 2009          ",null,null,null,null,null,"021310208"]
["MEDU 349062/4","2013-12-08","021200618","LIBERTAS PINOTAGE             ",null,null,null,null,null,"021310250"]
["MEDU 349062/4","2013-12-08","021200623","LIBERTAS MERLOT               ",null,null,null,null,null,"021310252"]
["MEDU 349062/4","2013-12-08","021200701","TWO OCEANS SHIRAZ 2013   ",null,null,null,null,null,"021310255"]
["MEDU 349062/4","2013-12-08","021200702","TWO OCEANS SAUVIGNON BLC 2013",null,null,null,null,null,"021310255           "]
["MEDU 349062/4","2013-12-08","021200703","TWO OCEANS CAB SAUV/MERLOT 08 ",null,null,null,null,null,"021310256"]
["MEDU 349062/4","2013-12-08","021200713","TWO OCEANS SHIRAZ ROSE 2007   ",null,null,null,null,null,"021310256 "]
["MEDU 349062/4","2013-12-08","021200714","TWO OCEANS CAB SAUV/MERLOT 09 ",null,null,null,null,null,"021310257"]
["MEDU 349062/4","2013-12-08","021200715","TWO OCEANS SHIRAZ ROSE        ",null,null,null,null,null,"021310257           "]
["MEDU 349062/4","2013-12-08","021200716","TWO OCEANS CHARDONNAY 2009    ",null,null,null,null,null,"021310257-6"]
["MEDU 349062/4","2013-12-08","021200717","TWO OCEANS FH&FRUITY WHITE    ",null,null,null,null,null,"021310303"]
["MEDU 349062/4","2013-12-08","021200718","TWO OCEANS SOFT&FRUITY RED    ",null,null,null,null,null,"021310304"]
["MEDU 349062/4","2013-12-08","021201000","PLAISIR DE MERLE SHIRAZ 07    ",null,null,null,null,null,"021310305"]
["MEDU 349062/4","2013-12-08","021201001","PLAISIR DE MERLE SAUV BLC 07  ",null,null,null,null,null,"021310315"]
["MEDU 349062/4","2013-12-08","021201002","PLAISIR DE MERLE CHARDONNAY 07",null,null,null,null,null,"021310317"]
["MEDU 349062/4","2013-12-08","021201003","PLAISIR DE MERLE CAB SAUV 06  ",null,null,null,null,null,"021310317          "]
["MEDU 349062/4","2013-12-08","021201004","PLAISIR DE MERLE SAUV BLC     ",null,null,null,null,null,"021310318"]
["MEDU 349062/4","2013-12-08","022200566","NEETHLINGSHOF THE OWL POST 08 ",null,null,null,null,null,"021310325"]
["MEDU 349062/4","2013-12-08","022300337","DROSTDY HOF CLARET            ",null,null,null,null,null,"021310325      "]
["MEDU 349062/4","2013-12-08","022300338","DROSTDY HOF ADELPRACHT        ",null,null,null,null,null,"021310402"]
["MEDU 349062/4","2013-12-08","022300339","DROSTDY HOF NATURAL SWEET ROSE",null,null,null,null,null,"021310402   "]
["MEDU 349062/4","2013-12-08","022300340","DROSTDY HOF CABERNET SAUV     ",null,null,null,null,null,"021310402           "]
["MEDU 349062/4","2013-12-08","022300341","DROSTDY HOF CHARDONNAY        ",null,null,null,null,null,"021310430"]
["MEDU 349062/4","2013-12-08","022300342","DROSTDY HOF MERLOT            ",null,null,null,null,null,"021310450"]
["MEDU 349062/4","2013-12-08","022300400","FLEUR DU CAP CABERNET SAUV    ",null,null,null,null,null,"021310500"]
["MEDU 349062/4","2013-12-08","022300401","FLEUR DU CAP CHARDONNAY       ",null,null,null,null,null,"021310500     "]
["MEDU 349062/4","2013-12-08","022300402","FLEUR DU CAP MERLOT 2008      ",null,null,null,null,null,"021320016"]
["MEDU 349062/4","2013-12-08","022300403","FLEUR DU CAP PINOTAGE         ",null,null,null,null,null,"021320025"]
["MEDU 349062/4","2013-12-08","022300404","FLEUR DU CAP SAUVIGNON BLC    ",null,null,null,null,null,"021320101"]
["MEDU 349062/4","2013-12-08","022300405","FLEUR DU CAP SHIRAZ           ",null,null,null,null,null,"021320300"]
["MEDU 349062/4","2013-12-08","022300502","NEETHLINGSHOF CHARD NO WOOD   ",null,null,null,null,null,"021320300        "]
["MEDU 349062/4","2013-12-08","022300503","NEETHLINGSHOF CARACAL         ",null,null,null,null,null,"021320300           "]
["MEDU 349062/4","2013-12-08","022300505","NEETHLINGSHOF MALBEC          ",null,null,null,null,null,"021400576"]
["MEDU 349062/4","2013-12-08","022300567","NEETHLINGSHOF GEWURZTRAMIN    ",null,null,null,null,null,"021400580"]
["MEDU 349062/4","2013-12-08","022300568","NEETHLINGSHOF SHIRAZ          ",null,null,null,null,null,"021400800"]
["MEDU 349062/4","2013-12-08","022300600","SAVANNA DRY 33CL.             ",null,null,null,null,null,"021500203"]
[null,null,null,null,null,null,null,null,null,"021500203       "]
["XINU 145940/1","2013-12-11",null,"ADVINI- PINOTAGE BY AVENIR ROUGE",null,null,null,null,null,"021500257"]
["XINU 145940/1","2013-12-11",null,"MIGUEL TORRES- RED WINE 2012 (SANGRE TORO)",null,null,null,null,null,"021500264"]
["XINU 145940/1","2013-12-11",null,"MIGUEL TORRES- RED WINE 2012 (SANGRE TORO)",null,null,null,null,null,"021500267"]
["XINU 145940/1","2013-12-11",null,"MIGUEL TORRES- RED WINE 2011 (CORANAS)",null,null,null,null,null,"021500269"]
["XINU 145940/1","2013-12-11",null,"VRANKEN POMMERY - VIN PAYS SABLE GOLF LION ",null,null,null,null,null,"021500269     "]
["XINU 145940/1","2013-12-11",null,"VRANKEN POMMERY - VIN PAYS SABLE CAMARGUE",null,null,null,null,null,"021500270"]
["XINU 145940/1","2013-12-11",null,"LACHETEAU- TOURAINE ROUGE",null,null,null,null,null,"021500270   "]
["XINU 145940/1","2013-12-11",null,"LACHETEAU- ST NICOLAS DE BOURGUEILA ROUGE",null,null,null,null,null,"021500270           "]
["XINU 145940/1","2013-12-11",null,"LACHETEAU- ART PUBLICITAIRE",null,null,null,null,null,"021500271     "]
["XINU 145940/1","2013-12-11",null,"LIBELLE",null,null,null,null,null,"021500271           "]
[null,null,null,null,null,null,null,null,null,"021900012"]
["CMAU 125254/7","2014-02-18",null,"GRANDS CHAIS DE France - ARMAGNAC AOC PRINCE ARIGNAC XO",null,null,null,null,null,"021900016"]
["CMAU 125254/7","2014-02-18",null,"GRANDS CHAIS DE France - ARMAGNAC AOC PRINCE ARIGNAC VS",null,null,null,null,null,"021900027"]
["CMAU 125254/7","2014-02-18",null,"GRANDS CHAIS DE France- VIN DU MAROC ROSE DOMAINE TOUTAL",null,null,null,null,null,"021900027           "]
["CMAU 125254/7","2014-02-18",null,"GRANDS CHAIS DE France - VODKA JELZIN",null,null,null,null,null,"021900029"]
["CMAU 125254/7","2014-02-18",null,"GRANDS CHAIS DE France - ARTICLE PUB",null,null,null,null,null,"021900029     "]
["CMAU 125254/7","2014-02-18",null,"CPESO - VDP CARCASSONNE ROSE / DOMAINE AUZIAS",null,null,null,null,null,"021900030"]
["CMAU 125254/7","2014-02-18",null,"CPESO - HAUTE COTES BEAUNES BLANC / DOMAINE BERGER RIVES",null,null,null,null,null,"021900030 "]
["CMAU 125254/7","2014-02-18",null,"CPESO - COTE DE BLAYE / CH CAZEAUX",null,null,null,null,null,"021900031"]
["CMAU 125254/7","2014-02-18",null,"CPESO - BORDEAUX ROUGE / CH PAGUENEAU",null,null,null,null,null,"021900031   "]
["CMAU 125254/7","2014-02-18",null,"H. CUVELIER & FILS - CHÂTEAU LACROIX SAINT ES 2009",null,null,null,null,null,"021900031           "]
["CMAU 125254/7","2014-02-18",null,"ADVINI - AFS SPRAKLING ROSE AVENIR",null,null,null,null,null,"021900110"]
["CMAU 125254/7","2014-02-18",null,"LOUIS ROEDERER - BRUT PREMIER L. ROEDERER",null,null,null,null,null,"021900113"]
["CMAU 125254/7","2014-02-18",null,"LOUIS ROEDERER - BRUT MILLESIME 2007 L. ROEDERER",null,null,null,null,null,"021900205"]
["CMAU 125254/7","2014-02-18",null,"TORRES - SAN VALENTIN PARELLADA BLANC",null,null,null,null,null,"021900207"]
["CMAU 125254/7","2014-02-18",null,"TORRES - SAN VALENTIN GARNACHA - ROUGE",null,null,null,null,null,"021900210"]
["CMAU 125254/7","2014-02-18",null,"TORRES - SANGRE DE TORO - ROUGE",null,null,null,null,null,"021900210-12"]
["CMAU 125254/7","2014-02-18",null,"BOULARD BAUQUAIRE - CHAMPAGNE BRUT TRADITION",null,null,null,null,null,"021900404"]
["CMAU 125254/7","2014-02-18",null,"BOULARD BAUQUAIRE - CHAMPAGNE GRANDE RESERVE",null,null,null,null,null,"021900415"]
["CMAU 125254/7","2014-02-18",null,"SIMONNET FEBVRE - SAINT BRIS",null,null,null,null,null,"021900424"]
["CMAU 125254/7","2014-02-18",null,"SIMONNET FEBVRE - BG ALIGOTE BLANC",null,null,null,null,null,"021900425"]
["CMAU 125254/7","2014-02-18",null,"LOUIS LATOUR - POMMARD",null,null,null,null,null,"021900430"]
["CMAU 125254/7","2014-02-18",null,"CHAMPAGNE JANISSON & FILS - CARTE BLANCHE 75 CL",null,null,null,null,null,"021900500"]
["CMAU 125254/7","2014-02-18",null,"SA CORDIER MESTREZAT GRANDS CRUS - 1ERES COTE DE BLAYE ROUGE",null,null,null,null,null,"021900501"]
["CMAU 125254/7","2014-02-18",null,"SA CORDIER MESTREZAT GRANDS CRUS - BLAYE COTE BORDEAUX ROUGE",null,null,null,null,null,"021900502"]
["CMAU 125254/7","2014-02-18",null,"SA CORDIER MESTREZAT GRANDS CRUS - COTES DE BOURG ROUGE",null,null,null,null,null,"021900503"]
["CMAU 125254/7","2014-02-18",null,"SA CORDIER MESTREZAT GRANDS CRUS - ART PUB",null,null,null,null,null,"021900503-6"]
["CMAU 125254/7","2014-02-18",null,"PERNOD RICARD KENYA - CLAN CAMPBELL 40% 12X70CL",null,null,null,null,null,"021900504"]
["CMAU 125254/7","2014-02-18",null,"PERNOD RICARD KENYA - MALIBU 21% 6X70 CL",null,null,null,null,null,"021900505"]
["CMAU 125254/7","2014-02-18",null,"PERNOD RICARD KENYA - ABSOLUT VODKA 40% 12X70 CL",null,null,null,null,null,"021900506"]
["CMAU 125254/7","2014-02-18",null,"PERNOD RICARD KENYA - HAVANA CLUB RHUMANEJO 3 YEARS 40% 6X70 CL",null,null,null,null,null,"021900507"]
["CMAU 125254/7","2014-02-18",null,"LES MAITRES VIGNERONS DE LA PRESQU'ILE - GOURMANDISE ROUGE",null,null,null,null,null,"021900509"]
["CMAU 125254/7","2014-02-18",null,"LES MAITRES VIGNERONS DE LA PRESQU'ILE - GOURMANDISE ROSE",null,null,null,null,null,"021900512"]
["CMAU 125254/7","2014-02-18",null,"LES MAITRES VIGNERONS DE LA PRESQU'ILE - GOURMANDISE BLANC",null,null,null,null,null,"021900514"]
["CMAU 125254/7","2014-02-18",null,"LES MAITRES VIGNERONS DE LA PRESQU'ILE - SAINT ROCHE ROSE 2012",null,null,null,null,null,"021900515"]
[null,null,null,null,null,null,null,null,null,"021900516"]
["IPXU 331800/0","2014-04-04",null,"GRANDS CHAIS DE France - VIN DE PAYS D'OC / CABERNET SAUVIGNON",null,null,null,null,null,"021900520"]
["IPXU 331800/0","2014-04-04",null,"LACHETEAU - MUSCADET SM/ LIE AOC/AOP BLANC - CHT DE GOULAINE PAPILLON",null,null,null,null,null,"021900521"]
["IPXU 331800/0","2014-04-04",null,"LACHETEAU - MUSCADET SM/LIE AOC/AOP BLANC DOM DES CANTREAUX /LIE",null,null,null,null,null,"021900524"]
["IPXU 331800/0","2014-04-04",null,"LACHETEAU - POUILLY FUME BLANC",null,null,null,null,null,"021900525"]
["IPXU 331800/0","2014-04-04",null,"ADVINI - AFS BY AVENIR ROSE/GRIS",null,null,null,null,null,"021900540"]
["IPXU 331800/0","2014-04-04",null,"ADVINI - AFS SPRAKLING ROSE AVENIR",null,null,null,null,null,"021900541"]
["TRHU 225287/0","2014-04-30",null,"MAISON HEBRARD - Saint Thibeaud 2010 / AOC Bordeaux rouge",null,null,null,null,null,"021900542"]
["TRHU 225287/0","2014-04-30",null,"MAISON HEBRARD - Saint Thibeaud BLANC SEC 2012  / AOC Bordeaux BLANC SEC",null,null,null,null,null,"021900543"]
["TRHU 225287/0","2014-04-30",null,"MAISON HEBRARD - Saint Thibeaud Rosé 2012 / AOC Bordeaux Rosé",null,null,null,null,null,"021900547"]
["TRHU 225287/0","2014-04-30","021305106","COMPAGNIE VINICOLE BARON EDMOND DE ROTHSCHILD - Château clarke 2008",null,null,null,null,null,"021900548"]
["TRHU 225287/0","2014-04-30",null,"GRANDS CHAIS DE France - VODKA JELZIN",null,null,null,null,null,"021900558"]
["TRHU 225287/0","2014-04-30",null,"GRANDS CHAIS DE France - Vin de pays d'oc rouge - chevalier a lichine Merlo crd",null,null,null,null,null,"021900558 "]
["TRHU 225287/0","2014-04-30",null,"GRANDS CHAIS DE France - Jean Loret Bouche - Cidre Brut blanc ",null,null,null,null,null,"021900560"]
["TRHU 225287/0","2014-04-30",null,"GRANDS CHAIS DE France - Armagnac AOC - prince d'arignac XO",null,null,null,null,null,"021900561"]
["TRHU 225287/0","2014-04-30",null,"GRANDS CHAIS DE France - puccini sangiovese- chianti docg rouge",null,null,null,null,null,"021900604"]
["TRHU 225287/0","2014-04-30",null,"GRANDS CHAIS DE France - Domaine toulal Vin du maroc rose",null,null,null,null,null,"021900609"]
["TRHU 225287/0","2014-04-30",null,"GRANDS CHAIS DE France - Domaine toulal Vin du maroc rouge",null,null,null,null,null,"021900650"]
["TRHU 225287/0","2014-04-30",null,"SA CORDIER MESTREZAT - La croix bacalan bordeaux rouge",null,null,null,null,null,"021900651"]
["TRHU 225287/0","2014-04-30",null,"SA CORDIER MESTREZAT - Château fougere la noble bordeaux rouge",null,null,null,null,null,"021900652"]
["TRHU 225287/0","2014-04-30",null,"CELLIER DES DAUPHINS - IGP MEDITERRANEE ROUGE 5l",null,null,null,null,null,"021900700"]
["TRHU 225287/0","2014-04-30",null,"CELLIER DES DAUPHINS - IGP MEDITERRANEE BLANC 5l",null,null,null,null,null,"021900701"]
["TRHU 225287/0","2014-04-30",null,"CELLIER DES DAUPHINS - IGP MEDITERRANEE ROSE 5l",null,null,null,null,null,"022000000"]
["TRHU 225287/0","2014-04-30",null,"PAUL JABOULET AINE - Côtes du Rhônes \"parallèle 45\" Rouge",null,null,null,null,null,"022000001"]
["TRHU 225287/0","2014-04-30",null,"BOULARD BAUQUAIRE - Champagne rose",null,null,null,null,null,"022000002"]
["TRHU 225287/0","2014-04-30",null,"BOULARD BAUQUAIRE - Champagne grande reserve",null,null,null,null,null,"022000003"]
["TRHU 225287/0","2014-04-30",null,"BOULARD BAUQUAIRE - Magnum brut grande reserve",null,null,null,null,null,"022000005"]
["TRHU 225287/0","2014-04-30",null,"BOULARD BAUQUAIRE - Champagne brut tradition",null,null,null,null,null,"022000007"]
["TRHU 225287/0","2014-04-30",null,"BOULARD BAUQUAIRE - Champagne rose",null,null,null,null,null,"022200566"]
["TRHU 225287/0","2014-04-30",null,"BOULARD BAUQUAIRE - brut carte noire",null,null,null,null,null,"022300337"]
["TRHU 225287/0","2014-04-30",null,"BOUQUET DE LOIRE - Vin de pays d'oc - Bouquet Merlot",null,null,null,null,null,"022300338"]
["TRHU 225287/0","2014-04-30",null,"BOUQUET DE LOIRE - Vin de pays d'oc - Bouquet de Syrah",null,null,null,null,null,"022300339"]
["TRHU 225287/0","2014-04-30",null,"BOUQUET DE LOIRE - Cheverny rouge dom. Sauger",null,null,null,null,null,"022300340"]
["TRHU 225287/0","2014-04-30",null,"BOUQUET DE LOIRE - Saint Nicolas de Bourgueil Dom Godefroy",null,null,null,null,null,"022300341"]
["TRHU 225287/0","2014-04-30",null,"BOUQUET DE LOIRE - Pouilly Fumé Michel Reddel Le petit fumé",null,null,null,null,null,"022300341  "]
["TRHU 225287/0","2014-04-30",null,"BOUQUET DE LOIRE - Quincy dom Mardon",null,null,null,null,null,"022300342"]
[null,null,null,null,null,null,null,null,null,"022300343"]
["CMAU 103481/7","2014-04-30",null,"PERNOD RICARD - Absolut vodka 40%",null,null,null,null,null,"022300400"]
["CMAU 103481/7","2014-04-30",null,"PERNOD RICARD - Ballantine's finest whisky ",null,null,null,null,null,"022300401"]
["CMAU 103481/7","2014-04-30",null,"PERNOD RICARD - Beefeater gin",null,null,null,null,null,"022300402"]
["CMAU 103481/7","2014-04-30",null,"PERNOD RICARD - Chivas regal whisky 18 yo 40%",null,null,null,null,null,"022300403"]
["CMAU 103481/7","2014-04-30",null,"PERNOD RICARD - Chivas regal whisky 12 yo 40%",null,null,null,null,null,"022300404"]
["CMAU 103481/7","2014-04-30",null,"PERNOD RICARD - Jameson whisky 40% 70 cl",null,null,null,null,null,"022300404      "]
["CMAU 103481/7","2014-04-30",null,"PERNOD RICARD - malibu liqueur 21% ",null,null,null,null,null,"022300405"]
["CMAU 103481/7","2014-04-30",null,"PERNOD RICARD - Mumm champagne cordon rouge",null,null,null,null,null,"022300502"]
["CMAU 103481/7","2014-04-30",null,"PERNOD RICARD - pastis 51 45% - 100 CL",null,null,null,null,null,"022300503"]
["CMAU 103481/7","2014-04-30",null,"PERNOD RICARD - Ricard 45%  - 100 CL",null,null,null,null,null,"022300505"]
["CMAU 103481/7","2014-04-30",null,"PERNOD RICARD - wyborowa vodka 40%",null,null,null,null,null,"022300567"]
["CMAU 103481/7","2014-04-30",null,"LOUIS LATOUR - Bourgogne passe tout grain",null,null,null,null,null,"022300567  "]
["CMAU 103481/7","2014-04-30",null,"LOUIS LATOUR - pinot noir bourgogne",null,null,null,null,null,"022300568"]
["CMAU 103481/7","2014-04-30",null,"LOUIS LATOUR - pommard",null,null,null,null,null,"022300600"]
["CMAU 103481/7","2014-04-30",null,"PAUL JABOULET AINE - Côtes du Rhônes \"parallèle 45\" Rouge",null,null,null,null,null,"022300600 "]
["CMAU 103481/7","2014-04-30",null,"PERNOD RICARD - malibu liqueur 21% ",null,null,null,null,null,"022600100"]
["CMAU 103481/7","2014-04-30",null,"PERNOD RICARD - Absolut vodka 40%",null,null,null,null,null,"022600102"]
["CMAU 103481/7","2014-04-30",null,"PERNOD RICARD - Mumm champagne cordon rouge",null,null,null,null,null,"022600103"]
["CMAU 103481/7","2014-04-30",null,"PERNOD RICARD - wyborowa vodka 40%",null,null,null,null,null,"022800001"]
["CMAU 103481/7","2014-04-30",null,"PERNOD RICARD - havana club rhum anejo 3 years old",null,null,null,null,null,"022800002"]
["CMAU 103481/7","2014-04-30",null,"BOULARD BAUQUAIRE - Champagne brut tradition - 3700736500016",null,null,null,null,null,"022800003"]
["CMAU 103481/7","2014-04-30",null,"BOULARD BAUQUAIRE - Champagne rose - 3700365500047",null,null,null,null,null,"022800004"]
["CMAU 103481/7","2014-04-30",null,"BOULARD BAUQUAIRE - champagne grande reserve - 370036500030",null,null,null,null,null,"022800007"]
["CMAU 103481/7","2014-04-30",null,"BOULARD BAUQUAIRE - Demies champagne grande reserve-3700736500061",null,null,null,null,null,"022800008"]
["CMAU 103481/7","2014-04-30",null,"BOULARD BAUQUAIRE - Champagnes demi sec - 37007365000023",null,null,null,null,null,"022800100"]
["CMAU 103481/7","2014-04-30",null,"BOULARD BAUQUAIRE - magnum brut grande reserve - 3700736500076",null,null,null,null,null,"022810002"]
["CMAU 103481/7","2014-04-30",null,"BOULARD BAUQUAIRE - bouteilles vieilles vignes trepail",null,null,null,null,null,"022810005"]
["CMAU 103481/7","2014-04-30",null,"SA CORDIER MESTREZAT - Château fougere la noble cc",null,null,null,null,null,"022810050"]
["CMAU 103481/7","2014-04-30",null,"SA CORDIER MESTREZAT - Château du grand soussans",null,null,null,null,null,"024100001"]
[null,null,null,null,null,null,null,null,null,"060220100"]
["CMAU 033796/9","2014-05-12",null,"SARL CPESO - VDP CARCASSONNE ROSE / DOMAINE AUZIAS",null,null,null,null,null,"DABAA355257"]
["CMAU 033796/9","2014-05-12",null,"SARL CPESO - SAINT CHINIAN ROUGE / COL DE L'ORB",null,null,null,null,null,"DABAA502717"]
["CMAU 033796/9","2014-05-12",null,"SARL CPESO - BORDEAUX ROUGE / CHÂTEAU LA ROSE TOUR BLANCHE",null,null,null,null,null,"DABAA600635"]
["CMAU 033796/9","2014-05-12",null,"SARL CPESO - COTES DE BLAYE / CHÂTEAU CAZEAUX",null,null,null,null,null,"DACAB691667"]
["CMAU 033796/9","2014-05-12",null,"SARL CPESO - BORDEAUX ROUGE / CHÂTEAU PAGUENEAU",null,null,null,null,null,"DADAA005604 "]
["CMAU 033796/9","2014-05-12",null,"UNION DES VIGNERONS DES COTES DU RHONE - COTES DU RHONE CHÂTEAU DE L'ESTAGNOL ROUGE",null,null,null,null,null,"DADAA321112"]
["CMAU 033796/9","2014-05-12",null,"UNION DES VIGNERONS DES COTES DU RHONE - IGP MEDITERRANEE BLANC",null,null,null,null,null,"DADAA571144"]
["CMAU 033796/9","2014-05-12",null,"UNION DES VIGNERONS DES COTES DU RHONE - IGP MEDITERRANEE ROSE",null,null,null,null,null,"DAEAA450558"]
["CMAU 033796/9","2014-05-12",null,"BOUQUET DE LOIR - VIN DE PAYS D'OC / BOUQUET MERLOT",null,null,null,null,null,"DAGAA302015"]
["CMAU 033796/9","2014-05-12",null,"BOUQUET DE LOIR - POUILLY FUME MICHEL REDDE / LE PETIT FUME",null,null,null,null,null,"DAGAA304033"]
["CMAU 033796/9","2014-05-12",null,"LACHETEAU - SAINT NICOLAS DE BOURGUEILA ROUGE (M MARTIN LES ECHALIERS)",null,null,null,null,null,"DAGAA304033         "]
["CMAU 033796/9","2014-05-12",null,"LACHETEAU - MUSCADET SM/LIE AOC/AOP BLANC (DOM DES CANTREAUX)",null,null,null,null,null,"DAGAA406645"]
["CMAU 033796/9","2014-05-12",null,"LACHETEAU - MUSCADET SM/LIE AOC/AOP BLANC (CHT DE GOULAINE PAPILLON)",null,null,null,null,null,"DAGAA406645      "]
["CMAU 033796/9","2014-05-12",null,"LACHETEAU - POUILLY FUME BLANC",null,null,null,null,null,"DAGAA501623"]
["CMAU 033796/9","2014-05-12",null,"HOREAU BEYLOT - CH HAUT CLOQUET POMEROL",null,null,null,null,null,"DAGAA502965"]
["CMAU 033796/9","2014-05-12",null,"LOUIS ROEDERER - BRUT PREMIER L. ROEDERER - 3114080016053",null,null,null,null,null,"DAGAA504471"]
["CMAU 033796/9","2014-05-12",null,"LOUIS ROEDERER - BRUT PREMIER L. ROEDERER (ETUI GRAPHIQUE) - 3114080116050",null,null,null,null,null,"DAGAA506000"]
["CMAU 033796/9","2014-05-12",null,"LOUIS ROEDERER - BRUT MILLESIME 2006 - 3114080025055",null,null,null,null,null,"DAGAA734019"]
["CMAU 033796/9","2014-05-12",null,"LOUIS ROEDERER - BRUT MILLESIME 2007 - 3114080125052",null,null,null,null,null,"DAGAB001454"]
["CMAU 033796/9","2014-05-12",null,"LOUIS ROEDERER - CRISTAL BRUT 2006",null,null,null,null,null,"DAGAB001508"]
["CMAU 033796/9","2014-05-12",null,"LOUIS ROEDERER - CRISTAL BRUT 2006-COFFRET",null,null,null,null,null,"DAGAJ000014"]
["CMAU 033796/9","2014-05-12",null,"LOUIS ROEDERER - CHÂTEAU HAUT-BEAUSEJOUR 2009",null,null,null,null,null,"DAGAJ000021"]
["CMAU 033796/9","2014-05-12",null,"LOUIS ROEDERER - CHÂTEAU HAUT DE PEZ 2008",null,null,null,null,null,"DAKAA815251"]
["CMAU 033796/9","2014-05-12",null,"MAITRES VIGNERONS DE LA PRESQU'ILE DE SAINT-TROPEZ - GOURMANDISE ROSE",null,null,null,null,null,"DALAA307095"]
["CMAU 033796/9","2014-05-12",null,"MAITRES VIGNERONS DE LA PRESQU'ILE DE SAINT-TROPEZ - SAINT ROCH ROSE / 75 CL / flute corset",null,null,null,null,null,"DALAA347213"]
["CMAU 033796/9","2014-05-12",null,"MAITRES VIGNERONS DE LA PRESQU'ILE DE SAINT-TROPEZ - SAINT ROCH ROSE / 37,5 CL bordelaise bleu",null,null,null,null,null,"DALAA423290"]
["CMAU 033796/9","2014-05-12",null,"MAITRES VIGNERONS DE LA PRESQU'ILE DE SAINT-TROPEZ - SAINT ROCH ROSE / 75 CL sensation",null,null,null,null,null,"DALAA446268"]
["CMAU 033796/9","2014-05-12","021101009","CAMUS - CAMUS COCGNAC VSOP ELEGANCE ETUIS",null,null,null,null,null,"DALAA460752"]
["CMAU 033796/9","2014-05-12",null,"CAMUS - CAMUS COCGNAC XO ELEGANCE",null,null,null,null,null,"DANAA501002"]
["CMAU 033796/9","2014-05-12",null,"GRANDS CHAIS DE France - WHISKY BOURBON JACK DANIEL'S 70 cl",null,null,null,null,null,"DAPAA003986"]
["CMAU 033796/9","2014-05-12"," ","GRANDS CHAIS DE France - VODKA JELZIN 1L",null,null,null,null,null,"DARAA004564"]
["CMAU 033796/9","2014-05-12",null,"GRANDS CHAIS DE France - VIN DU MAROC ROSE / DOMAINE TOULAL GUERROUANE",null,null,null,null,null,"DARAA061257"]
["CMAU 033796/9","2014-05-12",null,"GRANDS CHAIS DE France - VIN DU MAROC ROUGE  / DOMAINE TOULAL GUERROUANE",null,null,null,null,null,"DAVAA000015"]
[null,null,null,null,null,null,null,null,null,"DAVAA000602"]
["CMAU 023604/8","2014-06-02","022000000","MIGUEL TORRES - TORRES SANGRE DE TORO - VINO TINTO",null,null,null,null,null,"DBFAA100018"]
["CMAU 023604/8","2014-06-02","022000002","MIGUEL TORRES - TORRES CORONAS - VINO TINTO",null,null,null,null,null,"DBFAA100025"]
["CMAU 023604/8","2014-06-02",null,"MIGUEL TORRES - SAN VALENTIN PARELLADA - VINO BLANCO",null,null,null,null,null,"DBZAA750855"]
["CMAU 023604/8","2014-06-02","022000001","MIGUEL TORRES - SANGRE DE TORO - VINO TINTO 1/2  37,5 cl",null,null,null,null,null,"DBZAA774776"]
["CMAU 023604/8","2014-06-02","022000002","MIGUEL TORRES - TORRES CORONAS - VINO TINTO",null,null,null,null,null,"DBZAB180359"]
["CMAU 023604/8","2014-06-02",null,"H CUVELIER - CHÂTEAU LA CROIX SAINT ESTEPHE - ROUGE",null,null,null,null,null,"DBZAB180458"]
["CMAU 023604/8","2014-06-02",null,"H CUVELIER - PETIT CORBIN DESPAGNE ST EMILION - ROUGE",null,null,null,null,null,"DBZAB716633"]
["CMAU 023604/8","2014-06-02",null,"H CUVELIER - CHÂTEAU HAUTES GRAVES POMEROL - ",null,null,null,null,null,"DBZAB719481"]
["CMAU 023604/8","2014-06-02",null,"LES MAITRES VIGNERONS - GOURMANDISE - ROUGE",null,null,null,null,null,"DBZAE000024"]
["CMAU 023604/8","2014-06-02",null,"LES MAITRES VIGNERONS - GOURMANDISE - ROSE",null,null,null,null,null,"DBZAE070037"]
["CMAU 023604/8","2014-06-02",null,"LES MAITRES VIGNERONS - SAINT ROCH / SENSATION - ROSE",null,null,null,null,null,"DBZAE260513"]
["CMAU 023604/8","2014-06-02",null,"LES MAITRES VIGNERONS - SAINT ROCH / FLUTE A CORSET- ROSE",null,null,null,null,null,"DBZAE602030"]
["CMAU 023604/8","2014-06-02","021310201","LES DOMAINES AURIOL - DNE MIRABAU - ROUGE",null,null,null,null,null,"DCAAA000379"]
["CMAU 023604/8","2014-06-02",null,"SARL CPESO - CHÂTEAU PAGUENEAU - BORDEAUX ROUGE",null,null,null,null,null,"DCAAA000676"]
["CMAU 023604/8","2014-06-02",null,"SARL CPESO - MAISON JEAN BAPTISTE BEJOT - PETIT CHABLIS BLANC",null,null,null,null,null,"DCAAA300430"]
["CMAU 023604/8","2014-06-02",null,"SARL CPESO - CHÂTEAU LA ROSE TOUR BLANCHE - BORDEAUX ROUGE",null,null,null,null,null,"DCAAA610256"]
["CMAU 023604/8","2014-06-02",null,"PERNOD RICARD - BALLANTINE'S FINEST WHISKY ",null,null,null,null,null,"DCIAA202140"]
["CMAU 023604/8","2014-06-02",null,"PERNOD RICARD - ABSOLUT VODKA 40% - 70 CL",null,null,null,null,null,"DCIAA211135"]
["CMAU 023604/8","2014-06-02",null,"PERNOD RICARD - JAMESON WHISKY 40% - 70cl",null,null,null,null,null,"DCIAA212149"]
["CMAU 023604/8","2014-06-02",null,"PERNOD RICARD - WYBOROWA VODKA 40%",null,null,null,null,null,"DCIAA230136"]
["CMAU 023604/8","2014-06-02",null,"PERNOD RICARD - CLAN CAMPBELL 40%",null,null,null,null,null,"DCIAA240135"]
["CMAU 023604/8","2014-06-02",null,"PERNOD RICARD - ABSOLUT VODKA 40% - 100 CL",null,null,null,null,null,"DCIAA241132"]
["CMAU 023604/8","2014-06-02","021900516","PERNOD RICARD - ABSOLUT VODKA 40% - 70 CL",null,null,null,null,null,"DCIAA242134"]
["CMAU 023604/8","2014-06-02",null,"SIMONNET FEBVRE - SAINT BRIS ",null,null,null,null,null,"DCIAA244121"]
["CMAU 023604/8","2014-06-02",null,"SIMONNET FEBVRE - BOURGONE ALIGOTE",null,null,null,null,null,"DCIAA250141"]
["CMAU 023604/8","2014-06-02",null,"CHAMPAGNE BOLLINGER - SPECIAL CUVEE BRUT",null,null,null,null,null,"DCJAA002992"]
["CMAU 023604/8","2014-06-02",null,"LOUIS LATOUR - CHASAGNE MONTRACHET - BLANC",null,null,null,null,null,"DCJAA003418"]
["CMAU 023604/8","2014-06-02",null,"LOUIS LATOUR - ALOXE CORTON DOMAINE LATOUR",null,null,null,null,null,"DCJAA003470"]
["CMAU 023604/8","2014-06-02",null,"LOUIS LATOUR - GEVREY - CHAMBERTIN",null,null,null,null,null,"DCJAA003753"]
["CMAU 023604/8","2014-06-02",null,"LOUIS LATOUR - MEURSAULT - BLANC",null,null,null,null,null,"EAAAA001284 "]
["CMAU 023604/8","2014-06-02",null,"LOUIS LATOUR - MONTAGNY ",null,null,null,null,null,"EADAJ201600"]
["CMAU 023604/8","2014-06-02",null,"CHAMPAGNE AYALA - BRUT MAJEUR",null,null,null,null,null,"FABAA046447"]
["CMAU 023604/8","2014-06-02",null,"CHAMPAGNE AYALA - ROSE MAJEUR",null,null,null,null,null,"GAAAA003386"]
["CMAU 023604/8","2014-06-02",null,"CIE VIGNICOLE BARON EDMOND DE ROTHSCHILD - CHÂTEAU DES LAURETS",null,null,null,null,null,"GAAAA003508"]
["CMAU 023604/8","2014-06-02","021900701","ARMAGNAC CASTAREDE - ARMAGNAC CASTAREDE VSOP ",null,null,null,null,null,"IAHAA080927"]
[null,null,null,null,null,null,null,null,null,"IAHAA110225"]
["CMAU 021481/4","2014-06-05",null,"HOREAU BEYLOT - CH. MARTINET SAINT EMILLION - 2011",null,null,null,null,null,"IAHAA113127"]
["CMAU 021481/4","2014-06-05",null,"PLAIMONT PRODUCTEURS - AOC SAINT MONT BLANC  CHEMIN DES PELERINS 2012",null,null,null,null,null,"IAIAA042397"]
["CMAU 021481/4","2014-06-05",null,"PLAIMONT PRODUCTEURS - AOC SAINT MONT ROSE CHEMINS DES PELERINS",null,null,null,null,null,"IAKAA020158         "]
["CMAU 021481/4","2014-06-05",null,"LES MAITRES VIGNERONS - GOURMANDISE ROUGE ",null,null,null,null,null,"IAKAA020196         "]
["CMAU 021481/4","2014-06-05",null,"LES MAITRES VIGNERONS - GOURMANDISE ROSE ",null,null,null,null,null,"UDAA932717"]
["CMAU 021481/4","2014-06-05","021310252","LES MAITRES VIGNERONS - GOURMANDISE BLANC"]
["CMAU 021481/4","2014-06-05",null,"BOUQUET DE LOIRE - BOUQUET DE SYRAH ROSE"]
["CMAU 021481/4","2014-06-05","022800004","BOUQUET DE LOIRE - BOUQUET DE SYRAH VDP"]
["CMAU 021481/4","2014-06-05",null,"BOUQUET DE LOIRE - CHEVERNY ROUGE DOMAINE SAUGER"]
["CMAU 021481/4","2014-06-05",null,"LES GRANDS CHAIS DE France - WHISKY BOURBON JACK DANIEL'S 1L"]
["CMAU 021481/4","2014-06-05",null,"LES GRANDS CHAIS DE France - VODKA JELZIN 1L"]
["CMAU 021481/4","2014-06-05",null,"LACHETEAU - TOURAINE ROUGE M MARTIN LE CLOUQUIN NV 75 CL"]
["CMAU 021481/4","2014-06-05",null,"LACHETEAU - SAUMUR ROUGE CHT MONTGUERET "]
["CMAU 021481/4","2014-06-05",null,"LACHETEAU - TOURAINE ROUGE M MARTIN LE CLOUQUIN SSG 37,5 CL"]
["CMAU 021481/4","2014-06-05",null,"LACHETEAU - SAINT NICOLAS DE BOURGUELLA ROUGE M MARTIN LES ECHALIERS NV"]
["CMAU 021481/4","2014-06-05",null,"LACHETEAU - CHINON ROUGE / M ARTIN LES BERNIERES "]
["CMAU 021481/4","2014-06-05",null,"LACHETEAU - POUILLY FUME BLANC / LACHETEAU"]
["CMAU 021481/4","2014-06-05",null,"LOUIS ROEDERER CHAMPAGNE - BRUT PREMIER"]
["CMAU 021481/4","2014-06-05","021900541","LOUIS ROEDERER CHAMPAGNE - BRUT PREMIER (ETUI GRAPHIQUE) new labels"]
["CMAU 021481/4","2014-06-05",null,"LOUIS ROEDERER CHAMPAGNE - CHÂTEAU HAUT-BEAU SEJOUR"]
[]
["MSCU 394215/8","2014-06-06","021100106","NEDERBURG BARONNE                   "]
["MSCU 394215/8","2014-06-06","021100107","NEDERBURG EDELROOD 2007             "]
["MSCU 394215/8","2014-06-06","021100108","NEDERBURG CHARDONNAY 2008           "]
["MSCU 394215/8","2014-06-06","021100113","NEDERBURG WINEMASTERS SPECIAL LATE HARVEST      "]
["MSCU 394215/8","2014-06-06","021100114","NEDERBURG CHARDONNAY                "]
["MSCU 394215/8","2014-06-06","021100115","NEDERBURG LYRIC               "]
["MSCU 394215/8","2014-06-06","021100116","NEDERBURG  CABERNET SAUVIGNON 2012 "]
["MSCU 394215/8","2014-06-06","021100118","NEDERBURG ROSE 2009           "]
["MSCU 394215/8","2014-06-06","021100119","NEDERBURG WINEMASTERS SHIRAZ 2012              "]
["MSCU 394215/8","2014-06-06","021100300","NEDERBURG  CUVEE BRUT SPARKLING WINE    "]
["MSCU 394215/8","2014-06-06","021100301","NEDERBURG WINEMASTERS  SAUVIGNON BLANC       "]
["MSCU 394215/8","2014-06-06","021100302","NEDERBURG ROSE                "]
["MSCU 394215/8","2014-06-06","021100340","NED WINEMASTERS EDELROOD 2012"]
["MSCU 394215/8","2014-06-06","021200307","ZONNEBLOEM SHIRAZ 2007        "]
["MSCU 394215/8","2014-06-06","021200308","ZONNEBLOEM PINOTAGE 2012           "]
["MSCU 394215/8","2014-06-06","021200309","ZONNEBLOEM CABERNET SAUVIGNON           "]
["MSCU 394215/8","2014-06-06","021200311","ZONNEBLOEM SAUVIGNON BLANC 2013"]
["MSCU 394215/8","2014-06-06","021200403","ZONNEBLOEM CHARDONNAY         "]
["MSCU 394215/8","2014-06-06","021200404","ZONNEBLOEM SHIRAZ             "]
["MSCU 394215/8","2014-06-06","021200508","OBIKWA PINOTAGE SAVIN 2009    "]
["MSCU 394215/8","2014-06-06","021200509","OBIKWA MERLOT                 "]
["MSCU 394215/8","2014-06-06","021200511","OBIKWA CHARDONNAY             "]
["MSCU 394215/8","2014-06-06","021200514","OBIKWA SAUVIGNON BLANC        "]
["MSCU 394215/8","2014-06-06","021200515","OBIKWA PINOTAGE ROSE          "]
["MSCU 394215/8","2014-06-06","021200516","OBIKWA CHENIN BLANC           "]
["MSCU 394215/8","2014-06-06","021200517","OBIKWA CABERNET SAUVIGNON 2013"]
["MSCU 394215/8","2014-06-06","021200518","OBIKWA PINOTAGE 2013               "]
["MSCU 394215/8","2014-06-06","021200614","LIBERTAS CAB SAUVIGNON        "]
["MSCU 394215/8","2014-06-06","021200615","LIBERTAS CHARDONNAY   2013       "]
["MSCU 394215/8","2014-06-06","021200616","LIBERTAS CHENIN BLANC         "]
["MSCU 394215/8","2014-06-06","021200617","LIBERTAS MERLOT 2009          "]
["MSCU 394215/8","2014-06-06","021200618","LIBERTAS PINOTAGE             "]
["MSCU 394215/8","2014-06-06","021200623","LIBERTAS MERLOT               "]
["MSCU 394215/8","2014-06-06","021200701","TWO OCEANS SHIRAZ 2013   "]
["MSCU 394215/8","2014-06-06","021200702","TWO OCEANS SAUVIGNON BLC 2013"]
["MSCU 394215/8","2014-06-06","021200703","TWO OCEANS CAB SAUV/MERLOT 08 "]
["MSCU 394215/8","2014-06-06","021200713","TWO OCEANS SHIRAZ ROSE 2007   "]
["MSCU 394215/8","2014-06-06","021200714","TWO OCEANS CAB SAUV/MERLOT 09 "]
["MSCU 394215/8","2014-06-06","021200715","TWO OCEANS SHIRAZ ROSE        "]
["MSCU 394215/8","2014-06-06","021200716","TWO OCEANS CHARDONNAY 2009    "]
["MSCU 394215/8","2014-06-06","021200717","TWO OCEANS FH&FRUITY WHITE    "]
["MSCU 394215/8","2014-06-06","021200718","TWO OCEANS SOFT&FRUITY RED    "]
["MSCU 394215/8","2014-06-06","021201000","PLAISIR DE MERLE SHIRAZ 07    "]
["MSCU 394215/8","2014-06-06","021201001","PLAISIR DE MERLE SAUVIGNON BLANC 2013"]
["MSCU 394215/8","2014-06-06","021201002","PLAISIR DE MERLE CHARDONNAY 2013"]
["MSCU 394215/8","2014-06-06","021201003","PLAISIR DE MERLE CAB SAUV 06  "]
["MSCU 394215/8","2014-06-06","021201004","PLAISIR DE MERLE SAUV BLC     "]
["MSCU 394215/8","2014-06-06","022200566","NEETHLINGSHOF THE OWL POST 08 "]
["MSCU 394215/8","2014-06-06","022300337","DROSTDY HOF CLARET            "]
["MSCU 394215/8","2014-06-06","022300338","DROSTDY HOF ADELPRACHT        "]
["MSCU 394215/8","2014-06-06","022300339","DROSTDY HOF NATURAL SWEET ROSE"]
["MSCU 394215/8","2014-06-06","022300340","DROSTDY HOF CABERNET SAUV     "]
["MSCU 394215/8","2014-06-06","022300341","DROSTDY HOF CHARDONNAY        "]
["MSCU 394215/8","2014-06-06","022300342","DROSTDY HOF MERLOT            "]
["MSCU 394215/8","2014-06-06","022300400","FLEUR DU CAP CABERNET SAUVIGNON BLANC    "]
["MSCU 394215/8","2014-06-06","022300401","FLEUR DU CAP CHARDONNAY        "]
["MSCU 394215/8","2014-06-06","022300402","FLEUR DU CAP MERLOT 2012"]
["MSCU 394215/8","2014-06-06","022300403","FLEUR DU CAP PINOTAGE 2012       "]
["MSCU 394215/8","2014-06-06","022300403","FLEUR DU CAP PINOTAGE 2012       "]
["MSCU 394215/8","2014-06-06","022300404","FLEUR DU CAP SAUVIGNON BLANC    "]
["MSCU 394215/8","2014-06-06","022300405","FLEUR DU CAP SHIRAZ           "]
["MSCU 394215/8","2014-06-06","022300502","NEETHLINGSHOF CHARD UNWOODED"]
["MSCU 394215/8","2014-06-06",null,"AMARULA CREAM LIQUEUR"]
["MSCU 394215/8","2014-06-06","022300505","NEETHLINGSHOF MALBEC          "]
["MSCU 394215/8","2014-06-06","022300567","NEETHLINGSHOF GEWURZTRAMIN    "]
["MSCU 394215/8","2014-06-06","022300568","NEETHLINGSHOF SHIRAZ          "]
["MSCU 394215/8","2014-06-06","022300600","SAVANNA DRY 33CL.             "]
[]
["CMAU 026508/8","2014-06-27",null,"BOULARD BAUQUAIRE - CHAMPAGNE BRUT TRADITION"]
["CMAU 026508/8","2014-06-27",null,"BOULARD BAUQUAIRE - CHAMPAGNE GRANDE RESERVE"]
["CMAU 026508/8","2014-06-27",null,"UNION DES VIGNERONS CELLIER DES DAUPHINS- CROZES HERMITAGE LA TOUVIERE ROUGE 75 CL"]
["CMAU 026508/8","2014-06-27",null,"UNION DES VIGNERONS CELLIER DES DAUPHINS - IGP MEDITERRANEE BLANC - BIB 5L"]
["CMAU 026508/8","2014-06-27",null,"UNION DES VIGNERONS CELLIER DES DAUPHINS - IGP MEDITERRANEE ROSE - BIB 5L"]
["CMAU 026508/8","2014-06-27"," ","UNION DES VIGNERONS CELLIER DES DAUPHINS - IGP MEDITERRANEE ROUGE - BIB 5L"]
["CMAU 026508/8","2014-06-27",null,"CHAMPAGNE JANISSON & FILS - CARTE BLANCHE BRUT "]
["CMAU 026508/8","2014-06-27",null,"PERNOD RICARD - CLAN CAMPBELL 40% 70CL"]
["CMAU 026508/8","2014-06-27","021900515","PERNOD RICARD - MALIBU LIQUEUR 21% 70CL"]
["CMAU 026508/8","2014-06-27",null,"PERNOD RICARD - ABSOLUT VODKA 40% 70CL"]
["CMAU 026508/8","2014-06-27",null,"PERNOD RICARD - WYBOROWA VODKA 40% NEW PACK 70CL"]
["CMAU 026508/8","2014-06-27",null,"PERNOD RICARD - CLAN CAMPBELL 40% 100 CL"]
["CMAU 026508/8","2014-06-27",null,"PERNOD RICARD - OLMECA TEQUILA BLANCO 38% 70CL"]
["CMAU 026508/8","2014-06-27",null,"PERNOD RICARD - OLMECA TEQUILA GOLD 38% 70CL"]
["CMAU 026508/8","2014-06-27",null,"PERNOD RICARD - CLAN CAMPBELL 40% 70CL"]
["CMAU 026508/8","2014-06-27",null,"GRANDS CHAIS DE France - VDP CHEVALIER A LICHINE MERLO - ROUGE"]
["CMAU 026508/8","2014-06-27",null,"GRANDS CHAIS DE France - WHISKY BOURBON JACK DANIEL'S 1L"]
["CMAU 026508/8","2014-06-27",null,"GRANDS CHAIS DE France - WHISKY BOURBON JACK DANIEL'S 70CL"]
["CMAU 026508/8","2014-06-27",null,"LACHETEAU - TOURAINE MARTIN LE CLOUQUIN ROUGE - 75CL"]
["CMAU 026508/8","2014-06-27",null,"LACHETEAU - TOURAINE MARTIN LE CLOUQUIN SSG ROUGE - 37,5 CL"]
["CMAU 026508/8","2014-06-27",null,"LACHETEAU - CHINON ROUGE"]
["CMAU 026508/8","2014-06-27",null,"LACHETEAU - MUSCADET SM/LIE AOC/AOP - CHT GOULAINE PAPILLON BLANC - 37,5 CL"]
["CMAU 026508/8","2014-06-27",null,"LACHETEAU - MUSCADET SM/LIE AOC/AOP - CHT GOULAINE PAPILLON BLANC - 75 CL"]
[]
["FCIU 251815/4","2014-07-08",null,"ASTORIA 9.5 BRUT 75 CL"]
[]
["ECMU 199822/5","2014-07-11",null,"UNION DES VIGNERONS CELLIER DES DAUPHINS - IGP MEDITERRANEE ROSE - BIB 5L"]
["ECMU 199822/5","2014-07-11",null,"UNION DES VIGNERONS CELLIER DES DAUPHINS - IGP MEDITERRANEE ROUGE - BIB 5L"]
["ECMU 199822/5","2014-07-11",null,"H CUVELIER ET FILS - SAINT JULIEN ROUGE - PAVILLON DE LEOVILLE POYF 2011"]
["ECMU 199822/5","2014-07-11",null,"H CUVELIER ET FILS - SAINT EMILION GRAND CRU ROUGE - PETIT CORBIN DESPAGNE 2008"]
["ECMU 199822/5","2014-07-11",null,"LES MAITRES VIGNERONS - GOURMANDISE ROUGE 75 CL"]
["ECMU 199822/5","2014-07-11",null,"SARL CPESO - CABARDES ROUGE - DOMAINE AUZIAS CUVEE PETIT M - rouge"]
["ECMU 199822/5","2014-07-11",null,"SARL CPESO - SAINT CHINIAN ROUGE - COL DE L'ORB"]
["ECMU 199822/5","2014-07-11",null,"SARL CPESO - BORDEAUX ROUGE - CHÂTEAU LA ROSE TOUR BLANC"]
["ECMU 199822/5","2014-07-11",null,"SARL CPESO - PETIT CHABLIS BLANC - MAISON JEAN BAPTISTE BEJOT"]
[]
["CAXU 652806/7","2014-07-23",null,"BOULARD BAUQUAIRE - CHAMPAGNE BRUT TRADITION / 3700736500016"]
["CAXU 652806/7","2014-07-23",null,"BOULARD BAUQUAIRE - CHAMPAGNE DEMI SEX TRADITION / 3700736500023"]
[]
["CLHU 438812/8","2014-08-08",null,"COMPAGNIE VINICOLE BARON EDMOND DE ROTHSCHILD - LES GRANGES -DOMAINES / 3309470001171"]
["CLHU 438812/8","2014-08-08",null,"CHAMPAGNE BOLLINGER - SPECIAL CUVEE BRUT"]
[]
["CMAU 039866/6","2014-09-04",null,"CAMUS - CHABANNEAU COGNAC ***/VS AVEC ETUIS"]
["CMAU 039866/6","2014-09-04","021101009","CAMUS - CAMUS COGNAC VSOP ELEGANCE AVEC ETUIS"]
["CMAU 039866/6","2014-09-04","021101002","CAMUS - CHABANNEAU COCGNAC XO AVEC ETUIS"]
["CMAU 039866/6","2014-09-04",null,"CAMUS - BERNEROY CALVADOS FINE"]
["CMAU 039866/6","2014-09-04",null,"BOUQUET DE LOIRE - SAUMUR CHAMPIGNY VOLTIGE DES CLOS DOM DES CLOS MAURICE"]
["CMAU 039866/6","2014-09-04",null,"BOUQUET DE LOIRE - POUILLY FUME MICHEL REDDE LE PETIT FUME"]
["CMAU 039866/6","2014-09-04",null,"LES MAITRES VIGNERONS - GOURMANDISE ROSE "]
["CMAU 039866/6","2014-09-04",null,"BOULARD BAUQUAIRE - DEMIES CHAMPAGNE GRANDE RESERVE - 3700736500061"]
["CMAU 039866/6","2014-09-04",null,"BOULARD BAUQUAIRE - CHAMPAGNE DEMI SEC TRADITION - 3700736500023"]
["CMAU 039866/6","2014-09-04",null,"BOULARD BAUQUAIRE - MAGNUMS BRUT GRANDE RESERVE - 3700736500078"]
["CMAU 039866/6","2014-09-04",null,"BOULARD BAUQUAIRE - CHAMPAGNE BRUT TRADITION - 3700736500016"]
["CMAU 039866/6","2014-09-04",null,"BOULARD BAUQUAIRE - BRUT CARTE NOIRE - 3700736500054"]
["CMAU 039866/6","2014-09-04","021300021","AYALA - BRUT MAJEUR"]
["CMAU 039866/6","2014-09-04",null,"AYALA - ROSE MAJEUR"]
["CMAU 039866/6","2014-09-04",null,"LES MAITRES VIGNERONS - GOURMANDISE ROSE "]
["CMAU 039866/6","2014-09-04",null,"LES MAITRES VIGNERONS - SAINT ROCH ROSE AOC COTES DE PROVENCE / FLUTE"]
["CMAU 039866/6","2014-09-04",null,"LES GRANDS CHAIS DE France - VIN DE PAYS ROUGE - CHEVALIER A LICHINE MERLO"]
["CMAU 039866/6","2014-09-04",null,"LES GRANDS CHAIS DE France - CIDRE BRUT BLANC JEAN LORET BOUCHE"]
["CMAU 039866/6","2014-09-04",null,"LES GRANDS CHAIS DE France - WHISKY BOURBON JACK DANIEL/S - 1L"]
["CMAU 039866/6","2014-09-04","021310119","PLAIMONT PRODUCTEURS - AOC ST MON ROSE 2013 CHEMIN DES PELERINS"]
["CMAU 039866/6","2014-09-04",null,"PLAIMONT PRODUCTEURS - AOC ST MON ROUGE 2013 CHEMIN DES PELERINS"]
["CMAU 039866/6","2014-09-04","021101009","CAMUS - COGNAC VSOP ELEGANCE AVEC ETUIS"]
[]
["CMAU 007794/3","2014-09-11",null,"CLEVERBEL - RHUM ARRANGE CAFE VANILLE 70CL"]
["CMAU 007794/3","2014-09-11",null,"CLEVERBEL - RHUM ARRANGE VANILLE VANGASSAYE 70CL"]
["CMAU 007794/3","2014-09-11",null,"CLEVERBEL - RHUM ARRANGE CHAMARRES EXOTIQUE 70CL"]
["CMAU 007794/3","2014-09-11",null,"BOUQUET DE LOIRE - VIN DE PAYS D'OC - BOUQUET DE MERLOT"]
["CMAU 007794/3","2014-09-11","022800004","BOUQUET DE LOIRE - VIN DE PAYS D'OC - BOUQUET DE SYRAH"]
["CMAU 007794/3","2014-09-11",null,"PERNOD RICARD - PASTIS 51 1L"]
["CMAU 007794/3","2014-09-11",null,"PERNOD RICARD - CLAN CAMPBELL 70CL"]
["CMAU 007794/3","2014-09-11",null,"PERNOD RICARD - BALLANTINE'S FINEST WHISKY 70CL"]
["CMAU 007794/3","2014-09-11",null,"PERNOD RICARD - LONG JOHN WHISKY 70CL"]
["CMAU 007794/3","2014-09-11",null,"PERNOD RICARD - JAMESON WHISKY 70 CL"]
["CMAU 007794/3","2014-09-11","021900525","PERNOD RICARD - MUMM CHAMPAGNE CORDON ROUGE"]
["CMAU 007794/3","2014-09-11",null,"PERNOD RICARD - CLAN CAMPBELL 1L"]
["CMAU 007794/3","2014-09-11",null,"PERNOD RICARD - ABSOLUT VODKA 1L"]
["CMAU 007794/3","2014-09-11",null,"PERNOD RICARD - LONG JOHN WHISKY 70CL"]
["CMAU 007794/3","2014-09-11",null,"MAISON HEBRARD - SAINT THIBEAUD MOELLEUX 2011 BLANC"]
["CMAU 007794/3","2014-09-11",null,"MAISON HEBRARD - SAINT THIBEAUD 2011 ROUGE"]
["CMAU 007794/3","2014-09-11",null,"MAISON HEBRARD - CHÂTEAU SAINT THIBEAUD ROSE 2011"]
["CMAU 007794/3","2014-09-11",null,"MAISON HEBRARD - CHÂTEAU PIAUT SIMON 2010 ROUGE"]
["CMAU 007794/3","2014-09-11",null,"MAISON HEBRARD - CHÂTEAU SAINT THIBEAUD BLANC 2012"]
["CMAU 007794/3","2014-09-11",null,"CORDIER - CHÂTEAU LA CROIX SAINT JACQUES BLAYE ROUGE 2011 "]
["CMAU 007794/3","2014-09-11",null,"CORDIER - CHÂTEAU RIVIERE PELEGRIS SC COTES DE BOURG ROUGE 2012"]
["CMAU 007794/3","2014-09-11","021900524","PERNORD RICARD - WYBOROWA VODKA 70CL"]
["CMAU 007794/3","2014-09-11",null,"PERNORD RICARD - CLAN CAMPBELL 1L"]
["CMAU 007794/3","2014-09-11",null,"SARL CPESO - CHÂTEAU COL DE L'ORB - SAINT CHINIAN ROUGE"]
["CMAU 007794/3","2014-09-11",null,"BOULARD BAUQUAIRE - CHAMPAGNE GRANDE RESERVE "]
["CMAU 007794/3","2014-09-11",null,"BOULARD BAUQUAIRE - CHAMPAGNE BRUT CARTE NOIRE"]
["CMAU 007794/3","2014-09-11",null,"LOUIS ROEDERER - BRUT PREMIER L. ROEDERER (ETUI GRAOHIQUE)"]
["CMAU 007794/3","2014-09-11",null,"LOUIS  ROEDERER - BRUT MILLESIME 2007 L. ROEDERER (ETUI GRAPHIQUE)"]
["CMAU 007794/3","2014-09-11",null,"LOUIS  ROEDERER - CHÂTEAU DE PEZ 2008 (CAISSE BOIS)"]
["CMAU 007794/3","2014-09-11",null,"MAISON HEBRARD - CHÂTEAU SAINT THIBEAUD MOELLEUX 2011 BLANC"]
["CMAU 007794/3","2014-09-11",null,"MAISON HEBRARD - SAINT THIBEAUD 2010 ROUGE"]
["CMAU 007794/3","2014-09-11",null,"MAISON HEBRARD - SAINT THIBEAUD BLANC SEC 2013"]
["CMAU 007794/3","2014-09-11",null,"MAISON HEBRARD - SAINT THIBEAUD ROSE 2013"]
["CMAU 007794/3","2014-09-11",null,"MAISON HEBRARD - CHÂTEAU PIAUT SIMON 2010 ROUGE"]
["CMAU 007794/3","2014-09-11",null,"MAISON HEBRARD - SAINT THIBEAUD ROSE 2013"]
["CMAU 007794/3","2014-09-11",null,"SARL CIDRES BIGOUD - CIDRE LE BRUN ARTISANAL BRUT"]
["CMAU 007794/3","2014-09-11","021900701","ARMAGNAC CASTAREDE - ARMAGNAC CASTAREDE VSOP 70CL ETUI"]
[]
["CMAU 202097/3","2014-09-16","021310305","SARL CPESO - DOMAINE AUZIAS CUVEE PETIT MONSIEUR - CABARDES ROUGE MEDAILLE DE BRONZE"]
["CMAU 202097/3","2014-09-16",null,"SARL CPESO - CHATEAUX CAZEAUX - COTES BLAYE 1/2"]
["CMAU 202097/3","2014-09-16",null,"UNION DES VIGNERONS - IGP MEDITERRANEE ROUGE"]
["CMAU 202097/3","2014-09-16",null,"UNION DES VIGNERONS - IGP MEDITERRANEE ROSE"]
["CMAU 202097/3","2014-09-16","021310014","LES GRANDS CHAIS DE France - ARMAGNAC AOC PRINCE D'ARIGNAC XO"]
["CMAU 202097/3","2014-09-16",null,"LES GRANDS CHAIS DE France - ARMAGNAC AOC PRINCE D'ARIGNAC VS + CANISTER (COFFRET)"]
["CMAU 202097/3","2014-09-16",null,"LES GRANDS CHAIS DE France- VIN DE MAROC ROSE - DOMAINE TOULAL GUERROUANE"]
["CMAU 202097/3","2014-09-16",null,"LES GRANDS CHAIS DE France-  WHISKY BOURBON JACK DANIEL'S 1L"]
["CMAU 202097/3","2014-09-16",null,"LES GRANDS CHAIS DE France-  WHISKY BOURBON JACK DANIEL'S 70CL"]
["CMAU 202097/3","2014-09-16",null,"LES GRANDS CHAIS DE France-  JELZIN VODKA"]
["CMAU 202097/3","2014-09-16",null,"CHAMPAGNE BOLLINGER - SPECIAL CUVEE BRUT"]
["CMAU 202097/3","2014-09-16","022810002","MAISON HEBRARD - SAINT THIBEAUD MOELLEUX BLANC 2013"]
["CMAU 202097/3","2014-09-16",null,"MAISON HEBRARD - SAINT THIBEAUD ROSE 2013"]
[]
["CMAU 196568/2","2014-09-03",null,"UNIONS DES VIGNERONS / CELLIER DES DAUPHINS - IGP MEDITERRANEE BLANC 5L"]
["CMAU 196568/2","2014-09-03",null,"UNIONS DES VIGNERONS / CELLIER DES DAUPHINS - IGP MEDITERRANEE ROSE 5L"]
["CMAU 196568/2","2014-09-03",null,"UNIONS DES VIGNERONS / CELLIER DES DAUPHINS - IGP MEDITERRANEE ROUGE 5L"]
["CMAU 196568/2","2014-09-03",null,"CODIER - CH. LA CROIX SAINT JACQUES BLAYE - COTES DE BORDEAUX"]
["CMAU 196568/2","2014-09-03",null,"CODIER - CH. ANDRON \"FUT\" CC MEDOC"]
["CMAU 196568/2","2014-09-03","021900500","PERNOD RICARD - PASTIS 51 1L"]
["CMAU 196568/2","2014-09-03","021900502","PERNOD RICARD - RICARD 70 CL"]
["CMAU 196568/2","2014-09-03","021900503","PERNOD RICARD - CLAN CAMPBELL 70CL"]
["CMAU 196568/2","2014-09-03",null,"PERNOD RICARD - BALLANTINES FINEST WHISKY 70CL"]
["CMAU 196568/2","2014-09-03",null,"PERNOD RICARD - CHIVAS REGAL WHISKY 12 YO 70CL"]
["CMAU 196568/2","2014-09-03",null,"PERNOD RICARD - CHIVAS REGAL WHISKY 18 YO 70CL"]
["CMAU 196568/2","2014-09-03",null,"PERNOD RICARD - LONG JOHN WHISKY 70CL"]
["CMAU 196568/2","2014-09-03",null,"PERNOD RICARD - BEEFEATER GIN 70 CL"]
["CMAU 196568/2","2014-09-03",null,"PERNOD RICARD - CLAN CAMPBELL 100CL"]
["CMAU 196568/2","2014-09-03",null,"PERNOD RICARD - ABSOLUT VODKA 100CL"]
["CMAU 196568/2","2014-09-03","021305011","H. CUVELIER & FILS - PETIT CORBIN DESPAGNE 2008 ST EMILION GRAND CRU AOC ROUGE"]
["CMAU 196568/2","2014-09-03",null,"LES GRANDS CHAIS DE France - VODKA JELZIN 1L"]
[]
["TEMU 540158/9","2014-10-14",null,"LES GRANDS CHAIS DE France - VODKA JELZIN 1L"]
[]
["TRHU 133969/9","2014-11-05",null,"CHAMPAGNE AYALA - BRUT MAJEUR"]
["TRHU 133969/9","2014-11-05","021300022","CHAMPAGNE AYALA - ROSE MAJEUR"]
[]
["TEMU 245269/0","2014-12-09",null,"SARL CIDRES BIGOUD - CIDRE LE BRUN ARTISANAL BRUT 75 CL"]
["TEMU 245269/0","2014-12-09",null,"CORDIER - CHÂTEAU ANDRON "]
["TEMU 245269/0","2014-12-09",null,"CORDIER - CHÂTEAU MEYNEY ST ESTEPHE"]
["TEMU 245269/0","2014-12-09",null,"PERNOD RICARD - RICARD 100 CL"]
["TEMU 245269/0","2014-12-09",null,"PERNORD RICARD - BALLANTINES FINEST WHISKY 70 CL NRF "]
["TEMU 245269/0","2014-12-09",null,"PERNORD RICARD - BALLANTINES FINEST WHISKY 70 CL"]
["TEMU 245269/0","2014-12-09",null,"PERNORD RICARD - BEEFEATER GIN 70CL"]
["TEMU 245269/0","2014-12-09",null,"PERNORD RICARD - JAMESON WHISKY 70CL"]
["TEMU 245269/0","2014-12-09","021900609","PERNORD RICARD - HAVANA CLUB RHUM ANEJO 3 YEARS OLD 70CL"]
["TEMU 245269/0","2014-12-09",null,"PERNORD RICARD - CLAN CAMPBELL 100CL"]
[]
["CMAU 217604/0","2015-01-09",null,"BOUQUET DE LOIRE - Bouquet de Merlot"]
["CMAU 217604/0","2015-01-09",null,"BOUQUET DE LOIRE - Bouquet de Syrah Rosé"]
["CMAU 217604/0","2015-01-09","021900548","CHAMPAGNE JANISSON & FILS - Carte blanche brut"]
["CMAU 217604/0","2015-01-09",null,"CPESO - Château la rose (Bordeaux rouge)"]
["CMAU 217604/0","2015-01-09",null,"CPESO - Château Pagueneau (Bordeaux rouge)"]
["CMAU 217604/0","2015-01-09",null,"CPESO - Château Cazeaux (Cotes de Blaye)"]
["CMAU 217604/0","2015-01-09","021900016","LES GRANDS CHAIS DE France - Vodka Jelzin (1L)"]
["CMAU 217604/0","2015-01-09",null,"LES GRANDS CHAIS DE France - Cidre brut Jean Loret Bouche"]
["CMAU 217604/0","2015-01-09",null,"LES GRANDS CHAIS DE France - Vin du maroc domaine Toulal Guerrouane"]
["CMAU 217604/0","2015-01-09",null,"LES GRANDS CHAIS DE France - Whisky Bourbon Jack Daniel's (1L)"]
["CMAU 217604/0","2015-01-09",null,"BOULARD BAUQUAIRE - Champagne rosé"]
["CMAU 217604/0","2015-01-09",null,"BOULARD BAUQUAIRE - Champagne grande reserve"]
["CMAU 217604/0","2015-01-09",null,"BOULARD BAUQUAIRE - Champagne  brut tradition"]
[]
["FCIU 445642/6","2015-01-15",null,"LES MAITRES VIGNERONS - GOURMANDISE ROSE "]
["FCIU 445642/6","2015-01-15",null,"LES MAITRES VIGNERONS - SAINT ROCHE ROSE"]
["FCIU 445642/6","2015-01-15","021900016","LES GRANDS CHAIS DE France - VODKA JELZIN 1L"]
["FCIU 445642/6","2015-01-15",null,"LES GRANDS CHAIS DE France - CIDRE BRUT JEAN LORET BOUCHE"]
["FCIU 445642/6","2015-01-15",null,"LES GRANDS CHAIS DE France - VIN DE MAROC ROSE DOMAINE TOULAL"]
["FCIU 445642/6","2015-01-15",null,"SARL CIDRES BIGOUD - Cidre Le Brun artisanal brut"]
["FCIU 445642/6","2015-01-15","021900113","LACHETEAU - SAUMUR ROUGE"]
["FCIU 445642/6","2015-01-15",null,"LACHETEAU - MUSCADET SM/LIE AOC/AOP BLANC"]
["FCIU 445642/6","2015-01-15",null,"LACHETEAU - BOURGUEIL ROUGE"]
["FCIU 445642/6","2015-01-15",null,"LACHETEAU - SAINT NICOLAS DE BOURGUEILA ROUGE"]
["FCIU 445642/6","2015-01-15",null,"LACHETEAU - POUILLY FUME"]
[]
["CAIU 896641/4","2015-02-16",null,"PERNORD ABSINTHE 68% 70 CL"]
["CAIU 896641/4","2015-02-16",null,"RICARD 45% 100CL"]
["CAIU 896641/4","2015-02-16","021900503","CLAN CAMPBELL 40% 70CL"]
["CAIU 896641/4","2015-02-16",null,"BALLANTINE'S FINEST WHISKY 40% 70CL"]
["CAIU 896641/4","2015-02-16",null,"CHIVAS REGAL WHISKY 12 YO 40% 70 CL NRF ETUI"]
["CAIU 896641/4","2015-02-16","021900509","BEEFEATER GIN 70CL 40%"]
["CAIU 896641/4","2015-02-16",null,"MALIBU LIQUEUR 21% 70CL  "]
["CAIU 896641/4","2015-02-16","021900516","ABSOLUT VODKA 40% 70CL "]
["CAIU 896641/4","2015-02-16","021900520","JAMESON WHISKY 40% 70CL "]
["CAIU 896641/4","2015-02-16","021900609","HAVANA CLUB RHUM ANEJO 3 YEARS OLD 40% 70CL "]
["CAIU 896641/4","2015-02-16",null,"CLAN CAMPBELL 40% 100CL"]
["CAIU 896641/4","2015-02-16",null,"CHIVAS REGAL WHISKY 18 YO 40% 100 CL  ETUI"]
[]
["CMAU 001506/8","2015-05-11",null,"MAISON HEBRARD - CHÂTEAU LES AUBIERS 2010/AOC premières Côtes de Blaye Rouge 75 cl"]
["CMAU 001506/8","2015-05-11",null,"MAISON HEBRARD - SAINT THIBEAUD 2012/AOC Bordeaux Rouge"]
["CMAU 001506/8","2015-05-11",null,"MAISON HEBRARD - CHÂTEAU PIAUT SIMON 2011/AOC GRAVES ROUGE"]
["CMAU 001506/8","2015-05-11",null,"SARL CPESO - SAINT CHINIAN ROUGE / ARGENT"]
["CMAU 001506/8","2015-05-11",null,"SARL CPESO - SAINT CHINIAN ROUGE"]
["CMAU 001506/8","2015-05-11",null,"SARL CPESO - PETIT CHABLIS BLANC (GENCODE CARTON 3357400603063)"]
["CMAU 001506/8","2015-05-11",null,"SARL CPESO - BORDEAUX ROUGE / MARQUIS DE BALMONT"]
["CMAU 001506/8","2015-05-11",null,"SARL CPESO - HAUTES COTES DE BEAUNES BLC"]
["CMAU 001506/8","2015-05-11",null,"SARL CPESO - BORDEAUX ROUGE / CHÂTEAU PAGUENEAU"]
["CMAU 001506/8","2015-05-11",null,"H CUVELIE & FILS - CHATEAUX LACROIX SAINT ESTEPHE 2011 / AOC rouge 2nd Vin/wine Ch. Crock"]
["CMAU 001506/8","2015-05-11",null,"H CUVELIE & FILS - CHATEAUX PAVILLON DE LEOVILLE POYFERRE / AOC Rouge 2nd Vin/wine Ch. Léoville Poyferré"]
["CMAU 001506/8","2015-05-11","021305012-12","H CUVELIE & FILS - HAUTES GRAVES DEA 2011 / POMEROL AOC Rouge"]
["CMAU 001506/8","2015-05-11",null,"HOREAU-BEYLOT - CH. MARTINET GC SAINT EMILION GRAND CRU 2007"]
["CMAU 001506/8","2015-05-11",null,"CORDIER MESTREZAT - CH. LA CROIX SAINT JACQUES BLAYE/COTES DE BORDEAUX (Gencod bouteille : 3148597117620)"]
["CMAU 001506/8","2015-05-11",null,"TORRES - TORRES SAN VALENTIN PARELLADA "]
["CMAU 001506/8","2015-05-11","022000005","TORRES - TORRES SAN VALENTIN GARNACHA"]
["CMAU 001506/8","2015-05-11",null,"LOUIS ROEDERER - BRUT MILLESIME 2008 L. ROEDERER (ETUI GRAPHIQUE) / 75 cl"]
["CMAU 001506/8","2015-05-11","021900540","LOUIS ROEDERER - BRUT MILLESIME 2008 L. ROEDERER (ETUI GRAPHIQUE) / 75 cl"]
["CMAU 001506/8","2015-05-11",null,"LOUIS ROEDERER - CHÂTEAU HAUT-BEAUSEJOUR 2011 - 75 CL"]
["CMAU 001506/8","2015-05-11","021900543","LOUIS ROEDERER - CHÂTEAU DE PEZ 2011 (CAISSE BOIS) - 75 CL"]
[]
["CMAU 178851/9","2015-05-14",null,"LACHETEAU - ST NICOLAS DE BOURGUEILA ROUGE M MARTIN LES ECHALIERS NV CRD "]
["CMAU 178851/9","2015-05-14",null,"SAS LES DOMAINES AURIOL - DNE LA CROIX D'ALINE ROUGE 2013 AOP SAINT CHINIAN"]
["CMAU 178851/9","2015-05-14","021310208","SAS LES DOMAINES AURIOL - SYRAH-LA-CHAPELLE DE MONTMIJA 2013 IGP PAYS D'OC ROUGE VIN BIOLOGIQUE"]
["CMAU 178851/9","2015-05-14","021310208","SAS LES DOMAINES AURIOL - SYRAH-LA-CHAPELLE DE MONTMIJA IGP PAYS D'OC ROUGE 2014 VIN BIOLOGIQUE"]
["CMAU 178851/9","2015-05-14",null,"UNION DES VIGNERONS DES COTES DU RHONE/CELIER DES DAUPHINS - COTES DU RHONE CHÂTEAU DE L'ESTAGNOL ROUGE 75"]
["CMAU 178851/9","2015-05-14",null,"UNION DES VIGNERONS DES COTES DU RHONE/CELIER DES DAUPHINS - CROZES HERMITAGE LA TOUVIERE ROUGE 2012 "]
["CMAU 178851/9","2015-05-14","021900651","PERNOD RICARD - ABSOLUT VODKA 40% / 100 CL"]
["CMAU 178851/9","2015-05-14",null,"BOULARD-BAUQUAIRE - MAGNUMS MAGNUM BRUT GRANDE RESERVE"]
["CMAU 178851/9","2015-05-14",null,"SARL CPESO - SAINT CHINIAN ROUGE ARGENT"]
["CMAU 178851/9","2015-05-14",null,"SARL CPESO - PETIT CHABLIS BLANC"]
["CMAU 178851/9","2015-05-14",null,"SARL CPESO - BORDEAUX ROUGE"]
["CMAU 178851/9","2015-05-14",null,"CAHORS ROUGE"]
["CMAU 178851/9","2015-05-14",null,"VDP CARCASSONNE ROUGE"]
[]
["CMAU 032896/7","2015-06-15",null,"BOULARD BAUQUAIRE - CHAMPAGNE BRUT TRADITION"]
["CMAU 032896/7","2015-06-15",null,"BOULARD BAUQUAIRE - Champagne rose"]
["CMAU 032896/7","2015-06-15",null,"PERNOD RICARD - RICARD 45% 100 CL"]
["CMAU 032896/7","2015-06-15",null,"PERNOD RICARD - Chivas regal whisky 18 yo 40% - 70CL"]
[]
["TEMU 319653/0","2015-07-20","021900027","GRANDS CHAIS DE France - VIN DU MAROC DOMAINE TOULAL GUERROUANE"]
["TEMU 319653/0","2015-07-20","021400576","ETS CORDIER MESTREZAT - CH. LA CROIX SAINT JACQUES 2013"]
["TEMU 319653/0","2015-07-20","021305105","COMPAGNIE VINICOLE BARON EDMOND DE ROTHSCHILD - CHÂTEAU DES LAURETS 2011"]
["TEMU 319653/0","2015-07-20","022810050","MAISON HEBRARD - HAUT SOCIONDO 2012 AOC COTES DE BLAYE ROUGE"]
["TEMU 319653/0","2015-07-20","021310317","SARL CPESO - SAINT CHINIAN ROUGE - CHÂTEAU COL DE L'ORB"]
["TEMU 319653/0","2015-07-20","021101000","CAMUS - CHABANNEAU COGNAC AVEC ETUIS"]
[]
["TCKU 271294/1","2015-07-28","021900110","LACHETEAU - TOURAINE ROUGE / M MARTIN LE CLOUQUIN - 75 CL"]
["TCKU 271294/1","2015-07-28","021900210","LACHETEAU - 1/2 TOURAINE ROUGE / M MARTIN LE CLOUQUIN - 37,5 CL"]
["TCKU 271294/1","2015-07-28","021900415","LACHETEAU - CHINON ROUGE / M MARTIN LES BERNIERES"]
["TCKU 271294/1","2015-07-28","021900424","LACHETEAU - MUSCADET BLANC  / CHÂTEAU DE GOULAINE PAPILLON"]
["TCKU 271294/1","2015-07-28","021900425","LACHETEAU - POUILLY FUME BLANC"]
["TCKU 271294/1","2015-07-28","021900430","LACHETEAU - 1/2 MUSCADET BLANC  / CHÂTEAU DE GOULAINE PAPILLON - 37,5 CL"]
["TCKU 271294/1","2015-07-28","021310256","LES MAITRES VIGNERONS - GOURMANDISE ROSE"]
["TCKU 271294/1","2015-07-28","021310257","LES MAITRES VIGNERONS - SAINT ROCH - FLUTE CORSET"]
["TCKU 271294/1","2015-07-28","021310020","LES GRANDS CHAIS DE France - CHIANTI DOCG ROUGE / PICCINI SANGIOVESE"]
["TCKU 271294/1","2015-07-28","021310256","LES MAITRES VIGNERONS - GOURMANDISE ROSE"]
["TCKU 271294/1","2015-07-28","021310257","LES MAITRES VIGNERONS - SAINT ROCH - FLUTE CORSET"]
[]
["ECMU 155040/0","2016-07-09","022810005","MAISON HEBRARD - SAINT THIBEAUD BDX ROUGE 2012"]
["ECMU 155040/0","2016-07-09","021300009","CHAMPAGNE BOULARD BAUQUAIRE - CHAMPAGNE BRUT TRADITION"]
["ECMU 155040/0","2016-07-09","DAGAB001454","COMPAGNIE VINICOLE BARON EDMOND DE ROTHSCHILD - CHÂTEAU DES LAURETS 2012"]
[]
["TEMU 319813/2","2015-10-01","021310010","LES GRANDS CHAIS DE France - VPAYS D'OC - CHEVALIER LACHINE MERLO ROUGE"]
["TEMU 319813/2","2015-10-01","DARAA004564","LES GRANDS CHAIS DE France - ORVIETO CLASSICO D'OC SAN CAIO PROCANICO VERDEL BLANC"]
["TEMU 319813/2","2015-10-01","021310020","LES GRANDS CHAIS DE France - CHIANTI DOCG PICINNI SANGIOVESE ROUGE"]
["TEMU 319813/2","2015-10-01","021320025","LES GRANDS CHAIS DE France - SICILIA IGP VIALA NERO D'AVOLA VIS ROUGE"]
["TEMU 319813/2","2015-10-01","021900027","LES GRANDS CHAIS DE France - VIN DU MAROC DOMAINE TOULAL GUERROUANE ROSE"]
["TEMU 319813/2","2015-10-01","021900031","LES GRANDS CHAIS DE France - VIN DU MAROC DOMAINE TOULAL GUERROUANE ROUGE"]
["TEMU 319813/2","2015-10-01","021310315","SARL CPESO - GEWURZTRAMINER"]
["TEMU 319813/2","2015-10-01","021310402","SARL CPESO - BORDEAUX ROUGE"]
["TEMU 319813/2","2015-10-01","021310250","LES MAITRES VIGNERONS - GOURMANDISE ROUGE "]
["TEMU 319813/2","2015-10-01","021310256","LES MAITRES VIGNERONS - GOURMANDISE ROSE"]
[]
["CMAU 019331/0","2015-11-03","IAKAA020158         ","CLEVERBEL - RHUM TRADITIONNEL BLANC"]
["CMAU 019331/0","2015-11-03","021200650           ","CLEVERBEL - RHUM ARRANGE CAFE VANILLE"]
["CMAU 019331/0","2015-11-03","021200651           ","CLEVERBEL - RHUM ARRANGE VANILLE VANGASSAYE"]
["CMAU 019331/0","2015-11-03","021200652           ","CLEVERBEL - RHUM ARRANGE CHAMARRES EXOTIQUE"]
["CMAU 019331/0","2015-11-03","IAKAA020196         ","CLEVERBEL - RHUM TRADITIONNEL BLOND"]
["CMAU 019331/0","2015-11-03","021320300           ","SARL CPESO - BORDEAUX ROUGE // MARQUIS DE BALMONT"]
["CMAU 019331/0","2015-11-03","021310402           ","SARL CPESO - BORDEAUX ROUGE // CHÂTEAU PAGUENEAU"]
["CMAU 019331/0","2015-11-03","021310255           ","LES MAITRES VIGNERONS - SAINT ROCH ROSE // SENSATION ST ROCH \"ARGENT\""]
["CMAU 019331/0","2015-11-03","021310257           ","LES MAITRES VIGNERONS - SAINT ROCH ROSE // FLUTE A CORSET"]
[]
["CMAU 122384/7","2015-12-04","022800100","SARL CIDRES BIGOUD - CIDRE LE BRUN ARTISANAL BRUT"]
["CMAU 122384/7","2015-12-04","022800007","BOUQUET DE LOIRE - SAINT NICOLAS DE BOURGUEL DOM. GODEFROY"]
[]
["CMAU 061044/0","2016-06-24","021310256","LES MAITRES VIGNERONS - GOURMANDISE ROSE"]
["CMAU 061044/0","2016-06-24","UDAA932717","LES MAITRES VIGNERONS - SOMMELIER MAITRES VIGNERONS - ECHANTILLONS"]
["CMAU 061044/0","2016-06-24","DANAA501002","CHÂTEAU D'AMPUIS E.GUIGAL - COTES DU RHONE ROUGE"]
["CMAU 061044/0","2016-06-24","021310304","SARL CPESO - DOMAINE AUZIAS VDP CARCASSONNE ROSE"]
["CMAU 061044/0","2016-06-24","021900558 ","LOUIS LATOUR - GEVREY-CHAMBERTIN"]
["CMAU 061044/0","2016-06-24","021900560","LOUIS LATOUR - PINOT NOIR BOURGOGNE"]
["CMAU 061044/0","2016-06-24","021900424","LACHETEAU - MUSCADET SM/LIE BLANC"]
["CMAU 061044/0","2016-06-24","GAAAA003508","MIGUEL TORRES - RGE - SELECCION DE TORRES SL CELESTE CRIANZA"]
["CMAU 061044/0","2016-06-24","DADAA571144","MAISON HEBRARD - CHÂTEAU CHADEUIL ROUGE  "]
["CMAU 061044/0","2016-06-24","DADAA005604 ","MAISON HEBRARD - CHÂTEAU LES AUBIERS ROUGE"]
["CMAU 061044/0","2016-06-24","DADAA321112","MAISON HEBRARD - PAVILLON TRIANON ROUGE"]
["CMAU 061044/0","2016-06-24","021310013","LES GRANDS CHAIS DE France - CIDRE JEAN LORET BLANC"]
["CMAU 061044/0","2016-06-24","021900027           ","LES GRANDS CHAIS DE France - DOMAINE TOULAL ROSE"]
["CMAU 061044/0","2016-06-24","021900031           ","LES GRANDS CHAIS DE France - DOMAINE TOULAL ROUGE"]
["CMAU 061044/0","2016-06-24","021900030 ","LES GRANDS CHAIS DE France - MERCUREY LA DOMAL ROUGE"]
["CMAU 061044/0","2016-06-24","021900012","LES GRANDS CHAIS DE France - WISKY JACK DANIEL'S 70 CL"]
["CMAU 061044/0","2016-06-24","021500270           ","CELLIERS DES DAUPHINS - IGP MEDITERRANEE ROSE / ENCLAVE DES PAPES"]
["CMAU 061044/0","2016-06-24","021500271           ","CELLIERS DES DAUPHINS - IGP MEDITERRANEE ROUGE /  ENCLAVE DES PAPES"]
["CMAU 061044/0","2016-06-24","021900027           ","LES GRANDS CHAIS DE France - DOMAINE TOULAL ROSE"]
["CMAU 061044/0","2016-06-24","DAGAB001508","COMPAGNIE VINICOLE BARON EDMOND - LES GRANGES"]
["CMAU 061044/0","2016-06-24","DCAAA610256","HOREAU-BEYLOT - CH MARTINET"]
["CMAU 061044/0","2016-06-24","DAGAA501623","CORDIER - CH. BEL AIR ROUGE"]
["CMAU 061044/0","2016-06-24","021300009","BOULARD BAUQUAIRE - CHAMPAGNE BRUT TRADITION"]
["CMAU 061044/0","2016-06-24","DCJAA003753","GRANDEAU LAUDUC - CHÂTEAU LAUDUC BLANC"]
[]
["CMAU 066536/1","2016-01-11","021900027","LES GRANDS CHAIS DE France - VIN DU MAROC DOMMAINE TOULAL GUERROUANE ROSE"]
["CMAU 066536/1","2016-01-11","021900029     ","LES GRANDS CHAIS DE France - WHISKY BOURBON JACK DANIEL'S 1L"]
["CMAU 066536/1","2016-01-11","DAGAA304033         ","ETS CORDIER - CHATEAU ANDRON \"FUT\" CC"]
["CMAU 066536/1","2016-01-11","DAGAA406645      ","ETS CORDIER - CHATEAU LACROIX DE QUEYNAC SC (BORDEAUX ROUGE)"]
["CMAU 066536/1","2016-01-11","021500203       ","PAUL JABOULET AINE - COTES DU RHONE \"PARALLELE 45\" rouge"]
["CMAU 066536/1","2016-01-11","021310010          ","LES GRANDS CHAISE DE France - CHEVALIER A LICHINE MERLO ROUGE (VIN DE PAYS)"]
["CMAU 066536/1","2016-01-11","021900027","LES GRANDS CHAIS DE France - VIN DU MAROC DOMMAINE TOULAL GUERROUANE ROSE"]
["CMAU 066536/1","2016-01-11","021900029     ","LES GRANDS CHAIS DE France - WHISKY BOURBON JACK DANIEL'S 1L"]
["CMAU 066536/1","2016-01-11","021900031   ","LES GRANDS CHAIS DE France - VIN DU MAROC DOMMAINE TOULAL GUERROUANE ROUGE"]
["CMAU 066536/1","2016-01-11","021310500     ","SARL CPESO - CAHORS (MARQUIS D'OLT)"]
["CMAU 066536/1","2016-01-11","021310317          ","SARL CPESO - SAINT CHINIAN ROUGE (COL DE L'ORB)"]
["CMAU 066536/1","2016-01-11","021310325      ","SARL CPESO - COTES DE BLAYE (CH CAZEAUX )"]
["CMAU 066536/1","2016-01-11","021320300        ","SARL CPESO - BORDEAUX ROUGE (MARQUIS DE BALMONT)"]
["CMAU 066536/1","2016-01-11","021310402   ","SARL CPESO - BORDEAUX ROUGE (CHÂTEAU PAGUENEAU)"]
["CMAU 066536/1","2016-01-11","021500269     ","UNION DES VIGNERONS DES COTES DU RHONE - IGP MEDITERANNEE BLANC "]
["CMAU 066536/1","2016-01-11","021500270   ","UNION DES VIGNERONS DES COTES DU RHONE - IGP MEDITERANNEE ROSE"]
["CMAU 066536/1","2016-01-11","021500271     ","UNION DES VIGNERONS DES COTES DU RHONE - IGP MEDITERANNEE  ROUGE"]
["CMAU 066536/1","2016-01-11","021500269     ","UNION DES VIGNERONS DES COTES DU RHONE - IGP MEDITERANNEE BLANC"]
["CMAU 066536/1","2016-01-11","021500270   ","UNION DES VIGNERONS DES COTES DU RHONE - IGP MEDITERANNEE ROSE"]
["CMAU 066536/1","2016-01-11","021500271     ","UNION DES VIGNERONS DES COTES DU RHONE - IGP MEDITERANNEE  ROUGE"]
[]
["INKU 261026/2","2016-02-03","FABAA046447","SODIBEL - CANTI PROSECCO"]
[]
["TEMU 330930/2","2016-02-18","021310010","GRANDS CHAIS DE France - CHAVLIER A LICHINE ROUGE"]
["TEMU 330930/2","2016-02-18","021900027","GRANDS CHAIS DE France - VIN DU MAROC DOMAINE TOULAL ROSE"]
["TEMU 330930/2","2016-02-18","021900029","GRANDS CHAIS DE France - WHISKY BOURBON JACK DANIEL'S 1L"]
["TEMU 330930/2","2016-02-18","021900030","GRANDS CHAIS DE France - MERCUREY ROUGE - LA DOMAL"]
["TEMU 330930/2","2016-02-18","021900031","GRANDS CHAIS DE France - VIN DU MAROC DOMAINE TOULAL ROUGE"]
["TEMU 330930/2","2016-02-18","022800001","BOUQUET DE LOIRE - BOUQUET DE MERLOT"]
["TEMU 330930/2","2016-02-18","022800007","BOUQUET DE LOIRE - SAINT NICOLAS DE BOURGEUIL DOM GODEFROY"]
["TEMU 330930/2","2016-02-18","021300001","CHAMPAGNE BOULARD BAUQUAIRE - CHAMPAGNE ROSE"]
["TEMU 330930/2","2016-02-18","021300007","CHAMPAGNE BOULARD BAUQUAIRE - MAGNUM BRUT GRANDE RESERVE"]
["TEMU 330930/2","2016-02-18","021300009","CHAMPAGNE BOULARD BAUQUAIRE - CHAMPAGNE BRUT TRADITION"]
["TEMU 330930/2","2016-02-18","021310500","SARL CPESO - CAHORS ROUGE - MARQUIS D'OLT"]
["TEMU 330930/2","2016-02-18","021310317","SARL CPESO - SAINT CHINIAN ROUGE - COL DE L'ORB"]
["TEMU 330930/2","2016-02-18","021310325","SARL CPESO - COTES DE BLAYE - CH CAZEAUX"]
["TEMU 330930/2","2016-02-18","021320300","SARL CPESO - BORDEAUX ROUGE - MARQUIS DE BALMONT"]
["TEMU 330930/2","2016-02-18","021310402","SARL CPESO - BORDEAUX ROUGE - CHÂTEAU PAGUENEAU"]
["TEMU 330930/2","2016-02-18","DAGAA406645","ETS CORDIER - CHÂTEAU LA CROIX DE QUEYNAC SC"]
["TEMU 330930/2","2016-02-18","DAGAA304033","ETS CORDIER - CHÂTEAU ANDRON \"FUT\" CC"]
["TEMU 330930/2","2016-02-18","021500203","PAUL JABOULET AINE - COTES DU RHONE \"PARALLELE 45\" ROUGE"]
["TEMU 330930/2","2016-02-18","021310250","LES MAITRES VIGNERONS - GOURMANDISE ROUGE"]
["TEMU 330930/2","2016-02-18","021310256 ","LES MAITRES VIGNERONS - GOURMANDISE ROSE"]
[]
["MSCU 017755/9","2016-03-03","022300600 ","SAVANNA DRY CIDER NRB BBE - 33CL"]
["MSCU 017755/9","2016-03-03","022300567  ","NEETHLINGSHOF GEWURZTRAMINER SAVIN - 75 CL"]
["MSCU 017755/9","2016-03-03","022300404      ","FLEUR DU CAP SAUVIGNON BLANC 2015"]
["MSCU 017755/9","2016-03-03","022300402","FLEUR DU CAP MERLOT 2013"]
["MSCU 017755/9","2016-03-03","022300401","FLEUR DU CAP CHARDONNAY SAVIN 2015"]
["MSCU 017755/9","2016-03-03","022300341  ","DROSTDY-HOF CHARDONNAY SAVIN 2015"]
["MSCU 017755/9","2016-03-03","021200518    ","OBIKWA PINOTAGE SAVIN 2014"]
["MSCU 017755/9","2016-03-03","021200517  ","OBIKWA CABERNET SAUVIGNON SAVIN 2015"]
["MSCU 017755/9","2016-03-03","021200516","OBIKWA CHENIN BLANC SAVIN 2014"]
["MSCU 017755/9","2016-03-03","021200514  ","OBIKWA SAUVIGNON BLANC SAVIN 2015"]
["MSCU 017755/9","2016-03-03","021200511","OBIKWA CHARDONNAY SAVIN 2015"]
["MSCU 017755/9","2016-03-03","021200404","ZONNEBLOEM SHIRAZ 2014"]
["MSCU 017755/9","2016-03-03","021100340  ","NEDERBURG WINEMASTERS RIESLING SAVIN 2015"]
["MSCU 017755/9","2016-03-03","0021100118 ","NEDERBURG ROSE SAVIN 2015 - FOUNDATION"]
["MSCU 017755/9","2016-03-03","021100301","NEDERBURG WINEMASTERS SAUVIGNON BLANC SAVIN 2015"]
["MSCU 017755/9","2016-03-03","021100300 ","NEDERBURG CUVEE BRUT SPARKLING WINE"]
["MSCU 017755/9","2016-03-03","021100119 ","NEDERBURG WINEMASTERS SHIRAZ 2013"]
["MSCU 017755/9","2016-03-03","021100116    ","NEDERBURG WINEMASTERS CABERNET SAUVIGNON 2013"]
["MSCU 017755/9","2016-03-03","021100113","NEDERBURG WINEMASTERS SPECIAL LATE HARVEST 2015"]
["MSCU 017755/9","2016-03-03","EAAAA001284 ","L'AVENIR - PINOTAGE ROSÉ FAR AND NEAR "]
[]
["CMAU 191794/0","2016-03-15","022800100","SARL CIDRES BIGOUD - CIDRE LE BRUN ARTISANAL"]
["CMAU 191794/0","2016-03-15","021101003","CAMUS - BERNEROY CALVADOS FINE"]
["CMAU 191794/0","2016-03-15","021310207","LES DOMAINES AURIOL - DOMAINE LA CROIX D ALINE ROUGE / AOP SAINT CHINIAN"]
["CMAU 191794/0","2016-03-15","021300002","BOULARD BAUQUAIRE - CHAMPAGNE GRANDE RESERVE"]
["CMAU 191794/0","2016-03-15","021300009","BOULARD BAUQUAIRE - CHAMPAGNE BRUT TRADITION"]
["CMAU 191794/0","2016-03-15","021300006","BOULARD BAUQUAIRE - CHAMPAGNE TRADITION DEMI SEC"]
["CMAU 191794/0","2016-03-15","021300001","BOULARD BAUQUAIRE - CHAMPAGNE ROSE"]
["CMAU 191794/0","2016-03-15","021300004","BOULARD BAUQUAIRE - CUVEE MELANIE"]
["CMAU 191794/0","2016-03-15","021300005","BOULARD BAUQUAIRE - GRANDE RESERVE DEMIES BOUTEILLES/ 37,5 CL"]
["CMAU 191794/0","2016-03-15","021300007","BOULARD BAUQUAIRE - MAGNUM BRUT GRANDE RESERVE"]
["CMAU 191794/0","2016-03-15","021300008","BOULARD BAUQUAIRE - VIEILLES VIGNES TREPAIL"]
["CMAU 191794/0","2016-03-15","022800001","BOUQUET DE LOIRE - BOUQUET DE MERLOT / VON DE PAYS D OC"]
["CMAU 191794/0","2016-03-15","DCJAA003418","LAUDUC GRANDEAU - CHÂTEAU LAUDUC CLASSIC 2014 / BORDEAUX ROUGE"]
["CMAU 191794/0","2016-03-15","DCJAA002992","LAUDUC GRANDEAU - CHÂTEAU LAUDUC CLASSIC 2014 / BORDEAUX BLANC"]
["CMAU 191794/0","2016-03-15","021310010","GRANDS CHAIS DE France - CHAVALIER A LICHINE MERLO / ROUGE"]
["CMAU 191794/0","2016-03-15","021900027","GRANDS CHAIS DE France - DOMAINE TOULAL GUERROUANE / ROSE"]
["CMAU 191794/0","2016-03-15","021900012","GRANDS CHAIS DE France - WHISKY BOURBON JACK DANIEL'S - 70 CL"]
["CMAU 191794/0","2016-03-15","021900029","GRANDS CHAIS DE France - WHISKY BOURBON JACK DANIEL'S - 1 L"]
["CMAU 191794/0","2016-03-15","021900415","LACHETEAU - CHINON ROUGE / M MARTIN LES BERNIERES"]
["CMAU 191794/0","2016-03-15","021900425","LACHETEAU - POUILLY FUME / BLANC"]
["CMAU 191794/0","2016-03-15","021900207","LACHETEAU - BOURGUEIL ROUGE / M MARTIN LE PREVOT"]
["CMAU 191794/0","2016-03-15","021900110","LACHETEAU - TOURAINE / M MARTIN LE CLOUQUIN"]
["CMAU 191794/0","2016-03-15","024100001","UCCOAR SAS - ALLEE DES FRENES / BORDEAUX ROUGE"]
["CMAU 191794/0","2016-03-15","022600100","HENRY FESSY - BROUILLY"]
["CMAU 191794/0","2016-03-15","022600102","HENRY FESSY - MOULIN A VENT"]
["CMAU 191794/0","2016-03-15","022600103","HENRY FESSY - SAINT AMOUR"]
["CMAU 191794/0","2016-03-15","021900560","LOUIS LATOUR - PINOT NOIR BOURGOGNE"]
["CMAU 191794/0","2016-03-15","021900501","PERNOD RICARD - RICARD / 1L"]
["CMAU 191794/0","2016-03-15","021900503-6","PERNOD RICARD - CLAN CAMPBELL 70 CL x6"]
["CMAU 191794/0","2016-03-15","021900505","PERNOD RICARD - CHIVAS REGAL WISKY 12 YO / ETUI"]
["CMAU 191794/0","2016-03-15","021900506","PERNOD RICARD - CHIVAS REGAL WISKY 18 YO "]
["CMAU 191794/0","2016-03-15","021900652","PERNOD RICARD - CHIVAS REGAL WISKY 18 YO / 1L ETUI"]
["CMAU 191794/0","2016-03-15","IAHAA113127","PERNOD RICARD - BALLANTINE'S FINEST WHISKY "]
["CMAU 191794/0","2016-03-15","IAHAA110225","PERNOD RICARD - BALLANTINE'S WISKY 12 YO / ETUI"]
["CMAU 191794/0","2016-03-15","021900525","PERNOD RICARD -MUMM CHAMPAGNE CORDON ROUGE"]
[]
["GESU 666717/1","2016-04-20","021500267","UNIONS DE VIGNERONS C.R CELLIER DES DAUPHINS - COTES DU RHONE CHÂTEAU DE L'ESTAGNOL ROUGE"]
["GESU 666717/1","2016-04-20","021500269","UNION DES VIGNERONS C.R CELLIER DES DAUPHINS -IGP MEDITERRANEE BLANC BIB 5L"]
["GESU 666717/1","2016-04-20","021500270","UNION DES VIGNERONS C.R CELLIER DES DAUPHINS -IGP MEDITERRANEE ROSE BIB 5L"]
["GESU 666717/1","2016-04-20","021310255","MAITRES VIGNERONS - SAINT ROCH ROSE 2014"]
["GESU 666717/1","2016-04-20","021310250","MAITRES VIGNERONS - GOURMANDISE ROUGE"]
["GESU 666717/1","2016-04-20","DCAAA000379","HOREAU BEYLOT - CH. HAUT CLOQUET POMEROL 2011"]
["GESU 666717/1","2016-04-20","DCAAA610256","HOREAU BEYLOT - CH. MARTINET GC SAINT EMILION GRAND CRU"]
["GESU 666717/1","2016-04-20","DCAAA000676","HOREAU BEYLOT - CH. HAUT CLOQUET POMEROL 2013"]
["GESU 666717/1","2016-04-20","021500203","PAUL JABOULET - COTES DU RHONE PARALLELE 45 ROUGE"]
["GESU 666717/1","2016-04-20","021310303","SARL CPESO - IGP CITE CARCASSONNE ROUGE, DOMAINE AUZIAS CUVEE MONSIEUR"]
["GESU 666717/1","2016-04-20","021310304","SARL CPESO - VDP CARCASSONNE ROSE, DOMAINE AUZIAS"]
["GESU 666717/1","2016-04-20","021310317","SARL CPESO - SAINT CHINIAN ROUGE, COL DE L'ORB"]
["GESU 666717/1","2016-04-20","DABAA502717","SARL CPESO - BORDEAUX ROUGE, CH. LAMOTHE ST GERMAIN"]
["GESU 666717/1","2016-04-20","DABAA355257","SARL CPESO - BORDEAUX ROUGE, CH. TREILLE DE CANDALE"]
["GESU 666717/1","2016-04-20","021320101","SARL CPESO - BORDEAUX ENTRE DEUX MERS BLANC SEC, CHÂTEAU TREILLE DE CANDALE"]
["GESU 666717/1","2016-04-20","021320300","SARL CPESO - BORDEAUX ROUGE, MARQUIS DE BALMONT"]
["GESU 666717/1","2016-04-20","021310450","SARL CPESO - HAUTES COTES DE BEAUNES BLANC, DOMAINE BERGER RIVES"]
["GESU 666717/1","2016-04-20","DBFAA100018","CHÂTEAU DU TARIQUET - DOMAINE DU TARIQUET CLASSIC  COTES DE GASCOGNE IGP BLANC"]
["GESU 666717/1","2016-04-20","DBFAA100025","CHÂTEAU DU TARIQUET - DOMAINE DU TARIQUET PREMIERES GRIVES  COTES DE GASCOGNE IGP BLANC"]
["GESU 666717/1","2016-04-20","022800100","CIDRES BIGOUD - CIDRE LE BRUN ARTISANAL BRUT"]
["GESU 666717/1","2016-04-20","DAVAA000015","SIMONET FEBVRE - BOURGONE ALIGOTE"]
["GESU 666717/1","2016-04-20","DAGAB001508","CIE VINICOLE BARON EDMOND DE ROTHSCHILD - LES GRANGES 2012, DOMAINES BARONS DE ROTHSCHILD"]
["GESU 666717/1","2016-04-20","021500203","PAUL JABOULET - COTES DU RHONE PARALLELE 45 ROUGE"]
["GESU 666717/1","2016-04-20","021400576","CORDIER - CH. LA CROIX SAINT JACQUES 2014"]
["GESU 666717/1","2016-04-20","DAGAA504471","CORDIER - LA CROIX BACALAN CORDIER"]
["GESU 666717/1","2016-04-20","DAGAA302015","CORDIER - CH. DU GARDE \"LA COTE DE MONS\" CC"]
["GESU 666717/1","2016-04-20","DAGAA304033","CORDIER - CH, ANDRON \"FUT\" CC"]
["GESU 666717/1","2016-04-20","DAGAA502965","CORDIER - CH. FOUGERE LA NOBLEAR.PA.15 CC"]
["GESU 666717/1","2016-04-20","DCJAA003418","MAISON GRANDEAU LAUDUC - CH. LAUDUC CLASSIC 2014 BORDEAUX ROUGE"]
["GESU 666717/1","2016-04-20","DCJAA003753","MAISON GRANDEAU LAUDUC - CH. LAUDUC CLASSIC 2015 BORDEAUX BLANC"]
[]
["CMAU 076556/6","2016-05-09","021300001","BOULARD BAUQUAIRE - CHAMPAGNE ROSE"]
["CMAU 076556/6","2016-05-09","021300002","BOULARD BAUQUAIRE - CHAMPAGNE GRANDE RESERVE"]
["CMAU 076556/6","2016-05-09","021300004","BOULARD BAUQUAIRE - CUVEE MELANIE"]
["CMAU 076556/6","2016-05-09","021300005","BOULARD BAUQUAIRE - CHAMPAGNE GRANDE RESERVE DEMIES BOUTEILLES"]
["CMAU 076556/6","2016-05-09","021300006","BOULARD BAUQUAIRE - CHAMPAGNE TRADITION DEMI-SEC"]
["CMAU 076556/6","2016-05-09","021300007","BOULARD BAUQUAIRE - CHAMPAGNE MAGNUM BRUT GRANDE RESERVE"]
["CMAU 076556/6","2016-05-09","021300009","BOULARD BAUQUAIRE - CHAMPAGNE BRUT TRADITION"]
["CMAU 076556/6","2016-05-09","022800001","BOUQUET DE LOIRE - BOUQUET MERLOT"]
["CMAU 076556/6","2016-05-09","022800002","BOUQUET DE LOIRE - BOUQUET DE PINOT NOIR"]
["CMAU 076556/6","2016-05-09","022800001","BOUQUET DE LOIRE - BOUQUET MERLOT"]
["CMAU 076556/6","2016-05-09","022800003","BOUQUET DE LOIRE - BOUQUET DE SYRAH ROSE"]
["CMAU 076556/6","2016-05-09","DAPAA003986","BOUQUET DE LOIRE - COTEAUX DE LAYON DOM. DE LA DUCQUERIE"]
["CMAU 076556/6","2016-05-09","DCIAA202140","DOMAINE R. DUBOIS - BOURGOGNE HAUTES COTES DE BEAUNE \"LE MONTBATOIS\" BLANC 2014"]
["CMAU 076556/6","2016-05-09","DCIAA211135","DOMAINE R. DUBOIS - BOURGOGNE PASSETOUTGRAINS ROUGE"]
["CMAU 076556/6","2016-05-09","DCIAA212149","DOMAINE R. DUBOIS - BOURGOGNE ROUGE PINOT NOIR"]
["CMAU 076556/6","2016-05-09","DCIAA240135","DOMAINE R. DUBOIS - COTES DE NUIT VILLAGES ROUGE"]
["CMAU 076556/6","2016-05-09","DAGAJ000014","MOULIN DE LA ROQUE - LES ADRETS ROUGE 2013"]
["CMAU 076556/6","2016-05-09","DAGAJ000021","MOULIN DE LA ROQUE - LES ADRETS ROSE 2014"]
["CMAU 076556/6","2016-05-09","021500203","PAUL JABOULET - COTES DU RHONE PARALLELE 45 ROUGE"]
["CMAU 076556/6","2016-05-09","DAEAA450558","PAUL JABOULET - VENTOUX LES TRAVERSES ROUGE"]
["CMAU 076556/6","2016-05-09","DCAAA300430","HOREAU BEYLOT - CH. SEGUELONGUE MRP MEDOC"]
["CMAU 076556/6","2016-05-09","DCAAA000676","HOREAU BEYLOT - CH.  HAUT CLOQUET POMEROL"]
["CMAU 076556/6","2016-05-09","021320016","HOREAU BEYLOT - CH.  MARTINET GC SAINT EMILION GRAND CRU"]
["CMAU 076556/6","2016-05-09","021310256","LES MAITRES VIGNERONS - GOURMANDISE ROSE 75 CL"]
["CMAU 076556/6","2016-05-09","021310257","LES MAITRES VIGNERONS - SAINT ROCH ROSE 75 CL"]
["CMAU 076556/6","2016-05-09","021310256","LES MAITRES VIGNERONS - GOURMANDISE ROSE 75 CL"]
["CMAU 076556/6","2016-05-09","021310257","LES MAITRES VIGNERONS - SAINT ROCH ROSE 75 CL"]
["CMAU 076556/6","2016-05-09","DAGAA406645","CORDIER - CH. LA CROIX DE QUEYNAC BORDEAUX ROUGE"]
["CMAU 076556/6","2016-05-09","DAGAA501623","CORDIER - CH. BEL AIR BORDEAUX ROUGE"]
["CMAU 076556/6","2016-05-09","021400576","CORDIER - CH. LA CROIX SAINT JACQUES "]
["CMAU 076556/6","2016-05-09","DAGAA504471","CORDIER - LA CROIX BACALAN CORDIER BORGEAUX ROUGE"]
["CMAU 076556/6","2016-05-09","DAGAA502965","CORDIER - FOUGERE LA NOBLEAR PA. 15CC BORDEAUX ROUGE"]
["CMAU 076556/6","2016-05-09","DAGAA302015","CORDIER - CH. DU GARDE LA COTE DE MONS CC BORDEAUX ROUGE"]
["CMAU 076556/6","2016-05-09","021400800","CORDIER - CH. ROC DE CANDALE"]
["CMAU 076556/6","2016-05-09","DAGAA304033","CORDIER - CH. ANDRON FUT CC"]
["CMAU 076556/6","2016-05-09","021400580","CORDIER/MESTREZAT - CH. MENEY SAINT ESTEPHE"]
["CMAU 076556/6","2016-05-09","DAGAB001508","COMPAGNIE VINICOLE BARON EDMOND DE ROTHSCHILD - LES GRANGES 2012"]
["CMAU 076556/6","2016-05-09","DAGAB001454","COMPAGNIE VINICOLE BARON EDMOND DE ROTHSCHILD - CH. DES LAURETS 2012"]
["CMAU 076556/6","2016-05-09","021900504","PERNOD RICARD - BALLANTINES FINEST WHISKY"]
["CMAU 076556/6","2016-05-09",21900507,"PERNOD RICARD - LONG JOHN WHISKY"]
["CMAU 076556/6","2016-05-09","021900512","PERNOD RICARD - OLMEGA TEQUILA GOLD"]
["CMAU 076556/6","2016-05-09","021900514","PERNOD RICARD - SUZE AMER 1L"]
["CMAU 076556/6","2016-05-09","IAHAA080927","PERNOD RICARD - HAVANA CLUB RHUM ANEJO ESPECIAL"]
["CMAU 076556/6","2016-05-09","021900521","PERNOD RICARD - ROYAL SALUTE WHISKY 40% 21 YO"]
["CMAU 076556/6","2016-05-09","021900604","PERNOD RICARD - BALLANTINES WHISKY 12 YO NRF ETUI"]
["CMAU 076556/6","2016-05-09","022000007","TORRES - SAN VALENTIN PARRELADA"]
["CMAU 076556/6","2016-05-09","GAAAA003386","TORRES - SAN VALENTIN GARNACHA"]
["CMAU 076556/6","2016-05-09","022000000","TORRES - SANGRE DE TORO"]
[]
["TCNU 458829/0","2016-05-26","021310303","SARL CPESO - DOMAINE AUZIAS CUVEE MONSIEUR - ROUGE"]
["TCNU 458829/0","2016-05-26","021310304","SARL CPESO - DOMAINE AUZIAS  - VDP CARCASSONE ROSE"]
["TCNU 458829/0","2016-05-26","021310317","SARL CPESO - COL DE L'ORB - SAINT CHINIAN ROUGE OR"]
["TCNU 458829/0","2016-05-26","021310318","SARL CPESO - COL DE L'ORB - SAINT CHINIAN ROUGE 86/100 WS (x12)"]
["TCNU 458829/0","2016-05-26","DABAA502717","SARL CPESO - CHÂTEAU LAMOTHE ST GERMAIN - ROUGE"]
["TCNU 458829/0","2016-05-26","021310450","SARL CPESO - DOMAINE BERGER-RIVES - HTES COTES DE BEAUNES BLANC"]
["TCNU 458829/0","2016-05-26","021310430","SARL CPESO - MAISON JEAN BAPTISTE BEJOT - PETIT CHABLIS BLANC"]
["TCNU 458829/0","2016-05-26","021500257","UNIONS DES VIGNERONS /CELLIER DES DAUPHINS - CROZES HERMITAGE LA TOUVIERE ROUGE"]
["TCNU 458829/0","2016-05-26","021500264","UNIONS DES VIGNERONS /CELLIER DES DAUPHINS - VACQUEYRAS AOC ROUGE"]
["TCNU 458829/0","2016-05-26","022000003","MIGUEL TORRES - TORRES DE CASTA ROSADO"]
["TCNU 458829/0","2016-05-26","022000007","MIGUEL TORRES - TORRES SAN VALENTIN PARELLADA"]
["TCNU 458829/0","2016-05-26","021310114","PRODUCTEURS PLAIMONT - AOC MADIRAN ROUGE"]
["TCNU 458829/0","2016-05-26","021310118","PRODUCTEURS PLAIMONT - AOC SAINT MONT BLANC CHEMINS DES PELERINS"]
["TCNU 458829/0","2016-05-26","DACAB691667","CHÂTEAU DE LA ROULERIE - ANJOU ROUGE, LE P'TIT CAB"]
["TCNU 458829/0","2016-05-26","024100001","UCCOAR SAS - ALLEE DES FRENES BORDEAUX ROUGE"]
["TCNU 458829/0","2016-05-26","DARAA061257","LES GRANDS CHAIS DE France - VIN PAYS D'OC / IGP PAYS D'OC ROUGE ESCHENAUER "]
["TCNU 458829/0","2016-05-26","021310013","LES GRANDS CHAIS DE France - CIDRE BRUT JEAN LORET BRUT"]
["TCNU 458829/0","2016-05-26","021900027","LES GRANDS CHAIS DE France - DOMAINE TOULAL GUERROUANE ROSE"]
["TCNU 458829/0","2016-05-26","021310015","LES GRANDS CHAIS DE France - ARMAGNAC AOC - PRINCE ARIGNAC VS + CANISTER"]
["TCNU 458829/0","2016-05-26","021900012","LES GRANDS CHAIS DE France - WISKY BOURBON JACK DANIEL'S"]
["TCNU 458829/0","2016-05-26","021900110","LACHETEAU - TOURAINE M MARTIN LE CLOUQUIN ROUGE 75 CL (x6)"]
["TCNU 458829/0","2016-05-26","021900210-12","LACHETEAU - TOURAINE M MARTIN LE CLOUQUIN ROUGE 37,5 CL (x12) "]
["TCNU 458829/0","2016-05-26","021900415","LACHETEAU - CHINON M MARTIN LES BERNIERES ROUGE"]
["TCNU 458829/0","2016-05-26","021900425","LACHETEAU - POUILLY FUME BLANC"]
["TCNU 458829/0","2016-05-26","021310303","SARL CPESO - DOMAINE AUZIAS CUVEE MONSIEUR - ROUGE - IGP CITE CARCOSONNE "]
["TCNU 458829/0","2016-05-26","021310304","SARL CPESO - DOMAINE AUZIAS ROSE - VDP CARCASONNE ROSE"]
["TCNU 458829/0","2016-05-26","DABAA355257","SARL CPESO - CHÂTEAU TREILLE DE CANDALE - BORDEAUX ROUGE"]
["TCNU 458829/0","2016-05-26","021320101","SARL CPESO - CHÂTEAU TREILLE DE CANDALE - BORDEAUX BLANC SEC"]
["TCNU 458829/0","2016-05-26","021310450","SARL CPESO - DOMAINE BERGER-RIVES - HTES COTES DE BEAUNES BLANC"]
["TCNU 458829/0","2016-05-26","021300009","BOULARD BAUQUAIRE - CHAMPAGNE BRUT TRADITION "]
["TCNU 458829/0","2016-05-26","021300001","BOULARD BAUQUAIRE - CHAMPAGNE ROSE"]
["TCNU 458829/0","2016-05-26","DAKAA815251","H CUVELIER & FILS - CHÂTEAU LACROIX SAINT ESTEPHE - ROUGE"]
["TCNU 458829/0","2016-05-26","DBZAE602030","ADVINI - IGP COTES CATALANES ROUGE / CANON DU MARECHAL ROUGE "]
["TCNU 458829/0","2016-05-26","DBZAE070037","ADVINI - IGP COTES CATALANES ROSE / CANON DU MARECHAL ROSE"]
["TCNU 458829/0","2016-05-26","DBZAE260513","ADVINI - IGP COTES CATALANES BLANC / CANON DU MARECHAL BLANC"]
["TCNU 458829/0","2016-05-26","DBZAE000024","ADVINI - AOP COTES DU ROUSSILLON VILLAGES  / EGO ROUGE"]
["TCNU 458829/0","2016-05-26","DBZAB719481","ADVINI - AOP COTES DE PROVENCE - ESPRIT GASSIER ROSE"]
["TCNU 458829/0","2016-05-26","DBZAA750855","ADVINI - IGP SABLE DE CAMARGUE / DN LE PIVE GRIS ROSE"]
["TCNU 458829/0","2016-05-26","DBZAA774776","ADVINI - AOP LANGUEDOC GRES DE MONTPELLIER / MAS DE LUNE ROUGE"]
["TCNU 458829/0","2016-05-26","DBZAB180359","ADVINI - AOP COTES DE PROVENCE 2014 - LA SANTONNIERE ROSE 75 CL"]
["TCNU 458829/0","2016-05-26","DBZAB180458","ADVINI - AOP COTES DE PROVENCE 2015  - LA SANTONNIERE ROSE 37,5 CL"]
["TCNU 458829/0","2016-05-26","DBZAB716633","ADVINI - IGP VAR 2015 / AMALIA ROSE"]
["TCNU 458829/0","2016-05-26","021900505","PERNOD RICARD - CHIVAS REGAL WHISKY 12 YO"]
["TCNU 458829/0","2016-05-26","DCJAA003418","GRANDEAU LAUDUC - CHÂTEAU LAUDUC ROUGE"]
["TCNU 458829/0","2016-05-26","DCJAA003753","GRANDEAU LAUDUC - CHÂTEAU LAUDUC CLASSIC BLANC"]
["TCNU 458829/0","2016-05-26","022800008","BOUQUET DE LOIRE - COTEAUX DU LAYON CLAIR DE LUNE DOM. MATIGNON"]
["TCNU 458829/0","2016-05-26","DAVAA000602","SIMMONET FEBVRE - IRANCY "]
["TCNU 458829/0","2016-05-26","022800100","CIDRES BIGOUD - CIDRES LE BRUN"]
[]
["CMAU 702637/8","2016-07-21","022800100","CIDRES BIGOUD - CIDRE LE BRUN ARTISANALE"]
["CMAU 702637/8","2016-07-21","DAEAA450558","PAUL JABOULET - VENTOUS LES TRAVERSES ROUGE"]
["CMAU 702637/8","2016-07-21","DBZAE070037","ADVNI - CANON DU MARECHAL ROSE "]
["CMAU 702637/8","2016-07-21","DBZAE260513","ADVNI - CANON DU MARECHAL BLANC"]
["CMAU 702637/8","2016-07-21","DBZAE602030","ADVNI - CANON DU MARECHAL ROUGE "]
[]
["GESU 138532/3","2016-07-25","021310256","MAITRES VIGNERONS - GOURMANDISE ROSE"]
["GESU 138532/3","2016-07-25","021310317","CPESO - SAINT CHINIAN ROUGE"]
["GESU 138532/3","2016-07-25","021310304","CPESO - VDP CARCASSONNE ROSE"]
["GESU 138532/3","2016-07-25","GAAAA003508","MIGUEL TORRES - SELECCION DE TORRES SL CELESTE CRIANZA"]
["GESU 138532/3","2016-07-25","021300002","BOULARD BAUQUAIRE - CHAMPAGNE GRANDE RESERVE"]
["GESU 138532/3","2016-07-25","021300005","BOULARD BAUQUAIRE - CHAMPAGNE GRANDE RESERVE DEMIES 37,50 CL"]
["GESU 138532/3","2016-07-25","021300020","BOULARD BAUQUAIRE - BRUT CARTE NOIRE"]
["GESU 138532/3","2016-07-25","021305106","Cie VINICOLE BARON EDMOND DE ROTHSCHILD - CHÂTEAU CLARKE 2008"]
["GESU 138532/3","2016-07-25","021300021","CHAMPAGNE AYALA - BRUT MAJEUR"]
["GESU 138532/3","2016-07-25","022800001","BOUQUET DE LOIRE - BOUQUET MERLOT"]
["GESU 138532/3","2016-07-25","022800003","BOUQUET DE LOIRE - SYRAH ROSE"]
["GESU 138532/3","2016-07-25","022800007","BOUQUET DE LOIRE - SAINT NICOLAS DE BOURGUEIL DOM GODEFROY"]
["GESU 138532/3","2016-07-25","DCJAA003418","GRANDEAU LAUDUC - CHÂTEAU LAUDUC CLASSIC 2014 - BDX ROUGE"]
["GESU 138532/3","2016-07-25","060220100","CHAMPAGNE BOLLINGER - SPECIAL CUVEE BRUT"]
["GESU 138532/3","2016-07-25","021500203","PAUL JABOULET - COTES DU RHONE PARALLELE 45 ROUGE"]
[]
["CLHU 470324/0","2016-08-02","021100301","NEDERBURG SAUVIGNON BLANC"]
["CLHU 470324/0","2016-08-02","021100118","NEDERBURG (FOUNDATION) - ROSE CABERNET FRANC/MERLOT/SHIRAZ"]
["CLHU 470324/0","2016-08-02","021100114","NEDERBURG CHARDONNAY"]
["CLHU 470324/0","2016-08-02","022300600","SAVANNA DRY CIDER 33 CL"]
["CLHU 470324/0","2016-08-02","021100119","NEDERBURG SHIRAZ "]
["CLHU 470324/0","2016-08-02","021200403","ZONNEBLOEM CHARDONNAY"]
["CLHU 470324/0","2016-08-02","021200311","ZONNEBLOEM SAUVIGNON BLANC"]
["CLHU 470324/0","2016-08-02","021201006","PLAISIR DE MERLE PETIT PLAISIR SHIRAZ"]
["CLHU 470324/0","2016-08-02","021201005","PLAISIR DE MERLE MCC GRAND BRUT"]
["CLHU 470324/0","2016-08-02","022300343","DROSTDY HOF ROUGE"]
["CLHU 470324/0","2016-08-02","DABAA355257","SARL CPESO - CHÂTEAU TREILLE DE CANDALE - BORDEAUX ROUGE"]
["CLHU 470324/0","2016-08-02","021320101","SARL CPESO - CHÂTEAU TREILLE DE CANDALE - BORDEAUX BLANC SEC"]
["CLHU 470324/0","2016-08-02",null,"DECLARE DANS TCNU 458829/0"]
[]
["DR 23079 - TRANSFERT SOUS DOUANE","2016-07-11","021200509","OBIKWA MERLOT"]
["DR 23079 - TRANSFERT SOUS DOUANE","2016-07-11","021200515","OBIKWA ROSE"]
["DR 23079 - TRANSFERT SOUS DOUANE","2016-07-11","021200516","OBIKWA CHENIN BLANC"]
["DR 23079 - TRANSFERT SOUS DOUANE","2016-07-11","021200518","OBIKWA PINOTAGE"]
["DR 23080 - TRANSFERT SOUS DOUANE","2016-07-11","021200518","OBIKWA PINOTAGE"]
["DR 23080 - TRANSFERT SOUS DOUANE","2016-07-11","021200516","OBIKWA CHENIN BLANC"]
[]
["TCLU 719886/9","2016-08-11","021900561","LOUIS LATOUR - POMMARD"]
["TCLU 719886/9","2016-08-11","021900558","LOUIS LATOUR - GEVREY-CHAMBERTIN"]
["TCLU 719886/9","2016-08-11","021900560","LOUIS LATOUR - PINOT NOIR BOURGOGNE"]
[]
["CMAU  213380/9","2016-09-07","021900027","LES GRANDS CHAIS DE France - VIN DU MAROC ROSE (DMNE TOULAL)"]
["CMAU  213380/9","2016-09-07","021900031","LES GRANDS CHAIS DE France - VIN DU MAROC ROUGE (DMNE TOULAL)"]
["CMAU  213380/9","2016-09-07","021900012","LES GRANDS CHAIS DE France - WHISKY JACK DANIEL'S 70CL"]
["CMAU  213380/9","2016-09-07","022000007","MIGUEL TORRES - TORRES SAN VALENTIN PARELLADA"]
["CMAU  213380/9","2016-09-07","022000005","MIGUEL TORRES - TORRES SAN VALENTIN GARNACHA"]
["CMAU  213380/9","2016-09-07","022000007","MIGUEL TORRES - TORRES SAN VALENTIN PARELLADA"]
["CMAU  213380/9","2016-09-07","021400576","CORDIER - CH. LA CROIX SAINT JACQUES 2014"]
["CMAU  213380/9","2016-09-07","021900547","LOUIS ROEDERER - CRISTAL BRUT 2007"]
["CMAU  213380/9","2016-09-07","021900700","LOUIS ROEDERER - CRISTAL BRUT 2007 - COFFRET MILLESIME"]
["CMAU  213380/9","2016-09-07","021900542","LOUIS ROEDERER - CHÂTEAU HAUT BEAUSEJOUR 2012"]
["CMAU  213380/9","2016-09-07","021900543","LOUIS ROEDERER - CHÂTEAU DE PEZ 2012 (CAISSE BOIS)"]
["CMAU  213380/9","2016-09-07","021900506","PERNOD RICARD - CHIVAS REGAL WHISKY 18 YO "]
["CMAU  213380/9","2016-09-07","021900507","PERNOD RICARD - LONG JOHN WHISKY 70 CL "]
["CMAU  213380/9","2016-09-07","021900514","PERNOD RICARD - SUZE AMER 100 CL"]
["CMAU  213380/9","2016-09-07","IAHAA110225","PERNOD RICARD - BALLANTINE'S WHISKY 12 YO 70 CL"]
["CMAU  213380/9","2016-09-07","021900521","PERNOD RICARD - ROYAL SALUTE WHISKY 21 YO 70CL (ETUIS)"]
[]
["CMAU 064057/4","2016-10-07","021101003","CAMUS - BERNEROY CALVADOS"]
["CMAU 064057/4","2016-10-07","DCJAA003470","GRANDEAU LAUDUC - CHÂTEAU LAUDUC CLASSIC 2015 - ROSE"]
["CMAU 064057/4","2016-10-07","022800100","CIDRES BIGOUD - CIDRE LE BRUN ARTISANAL"]
["CMAU 064057/4","2016-10-07","DALAA307095","PRODUCTEURS PLAIMONT - IGP COTES GASCOGNE BLANC 2015 ECHO INDIGO"]
["CMAU 064057/4","2016-10-07","DALAA446268","PRODUCTEURS PLAIMONT - IGP COTES GASCOGNE ROUGE 2016 ECHO INDIGO"]
["CMAU 064057/4","2016-10-07","DALAA460752","PRODUCTEURS PLAIMONT - AOC SAINT MONT ROUGE - EMPREINTE ROUGE"]
["CMAU 064057/4","2016-10-07","DALAA423290","PRODUCTEURS PLAIMONT - AOC PACHERENC BLANC DOUX 2014"]
["CMAU 064057/4","2016-10-07","DALAA347213","PRODUCTEURS PLAIMONT - AOC SAINT MONT ROSE 2015 ROSE D'ENFER"]
["CMAU 064057/4","2016-10-07","DAEAA450558","PAUL JABOULET AINE - VENTOUX LES TRAVERSES ROUGE 2014"]
["CMAU 064057/4","2016-10-07","DAGAA506000","ETS CORDIER - CH. HAUT BASCALA BRONZE BORDEAU ROUGE"]
["CMAU 064057/4","2016-10-07","DAGAA734019","ETS CORDIER - PAJZOS HARSLEVELU TOKAJI BLANC MOELLEUX"]
["CMAU 064057/4","2016-10-07","021200410","ETS CORDIER - CH. LA TUILERIE ROUGE "]
["CMAU 064057/4","2016-10-07","021900650","PERNOD RICARD - CLAN CAMPBELL 1L"]
["CMAU 064057/4","2016-10-07","021900505","PERNOD RICARD - CHIVAS REGAL 12 YO - 70 CL"]
["CMAU 064057/4","2016-10-07","IAIAA042397","LES GRANDS CHAIS DE France - LIQUEUR WHISKY US JACK & HONEY"]
["CMAU 064057/4","2016-10-07","021310010","LES GRANDS CHAIS DE France - CHEVALIER A LICHINE MERLO -ROUGE"]
["CMAU 064057/4","2016-10-07","DARAA061257","LES GRANDS CHAIS DE France - ESCHENAUER CABS - ROUGE"]
["CMAU 064057/4","2016-10-07","021900030","LES GRANDS CHAIS DE France -  LA DOMAL - ROUGE"]
["CMAU 064057/4","2016-10-07","021310015","LES GRANDS CHAIS DE France - PRINCE ARIGNAC VS + CANISTER"]
["CMAU 064057/4","2016-10-07","DBZAB716633","ADVINI - AMALIA ROSE"]
["CMAU 064057/4","2016-10-07","DBZAE000024","ADVINI - EGO ROUGE"]
["CMAU 064057/4","2016-10-07","DBZAB180458","ADVINI - LA SANTONNIERE ROSE"]
["CMAU 064057/4","2016-10-07","DBZAE260513","ADVINI - CANON DU MARECHAL BLANC"]
["CMAU 064057/4","2016-10-07","DBZAE070037","ADVINI - CANON DU MARECHAL ROSE"]
["CMAU 064057/4","2016-10-07","DBZAE602030","ADVINI - CANON DU MARECHAL ROUGE"]
["CMAU 064057/4","2016-10-07","DBZAA774776","ADVINI - MAS DE LUNES ROUGE"]
["CMAU 064057/4","2016-10-07","021102017","ADVINI - JC PEPIN ROUGE MERLOT - BIB"]
["CMAU 064057/4","2016-10-07","021102018","ADVINI - JC PEPIN ROSE CINSAULT - BIB"]
["CMAU 064057/4","2016-10-07","021900430","LACHETEAU - MUSCADET BLANC / CH. GOULAINE PAPILLON / LIE"]
["CMAU 064057/4","2016-10-07","021900205","LACHETEAU - MUSCADET BLANC / CH. GOULAINE PUY FERRAND / LIE"]
["CMAU 064057/4","2016-10-07","021900424","LACHETEAU - MUSCADET BLANC / CH. GOULAINE PAPILLON"]
["CMAU 064057/4","2016-10-07","021900404","LACHETEAU - ST NICOLAS DE BOURGUEIL ROUGE"]
["CMAU 064057/4","2016-10-07","DCIAA242134","RAPHAEL DUBOIS - VOSNE ROMANEE LES CHALANDINS ROUGE"]
["CMAU 064057/4","2016-10-07","DCIAA244121","RAPHAEL DUBOIS - GEVREY CHAMBERTIN ROUGE"]
["CMAU 064057/4","2016-10-07","DCIAA202140","RAPHAEL DUBOIS - GBOURGONE HTES COTES DE BEAUNE LE MONTBATOIS BLANC"]
["CMAU 064057/4","2016-10-07","DCIAA230136","RAPHAEL DUBOIS - SAVIGNY LES BEAUNE ROUGES "]
["CMAU 064057/4","2016-10-07","DCIAA240135","RAPHAEL DUBOIS - COTE DE NUITS VILLAGES ROUGE"]
["CMAU 064057/4","2016-10-07","DCIAA241132","RAPHAEL DUBOIS - NUITS SAINT GEORGES ROUGE"]
["CMAU 064057/4","2016-10-07","DCIAA250141","RAPHAEL DUBOIS - SAVIGNY LES BEAUNE 1ER CRU LES NARBANTONS ROUGE 2014"]
[]
["CMAU 426257/5","2016-11-24","021310256","LES MAITRES VIGNERONS - GOURMANDISE ROSE (x12)"]
["CMAU 426257/5","2016-11-24","021310257","LES MAITRES VIGNERONS - SAINT ROCH ROSE (x12)"]
["CMAU 426257/5","2016-11-24","021310252","LES MAITRES VIGNERONS - GOURMANDISE BLANC (x12)"]
["CMAU 426257/5","2016-11-24","021310256","LES MAITRES VIGNERONS - GOURMANDISE ROSE (x12)"]
["CMAU 426257/5","2016-11-24","021310257-6","LES MAITRES VIGNERONS - SAINT ROCH (x6)"]
["CMAU 426257/5","2016-11-24","021310317","CPESO - SAINT CHINIAN ROUGE / COL DE L'ORB"]
["CMAU 426257/5","2016-11-24","DABAA355257","CPESO - BORDEAUX ROUGE / CH. TREILLE DE CANDALE"]
["CMAU 426257/5","2016-11-24","021320101","CPESO - BORDEAU ENTRE DEUX MERS BLANC SEC / CH. TREILLE DE CANDALE"]
["CMAU 426257/5","2016-11-24","DABAA600635","CPESO - BORDEAUX ROUGE / CH. LAMOTHE ST GERMAIN"]
["CMAU 426257/5","2016-11-24","021310325","CPESO - COTES DE BLAYE / CH. CAZEAUX"]
["CMAU 426257/5","2016-11-24","021310315","CPESO - GEWURZTRAIMINER / JULES MULLER"]
[]
["TRLU 382312/3","2016-11-15","‘022800100","CIDRE LE BRUN ARTISANAL "]
[]
["CMAU 186380/2","2016-12-02","021300618","AMARULA LIQUEUR 70 CL"]
["CMAU 186380/2","2016-12-02","021202001","ALTO ESTATE ROUGE 2011"]
["CMAU 186380/2","2016-12-02","021100114","NEDERBURG WINEMASTER’S CHARDONNAY"]
["CMAU 186380/2","2016-12-02","021100340","NEDERBURG WINEMASTER’S RHINE RIESLING"]
["CMAU 186380/2","2016-12-02","021100300","NEDERBURG 1ERE CUVEE BRUT"]
["CMAU 186380/2","2016-12-02","021100301","NEDERBURG SAUVIGNON BLANC"]
["CMAU 186380/2","2016-12-02","021100119","NEDERBURG SHIRAZ"]
["CMAU 186380/2","2016-12-02","022300502","NEETHLINGSHOF UNWOODED CHARDONNAY"]
["CMAU 186380/2","2016-12-02","021200310","ZONNEBLOEM CHARDONNAY"]
["CMAU 186380/2","2016-12-02","021200311","ZONNEBLOEM SAUVIGNON BLANC"]
["CMAU 186380/2","2016-12-02","021300618","AMARULA LIQUEUR 70 CL"]
["CMAU 186380/2","2016-12-02","021201002","PLAISIR DE MERLE CHARDONNAY"]
["CMAU 186380/2","2016-12-02","022300401","FLEUR DU CAP CHARDONNAY"]
["CMAU 186380/2","2016-12-02","022300502","NEETHLINGSHOF UNWOODED CHARDONNAY"]
["CMAU 186380/2","2016-12-02","021200310","ZONNEBLOEM CHARDONNAY"]
["CMAU 186380/2","2016-12-02","021100340","NEDERBURG WINEMASTER’S RHINE RIESLING"]
["CMAU 186380/2","2016-12-02","EADAJ201600","DROSTDY HOF ROUGE 5L"]
[]
["CMAU 598908/6","2017-01-11","021300618","AMARULA LIQUEUR 70CL"]
["CMAU 598908/6","2017-01-12","022300338","DROSTDY HOF ADELPRACHT 14"]
["CMAU 598908/6","2017-01-13","EADAJ201600","DROSTDY HOF ROUGE 5L"]
["CMAU 598908/6","2017-01-14","022300400","FLEUR DU CAP CABERNET SAUVIGNON"]
["CMAU 598908/6","2017-01-15","022300401","FLEUR DU CAP CHARDONNAY"]
["CMAU 598908/6","2017-01-16","022300403","FLEUR DU CAP PINOTAGE"]
["CMAU 598908/6","2017-01-17","021201006","PLAISIR DE MERLE PETIT PLAISIR"]
["CMAU 598908/6","2017-01-18","021200615","LIBERTAS CHARDONNAY 2015"]
["CMAU 598908/6","2017-01-19","021200616","LIBERTAS CHENIN BLANC"]
["CMAU 598908/6","2017-01-20","021200617","LIBERTAS MERLOT"]
["CMAU 598908/6","2017-01-21","021200701","NEDERBURG WM RHINE RIESLING"]
["CMAU 598908/6","2017-01-22","021100106","NEDERBURG BARONNE CABERNET SAUVIGNON"]
["CMAU 598908/6","2017-01-23","022300502","NEETHLINGSHOF UNWOODED CHARDONAY"]
["CMAU 598908/6","2017-01-24","022300568","NEETHLING SHIRAZ 11"]
["CMAU 598908/6","2017-01-25","021200517","OBIKWA CABERNET SAUVIGNON"]
["CMAU 598908/6","2017-01-26","021200511","OBIKWA CHARDONNAY"]
["CMAU 598908/6","2017-01-27","021201002","PLAISIR DE MERLE CHARDONNAY"]
["CMAU 598908/6","2017-01-28","021201004","PLAISIR DE MERLE SAUVIGNON BLANC"]
["CMAU 598908/6","2017-01-29","021200718","TWO OCEANS SOFT & FRUITY RED"]
["CMAU 598908/6","2017-01-30","021200310","ZONNEBLOEM CHARDONNAY 12"]
["CMAU 598908/6","2017-01-31","021200309","ZONNEBLOEM SHIRAZ 12"]

{"sheet":"SOLDE","index":2,"n_rows":1042,"n_cols":19,"rows_kept":1042,"cut":false,"hidden":false,"merged":[]}
["N° Conteneur","Date entrée","CODE ART","TC","LIBELLE","Nombre de bouteille / carton","Nombre de bouteilles","Nombre de cartons","Stock final Bouteile","Stock Final carton","SF","Durée sejour IST en mois","BDX 99","BDX 100","BDX 101","BDX 102","BDX 103","BDX 104","BDX 105"]
["GESU 666717/1","2016-04-20","DCJAA003418",null,"MAISON GRANDEAU LAUDUC - CH. LAUDUC CLASSIC 2014 BORDEAUX ROUGE",{"$f":"IFERROR(G2/H2,0)","v":0},0,0,{"$f":"G2","v":0},{"$f":"IF(H2<=0,\"soldé\",H2)","v":"soldé"},null,{"$f":"(TODAY()-B2)/30","v":10.433333333333334},{"$f":"IFERROR(IF(J2=\"soldé\",0,VLOOKUP(SOLDE!C798,#REF!,8,0)),0)","v":0}]
["GESU 666717/1","2016-04-20","DCJAA003753",null,"MAISON GRANDEAU LAUDUC - CH. LAUDUC CLASSIC 2015 BORDEAUX BLANC",0,0,0,0,"soldé",null,10.433333333333334,{"$f":"IFERROR(IF(J3=\"soldé\",0,VLOOKUP(SOLDE!C799,#REF!,8,0)),0)","v":0}]
["TCNU 458829/0","2016-05-26","021900110",null,"LACHETEAU - TOURAINE M MARTIN LE CLOUQUIN ROUGE 75 CL (x6)",6,240,40,240,40,null,9.2333333333333325,{"$f":"IFERROR(IF(J4=\"soldé\",0,VLOOKUP(SOLDE!C868,#REF!,8,0)),0)","v":0}]
["TCNU 458829/0","2016-05-26","021900210-12",null,"LACHETEAU - TOURAINE M MARTIN LE CLOUQUIN ROUGE 37,5 CL (x12) ",12,60,5,60,5,null,9.2333333333333325,{"$f":"IFERROR(IF(J5=\"soldé\",0,VLOOKUP(SOLDE!C869,#REF!,8,0)),0)","v":0}]
["TCNU 458829/0","2016-05-26","DBZAB716633",null,"ADVINI - IGP VAR 2015 / AMALIA ROSE",0,0,0,0,"soldé",null,9.2333333333333325,{"$f":"IFERROR(IF(J6=\"soldé\",0,VLOOKUP(SOLDE!C889,#REF!,8,0)),0)","v":0}]
["TCNU 458829/0","2016-05-26","021900505",null,"PERNOD RICARD - CHIVAS REGAL WHISKY 12 YO",12,180,15,180,15,null,9.2333333333333325,{"$f":"IFERROR(IF(J7=\"soldé\",0,VLOOKUP(SOLDE!C890,#REF!,8,0)),0)","v":0}]
["TCNU 458829/0","2016-05-26","DCJAA003418",null,"GRANDEAU LAUDUC - CHÂTEAU LAUDUC ROUGE",6,156,26,156,26,{"$f":"J8-M8-N8-O8-P8-Q8-R8","v":26},9.2333333333333325,{"$f":"IFERROR(IF(J8=\"soldé\",0,VLOOKUP(SOLDE!C891,#REF!,8,0)),0)","v":0}]
["TCNU 458829/0","2016-05-26","DCJAA003753",null,"GRANDEAU LAUDUC - CHÂTEAU LAUDUC CLASSIC BLANC",6,300,50,300,50,null,9.2333333333333325,{"$f":"IFERROR(IF(J9=\"soldé\",0,VLOOKUP(SOLDE!C892,#REF!,8,0)),0)","v":0}]
["TCNU 458829/0","2016-05-26","022800008",null,"BOUQUET DE LOIRE - COTEAUX DU LAYON CLAIR DE LUNE DOM. MATIGNON",6,30,5,30,5,null,9.2333333333333325,{"$f":"IFERROR(IF(J10=\"soldé\",0,VLOOKUP(SOLDE!C893,#REF!,8,0)),0)","v":0}]
["TCNU 458829/0","2016-05-26","DAVAA000602",null,"SIMMONET FEBVRE - IRANCY ",0,0,0,0,"soldé",null,9.2333333333333325,{"$f":"IFERROR(IF(J11=\"soldé\",0,VLOOKUP(SOLDE!C894,#REF!,8,0)),0)","v":0}]
["TCNU 458829/0","2016-05-26","022800100",null,"CIDRES BIGOUD - CIDRES LE BRUN",0,0,0,0,"soldé",null,9.2333333333333325,{"$f":"IFERROR(IF(J12=\"soldé\",0,VLOOKUP(SOLDE!C895,#REF!,8,0)),0)","v":0}]
["CMAU 702637/8","2016-07-21","022800100",null,"CIDRES BIGOUD - CIDRE LE BRUN ARTISANALE",12,216,18,216,18,{"$f":"J13-M13-N13-O13-P13-Q13-R13","v":18},7.3666666666666663,0]
["CMAU 702637/8","2016-07-21","DAEAA450558",null,"PAUL JABOULET - VENTOUS LES TRAVERSES ROUGE",6,120,20,120,20,null,7.3666666666666663,{"$f":"IFERROR(IF(J14=\"soldé\",0,VLOOKUP(SOLDE!C897,#REF!,8,0)),0)","v":0}]
["CMAU 702637/8","2016-07-21","DBZAE070037",null,"ADVNI - CANON DU MARECHAL ROSE ",0,0,0,0,"soldé",null,7.3666666666666663,{"$f":"IFERROR(IF(J15=\"soldé\",0,VLOOKUP(SOLDE!C898,#REF!,8,0)),0)","v":0}]
["CMAU 702637/8","2016-07-21","DBZAE260513",null,"ADVNI - CANON DU MARECHAL BLANC",0,0,0,0,"soldé",null,7.3666666666666663,{"$f":"IFERROR(IF(J16=\"soldé\",0,VLOOKUP(SOLDE!C899,#REF!,8,0)),0)","v":0}]
["CMAU 702637/8","2016-07-21","DBZAE602030",null,"ADVNI - CANON DU MARECHAL ROUGE ",0,0,0,0,"soldé",null,7.3666666666666663,{"$f":"IFERROR(IF(J17=\"soldé\",0,VLOOKUP(SOLDE!C900,#REF!,8,0)),0)","v":0}]
["GESU 138532/3","2016-07-25","021310256",null,"MAITRES VIGNERONS - GOURMANDISE ROSE",12,600,50,600,50,{"$f":"J18-M18-N18-O18-P18-Q18-R18","v":50},7.2333333333333334,0]
["GESU 138532/3","2016-07-25","021310317",null,"CPESO - SAINT CHINIAN ROUGE",6,30,5,30,5,null,7.2333333333333334,{"$f":"IFERROR(IF(J19=\"soldé\",0,VLOOKUP(SOLDE!C902,#REF!,8,0)),0)","v":0}]
["GESU 138532/3","2016-07-25","021310304",null,"CPESO - VDP CARCASSONNE ROSE",6,60,10,60,10,null,7.2333333333333334,{"$f":"IFERROR(IF(J20=\"soldé\",0,VLOOKUP(SOLDE!C903,#REF!,8,0)),0)","v":0}]
["GESU 138532/3","2016-07-25","GAAAA003508",null,"MIGUEL TORRES - SELECCION DE TORRES SL CELESTE CRIANZA",6,120,20,120,20,null,7.2333333333333334,{"$f":"IFERROR(IF(J21=\"soldé\",0,VLOOKUP(SOLDE!C904,#REF!,8,0)),0)","v":0}]
["GESU 138532/3","2016-07-25","021300002",null,"BOULARD BAUQUAIRE - CHAMPAGNE GRANDE RESERVE",6,186,31,186,31,null,7.2333333333333334,{"$f":"IFERROR(IF(J22=\"soldé\",0,VLOOKUP(SOLDE!C905,#REF!,8,0)),0)","v":0}]
["GESU 138532/3","2016-07-25","021300005",null,"BOULARD BAUQUAIRE - CHAMPAGNE GRANDE RESERVE DEMIES 37,50 CL",6,54,9,54,9,null,7.2333333333333334,{"$f":"IFERROR(IF(J23=\"soldé\",0,VLOOKUP(SOLDE!C906,#REF!,8,0)),0)","v":0}]
["GESU 138532/3","2016-07-25","021300020",null,"BOULARD BAUQUAIRE - BRUT CARTE NOIRE",6,60,10,60,10,null,7.2333333333333334,{"$f":"IFERROR(IF(J24=\"soldé\",0,VLOOKUP(SOLDE!C907,#REF!,8,0)),0)","v":0}]
["GESU 138532/3","2016-07-25","021305106",null,"Cie VINICOLE BARON EDMOND DE ROTHSCHILD - CHÂTEAU CLARKE 2008",12,84,7,84,7,null,7.2333333333333334,{"$f":"IFERROR(IF(J25=\"soldé\",0,VLOOKUP(SOLDE!C908,#REF!,8,0)),0)","v":0}]
["GESU 138532/3","2016-07-25","021300021",null,"CHAMPAGNE AYALA - BRUT MAJEUR",6,42,7,42,7,null,7.2333333333333334,{"$f":"IFERROR(IF(J26=\"soldé\",0,VLOOKUP(SOLDE!C909,#REF!,8,0)),0)","v":0}]
["GESU 138532/3","2016-07-25","022800001",null,"BOUQUET DE LOIRE - BOUQUET MERLOT",6,630,105,630,105,{"$f":"J27-M27-N27-O27-P27-Q27-R27","v":105},7.2333333333333334,0]
["GESU 138532/3","2016-07-25","022800003",null,"BOUQUET DE LOIRE - SYRAH ROSE",6,12,2,12,2,null,7.2333333333333334,{"$f":"IFERROR(IF(J28=\"soldé\",0,VLOOKUP(SOLDE!C911,#REF!,8,0)),0)","v":0}]
["GESU 138532/3","2016-07-25","022800007",null,"BOUQUET DE LOIRE - SAINT NICOLAS DE BOURGUEIL DOM GODEFROY",6,24,4,24,4,null,7.2333333333333334,{"$f":"IFERROR(IF(J29=\"soldé\",0,VLOOKUP(SOLDE!C912,#REF!,8,0)),0)","v":0}]
["GESU 138532/3","2016-07-25","DCJAA003418",null,"GRANDEAU LAUDUC - CHÂTEAU LAUDUC CLASSIC 2014 - BDX ROUGE",6,240,40,240,40,{"$f":"J30-M30-N30-O30-P30-Q30-R30","v":40},7.2333333333333334,0]
["GESU 138532/3","2016-07-25","060220100",null,"CHAMPAGNE BOLLINGER - SPECIAL CUVEE BRUT",6,66,11,66,11,null,7.2333333333333334,{"$f":"IFERROR(IF(J31=\"soldé\",0,VLOOKUP(SOLDE!C914,#REF!,8,0)),0)","v":0}]
["GESU 138532/3","2016-07-25","021500203",null,"PAUL JABOULET - COTES DU RHONE PARALLELE 45 ROUGE",6,240,40,240,40,{"$f":"J32-M32-N32-O32-P32-Q32-R32","v":40},7.2333333333333334,0]
["CLHU 470324/0","2016-08-02","021100301",null,"NEDERBURG SAUVIGNON BLANC",6,240,40,240,40,null,6.9666666666666668,{"$f":"IFERROR(IF(J33=\"soldé\",0,VLOOKUP(SOLDE!C916,#REF!,8,0)),0)","v":0}]
["CLHU 470324/0","2016-08-02","021100118",null,"NEDERBURG (FOUNDATION) - ROSE CABERNET FRANC/MERLOT/SHIRAZ",12,204,17,204,17,null,6.9666666666666668,{"$f":"IFERROR(IF(J34=\"soldé\",0,VLOOKUP(SOLDE!C917,#REF!,8,0)),0)","v":0}]
["CLHU 470324/0","2016-08-02","021100114",null,"NEDERBURG CHARDONNAY",6,558,93,558,93,null,6.9666666666666668,{"$f":"IFERROR(IF(J35=\"soldé\",0,VLOOKUP(SOLDE!C918,#REF!,8,0)),0)","v":0}]
["CLHU 470324/0","2016-08-02","022300600",null,"SAVANNA DRY CIDER 33 CL",24,744,31,744,31,{"$f":"J36-M36-N36-O36-P36-Q36-R36","v":31},6.9666666666666668,{"$f":"IFERROR(IF(J36=\"soldé\",0,VLOOKUP(SOLDE!C919,#REF!,8,0)),0)","v":0}]
["CLHU 470324/0","2016-08-02","021100119",null,"NEDERBURG SHIRAZ ",6,300,50,300,50,null,6.9666666666666668,{"$f":"IFERROR(IF(J37=\"soldé\",0,VLOOKUP(SOLDE!C920,#REF!,8,0)),0)","v":0}]
["CLHU 470324/0","2016-08-02","021200403",null,"ZONNEBLOEM CHARDONNAY",6,162,27,162,27,null,6.9666666666666668,{"$f":"IFERROR(IF(J38=\"soldé\",0,VLOOKUP(SOLDE!C921,#REF!,8,0)),0)","v":0}]
["CLHU 470324/0","2016-08-02","021200311",null,"ZONNEBLOEM SAUVIGNON BLANC",6,180,30,180,30,null,6.9666666666666668,{"$f":"IFERROR(IF(J39=\"soldé\",0,VLOOKUP(SOLDE!C922,#REF!,8,0)),0)","v":0}]
["CLHU 470324/0","2016-08-02","021201006",null,"PLAISIR DE MERLE PETIT PLAISIR SHIRAZ",6,270,45,270,45,null,6.9666666666666668,{"$f":"IFERROR(IF(J40=\"soldé\",0,VLOOKUP(SOLDE!C923,#REF!,8,0)),0)","v":0}]
["CLHU 470324/0","2016-08-02","021201005",null,"PLAISIR DE MERLE MCC GRAND BRUT",6,540,90,540,90,null,6.9666666666666668,{"$f":"IFERROR(IF(J41=\"soldé\",0,VLOOKUP(SOLDE!C924,#REF!,8,0)),0)","v":0}]
["CLHU 470324/0","2016-08-02","022300343",null,"DROSTDY HOF ROUGE",4,24,6,24,6,null,6.9666666666666668,{"$f":"IFERROR(IF(J42=\"soldé\",0,VLOOKUP(SOLDE!C925,#REF!,8,0)),0)","v":0}]
["CLHU 470324/0","2016-08-02","DABAA355257",null,"SARL CPESO - CHÂTEAU TREILLE DE CANDALE - BORDEAUX ROUGE",0,0,0,0,"soldé",null,6.9666666666666668,{"$f":"IFERROR(IF(J43=\"soldé\",0,VLOOKUP(SOLDE!C926,#REF!,8,0)),0)","v":0}]
["CLHU 470324/0","2016-08-02","021320101",null,"SARL CPESO - CHÂTEAU TREILLE DE CANDALE - BORDEAUX BLANC SEC",0,0,0,0,"soldé",null,6.9666666666666668,{"$f":"IFERROR(IF(J44=\"soldé\",0,VLOOKUP(SOLDE!C927,#REF!,8,0)),0)","v":0}]
["CLHU 470324/0","2016-08-02",null,null,"DECLARE DANS TCNU 458829/0",0,0,0,0,"soldé",null,6.9666666666666668,{"$f":"IFERROR(IF(J45=\"soldé\",0,VLOOKUP(SOLDE!C928,#REF!,8,0)),0)","v":0}]
["DR 23079 - TRANSFERT SOUS DOUANE","2016-07-11","021200509",null,"OBIKWA MERLOT",0,0,0,0,"soldé",null,7.7,{"$f":"IFERROR(IF(J46=\"soldé\",0,VLOOKUP(SOLDE!C929,#REF!,8,0)),0)","v":0}]
["DR 23079 - TRANSFERT SOUS DOUANE","2016-07-11","021200515",null,"OBIKWA ROSE",0,0,0,0,"soldé",null,7.7,{"$f":"IFERROR(IF(J47=\"soldé\",0,VLOOKUP(SOLDE!C930,#REF!,8,0)),0)","v":0}]
["DR 23079 - TRANSFERT SOUS DOUANE","2016-07-11","021200516",null,"OBIKWA CHENIN BLANC",0,0,0,0,"soldé",null,7.7,{"$f":"IFERROR(IF(J48=\"soldé\",0,VLOOKUP(SOLDE!C931,#REF!,8,0)),0)","v":0}]
["DR 23079 - TRANSFERT SOUS DOUANE","2016-07-11","021200518",null,"OBIKWA PINOTAGE",0,0,0,0,"soldé",null,7.7,{"$f":"IFERROR(IF(J49=\"soldé\",0,VLOOKUP(SOLDE!C932,#REF!,8,0)),0)","v":0}]
["DR 23080 - TRANSFERT SOUS DOUANE","2016-07-11","021200518",null,"OBIKWA PINOTAGE",0,0,0,0,"soldé",null,7.7,{"$f":"IFERROR(IF(J50=\"soldé\",0,VLOOKUP(SOLDE!C933,#REF!,8,0)),0)","v":0}]
["DR 23080 - TRANSFERT SOUS DOUANE","2016-07-11","021200516",null,"OBIKWA CHENIN BLANC",0,0,0,0,"soldé",null,7.7,{"$f":"IFERROR(IF(J51=\"soldé\",0,VLOOKUP(SOLDE!C934,#REF!,8,0)),0)","v":0}]
["TCLU 719886/9","2016-08-11","021900561",null,"LOUIS LATOUR - POMMARD",6,30,5,30,5,null,6.666666666666667,{"$f":"IFERROR(IF(J52=\"soldé\",0,VLOOKUP(SOLDE!C935,#REF!,8,0)),0)","v":0}]
["TCLU 719886/9","2016-08-11","021900558",null,"LOUIS LATOUR - GEVREY-CHAMBERTIN",0,0,0,0,"soldé",null,6.666666666666667,{"$f":"IFERROR(IF(J53=\"soldé\",0,VLOOKUP(SOLDE!C936,#REF!,8,0)),0)","v":0}]
["CMAU 598908/6","2017-01-17","021201006",null,"PLAISIR DE MERLE PETIT PLAISIR",6,66,11,66,11,null,1.3666666666666667,{"$f":"IFERROR(IF(J54=\"soldé\",0,VLOOKUP(SOLDE!C1028,#REF!,8,0)),0)","v":0}]
["CMAU 598908/6","2017-01-18","021200615",null,"LIBERTAS CHARDONNAY 2015",6,186,31,186,31,null,1.3333333333333333,{"$f":"IFERROR(IF(J55=\"soldé\",0,VLOOKUP(SOLDE!C1029,#REF!,8,0)),0)","v":0}]
["CMAU 598908/6","2017-01-29","021200718",null,"TWO OCEANS SOFT & FRUITY RED",12,36,3,36,3,null,0.96666666666666667,{"$f":"IFERROR(IF(J56=\"soldé\",0,VLOOKUP(SOLDE!C1040,#REF!,8,0)),0)","v":0}]
["CAXU 631779/0  ","2013-12-08","021100106",null,"NED BARONNE                   ",0,0,0,0,"soldé",null,39.233333333333334,{"$f":"IFERROR(IF(J57=\"soldé\",0,VLOOKUP(SOLDE!C2,#REF!,8,0)),0)","v":0}]
["CAXU 631779/0  ","2013-12-08","021100107",null,"NED EDELROOD 2007             ",0,0,0,0,"soldé",null,39.233333333333334,{"$f":"IFERROR(IF(J58=\"soldé\",0,VLOOKUP(SOLDE!C3,#REF!,8,0)),0)","v":0}]
["CAXU 631779/0  ","2013-12-08","021100108",null,"NED CHARDONNAY 2008           ",0,0,0,0,"soldé",null,39.233333333333334,{"$f":"IFERROR(IF(J59=\"soldé\",0,VLOOKUP(SOLDE!C4,#REF!,8,0)),0)","v":0}]
["CAXU 631779/0  ","2013-12-08","021100113",{"$f":"+A60","v":"CAXU 631779/0  "},"NED SPECIAL LATE HARVEST      ",0,0,0,0,"soldé",null,39.233333333333334,{"$f":"IFERROR(IF(J60=\"soldé\",0,VLOOKUP(SOLDE!C5,#REF!,8,0)),0)","v":0}]
["CAXU 631779/0  ","2013-12-08","021100114",null,"NED CHARDONNAY                ",0,0,0,0,"soldé",null,39.233333333333334,{"$f":"IFERROR(IF(J61=\"soldé\",0,VLOOKUP(SOLDE!C6,#REF!,8,0)),0)","v":0}]
["CAXU 631779/0  ","2013-12-08","021100115",null,"NEDERBURG LYRIC               ",0,0,0,0,"soldé",null,39.233333333333334,{"$f":"IFERROR(IF(J62=\"soldé\",0,VLOOKUP(SOLDE!C7,#REF!,8,0)),0)","v":0}]
["CAXU 631779/0  ","2013-12-08","021100116",null,"NEDERBURG CAB SAUV 2008       ",0,0,0,0,"soldé",null,39.233333333333334,{"$f":"IFERROR(IF(J63=\"soldé\",0,VLOOKUP(SOLDE!C8,#REF!,8,0)),0)","v":0}]
["CAXU 631779/0  ","2013-12-08","021100118",null,"NEDERBURG ROSE 2009           ",0,0,0,0,"soldé",null,39.233333333333334,{"$f":"IFERROR(IF(J64=\"soldé\",0,VLOOKUP(SOLDE!C9,#REF!,8,0)),0)","v":0}]
["CAXU 631779/0  ","2013-12-08","021100119",null,"NEDERBURG SHIRAZ              ",0,0,0,0,"soldé",null,39.233333333333334,{"$f":"IFERROR(IF(J65=\"soldé\",0,VLOOKUP(SOLDE!C10,#REF!,8,0)),0)","v":0}]
["CAXU 631779/0  ","2013-12-08","021100300",null,"NEDERBURG 1ERE CUVEE BRUT     ",{"$f":"IFERROR(G66/H66,0)","v":0},0,0,{"$f":"G66","v":0},{"$f":"IF(H66<=0,\"soldé\",H66)","v":"soldé"},null,{"$f":"(TODAY()-B66)/30","v":39.233333333333334},{"$f":"IFERROR(IF(J66=\"soldé\",0,VLOOKUP(SOLDE!C11,#REF!,8,0)),0)","v":0}]
["CAXU 631779/0  ","2013-12-08","021100301",null,"NEDERBURG SAUVIGNON BLC       ",0,0,0,0,"soldé",null,39.233333333333334,{"$f":"IFERROR(IF(J67=\"soldé\",0,VLOOKUP(SOLDE!C12,#REF!,8,0)),0)","v":0}]
["CAXU 631779/0  ","2013-12-08","021100302",null,"NEDERBURG ROSE                ",0,0,0,0,"soldé",null,39.233333333333334,{"$f":"IFERROR(IF(J68=\"soldé\",0,VLOOKUP(SOLDE!C13,#REF!,8,0)),0)","v":0}]
["CAXU 631779/0  ","2013-12-08","021100340",null,"NED WINEMASTERS RHINE RIESLING",0,0,0,0,"soldé",null,39.233333333333334,{"$f":"IFERROR(IF(J69=\"soldé\",0,VLOOKUP(SOLDE!C14,#REF!,8,0)),0)","v":0}]
["CAXU 631779/0  ","2013-12-08","021200307",null,"ZONNEBLOEM SHIRAZ 2007        ",0,0,0,0,"soldé",null,39.233333333333334,{"$f":"IFERROR(IF(J70=\"soldé\",0,VLOOKUP(SOLDE!C15,#REF!,8,0)),0)","v":0}]
["CAXU 631779/0  ","2013-12-08","021200308",null,"ZONNEBLOEM PINOTAGE           ",0,0,0,0,"soldé",null,39.233333333333334,{"$f":"IFERROR(IF(J71=\"soldé\",0,VLOOKUP(SOLDE!C16,#REF!,8,0)),0)","v":0}]
["CAXU 631779/0  ","2013-12-08","021200309",null,"ZONNEBLOEM CAB SAUV           ",0,0,0,0,"soldé",null,39.233333333333334,{"$f":"IFERROR(IF(J72=\"soldé\",0,VLOOKUP(SOLDE!C17,#REF!,8,0)),0)","v":0}]
["CAXU 631779/0  ","2013-12-08","021200311",null,"ZONNEBLOEM SAUVIGNON BLC 2010 ",0,0,0,0,"soldé",null,39.233333333333334,{"$f":"IFERROR(IF(J73=\"soldé\",0,VLOOKUP(SOLDE!C18,#REF!,8,0)),0)","v":0}]
["CAXU 631779/0  ","2013-12-08","021200403",null,"ZONNEBLOEM CHARDONNAY         ",0,0,0,0,"soldé",null,39.233333333333334,{"$f":"IFERROR(IF(J74=\"soldé\",0,VLOOKUP(SOLDE!C19,#REF!,8,0)),0)","v":0}]
["CAXU 631779/0  ","2013-12-08","021200404",null,"ZONNEBLOEM SHIRAZ             ",0,0,0,0,"soldé",null,39.233333333333334,{"$f":"IFERROR(IF(J75=\"soldé\",0,VLOOKUP(SOLDE!C20,#REF!,8,0)),0)","v":0}]
["CAXU 631779/0  ","2013-12-08","021200508",null,"OBIKWA PINOTAGE SAVIN 2009    ",0,0,0,0,"soldé",null,39.233333333333334,{"$f":"IFERROR(IF(J76=\"soldé\",0,VLOOKUP(SOLDE!C21,#REF!,8,0)),0)","v":0}]
["CAXU 631779/0  ","2013-12-08","021200509",null,"OBIKWA MERLOT                 ",0,0,0,0,"soldé",null,39.233333333333334,{"$f":"IFERROR(IF(J77=\"soldé\",0,VLOOKUP(SOLDE!C22,#REF!,8,0)),0)","v":0}]
["CAXU 631779/0  ","2013-12-08","021200511",null,"OBIKWA CHARDONNAY             ",0,0,0,0,"soldé",null,39.233333333333334,{"$f":"IFERROR(IF(J78=\"soldé\",0,VLOOKUP(SOLDE!C23,#REF!,8,0)),0)","v":0}]
["CAXU 631779/0  ","2013-12-08","021200514",null,"OBIKWA SAUVIGNON BLANC        ",0,0,0,0,"soldé",null,39.233333333333334,{"$f":"IFERROR(IF(J79=\"soldé\",0,VLOOKUP(SOLDE!C24,#REF!,8,0)),0)","v":0}]
["CAXU 631779/0  ","2013-12-08","021200515",null,"OBIKWA PINOTAGE ROSE          ",0,0,0,0,"soldé",null,39.233333333333334,{"$f":"IFERROR(IF(J80=\"soldé\",0,VLOOKUP(SOLDE!C25,#REF!,8,0)),0)","v":0}]
["CAXU 631779/0  ","2013-12-08","021200516",null,"OBIKWA CHENIN BLANC           ",0,0,0,0,"soldé",null,39.233333333333334,{"$f":"IFERROR(IF(J81=\"soldé\",0,VLOOKUP(SOLDE!C26,#REF!,8,0)),0)","v":0}]
["CAXU 631779/0  ","2013-12-08","021200517",null,"OBIKWA CABERNET SAUVIGNON     ",0,0,0,0,"soldé",null,39.233333333333334,{"$f":"IFERROR(IF(J82=\"soldé\",0,VLOOKUP(SOLDE!C27,#REF!,8,0)),0)","v":0}]
["CAXU 631779/0  ","2013-12-08","021200518",null,"OBIKWA PINOTAGE               ",0,0,0,0,"soldé",null,39.233333333333334,{"$f":"IFERROR(IF(J83=\"soldé\",0,VLOOKUP(SOLDE!C28,#REF!,8,0)),0)","v":0}]
["CAXU 631779/0  ","2013-12-08","021200614",null,"LIBERTAS CAB SAUVIGNON        ",6,150,25,150,25,null,39.233333333333334,{"$f":"IFERROR(IF(J84=\"soldé\",0,VLOOKUP(SOLDE!C29,#REF!,8,0)),0)","v":0}]
["CAXU 631779/0  ","2013-12-08","021200615",null,"LIBERTAS CHARDONNAY           ",0,0,0,0,"soldé",null,39.233333333333334,{"$f":"IFERROR(IF(J85=\"soldé\",0,VLOOKUP(SOLDE!C30,#REF!,8,0)),0)","v":0}]
["CAXU 631779/0  ","2013-12-08","021200616",null,"LIBERTAS CHENIN BLANC         ",0,0,0,0,"soldé",null,39.233333333333334,{"$f":"IFERROR(IF(J86=\"soldé\",0,VLOOKUP(SOLDE!C31,#REF!,8,0)),0)","v":0}]
["CAXU 631779/0  ","2013-12-08","021200617",null,"LIBERTAS MERLOT 2009          ",0,0,0,0,"soldé",null,39.233333333333334,{"$f":"IFERROR(IF(J87=\"soldé\",0,VLOOKUP(SOLDE!C32,#REF!,8,0)),0)","v":0}]
["CAXU 631779/0  ","2013-12-08","021200618",null,"LIBERTAS PINOTAGE             ",0,0,0,0,"soldé",null,39.233333333333334,{"$f":"IFERROR(IF(J88=\"soldé\",0,VLOOKUP(SOLDE!C33,#REF!,8,0)),0)","v":0}]
["CAXU 631779/0  ","2013-12-08","021200623",null,"LIBERTAS MERLOT               ",0,0,0,0,"soldé",null,39.233333333333334,{"$f":"IFERROR(IF(J89=\"soldé\",0,VLOOKUP(SOLDE!C34,#REF!,8,0)),0)","v":0}]
["CAXU 631779/0  ","2013-12-08","021200701",null,"TWO OCEANS SHIRAZ 2012   ",12,228,19,228,19,null,39.233333333333334,{"$f":"IFERROR(IF(J90=\"soldé\",0,VLOOKUP(SOLDE!C35,#REF!,8,0)),0)","v":0}]
["CAXU 631779/0  ","2013-12-08","021200702",null,"TWO OCEANS SAUVIGNON BLC 2013",0,0,0,0,"soldé",null,39.233333333333334,{"$f":"IFERROR(IF(J91=\"soldé\",0,VLOOKUP(SOLDE!C36,#REF!,8,0)),0)","v":0}]
["CAXU 631779/0  ","2013-12-08","021200703",null,"TWO OCEANS CAB SAUV/MERLOT 08 ",0,0,0,0,"soldé",null,39.233333333333334,{"$f":"IFERROR(IF(J92=\"soldé\",0,VLOOKUP(SOLDE!C37,#REF!,8,0)),0)","v":0}]
["CAXU 631779/0  ","2013-12-08","021200713",null,"TWO OCEANS SHIRAZ ROSE 2007   ",0,0,0,0,"soldé",null,39.233333333333334,{"$f":"IFERROR(IF(J93=\"soldé\",0,VLOOKUP(SOLDE!C38,#REF!,8,0)),0)","v":0}]
["CAXU 631779/0  ","2013-12-08","021200714",null,"TWO OCEANS CAB SAUV/MERLOT 09 ",0,0,0,0,"soldé",null,39.233333333333334,{"$f":"IFERROR(IF(J94=\"soldé\",0,VLOOKUP(SOLDE!C39,#REF!,8,0)),0)","v":0}]
["CAXU 631779/0  ","2013-12-08","021200715",null,"TWO OCEANS SHIRAZ ROSE        ",12,276,23,276,23,{"$f":"J95-M95-N95-O95-P95-Q95-R95","v":23},39.233333333333334,0]
["CAXU 631779/0  ","2013-12-08","021200716",null,"TWO OCEANS CHARDONNAY 2009    ",0,0,0,0,"soldé",null,39.233333333333334,{"$f":"IFERROR(IF(J96=\"soldé\",0,VLOOKUP(SOLDE!C41,#REF!,8,0)),0)","v":0}]
["CAXU 631779/0  ","2013-12-08","021200717",null,"TWO OCEANS FH&FRUITY WHITE    ",0,0,0,0,"soldé",null,39.233333333333334,{"$f":"IFERROR(IF(J97=\"soldé\",0,VLOOKUP(SOLDE!C42,#REF!,8,0)),0)","v":0}]
["CAXU 631779/0  ","2013-12-08","021200718",null,"TWO OCEANS SOFT&FRUITY RED    ",0,0,0,0,"soldé",null,39.233333333333334,{"$f":"IFERROR(IF(J98=\"soldé\",0,VLOOKUP(SOLDE!C43,#REF!,8,0)),0)","v":0}]
["CAXU 631779/0  ","2013-12-08","021201000",null,"PLAISIR DE MERLE SHIRAZ 07    ",0,0,0,0,"soldé",null,39.233333333333334,{"$f":"IFERROR(IF(J99=\"soldé\",0,VLOOKUP(SOLDE!C44,#REF!,8,0)),0)","v":0}]
["CAXU 631779/0  ","2013-12-08","021201001",null,"PLAISIR DE MERLE SAUV BLC 07  ",0,0,0,0,"soldé",null,39.233333333333334,{"$f":"IFERROR(IF(J100=\"soldé\",0,VLOOKUP(SOLDE!C45,#REF!,8,0)),0)","v":0}]
["CAXU 631779/0  ","2013-12-08","021201002",null,"PLAISIR DE MERLE CHARDONNAY 07",0,0,0,0,"soldé",null,39.233333333333334,{"$f":"IFERROR(IF(J101=\"soldé\",0,VLOOKUP(SOLDE!C46,#REF!,8,0)),0)","v":0}]
["CAXU 631779/0  ","2013-12-08","021201003",null,"PLAISIR DE MERLE CAB SAUV 06  ",0,0,0,0,"soldé",null,39.233333333333334,{"$f":"IFERROR(IF(J102=\"soldé\",0,VLOOKUP(SOLDE!C47,#REF!,8,0)),0)","v":0}]
["CAXU 631779/0  ","2013-12-08","021201004",null,"PLAISIR DE MERLE SAUV BLC     ",0,0,0,0,"soldé",null,39.233333333333334,{"$f":"IFERROR(IF(J103=\"soldé\",0,VLOOKUP(SOLDE!C48,#REF!,8,0)),0)","v":0}]
["CAXU 631779/0  ","2013-12-08","022200566",null,"NEETHLINGSHOF THE OWL POST 08 ",0,0,0,0,"soldé",null,39.233333333333334,{"$f":"IFERROR(IF(J104=\"soldé\",0,VLOOKUP(SOLDE!C49,#REF!,8,0)),0)","v":0}]
["CAXU 631779/0  ","2013-12-08","022300337",null,"DROSTDY HOF CLARET            ",0,0,0,0,"soldé",null,39.233333333333334,{"$f":"IFERROR(IF(J105=\"soldé\",0,VLOOKUP(SOLDE!C50,#REF!,8,0)),0)","v":0}]
["CAXU 631779/0  ","2013-12-08","022300338",null,"DROSTDY HOF ADELPRACHT        ",0,0,0,0,"soldé",null,39.233333333333334,{"$f":"IFERROR(IF(J106=\"soldé\",0,VLOOKUP(SOLDE!C51,#REF!,8,0)),0)","v":0}]
["CAXU 631779/0  ","2013-12-08","022300339",null,"DROSTDY HOF NATURAL SWEET ROSE",0,0,0,0,"soldé",null,39.233333333333334,{"$f":"IFERROR(IF(J107=\"soldé\",0,VLOOKUP(SOLDE!C52,#REF!,8,0)),0)","v":0}]
["CAXU 631779/0  ","2013-12-08","022300340",null,"DROSTDY HOF CABERNET SAUV     ",0,0,0,0,"soldé",null,39.233333333333334,{"$f":"IFERROR(IF(J108=\"soldé\",0,VLOOKUP(SOLDE!C53,#REF!,8,0)),0)","v":0}]
["CAXU 631779/0  ","2013-12-08","022300341",null,"DROSTDY HOF CHARDONNAY        ",0,0,0,0,"soldé",null,39.233333333333334,{"$f":"IFERROR(IF(J109=\"soldé\",0,VLOOKUP(SOLDE!C54,#REF!,8,0)),0)","v":0}]
["CAXU 631779/0  ","2013-12-08","022300342",null,"DROSTDY HOF MERLOT            ",0,0,0,0,"soldé",null,39.233333333333334,{"$f":"IFERROR(IF(J110=\"soldé\",0,VLOOKUP(SOLDE!C55,#REF!,8,0)),0)","v":0}]
["CAXU 631779/0  ","2013-12-08","022300400",null,"FLEUR DU CAP CABERNET SAUV    ",0,0,0,0,"soldé",null,39.233333333333334,{"$f":"IFERROR(IF(J111=\"soldé\",0,VLOOKUP(SOLDE!C56,#REF!,8,0)),0)","v":0}]
["CAXU 631779/0  ","2013-12-08","022300401",null,"FLEUR DU CAP CHARDONNAY       ",0,0,0,0,"soldé",null,39.233333333333334,{"$f":"IFERROR(IF(J112=\"soldé\",0,VLOOKUP(SOLDE!C57,#REF!,8,0)),0)","v":0}]
["CAXU 631779/0  ","2013-12-08","022300402",null,"FLEUR DU CAP MERLOT 2008      ",0,0,0,0,"soldé",null,39.233333333333334,{"$f":"IFERROR(IF(J113=\"soldé\",0,VLOOKUP(SOLDE!C58,#REF!,8,0)),0)","v":0}]
["CAXU 631779/0  ","2013-12-08","022300403",null,"FLEUR DU CAP PINOTAGE         ",0,0,0,0,"soldé",null,39.233333333333334,{"$f":"IFERROR(IF(J114=\"soldé\",0,VLOOKUP(SOLDE!C59,#REF!,8,0)),0)","v":0}]
["CAXU 631779/0  ","2013-12-08","022300404",null,"FLEUR DU CAP SAUVIGNON BLC    ",0,0,0,0,"soldé",null,39.233333333333334,{"$f":"IFERROR(IF(J115=\"soldé\",0,VLOOKUP(SOLDE!C60,#REF!,8,0)),0)","v":0}]
["CAXU 631779/0  ","2013-12-08","022300405",null,"FLEUR DU CAP SHIRAZ           ",0,0,0,0,"soldé",null,39.233333333333334,{"$f":"IFERROR(IF(J116=\"soldé\",0,VLOOKUP(SOLDE!C61,#REF!,8,0)),0)","v":0}]
["CAXU 631779/0  ","2013-12-08","022300502",null,"NEETHLINGSHOF CHARD NO WOOD   ",0,0,0,0,"soldé",null,39.233333333333334,{"$f":"IFERROR(IF(J117=\"soldé\",0,VLOOKUP(SOLDE!C62,#REF!,8,0)),0)","v":0}]
["CAXU 631779/0  ","2013-12-08","022300503",null,"NEETHLINGSHOF CARACAL         ",0,0,0,0,"soldé",null,39.233333333333334,{"$f":"IFERROR(IF(J118=\"soldé\",0,VLOOKUP(SOLDE!C63,#REF!,8,0)),0)","v":0}]
["CAXU 631779/0  ","2013-12-08","022300505",null,"NEETHLINGSHOF MALBEC          ",0,0,0,0,"soldé",null,39.233333333333334,{"$f":"IFERROR(IF(J119=\"soldé\",0,VLOOKUP(SOLDE!C64,#REF!,8,0)),0)","v":0}]
["CAXU 631779/0  ","2013-12-08","022300567",null,"NEETHLINGSHOF GEWURZTRAMIN    ",0,0,0,0,"soldé",null,39.233333333333334,{"$f":"IFERROR(IF(J120=\"soldé\",0,VLOOKUP(SOLDE!C65,#REF!,8,0)),0)","v":0}]
["CAXU 631779/0  ","2013-12-08","022300568",null,"NEETHLINGSHOF SHIRAZ          ",0,0,0,0,"soldé",null,39.233333333333334,{"$f":"IFERROR(IF(J121=\"soldé\",0,VLOOKUP(SOLDE!C66,#REF!,8,0)),0)","v":0}]
["CAXU 631779/0  ","2013-12-08","022300600",null,"SAVANNA DRY 33CL.             ",0,0,0,0,"soldé",null,39.233333333333334,{"$f":"IFERROR(IF(J122=\"soldé\",0,VLOOKUP(SOLDE!C67,#REF!,8,0)),0)","v":0}]
["MEDU 349062/4","2013-12-08","021100106",null,"NED BARONNE                   ",0,0,0,0,"soldé",null,39.233333333333334,{"$f":"IFERROR(IF(J123=\"soldé\",0,VLOOKUP(SOLDE!C68,#REF!,8,0)),0)","v":0}]
["MEDU 349062/4","2013-12-08","021100107",null,"NED EDELROOD 2007             ",0,0,0,0,"soldé",null,39.233333333333334,{"$f":"IFERROR(IF(J124=\"soldé\",0,VLOOKUP(SOLDE!C69,#REF!,8,0)),0)","v":0}]
["MEDU 349062/4","2013-12-08","021100108",null,"NED CHARDONNAY 2008           ",0,0,0,0,"soldé",null,39.233333333333334,{"$f":"IFERROR(IF(J125=\"soldé\",0,VLOOKUP(SOLDE!C70,#REF!,8,0)),0)","v":0}]
["MEDU 349062/4","2013-12-08","021100113",{"$f":"+A126","v":"MEDU 349062/4"},"NED SPECIAL LATE HARVEST      ",0,0,0,0,"soldé",null,39.233333333333334,{"$f":"IFERROR(IF(J126=\"soldé\",0,VLOOKUP(SOLDE!C71,#REF!,8,0)),0)","v":0}]
["MEDU 349062/4","2013-12-08","021100114",null,"NED CHARDONNAY                ",0,0,0,0,"soldé",null,39.233333333333334,{"$f":"IFERROR(IF(J127=\"soldé\",0,VLOOKUP(SOLDE!C72,#REF!,8,0)),0)","v":0}]
["MEDU 349062/4","2013-12-08","021100115",null,"NEDERBURG LYRIC               ",0,0,0,0,"soldé",null,39.233333333333334,{"$f":"IFERROR(IF(J128=\"soldé\",0,VLOOKUP(SOLDE!C73,#REF!,8,0)),0)","v":0}]
["MEDU 349062/4","2013-12-08","021100116",null,"NEDERBURG CAB SAUV 2008       ",0,0,0,0,"soldé",null,39.233333333333334,{"$f":"IFERROR(IF(J129=\"soldé\",0,VLOOKUP(SOLDE!C74,#REF!,8,0)),0)","v":0}]
["MEDU 349062/4","2013-12-08","021100118",null,"NEDERBURG ROSE 2009           ",{"$f":"IFERROR(G130/H130,0)","v":0},0,0,{"$f":"G130","v":0},{"$f":"IF(H130<=0,\"soldé\",H130)","v":"soldé"},null,{"$f":"(TODAY()-B130)/30","v":39.233333333333334},{"$f":"IFERROR(IF(J130=\"soldé\",0,VLOOKUP(SOLDE!C75,#REF!,8,0)),0)","v":0}]
["MEDU 349062/4","2013-12-08","021100119",null,"NEDERBURG SHIRAZ              ",0,0,0,0,"soldé",null,39.233333333333334,{"$f":"IFERROR(IF(J131=\"soldé\",0,VLOOKUP(SOLDE!C76,#REF!,8,0)),0)","v":0}]
["MEDU 349062/4","2013-12-08","021100300",null,"NEDERBURG 1ERE CUVEE BRUT     ",0,0,0,0,"soldé",null,39.233333333333334,{"$f":"IFERROR(IF(J132=\"soldé\",0,VLOOKUP(SOLDE!C77,#REF!,8,0)),0)","v":0}]
["MEDU 349062/4","2013-12-08","021100301",null,"NEDERBURG SAUVIGNON BLC       ",0,0,0,0,"soldé",null,39.233333333333334,{"$f":"IFERROR(IF(J133=\"soldé\",0,VLOOKUP(SOLDE!C78,#REF!,8,0)),0)","v":0}]
["MEDU 349062/4","2013-12-08","021100302",null,"NEDERBURG ROSE                ",0,0,0,0,"soldé",null,39.233333333333334,{"$f":"IFERROR(IF(J134=\"soldé\",0,VLOOKUP(SOLDE!C79,#REF!,8,0)),0)","v":0}]
["MEDU 349062/4","2013-12-08","021100340",null,"NED WINEMASTERS RHINE RIESLING",0,0,0,0,"soldé",null,39.233333333333334,{"$f":"IFERROR(IF(J135=\"soldé\",0,VLOOKUP(SOLDE!C80,#REF!,8,0)),0)","v":0}]
["MEDU 349062/4","2013-12-08","021200307",null,"ZONNEBLOEM SHIRAZ 2007        ",0,0,0,0,"soldé",null,39.233333333333334,{"$f":"IFERROR(IF(J136=\"soldé\",0,VLOOKUP(SOLDE!C81,#REF!,8,0)),0)","v":0}]
["MEDU 349062/4","2013-12-08","021200308",null,"ZONNEBLOEM PINOTAGE           ",0,0,0,0,"soldé",null,39.233333333333334,{"$f":"IFERROR(IF(J137=\"soldé\",0,VLOOKUP(SOLDE!C82,#REF!,8,0)),0)","v":0}]
["MEDU 349062/4","2013-12-08","021200309",null,"ZONNEBLOEM CAB SAUV           ",0,0,0,0,"soldé",null,39.233333333333334,{"$f":"IFERROR(IF(J138=\"soldé\",0,VLOOKUP(SOLDE!C83,#REF!,8,0)),0)","v":0}]
["MEDU 349062/4","2013-12-08","021200311",null,"ZONNEBLOEM SAUVIGNON BLC 2010 ",0,0,0,0,"soldé",null,39.233333333333334,{"$f":"IFERROR(IF(J139=\"soldé\",0,VLOOKUP(SOLDE!C84,#REF!,8,0)),0)","v":0}]
["MEDU 349062/4","2013-12-08","021200403",null,"ZONNEBLOEM CHARDONNAY         ",0,0,0,0,"soldé",null,39.233333333333334,{"$f":"IFERROR(IF(J140=\"soldé\",0,VLOOKUP(SOLDE!C85,#REF!,8,0)),0)","v":0}]
["MEDU 349062/4","2013-12-08","021200404",null,"ZONNEBLOEM SHIRAZ             ",0,0,0,0,"soldé",null,39.233333333333334,{"$f":"IFERROR(IF(J141=\"soldé\",0,VLOOKUP(SOLDE!C86,#REF!,8,0)),0)","v":0}]
["MEDU 349062/4","2013-12-08","021200508",null,"OBIKWA PINOTAGE SAVIN 2009    ",0,0,0,0,"soldé",null,39.233333333333334,{"$f":"IFERROR(IF(J142=\"soldé\",0,VLOOKUP(SOLDE!C87,#REF!,8,0)),0)","v":0}]
["MEDU 349062/4","2013-12-08","021200509",null,"OBIKWA MERLOT                 ",0,0,0,0,"soldé",null,39.233333333333334,{"$f":"IFERROR(IF(J143=\"soldé\",0,VLOOKUP(SOLDE!C88,#REF!,8,0)),0)","v":0}]
["MEDU 349062/4","2013-12-08","021200511",null,"OBIKWA CHARDONNAY             ",0,0,0,0,"soldé",null,39.233333333333334,{"$f":"IFERROR(IF(J144=\"soldé\",0,VLOOKUP(SOLDE!C89,#REF!,8,0)),0)","v":0}]
["MEDU 349062/4","2013-12-08","021200514",null,"OBIKWA SAUVIGNON BLANC        ",6,-6,-1,-6,"soldé",null,39.233333333333334,{"$f":"IFERROR(IF(J145=\"soldé\",0,VLOOKUP(SOLDE!C90,#REF!,8,0)),0)","v":0}]
["MEDU 349062/4","2013-12-08","021200515",null,"OBIKWA PINOTAGE ROSE          ",6,198,33,198,33,null,39.233333333333334,{"$f":"IFERROR(IF(J146=\"soldé\",0,VLOOKUP(SOLDE!C91,#REF!,8,0)),0)","v":0}]
["MEDU 349062/4","2013-12-08","021200516",null,"OBIKWA CHENIN BLANC           ",0,0,0,0,"soldé",null,39.233333333333334,{"$f":"IFERROR(IF(J147=\"soldé\",0,VLOOKUP(SOLDE!C92,#REF!,8,0)),0)","v":0}]
["MEDU 349062/4","2013-12-08","021200517",null,"OBIKWA CABERNET SAUVIGNON     ",0,0,0,0,"soldé",null,39.233333333333334,{"$f":"IFERROR(IF(J148=\"soldé\",0,VLOOKUP(SOLDE!C93,#REF!,8,0)),0)","v":0}]
["MEDU 349062/4","2013-12-08","021200518",null,"OBIKWA PINOTAGE               ",6,60,10,60,10,null,39.233333333333334,{"$f":"IFERROR(IF(J149=\"soldé\",0,VLOOKUP(SOLDE!C94,#REF!,8,0)),0)","v":0}]
["MEDU 349062/4","2013-12-08","021200614",null,"LIBERTAS CAB SAUVIGNON        ",6,138,23,138,23,null,39.233333333333334,{"$f":"IFERROR(IF(J150=\"soldé\",0,VLOOKUP(SOLDE!C95,#REF!,8,0)),0)","v":0}]
["MEDU 349062/4","2013-12-08","021200615",null,"LIBERTAS CHARDONNAY           ",0,0,0,0,"soldé",null,39.233333333333334,{"$f":"IFERROR(IF(J151=\"soldé\",0,VLOOKUP(SOLDE!C96,#REF!,8,0)),0)","v":0}]
["MEDU 349062/4","2013-12-08","021200616",null,"LIBERTAS CHENIN BLANC         ",0,0,0,0,"soldé",null,39.233333333333334,{"$f":"IFERROR(IF(J152=\"soldé\",0,VLOOKUP(SOLDE!C97,#REF!,8,0)),0)","v":0}]
["MEDU 349062/4","2013-12-08","021200617",null,"LIBERTAS MERLOT 2009          ",0,0,0,0,"soldé",null,39.233333333333334,{"$f":"IFERROR(IF(J153=\"soldé\",0,VLOOKUP(SOLDE!C98,#REF!,8,0)),0)","v":0}]
["MEDU 349062/4","2013-12-08","021200618",null,"LIBERTAS PINOTAGE             ",0,0,0,0,"soldé",null,39.233333333333334,{"$f":"IFERROR(IF(J154=\"soldé\",0,VLOOKUP(SOLDE!C99,#REF!,8,0)),0)","v":0}]
["MEDU 349062/4","2013-12-08","021200623",null,"LIBERTAS MERLOT               ",0,0,0,0,"soldé",null,39.233333333333334,{"$f":"IFERROR(IF(J155=\"soldé\",0,VLOOKUP(SOLDE!C100,#REF!,8,0)),0)","v":0}]
["MEDU 349062/4","2013-12-08","021200701",null,"TWO OCEANS SHIRAZ 2013   ",12,60,5,60,5,null,39.233333333333334,{"$f":"IFERROR(IF(J156=\"soldé\",0,VLOOKUP(SOLDE!C101,#REF!,8,0)),0)","v":0}]
["MEDU 349062/4","2013-12-08","021200702",null,"TWO OCEANS SAUVIGNON BLC 2013",0,0,0,0,"soldé",null,39.233333333333334,{"$f":"IFERROR(IF(J157=\"soldé\",0,VLOOKUP(SOLDE!C102,#REF!,8,0)),0)","v":0}]
["MEDU 349062/4","2013-12-08","021200703",null,"TWO OCEANS CAB SAUV/MERLOT 08 ",0,0,0,0,"soldé",null,39.233333333333334,{"$f":"IFERROR(IF(J158=\"soldé\",0,VLOOKUP(SOLDE!C103,#REF!,8,0)),0)","v":0}]
["MEDU 349062/4","2013-12-08","021200713",null,"TWO OCEANS SHIRAZ ROSE 2007   ",0,0,0,0,"soldé",null,39.233333333333334,{"$f":"IFERROR(IF(J159=\"soldé\",0,VLOOKUP(SOLDE!C104,#REF!,8,0)),0)","v":0}]
["MEDU 349062/4","2013-12-08","021200714",null,"TWO OCEANS CAB SAUV/MERLOT 09 ",0,0,0,0,"soldé",null,39.233333333333334,{"$f":"IFERROR(IF(J160=\"soldé\",0,VLOOKUP(SOLDE!C105,#REF!,8,0)),0)","v":0}]
["MEDU 349062/4","2013-12-08","021200715",null,"TWO OCEANS SHIRAZ ROSE        ",12,24,2,24,2,{"$f":"J161-M161-N161-O161-P161-Q161-R161","v":2},39.233333333333334,{"$f":"IFERROR(IF(J161=\"soldé\",0,VLOOKUP(SOLDE!C106,#REF!,8,0)),0)","v":0}]
["MEDU 349062/4","2013-12-08","021200716",null,"TWO OCEANS CHARDONNAY 2009    ",0,0,0,0,"soldé",null,39.233333333333334,{"$f":"IFERROR(IF(J162=\"soldé\",0,VLOOKUP(SOLDE!C107,#REF!,8,0)),0)","v":0}]
["MEDU 349062/4","2013-12-08","021200717",null,"TWO OCEANS FH&FRUITY WHITE    ",0,0,0,0,"soldé",null,39.233333333333334,{"$f":"IFERROR(IF(J163=\"soldé\",0,VLOOKUP(SOLDE!C108,#REF!,8,0)),0)","v":0}]
["MEDU 349062/4","2013-12-08","021200718",null,"TWO OCEANS SOFT&FRUITY RED    ",0,0,0,0,"soldé",null,39.233333333333334,{"$f":"IFERROR(IF(J164=\"soldé\",0,VLOOKUP(SOLDE!C109,#REF!,8,0)),0)","v":0}]
["MEDU 349062/4","2013-12-08","021201000",null,"PLAISIR DE MERLE SHIRAZ 07    ",0,0,0,0,"soldé",null,39.233333333333334,{"$f":"IFERROR(IF(J165=\"soldé\",0,VLOOKUP(SOLDE!C110,#REF!,8,0)),0)","v":0}]
["MEDU 349062/4","2013-12-08","021201001",null,"PLAISIR DE MERLE SAUV BLC 07  ",0,0,0,0,"soldé",null,39.233333333333334,{"$f":"IFERROR(IF(J166=\"soldé\",0,VLOOKUP(SOLDE!C111,#REF!,8,0)),0)","v":0}]
["MEDU 349062/4","2013-12-08","021201002",null,"PLAISIR DE MERLE CHARDONNAY 07",0,0,0,0,"soldé",null,39.233333333333334,{"$f":"IFERROR(IF(J167=\"soldé\",0,VLOOKUP(SOLDE!C112,#REF!,8,0)),0)","v":0}]
["MEDU 349062/4","2013-12-08","021201003",null,"PLAISIR DE MERLE CAB SAUV 06  ",0,0,0,0,"soldé",null,39.233333333333334,{"$f":"IFERROR(IF(J168=\"soldé\",0,VLOOKUP(SOLDE!C113,#REF!,8,0)),0)","v":0}]
["MEDU 349062/4","2013-12-08","021201004",null,"PLAISIR DE MERLE SAUV BLC     ",0,0,0,0,"soldé",null,39.233333333333334,{"$f":"IFERROR(IF(J169=\"soldé\",0,VLOOKUP(SOLDE!C114,#REF!,8,0)),0)","v":0}]
["MEDU 349062/4","2013-12-08","022200566",null,"NEETHLINGSHOF THE OWL POST 08 ",0,0,0,0,"soldé",null,39.233333333333334,{"$f":"IFERROR(IF(J170=\"soldé\",0,VLOOKUP(SOLDE!C115,#REF!,8,0)),0)","v":0}]
["MEDU 349062/4","2013-12-08","022300337",null,"DROSTDY HOF CLARET            ",0,0,0,0,"soldé",null,39.233333333333334,{"$f":"IFERROR(IF(J171=\"soldé\",0,VLOOKUP(SOLDE!C116,#REF!,8,0)),0)","v":0}]
["MEDU 349062/4","2013-12-08","022300338",null,"DROSTDY HOF ADELPRACHT        ",0,0,0,0,"soldé",null,39.233333333333334,{"$f":"IFERROR(IF(J172=\"soldé\",0,VLOOKUP(SOLDE!C117,#REF!,8,0)),0)","v":0}]
["MEDU 349062/4","2013-12-08","022300339",null,"DROSTDY HOF NATURAL SWEET ROSE",0,0,0,0,"soldé",null,39.233333333333334,{"$f":"IFERROR(IF(J173=\"soldé\",0,VLOOKUP(SOLDE!C118,#REF!,8,0)),0)","v":0}]
["MEDU 349062/4","2013-12-08","022300340",null,"DROSTDY HOF CABERNET SAUV     ",0,0,0,0,"soldé",null,39.233333333333334,{"$f":"IFERROR(IF(J174=\"soldé\",0,VLOOKUP(SOLDE!C119,#REF!,8,0)),0)","v":0}]
["MEDU 349062/4","2013-12-08","022300341",null,"DROSTDY HOF CHARDONNAY        ",0,0,0,0,"soldé",null,39.233333333333334,{"$f":"IFERROR(IF(J175=\"soldé\",0,VLOOKUP(SOLDE!C120,#REF!,8,0)),0)","v":0}]
["MEDU 349062/4","2013-12-08","022300342",null,"DROSTDY HOF MERLOT            ",0,0,0,0,"soldé",null,39.233333333333334,{"$f":"IFERROR(IF(J176=\"soldé\",0,VLOOKUP(SOLDE!C121,#REF!,8,0)),0)","v":0}]
["MEDU 349062/4","2013-12-08","022300400",null,"FLEUR DU CAP CABERNET SAUV    ",0,0,0,0,"soldé",null,39.233333333333334,{"$f":"IFERROR(IF(J177=\"soldé\",0,VLOOKUP(SOLDE!C122,#REF!,8,0)),0)","v":0}]
["MEDU 349062/4","2013-12-08","022300401",null,"FLEUR DU CAP CHARDONNAY       ",0,0,0,0,"soldé",null,39.233333333333334,{"$f":"IFERROR(IF(J178=\"soldé\",0,VLOOKUP(SOLDE!C123,#REF!,8,0)),0)","v":0}]
["MEDU 349062/4","2013-12-08","022300402",null,"FLEUR DU CAP MERLOT 2008      ",0,0,0,0,"soldé",null,39.233333333333334,{"$f":"IFERROR(IF(J179=\"soldé\",0,VLOOKUP(SOLDE!C124,#REF!,8,0)),0)","v":0}]
["MEDU 349062/4","2013-12-08","022300403",null,"FLEUR DU CAP PINOTAGE         ",0,0,0,0,"soldé",null,39.233333333333334,{"$f":"IFERROR(IF(J180=\"soldé\",0,VLOOKUP(SOLDE!C125,#REF!,8,0)),0)","v":0}]
["MEDU 349062/4","2013-12-08","022300404",null,"FLEUR DU CAP SAUVIGNON BLC    ",0,0,0,0,"soldé",null,39.233333333333334,{"$f":"IFERROR(IF(J181=\"soldé\",0,VLOOKUP(SOLDE!C126,#REF!,8,0)),0)","v":0}]
["MEDU 349062/4","2013-12-08","022300405",null,"FLEUR DU CAP SHIRAZ           ",0,0,0,0,"soldé",null,39.233333333333334,{"$f":"IFERROR(IF(J182=\"soldé\",0,VLOOKUP(SOLDE!C127,#REF!,8,0)),0)","v":0}]
["MEDU 349062/4","2013-12-08","022300502",null,"NEETHLINGSHOF CHARD NO WOOD   ",0,0,0,0,"soldé",null,39.233333333333334,{"$f":"IFERROR(IF(J183=\"soldé\",0,VLOOKUP(SOLDE!C128,#REF!,8,0)),0)","v":0}]
["MEDU 349062/4","2013-12-08","022300503",null,"NEETHLINGSHOF CARACAL         ",0,0,0,0,"soldé",null,39.233333333333334,{"$f":"IFERROR(IF(J184=\"soldé\",0,VLOOKUP(SOLDE!C129,#REF!,8,0)),0)","v":0}]
["MEDU 349062/4","2013-12-08","022300505",null,"NEETHLINGSHOF MALBEC          ",0,0,0,0,"soldé",null,39.233333333333334,{"$f":"IFERROR(IF(J185=\"soldé\",0,VLOOKUP(SOLDE!C130,#REF!,8,0)),0)","v":0}]
["MEDU 349062/4","2013-12-08","022300567",null,"NEETHLINGSHOF GEWURZTRAMIN    ",0,0,0,0,"soldé",null,39.233333333333334,{"$f":"IFERROR(IF(J186=\"soldé\",0,VLOOKUP(SOLDE!C131,#REF!,8,0)),0)","v":0}]
["MEDU 349062/4","2013-12-08","022300568",null,"NEETHLINGSHOF SHIRAZ          ",0,0,0,0,"soldé",null,39.233333333333334,{"$f":"IFERROR(IF(J187=\"soldé\",0,VLOOKUP(SOLDE!C132,#REF!,8,0)),0)","v":0}]
["MEDU 349062/4","2013-12-08","022300600",null,"SAVANNA DRY 33CL.             ",0,0,0,0,"soldé",null,39.233333333333334,{"$f":"IFERROR(IF(J188=\"soldé\",0,VLOOKUP(SOLDE!C133,#REF!,8,0)),0)","v":0}]
["XINU 145940/1","2013-12-11",null,null,"ADVINI- PINOTAGE BY AVENIR ROUGE",0,0,0,0,"soldé",null,39.133333333333333,{"$f":"IFERROR(IF(J189=\"soldé\",0,VLOOKUP(SOLDE!C134,#REF!,8,0)),0)","v":0}]
["XINU 145940/1","2013-12-11",null,null,"MIGUEL TORRES- RED WINE 2012 (SANGRE TORO)",0,0,0,0,"soldé",null,39.133333333333333,{"$f":"IFERROR(IF(J190=\"soldé\",0,VLOOKUP(SOLDE!C135,#REF!,8,0)),0)","v":0}]
["XINU 145940/1","2013-12-11",null,null,"MIGUEL TORRES- RED WINE 2012 (SANGRE TORO)",0,0,0,0,"soldé",null,39.133333333333333,{"$f":"IFERROR(IF(J191=\"soldé\",0,VLOOKUP(SOLDE!C136,#REF!,8,0)),0)","v":0}]
["XINU 145940/1","2013-12-11",null,null,"MIGUEL TORRES- RED WINE 2011 (CORANAS)",0,0,0,0,"soldé",null,39.133333333333333,{"$f":"IFERROR(IF(J192=\"soldé\",0,VLOOKUP(SOLDE!C137,#REF!,8,0)),0)","v":0}]
["XINU 145940/1","2013-12-11",null,null,"VRANKEN POMMERY - VIN PAYS SABLE GOLF LION ",0,0,0,0,"soldé",null,39.133333333333333,{"$f":"IFERROR(IF(J193=\"soldé\",0,VLOOKUP(SOLDE!C138,#REF!,8,0)),0)","v":0}]
["XINU 145940/1","2013-12-11",null,null,"VRANKEN POMMERY - VIN PAYS SABLE CAMARGUE",{"$f":"IFERROR(G194/H194,0)","v":0},0,0,{"$f":"G194","v":0},{"$f":"IF(H194<=0,\"soldé\",H194)","v":"soldé"},null,{"$f":"(TODAY()-B194)/30","v":39.133333333333333},{"$f":"IFERROR(IF(J194=\"soldé\",0,VLOOKUP(SOLDE!C139,#REF!,8,0)),0)","v":0}]
["XINU 145940/1","2013-12-11",null,null,"LACHETEAU- TOURAINE ROUGE",0,0,0,0,"soldé",null,39.133333333333333,{"$f":"IFERROR(IF(J195=\"soldé\",0,VLOOKUP(SOLDE!C140,#REF!,8,0)),0)","v":0}]
["XINU 145940/1","2013-12-11",null,null,"LACHETEAU- ST NICOLAS DE BOURGUEILA ROUGE",0,0,0,0,"soldé",null,39.133333333333333,{"$f":"IFERROR(IF(J196=\"soldé\",0,VLOOKUP(SOLDE!C141,#REF!,8,0)),0)","v":0}]
["XINU 145940/1","2013-12-11",null,null,"LACHETEAU- ART PUBLICITAIRE",0,0,0,0,"soldé",null,39.133333333333333,{"$f":"IFERROR(IF(J197=\"soldé\",0,VLOOKUP(SOLDE!C142,#REF!,8,0)),0)","v":0}]
["XINU 145940/1","2013-12-11",null,null,"LIBELLE",0,null,null,0,"soldé",null,39.133333333333333,{"$f":"IFERROR(IF(J198=\"soldé\",0,VLOOKUP(SOLDE!C143,#REF!,8,0)),0)","v":0}]
["CMAU 125254/7","2014-02-18",null,null,"GRANDS CHAIS DE France - ARMAGNAC AOC PRINCE ARIGNAC XO",0,0,0,0,"soldé",null,36.833333333333336,{"$f":"IFERROR(IF(J199=\"soldé\",0,VLOOKUP(SOLDE!C144,#REF!,8,0)),0)","v":0}]
["CMAU 125254/7","2014-02-18",null,null,"GRANDS CHAIS DE France - ARMAGNAC AOC PRINCE ARIGNAC VS",0,0,0,0,"soldé",null,36.833333333333336,{"$f":"IFERROR(IF(J200=\"soldé\",0,VLOOKUP(SOLDE!C145,#REF!,8,0)),0)","v":0}]
["CMAU 125254/7","2014-02-18",null,null,"GRANDS CHAIS DE France- VIN DU MAROC ROSE DOMAINE TOUTAL",0,0,0,0,"soldé",null,36.833333333333336,{"$f":"IFERROR(IF(J201=\"soldé\",0,VLOOKUP(SOLDE!C146,#REF!,8,0)),0)","v":0}]
["CMAU 125254/7","2014-02-18",null,null,"GRANDS CHAIS DE France - VODKA JELZIN",0,0,0,0,"soldé",null,36.833333333333336,{"$f":"IFERROR(IF(J202=\"soldé\",0,VLOOKUP(SOLDE!C147,#REF!,8,0)),0)","v":0}]
["CMAU 125254/7","2014-02-18",null,null,"GRANDS CHAIS DE France - ARTICLE PUB",0,0,0,0,"soldé",null,36.833333333333336,{"$f":"IFERROR(IF(J203=\"soldé\",0,VLOOKUP(SOLDE!C148,#REF!,8,0)),0)","v":0}]
["CMAU 125254/7","2014-02-18",null,null,"CPESO - VDP CARCASSONNE ROSE / DOMAINE AUZIAS",0,0,0,0,"soldé",null,36.833333333333336,{"$f":"IFERROR(IF(J204=\"soldé\",0,VLOOKUP(SOLDE!C149,#REF!,8,0)),0)","v":0}]
["CMAU 125254/7","2014-02-18",null,null,"CPESO - HAUTE COTES BEAUNES BLANC / DOMAINE BERGER RIVES",0,0,0,0,"soldé",null,36.833333333333336,{"$f":"IFERROR(IF(J205=\"soldé\",0,VLOOKUP(SOLDE!C150,#REF!,8,0)),0)","v":0}]
["CMAU 125254/7","2014-02-18",null,null,"CPESO - COTE DE BLAYE / CH CAZEAUX",0,0,0,0,"soldé",null,36.833333333333336,{"$f":"IFERROR(IF(J206=\"soldé\",0,VLOOKUP(SOLDE!C151,#REF!,8,0)),0)","v":0}]
["CMAU 125254/7","2014-02-18",null,null,"CPESO - BORDEAUX ROUGE / CH PAGUENEAU",0,0,0,0,"soldé",null,36.833333333333336,{"$f":"IFERROR(IF(J207=\"soldé\",0,VLOOKUP(SOLDE!C152,#REF!,8,0)),0)","v":0}]
["CMAU 125254/7","2014-02-18",null,null,"H. CUVELIER & FILS - CHÂTEAU LACROIX SAINT ES 2009",0,0,0,0,"soldé",null,36.833333333333336,{"$f":"IFERROR(IF(J208=\"soldé\",0,VLOOKUP(SOLDE!C153,#REF!,8,0)),0)","v":0}]
["CMAU 125254/7","2014-02-18",null,null,"ADVINI - AFS SPRAKLING ROSE AVENIR",0,0,0,0,"soldé",null,36.833333333333336,{"$f":"IFERROR(IF(J209=\"soldé\",0,VLOOKUP(SOLDE!C154,#REF!,8,0)),0)","v":0}]
["CMAU 125254/7","2014-02-18",null,null,"LOUIS ROEDERER - BRUT PREMIER L. ROEDERER",0,0,0,0,"soldé",null,36.833333333333336,{"$f":"IFERROR(IF(J210=\"soldé\",0,VLOOKUP(SOLDE!C155,#REF!,8,0)),0)","v":0}]
["CMAU 125254/7","2014-02-18",null,null,"LOUIS ROEDERER - BRUT MILLESIME 2007 L. ROEDERER",0,0,0,0,"soldé",null,36.833333333333336,{"$f":"IFERROR(IF(J211=\"soldé\",0,VLOOKUP(SOLDE!C156,#REF!,8,0)),0)","v":0}]
["CMAU 125254/7","2014-02-18",null,null,"TORRES - SAN VALENTIN PARELLADA BLANC",0,0,0,0,"soldé",null,36.833333333333336,{"$f":"IFERROR(IF(J212=\"soldé\",0,VLOOKUP(SOLDE!C157,#REF!,8,0)),0)","v":0}]
["CMAU 125254/7","2014-02-18",null,null,"TORRES - SAN VALENTIN GARNACHA - ROUGE",0,0,0,0,"soldé",null,36.833333333333336,{"$f":"IFERROR(IF(J213=\"soldé\",0,VLOOKUP(SOLDE!C158,#REF!,8,0)),0)","v":0}]
["CMAU 125254/7","2014-02-18",null,null,"TORRES - SANGRE DE TORO - ROUGE",0,0,0,0,"soldé",null,36.833333333333336,{"$f":"IFERROR(IF(J214=\"soldé\",0,VLOOKUP(SOLDE!C159,#REF!,8,0)),0)","v":0}]
["CMAU 125254/7","2014-02-18",null,null,"BOULARD BAUQUAIRE - CHAMPAGNE BRUT TRADITION",0,0,0,0,"soldé",null,36.833333333333336,{"$f":"IFERROR(IF(J215=\"soldé\",0,VLOOKUP(SOLDE!C160,#REF!,8,0)),0)","v":0}]
["CMAU 125254/7","2014-02-18",null,null,"BOULARD BAUQUAIRE - CHAMPAGNE GRANDE RESERVE",0,0,0,0,"soldé",null,36.833333333333336,{"$f":"IFERROR(IF(J216=\"soldé\",0,VLOOKUP(SOLDE!C161,#REF!,8,0)),0)","v":0}]
["CMAU 125254/7","2014-02-18",null,null,"SIMONNET FEBVRE - SAINT BRIS",0,0,0,0,"soldé",null,36.833333333333336,{"$f":"IFERROR(IF(J217=\"soldé\",0,VLOOKUP(SOLDE!C162,#REF!,8,0)),0)","v":0}]
["CMAU 125254/7","2014-02-18",null,null,"SIMONNET FEBVRE - BG ALIGOTE BLANC",0,0,0,0,"soldé",null,36.833333333333336,{"$f":"IFERROR(IF(J218=\"soldé\",0,VLOOKUP(SOLDE!C163,#REF!,8,0)),0)","v":0}]
["CMAU 125254/7","2014-02-18",null,null,"LOUIS LATOUR - POMMARD",0,0,0,0,"soldé",null,36.833333333333336,{"$f":"IFERROR(IF(J219=\"soldé\",0,VLOOKUP(SOLDE!C164,#REF!,8,0)),0)","v":0}]
["CMAU 125254/7","2014-02-18",null,null,"CHAMPAGNE JANISSON & FILS - CARTE BLANCHE 75 CL",0,0,0,0,"soldé",null,36.833333333333336,{"$f":"IFERROR(IF(J220=\"soldé\",0,VLOOKUP(SOLDE!C165,#REF!,8,0)),0)","v":0}]
["CMAU 125254/7","2014-02-18",null,null,"SA CORDIER MESTREZAT GRANDS CRUS - 1ERES COTE DE BLAYE ROUGE",0,0,0,0,"soldé",null,36.833333333333336,{"$f":"IFERROR(IF(J221=\"soldé\",0,VLOOKUP(SOLDE!C166,#REF!,8,0)),0)","v":0}]
["CMAU 125254/7","2014-02-18",null,null,"SA CORDIER MESTREZAT GRANDS CRUS - BLAYE COTE BORDEAUX ROUGE",0,0,0,0,"soldé",null,36.833333333333336,{"$f":"IFERROR(IF(J222=\"soldé\",0,VLOOKUP(SOLDE!C167,#REF!,8,0)),0)","v":0}]
["CMAU 125254/7","2014-02-18",null,null,"SA CORDIER MESTREZAT GRANDS CRUS - COTES DE BOURG ROUGE",0,0,0,0,"soldé",null,36.833333333333336,{"$f":"IFERROR(IF(J223=\"soldé\",0,VLOOKUP(SOLDE!C168,#REF!,8,0)),0)","v":0}]
["CMAU 125254/7","2014-02-18",null,null,"SA CORDIER MESTREZAT GRANDS CRUS - ART PUB",0,0,0,0,"soldé",null,36.833333333333336,{"$f":"IFERROR(IF(J224=\"soldé\",0,VLOOKUP(SOLDE!C169,#REF!,8,0)),0)","v":0}]
["CMAU 125254/7","2014-02-18",null,null,"PERNOD RICARD KENYA - CLAN CAMPBELL 40% 12X70CL",0,0,0,0,"soldé",null,36.833333333333336,{"$f":"IFERROR(IF(J225=\"soldé\",0,VLOOKUP(SOLDE!C170,#REF!,8,0)),0)","v":0}]
["CMAU 125254/7","2014-02-18",null,null,"PERNOD RICARD KENYA - MALIBU 21% 6X70 CL",0,0,0,0,"soldé",null,36.833333333333336,{"$f":"IFERROR(IF(J226=\"soldé\",0,VLOOKUP(SOLDE!C171,#REF!,8,0)),0)","v":0}]
["CMAU 125254/7","2014-02-18",null,null,"PERNOD RICARD KENYA - ABSOLUT VODKA 40% 12X70 CL",0,0,0,0,"soldé",null,36.833333333333336,{"$f":"IFERROR(IF(J227=\"soldé\",0,VLOOKUP(SOLDE!C172,#REF!,8,0)),0)","v":0}]
["CMAU 125254/7","2014-02-18",null,null,"PERNOD RICARD KENYA - HAVANA CLUB RHUMANEJO 3 YEARS 40% 6X70 CL",0,0,0,0,"soldé",null,36.833333333333336,{"$f":"IFERROR(IF(J228=\"soldé\",0,VLOOKUP(SOLDE!C173,#REF!,8,0)),0)","v":0}]
["CMAU 125254/7","2014-02-18",null,null,"LES MAITRES VIGNERONS DE LA PRESQU'ILE - GOURMANDISE ROUGE",0,0,0,0,"soldé",null,36.833333333333336,{"$f":"IFERROR(IF(J229=\"soldé\",0,VLOOKUP(SOLDE!C174,#REF!,8,0)),0)","v":0}]
["CMAU 125254/7","2014-02-18",null,null,"LES MAITRES VIGNERONS DE LA PRESQU'ILE - GOURMANDISE ROSE",12,-108,-9,-108,"soldé",null,36.833333333333336,{"$f":"IFERROR(IF(J230=\"soldé\",0,VLOOKUP(SOLDE!C175,#REF!,8,0)),0)","v":0}]
["CMAU 125254/7","2014-02-18",null,null,"LES MAITRES VIGNERONS DE LA PRESQU'ILE - GOURMANDISE BLANC",0,0,0,0,"soldé",null,36.833333333333336,{"$f":"IFERROR(IF(J231=\"soldé\",0,VLOOKUP(SOLDE!C176,#REF!,8,0)),0)","v":0}]
["CMAU 125254/7","2014-02-18",null,null,"LES MAITRES VIGNERONS DE LA PRESQU'ILE - SAINT ROCHE ROSE 2012",0,0,0,0,"soldé",null,36.833333333333336,{"$f":"IFERROR(IF(J232=\"soldé\",0,VLOOKUP(SOLDE!C177,#REF!,8,0)),0)","v":0}]
["IPXU 331800/0","2014-04-04",null,null,"GRANDS CHAIS DE France - VIN DE PAYS D'OC / CABERNET SAUVIGNON",0,0,0,0,"soldé",null,35.333333333333336,{"$f":"IFERROR(IF(J233=\"soldé\",0,VLOOKUP(SOLDE!C178,#REF!,8,0)),0)","v":0}]
["IPXU 331800/0","2014-04-04",null,null,"LACHETEAU - MUSCADET SM/ LIE AOC/AOP BLANC - CHT DE GOULAINE PAPILLON",0,0,0,0,"soldé",null,35.333333333333336,{"$f":"IFERROR(IF(J234=\"soldé\",0,VLOOKUP(SOLDE!C179,#REF!,8,0)),0)","v":0}]
["IPXU 331800/0","2014-04-04",null,null,"LACHETEAU - MUSCADET SM/LIE AOC/AOP BLANC DOM DES CANTREAUX /LIE",0,0,0,0,"soldé",null,35.333333333333336,{"$f":"IFERROR(IF(J235=\"soldé\",0,VLOOKUP(SOLDE!C180,#REF!,8,0)),0)","v":0}]
["IPXU 331800/0","2014-04-04",null,null,"LACHETEAU - POUILLY FUME BLANC",0,0,0,0,"soldé",null,35.333333333333336,{"$f":"IFERROR(IF(J236=\"soldé\",0,VLOOKUP(SOLDE!C181,#REF!,8,0)),0)","v":0}]
["IPXU 331800/0","2014-04-04",null,null,"ADVINI - AFS BY AVENIR ROSE/GRIS",0,0,0,0,"soldé",null,35.333333333333336,{"$f":"IFERROR(IF(J237=\"soldé\",0,VLOOKUP(SOLDE!C182,#REF!,8,0)),0)","v":0}]
["IPXU 331800/0","2014-04-04",null,null,"ADVINI - AFS SPRAKLING ROSE AVENIR",0,0,0,0,"soldé",null,35.333333333333336,{"$f":"IFERROR(IF(J238=\"soldé\",0,VLOOKUP(SOLDE!C183,#REF!,8,0)),0)","v":0}]
["TRHU 225287/0","2014-04-30",null,null,"MAISON HEBRARD - Saint Thibeaud 2010 / AOC Bordeaux rouge",0,0,0,0,"soldé",null,34.466666666666669,{"$f":"IFERROR(IF(J239=\"soldé\",0,VLOOKUP(SOLDE!C184,#REF!,8,0)),0)","v":0}]
["TRHU 225287/0","2014-04-30",null,null,"MAISON HEBRARD - Saint Thibeaud BLANC SEC 2012  / AOC Bordeaux BLANC SEC",0,0,0,0,"soldé",null,34.466666666666669,{"$f":"IFERROR(IF(J240=\"soldé\",0,VLOOKUP(SOLDE!C185,#REF!,8,0)),0)","v":0}]
["TRHU 225287/0","2014-04-30",null,null,"MAISON HEBRARD - Saint Thibeaud Rosé 2012 / AOC Bordeaux Rosé",0,0,0,0,"soldé",null,34.466666666666669,{"$f":"IFERROR(IF(J241=\"soldé\",0,VLOOKUP(SOLDE!C186,#REF!,8,0)),0)","v":0}]
["TRHU 225287/0","2014-04-30","021305106",null,"COMPAGNIE VINICOLE BARON EDMOND DE ROTHSCHILD - Château clarke 2008",12,12,1,12,1,null,34.466666666666669,{"$f":"IFERROR(IF(J242=\"soldé\",0,VLOOKUP(SOLDE!C187,#REF!,8,0)),0)","v":0}]
["TRHU 225287/0","2014-04-30",null,null,"GRANDS CHAIS DE France - VODKA JELZIN",0,0,0,0,"soldé",null,34.466666666666669,{"$f":"IFERROR(IF(J243=\"soldé\",0,VLOOKUP(SOLDE!C188,#REF!,8,0)),0)","v":0}]
["TRHU 225287/0","2014-04-30",null,null,"GRANDS CHAIS DE France - Vin de pays d'oc rouge - chevalier a lichine Merlo crd",0,0,0,0,"soldé",null,34.466666666666669,{"$f":"IFERROR(IF(J244=\"soldé\",0,VLOOKUP(SOLDE!C189,#REF!,8,0)),0)","v":0}]
["TRHU 225287/0","2014-04-30",null,null,"GRANDS CHAIS DE France - Jean Loret Bouche - Cidre Brut blanc ",0,0,0,0,"soldé",null,34.466666666666669,{"$f":"IFERROR(IF(J245=\"soldé\",0,VLOOKUP(SOLDE!C190,#REF!,8,0)),0)","v":0}]
["TRHU 225287/0","2014-04-30",null,null,"GRANDS CHAIS DE France - Armagnac AOC - prince d'arignac XO",0,0,0,0,"soldé",null,34.466666666666669,{"$f":"IFERROR(IF(J246=\"soldé\",0,VLOOKUP(SOLDE!C191,#REF!,8,0)),0)","v":0}]
["TRHU 225287/0","2014-04-30",null,null,"GRANDS CHAIS DE France - puccini sangiovese- chianti docg rouge",0,0,0,0,"soldé",null,34.466666666666669,{"$f":"IFERROR(IF(J247=\"soldé\",0,VLOOKUP(SOLDE!C192,#REF!,8,0)),0)","v":0}]
["TRHU 225287/0","2014-04-30",null,null,"GRANDS CHAIS DE France - Domaine toulal Vin du maroc rose",0,0,0,0,"soldé",null,34.466666666666669,{"$f":"IFERROR(IF(J248=\"soldé\",0,VLOOKUP(SOLDE!C193,#REF!,8,0)),0)","v":0}]
["TRHU 225287/0","2014-04-30",null,null,"GRANDS CHAIS DE France - Domaine toulal Vin du maroc rouge",0,0,0,0,"soldé",null,34.466666666666669,{"$f":"IFERROR(IF(J249=\"soldé\",0,VLOOKUP(SOLDE!C194,#REF!,8,0)),0)","v":0}]
["TRHU 225287/0","2014-04-30",null,null,"SA CORDIER MESTREZAT - La croix bacalan bordeaux rouge",0,0,0,0,"soldé",null,34.466666666666669,{"$f":"IFERROR(IF(J250=\"soldé\",0,VLOOKUP(SOLDE!C195,#REF!,8,0)),0)","v":0}]
["TRHU 225287/0","2014-04-30",null,null,"SA CORDIER MESTREZAT - Château fougere la noble bordeaux rouge",0,0,0,0,"soldé",null,34.466666666666669,{"$f":"IFERROR(IF(J251=\"soldé\",0,VLOOKUP(SOLDE!C196,#REF!,8,0)),0)","v":0}]
["TRHU 225287/0","2014-04-30",null,null,"CELLIER DES DAUPHINS - IGP MEDITERRANEE ROUGE 5l",0,0,0,0,"soldé",null,34.466666666666669,{"$f":"IFERROR(IF(J252=\"soldé\",0,VLOOKUP(SOLDE!C197,#REF!,8,0)),0)","v":0}]
["TRHU 225287/0","2014-04-30",null,null,"CELLIER DES DAUPHINS - IGP MEDITERRANEE BLANC 5l",0,0,0,0,"soldé",null,34.466666666666669,{"$f":"IFERROR(IF(J253=\"soldé\",0,VLOOKUP(SOLDE!C198,#REF!,8,0)),0)","v":0}]
["TRHU 225287/0","2014-04-30",null,null,"CELLIER DES DAUPHINS - IGP MEDITERRANEE ROSE 5l",0,0,0,0,"soldé",null,34.466666666666669,{"$f":"IFERROR(IF(J254=\"soldé\",0,VLOOKUP(SOLDE!C199,#REF!,8,0)),0)","v":0}]
["TRHU 225287/0","2014-04-30",null,null,"PAUL JABOULET AINE - Côtes du Rhônes \"parallèle 45\" Rouge",0,0,0,0,"soldé",null,34.466666666666669,{"$f":"IFERROR(IF(J255=\"soldé\",0,VLOOKUP(SOLDE!C200,#REF!,8,0)),0)","v":0}]
["TRHU 225287/0","2014-04-30",null,null,"BOULARD BAUQUAIRE - Champagne rose",0,0,0,0,"soldé",null,34.466666666666669,{"$f":"IFERROR(IF(J256=\"soldé\",0,VLOOKUP(SOLDE!C201,#REF!,8,0)),0)","v":0}]
["TRHU 225287/0","2014-04-30",null,null,"BOULARD BAUQUAIRE - Champagne grande reserve",0,0,0,0,"soldé",null,34.466666666666669,{"$f":"IFERROR(IF(J257=\"soldé\",0,VLOOKUP(SOLDE!C202,#REF!,8,0)),0)","v":0}]
["TRHU 225287/0","2014-04-30",null,null,"BOULARD BAUQUAIRE - Magnum brut grande reserve",{"$f":"IFERROR(G258/H258,0)","v":0},0,0,{"$f":"G258","v":0},{"$f":"IF(H258<=0,\"soldé\",H258)","v":"soldé"},null,{"$f":"(TODAY()-B258)/30","v":34.466666666666669},{"$f":"IFERROR(IF(J258=\"soldé\",0,VLOOKUP(SOLDE!C203,#REF!,8,0)),0)","v":0}]
["TRHU 225287/0","2014-04-30",null,null,"BOULARD BAUQUAIRE - Champagne brut tradition",0,0,0,0,"soldé",null,34.466666666666669,{"$f":"IFERROR(IF(J259=\"soldé\",0,VLOOKUP(SOLDE!C204,#REF!,8,0)),0)","v":0}]
["TRHU 225287/0","2014-04-30",null,null,"BOULARD BAUQUAIRE - Champagne rose",0,0,0,0,"soldé",null,34.466666666666669,{"$f":"IFERROR(IF(J260=\"soldé\",0,VLOOKUP(SOLDE!C205,#REF!,8,0)),0)","v":0}]
["TRHU 225287/0","2014-04-30",null,null,"BOULARD BAUQUAIRE - brut carte noire",0,0,0,0,"soldé",null,34.466666666666669,{"$f":"IFERROR(IF(J261=\"soldé\",0,VLOOKUP(SOLDE!C206,#REF!,8,0)),0)","v":0}]
["TRHU 225287/0","2014-04-30",null,null,"BOUQUET DE LOIRE - Vin de pays d'oc - Bouquet Merlot",0,0,0,0,"soldé",null,34.466666666666669,{"$f":"IFERROR(IF(J262=\"soldé\",0,VLOOKUP(SOLDE!C207,#REF!,8,0)),0)","v":0}]
["TRHU 225287/0","2014-04-30",null,null,"BOUQUET DE LOIRE - Vin de pays d'oc - Bouquet de Syrah",0,0,0,0,"soldé",null,34.466666666666669,{"$f":"IFERROR(IF(J263=\"soldé\",0,VLOOKUP(SOLDE!C208,#REF!,8,0)),0)","v":0}]
["TRHU 225287/0","2014-04-30",null,null,"BOUQUET DE LOIRE - Cheverny rouge dom. Sauger",0,0,0,0,"soldé",null,34.466666666666669,{"$f":"IFERROR(IF(J264=\"soldé\",0,VLOOKUP(SOLDE!C209,#REF!,8,0)),0)","v":0}]
["TRHU 225287/0","2014-04-30",null,null,"BOUQUET DE LOIRE - Saint Nicolas de Bourgueil Dom Godefroy",0,0,0,0,"soldé",null,34.466666666666669,{"$f":"IFERROR(IF(J265=\"soldé\",0,VLOOKUP(SOLDE!C210,#REF!,8,0)),0)","v":0}]
["TRHU 225287/0","2014-04-30",null,null,"BOUQUET DE LOIRE - Pouilly Fumé Michel Reddel Le petit fumé",0,0,0,0,"soldé",null,34.466666666666669,{"$f":"IFERROR(IF(J266=\"soldé\",0,VLOOKUP(SOLDE!C211,#REF!,8,0)),0)","v":0}]
["TRHU 225287/0","2014-04-30",null,null,"BOUQUET DE LOIRE - Quincy dom Mardon",0,0,0,0,"soldé",null,34.466666666666669,{"$f":"IFERROR(IF(J267=\"soldé\",0,VLOOKUP(SOLDE!C212,#REF!,8,0)),0)","v":0}]
["CMAU 103481/7","2014-04-30",null,null,"PERNOD RICARD - Absolut vodka 40%",0,0,0,0,"soldé",null,34.466666666666669,{"$f":"IFERROR(IF(J268=\"soldé\",0,VLOOKUP(SOLDE!C213,#REF!,8,0)),0)","v":0}]
["CMAU 103481/7","2014-04-30",null,null,"PERNOD RICARD - Ballantine's finest whisky ",0,0,0,0,"soldé",null,34.466666666666669,{"$f":"IFERROR(IF(J269=\"soldé\",0,VLOOKUP(SOLDE!C214,#REF!,8,0)),0)","v":0}]
["CMAU 103481/7","2014-04-30",null,null,"PERNOD RICARD - Beefeater gin",0,0,0,0,"soldé",null,34.466666666666669,{"$f":"IFERROR(IF(J270=\"soldé\",0,VLOOKUP(SOLDE!C215,#REF!,8,0)),0)","v":0}]
["CMAU 103481/7","2014-04-30",null,null,"PERNOD RICARD - Chivas regal whisky 18 yo 40%",0,0,0,0,"soldé",null,34.466666666666669,{"$f":"IFERROR(IF(J271=\"soldé\",0,VLOOKUP(SOLDE!C216,#REF!,8,0)),0)","v":0}]
["CMAU 103481/7","2014-04-30",null,null,"PERNOD RICARD - Chivas regal whisky 12 yo 40%",0,0,0,0,"soldé",null,34.466666666666669,{"$f":"IFERROR(IF(J272=\"soldé\",0,VLOOKUP(SOLDE!C217,#REF!,8,0)),0)","v":0}]
["CMAU 103481/7","2014-04-30",null,null,"PERNOD RICARD - Jameson whisky 40% 70 cl",0,0,0,0,"soldé",null,34.466666666666669,{"$f":"IFERROR(IF(J273=\"soldé\",0,VLOOKUP(SOLDE!C218,#REF!,8,0)),0)","v":0}]
["CMAU 103481/7","2014-04-30",null,null,"PERNOD RICARD - malibu liqueur 21% ",0,0,0,0,"soldé",null,34.466666666666669,{"$f":"IFERROR(IF(J274=\"soldé\",0,VLOOKUP(SOLDE!C219,#REF!,8,0)),0)","v":0}]
["CMAU 103481/7","2014-04-30",null,null,"PERNOD RICARD - Mumm champagne cordon rouge",0,0,0,0,"soldé",null,34.466666666666669,{"$f":"IFERROR(IF(J275=\"soldé\",0,VLOOKUP(SOLDE!C220,#REF!,8,0)),0)","v":0}]
["CMAU 103481/7","2014-04-30",null,null,"PERNOD RICARD - pastis 51 45% - 100 CL",0,0,0,0,"soldé",null,34.466666666666669,{"$f":"IFERROR(IF(J276=\"soldé\",0,VLOOKUP(SOLDE!C221,#REF!,8,0)),0)","v":0}]
["CMAU 103481/7","2014-04-30",null,null,"PERNOD RICARD - Ricard 45%  - 100 CL",0,0,0,0,"soldé",null,34.466666666666669,{"$f":"IFERROR(IF(J277=\"soldé\",0,VLOOKUP(SOLDE!C222,#REF!,8,0)),0)","v":0}]
["CMAU 103481/7","2014-04-30",null,null,"PERNOD RICARD - wyborowa vodka 40%",0,0,0,0,"soldé",null,34.466666666666669,{"$f":"IFERROR(IF(J278=\"soldé\",0,VLOOKUP(SOLDE!C223,#REF!,8,0)),0)","v":0}]
["CMAU 103481/7","2014-04-30",null,null,"LOUIS LATOUR - Bourgogne passe tout grain",0,0,0,0,"soldé",null,34.466666666666669,{"$f":"IFERROR(IF(J279=\"soldé\",0,VLOOKUP(SOLDE!C224,#REF!,8,0)),0)","v":0}]
["CMAU 103481/7","2014-04-30",null,null,"LOUIS LATOUR - pinot noir bourgogne",0,0,0,0,"soldé",null,34.466666666666669,{"$f":"IFERROR(IF(J280=\"soldé\",0,VLOOKUP(SOLDE!C225,#REF!,8,0)),0)","v":0}]
["CMAU 103481/7","2014-04-30",null,null,"LOUIS LATOUR - pommard",0,0,0,0,"soldé",null,34.466666666666669,{"$f":"IFERROR(IF(J281=\"soldé\",0,VLOOKUP(SOLDE!C226,#REF!,8,0)),0)","v":0}]
["CMAU 103481/7","2014-04-30",null,null,"PAUL JABOULET AINE - Côtes du Rhônes \"parallèle 45\" Rouge",0,0,0,0,"soldé",null,34.466666666666669,{"$f":"IFERROR(IF(J282=\"soldé\",0,VLOOKUP(SOLDE!C227,#REF!,8,0)),0)","v":0}]
["CMAU 103481/7","2014-04-30",null,null,"PERNOD RICARD - malibu liqueur 21% ",0,0,0,0,"soldé",null,34.466666666666669,{"$f":"IFERROR(IF(J283=\"soldé\",0,VLOOKUP(SOLDE!C228,#REF!,8,0)),0)","v":0}]
["CMAU 103481/7","2014-04-30",null,null,"PERNOD RICARD - Absolut vodka 40%",0,0,0,0,"soldé",null,34.466666666666669,{"$f":"IFERROR(IF(J284=\"soldé\",0,VLOOKUP(SOLDE!C229,#REF!,8,0)),0)","v":0}]
["CMAU 103481/7","2014-04-30",null,null,"PERNOD RICARD - Mumm champagne cordon rouge",0,0,0,0,"soldé",null,34.466666666666669,{"$f":"IFERROR(IF(J285=\"soldé\",0,VLOOKUP(SOLDE!C230,#REF!,8,0)),0)","v":0}]
["CMAU 103481/7","2014-04-30",null,null,"PERNOD RICARD - wyborowa vodka 40%",0,0,0,0,"soldé",null,34.466666666666669,{"$f":"IFERROR(IF(J286=\"soldé\",0,VLOOKUP(SOLDE!C231,#REF!,8,0)),0)","v":0}]
["CMAU 103481/7","2014-04-30",null,null,"PERNOD RICARD - havana club rhum anejo 3 years old",0,0,0,0,"soldé",null,34.466666666666669,{"$f":"IFERROR(IF(J287=\"soldé\",0,VLOOKUP(SOLDE!C232,#REF!,8,0)),0)","v":0}]
["CMAU 103481/7","2014-04-30",null,null,"BOULARD BAUQUAIRE - Champagne brut tradition - 3700736500016",0,0,0,0,"soldé",null,34.466666666666669,{"$f":"IFERROR(IF(J288=\"soldé\",0,VLOOKUP(SOLDE!C233,#REF!,8,0)),0)","v":0}]
["CMAU 103481/7","2014-04-30",null,null,"BOULARD BAUQUAIRE - Champagne rose - 3700365500047",0,0,0,0,"soldé",null,34.466666666666669,{"$f":"IFERROR(IF(J289=\"soldé\",0,VLOOKUP(SOLDE!C234,#REF!,8,0)),0)","v":0}]
["CMAU 103481/7","2014-04-30",null,null,"BOULARD BAUQUAIRE - champagne grande reserve - 370036500030",0,0,0,0,"soldé",null,34.466666666666669,{"$f":"IFERROR(IF(J290=\"soldé\",0,VLOOKUP(SOLDE!C235,#REF!,8,0)),0)","v":0}]
["CMAU 103481/7","2014-04-30",null,null,"BOULARD BAUQUAIRE - Demies champagne grande reserve-3700736500061",0,0,0,0,"soldé",null,34.466666666666669,{"$f":"IFERROR(IF(J291=\"soldé\",0,VLOOKUP(SOLDE!C236,#REF!,8,0)),0)","v":0}]
["CMAU 103481/7","2014-04-30",null,null,"BOULARD BAUQUAIRE - Champagnes demi sec - 37007365000023",0,0,0,0,"soldé",null,34.466666666666669,{"$f":"IFERROR(IF(J292=\"soldé\",0,VLOOKUP(SOLDE!C237,#REF!,8,0)),0)","v":0}]
["CMAU 103481/7","2014-04-30",null,null,"BOULARD BAUQUAIRE - magnum brut grande reserve - 3700736500076",0,0,0,0,"soldé",null,34.466666666666669,{"$f":"IFERROR(IF(J293=\"soldé\",0,VLOOKUP(SOLDE!C238,#REF!,8,0)),0)","v":0}]
["CMAU 103481/7","2014-04-30",null,null,"BOULARD BAUQUAIRE - bouteilles vieilles vignes trepail",0,0,0,0,"soldé",null,34.466666666666669,{"$f":"IFERROR(IF(J294=\"soldé\",0,VLOOKUP(SOLDE!C239,#REF!,8,0)),0)","v":0}]
["CMAU 103481/7","2014-04-30",null,null,"SA CORDIER MESTREZAT - Château fougere la noble cc",0,0,0,0,"soldé",null,34.466666666666669,{"$f":"IFERROR(IF(J295=\"soldé\",0,VLOOKUP(SOLDE!C240,#REF!,8,0)),0)","v":0}]
["CMAU 103481/7","2014-04-30",null,null,"SA CORDIER MESTREZAT - Château du grand soussans",0,0,0,0,"soldé",null,34.466666666666669,{"$f":"IFERROR(IF(J296=\"soldé\",0,VLOOKUP(SOLDE!C241,#REF!,8,0)),0)","v":0}]
["CMAU 033796/9","2014-05-12",null,null,"SARL CPESO - VDP CARCASSONNE ROSE / DOMAINE AUZIAS",0,0,0,0,"soldé",null,34.06666666666667,{"$f":"IFERROR(IF(J297=\"soldé\",0,VLOOKUP(SOLDE!C242,#REF!,8,0)),0)","v":0}]
["CMAU 033796/9","2014-05-12",null,null,"SARL CPESO - SAINT CHINIAN ROUGE / COL DE L'ORB",0,0,0,0,"soldé",null,34.06666666666667,{"$f":"IFERROR(IF(J298=\"soldé\",0,VLOOKUP(SOLDE!C243,#REF!,8,0)),0)","v":0}]
["CMAU 033796/9","2014-05-12",null,null,"SARL CPESO - BORDEAUX ROUGE / CHÂTEAU LA ROSE TOUR BLANCHE",0,0,0,0,"soldé",null,34.06666666666667,{"$f":"IFERROR(IF(J299=\"soldé\",0,VLOOKUP(SOLDE!C244,#REF!,8,0)),0)","v":0}]
["CMAU 033796/9","2014-05-12",null,null,"SARL CPESO - COTES DE BLAYE / CHÂTEAU CAZEAUX",0,0,0,0,"soldé",null,34.06666666666667,{"$f":"IFERROR(IF(J300=\"soldé\",0,VLOOKUP(SOLDE!C245,#REF!,8,0)),0)","v":0}]
["CMAU 033796/9","2014-05-12",null,null,"SARL CPESO - BORDEAUX ROUGE / CHÂTEAU PAGUENEAU",0,0,0,0,"soldé",null,34.06666666666667,{"$f":"IFERROR(IF(J301=\"soldé\",0,VLOOKUP(SOLDE!C246,#REF!,8,0)),0)","v":0}]
["CMAU 033796/9","2014-05-12",null,null,"UNION DES VIGNERONS DES COTES DU RHONE - COTES DU RHONE CHÂTEAU DE L'ESTAGNOL ROUGE",0,0,0,0,"soldé",null,34.06666666666667,{"$f":"IFERROR(IF(J302=\"soldé\",0,VLOOKUP(SOLDE!C247,#REF!,8,0)),0)","v":0}]
["CMAU 033796/9","2014-05-12",null,null,"UNION DES VIGNERONS DES COTES DU RHONE - IGP MEDITERRANEE BLANC",0,0,0,0,"soldé",null,34.06666666666667,{"$f":"IFERROR(IF(J303=\"soldé\",0,VLOOKUP(SOLDE!C248,#REF!,8,0)),0)","v":0}]
["CMAU 033796/9","2014-05-12",null,null,"UNION DES VIGNERONS DES COTES DU RHONE - IGP MEDITERRANEE ROSE",0,0,0,0,"soldé",null,34.06666666666667,{"$f":"IFERROR(IF(J304=\"soldé\",0,VLOOKUP(SOLDE!C249,#REF!,8,0)),0)","v":0}]
["CMAU 033796/9","2014-05-12",null,null,"BOUQUET DE LOIR - VIN DE PAYS D'OC / BOUQUET MERLOT",0,0,0,0,"soldé",null,34.06666666666667,{"$f":"IFERROR(IF(J305=\"soldé\",0,VLOOKUP(SOLDE!C250,#REF!,8,0)),0)","v":0}]
["CMAU 033796/9","2014-05-12",null,null,"BOUQUET DE LOIR - POUILLY FUME MICHEL REDDE / LE PETIT FUME",0,0,0,0,"soldé",null,34.06666666666667,{"$f":"IFERROR(IF(J306=\"soldé\",0,VLOOKUP(SOLDE!C251,#REF!,8,0)),0)","v":0}]
["CMAU 033796/9","2014-05-12",null,null,"LACHETEAU - SAINT NICOLAS DE BOURGUEILA ROUGE (M MARTIN LES ECHALIERS)",0,0,0,0,"soldé",null,34.06666666666667,{"$f":"IFERROR(IF(J307=\"soldé\",0,VLOOKUP(SOLDE!C252,#REF!,8,0)),0)","v":0}]
["CMAU 033796/9","2014-05-12",null,null,"LACHETEAU - MUSCADET SM/LIE AOC/AOP BLANC (DOM DES CANTREAUX)",0,0,0,0,"soldé",null,34.06666666666667,{"$f":"IFERROR(IF(J308=\"soldé\",0,VLOOKUP(SOLDE!C253,#REF!,8,0)),0)","v":0}]
["CMAU 033796/9","2014-05-12",null,null,"LACHETEAU - MUSCADET SM/LIE AOC/AOP BLANC (CHT DE GOULAINE PAPILLON)",0,0,0,0,"soldé",null,34.06666666666667,{"$f":"IFERROR(IF(J309=\"soldé\",0,VLOOKUP(SOLDE!C254,#REF!,8,0)),0)","v":0}]
["CMAU 033796/9","2014-05-12",null,null,"LACHETEAU - POUILLY FUME BLANC",0,0,0,0,"soldé",null,34.06666666666667,{"$f":"IFERROR(IF(J310=\"soldé\",0,VLOOKUP(SOLDE!C255,#REF!,8,0)),0)","v":0}]
["CMAU 033796/9","2014-05-12",null,null,"HOREAU BEYLOT - CH HAUT CLOQUET POMEROL",0,0,0,0,"soldé",null,34.06666666666667,{"$f":"IFERROR(IF(J311=\"soldé\",0,VLOOKUP(SOLDE!C256,#REF!,8,0)),0)","v":0}]
["CMAU 033796/9","2014-05-12",null,null,"LOUIS ROEDERER - BRUT PREMIER L. ROEDERER - 3114080016053",0,0,0,0,"soldé",null,34.06666666666667,{"$f":"IFERROR(IF(J312=\"soldé\",0,VLOOKUP(SOLDE!C257,#REF!,8,0)),0)","v":0}]
["CMAU 033796/9","2014-05-12",null,null,"LOUIS ROEDERER - BRUT PREMIER L. ROEDERER (ETUI GRAPHIQUE) - 3114080116050",0,0,0,0,"soldé",null,34.06666666666667,{"$f":"IFERROR(IF(J313=\"soldé\",0,VLOOKUP(SOLDE!C258,#REF!,8,0)),0)","v":0}]
["CMAU 033796/9","2014-05-12",null,null,"LOUIS ROEDERER - BRUT MILLESIME 2006 - 3114080025055",0,0,0,0,"soldé",null,34.06666666666667,{"$f":"IFERROR(IF(J314=\"soldé\",0,VLOOKUP(SOLDE!C259,#REF!,8,0)),0)","v":0}]
["CMAU 033796/9","2014-05-12",null,null,"LOUIS ROEDERER - BRUT MILLESIME 2007 - 3114080125052",0,0,0,0,"soldé",null,34.06666666666667,{"$f":"IFERROR(IF(J315=\"soldé\",0,VLOOKUP(SOLDE!C260,#REF!,8,0)),0)","v":0}]
["CMAU 033796/9","2014-05-12",null,null,"LOUIS ROEDERER - CRISTAL BRUT 2006",0,0,0,0,"soldé",null,34.06666666666667,{"$f":"IFERROR(IF(J316=\"soldé\",0,VLOOKUP(SOLDE!C261,#REF!,8,0)),0)","v":0}]
["CMAU 033796/9","2014-05-12",null,null,"LOUIS ROEDERER - CRISTAL BRUT 2006-COFFRET",0,0,0,0,"soldé",null,34.06666666666667,{"$f":"IFERROR(IF(J317=\"soldé\",0,VLOOKUP(SOLDE!C262,#REF!,8,0)),0)","v":0}]
["CMAU 033796/9","2014-05-12",null,null,"LOUIS ROEDERER - CHÂTEAU HAUT-BEAUSEJOUR 2009",0,0,0,0,"soldé",null,34.06666666666667,{"$f":"IFERROR(IF(J318=\"soldé\",0,VLOOKUP(SOLDE!C263,#REF!,8,0)),0)","v":0}]
["CMAU 033796/9","2014-05-12",null,null,"LOUIS ROEDERER - CHÂTEAU HAUT DE PEZ 2008",0,0,0,0,"soldé",null,34.06666666666667,{"$f":"IFERROR(IF(J319=\"soldé\",0,VLOOKUP(SOLDE!C264,#REF!,8,0)),0)","v":0}]
["CMAU 033796/9","2014-05-12",null,null,"MAITRES VIGNERONS DE LA PRESQU'ILE DE SAINT-TROPEZ - GOURMANDISE ROSE",0,0,0,0,"soldé",null,34.06666666666667,{"$f":"IFERROR(IF(J320=\"soldé\",0,VLOOKUP(SOLDE!C265,#REF!,8,0)),0)","v":0}]
["CMAU 033796/9","2014-05-12",null,null,"MAITRES VIGNERONS DE LA PRESQU'ILE DE SAINT-TROPEZ - SAINT ROCH ROSE / 75 CL / flute corset",0,0,0,0,"soldé",null,34.06666666666667,{"$f":"IFERROR(IF(J321=\"soldé\",0,VLOOKUP(SOLDE!C266,#REF!,8,0)),0)","v":0}]
["CMAU 033796/9","2014-05-12",null,null,"MAITRES VIGNERONS DE LA PRESQU'ILE DE SAINT-TROPEZ - SAINT ROCH ROSE / 37,5 CL bordelaise bleu",{"$f":"IFERROR(G322/H322,0)","v":0},0,0,{"$f":"G322","v":0},{"$f":"IF(H322<=0,\"soldé\",H322)","v":"soldé"},null,{"$f":"(TODAY()-B322)/30","v":34.06666666666667},{"$f":"IFERROR(IF(J322=\"soldé\",0,VLOOKUP(SOLDE!C267,#REF!,8,0)),0)","v":0}]
["CMAU 033796/9","2014-05-12",null,null,"MAITRES VIGNERONS DE LA PRESQU'ILE DE SAINT-TROPEZ - SAINT ROCH ROSE / 75 CL sensation",0,0,0,0,"soldé",null,34.06666666666667,{"$f":"IFERROR(IF(J323=\"soldé\",0,VLOOKUP(SOLDE!C268,#REF!,8,0)),0)","v":0}]
["CMAU 033796/9","2014-05-12","021101009",null,"CAMUS - CAMUS COCGNAC VSOP ELEGANCE ETUIS",6,12,2,12,2,null,34.06666666666667,{"$f":"IFERROR(IF(J324=\"soldé\",0,VLOOKUP(SOLDE!C269,#REF!,8,0)),0)","v":0}]
["CMAU 033796/9","2014-05-12",null,null,"CAMUS - CAMUS COCGNAC XO ELEGANCE",0,0,0,0,"soldé",null,34.06666666666667,{"$f":"IFERROR(IF(J325=\"soldé\",0,VLOOKUP(SOLDE!C270,#REF!,8,0)),0)","v":0}]
["CMAU 033796/9","2014-05-12",null,null,"GRANDS CHAIS DE France - WHISKY BOURBON JACK DANIEL'S 70 cl",0,0,0,0,"soldé",null,34.06666666666667,{"$f":"IFERROR(IF(J326=\"soldé\",0,VLOOKUP(SOLDE!C271,#REF!,8,0)),0)","v":0}]
["CMAU 033796/9","2014-05-12"," ",null,"GRANDS CHAIS DE France - VODKA JELZIN 1L",0,0,0,0,"soldé",null,34.06666666666667,{"$f":"IFERROR(IF(J327=\"soldé\",0,VLOOKUP(SOLDE!C272,#REF!,8,0)),0)","v":0}]
["CMAU 033796/9","2014-05-12",null,null,"GRANDS CHAIS DE France - VIN DU MAROC ROSE / DOMAINE TOULAL GUERROUANE",0,0,0,0,"soldé",null,34.06666666666667,{"$f":"IFERROR(IF(J328=\"soldé\",0,VLOOKUP(SOLDE!C273,#REF!,8,0)),0)","v":0}]
["CMAU 033796/9","2014-05-12",null,null,"GRANDS CHAIS DE France - VIN DU MAROC ROUGE  / DOMAINE TOULAL GUERROUANE",0,0,0,0,"soldé",null,34.06666666666667,{"$f":"IFERROR(IF(J329=\"soldé\",0,VLOOKUP(SOLDE!C274,#REF!,8,0)),0)","v":0}]
["CMAU 023604/8","2014-06-02","022000000",null,"MIGUEL TORRES - TORRES SANGRE DE TORO - VINO TINTO",12,96,8,96,8,null,33.366666666666667,{"$f":"IFERROR(IF(J330=\"soldé\",0,VLOOKUP(SOLDE!C275,#REF!,8,0)),0)","v":0}]
["CMAU 023604/8","2014-06-02","022000002",null,"MIGUEL TORRES - TORRES CORONAS - VINO TINTO",12,72,6,72,6,null,33.366666666666667,{"$f":"IFERROR(IF(J331=\"soldé\",0,VLOOKUP(SOLDE!C276,#REF!,8,0)),0)","v":0}]
["CMAU 023604/8","2014-06-02",null,null,"MIGUEL TORRES - SAN VALENTIN PARELLADA - VINO BLANCO",0,0,0,0,"soldé",null,33.366666666666667,{"$f":"IFERROR(IF(J332=\"soldé\",0,VLOOKUP(SOLDE!C277,#REF!,8,0)),0)","v":0}]
["CMAU 023604/8","2014-06-02","022000001",null,"MIGUEL TORRES - SANGRE DE TORO - VINO TINTO 1/2  37,5 cl",24,48,2,48,2,null,33.366666666666667,{"$f":"IFERROR(IF(J333=\"soldé\",0,VLOOKUP(SOLDE!C278,#REF!,8,0)),0)","v":0}]
["CMAU 023604/8","2014-06-02","022000002",null,"MIGUEL TORRES - TORRES CORONAS - VINO TINTO",12,120,10,120,10,null,33.366666666666667,{"$f":"IFERROR(IF(J334=\"soldé\",0,VLOOKUP(SOLDE!C279,#REF!,8,0)),0)","v":0}]
["CMAU 023604/8","2014-06-02",null,null,"H CUVELIER - CHÂTEAU LA CROIX SAINT ESTEPHE - ROUGE",0,0,0,0,"soldé",null,33.366666666666667,{"$f":"IFERROR(IF(J335=\"soldé\",0,VLOOKUP(SOLDE!C280,#REF!,8,0)),0)","v":0}]
["CMAU 023604/8","2014-06-02",null,null,"H CUVELIER - PETIT CORBIN DESPAGNE ST EMILION - ROUGE",0,0,0,0,"soldé",null,33.366666666666667,{"$f":"IFERROR(IF(J336=\"soldé\",0,VLOOKUP(SOLDE!C281,#REF!,8,0)),0)","v":0}]
["CMAU 023604/8","2014-06-02",null,null,"H CUVELIER - CHÂTEAU HAUTES GRAVES POMEROL - ",0,0,0,0,"soldé",null,33.366666666666667,{"$f":"IFERROR(IF(J337=\"soldé\",0,VLOOKUP(SOLDE!C282,#REF!,8,0)),0)","v":0}]
["CMAU 023604/8","2014-06-02",null,null,"LES MAITRES VIGNERONS - GOURMANDISE - ROUGE",0,0,0,0,"soldé",null,33.366666666666667,{"$f":"IFERROR(IF(J338=\"soldé\",0,VLOOKUP(SOLDE!C283,#REF!,8,0)),0)","v":0}]
["CMAU 023604/8","2014-06-02",null,null,"LES MAITRES VIGNERONS - GOURMANDISE - ROSE",0,0,0,0,"soldé",null,33.366666666666667,{"$f":"IFERROR(IF(J339=\"soldé\",0,VLOOKUP(SOLDE!C284,#REF!,8,0)),0)","v":0}]
["CMAU 023604/8","2014-06-02",null,null,"LES MAITRES VIGNERONS - SAINT ROCH / SENSATION - ROSE",0,0,0,0,"soldé",null,33.366666666666667,{"$f":"IFERROR(IF(J340=\"soldé\",0,VLOOKUP(SOLDE!C285,#REF!,8,0)),0)","v":0}]
["CMAU 023604/8","2014-06-02",null,null,"LES MAITRES VIGNERONS - SAINT ROCH / FLUTE A CORSET- ROSE",0,0,0,0,"soldé",null,33.366666666666667,{"$f":"IFERROR(IF(J341=\"soldé\",0,VLOOKUP(SOLDE!C286,#REF!,8,0)),0)","v":0}]
["CMAU 023604/8","2014-06-02","021310201",null,"LES DOMAINES AURIOL - DNE MIRABAU - ROUGE",6,120,20,120,20,null,33.366666666666667,{"$f":"IFERROR(IF(J342=\"soldé\",0,VLOOKUP(SOLDE!C287,#REF!,8,0)),0)","v":0}]
["CMAU 023604/8","2014-06-02",null,null,"SARL CPESO - CHÂTEAU PAGUENEAU - BORDEAUX ROUGE",0,0,0,0,"soldé",null,33.366666666666667,{"$f":"IFERROR(IF(J343=\"soldé\",0,VLOOKUP(SOLDE!C288,#REF!,8,0)),0)","v":0}]
["CMAU 023604/8","2014-06-02",null,null,"SARL CPESO - MAISON JEAN BAPTISTE BEJOT - PETIT CHABLIS BLANC",0,0,0,0,"soldé",null,33.366666666666667,{"$f":"IFERROR(IF(J344=\"soldé\",0,VLOOKUP(SOLDE!C289,#REF!,8,0)),0)","v":0}]
["CMAU 023604/8","2014-06-02",null,null,"SARL CPESO - CHÂTEAU LA ROSE TOUR BLANCHE - BORDEAUX ROUGE",0,0,0,0,"soldé",null,33.366666666666667,{"$f":"IFERROR(IF(J345=\"soldé\",0,VLOOKUP(SOLDE!C290,#REF!,8,0)),0)","v":0}]
["CMAU 023604/8","2014-06-02",null,null,"PERNOD RICARD - BALLANTINE'S FINEST WHISKY ",0,0,0,0,"soldé",null,33.366666666666667,{"$f":"IFERROR(IF(J346=\"soldé\",0,VLOOKUP(SOLDE!C291,#REF!,8,0)),0)","v":0}]
["CMAU 023604/8","2014-06-02",null,null,"PERNOD RICARD - ABSOLUT VODKA 40% - 70 CL",0,0,0,0,"soldé",null,33.366666666666667,{"$f":"IFERROR(IF(J347=\"soldé\",0,VLOOKUP(SOLDE!C292,#REF!,8,0)),0)","v":0}]
["CMAU 023604/8","2014-06-02",null,null,"PERNOD RICARD - JAMESON WHISKY 40% - 70cl",0,0,0,0,"soldé",null,33.366666666666667,{"$f":"IFERROR(IF(J348=\"soldé\",0,VLOOKUP(SOLDE!C293,#REF!,8,0)),0)","v":0}]
["CMAU 023604/8","2014-06-02",null,null,"PERNOD RICARD - WYBOROWA VODKA 40%",0,0,0,0,"soldé",null,33.366666666666667,{"$f":"IFERROR(IF(J349=\"soldé\",0,VLOOKUP(SOLDE!C294,#REF!,8,0)),0)","v":0}]
["CMAU 023604/8","2014-06-02",null,null,"PERNOD RICARD - CLAN CAMPBELL 40%",0,0,0,0,"soldé",null,33.366666666666667,{"$f":"IFERROR(IF(J350=\"soldé\",0,VLOOKUP(SOLDE!C295,#REF!,8,0)),0)","v":0}]
["CMAU 023604/8","2014-06-02",null,null,"PERNOD RICARD - ABSOLUT VODKA 40% - 100 CL",0,0,0,0,"soldé",null,33.366666666666667,{"$f":"IFERROR(IF(J351=\"soldé\",0,VLOOKUP(SOLDE!C296,#REF!,8,0)),0)","v":0}]
["CMAU 023604/8","2014-06-02","021900516",null,"PERNOD RICARD - ABSOLUT VODKA 40% - 70 CL",12,120,10,120,10,null,33.366666666666667,{"$f":"IFERROR(IF(J352=\"soldé\",0,VLOOKUP(SOLDE!C297,#REF!,8,0)),0)","v":0}]
["CMAU 023604/8","2014-06-02",null,null,"SIMONNET FEBVRE - SAINT BRIS ",0,0,0,0,"soldé",null,33.366666666666667,{"$f":"IFERROR(IF(J353=\"soldé\",0,VLOOKUP(SOLDE!C298,#REF!,8,0)),0)","v":0}]
["CMAU 023604/8","2014-06-02",null,null,"SIMONNET FEBVRE - BOURGONE ALIGOTE",0,0,0,0,"soldé",null,33.366666666666667,{"$f":"IFERROR(IF(J354=\"soldé\",0,VLOOKUP(SOLDE!C299,#REF!,8,0)),0)","v":0}]
["CMAU 023604/8","2014-06-02",null,null,"CHAMPAGNE BOLLINGER - SPECIAL CUVEE BRUT",0,0,0,0,"soldé",null,33.366666666666667,{"$f":"IFERROR(IF(J355=\"soldé\",0,VLOOKUP(SOLDE!C300,#REF!,8,0)),0)","v":0}]
["CMAU 023604/8","2014-06-02",null,null,"LOUIS LATOUR - CHASAGNE MONTRACHET - BLANC",0,0,0,0,"soldé",null,33.366666666666667,{"$f":"IFERROR(IF(J356=\"soldé\",0,VLOOKUP(SOLDE!C301,#REF!,8,0)),0)","v":0}]
["CMAU 023604/8","2014-06-02",null,null,"LOUIS LATOUR - ALOXE CORTON DOMAINE LATOUR",0,0,0,0,"soldé",null,33.366666666666667,{"$f":"IFERROR(IF(J357=\"soldé\",0,VLOOKUP(SOLDE!C302,#REF!,8,0)),0)","v":0}]
["CMAU 023604/8","2014-06-02",null,null,"LOUIS LATOUR - GEVREY - CHAMBERTIN",0,0,0,0,"soldé",null,33.366666666666667,{"$f":"IFERROR(IF(J358=\"soldé\",0,VLOOKUP(SOLDE!C303,#REF!,8,0)),0)","v":0}]
["CMAU 023604/8","2014-06-02",null,null,"LOUIS LATOUR - MEURSAULT - BLANC",0,0,0,0,"soldé",null,33.366666666666667,{"$f":"IFERROR(IF(J359=\"soldé\",0,VLOOKUP(SOLDE!C304,#REF!,8,0)),0)","v":0}]
["CMAU 023604/8","2014-06-02",null,null,"LOUIS LATOUR - MONTAGNY ",0,0,0,0,"soldé",null,33.366666666666667,{"$f":"IFERROR(IF(J360=\"soldé\",0,VLOOKUP(SOLDE!C305,#REF!,8,0)),0)","v":0}]
["CMAU 023604/8","2014-06-02",null,null,"CHAMPAGNE AYALA - BRUT MAJEUR",0,0,0,0,"soldé",null,33.366666666666667,{"$f":"IFERROR(IF(J361=\"soldé\",0,VLOOKUP(SOLDE!C306,#REF!,8,0)),0)","v":0}]
["CMAU 023604/8","2014-06-02",null,null,"CHAMPAGNE AYALA - ROSE MAJEUR",0,0,0,0,"soldé",null,33.366666666666667,{"$f":"IFERROR(IF(J362=\"soldé\",0,VLOOKUP(SOLDE!C307,#REF!,8,0)),0)","v":0}]
["CMAU 023604/8","2014-06-02",null,null,"CIE VIGNICOLE BARON EDMOND DE ROTHSCHILD - CHÂTEAU DES LAURETS",0,0,0,0,"soldé",null,33.366666666666667,{"$f":"IFERROR(IF(J363=\"soldé\",0,VLOOKUP(SOLDE!C308,#REF!,8,0)),0)","v":0}]
["CMAU 023604/8","2014-06-02","021900701",null,"ARMAGNAC CASTAREDE - ARMAGNAC CASTAREDE VSOP ",6,210,35,210,35,null,33.366666666666667,{"$f":"IFERROR(IF(J364=\"soldé\",0,VLOOKUP(SOLDE!C309,#REF!,8,0)),0)","v":0}]
["CMAU 021481/4","2014-06-05",null,null,"HOREAU BEYLOT - CH. MARTINET SAINT EMILLION - 2011",0,0,0,0,"soldé",null,33.266666666666666,{"$f":"IFERROR(IF(J365=\"soldé\",0,VLOOKUP(SOLDE!C310,#REF!,8,0)),0)","v":0}]
["CMAU 021481/4","2014-06-05",null,null,"PLAIMONT PRODUCTEURS - AOC SAINT MONT BLANC  CHEMIN DES PELERINS 2012",0,0,0,0,"soldé",null,33.266666666666666,{"$f":"IFERROR(IF(J366=\"soldé\",0,VLOOKUP(SOLDE!C311,#REF!,8,0)),0)","v":0}]
["CMAU 021481/4","2014-06-05",null,null,"PLAIMONT PRODUCTEURS - AOC SAINT MONT ROSE CHEMINS DES PELERINS",0,0,0,0,"soldé",null,33.266666666666666,{"$f":"IFERROR(IF(J367=\"soldé\",0,VLOOKUP(SOLDE!C312,#REF!,8,0)),0)","v":0}]
["CMAU 021481/4","2014-06-05",null,null,"LES MAITRES VIGNERONS - GOURMANDISE ROUGE ",0,0,0,0,"soldé",null,33.266666666666666,{"$f":"IFERROR(IF(J368=\"soldé\",0,VLOOKUP(SOLDE!C313,#REF!,8,0)),0)","v":0}]
["CMAU 021481/4","2014-06-05",null,null,"LES MAITRES VIGNERONS - GOURMANDISE ROSE ",0,0,0,0,"soldé",null,33.266666666666666,{"$f":"IFERROR(IF(J369=\"soldé\",0,VLOOKUP(SOLDE!C314,#REF!,8,0)),0)","v":0}]
["CMAU 021481/4","2014-06-05","021310252",null,"LES MAITRES VIGNERONS - GOURMANDISE BLANC",0,0,0,0,"soldé",null,33.266666666666666,{"$f":"IFERROR(IF(J370=\"soldé\",0,VLOOKUP(SOLDE!C315,#REF!,8,0)),0)","v":0}]
["CMAU 021481/4","2014-06-05",null,null,"BOUQUET DE LOIRE - BOUQUET DE SYRAH ROSE",0,0,0,0,"soldé",null,33.266666666666666,{"$f":"IFERROR(IF(J371=\"soldé\",0,VLOOKUP(SOLDE!C316,#REF!,8,0)),0)","v":0}]
["CMAU 021481/4","2014-06-05","022800004",null,"BOUQUET DE LOIRE - BOUQUET DE SYRAH VDP",6,114,19,114,19,null,33.266666666666666,{"$f":"IFERROR(IF(J372=\"soldé\",0,VLOOKUP(SOLDE!C317,#REF!,8,0)),0)","v":0}]
["CMAU 021481/4","2014-06-05",null,null,"BOUQUET DE LOIRE - CHEVERNY ROUGE DOMAINE SAUGER",0,0,0,0,"soldé",null,33.266666666666666,{"$f":"IFERROR(IF(J373=\"soldé\",0,VLOOKUP(SOLDE!C318,#REF!,8,0)),0)","v":0}]
["CMAU 021481/4","2014-06-05",null,null,"LES GRANDS CHAIS DE France - WHISKY BOURBON JACK DANIEL'S 1L",0,0,0,0,"soldé",null,33.266666666666666,{"$f":"IFERROR(IF(J374=\"soldé\",0,VLOOKUP(SOLDE!C319,#REF!,8,0)),0)","v":0}]
["CMAU 021481/4","2014-06-05",null,null,"LES GRANDS CHAIS DE France - VODKA JELZIN 1L",0,0,0,0,"soldé",null,33.266666666666666,{"$f":"IFERROR(IF(J375=\"soldé\",0,VLOOKUP(SOLDE!C320,#REF!,8,0)),0)","v":0}]
["CMAU 021481/4","2014-06-05",null,null,"LACHETEAU - TOURAINE ROUGE M MARTIN LE CLOUQUIN NV 75 CL",0,0,0,0,"soldé",null,33.266666666666666,{"$f":"IFERROR(IF(J376=\"soldé\",0,VLOOKUP(SOLDE!C321,#REF!,8,0)),0)","v":0}]
["CMAU 021481/4","2014-06-05",null,null,"LACHETEAU - SAUMUR ROUGE CHT MONTGUERET ",0,0,0,0,"soldé",null,33.266666666666666,{"$f":"IFERROR(IF(J377=\"soldé\",0,VLOOKUP(SOLDE!C322,#REF!,8,0)),0)","v":0}]
["CMAU 021481/4","2014-06-05",null,null,"LACHETEAU - TOURAINE ROUGE M MARTIN LE CLOUQUIN SSG 37,5 CL",0,0,0,0,"soldé",null,33.266666666666666,{"$f":"IFERROR(IF(J378=\"soldé\",0,VLOOKUP(SOLDE!C323,#REF!,8,0)),0)","v":0}]
["CMAU 021481/4","2014-06-05",null,null,"LACHETEAU - SAINT NICOLAS DE BOURGUELLA ROUGE M MARTIN LES ECHALIERS NV",0,0,0,0,"soldé",null,33.266666666666666,{"$f":"IFERROR(IF(J379=\"soldé\",0,VLOOKUP(SOLDE!C324,#REF!,8,0)),0)","v":0}]
["CMAU 021481/4","2014-06-05",null,null,"LACHETEAU - CHINON ROUGE / M ARTIN LES BERNIERES ",0,0,0,0,"soldé",null,33.266666666666666,{"$f":"IFERROR(IF(J380=\"soldé\",0,VLOOKUP(SOLDE!C325,#REF!,8,0)),0)","v":0}]
["CMAU 021481/4","2014-06-05",null,null,"LACHETEAU - POUILLY FUME BLANC / LACHETEAU",0,0,0,0,"soldé",null,33.266666666666666,{"$f":"IFERROR(IF(J381=\"soldé\",0,VLOOKUP(SOLDE!C326,#REF!,8,0)),0)","v":0}]
["CMAU 021481/4","2014-06-05",null,null,"LOUIS ROEDERER CHAMPAGNE - BRUT PREMIER",0,0,0,0,"soldé",null,33.266666666666666,{"$f":"IFERROR(IF(J382=\"soldé\",0,VLOOKUP(SOLDE!C327,#REF!,8,0)),0)","v":0}]
["CMAU 021481/4","2014-06-05","021900541",null,"LOUIS ROEDERER CHAMPAGNE - BRUT PREMIER (ETUI GRAPHIQUE) new labels",6,120,20,120,20,null,33.266666666666666,{"$f":"IFERROR(IF(J383=\"soldé\",0,VLOOKUP(SOLDE!C328,#REF!,8,0)),0)","v":0}]
["CMAU 021481/4","2014-06-05",null,null,"LOUIS ROEDERER CHAMPAGNE - CHÂTEAU HAUT-BEAU SEJOUR",0,0,0,0,"soldé",null,33.266666666666666,{"$f":"IFERROR(IF(J384=\"soldé\",0,VLOOKUP(SOLDE!C329,#REF!,8,0)),0)","v":0}]
["MSCU 394215/8","2014-06-06","021100106",null,"NEDERBURG BARONNE                   ",0,0,0,0,"soldé",null,33.233333333333334,{"$f":"IFERROR(IF(J385=\"soldé\",0,VLOOKUP(SOLDE!C330,#REF!,8,0)),0)","v":0}]
["MSCU 394215/8","2014-06-06","021100107",null,"NEDERBURG EDELROOD 2007             ",{"$f":"IFERROR(G386/H386,0)","v":0},0,0,{"$f":"G386","v":0},{"$f":"IF(H386<=0,\"soldé\",H386)","v":"soldé"},null,{"$f":"(TODAY()-B386)/30","v":33.233333333333334},{"$f":"IFERROR(IF(J386=\"soldé\",0,VLOOKUP(SOLDE!C331,#REF!,8,0)),0)","v":0}]
["MSCU 394215/8","2014-06-06","021100108",null,"NEDERBURG CHARDONNAY 2008           ",0,0,0,0,"soldé",null,33.233333333333334,{"$f":"IFERROR(IF(J387=\"soldé\",0,VLOOKUP(SOLDE!C332,#REF!,8,0)),0)","v":0}]
["MSCU 394215/8","2014-06-06","021100113",{"$f":"+A388","v":"MSCU 394215/8"},"NEDERBURG WINEMASTERS SPECIAL LATE HARVEST      ",0,0,0,0,"soldé",null,33.233333333333334,{"$f":"IFERROR(IF(J388=\"soldé\",0,VLOOKUP(SOLDE!C333,#REF!,8,0)),0)","v":0}]
["MSCU 394215/8","2014-06-06","021100114",null,"NEDERBURG CHARDONNAY                ",0,0,0,0,"soldé",null,33.233333333333334,{"$f":"IFERROR(IF(J389=\"soldé\",0,VLOOKUP(SOLDE!C334,#REF!,8,0)),0)","v":0}]
["MSCU 394215/8","2014-06-06","021100115",null,"NEDERBURG LYRIC               ",0,0,0,0,"soldé",null,33.233333333333334,{"$f":"IFERROR(IF(J390=\"soldé\",0,VLOOKUP(SOLDE!C335,#REF!,8,0)),0)","v":0}]
["MSCU 394215/8","2014-06-06","021100116",null,"NEDERBURG  CABERNET SAUVIGNON 2012 ",0,0,0,0,"soldé",null,33.233333333333334,{"$f":"IFERROR(IF(J391=\"soldé\",0,VLOOKUP(SOLDE!C336,#REF!,8,0)),0)","v":0}]
["MSCU 394215/8","2014-06-06","021100118",null,"NEDERBURG ROSE 2009           ",0,0,0,0,"soldé",null,33.233333333333334,{"$f":"IFERROR(IF(J392=\"soldé\",0,VLOOKUP(SOLDE!C337,#REF!,8,0)),0)","v":0}]
["MSCU 394215/8","2014-06-06","021100119",null,"NEDERBURG WINEMASTERS SHIRAZ 2012              ",0,0,0,0,"soldé",null,33.233333333333334,{"$f":"IFERROR(IF(J393=\"soldé\",0,VLOOKUP(SOLDE!C338,#REF!,8,0)),0)","v":0}]
["MSCU 394215/8","2014-06-06","021100300",null,"NEDERBURG  CUVEE BRUT SPARKLING WINE    ",0,0,0,0,"soldé",null,33.233333333333334,{"$f":"IFERROR(IF(J394=\"soldé\",0,VLOOKUP(SOLDE!C339,#REF!,8,0)),0)","v":0}]
["MSCU 394215/8","2014-06-06","021100301",null,"NEDERBURG WINEMASTERS  SAUVIGNON BLANC       ",0,0,0,0,"soldé",null,33.233333333333334,{"$f":"IFERROR(IF(J395=\"soldé\",0,VLOOKUP(SOLDE!C340,#REF!,8,0)),0)","v":0}]
["MSCU 394215/8","2014-06-06","021100302",null,"NEDERBURG ROSE                ",0,0,0,0,"soldé",null,33.233333333333334,{"$f":"IFERROR(IF(J396=\"soldé\",0,VLOOKUP(SOLDE!C341,#REF!,8,0)),0)","v":0}]
["MSCU 394215/8","2014-06-06","021100340",null,"NED WINEMASTERS EDELROOD 2012",0,0,0,0,"soldé",null,33.233333333333334,{"$f":"IFERROR(IF(J397=\"soldé\",0,VLOOKUP(SOLDE!C342,#REF!,8,0)),0)","v":0}]
["MSCU 394215/8","2014-06-06","021200307",null,"ZONNEBLOEM SHIRAZ 2007        ",0,0,0,0,"soldé",null,33.233333333333334,{"$f":"IFERROR(IF(J398=\"soldé\",0,VLOOKUP(SOLDE!C343,#REF!,8,0)),0)","v":0}]
["MSCU 394215/8","2014-06-06","021200308",null,"ZONNEBLOEM PINOTAGE 2012           ",0,0,0,0,"soldé",null,33.233333333333334,{"$f":"IFERROR(IF(J399=\"soldé\",0,VLOOKUP(SOLDE!C344,#REF!,8,0)),0)","v":0}]
["MSCU 394215/8","2014-06-06","021200309",null,"ZONNEBLOEM CABERNET SAUVIGNON           ",6,330,55,330,55,null,33.233333333333334,{"$f":"IFERROR(IF(J400=\"soldé\",0,VLOOKUP(SOLDE!C345,#REF!,8,0)),0)","v":0}]
["MSCU 394215/8","2014-06-06","021200311",null,"ZONNEBLOEM SAUVIGNON BLANC 2013",0,0,0,0,"soldé",null,33.233333333333334,{"$f":"IFERROR(IF(J401=\"soldé\",0,VLOOKUP(SOLDE!C346,#REF!,8,0)),0)","v":0}]
["MSCU 394215/8","2014-06-06","021200403",null,"ZONNEBLOEM CHARDONNAY         ",0,0,0,0,"soldé",null,33.233333333333334,{"$f":"IFERROR(IF(J402=\"soldé\",0,VLOOKUP(SOLDE!C347,#REF!,8,0)),0)","v":0}]
["MSCU 394215/8","2014-06-06","021200404",null,"ZONNEBLOEM SHIRAZ             ",0,0,0,0,"soldé",null,33.233333333333334,{"$f":"IFERROR(IF(J403=\"soldé\",0,VLOOKUP(SOLDE!C348,#REF!,8,0)),0)","v":0}]
["MSCU 394215/8","2014-06-06","021200508",null,"OBIKWA PINOTAGE SAVIN 2009    ",0,0,0,0,"soldé",null,33.233333333333334,{"$f":"IFERROR(IF(J404=\"soldé\",0,VLOOKUP(SOLDE!C349,#REF!,8,0)),0)","v":0}]
["MSCU 394215/8","2014-06-06","021200509",null,"OBIKWA MERLOT                 ",6,198,33,198,33,null,33.233333333333334,{"$f":"IFERROR(IF(J405=\"soldé\",0,VLOOKUP(SOLDE!C350,#REF!,8,0)),0)","v":0}]
["MSCU 394215/8","2014-06-06","021200511",null,"OBIKWA CHARDONNAY             ",0,0,0,0,"soldé",null,33.233333333333334,{"$f":"IFERROR(IF(J406=\"soldé\",0,VLOOKUP(SOLDE!C351,#REF!,8,0)),0)","v":0}]
["MSCU 394215/8","2014-06-06","021200514",null,"OBIKWA SAUVIGNON BLANC        ",0,0,0,0,"soldé",null,33.233333333333334,{"$f":"IFERROR(IF(J407=\"soldé\",0,VLOOKUP(SOLDE!C352,#REF!,8,0)),0)","v":0}]
["MSCU 394215/8","2014-06-06","021200515",null,"OBIKWA PINOTAGE ROSE          ",0,0,0,0,"soldé",null,33.233333333333334,{"$f":"IFERROR(IF(J408=\"soldé\",0,VLOOKUP(SOLDE!C353,#REF!,8,0)),0)","v":0}]
["MSCU 394215/8","2014-06-06","021200516",null,"OBIKWA CHENIN BLANC           ",0,0,0,0,"soldé",null,33.233333333333334,{"$f":"IFERROR(IF(J409=\"soldé\",0,VLOOKUP(SOLDE!C354,#REF!,8,0)),0)","v":0}]
["MSCU 394215/8","2014-06-06","021200517",null,"OBIKWA CABERNET SAUVIGNON 2013",0,0,0,0,"soldé",null,33.233333333333334,{"$f":"IFERROR(IF(J410=\"soldé\",0,VLOOKUP(SOLDE!C355,#REF!,8,0)),0)","v":0}]
["MSCU 394215/8","2014-06-06","021200518",null,"OBIKWA PINOTAGE 2013               ",6,30,5,30,5,null,33.233333333333334,{"$f":"IFERROR(IF(J411=\"soldé\",0,VLOOKUP(SOLDE!C356,#REF!,8,0)),0)","v":0}]
["MSCU 394215/8","2014-06-06","021200614",null,"LIBERTAS CAB SAUVIGNON        ",0,0,0,0,"soldé",null,33.233333333333334,{"$f":"IFERROR(IF(J412=\"soldé\",0,VLOOKUP(SOLDE!C357,#REF!,8,0)),0)","v":0}]
["MSCU 394215/8","2014-06-06","021200615",null,"LIBERTAS CHARDONNAY   2013       ",0,0,0,0,"soldé",null,33.233333333333334,{"$f":"IFERROR(IF(J413=\"soldé\",0,VLOOKUP(SOLDE!C358,#REF!,8,0)),0)","v":0}]
["MSCU 394215/8","2014-06-06","021200616",null,"LIBERTAS CHENIN BLANC         ",0,0,0,0,"soldé",null,33.233333333333334,{"$f":"IFERROR(IF(J414=\"soldé\",0,VLOOKUP(SOLDE!C359,#REF!,8,0)),0)","v":0}]
["MSCU 394215/8","2014-06-06","021200617",null,"LIBERTAS MERLOT 2009          ",0,0,0,0,"soldé",null,33.233333333333334,{"$f":"IFERROR(IF(J415=\"soldé\",0,VLOOKUP(SOLDE!C360,#REF!,8,0)),0)","v":0}]
["MSCU 394215/8","2014-06-06","021200618",null,"LIBERTAS PINOTAGE             ",0,0,0,0,"soldé",null,33.233333333333334,{"$f":"IFERROR(IF(J416=\"soldé\",0,VLOOKUP(SOLDE!C361,#REF!,8,0)),0)","v":0}]
["MSCU 394215/8","2014-06-06","021200623",null,"LIBERTAS MERLOT               ",0,0,0,0,"soldé",null,33.233333333333334,{"$f":"IFERROR(IF(J417=\"soldé\",0,VLOOKUP(SOLDE!C362,#REF!,8,0)),0)","v":0}]
["MSCU 394215/8","2014-06-06","021200701",null,"TWO OCEANS SHIRAZ 2013   ",0,0,0,0,"soldé",null,33.233333333333334,{"$f":"IFERROR(IF(J418=\"soldé\",0,VLOOKUP(SOLDE!C363,#REF!,8,0)),0)","v":0}]
["MSCU 394215/8","2014-06-06","021200702",null,"TWO OCEANS SAUVIGNON BLC 2013",0,0,0,0,"soldé",null,33.233333333333334,{"$f":"IFERROR(IF(J419=\"soldé\",0,VLOOKUP(SOLDE!C364,#REF!,8,0)),0)","v":0}]
["MSCU 394215/8","2014-06-06","021200703",null,"TWO OCEANS CAB SAUV/MERLOT 08 ",0,0,0,0,"soldé",null,33.233333333333334,{"$f":"IFERROR(IF(J420=\"soldé\",0,VLOOKUP(SOLDE!C365,#REF!,8,0)),0)","v":0}]
["MSCU 394215/8","2014-06-06","021200713",null,"TWO OCEANS SHIRAZ ROSE 2007   ",0,0,0,0,"soldé",null,33.233333333333334,{"$f":"IFERROR(IF(J421=\"soldé\",0,VLOOKUP(SOLDE!C366,#REF!,8,0)),0)","v":0}]
["MSCU 394215/8","2014-06-06","021200714",null,"TWO OCEANS CAB SAUV/MERLOT 09 ",0,0,0,0,"soldé",null,33.233333333333334,{"$f":"IFERROR(IF(J422=\"soldé\",0,VLOOKUP(SOLDE!C367,#REF!,8,0)),0)","v":0}]
["MSCU 394215/8","2014-06-06","021200715",null,"TWO OCEANS SHIRAZ ROSE        ",0,0,0,0,"soldé",null,33.233333333333334,{"$f":"IFERROR(IF(J423=\"soldé\",0,VLOOKUP(SOLDE!C368,#REF!,8,0)),0)","v":0}]
["MSCU 394215/8","2014-06-06","021200716",null,"TWO OCEANS CHARDONNAY 2009    ",0,0,0,0,"soldé",null,33.233333333333334,{"$f":"IFERROR(IF(J424=\"soldé\",0,VLOOKUP(SOLDE!C369,#REF!,8,0)),0)","v":0}]
["MSCU 394215/8","2014-06-06","021200717",null,"TWO OCEANS FH&FRUITY WHITE    ",0,0,0,0,"soldé",null,33.233333333333334,{"$f":"IFERROR(IF(J425=\"soldé\",0,VLOOKUP(SOLDE!C370,#REF!,8,0)),0)","v":0}]
["MSCU 394215/8","2014-06-06","021200718",null,"TWO OCEANS SOFT&FRUITY RED    ",0,0,0,0,"soldé",null,33.233333333333334,{"$f":"IFERROR(IF(J426=\"soldé\",0,VLOOKUP(SOLDE!C371,#REF!,8,0)),0)","v":0}]
["MSCU 394215/8","2014-06-06","021201000",null,"PLAISIR DE MERLE SHIRAZ 07    ",0,0,0,0,"soldé",null,33.233333333333334,{"$f":"IFERROR(IF(J427=\"soldé\",0,VLOOKUP(SOLDE!C372,#REF!,8,0)),0)","v":0}]
["MSCU 394215/8","2014-06-06","021201001",null,"PLAISIR DE MERLE SAUVIGNON BLANC 2013",0,0,0,0,"soldé",null,33.233333333333334,{"$f":"IFERROR(IF(J428=\"soldé\",0,VLOOKUP(SOLDE!C373,#REF!,8,0)),0)","v":0}]
["MSCU 394215/8","2014-06-06","021201002",null,"PLAISIR DE MERLE CHARDONNAY 2013",0,0,0,0,"soldé",null,33.233333333333334,{"$f":"IFERROR(IF(J429=\"soldé\",0,VLOOKUP(SOLDE!C374,#REF!,8,0)),0)","v":0}]
["MSCU 394215/8","2014-06-06","021201003",null,"PLAISIR DE MERLE CAB SAUV 06  ",0,0,0,0,"soldé",null,33.233333333333334,{"$f":"IFERROR(IF(J430=\"soldé\",0,VLOOKUP(SOLDE!C375,#REF!,8,0)),0)","v":0}]
["MSCU 394215/8","2014-06-06","021201004",null,"PLAISIR DE MERLE SAUV BLC     ",0,0,0,0,"soldé",null,33.233333333333334,{"$f":"IFERROR(IF(J431=\"soldé\",0,VLOOKUP(SOLDE!C376,#REF!,8,0)),0)","v":0}]
["MSCU 394215/8","2014-06-06","022200566",null,"NEETHLINGSHOF THE OWL POST 08 ",0,0,0,0,"soldé",null,33.233333333333334,{"$f":"IFERROR(IF(J432=\"soldé\",0,VLOOKUP(SOLDE!C377,#REF!,8,0)),0)","v":0}]
["MSCU 394215/8","2014-06-06","022300337",null,"DROSTDY HOF CLARET            ",0,0,0,0,"soldé",null,33.233333333333334,{"$f":"IFERROR(IF(J433=\"soldé\",0,VLOOKUP(SOLDE!C378,#REF!,8,0)),0)","v":0}]
["MSCU 394215/8","2014-06-06","022300338",null,"DROSTDY HOF ADELPRACHT        ",0,0,0,0,"soldé",null,33.233333333333334,{"$f":"IFERROR(IF(J434=\"soldé\",0,VLOOKUP(SOLDE!C379,#REF!,8,0)),0)","v":0}]
["MSCU 394215/8","2014-06-06","022300339",null,"DROSTDY HOF NATURAL SWEET ROSE",0,0,0,0,"soldé",null,33.233333333333334,{"$f":"IFERROR(IF(J435=\"soldé\",0,VLOOKUP(SOLDE!C380,#REF!,8,0)),0)","v":0}]
["MSCU 394215/8","2014-06-06","022300340",null,"DROSTDY HOF CABERNET SAUV     ",0,0,0,0,"soldé",null,33.233333333333334,{"$f":"IFERROR(IF(J436=\"soldé\",0,VLOOKUP(SOLDE!C381,#REF!,8,0)),0)","v":0}]
["MSCU 394215/8","2014-06-06","022300341",null,"DROSTDY HOF CHARDONNAY        ",0,0,0,0,"soldé",null,33.233333333333334,{"$f":"IFERROR(IF(J437=\"soldé\",0,VLOOKUP(SOLDE!C382,#REF!,8,0)),0)","v":0}]
["MSCU 394215/8","2014-06-06","022300342",null,"DROSTDY HOF MERLOT            ",0,0,0,0,"soldé",null,33.233333333333334,{"$f":"IFERROR(IF(J438=\"soldé\",0,VLOOKUP(SOLDE!C383,#REF!,8,0)),0)","v":0}]
["MSCU 394215/8","2014-06-06","022300400",null,"FLEUR DU CAP CABERNET SAUVIGNON BLANC    ",0,0,0,0,"soldé",null,33.233333333333334,{"$f":"IFERROR(IF(J439=\"soldé\",0,VLOOKUP(SOLDE!C384,#REF!,8,0)),0)","v":0}]
["MSCU 394215/8","2014-06-06","022300401",null,"FLEUR DU CAP CHARDONNAY        ",0,0,0,0,"soldé",null,33.233333333333334,{"$f":"IFERROR(IF(J440=\"soldé\",0,VLOOKUP(SOLDE!C385,#REF!,8,0)),0)","v":0}]
["MSCU 394215/8","2014-06-06","022300402",null,"FLEUR DU CAP MERLOT 2012",0,0,0,0,"soldé",null,33.233333333333334,{"$f":"IFERROR(IF(J441=\"soldé\",0,VLOOKUP(SOLDE!C386,#REF!,8,0)),0)","v":0}]
["MSCU 394215/8","2014-06-06","022300403",null,"FLEUR DU CAP PINOTAGE 2012       ",0,0,0,0,"soldé",null,33.233333333333334,{"$f":"IFERROR(IF(J442=\"soldé\",0,VLOOKUP(SOLDE!C387,#REF!,8,0)),0)","v":0}]
["MSCU 394215/8","2014-06-06","022300403",null,"FLEUR DU CAP PINOTAGE 2012       ",6,48,8,48,8,null,33.233333333333334,{"$f":"IFERROR(IF(J443=\"soldé\",0,VLOOKUP(SOLDE!C388,#REF!,8,0)),0)","v":0}]
["MSCU 394215/8","2014-06-06","022300404",null,"FLEUR DU CAP SAUVIGNON BLANC    ",6.0000000000000213,1,0.16666666666666607,1,0.16666666666666607,null,33.233333333333334,{"$f":"IFERROR(IF(J444=\"soldé\",0,VLOOKUP(SOLDE!C389,#REF!,8,0)),0)","v":0}]
["MSCU 394215/8","2014-06-06","022300405",null,"FLEUR DU CAP SHIRAZ           ",6,300,50,300,50,null,33.233333333333334,{"$f":"IFERROR(IF(J445=\"soldé\",0,VLOOKUP(SOLDE!C390,#REF!,8,0)),0)","v":0}]
["MSCU 394215/8","2014-06-06","022300502",null,"NEETHLINGSHOF CHARD UNWOODED",0,0,0,0,"soldé",null,33.233333333333334,{"$f":"IFERROR(IF(J446=\"soldé\",0,VLOOKUP(SOLDE!C391,#REF!,8,0)),0)","v":0}]
["MSCU 394215/8","2014-06-06",null,null,"AMARULA CREAM LIQUEUR",0,0,0,0,"soldé",null,33.233333333333334,{"$f":"IFERROR(IF(J447=\"soldé\",0,VLOOKUP(SOLDE!C392,#REF!,8,0)),0)","v":0}]
["MSCU 394215/8","2014-06-06","022300505",null,"NEETHLINGSHOF MALBEC          ",0,0,0,0,"soldé",null,33.233333333333334,{"$f":"IFERROR(IF(J448=\"soldé\",0,VLOOKUP(SOLDE!C393,#REF!,8,0)),0)","v":0}]
["MSCU 394215/8","2014-06-06","022300567",null,"NEETHLINGSHOF GEWURZTRAMIN    ",0,0,0,0,"soldé",null,33.233333333333334,{"$f":"IFERROR(IF(J449=\"soldé\",0,VLOOKUP(SOLDE!C394,#REF!,8,0)),0)","v":0}]
["MSCU 394215/8","2014-06-06","022300568",null,"NEETHLINGSHOF SHIRAZ          ",{"$f":"IFERROR(G450/H450,0)","v":0},0,0,{"$f":"G450","v":0},{"$f":"IF(H450<=0,\"soldé\",H450)","v":"soldé"},null,{"$f":"(TODAY()-B450)/30","v":33.233333333333334},{"$f":"IFERROR(IF(J450=\"soldé\",0,VLOOKUP(SOLDE!C395,#REF!,8,0)),0)","v":0}]
["MSCU 394215/8","2014-06-06","022300600",null,"SAVANNA DRY 33CL.             ",0,0,0,0,"soldé",null,33.233333333333334,{"$f":"IFERROR(IF(J451=\"soldé\",0,VLOOKUP(SOLDE!C396,#REF!,8,0)),0)","v":0}]
["CMAU 026508/8","2014-06-27",null,null,"BOULARD BAUQUAIRE - CHAMPAGNE BRUT TRADITION",0,0,0,0,"soldé",null,32.533333333333331,{"$f":"IFERROR(IF(J452=\"soldé\",0,VLOOKUP(SOLDE!C397,#REF!,8,0)),0)","v":0}]
["CMAU 026508/8","2014-06-27",null,null,"BOULARD BAUQUAIRE - CHAMPAGNE GRANDE RESERVE",0,0,0,0,"soldé",null,32.533333333333331,{"$f":"IFERROR(IF(J453=\"soldé\",0,VLOOKUP(SOLDE!C398,#REF!,8,0)),0)","v":0}]
["CMAU 026508/8","2014-06-27",null,null,"UNION DES VIGNERONS CELLIER DES DAUPHINS- CROZES HERMITAGE LA TOUVIERE ROUGE 75 CL",0,0,0,0,"soldé",null,32.533333333333331,{"$f":"IFERROR(IF(J454=\"soldé\",0,VLOOKUP(SOLDE!C399,#REF!,8,0)),0)","v":0}]
["CMAU 026508/8","2014-06-27",null,null,"UNION DES VIGNERONS CELLIER DES DAUPHINS - IGP MEDITERRANEE BLANC - BIB 5L",0,0,0,0,"soldé",null,32.533333333333331,{"$f":"IFERROR(IF(J455=\"soldé\",0,VLOOKUP(SOLDE!C400,#REF!,8,0)),0)","v":0}]
["CMAU 026508/8","2014-06-27",null,null,"UNION DES VIGNERONS CELLIER DES DAUPHINS - IGP MEDITERRANEE ROSE - BIB 5L",0,0,0,0,"soldé",null,32.533333333333331,{"$f":"IFERROR(IF(J456=\"soldé\",0,VLOOKUP(SOLDE!C401,#REF!,8,0)),0)","v":0}]
["CMAU 026508/8","2014-06-27"," ",null,"UNION DES VIGNERONS CELLIER DES DAUPHINS - IGP MEDITERRANEE ROUGE - BIB 5L",0,0,0,0,"soldé",null,32.533333333333331,{"$f":"IFERROR(IF(J457=\"soldé\",0,VLOOKUP(SOLDE!C402,#REF!,8,0)),0)","v":0}]
["CMAU 026508/8","2014-06-27",null,null,"CHAMPAGNE JANISSON & FILS - CARTE BLANCHE BRUT ",0,0,0,0,"soldé",null,32.533333333333331,{"$f":"IFERROR(IF(J458=\"soldé\",0,VLOOKUP(SOLDE!C403,#REF!,8,0)),0)","v":0}]
["CMAU 026508/8","2014-06-27",null,null,"PERNOD RICARD - CLAN CAMPBELL 40% 70CL",0,0,0,0,"soldé",null,32.533333333333331,{"$f":"IFERROR(IF(J459=\"soldé\",0,VLOOKUP(SOLDE!C404,#REF!,8,0)),0)","v":0}]
["CMAU 026508/8","2014-06-27","021900515",null,"PERNOD RICARD - MALIBU LIQUEUR 21% 70CL",6,444,74,444,74,null,32.533333333333331,{"$f":"IFERROR(IF(J460=\"soldé\",0,VLOOKUP(SOLDE!C405,#REF!,8,0)),0)","v":0}]
["CMAU 026508/8","2014-06-27",null,null,"PERNOD RICARD - ABSOLUT VODKA 40% 70CL",0,0,0,0,"soldé",null,32.533333333333331,{"$f":"IFERROR(IF(J461=\"soldé\",0,VLOOKUP(SOLDE!C406,#REF!,8,0)),0)","v":0}]
["CMAU 026508/8","2014-06-27",null,null,"PERNOD RICARD - WYBOROWA VODKA 40% NEW PACK 70CL",0,0,0,0,"soldé",null,32.533333333333331,{"$f":"IFERROR(IF(J462=\"soldé\",0,VLOOKUP(SOLDE!C407,#REF!,8,0)),0)","v":0}]
["CMAU 026508/8","2014-06-27",null,null,"PERNOD RICARD - CLAN CAMPBELL 40% 100 CL",0,0,0,0,"soldé",null,32.533333333333331,{"$f":"IFERROR(IF(J463=\"soldé\",0,VLOOKUP(SOLDE!C408,#REF!,8,0)),0)","v":0}]
["CMAU 026508/8","2014-06-27",null,null,"PERNOD RICARD - OLMECA TEQUILA BLANCO 38% 70CL",0,0,0,0,"soldé",null,32.533333333333331,{"$f":"IFERROR(IF(J464=\"soldé\",0,VLOOKUP(SOLDE!C409,#REF!,8,0)),0)","v":0}]
["CMAU 026508/8","2014-06-27",null,null,"PERNOD RICARD - OLMECA TEQUILA GOLD 38% 70CL",0,0,0,0,"soldé",null,32.533333333333331,{"$f":"IFERROR(IF(J465=\"soldé\",0,VLOOKUP(SOLDE!C410,#REF!,8,0)),0)","v":0}]
["CMAU 026508/8","2014-06-27",null,null,"PERNOD RICARD - CLAN CAMPBELL 40% 70CL",0,0,0,0,"soldé",null,32.533333333333331,{"$f":"IFERROR(IF(J466=\"soldé\",0,VLOOKUP(SOLDE!C411,#REF!,8,0)),0)","v":0}]
["CMAU 026508/8","2014-06-27",null,null,"GRANDS CHAIS DE France - VDP CHEVALIER A LICHINE MERLO - ROUGE",0,0,0,0,"soldé",null,32.533333333333331,{"$f":"IFERROR(IF(J467=\"soldé\",0,VLOOKUP(SOLDE!C412,#REF!,8,0)),0)","v":0}]
["CMAU 026508/8","2014-06-27",null,null,"GRANDS CHAIS DE France - WHISKY BOURBON JACK DANIEL'S 1L",0,0,0,0,"soldé",null,32.533333333333331,{"$f":"IFERROR(IF(J468=\"soldé\",0,VLOOKUP(SOLDE!C413,#REF!,8,0)),0)","v":0}]
["CMAU 026508/8","2014-06-27",null,null,"GRANDS CHAIS DE France - WHISKY BOURBON JACK DANIEL'S 70CL",0,0,0,0,"soldé",null,32.533333333333331,{"$f":"IFERROR(IF(J469=\"soldé\",0,VLOOKUP(SOLDE!C414,#REF!,8,0)),0)","v":0}]
["CMAU 026508/8","2014-06-27",null,null,"LACHETEAU - TOURAINE MARTIN LE CLOUQUIN ROUGE - 75CL",0,0,0,0,"soldé",null,32.533333333333331,{"$f":"IFERROR(IF(J470=\"soldé\",0,VLOOKUP(SOLDE!C415,#REF!,8,0)),0)","v":0}]
["CMAU 026508/8","2014-06-27",null,null,"LACHETEAU - TOURAINE MARTIN LE CLOUQUIN SSG ROUGE - 37,5 CL",0,0,0,0,"soldé",null,32.533333333333331,{"$f":"IFERROR(IF(J471=\"soldé\",0,VLOOKUP(SOLDE!C416,#REF!,8,0)),0)","v":0}]
["CMAU 026508/8","2014-06-27",null,null,"LACHETEAU - CHINON ROUGE",0,0,0,0,"soldé",null,32.533333333333331,{"$f":"IFERROR(IF(J472=\"soldé\",0,VLOOKUP(SOLDE!C417,#REF!,8,0)),0)","v":0}]
["CMAU 026508/8","2014-06-27",null,null,"LACHETEAU - MUSCADET SM/LIE AOC/AOP - CHT GOULAINE PAPILLON BLANC - 37,5 CL",0,0,0,0,"soldé",null,32.533333333333331,{"$f":"IFERROR(IF(J473=\"soldé\",0,VLOOKUP(SOLDE!C418,#REF!,8,0)),0)","v":0}]
["CMAU 026508/8","2014-06-27",null,null,"LACHETEAU - MUSCADET SM/LIE AOC/AOP - CHT GOULAINE PAPILLON BLANC - 75 CL",0,0,0,0,"soldé",null,32.533333333333331,{"$f":"IFERROR(IF(J474=\"soldé\",0,VLOOKUP(SOLDE!C419,#REF!,8,0)),0)","v":0}]
["FCIU 251815/4","2014-07-08",null,null,"ASTORIA 9.5 BRUT 75 CL",0,0,0,0,"soldé",null,32.166666666666664,{"$f":"IFERROR(IF(J475=\"soldé\",0,VLOOKUP(SOLDE!C420,#REF!,8,0)),0)","v":0}]
["ECMU 199822/5","2014-07-11",null,null,"UNION DES VIGNERONS CELLIER DES DAUPHINS - IGP MEDITERRANEE ROSE - BIB 5L",0,0,0,0,"soldé",null,32.06666666666667,{"$f":"IFERROR(IF(J476=\"soldé\",0,VLOOKUP(SOLDE!C421,#REF!,8,0)),0)","v":0}]
["ECMU 199822/5","2014-07-11",null,null,"UNION DES VIGNERONS CELLIER DES DAUPHINS - IGP MEDITERRANEE ROUGE - BIB 5L",0,0,0,0,"soldé",null,32.06666666666667,{"$f":"IFERROR(IF(J477=\"soldé\",0,VLOOKUP(SOLDE!C422,#REF!,8,0)),0)","v":0}]
["ECMU 199822/5","2014-07-11",null,null,"H CUVELIER ET FILS - SAINT JULIEN ROUGE - PAVILLON DE LEOVILLE POYF 2011",0,0,0,0,"soldé",null,32.06666666666667,{"$f":"IFERROR(IF(J478=\"soldé\",0,VLOOKUP(SOLDE!C423,#REF!,8,0)),0)","v":0}]
["ECMU 199822/5","2014-07-11",null,null,"H CUVELIER ET FILS - SAINT EMILION GRAND CRU ROUGE - PETIT CORBIN DESPAGNE 2008",0,0,0,0,"soldé",null,32.06666666666667,{"$f":"IFERROR(IF(J479=\"soldé\",0,VLOOKUP(SOLDE!C424,#REF!,8,0)),0)","v":0}]
["ECMU 199822/5","2014-07-11",null,null,"LES MAITRES VIGNERONS - GOURMANDISE ROUGE 75 CL",0,0,0,0,"soldé",null,32.06666666666667,{"$f":"IFERROR(IF(J480=\"soldé\",0,VLOOKUP(SOLDE!C425,#REF!,8,0)),0)","v":0}]
["ECMU 199822/5","2014-07-11",null,null,"SARL CPESO - CABARDES ROUGE - DOMAINE AUZIAS CUVEE PETIT M - rouge",0,0,0,0,"soldé",null,32.06666666666667,{"$f":"IFERROR(IF(J481=\"soldé\",0,VLOOKUP(SOLDE!C426,#REF!,8,0)),0)","v":0}]
["ECMU 199822/5","2014-07-11",null,null,"SARL CPESO - SAINT CHINIAN ROUGE - COL DE L'ORB",0,0,0,0,"soldé",null,32.06666666666667,{"$f":"IFERROR(IF(J482=\"soldé\",0,VLOOKUP(SOLDE!C427,#REF!,8,0)),0)","v":0}]
["ECMU 199822/5","2014-07-11",null,null,"SARL CPESO - BORDEAUX ROUGE - CHÂTEAU LA ROSE TOUR BLANC",0,0,0,0,"soldé",null,32.06666666666667,{"$f":"IFERROR(IF(J483=\"soldé\",0,VLOOKUP(SOLDE!C428,#REF!,8,0)),0)","v":0}]
["ECMU 199822/5","2014-07-11",null,null,"SARL CPESO - PETIT CHABLIS BLANC - MAISON JEAN BAPTISTE BEJOT",0,0,0,0,"soldé",null,32.06666666666667,{"$f":"IFERROR(IF(J484=\"soldé\",0,VLOOKUP(SOLDE!C429,#REF!,8,0)),0)","v":0}]
["CAXU 652806/7","2014-07-23",null,null,"BOULARD BAUQUAIRE - CHAMPAGNE BRUT TRADITION / 3700736500016",0,0,0,0,"soldé",null,31.666666666666668,{"$f":"IFERROR(IF(J485=\"soldé\",0,VLOOKUP(SOLDE!C430,#REF!,8,0)),0)","v":0}]
["CAXU 652806/7","2014-07-23",null,null,"BOULARD BAUQUAIRE - CHAMPAGNE DEMI SEX TRADITION / 3700736500023",0,0,0,0,"soldé",null,31.666666666666668,{"$f":"IFERROR(IF(J486=\"soldé\",0,VLOOKUP(SOLDE!C431,#REF!,8,0)),0)","v":0}]
["CLHU 438812/8","2014-08-08",null,null,"COMPAGNIE VINICOLE BARON EDMOND DE ROTHSCHILD - LES GRANGES -DOMAINES / 3309470001171",0,0,0,0,"soldé",null,31.133333333333333,{"$f":"IFERROR(IF(J487=\"soldé\",0,VLOOKUP(SOLDE!C432,#REF!,8,0)),0)","v":0}]
["CLHU 438812/8","2014-08-08",null,null,"CHAMPAGNE BOLLINGER - SPECIAL CUVEE BRUT",0,0,0,0,"soldé",null,31.133333333333333,{"$f":"IFERROR(IF(J488=\"soldé\",0,VLOOKUP(SOLDE!C433,#REF!,8,0)),0)","v":0}]
["CMAU 039866/6","2014-09-04",null,null,"CAMUS - CHABANNEAU COGNAC ***/VS AVEC ETUIS",0,0,0,0,"soldé",null,30.233333333333334,{"$f":"IFERROR(IF(J489=\"soldé\",0,VLOOKUP(SOLDE!C434,#REF!,8,0)),0)","v":0}]
["CMAU 039866/6","2014-09-04","021101009",null,"CAMUS - CAMUS COGNAC VSOP ELEGANCE AVEC ETUIS",6,30,5,30,5,null,30.233333333333334,{"$f":"IFERROR(IF(J490=\"soldé\",0,VLOOKUP(SOLDE!C435,#REF!,8,0)),0)","v":0}]
["CMAU 039866/6","2014-09-04","021101002",null,"CAMUS - CHABANNEAU COCGNAC XO AVEC ETUIS",6,18,3,18,3,null,30.233333333333334,{"$f":"IFERROR(IF(J491=\"soldé\",0,VLOOKUP(SOLDE!C436,#REF!,8,0)),0)","v":0}]
["CMAU 039866/6","2014-09-04",null,null,"CAMUS - BERNEROY CALVADOS FINE",0,0,0,0,"soldé",null,30.233333333333334,{"$f":"IFERROR(IF(J492=\"soldé\",0,VLOOKUP(SOLDE!C437,#REF!,8,0)),0)","v":0}]
["CMAU 039866/6","2014-09-04",null,null,"BOUQUET DE LOIRE - SAUMUR CHAMPIGNY VOLTIGE DES CLOS DOM DES CLOS MAURICE",0,0,0,0,"soldé",null,30.233333333333334,{"$f":"IFERROR(IF(J493=\"soldé\",0,VLOOKUP(SOLDE!C438,#REF!,8,0)),0)","v":0}]
["CMAU 039866/6","2014-09-04",null,null,"BOUQUET DE LOIRE - POUILLY FUME MICHEL REDDE LE PETIT FUME",0,0,0,0,"soldé",null,30.233333333333334,{"$f":"IFERROR(IF(J494=\"soldé\",0,VLOOKUP(SOLDE!C439,#REF!,8,0)),0)","v":0}]
["CMAU 039866/6","2014-09-04",null,null,"LES MAITRES VIGNERONS - GOURMANDISE ROSE ",0,0,0,0,"soldé",null,30.233333333333334,{"$f":"IFERROR(IF(J495=\"soldé\",0,VLOOKUP(SOLDE!C440,#REF!,8,0)),0)","v":0}]
["CMAU 039866/6","2014-09-04",null,null,"BOULARD BAUQUAIRE - DEMIES CHAMPAGNE GRANDE RESERVE - 3700736500061",0,0,0,0,"soldé",null,30.233333333333334,{"$f":"IFERROR(IF(J496=\"soldé\",0,VLOOKUP(SOLDE!C441,#REF!,8,0)),0)","v":0}]
["CMAU 039866/6","2014-09-04",null,null,"BOULARD BAUQUAIRE - CHAMPAGNE DEMI SEC TRADITION - 3700736500023",0,0,0,0,"soldé",null,30.233333333333334,{"$f":"IFERROR(IF(J497=\"soldé\",0,VLOOKUP(SOLDE!C442,#REF!,8,0)),0)","v":0}]
["CMAU 039866/6","2014-09-04",null,null,"BOULARD BAUQUAIRE - MAGNUMS BRUT GRANDE RESERVE - 3700736500078",0,0,0,0,"soldé",null,30.233333333333334,{"$f":"IFERROR(IF(J498=\"soldé\",0,VLOOKUP(SOLDE!C443,#REF!,8,0)),0)","v":0}]
["CMAU 039866/6","2014-09-04",null,null,"BOULARD BAUQUAIRE - CHAMPAGNE BRUT TRADITION - 3700736500016",0,0,0,0,"soldé",null,30.233333333333334,{"$f":"IFERROR(IF(J499=\"soldé\",0,VLOOKUP(SOLDE!C444,#REF!,8,0)),0)","v":0}]
["CMAU 039866/6","2014-09-04",null,null,"BOULARD BAUQUAIRE - BRUT CARTE NOIRE - 3700736500054",0,0,0,0,"soldé",null,30.233333333333334,{"$f":"IFERROR(IF(J500=\"soldé\",0,VLOOKUP(SOLDE!C445,#REF!,8,0)),0)","v":0}]
["CMAU 039866/6","2014-09-04","021300021",null,"AYALA - BRUT MAJEUR",6,54,9,54,9,null,30.233333333333334,{"$f":"IFERROR(IF(J501=\"soldé\",0,VLOOKUP(SOLDE!C446,#REF!,8,0)),0)","v":0}]
["CMAU 039866/6","2014-09-04",null,null,"AYALA - ROSE MAJEUR",0,0,0,0,"soldé",null,30.233333333333334,{"$f":"IFERROR(IF(J502=\"soldé\",0,VLOOKUP(SOLDE!C447,#REF!,8,0)),0)","v":0}]
["CMAU 039866/6","2014-09-04",null,null,"LES MAITRES VIGNERONS - GOURMANDISE ROSE ",0,0,0,0,"soldé",null,30.233333333333334,{"$f":"IFERROR(IF(J503=\"soldé\",0,VLOOKUP(SOLDE!C448,#REF!,8,0)),0)","v":0}]
["CMAU 039866/6","2014-09-04",null,null,"LES MAITRES VIGNERONS - SAINT ROCH ROSE AOC COTES DE PROVENCE / FLUTE",0,0,0,0,"soldé",null,30.233333333333334,{"$f":"IFERROR(IF(J504=\"soldé\",0,VLOOKUP(SOLDE!C449,#REF!,8,0)),0)","v":0}]
["CMAU 039866/6","2014-09-04",null,null,"LES GRANDS CHAIS DE France - VIN DE PAYS ROUGE - CHEVALIER A LICHINE MERLO",0,0,0,0,"soldé",null,30.233333333333334,{"$f":"IFERROR(IF(J505=\"soldé\",0,VLOOKUP(SOLDE!C450,#REF!,8,0)),0)","v":0}]
["CMAU 039866/6","2014-09-04",null,null,"LES GRANDS CHAIS DE France - CIDRE BRUT BLANC JEAN LORET BOUCHE",0,0,0,0,"soldé",null,30.233333333333334,{"$f":"IFERROR(IF(J506=\"soldé\",0,VLOOKUP(SOLDE!C451,#REF!,8,0)),0)","v":0}]
["CMAU 039866/6","2014-09-04",null,null,"LES GRANDS CHAIS DE France - WHISKY BOURBON JACK DANIEL/S - 1L",0,0,0,0,"soldé",null,30.233333333333334,{"$f":"IFERROR(IF(J507=\"soldé\",0,VLOOKUP(SOLDE!C452,#REF!,8,0)),0)","v":0}]
["CMAU 039866/6","2014-09-04","021310119",null,"PLAIMONT PRODUCTEURS - AOC ST MON ROSE 2013 CHEMIN DES PELERINS",6,120,20,120,20,null,30.233333333333334,{"$f":"IFERROR(IF(J508=\"soldé\",0,VLOOKUP(SOLDE!C453,#REF!,8,0)),0)","v":0}]
["CMAU 039866/6","2014-09-04",null,null,"PLAIMONT PRODUCTEURS - AOC ST MON ROUGE 2013 CHEMIN DES PELERINS",0,0,0,0,"soldé",null,30.233333333333334,{"$f":"IFERROR(IF(J509=\"soldé\",0,VLOOKUP(SOLDE!C454,#REF!,8,0)),0)","v":0}]
["CMAU 039866/6","2014-09-04","021101009",null,"CAMUS - COGNAC VSOP ELEGANCE AVEC ETUIS",6,54,9,54,9,null,30.233333333333334,{"$f":"IFERROR(IF(J510=\"soldé\",0,VLOOKUP(SOLDE!C455,#REF!,8,0)),0)","v":0}]
["CMAU 007794/3","2014-09-11",null,null,"CLEVERBEL - RHUM ARRANGE CAFE VANILLE 70CL",0,0,0,0,"soldé",null,30,{"$f":"IFERROR(IF(J511=\"soldé\",0,VLOOKUP(SOLDE!C456,#REF!,8,0)),0)","v":0}]
["CMAU 007794/3","2014-09-11",null,null,"CLEVERBEL - RHUM ARRANGE VANILLE VANGASSAYE 70CL",0,0,0,{"$f":"G512","v":0},"soldé",null,30,{"$f":"IFERROR(IF(J512=\"soldé\",0,VLOOKUP(SOLDE!C457,#REF!,8,0)),0)","v":0}]
["CMAU 007794/3","2014-09-11",null,null,"CLEVERBEL - RHUM ARRANGE CHAMARRES EXOTIQUE 70CL",0,0,0,0,"soldé",null,30,{"$f":"IFERROR(IF(J513=\"soldé\",0,VLOOKUP(SOLDE!C458,#REF!,8,0)),0)","v":0}]
["CMAU 007794/3","2014-09-11",null,null,"BOUQUET DE LOIRE - VIN DE PAYS D'OC - BOUQUET DE MERLOT",0,0,0,0,{"$f":"IF(H514<=0,\"soldé\",H514)","v":"soldé"},null,{"$f":"(TODAY()-B514)/30","v":30},{"$f":"IFERROR(IF(J514=\"soldé\",0,VLOOKUP(SOLDE!C459,#REF!,8,0)),0)","v":0}]
["CMAU 007794/3","2014-09-11","022800004",null,"BOUQUET DE LOIRE - VIN DE PAYS D'OC - BOUQUET DE SYRAH",60,10,0,10,"soldé",null,30,{"$f":"IFERROR(IF(J515=\"soldé\",0,VLOOKUP(SOLDE!C460,#REF!,8,0)),0)","v":0}]
["CMAU 007794/3","2014-09-11",null,null,"PERNOD RICARD - PASTIS 51 1L",0,0,10,0,10,null,30,{"$f":"IFERROR(IF(J516=\"soldé\",0,VLOOKUP(SOLDE!C461,#REF!,8,0)),0)","v":0}]
["CMAU 007794/3","2014-09-11",null,null,"PERNOD RICARD - CLAN CAMPBELL 70CL",0,0,0,0,"soldé",null,30,{"$f":"IFERROR(IF(J517=\"soldé\",0,VLOOKUP(SOLDE!C462,#REF!,8,0)),0)","v":0}]
["CMAU 007794/3","2014-09-11",null,null,"PERNOD RICARD - BALLANTINE'S FINEST WHISKY 70CL",0,0,0,0,"soldé",null,30,{"$f":"IFERROR(IF(J518=\"soldé\",0,VLOOKUP(SOLDE!C463,#REF!,8,0)),0)","v":0}]
["CMAU 007794/3","2014-09-11",null,null,"PERNOD RICARD - LONG JOHN WHISKY 70CL",0,0,0,0,"soldé",null,30,{"$f":"IFERROR(IF(J519=\"soldé\",0,VLOOKUP(SOLDE!C464,#REF!,8,0)),0)","v":0}]
["CMAU 007794/3","2014-09-11",null,null,"PERNOD RICARD - JAMESON WHISKY 70 CL",0,0,0,0,"soldé",null,30,{"$f":"IFERROR(IF(J520=\"soldé\",0,VLOOKUP(SOLDE!C465,#REF!,8,0)),0)","v":0}]
["CMAU 007794/3","2014-09-11","021900525",null,"PERNOD RICARD - MUMM CHAMPAGNE CORDON ROUGE",36,6,0,6,"soldé",null,30,{"$f":"IFERROR(IF(J521=\"soldé\",0,VLOOKUP(SOLDE!C466,#REF!,8,0)),0)","v":0}]
["CMAU 007794/3","2014-09-11",null,null,"PERNOD RICARD - CLAN CAMPBELL 1L",0,0,6,0,6,null,30,{"$f":"IFERROR(IF(J522=\"soldé\",0,VLOOKUP(SOLDE!C467,#REF!,8,0)),0)","v":0}]
["CMAU 007794/3","2014-09-11",null,null,"PERNOD RICARD - ABSOLUT VODKA 1L",0,0,0,0,"soldé",null,30,{"$f":"IFERROR(IF(J523=\"soldé\",0,VLOOKUP(SOLDE!C468,#REF!,8,0)),0)","v":0}]
["CMAU 007794/3","2014-09-11",null,null,"PERNOD RICARD - LONG JOHN WHISKY 70CL",0,0,0,0,"soldé",null,30,{"$f":"IFERROR(IF(J524=\"soldé\",0,VLOOKUP(SOLDE!C469,#REF!,8,0)),0)","v":0}]
["CMAU 007794/3","2014-09-11",null,null,"MAISON HEBRARD - SAINT THIBEAUD MOELLEUX 2011 BLANC",0,0,0,0,"soldé",null,30,{"$f":"IFERROR(IF(J525=\"soldé\",0,VLOOKUP(SOLDE!C470,#REF!,8,0)),0)","v":0}]
["CMAU 007794/3","2014-09-11",null,null,"MAISON HEBRARD - SAINT THIBEAUD 2011 ROUGE",0,0,0,0,"soldé",null,30,{"$f":"IFERROR(IF(J526=\"soldé\",0,VLOOKUP(SOLDE!C471,#REF!,8,0)),0)","v":0}]
["CMAU 007794/3","2014-09-11",null,null,"MAISON HEBRARD - CHÂTEAU SAINT THIBEAUD ROSE 2011",0,0,0,0,"soldé",null,30,{"$f":"IFERROR(IF(J527=\"soldé\",0,VLOOKUP(SOLDE!C472,#REF!,8,0)),0)","v":0}]
["CMAU 007794/3","2014-09-11",null,null,"MAISON HEBRARD - CHÂTEAU PIAUT SIMON 2010 ROUGE",0,0,0,0,"soldé",null,30,{"$f":"IFERROR(IF(J528=\"soldé\",0,VLOOKUP(SOLDE!C473,#REF!,8,0)),0)","v":0}]
["CMAU 007794/3","2014-09-11",null,null,"MAISON HEBRARD - CHÂTEAU SAINT THIBEAUD BLANC 2012",0,0,0,0,"soldé",null,30,{"$f":"IFERROR(IF(J529=\"soldé\",0,VLOOKUP(SOLDE!C474,#REF!,8,0)),0)","v":0}]
["CMAU 007794/3","2014-09-11",null,null,"CORDIER - CHÂTEAU LA CROIX SAINT JACQUES BLAYE ROUGE 2011 ",0,0,0,0,"soldé",null,30,{"$f":"IFERROR(IF(J530=\"soldé\",0,VLOOKUP(SOLDE!C475,#REF!,8,0)),0)","v":0}]
["CMAU 007794/3","2014-09-11",null,null,"CORDIER - CHÂTEAU RIVIERE PELEGRIS SC COTES DE BOURG ROUGE 2012",0,0,0,0,"soldé",null,30,{"$f":"IFERROR(IF(J531=\"soldé\",0,VLOOKUP(SOLDE!C476,#REF!,8,0)),0)","v":0}]
["CMAU 007794/3","2014-09-11","021900524",null,"PERNORD RICARD - WYBOROWA VODKA 70CL",300,25,{"$f":"F532/G532","v":12},25,12,null,30,{"$f":"IFERROR(IF(J532=\"soldé\",0,VLOOKUP(SOLDE!C477,#REF!,8,0)),0)","v":0}]
["CMAU 007794/3","2014-09-11",null,null,"PERNORD RICARD - CLAN CAMPBELL 1L",0,0,25,0,25,null,30,{"$f":"IFERROR(IF(J533=\"soldé\",0,VLOOKUP(SOLDE!C478,#REF!,8,0)),0)","v":0}]
["CMAU 007794/3","2014-09-11",null,null,"SARL CPESO - CHÂTEAU COL DE L'ORB - SAINT CHINIAN ROUGE",0,0,0,0,"soldé",null,30,{"$f":"IFERROR(IF(J534=\"soldé\",0,VLOOKUP(SOLDE!C479,#REF!,8,0)),0)","v":0}]
["CMAU 007794/3","2014-09-11",null,null,"BOULARD BAUQUAIRE - CHAMPAGNE GRANDE RESERVE ",0,0,0,0,"soldé",null,30,{"$f":"IFERROR(IF(J535=\"soldé\",0,VLOOKUP(SOLDE!C480,#REF!,8,0)),0)","v":0}]
["CMAU 007794/3","2014-09-11",null,null,"BOULARD BAUQUAIRE - CHAMPAGNE BRUT CARTE NOIRE",0,0,0,0,"soldé",null,30,{"$f":"IFERROR(IF(J536=\"soldé\",0,VLOOKUP(SOLDE!C481,#REF!,8,0)),0)","v":0}]
["CMAU 007794/3","2014-09-11",null,null,"LOUIS ROEDERER - BRUT PREMIER L. ROEDERER (ETUI GRAOHIQUE)",0,0,0,0,"soldé",null,30,{"$f":"IFERROR(IF(J537=\"soldé\",0,VLOOKUP(SOLDE!C482,#REF!,8,0)),0)","v":0}]
["CMAU 007794/3","2014-09-11",null,null,"LOUIS  ROEDERER - BRUT MILLESIME 2007 L. ROEDERER (ETUI GRAPHIQUE)",0,0,0,0,"soldé",null,30,{"$f":"IFERROR(IF(J538=\"soldé\",0,VLOOKUP(SOLDE!C483,#REF!,8,0)),0)","v":0}]
["CMAU 007794/3","2014-09-11",null,null,"LOUIS  ROEDERER - CHÂTEAU DE PEZ 2008 (CAISSE BOIS)",0,0,0,0,"soldé",null,30,{"$f":"IFERROR(IF(J539=\"soldé\",0,VLOOKUP(SOLDE!C484,#REF!,8,0)),0)","v":0}]
["CMAU 007794/3","2014-09-11",null,null,"MAISON HEBRARD - CHÂTEAU SAINT THIBEAUD MOELLEUX 2011 BLANC",0,0,0,0,"soldé",null,30,{"$f":"IFERROR(IF(J540=\"soldé\",0,VLOOKUP(SOLDE!C485,#REF!,8,0)),0)","v":0}]
["CMAU 007794/3","2014-09-11",null,null,"MAISON HEBRARD - SAINT THIBEAUD 2010 ROUGE",0,0,0,0,"soldé",null,30,{"$f":"IFERROR(IF(J541=\"soldé\",0,VLOOKUP(SOLDE!C486,#REF!,8,0)),0)","v":0}]
["CMAU 007794/3","2014-09-11",null,null,"MAISON HEBRARD - SAINT THIBEAUD BLANC SEC 2013",0,0,0,0,"soldé",null,30,{"$f":"IFERROR(IF(J542=\"soldé\",0,VLOOKUP(SOLDE!C487,#REF!,8,0)),0)","v":0}]
["CMAU 007794/3","2014-09-11",null,null,"MAISON HEBRARD - SAINT THIBEAUD ROSE 2013",0,0,0,0,"soldé",null,30,{"$f":"IFERROR(IF(J543=\"soldé\",0,VLOOKUP(SOLDE!C488,#REF!,8,0)),0)","v":0}]
["CMAU 007794/3","2014-09-11",null,null,"MAISON HEBRARD - CHÂTEAU PIAUT SIMON 2010 ROUGE",0,0,0,0,"soldé",null,30,{"$f":"IFERROR(IF(J544=\"soldé\",0,VLOOKUP(SOLDE!C489,#REF!,8,0)),0)","v":0}]
["CMAU 007794/3","2014-09-11",null,null,"MAISON HEBRARD - SAINT THIBEAUD ROSE 2013",0,0,0,0,"soldé",null,30,{"$f":"IFERROR(IF(J545=\"soldé\",0,VLOOKUP(SOLDE!C490,#REF!,8,0)),0)","v":0}]
["CMAU 007794/3","2014-09-11",null,null,"SARL CIDRES BIGOUD - CIDRE LE BRUN ARTISANAL BRUT",0,0,0,0,"soldé",null,30,{"$f":"IFERROR(IF(J546=\"soldé\",0,VLOOKUP(SOLDE!C491,#REF!,8,0)),0)","v":0}]
["CMAU 007794/3","2014-09-11","021900701",null,"ARMAGNAC CASTAREDE - ARMAGNAC CASTAREDE VSOP 70CL ETUI",120,20,0,20,"soldé",null,30,{"$f":"IFERROR(IF(J547=\"soldé\",0,VLOOKUP(SOLDE!C492,#REF!,8,0)),0)","v":0}]
["CMAU 202097/3","2014-09-16","021310305",null,"SARL CPESO - DOMAINE AUZIAS CUVEE PETIT MONSIEUR - CABARDES ROUGE MEDAILLE DE BRONZE",{"$f":"IFERROR(G548/H548,0)","v":6},90,15,90,15,null,29.833333333333332,{"$f":"IFERROR(IF(J548=\"soldé\",0,VLOOKUP(SOLDE!C493,#REF!,8,0)),0)","v":0}]
["CMAU 202097/3","2014-09-16",null,null,"SARL CPESO - CHATEAUX CAZEAUX - COTES BLAYE 1/2",0,0,0,0,"soldé",null,29.833333333333332,{"$f":"IFERROR(IF(J549=\"soldé\",0,VLOOKUP(SOLDE!C494,#REF!,8,0)),0)","v":0}]
["CMAU 202097/3","2014-09-16",null,null,"UNION DES VIGNERONS - IGP MEDITERRANEE ROUGE",0,0,0,0,"soldé",null,29.833333333333332,{"$f":"IFERROR(IF(J550=\"soldé\",0,VLOOKUP(SOLDE!C495,#REF!,8,0)),0)","v":0}]
["CMAU 202097/3","2014-09-16",null,null,"UNION DES VIGNERONS - IGP MEDITERRANEE ROSE",0,0,0,0,"soldé",null,29.833333333333332,{"$f":"IFERROR(IF(J551=\"soldé\",0,VLOOKUP(SOLDE!C496,#REF!,8,0)),0)","v":0}]
["CMAU 202097/3","2014-09-16","021310014",null,"LES GRANDS CHAIS DE France - ARMAGNAC AOC PRINCE D'ARIGNAC XO",6,48,8,48,8,null,29.833333333333332,{"$f":"IFERROR(IF(J552=\"soldé\",0,VLOOKUP(SOLDE!C497,#REF!,8,0)),0)","v":0}]
["CMAU 202097/3","2014-09-16",null,null,"LES GRANDS CHAIS DE France - ARMAGNAC AOC PRINCE D'ARIGNAC VS + CANISTER (COFFRET)",0,0,0,0,"soldé",null,29.833333333333332,{"$f":"IFERROR(IF(J553=\"soldé\",0,VLOOKUP(SOLDE!C498,#REF!,8,0)),0)","v":0}]
["CMAU 202097/3","2014-09-16",null,null,"LES GRANDS CHAIS DE France- VIN DE MAROC ROSE - DOMAINE TOULAL GUERROUANE",0,0,0,0,"soldé",null,29.833333333333332,{"$f":"IFERROR(IF(J554=\"soldé\",0,VLOOKUP(SOLDE!C499,#REF!,8,0)),0)","v":0}]
["CMAU 202097/3","2014-09-16",null,null,"LES GRANDS CHAIS DE France-  WHISKY BOURBON JACK DANIEL'S 1L",0,0,0,0,"soldé",null,29.833333333333332,{"$f":"IFERROR(IF(J555=\"soldé\",0,VLOOKUP(SOLDE!C500,#REF!,8,0)),0)","v":0}]
["CMAU 202097/3","2014-09-16",null,null,"LES GRANDS CHAIS DE France-  WHISKY BOURBON JACK DANIEL'S 70CL",0,0,0,0,"soldé",null,29.833333333333332,{"$f":"IFERROR(IF(J556=\"soldé\",0,VLOOKUP(SOLDE!C501,#REF!,8,0)),0)","v":0}]
["CMAU 202097/3","2014-09-16",null,null,"LES GRANDS CHAIS DE France-  JELZIN VODKA",0,0,0,0,"soldé",null,29.833333333333332,{"$f":"IFERROR(IF(J557=\"soldé\",0,VLOOKUP(SOLDE!C502,#REF!,8,0)),0)","v":0}]
["CMAU 202097/3","2014-09-16",null,null,"CHAMPAGNE BOLLINGER - SPECIAL CUVEE BRUT",0,0,0,0,"soldé",null,29.833333333333332,{"$f":"IFERROR(IF(J558=\"soldé\",0,VLOOKUP(SOLDE!C503,#REF!,8,0)),0)","v":0}]
["CMAU 202097/3","2014-09-16","022810002",null,"MAISON HEBRARD - SAINT THIBEAUD MOELLEUX BLANC 2013",6,12,2,12,2,null,29.833333333333332,{"$f":"IFERROR(IF(J559=\"soldé\",0,VLOOKUP(SOLDE!C504,#REF!,8,0)),0)","v":0}]
["CMAU 202097/3","2014-09-16",null,null,"MAISON HEBRARD - SAINT THIBEAUD ROSE 2013",0,0,0,0,"soldé",null,29.833333333333332,{"$f":"IFERROR(IF(J560=\"soldé\",0,VLOOKUP(SOLDE!C505,#REF!,8,0)),0)","v":0}]
["CMAU 196568/2","2014-09-03",null,null,"UNIONS DES VIGNERONS / CELLIER DES DAUPHINS - IGP MEDITERRANEE BLANC 5L",0,0,0,0,"soldé",null,30.266666666666666,{"$f":"IFERROR(IF(J561=\"soldé\",0,VLOOKUP(SOLDE!C506,#REF!,8,0)),0)","v":0}]
["CMAU 196568/2","2014-09-03",null,null,"UNIONS DES VIGNERONS / CELLIER DES DAUPHINS - IGP MEDITERRANEE ROSE 5L",0,0,0,0,"soldé",null,30.266666666666666,{"$f":"IFERROR(IF(J562=\"soldé\",0,VLOOKUP(SOLDE!C507,#REF!,8,0)),0)","v":0}]
["CMAU 196568/2","2014-09-03",null,null,"UNIONS DES VIGNERONS / CELLIER DES DAUPHINS - IGP MEDITERRANEE ROUGE 5L",0,0,0,0,"soldé",null,30.266666666666666,{"$f":"IFERROR(IF(J563=\"soldé\",0,VLOOKUP(SOLDE!C508,#REF!,8,0)),0)","v":0}]
["CMAU 196568/2","2014-09-03",null,null,"CODIER - CH. LA CROIX SAINT JACQUES BLAYE - COTES DE BORDEAUX",0,0,0,0,"soldé",null,30.266666666666666,{"$f":"IFERROR(IF(J564=\"soldé\",0,VLOOKUP(SOLDE!C509,#REF!,8,0)),0)","v":0}]
["CMAU 196568/2","2014-09-03",null,null,"CODIER - CH. ANDRON \"FUT\" CC MEDOC",0,0,0,0,"soldé",null,30.266666666666666,{"$f":"IFERROR(IF(J565=\"soldé\",0,VLOOKUP(SOLDE!C510,#REF!,8,0)),0)","v":0}]
["CMAU 196568/2","2014-09-03","021900500",null,"PERNOD RICARD - PASTIS 51 1L",12,240,20,240,20,null,30.266666666666666,{"$f":"IFERROR(IF(J566=\"soldé\",0,VLOOKUP(SOLDE!C511,#REF!,8,0)),0)","v":0}]
["CMAU 196568/2","2014-09-03","021900502",null,"PERNOD RICARD - RICARD 70 CL",6,240,40,240,40,null,30.266666666666666,{"$f":"IFERROR(IF(J567=\"soldé\",0,VLOOKUP(SOLDE!C512,#REF!,8,0)),0)","v":0}]
["CMAU 196568/2","2014-09-03","021900503",null,"PERNOD RICARD - CLAN CAMPBELL 70CL",12,24,2,24,2,null,30.266666666666666,{"$f":"IFERROR(IF(J568=\"soldé\",0,VLOOKUP(SOLDE!C513,#REF!,8,0)),0)","v":0}]
["CMAU 196568/2","2014-09-03",null,null,"PERNOD RICARD - BALLANTINES FINEST WHISKY 70CL",0,0,0,0,"soldé",null,30.266666666666666,{"$f":"IFERROR(IF(J569=\"soldé\",0,VLOOKUP(SOLDE!C514,#REF!,8,0)),0)","v":0}]
["CMAU 196568/2","2014-09-03",null,null,"PERNOD RICARD - CHIVAS REGAL WHISKY 12 YO 70CL",0,0,0,0,"soldé",null,30.266666666666666,{"$f":"IFERROR(IF(J570=\"soldé\",0,VLOOKUP(SOLDE!C515,#REF!,8,0)),0)","v":0}]
["CMAU 196568/2","2014-09-03",null,null,"PERNOD RICARD - CHIVAS REGAL WHISKY 18 YO 70CL",0,0,0,0,"soldé",null,30.266666666666666,{"$f":"IFERROR(IF(J571=\"soldé\",0,VLOOKUP(SOLDE!C516,#REF!,8,0)),0)","v":0}]
["CMAU 196568/2","2014-09-03",null,null,"PERNOD RICARD - LONG JOHN WHISKY 70CL",0,0,0,0,"soldé",null,30.266666666666666,{"$f":"IFERROR(IF(J572=\"soldé\",0,VLOOKUP(SOLDE!C517,#REF!,8,0)),0)","v":0}]
["CMAU 196568/2","2014-09-03",null,null,"PERNOD RICARD - BEEFEATER GIN 70 CL",0,0,0,0,"soldé",null,30.266666666666666,{"$f":"IFERROR(IF(J573=\"soldé\",0,VLOOKUP(SOLDE!C518,#REF!,8,0)),0)","v":0}]
["CMAU 196568/2","2014-09-03",null,null,"PERNOD RICARD - CLAN CAMPBELL 100CL",0,0,0,0,"soldé",null,30.266666666666666,{"$f":"IFERROR(IF(J574=\"soldé\",0,VLOOKUP(SOLDE!C519,#REF!,8,0)),0)","v":0}]
["CMAU 196568/2","2014-09-03",null,null,"PERNOD RICARD - ABSOLUT VODKA 100CL",0,0,0,0,"soldé",null,30.266666666666666,{"$f":"IFERROR(IF(J575=\"soldé\",0,VLOOKUP(SOLDE!C520,#REF!,8,0)),0)","v":0}]
["CMAU 196568/2","2014-09-03","021305011",null,"H. CUVELIER & FILS - PETIT CORBIN DESPAGNE 2008 ST EMILION GRAND CRU AOC ROUGE",12,60,5,{"$f":"G576","v":60},5,null,30.266666666666666,{"$f":"IFERROR(IF(J576=\"soldé\",0,VLOOKUP(SOLDE!C521,#REF!,8,0)),0)","v":0}]
["CMAU 196568/2","2014-09-03",null,null,"LES GRANDS CHAIS DE France - VODKA JELZIN 1L",0,0,0,0,"soldé",null,30.266666666666666,{"$f":"IFERROR(IF(J577=\"soldé\",0,VLOOKUP(SOLDE!C522,#REF!,8,0)),0)","v":0}]
["TEMU 540158/9","2014-10-14",null,null,"LES GRANDS CHAIS DE France - VODKA JELZIN 1L",0,0,0,0,{"$f":"IF(H578<=0,\"soldé\",H578)","v":"soldé"},null,{"$f":"(TODAY()-B578)/30","v":28.9},{"$f":"IFERROR(IF(J578=\"soldé\",0,VLOOKUP(SOLDE!C523,#REF!,8,0)),0)","v":0}]
["TRHU 133969/9","2014-11-05",null,null,"CHAMPAGNE AYALA - BRUT MAJEUR",0,0,0,0,"soldé",null,28.166666666666668,{"$f":"IFERROR(IF(J579=\"soldé\",0,VLOOKUP(SOLDE!C524,#REF!,8,0)),0)","v":0}]
["TRHU 133969/9","2014-11-05","021300022",null,"CHAMPAGNE AYALA - ROSE MAJEUR",6,30,5,30,5,null,28.166666666666668,{"$f":"IFERROR(IF(J580=\"soldé\",0,VLOOKUP(SOLDE!C525,#REF!,8,0)),0)","v":0}]
["TEMU 245269/0","2014-12-09",null,null,"SARL CIDRES BIGOUD - CIDRE LE BRUN ARTISANAL BRUT 75 CL",0,0,0,0,"soldé",null,27.033333333333335,{"$f":"IFERROR(IF(J581=\"soldé\",0,VLOOKUP(SOLDE!C526,#REF!,8,0)),0)","v":0}]
["TEMU 245269/0","2014-12-09",null,null,"CORDIER - CHÂTEAU ANDRON ",0,0,0,0,"soldé",null,27.033333333333335,{"$f":"IFERROR(IF(J582=\"soldé\",0,VLOOKUP(SOLDE!C527,#REF!,8,0)),0)","v":0}]
["TEMU 245269/0","2014-12-09",null,null,"CORDIER - CHÂTEAU MEYNEY ST ESTEPHE",0,0,0,0,"soldé",null,27.033333333333335,{"$f":"IFERROR(IF(J583=\"soldé\",0,VLOOKUP(SOLDE!C528,#REF!,8,0)),0)","v":0}]
["TEMU 245269/0","2014-12-09",null,null,"PERNOD RICARD - RICARD 100 CL",0,0,0,0,"soldé",null,27.033333333333335,{"$f":"IFERROR(IF(J584=\"soldé\",0,VLOOKUP(SOLDE!C529,#REF!,8,0)),0)","v":0}]
["TEMU 245269/0","2014-12-09",null,null,"PERNORD RICARD - BALLANTINES FINEST WHISKY 70 CL NRF ",0,0,0,0,"soldé",null,27.033333333333335,{"$f":"IFERROR(IF(J585=\"soldé\",0,VLOOKUP(SOLDE!C530,#REF!,8,0)),0)","v":0}]
["TEMU 245269/0","2014-12-09",null,null,"PERNORD RICARD - BALLANTINES FINEST WHISKY 70 CL",0,0,0,0,"soldé",null,27.033333333333335,{"$f":"IFERROR(IF(J586=\"soldé\",0,VLOOKUP(SOLDE!C531,#REF!,8,0)),0)","v":0}]
["TEMU 245269/0","2014-12-09",null,null,"PERNORD RICARD - BEEFEATER GIN 70CL",0,0,0,0,"soldé",null,27.033333333333335,{"$f":"IFERROR(IF(J587=\"soldé\",0,VLOOKUP(SOLDE!C532,#REF!,8,0)),0)","v":0}]
["TEMU 245269/0","2014-12-09",null,null,"PERNORD RICARD - JAMESON WHISKY 70CL",0,0,0,0,"soldé",null,27.033333333333335,{"$f":"IFERROR(IF(J588=\"soldé\",0,VLOOKUP(SOLDE!C533,#REF!,8,0)),0)","v":0}]
["TEMU 245269/0","2014-12-09","021900609",null,"PERNORD RICARD - HAVANA CLUB RHUM ANEJO 3 YEARS OLD 70CL",6,60,10,60,10,null,27.033333333333335,{"$f":"IFERROR(IF(J589=\"soldé\",0,VLOOKUP(SOLDE!C534,#REF!,8,0)),0)","v":0}]
["TEMU 245269/0","2014-12-09",null,null,"PERNORD RICARD - CLAN CAMPBELL 100CL",0,0,0,0,"soldé",null,27.033333333333335,{"$f":"IFERROR(IF(J590=\"soldé\",0,VLOOKUP(SOLDE!C535,#REF!,8,0)),0)","v":0}]
["CMAU 217604/0","2015-01-09",null,null,"BOUQUET DE LOIRE - Bouquet de Merlot",0,0,0,0,"soldé",null,26,{"$f":"IFERROR(IF(J591=\"soldé\",0,VLOOKUP(SOLDE!C536,#REF!,8,0)),0)","v":0}]
["CMAU 217604/0","2015-01-09",null,null,"BOUQUET DE LOIRE - Bouquet de Syrah Rosé",0,0,0,0,"soldé",null,26,{"$f":"IFERROR(IF(J592=\"soldé\",0,VLOOKUP(SOLDE!C537,#REF!,8,0)),0)","v":0}]
["CMAU 217604/0","2015-01-09","021900548",null,"CHAMPAGNE JANISSON & FILS - Carte blanche brut",6,354,59,354,59,null,26,{"$f":"IFERROR(IF(J593=\"soldé\",0,VLOOKUP(SOLDE!C538,#REF!,8,0)),0)","v":0}]
["CMAU 217604/0","2015-01-09",null,null,"CPESO - Château la rose (Bordeaux rouge)",0,0,0,0,"soldé",null,26,{"$f":"IFERROR(IF(J594=\"soldé\",0,VLOOKUP(SOLDE!C539,#REF!,8,0)),0)","v":0}]
["CMAU 217604/0","2015-01-09",null,null,"CPESO - Château Pagueneau (Bordeaux rouge)",0,0,0,0,"soldé",null,26,{"$f":"IFERROR(IF(J595=\"soldé\",0,VLOOKUP(SOLDE!C540,#REF!,8,0)),0)","v":0}]
["CMAU 217604/0","2015-01-09",null,null,"CPESO - Château Cazeaux (Cotes de Blaye)",0,0,0,0,"soldé",null,26,{"$f":"IFERROR(IF(J596=\"soldé\",0,VLOOKUP(SOLDE!C541,#REF!,8,0)),0)","v":0}]
["CMAU 217604/0","2015-01-09","021900016",null,"LES GRANDS CHAIS DE France - Vodka Jelzin (1L)",6,108,18,108,18,null,26,{"$f":"IFERROR(IF(J597=\"soldé\",0,VLOOKUP(SOLDE!C542,#REF!,8,0)),0)","v":0}]
["CMAU 217604/0","2015-01-09",null,null,"LES GRANDS CHAIS DE France - Cidre brut Jean Loret Bouche",0,0,0,0,"soldé",null,26,{"$f":"IFERROR(IF(J598=\"soldé\",0,VLOOKUP(SOLDE!C543,#REF!,8,0)),0)","v":0}]
["CMAU 217604/0","2015-01-09",null,null,"LES GRANDS CHAIS DE France - Vin du maroc domaine Toulal Guerrouane",0,0,0,0,"soldé",null,26,{"$f":"IFERROR(IF(J599=\"soldé\",0,VLOOKUP(SOLDE!C544,#REF!,8,0)),0)","v":0}]
["CMAU 217604/0","2015-01-09",null,null,"LES GRANDS CHAIS DE France - Whisky Bourbon Jack Daniel's (1L)",0,0,0,0,"soldé",null,26,{"$f":"IFERROR(IF(J600=\"soldé\",0,VLOOKUP(SOLDE!C545,#REF!,8,0)),0)","v":0}]
["CMAU 217604/0","2015-01-09",null,null,"BOULARD BAUQUAIRE - Champagne rosé",0,0,0,0,"soldé",null,26,{"$f":"IFERROR(IF(J601=\"soldé\",0,VLOOKUP(SOLDE!C546,#REF!,8,0)),0)","v":0}]
["CMAU 217604/0","2015-01-09",null,null,"BOULARD BAUQUAIRE - Champagne grande reserve",0,0,0,0,"soldé",null,26,{"$f":"IFERROR(IF(J602=\"soldé\",0,VLOOKUP(SOLDE!C547,#REF!,8,0)),0)","v":0}]
["CMAU 217604/0","2015-01-09",null,null,"BOULARD BAUQUAIRE - Champagne  brut tradition",0,0,0,0,"soldé",null,26,{"$f":"IFERROR(IF(J603=\"soldé\",0,VLOOKUP(SOLDE!C548,#REF!,8,0)),0)","v":0}]
["FCIU 445642/6","2015-01-15",null,null,"LES MAITRES VIGNERONS - GOURMANDISE ROSE ",0,0,0,0,"soldé",null,25.8,{"$f":"IFERROR(IF(J604=\"soldé\",0,VLOOKUP(SOLDE!C549,#REF!,8,0)),0)","v":0}]
["FCIU 445642/6","2015-01-15",null,null,"LES MAITRES VIGNERONS - SAINT ROCHE ROSE",0,0,0,0,"soldé",null,25.8,{"$f":"IFERROR(IF(J605=\"soldé\",0,VLOOKUP(SOLDE!C550,#REF!,8,0)),0)","v":0}]
["FCIU 445642/6","2015-01-15","021900016",null,"LES GRANDS CHAIS DE France - VODKA JELZIN 1L",6,900,150,900,150,null,25.8,{"$f":"IFERROR(IF(J606=\"soldé\",0,VLOOKUP(SOLDE!C551,#REF!,8,0)),0)","v":0}]
["FCIU 445642/6","2015-01-15",null,null,"LES GRANDS CHAIS DE France - CIDRE BRUT JEAN LORET BOUCHE",0,0,0,0,"soldé",null,25.8,{"$f":"IFERROR(IF(J607=\"soldé\",0,VLOOKUP(SOLDE!C552,#REF!,8,0)),0)","v":0}]
["FCIU 445642/6","2015-01-15",null,null,"LES GRANDS CHAIS DE France - VIN DE MAROC ROSE DOMAINE TOULAL",0,0,0,0,"soldé",null,25.8,{"$f":"IFERROR(IF(J608=\"soldé\",0,VLOOKUP(SOLDE!C553,#REF!,8,0)),0)","v":0}]
["FCIU 445642/6","2015-01-15",null,null,"SARL CIDRES BIGOUD - Cidre Le Brun artisanal brut",0,0,0,0,"soldé",null,25.8,{"$f":"IFERROR(IF(J609=\"soldé\",0,VLOOKUP(SOLDE!C554,#REF!,8,0)),0)","v":0}]
["FCIU 445642/6","2015-01-15","021900113",null,"LACHETEAU - SAUMUR ROUGE",6,60,10,60,10,null,25.8,{"$f":"IFERROR(IF(J610=\"soldé\",0,VLOOKUP(SOLDE!C555,#REF!,8,0)),0)","v":0}]
["FCIU 445642/6","2015-01-15",null,null,"LACHETEAU - MUSCADET SM/LIE AOC/AOP BLANC",0,0,0,0,"soldé",null,25.8,{"$f":"IFERROR(IF(J611=\"soldé\",0,VLOOKUP(SOLDE!C556,#REF!,8,0)),0)","v":0}]
["FCIU 445642/6","2015-01-15",null,null,"LACHETEAU - BOURGUEIL ROUGE",{"$f":"IFERROR(G612/H612,0)","v":0},0,0,0,"soldé",null,25.8,{"$f":"IFERROR(IF(J612=\"soldé\",0,VLOOKUP(SOLDE!C557,#REF!,8,0)),0)","v":0}]
["FCIU 445642/6","2015-01-15",null,null,"LACHETEAU - SAINT NICOLAS DE BOURGUEILA ROUGE",0,0,0,0,"soldé",null,25.8,{"$f":"IFERROR(IF(J613=\"soldé\",0,VLOOKUP(SOLDE!C558,#REF!,8,0)),0)","v":0}]
["FCIU 445642/6","2015-01-15",null,null,"LACHETEAU - POUILLY FUME",0,0,0,0,"soldé",null,25.8,{"$f":"IFERROR(IF(J614=\"soldé\",0,VLOOKUP(SOLDE!C559,#REF!,8,0)),0)","v":0}]
["CAIU 896641/4","2015-02-16",null,null,"PERNORD ABSINTHE 68% 70 CL",0,0,0,0,"soldé",null,24.733333333333334,{"$f":"IFERROR(IF(J615=\"soldé\",0,VLOOKUP(SOLDE!C560,#REF!,8,0)),0)","v":0}]
["CAIU 896641/4","2015-02-16",null,null,"RICARD 45% 100CL",0,0,0,0,"soldé",null,24.733333333333334,{"$f":"IFERROR(IF(J616=\"soldé\",0,VLOOKUP(SOLDE!C561,#REF!,8,0)),0)","v":0}]
["CAIU 896641/4","2015-02-16","021900503",null,"CLAN CAMPBELL 40% 70CL",12,504,42,504,42,null,24.733333333333334,{"$f":"IFERROR(IF(J617=\"soldé\",0,VLOOKUP(SOLDE!C562,#REF!,8,0)),0)","v":0}]
["CAIU 896641/4","2015-02-16",null,null,"BALLANTINE'S FINEST WHISKY 40% 70CL",0,0,0,0,"soldé",null,24.733333333333334,{"$f":"IFERROR(IF(J618=\"soldé\",0,VLOOKUP(SOLDE!C563,#REF!,8,0)),0)","v":0}]
["CAIU 896641/4","2015-02-16",null,null,"CHIVAS REGAL WHISKY 12 YO 40% 70 CL NRF ETUI",0,0,0,0,"soldé",null,24.733333333333334,{"$f":"IFERROR(IF(J619=\"soldé\",0,VLOOKUP(SOLDE!C564,#REF!,8,0)),0)","v":0}]
["CAIU 896641/4","2015-02-16","021900509",null,"BEEFEATER GIN 70CL 40%",12,120,10,120,10,null,24.733333333333334,{"$f":"IFERROR(IF(J620=\"soldé\",0,VLOOKUP(SOLDE!C565,#REF!,8,0)),0)","v":0}]
["CAIU 896641/4","2015-02-16",null,null,"MALIBU LIQUEUR 21% 70CL  ",0,0,0,0,"soldé",null,24.733333333333334,{"$f":"IFERROR(IF(J621=\"soldé\",0,VLOOKUP(SOLDE!C566,#REF!,8,0)),0)","v":0}]
["CAIU 896641/4","2015-02-16","021900516",null,"ABSOLUT VODKA 40% 70CL ",12,600,50,600,50,null,24.733333333333334,{"$f":"IFERROR(IF(J622=\"soldé\",0,VLOOKUP(SOLDE!C567,#REF!,8,0)),0)","v":0}]
["CAIU 896641/4","2015-02-16","021900520",null,"JAMESON WHISKY 40% 70CL ",6,522,87,522,87,null,24.733333333333334,{"$f":"IFERROR(IF(J623=\"soldé\",0,VLOOKUP(SOLDE!C568,#REF!,8,0)),0)","v":0}]
["CAIU 896641/4","2015-02-16","021900609",null,"HAVANA CLUB RHUM ANEJO 3 YEARS OLD 40% 70CL ",6,378,63,378,63,null,24.733333333333334,{"$f":"IFERROR(IF(J624=\"soldé\",0,VLOOKUP(SOLDE!C569,#REF!,8,0)),0)","v":0}]
["CAIU 896641/4","2015-02-16",null,null,"CLAN CAMPBELL 40% 100CL",0,0,0,0,"soldé",null,24.733333333333334,{"$f":"IFERROR(IF(J625=\"soldé\",0,VLOOKUP(SOLDE!C570,#REF!,8,0)),0)","v":0}]
["CAIU 896641/4","2015-02-16",null,null,"CHIVAS REGAL WHISKY 18 YO 40% 100 CL  ETUI",0,0,0,0,"soldé",null,24.733333333333334,{"$f":"IFERROR(IF(J626=\"soldé\",0,VLOOKUP(SOLDE!C571,#REF!,8,0)),0)","v":0}]
["CMAU 001506/8","2015-05-11",null,null,"MAISON HEBRARD - CHÂTEAU LES AUBIERS 2010/AOC premières Côtes de Blaye Rouge 75 cl",0,0,0,0,"soldé",null,21.933333333333334,{"$f":"IFERROR(IF(J627=\"soldé\",0,VLOOKUP(SOLDE!C572,#REF!,8,0)),0)","v":0}]
["CMAU 001506/8","2015-05-11",null,null,"MAISON HEBRARD - SAINT THIBEAUD 2012/AOC Bordeaux Rouge",0,0,0,0,"soldé",null,21.933333333333334,{"$f":"IFERROR(IF(J628=\"soldé\",0,VLOOKUP(SOLDE!C573,#REF!,8,0)),0)","v":0}]
["CMAU 001506/8","2015-05-11",null,null,"MAISON HEBRARD - CHÂTEAU PIAUT SIMON 2011/AOC GRAVES ROUGE",0,0,0,0,"soldé",null,21.933333333333334,{"$f":"IFERROR(IF(J629=\"soldé\",0,VLOOKUP(SOLDE!C574,#REF!,8,0)),0)","v":0}]
["CMAU 001506/8","2015-05-11",null,null,"SARL CPESO - SAINT CHINIAN ROUGE / ARGENT",0,0,0,0,"soldé",null,21.933333333333334,{"$f":"IFERROR(IF(J630=\"soldé\",0,VLOOKUP(SOLDE!C575,#REF!,8,0)),0)","v":0}]
["CMAU 001506/8","2015-05-11",null,null,"SARL CPESO - SAINT CHINIAN ROUGE",0,0,0,0,"soldé",null,21.933333333333334,{"$f":"IFERROR(IF(J631=\"soldé\",0,VLOOKUP(SOLDE!C576,#REF!,8,0)),0)","v":0}]
["CMAU 001506/8","2015-05-11",null,null,"SARL CPESO - PETIT CHABLIS BLANC (GENCODE CARTON 3357400603063)",0,0,0,0,"soldé",null,21.933333333333334,{"$f":"IFERROR(IF(J632=\"soldé\",0,VLOOKUP(SOLDE!C577,#REF!,8,0)),0)","v":0}]
["CMAU 001506/8","2015-05-11",null,null,"SARL CPESO - BORDEAUX ROUGE / MARQUIS DE BALMONT",0,0,0,0,"soldé",null,21.933333333333334,{"$f":"IFERROR(IF(J633=\"soldé\",0,VLOOKUP(SOLDE!C578,#REF!,8,0)),0)","v":0}]
["CMAU 001506/8","2015-05-11",null,null,"SARL CPESO - HAUTES COTES DE BEAUNES BLC",0,0,0,0,"soldé",null,21.933333333333334,{"$f":"IFERROR(IF(J634=\"soldé\",0,VLOOKUP(SOLDE!C579,#REF!,8,0)),0)","v":0}]
["CMAU 001506/8","2015-05-11",null,null,"SARL CPESO - BORDEAUX ROUGE / CHÂTEAU PAGUENEAU",0,0,0,0,"soldé",null,21.933333333333334,{"$f":"IFERROR(IF(J635=\"soldé\",0,VLOOKUP(SOLDE!C580,#REF!,8,0)),0)","v":0}]
["CMAU 001506/8","2015-05-11",null,null,"H CUVELIE & FILS - CHATEAUX LACROIX SAINT ESTEPHE 2011 / AOC rouge 2nd Vin/wine Ch. Crock",0,0,0,0,"soldé",null,21.933333333333334,{"$f":"IFERROR(IF(J636=\"soldé\",0,VLOOKUP(SOLDE!C581,#REF!,8,0)),0)","v":0}]
["CMAU 001506/8","2015-05-11",null,null,"H CUVELIE & FILS - CHATEAUX PAVILLON DE LEOVILLE POYFERRE / AOC Rouge 2nd Vin/wine Ch. Léoville Poyferré",0,0,0,0,"soldé",null,21.933333333333334,{"$f":"IFERROR(IF(J637=\"soldé\",0,VLOOKUP(SOLDE!C582,#REF!,8,0)),0)","v":0}]
["CMAU 001506/8","2015-05-11","021305012-12",null,"H CUVELIE & FILS - HAUTES GRAVES DEA 2011 / POMEROL AOC Rouge",12,60,5,60,5,null,21.933333333333334,{"$f":"IFERROR(IF(J638=\"soldé\",0,VLOOKUP(SOLDE!C583,#REF!,8,0)),0)","v":0}]
["CMAU 001506/8","2015-05-11",null,null,"HOREAU-BEYLOT - CH. MARTINET GC SAINT EMILION GRAND CRU 2007",0,0,0,0,"soldé",null,21.933333333333334,{"$f":"IFERROR(IF(J639=\"soldé\",0,VLOOKUP(SOLDE!C584,#REF!,8,0)),0)","v":0}]
["CMAU 001506/8","2015-05-11",null,null,"CORDIER MESTREZAT - CH. LA CROIX SAINT JACQUES BLAYE/COTES DE BORDEAUX (Gencod bouteille : 3148597117620)",0,0,0,{"$f":"G640","v":0},"soldé",null,21.933333333333334,{"$f":"IFERROR(IF(J640=\"soldé\",0,VLOOKUP(SOLDE!C585,#REF!,8,0)),0)","v":0}]
["CMAU 001506/8","2015-05-11",null,null,"TORRES - TORRES SAN VALENTIN PARELLADA ",0,0,0,0,"soldé",null,21.933333333333334,{"$f":"IFERROR(IF(J641=\"soldé\",0,VLOOKUP(SOLDE!C586,#REF!,8,0)),0)","v":0}]
["CMAU 001506/8","2015-05-11","022000005",null,"TORRES - TORRES SAN VALENTIN GARNACHA",6,24,4,24,{"$f":"IF(H642<=0,\"soldé\",H642)","v":4},null,{"$f":"(TODAY()-B642)/30","v":21.933333333333334},{"$f":"IFERROR(IF(J642=\"soldé\",0,VLOOKUP(SOLDE!C587,#REF!,8,0)),0)","v":0}]
["CMAU 001506/8","2015-05-11",null,null,"LOUIS ROEDERER - BRUT MILLESIME 2008 L. ROEDERER (ETUI GRAPHIQUE) / 75 cl",0,0,0,0,"soldé",null,21.933333333333334,{"$f":"IFERROR(IF(J643=\"soldé\",0,VLOOKUP(SOLDE!C588,#REF!,8,0)),0)","v":0}]
["CMAU 001506/8","2015-05-11","021900540",null,"LOUIS ROEDERER - BRUT MILLESIME 2008 L. ROEDERER (ETUI GRAPHIQUE) / 75 cl",6,72,12,72,12,null,21.933333333333334,{"$f":"IFERROR(IF(J644=\"soldé\",0,VLOOKUP(SOLDE!C589,#REF!,8,0)),0)","v":0}]
["CMAU 001506/8","2015-05-11",null,null,"LOUIS ROEDERER - CHÂTEAU HAUT-BEAUSEJOUR 2011 - 75 CL",0,0,0,0,"soldé",null,21.933333333333334,{"$f":"IFERROR(IF(J645=\"soldé\",0,VLOOKUP(SOLDE!C590,#REF!,8,0)),0)","v":0}]
["CMAU 001506/8","2015-05-11","021900543",null,"LOUIS ROEDERER - CHÂTEAU DE PEZ 2011 (CAISSE BOIS) - 75 CL",6,30,5,30,5,null,21.933333333333334,{"$f":"IFERROR(IF(J646=\"soldé\",0,VLOOKUP(SOLDE!C591,#REF!,8,0)),0)","v":0}]
["CMAU 178851/9","2015-05-14",null,null,"LACHETEAU - ST NICOLAS DE BOURGUEILA ROUGE M MARTIN LES ECHALIERS NV CRD ",0,0,0,0,"soldé",null,21.833333333333332,{"$f":"IFERROR(IF(J647=\"soldé\",0,VLOOKUP(SOLDE!C592,#REF!,8,0)),0)","v":0}]
["CMAU 178851/9","2015-05-14",null,null,"SAS LES DOMAINES AURIOL - DNE LA CROIX D'ALINE ROUGE 2013 AOP SAINT CHINIAN",0,0,0,0,"soldé",null,21.833333333333332,{"$f":"IFERROR(IF(J648=\"soldé\",0,VLOOKUP(SOLDE!C593,#REF!,8,0)),0)","v":0}]
["CMAU 178851/9","2015-05-14","021310208",null,"SAS LES DOMAINES AURIOL - SYRAH-LA-CHAPELLE DE MONTMIJA 2013 IGP PAYS D'OC ROUGE VIN BIOLOGIQUE",6,24,4,24,4,null,21.833333333333332,{"$f":"IFERROR(IF(J649=\"soldé\",0,VLOOKUP(SOLDE!C594,#REF!,8,0)),0)","v":0}]
["CMAU 178851/9","2015-05-14","021310208",null,"SAS LES DOMAINES AURIOL - SYRAH-LA-CHAPELLE DE MONTMIJA IGP PAYS D'OC ROUGE 2014 VIN BIOLOGIQUE",6,36,6,36,6,null,21.833333333333332,{"$f":"IFERROR(IF(J650=\"soldé\",0,VLOOKUP(SOLDE!C595,#REF!,8,0)),0)","v":0}]
["CMAU 178851/9","2015-05-14",null,null,"UNION DES VIGNERONS DES COTES DU RHONE/CELIER DES DAUPHINS - COTES DU RHONE CHÂTEAU DE L'ESTAGNOL ROUGE 75",0,0,0,0,"soldé",null,21.833333333333332,{"$f":"IFERROR(IF(J651=\"soldé\",0,VLOOKUP(SOLDE!C596,#REF!,8,0)),0)","v":0}]
["CMAU 178851/9","2015-05-14",null,null,"UNION DES VIGNERONS DES COTES DU RHONE/CELIER DES DAUPHINS - CROZES HERMITAGE LA TOUVIERE ROUGE 2012 ",0,0,0,0,"soldé",null,21.833333333333332,{"$f":"IFERROR(IF(J652=\"soldé\",0,VLOOKUP(SOLDE!C597,#REF!,8,0)),0)","v":0}]
["CMAU 178851/9","2015-05-14","021900651",null,"PERNOD RICARD - ABSOLUT VODKA 40% / 100 CL",12,336,28,336,28,null,21.833333333333332,{"$f":"IFERROR(IF(J653=\"soldé\",0,VLOOKUP(SOLDE!C598,#REF!,8,0)),0)","v":0}]
["CMAU 178851/9","2015-05-14",null,null,"BOULARD-BAUQUAIRE - MAGNUMS MAGNUM BRUT GRANDE RESERVE",0,0,0,0,"soldé",null,21.833333333333332,{"$f":"IFERROR(IF(J654=\"soldé\",0,VLOOKUP(SOLDE!C599,#REF!,8,0)),0)","v":0}]
["CMAU 178851/9","2015-05-14",null,null,"SARL CPESO - SAINT CHINIAN ROUGE ARGENT",0,0,0,0,"soldé",null,21.833333333333332,{"$f":"IFERROR(IF(J655=\"soldé\",0,VLOOKUP(SOLDE!C600,#REF!,8,0)),0)","v":0}]
["CMAU 178851/9","2015-05-14",null,null,"SARL CPESO - PETIT CHABLIS BLANC",0,0,0,0,"soldé",null,21.833333333333332,{"$f":"IFERROR(IF(J656=\"soldé\",0,VLOOKUP(SOLDE!C601,#REF!,8,0)),0)","v":0}]
["CMAU 178851/9","2015-05-14",null,null,"SARL CPESO - BORDEAUX ROUGE",0,0,0,0,"soldé",null,21.833333333333332,{"$f":"IFERROR(IF(J657=\"soldé\",0,VLOOKUP(SOLDE!C602,#REF!,8,0)),0)","v":0}]
["CMAU 178851/9","2015-05-14",null,null,"CAHORS ROUGE",0,0,0,0,"soldé",null,21.833333333333332,{"$f":"IFERROR(IF(J658=\"soldé\",0,VLOOKUP(SOLDE!C603,#REF!,8,0)),0)","v":0}]
["CMAU 178851/9","2015-05-14",null,null,"VDP CARCASSONNE ROUGE",0,0,0,0,"soldé",null,21.833333333333332,{"$f":"IFERROR(IF(J659=\"soldé\",0,VLOOKUP(SOLDE!C604,#REF!,8,0)),0)","v":0}]
["CMAU 032896/7","2015-06-15",null,null,"BOULARD BAUQUAIRE - CHAMPAGNE BRUT TRADITION",0,0,0,0,"soldé",null,20.766666666666666,{"$f":"IFERROR(IF(J660=\"soldé\",0,VLOOKUP(SOLDE!C605,#REF!,8,0)),0)","v":0}]
["CMAU 032896/7","2015-06-15",null,null,"BOULARD BAUQUAIRE - Champagne rose",0,0,0,0,"soldé",null,20.766666666666666,{"$f":"IFERROR(IF(J661=\"soldé\",0,VLOOKUP(SOLDE!C606,#REF!,8,0)),0)","v":0}]
["CMAU 032896/7","2015-06-15",null,null,"PERNOD RICARD - RICARD 45% 100 CL",0,0,0,0,"soldé",null,20.766666666666666,{"$f":"IFERROR(IF(J662=\"soldé\",0,VLOOKUP(SOLDE!C607,#REF!,8,0)),0)","v":0}]
["CMAU 032896/7","2015-06-15",null,null,"PERNOD RICARD - Chivas regal whisky 18 yo 40% - 70CL",0,0,0,0,"soldé",null,20.766666666666666,{"$f":"IFERROR(IF(J663=\"soldé\",0,VLOOKUP(SOLDE!C608,#REF!,8,0)),0)","v":0}]
["TEMU 319653/0","2015-07-20","021900027",null,"GRANDS CHAIS DE France - VIN DU MAROC DOMAINE TOULAL GUERROUANE",0,0,0,0,"soldé",null,19.600000000000001,{"$f":"IFERROR(IF(J664=\"soldé\",0,VLOOKUP(SOLDE!C609,#REF!,8,0)),0)","v":0}]
["TEMU 319653/0","2015-07-20","021400576",null,"ETS CORDIER MESTREZAT - CH. LA CROIX SAINT JACQUES 2013",0,0,0,0,"soldé",null,19.600000000000001,{"$f":"IFERROR(IF(J665=\"soldé\",0,VLOOKUP(SOLDE!C610,#REF!,8,0)),0)","v":0}]
["TEMU 319653/0","2015-07-20","021305105",null,"COMPAGNIE VINICOLE BARON EDMOND DE ROTHSCHILD - CHÂTEAU DES LAURETS 2011",0,0,0,0,"soldé",null,19.600000000000001,{"$f":"IFERROR(IF(J666=\"soldé\",0,VLOOKUP(SOLDE!C611,#REF!,8,0)),0)","v":0}]
["TEMU 319653/0","2015-07-20","022810050",null,"MAISON HEBRARD - HAUT SOCIONDO 2012 AOC COTES DE BLAYE ROUGE",0,0,0,0,"soldé",null,19.600000000000001,{"$f":"IFERROR(IF(J667=\"soldé\",0,VLOOKUP(SOLDE!C612,#REF!,8,0)),0)","v":0}]
["TEMU 319653/0","2015-07-20","021310317",null,"SARL CPESO - SAINT CHINIAN ROUGE - CHÂTEAU COL DE L'ORB",0,0,0,0,"soldé",null,19.600000000000001,{"$f":"IFERROR(IF(J668=\"soldé\",0,VLOOKUP(SOLDE!C613,#REF!,8,0)),0)","v":0}]
["TEMU 319653/0","2015-07-20","021101000",null,"CAMUS - CHABANNEAU COGNAC AVEC ETUIS",6,216,36,216,36,null,19.600000000000001,{"$f":"IFERROR(IF(J669=\"soldé\",0,VLOOKUP(SOLDE!C614,#REF!,8,0)),0)","v":0}]
["TCKU 271294/1","2015-07-28","021900110",null,"LACHETEAU - TOURAINE ROUGE / M MARTIN LE CLOUQUIN - 75 CL",0,0,0,0,"soldé",null,19.333333333333332,{"$f":"IFERROR(IF(J670=\"soldé\",0,VLOOKUP(SOLDE!C615,#REF!,8,0)),0)","v":0}]
["TCKU 271294/1","2015-07-28","021900210",null,"LACHETEAU - 1/2 TOURAINE ROUGE / M MARTIN LE CLOUQUIN - 37,5 CL",0,0,0,0,"soldé",null,19.333333333333332,{"$f":"IFERROR(IF(J671=\"soldé\",0,VLOOKUP(SOLDE!C616,#REF!,8,0)),0)","v":0}]
["TCKU 271294/1","2015-07-28","021900415",null,"LACHETEAU - CHINON ROUGE / M MARTIN LES BERNIERES",0,0,0,0,"soldé",null,19.333333333333332,{"$f":"IFERROR(IF(J672=\"soldé\",0,VLOOKUP(SOLDE!C617,#REF!,8,0)),0)","v":0}]
["TCKU 271294/1","2015-07-28","021900424",null,"LACHETEAU - MUSCADET BLANC  / CHÂTEAU DE GOULAINE PAPILLON",0,0,0,0,"soldé",null,19.333333333333332,{"$f":"IFERROR(IF(J673=\"soldé\",0,VLOOKUP(SOLDE!C618,#REF!,8,0)),0)","v":0}]
["TCKU 271294/1","2015-07-28","021900425",null,"LACHETEAU - POUILLY FUME BLANC",0,0,0,0,"soldé",null,19.333333333333332,{"$f":"IFERROR(IF(J674=\"soldé\",0,VLOOKUP(SOLDE!C619,#REF!,8,0)),0)","v":0}]
["TCKU 271294/1","2015-07-28","021900430",null,"LACHETEAU - 1/2 MUSCADET BLANC  / CHÂTEAU DE GOULAINE PAPILLON - 37,5 CL",0,0,0,0,"soldé",null,19.333333333333332,{"$f":"IFERROR(IF(J675=\"soldé\",0,VLOOKUP(SOLDE!C620,#REF!,8,0)),0)","v":0}]
["TCKU 271294/1","2015-07-28","021310256",null,"LES MAITRES VIGNERONS - GOURMANDISE ROSE",{"$f":"IFERROR(G676/H676,0)","v":0},0,0,0,"soldé",null,19.333333333333332,{"$f":"IFERROR(IF(J676=\"soldé\",0,VLOOKUP(SOLDE!C621,#REF!,8,0)),0)","v":0}]
["TCKU 271294/1","2015-07-28","021310257",null,"LES MAITRES VIGNERONS - SAINT ROCH - FLUTE CORSET",0,0,0,0,"soldé",null,19.333333333333332,{"$f":"IFERROR(IF(J677=\"soldé\",0,VLOOKUP(SOLDE!C622,#REF!,8,0)),0)","v":0}]
["TCKU 271294/1","2015-07-28","021310020",null,"LES GRANDS CHAIS DE France - CHIANTI DOCG ROUGE / PICCINI SANGIOVESE",0,0,0,0,"soldé",null,19.333333333333332,{"$f":"IFERROR(IF(J678=\"soldé\",0,VLOOKUP(SOLDE!C623,#REF!,8,0)),0)","v":0}]
["TCKU 271294/1","2015-07-28","021310256",null,"LES MAITRES VIGNERONS - GOURMANDISE ROSE",0,0,0,0,"soldé",null,19.333333333333332,{"$f":"IFERROR(IF(J679=\"soldé\",0,VLOOKUP(SOLDE!C624,#REF!,8,0)),0)","v":0}]
["TCKU 271294/1","2015-07-28","021310257",null,"LES MAITRES VIGNERONS - SAINT ROCH - FLUTE CORSET",0,0,0,0,"soldé",null,19.333333333333332,{"$f":"IFERROR(IF(J680=\"soldé\",0,VLOOKUP(SOLDE!C625,#REF!,8,0)),0)","v":0}]
["ECMU 155040/0","2016-07-09","022810005",null,"MAISON HEBRARD - SAINT THIBEAUD BDX ROUGE 2012",0,0,0,0,"soldé",null,7.7666666666666666,{"$f":"IFERROR(IF(J681=\"soldé\",0,VLOOKUP(SOLDE!C626,#REF!,8,0)),0)","v":0}]
["ECMU 155040/0","2016-07-09","021300009",null,"CHAMPAGNE BOULARD BAUQUAIRE - CHAMPAGNE BRUT TRADITION",0,0,0,0,"soldé",null,7.7666666666666666,{"$f":"IFERROR(IF(J682=\"soldé\",0,VLOOKUP(SOLDE!C627,#REF!,8,0)),0)","v":0}]
["ECMU 155040/0","2016-07-09","DAGAB001454",null,"COMPAGNIE VINICOLE BARON EDMOND DE ROTHSCHILD - CHÂTEAU DES LAURETS 2012",0,0,0,0,"soldé",null,7.7666666666666666,{"$f":"IFERROR(IF(J683=\"soldé\",0,VLOOKUP(SOLDE!C628,#REF!,8,0)),0)","v":0}]
["TEMU 319813/2","2015-10-01","021310010",null,"LES GRANDS CHAIS DE France - VPAYS D'OC - CHEVALIER LACHINE MERLO ROUGE",0,0,0,0,"soldé",null,17.166666666666668,{"$f":"IFERROR(IF(J684=\"soldé\",0,VLOOKUP(SOLDE!C629,#REF!,8,0)),0)","v":0}]
["TEMU 319813/2","2015-10-01","DARAA004564",null,"LES GRANDS CHAIS DE France - ORVIETO CLASSICO D'OC SAN CAIO PROCANICO VERDEL BLANC",0,0,0,0,"soldé",null,17.166666666666668,{"$f":"IFERROR(IF(J685=\"soldé\",0,VLOOKUP(SOLDE!C630,#REF!,8,0)),0)","v":0}]
["TEMU 319813/2","2015-10-01","021310020",null,"LES GRANDS CHAIS DE France - CHIANTI DOCG PICINNI SANGIOVESE ROUGE",0,0,0,0,"soldé",null,17.166666666666668,{"$f":"IFERROR(IF(J686=\"soldé\",0,VLOOKUP(SOLDE!C631,#REF!,8,0)),0)","v":0}]
["TEMU 319813/2","2015-10-01","021320025",null,"LES GRANDS CHAIS DE France - SICILIA IGP VIALA NERO D'AVOLA VIS ROUGE",0,0,0,0,"soldé",null,17.166666666666668,{"$f":"IFERROR(IF(J687=\"soldé\",0,VLOOKUP(SOLDE!C632,#REF!,8,0)),0)","v":0}]
["TEMU 319813/2","2015-10-01","021900027",null,"LES GRANDS CHAIS DE France - VIN DU MAROC DOMAINE TOULAL GUERROUANE ROSE",0,0,0,0,"soldé",null,17.166666666666668,{"$f":"IFERROR(IF(J688=\"soldé\",0,VLOOKUP(SOLDE!C633,#REF!,8,0)),0)","v":0}]
["TEMU 319813/2","2015-10-01","021900031",null,"LES GRANDS CHAIS DE France - VIN DU MAROC DOMAINE TOULAL GUERROUANE ROUGE",0,0,0,0,"soldé",null,17.166666666666668,{"$f":"IFERROR(IF(J689=\"soldé\",0,VLOOKUP(SOLDE!C634,#REF!,8,0)),0)","v":0}]
["TEMU 319813/2","2015-10-01","021310315",null,"SARL CPESO - GEWURZTRAMINER",0,0,0,0,"soldé",null,17.166666666666668,{"$f":"IFERROR(IF(J690=\"soldé\",0,VLOOKUP(SOLDE!C635,#REF!,8,0)),0)","v":0}]
["TEMU 319813/2","2015-10-01","021310402",null,"SARL CPESO - BORDEAUX ROUGE",0,0,0,0,"soldé",null,17.166666666666668,{"$f":"IFERROR(IF(J691=\"soldé\",0,VLOOKUP(SOLDE!C636,#REF!,8,0)),0)","v":0}]
["TEMU 319813/2","2015-10-01","021310250",null,"LES MAITRES VIGNERONS - GOURMANDISE ROUGE ",0,0,0,0,"soldé",null,17.166666666666668,{"$f":"IFERROR(IF(J692=\"soldé\",0,VLOOKUP(SOLDE!C637,#REF!,8,0)),0)","v":0}]
["TEMU 319813/2","2015-10-01","021310256",null,"LES MAITRES VIGNERONS - GOURMANDISE ROSE",0,0,0,0,"soldé",null,17.166666666666668,{"$f":"IFERROR(IF(J693=\"soldé\",0,VLOOKUP(SOLDE!C638,#REF!,8,0)),0)","v":0}]
["CMAU 019331/0","2015-11-03","IAKAA020158         ",null,"CLEVERBEL - RHUM TRADITIONNEL BLANC",6,1662,277,1662,277,null,16.066666666666666,{"$f":"IFERROR(IF(J694=\"soldé\",0,VLOOKUP(SOLDE!C639,#REF!,8,0)),0)","v":0}]
["CMAU 019331/0","2015-11-03","021200650           ",null,"CLEVERBEL - RHUM ARRANGE CAFE VANILLE",0,0,0,0,"soldé",null,16.066666666666666,{"$f":"IFERROR(IF(J695=\"soldé\",0,VLOOKUP(SOLDE!C640,#REF!,8,0)),0)","v":0}]
["CMAU 019331/0","2015-11-03","021200651           ",null,"CLEVERBEL - RHUM ARRANGE VANILLE VANGASSAYE",0,0,0,0,"soldé",null,16.066666666666666,{"$f":"IFERROR(IF(J696=\"soldé\",0,VLOOKUP(SOLDE!C641,#REF!,8,0)),0)","v":0}]
["CMAU 019331/0","2015-11-03","021200652           ",null,"CLEVERBEL - RHUM ARRANGE CHAMARRES EXOTIQUE",0,0,0,0,"soldé",null,16.066666666666666,{"$f":"IFERROR(IF(J697=\"soldé\",0,VLOOKUP(SOLDE!C642,#REF!,8,0)),0)","v":0}]
["CMAU 019331/0","2015-11-03","IAKAA020196         ",null,"CLEVERBEL - RHUM TRADITIONNEL BLOND",12,624,52,624,52,null,16.066666666666666,{"$f":"IFERROR(IF(J698=\"soldé\",0,VLOOKUP(SOLDE!C643,#REF!,8,0)),0)","v":0}]
["CMAU 019331/0","2015-11-03","021320300           ",null,"SARL CPESO - BORDEAUX ROUGE // MARQUIS DE BALMONT",0,0,0,0,"soldé",null,16.066666666666666,{"$f":"IFERROR(IF(J699=\"soldé\",0,VLOOKUP(SOLDE!C644,#REF!,8,0)),0)","v":0}]
["CMAU 019331/0","2015-11-03","021310402           ",null,"SARL CPESO - BORDEAUX ROUGE // CHÂTEAU PAGUENEAU",0,0,0,0,"soldé",null,16.066666666666666,{"$f":"IFERROR(IF(J700=\"soldé\",0,VLOOKUP(SOLDE!C645,#REF!,8,0)),0)","v":0}]
["CMAU 019331/0","2015-11-03","021310255           ",null,"LES MAITRES VIGNERONS - SAINT ROCH ROSE // SENSATION ST ROCH \"ARGENT\"",12,60,5,60,5,null,16.066666666666666,{"$f":"IFERROR(IF(J701=\"soldé\",0,VLOOKUP(SOLDE!C646,#REF!,8,0)),0)","v":0}]
["CMAU 019331/0","2015-11-03","021310257           ",null,"LES MAITRES VIGNERONS - SAINT ROCH ROSE // FLUTE A CORSET",0,0,0,0,"soldé",null,16.066666666666666,{"$f":"IFERROR(IF(J702=\"soldé\",0,VLOOKUP(SOLDE!C647,#REF!,8,0)),0)","v":0}]
["CMAU 122384/7","2015-12-04","022800100",null,"SARL CIDRES BIGOUD - CIDRE LE BRUN ARTISANAL BRUT",0,0,0,0,"soldé",null,15.033333333333333,{"$f":"IFERROR(IF(J703=\"soldé\",0,VLOOKUP(SOLDE!C648,#REF!,8,0)),0)","v":0}]
["CMAU 122384/7","2015-12-04","022800007",null,"BOUQUET DE LOIRE - SAINT NICOLAS DE BOURGUEL DOM. GODEFROY",0,0,0,{"$f":"G704","v":0},"soldé",null,15.033333333333333,{"$f":"IFERROR(IF(J704=\"soldé\",0,VLOOKUP(SOLDE!C649,#REF!,8,0)),0)","v":0}]
["CMAU 061044/0","2016-06-24","021310256",null,"LES MAITRES VIGNERONS - GOURMANDISE ROSE",0,0,0,0,"soldé",null,8.2666666666666675,{"$f":"IFERROR(IF(J705=\"soldé\",0,VLOOKUP(SOLDE!C650,#REF!,8,0)),0)","v":0}]
["CMAU 061044/0","2016-06-24","UDAA932717",null,"LES MAITRES VIGNERONS - SOMMELIER MAITRES VIGNERONS - ECHANTILLONS",0,0,0,0,{"$f":"IF(H706<=0,\"soldé\",H706)","v":"soldé"},null,{"$f":"(TODAY()-B706)/30","v":8.2666666666666675},{"$f":"IFERROR(IF(J706=\"soldé\",0,VLOOKUP(SOLDE!C651,#REF!,8,0)),0)","v":0}]
["CMAU 061044/0","2016-06-24","DANAA501002",null,"CHÂTEAU D'AMPUIS E.GUIGAL - COTES DU RHONE ROUGE",0,0,0,0,"soldé",null,8.2666666666666675,{"$f":"IFERROR(IF(J707=\"soldé\",0,VLOOKUP(SOLDE!C652,#REF!,8,0)),0)","v":0}]
["CMAU 061044/0","2016-06-24","021310304",null,"SARL CPESO - DOMAINE AUZIAS VDP CARCASSONNE ROSE",0,0,0,0,"soldé",null,8.2666666666666675,{"$f":"IFERROR(IF(J708=\"soldé\",0,VLOOKUP(SOLDE!C653,#REF!,8,0)),0)","v":0}]
["CMAU 061044/0","2016-06-24","021900558 ",null,"LOUIS LATOUR - GEVREY-CHAMBERTIN",0,0,0,0,"soldé",null,8.2666666666666675,{"$f":"IFERROR(IF(J709=\"soldé\",0,VLOOKUP(SOLDE!C654,#REF!,8,0)),0)","v":0}]
["CMAU 061044/0","2016-06-24","021900560",null,"LOUIS LATOUR - PINOT NOIR BOURGOGNE",6,60,10,60,10,null,8.2666666666666675,{"$f":"IFERROR(IF(J710=\"soldé\",0,VLOOKUP(SOLDE!C655,#REF!,8,0)),0)","v":0}]
["CMAU 061044/0","2016-06-24","021900424",null,"LACHETEAU - MUSCADET SM/LIE BLANC",0,0,0,0,"soldé",null,8.2666666666666675,{"$f":"IFERROR(IF(J711=\"soldé\",0,VLOOKUP(SOLDE!C656,#REF!,8,0)),0)","v":0}]
["CMAU 061044/0","2016-06-24","GAAAA003508",null,"MIGUEL TORRES - RGE - SELECCION DE TORRES SL CELESTE CRIANZA",0,0,0,0,"soldé",null,8.2666666666666675,{"$f":"IFERROR(IF(J712=\"soldé\",0,VLOOKUP(SOLDE!C657,#REF!,8,0)),0)","v":0}]
["CMAU 061044/0","2016-06-24","DADAA571144",null,"MAISON HEBRARD - CHÂTEAU CHADEUIL ROUGE  ",6,174,29,174,29,null,8.2666666666666675,{"$f":"IFERROR(IF(J713=\"soldé\",0,VLOOKUP(SOLDE!C658,#REF!,8,0)),0)","v":0}]
["CMAU 061044/0","2016-06-24","DADAA005604 ",null,"MAISON HEBRARD - CHÂTEAU LES AUBIERS ROUGE",0,0,0,0,"soldé",null,8.2666666666666675,{"$f":"IFERROR(IF(J714=\"soldé\",0,VLOOKUP(SOLDE!C659,#REF!,8,0)),0)","v":0}]
["CMAU 061044/0","2016-06-24","DADAA321112",null,"MAISON HEBRARD - PAVILLON TRIANON ROUGE",6,132,22,132,22,null,8.2666666666666675,{"$f":"IFERROR(IF(J715=\"soldé\",0,VLOOKUP(SOLDE!C660,#REF!,8,0)),0)","v":0}]
["CMAU 061044/0","2016-06-24","021310013",null,"LES GRANDS CHAIS DE France - CIDRE JEAN LORET BLANC",6,120,20,120,20,null,8.2666666666666675,{"$f":"IFERROR(IF(J716=\"soldé\",0,VLOOKUP(SOLDE!C661,#REF!,8,0)),0)","v":0}]
["CMAU 061044/0","2016-06-24","021900027           ",null,"LES GRANDS CHAIS DE France - DOMAINE TOULAL ROSE",0,0,0,0,"soldé",null,8.2666666666666675,{"$f":"IFERROR(IF(J717=\"soldé\",0,VLOOKUP(SOLDE!C662,#REF!,8,0)),0)","v":0}]
["CMAU 061044/0","2016-06-24","021900031           ",null,"LES GRANDS CHAIS DE France - DOMAINE TOULAL ROUGE",6,252,42,252,42,null,8.2666666666666675,{"$f":"IFERROR(IF(J718=\"soldé\",0,VLOOKUP(SOLDE!C663,#REF!,8,0)),0)","v":0}]
["CMAU 061044/0","2016-06-24","021900030 ",null,"LES GRANDS CHAIS DE France - MERCUREY LA DOMAL ROUGE",0,0,0,0,"soldé",null,8.2666666666666675,{"$f":"IFERROR(IF(J719=\"soldé\",0,VLOOKUP(SOLDE!C664,#REF!,8,0)),0)","v":0}]
["CMAU 061044/0","2016-06-24","021900012",null,"LES GRANDS CHAIS DE France - WISKY JACK DANIEL'S 70 CL",0,0,0,0,"soldé",null,8.2666666666666675,{"$f":"IFERROR(IF(J720=\"soldé\",0,VLOOKUP(SOLDE!C665,#REF!,8,0)),0)","v":0}]
["CMAU 061044/0","2016-06-24","021500270           ",null,"CELLIERS DES DAUPHINS - IGP MEDITERRANEE ROSE / ENCLAVE DES PAPES",0,0,0,0,"soldé",null,8.2666666666666675,{"$f":"IFERROR(IF(J721=\"soldé\",0,VLOOKUP(SOLDE!C666,#REF!,8,0)),0)","v":0}]
["CMAU 061044/0","2016-06-24","021500271           ",null,"CELLIERS DES DAUPHINS - IGP MEDITERRANEE ROUGE /  ENCLAVE DES PAPES",0,0,0,0,"soldé",null,8.2666666666666675,{"$f":"IFERROR(IF(J722=\"soldé\",0,VLOOKUP(SOLDE!C667,#REF!,8,0)),0)","v":0}]
["CMAU 061044/0","2016-06-24","021900027           ",null,"LES GRANDS CHAIS DE France - DOMAINE TOULAL ROSE",0,0,0,0,"soldé",null,8.2666666666666675,{"$f":"IFERROR(IF(J723=\"soldé\",0,VLOOKUP(SOLDE!C668,#REF!,8,0)),0)","v":0}]
["CMAU 061044/0","2016-06-24","DAGAB001508",null,"COMPAGNIE VINICOLE BARON EDMOND - LES GRANGES",12,24,2,24,2,null,8.2666666666666675,{"$f":"IFERROR(IF(J724=\"soldé\",0,VLOOKUP(SOLDE!C669,#REF!,8,0)),0)","v":0}]
["CMAU 061044/0","2016-06-24","DCAAA610256",null,"HOREAU-BEYLOT - CH MARTINET",6,180,30,180,30,null,8.2666666666666675,{"$f":"IFERROR(IF(J725=\"soldé\",0,VLOOKUP(SOLDE!C670,#REF!,8,0)),0)","v":0}]
["CMAU 061044/0","2016-06-24","DAGAA501623",null,"CORDIER - CH. BEL AIR ROUGE",12,120,10,120,10,null,8.2666666666666675,{"$f":"IFERROR(IF(J726=\"soldé\",0,VLOOKUP(SOLDE!C671,#REF!,8,0)),0)","v":0}]
["CMAU 061044/0","2016-06-24","021300009",null,"BOULARD BAUQUAIRE - CHAMPAGNE BRUT TRADITION",0,0,0,0,"soldé",null,8.2666666666666675,{"$f":"IFERROR(IF(J727=\"soldé\",0,VLOOKUP(SOLDE!C672,#REF!,8,0)),0)","v":0}]
["CMAU 061044/0","2016-06-24","DCJAA003753",null,"GRANDEAU LAUDUC - CHÂTEAU LAUDUC BLANC",6,300,50,300,50,null,8.2666666666666675,{"$f":"IFERROR(IF(J728=\"soldé\",0,VLOOKUP(SOLDE!C673,#REF!,8,0)),0)","v":0}]
["CMAU 066536/1","2016-01-11","021900027",null,"LES GRANDS CHAIS DE France - VIN DU MAROC DOMMAINE TOULAL GUERROUANE ROSE",0,0,0,0,"soldé",null,13.766666666666667,{"$f":"IFERROR(IF(J729=\"soldé\",0,VLOOKUP(SOLDE!C674,#REF!,8,0)),0)","v":0}]
["CMAU 066536/1","2016-01-11","021900029     ",null,"LES GRANDS CHAIS DE France - WHISKY BOURBON JACK DANIEL'S 1L",0,0,0,0,"soldé",null,13.766666666666667,{"$f":"IFERROR(IF(J730=\"soldé\",0,VLOOKUP(SOLDE!C675,#REF!,8,0)),0)","v":0}]
["CMAU 066536/1","2016-01-11","DAGAA304033         ",null,"ETS CORDIER - CHATEAU ANDRON \"FUT\" CC",0,0,0,0,"soldé",null,13.766666666666667,{"$f":"IFERROR(IF(J731=\"soldé\",0,VLOOKUP(SOLDE!C676,#REF!,8,0)),0)","v":0}]
["CMAU 066536/1","2016-01-11","DAGAA406645      ",null,"ETS CORDIER - CHATEAU LACROIX DE QUEYNAC SC (BORDEAUX ROUGE)",0,0,0,0,"soldé",null,13.766666666666667,{"$f":"IFERROR(IF(J732=\"soldé\",0,VLOOKUP(SOLDE!C677,#REF!,8,0)),0)","v":0}]
["CMAU 066536/1","2016-01-11","021500203       ",null,"PAUL JABOULET AINE - COTES DU RHONE \"PARALLELE 45\" rouge",0,0,0,0,"soldé",null,13.766666666666667,{"$f":"IFERROR(IF(J733=\"soldé\",0,VLOOKUP(SOLDE!C678,#REF!,8,0)),0)","v":0}]
["CMAU 066536/1","2016-01-11","021310010          ",null,"LES GRANDS CHAISE DE France - CHEVALIER A LICHINE MERLO ROUGE (VIN DE PAYS)",0,0,0,0,"soldé",null,13.766666666666667,{"$f":"IFERROR(IF(J734=\"soldé\",0,VLOOKUP(SOLDE!C679,#REF!,8,0)),0)","v":0}]
["CMAU 066536/1","2016-01-11","021900027",null,"LES GRANDS CHAIS DE France - VIN DU MAROC DOMMAINE TOULAL GUERROUANE ROSE",0,0,0,0,"soldé",null,13.766666666666667,{"$f":"IFERROR(IF(J735=\"soldé\",0,VLOOKUP(SOLDE!C680,#REF!,8,0)),0)","v":0}]
["CMAU 066536/1","2016-01-11","021900029     ",null,"LES GRANDS CHAIS DE France - WHISKY BOURBON JACK DANIEL'S 1L",12,120,10,120,10,null,13.766666666666667,{"$f":"IFERROR(IF(J736=\"soldé\",0,VLOOKUP(SOLDE!C681,#REF!,8,0)),0)","v":0}]
["CMAU 066536/1","2016-01-11","021900031   ",null,"LES GRANDS CHAIS DE France - VIN DU MAROC DOMMAINE TOULAL GUERROUANE ROUGE",0,0,0,0,"soldé",null,13.766666666666667,{"$f":"IFERROR(IF(J737=\"soldé\",0,VLOOKUP(SOLDE!C682,#REF!,8,0)),0)","v":0}]
["CMAU 066536/1","2016-01-11","021310500     ",null,"SARL CPESO - CAHORS (MARQUIS D'OLT)",0,0,0,0,"soldé",null,13.766666666666667,{"$f":"IFERROR(IF(J738=\"soldé\",0,VLOOKUP(SOLDE!C683,#REF!,8,0)),0)","v":0}]
["CMAU 066536/1","2016-01-11","021310317          ",null,"SARL CPESO - SAINT CHINIAN ROUGE (COL DE L'ORB)",0,0,0,0,"soldé",null,13.766666666666667,{"$f":"IFERROR(IF(J739=\"soldé\",0,VLOOKUP(SOLDE!C684,#REF!,8,0)),0)","v":0}]
["CMAU 066536/1","2016-01-11","021310325      ",null,"SARL CPESO - COTES DE BLAYE (CH CAZEAUX )",{"$f":"IFERROR(G740/H740,0)","v":0},0,0,0,"soldé",null,13.766666666666667,{"$f":"IFERROR(IF(J740=\"soldé\",0,VLOOKUP(SOLDE!C685,#REF!,8,0)),0)","v":0}]
["CMAU 066536/1","2016-01-11","021320300        ",null,"SARL CPESO - BORDEAUX ROUGE (MARQUIS DE BALMONT)",0,0,0,0,"soldé",null,13.766666666666667,{"$f":"IFERROR(IF(J741=\"soldé\",0,VLOOKUP(SOLDE!C686,#REF!,8,0)),0)","v":0}]
["CMAU 066536/1","2016-01-11","021310402   ",null,"SARL CPESO - BORDEAUX ROUGE (CHÂTEAU PAGUENEAU)",0,0,0,0,"soldé",null,13.766666666666667,{"$f":"IFERROR(IF(J742=\"soldé\",0,VLOOKUP(SOLDE!C687,#REF!,8,0)),0)","v":0}]
["CMAU 066536/1","2016-01-11","021500269     ",null,"UNION DES VIGNERONS DES COTES DU RHONE - IGP MEDITERANNEE BLANC ",4,52,13,52,13,null,13.766666666666667,{"$f":"IFERROR(IF(J743=\"soldé\",0,VLOOKUP(SOLDE!C688,#REF!,8,0)),0)","v":0}]
["CMAU 066536/1","2016-01-11","021500270   ",null,"UNION DES VIGNERONS DES COTES DU RHONE - IGP MEDITERANNEE ROSE",0,0,0,0,"soldé",null,13.766666666666667,{"$f":"IFERROR(IF(J744=\"soldé\",0,VLOOKUP(SOLDE!C689,#REF!,8,0)),0)","v":0}]
["CMAU 066536/1","2016-01-11","021500271     ",null,"UNION DES VIGNERONS DES COTES DU RHONE - IGP MEDITERANNEE  ROUGE",0,0,0,0,"soldé",null,13.766666666666667,{"$f":"IFERROR(IF(J745=\"soldé\",0,VLOOKUP(SOLDE!C690,#REF!,8,0)),0)","v":0}]
["CMAU 066536/1","2016-01-11","021500269     ",null,"UNION DES VIGNERONS DES COTES DU RHONE - IGP MEDITERANNEE BLANC",0,0,0,0,"soldé",null,13.766666666666667,{"$f":"IFERROR(IF(J746=\"soldé\",0,VLOOKUP(SOLDE!C691,#REF!,8,0)),0)","v":0}]
["CMAU 066536/1","2016-01-11","021500270   ",null,"UNION DES VIGNERONS DES COTES DU RHONE - IGP MEDITERANNEE ROSE",0,0,0,0,"soldé",null,13.766666666666667,{"$f":"IFERROR(IF(J747=\"soldé\",0,VLOOKUP(SOLDE!C692,#REF!,8,0)),0)","v":0}]
["CMAU 066536/1","2016-01-11","021500271     ",null,"UNION DES VIGNERONS DES COTES DU RHONE - IGP MEDITERANNEE  ROUGE",0,0,0,0,"soldé",null,13.766666666666667,{"$f":"IFERROR(IF(J748=\"soldé\",0,VLOOKUP(SOLDE!C693,#REF!,8,0)),0)","v":0}]
["INKU 261026/2","2016-02-03","FABAA046447",null,"SODIBEL - CANTI PROSECCO",6,222,37,222,37,null,13,{"$f":"IFERROR(IF(J749=\"soldé\",0,VLOOKUP(SOLDE!C694,#REF!,8,0)),0)","v":0}]
["TEMU 330930/2","2016-02-18","021310010",null,"GRANDS CHAIS DE France - CHAVLIER A LICHINE ROUGE",0,0,0,0,"soldé",null,12.5,{"$f":"IFERROR(IF(J750=\"soldé\",0,VLOOKUP(SOLDE!C695,#REF!,8,0)),0)","v":0}]
["TEMU 330930/2","2016-02-18","021900027",null,"GRANDS CHAIS DE France - VIN DU MAROC DOMAINE TOULAL ROSE",0,0,0,0,"soldé",null,12.5,{"$f":"IFERROR(IF(J751=\"soldé\",0,VLOOKUP(SOLDE!C696,#REF!,8,0)),0)","v":0}]
["TEMU 330930/2","2016-02-18","021900029",null,"GRANDS CHAIS DE France - WHISKY BOURBON JACK DANIEL'S 1L",12,312,26,312,26,null,12.5,{"$f":"IFERROR(IF(J752=\"soldé\",0,VLOOKUP(SOLDE!C697,#REF!,8,0)),0)","v":0}]
["TEMU 330930/2","2016-02-18","021900030",null,"GRANDS CHAIS DE France - MERCUREY ROUGE - LA DOMAL",0,0,0,0,"soldé",null,12.5,{"$f":"IFERROR(IF(J753=\"soldé\",0,VLOOKUP(SOLDE!C698,#REF!,8,0)),0)","v":0}]
["TEMU 330930/2","2016-02-18","021900031",null,"GRANDS CHAIS DE France - VIN DU MAROC DOMAINE TOULAL ROUGE",0,0,0,0,"soldé",null,12.5,{"$f":"IFERROR(IF(J754=\"soldé\",0,VLOOKUP(SOLDE!C699,#REF!,8,0)),0)","v":0}]
["TEMU 330930/2","2016-02-18","022800001",null,"BOUQUET DE LOIRE - BOUQUET DE MERLOT",0,0,0,0,"soldé",null,12.5,{"$f":"IFERROR(IF(J755=\"soldé\",0,VLOOKUP(SOLDE!C700,#REF!,8,0)),0)","v":0}]
["TEMU 330930/2","2016-02-18","022800007",null,"BOUQUET DE LOIRE - SAINT NICOLAS DE BOURGEUIL DOM GODEFROY",0,0,0,0,"soldé",null,12.5,{"$f":"IFERROR(IF(J756=\"soldé\",0,VLOOKUP(SOLDE!C701,#REF!,8,0)),0)","v":0}]
["TEMU 330930/2","2016-02-18","021300001",null,"CHAMPAGNE BOULARD BAUQUAIRE - CHAMPAGNE ROSE",0,0,0,0,"soldé",null,12.5,{"$f":"IFERROR(IF(J757=\"soldé\",0,VLOOKUP(SOLDE!C702,#REF!,8,0)),0)","v":0}]
["TEMU 330930/2","2016-02-18","021300007",null,"CHAMPAGNE BOULARD BAUQUAIRE - MAGNUM BRUT GRANDE RESERVE",0,0,0,0,"soldé",null,12.5,{"$f":"IFERROR(IF(J758=\"soldé\",0,VLOOKUP(SOLDE!C703,#REF!,8,0)),0)","v":0}]
["TEMU 330930/2","2016-02-18","021300009",null,"CHAMPAGNE BOULARD BAUQUAIRE - CHAMPAGNE BRUT TRADITION",0,0,0,0,"soldé",null,12.5,{"$f":"IFERROR(IF(J759=\"soldé\",0,VLOOKUP(SOLDE!C704,#REF!,8,0)),0)","v":0}]
["TEMU 330930/2","2016-02-18","021310500",null,"SARL CPESO - CAHORS ROUGE - MARQUIS D'OLT",6,60,10,60,10,null,12.5,{"$f":"IFERROR(IF(J760=\"soldé\",0,VLOOKUP(SOLDE!C705,#REF!,8,0)),0)","v":0}]
["TEMU 330930/2","2016-02-18","021310317",null,"SARL CPESO - SAINT CHINIAN ROUGE - COL DE L'ORB",0,0,0,0,"soldé",null,12.5,{"$f":"IFERROR(IF(J761=\"soldé\",0,VLOOKUP(SOLDE!C706,#REF!,8,0)),0)","v":0}]
["TEMU 330930/2","2016-02-18","021310325",null,"SARL CPESO - COTES DE BLAYE - CH CAZEAUX",0,0,0,0,"soldé",null,12.5,{"$f":"IFERROR(IF(J762=\"soldé\",0,VLOOKUP(SOLDE!C707,#REF!,8,0)),0)","v":0}]
["TEMU 330930/2","2016-02-18","021320300",null,"SARL CPESO - BORDEAUX ROUGE - MARQUIS DE BALMONT",0,0,0,0,"soldé",null,12.5,{"$f":"IFERROR(IF(J763=\"soldé\",0,VLOOKUP(SOLDE!C708,#REF!,8,0)),0)","v":0}]
["TEMU 330930/2","2016-02-18","021310402",null,"SARL CPESO - BORDEAUX ROUGE - CHÂTEAU PAGUENEAU",0,0,0,0,"soldé",null,12.5,{"$f":"IFERROR(IF(J764=\"soldé\",0,VLOOKUP(SOLDE!C709,#REF!,8,0)),0)","v":0}]
["TEMU 330930/2","2016-02-18","DAGAA406645",null,"ETS CORDIER - CHÂTEAU LA CROIX DE QUEYNAC SC",0,0,0,0,"soldé",null,12.5,{"$f":"IFERROR(IF(J765=\"soldé\",0,VLOOKUP(SOLDE!C710,#REF!,8,0)),0)","v":0}]
["TEMU 330930/2","2016-02-18","DAGAA304033",null,"ETS CORDIER - CHÂTEAU ANDRON \"FUT\" CC",0,0,0,0,"soldé",null,12.5,{"$f":"IFERROR(IF(J766=\"soldé\",0,VLOOKUP(SOLDE!C711,#REF!,8,0)),0)","v":0}]
["TEMU 330930/2","2016-02-18","021500203",null,"PAUL JABOULET AINE - COTES DU RHONE \"PARALLELE 45\" ROUGE",0,0,0,0,"soldé",null,12.5,{"$f":"IFERROR(IF(J767=\"soldé\",0,VLOOKUP(SOLDE!C712,#REF!,8,0)),0)","v":0}]
["TEMU 330930/2","2016-02-18","021310250",null,"LES MAITRES VIGNERONS - GOURMANDISE ROUGE",0,0,0,{"$f":"G768","v":0},"soldé",null,12.5,{"$f":"IFERROR(IF(J768=\"soldé\",0,VLOOKUP(SOLDE!C713,#REF!,8,0)),0)","v":0}]
["TEMU 330930/2","2016-02-18","021310256 ",null,"LES MAITRES VIGNERONS - GOURMANDISE ROSE",0,0,0,0,"soldé",null,12.5,{"$f":"IFERROR(IF(J769=\"soldé\",0,VLOOKUP(SOLDE!C714,#REF!,8,0)),0)","v":0}]
["MSCU 017755/9","2016-03-03","022300600 ",null,"SAVANNA DRY CIDER NRB BBE - 33CL",0,0,0,0,{"$f":"IF(H770<=0,\"soldé\",H770)","v":"soldé"},null,{"$f":"(TODAY()-B770)/30","v":12.033333333333333},{"$f":"IFERROR(IF(J770=\"soldé\",0,VLOOKUP(SOLDE!C715,#REF!,8,0)),0)","v":0}]
["MSCU 017755/9","2016-03-03","022300567  ",null,"NEETHLINGSHOF GEWURZTRAMINER SAVIN - 75 CL",6,84,14,84,14,null,12.033333333333333,{"$f":"IFERROR(IF(J771=\"soldé\",0,VLOOKUP(SOLDE!C716,#REF!,8,0)),0)","v":0}]
["MSCU 017755/9","2016-03-03","022300404      ",null,"FLEUR DU CAP SAUVIGNON BLANC 2015",6,180,30,180,30,null,12.033333333333333,{"$f":"IFERROR(IF(J772=\"soldé\",0,VLOOKUP(SOLDE!C717,#REF!,8,0)),0)","v":0}]
["MSCU 017755/9","2016-03-03","022300402",null,"FLEUR DU CAP MERLOT 2013",6,120,20,120,20,null,12.033333333333333,{"$f":"IFERROR(IF(J773=\"soldé\",0,VLOOKUP(SOLDE!C718,#REF!,8,0)),0)","v":0}]
["MSCU 017755/9","2016-03-03","022300401",null,"FLEUR DU CAP CHARDONNAY SAVIN 2015",0,0,0,0,"soldé",null,12.033333333333333,{"$f":"IFERROR(IF(J774=\"soldé\",0,VLOOKUP(SOLDE!C719,#REF!,8,0)),0)","v":0}]
["MSCU 017755/9","2016-03-03","022300341  ",null,"DROSTDY-HOF CHARDONNAY SAVIN 2015",0,0,0,0,"soldé",null,12.033333333333333,{"$f":"IFERROR(IF(J775=\"soldé\",0,VLOOKUP(SOLDE!C720,#REF!,8,0)),0)","v":0}]
["MSCU 017755/9","2016-03-03","021200518    ",null,"OBIKWA PINOTAGE SAVIN 2014",6,120,20,120,20,null,12.033333333333333,{"$f":"IFERROR(IF(J776=\"soldé\",0,VLOOKUP(SOLDE!C721,#REF!,8,0)),0)","v":0}]
["MSCU 017755/9","2016-03-03","021200517  ",null,"OBIKWA CABERNET SAUVIGNON SAVIN 2015",0,0,0,0,"soldé",null,12.033333333333333,{"$f":"IFERROR(IF(J777=\"soldé\",0,VLOOKUP(SOLDE!C722,#REF!,8,0)),0)","v":0}]
["MSCU 017755/9","2016-03-03","021200516",null,"OBIKWA CHENIN BLANC SAVIN 2014",6,420,70,420,70,null,12.033333333333333,{"$f":"IFERROR(IF(J778=\"soldé\",0,VLOOKUP(SOLDE!C723,#REF!,8,0)),0)","v":0}]
["MSCU 017755/9","2016-03-03","021200514  ",null,"OBIKWA SAUVIGNON BLANC SAVIN 2015",0,0,0,0,"soldé",null,12.033333333333333,{"$f":"IFERROR(IF(J779=\"soldé\",0,VLOOKUP(SOLDE!C724,#REF!,8,0)),0)","v":0}]
["MSCU 017755/9","2016-03-03","021200511",null,"OBIKWA CHARDONNAY SAVIN 2015",0,0,0,0,"soldé",null,12.033333333333333,{"$f":"IFERROR(IF(J780=\"soldé\",0,VLOOKUP(SOLDE!C725,#REF!,8,0)),0)","v":0}]
["MSCU 017755/9","2016-03-03","021200404",null,"ZONNEBLOEM SHIRAZ 2014",6,294,49,294,49,null,12.033333333333333,{"$f":"IFERROR(IF(J781=\"soldé\",0,VLOOKUP(SOLDE!C726,#REF!,8,0)),0)","v":0}]
["MSCU 017755/9","2016-03-03","021100340  ",null,"NEDERBURG WINEMASTERS RIESLING SAVIN 2015",0,0,0,0,"soldé",null,12.033333333333333,{"$f":"IFERROR(IF(J782=\"soldé\",0,VLOOKUP(SOLDE!C727,#REF!,8,0)),0)","v":0}]
["MSCU 017755/9","2016-03-03","0021100118 ",null,"NEDERBURG ROSE SAVIN 2015 - FOUNDATION",0,0,0,0,"soldé",null,12.033333333333333,{"$f":"IFERROR(IF(J783=\"soldé\",0,VLOOKUP(SOLDE!C728,#REF!,8,0)),0)","v":0}]
["MSCU 017755/9","2016-03-03","021100301",null,"NEDERBURG WINEMASTERS SAUVIGNON BLANC SAVIN 2015",0,0,0,0,"soldé",null,12.033333333333333,{"$f":"IFERROR(IF(J784=\"soldé\",0,VLOOKUP(SOLDE!C729,#REF!,8,0)),0)","v":0}]
["MSCU 017755/9","2016-03-03","021100300 ",null,"NEDERBURG CUVEE BRUT SPARKLING WINE",12,276,23,276,23,null,12.033333333333333,{"$f":"IFERROR(IF(J785=\"soldé\",0,VLOOKUP(SOLDE!C730,#REF!,8,0)),0)","v":0}]
["MSCU 017755/9","2016-03-03","021100119 ",null,"NEDERBURG WINEMASTERS SHIRAZ 2013",0,0,0,0,"soldé",null,12.033333333333333,{"$f":"IFERROR(IF(J786=\"soldé\",0,VLOOKUP(SOLDE!C731,#REF!,8,0)),0)","v":0}]
["MSCU 017755/9","2016-03-03","021100116    ",null,"NEDERBURG WINEMASTERS CABERNET SAUVIGNON 2013",6,120,20,120,20,null,12.033333333333333,{"$f":"IFERROR(IF(J787=\"soldé\",0,VLOOKUP(SOLDE!C732,#REF!,8,0)),0)","v":0}]
["MSCU 017755/9","2016-03-03","021100113",{"$f":"+A788","v":"MSCU 017755/9"},"NEDERBURG WINEMASTERS SPECIAL LATE HARVEST 2015",6,300,50,300,50,null,12.033333333333333,{"$f":"IFERROR(IF(J788=\"soldé\",0,VLOOKUP(SOLDE!C733,#REF!,8,0)),0)","v":0}]
["MSCU 017755/9","2016-03-03","EAAAA001284 ",null,"L'AVENIR - PINOTAGE ROSÉ FAR AND NEAR ",6,240,40,240,40,null,12.033333333333333,{"$f":"IFERROR(IF(J789=\"soldé\",0,VLOOKUP(SOLDE!C734,#REF!,8,0)),0)","v":0}]
["CMAU 191794/0","2016-03-15","022800100",null,"SARL CIDRES BIGOUD - CIDRE LE BRUN ARTISANAL",0,0,0,0,"soldé",null,11.633333333333333,{"$f":"IFERROR(IF(J790=\"soldé\",0,VLOOKUP(SOLDE!C735,#REF!,8,0)),0)","v":0}]
["CMAU 191794/0","2016-03-15","021101003",null,"CAMUS - BERNEROY CALVADOS FINE",0,0,0,0,"soldé",null,11.633333333333333,{"$f":"IFERROR(IF(J791=\"soldé\",0,VLOOKUP(SOLDE!C736,#REF!,8,0)),0)","v":0}]
["CMAU 191794/0","2016-03-15","021310207",null,"LES DOMAINES AURIOL - DOMAINE LA CROIX D ALINE ROUGE / AOP SAINT CHINIAN",0,0,0,0,"soldé",null,11.633333333333333,{"$f":"IFERROR(IF(J792=\"soldé\",0,VLOOKUP(SOLDE!C737,#REF!,8,0)),0)","v":0}]
["CMAU 191794/0","2016-03-15","021300002",null,"BOULARD BAUQUAIRE - CHAMPAGNE GRANDE RESERVE",0,0,0,0,"soldé",null,11.633333333333333,{"$f":"IFERROR(IF(J793=\"soldé\",0,VLOOKUP(SOLDE!C738,#REF!,8,0)),0)","v":0}]
["CMAU 191794/0","2016-03-15","021300009",null,"BOULARD BAUQUAIRE - CHAMPAGNE BRUT TRADITION",6,30,5,30,5,null,11.633333333333333,{"$f":"IFERROR(IF(J794=\"soldé\",0,VLOOKUP(SOLDE!C739,#REF!,8,0)),0)","v":0}]
["CMAU 191794/0","2016-03-15","021300006",null,"BOULARD BAUQUAIRE - CHAMPAGNE TRADITION DEMI SEC",0,0,0,0,"soldé",null,11.633333333333333,{"$f":"IFERROR(IF(J795=\"soldé\",0,VLOOKUP(SOLDE!C740,#REF!,8,0)),0)","v":0}]
["CMAU 191794/0","2016-03-15","021300001",null,"BOULARD BAUQUAIRE - CHAMPAGNE ROSE",0,0,0,0,"soldé",null,11.633333333333333,{"$f":"IFERROR(IF(J796=\"soldé\",0,VLOOKUP(SOLDE!C741,#REF!,8,0)),0)","v":0}]
["CMAU 191794/0","2016-03-15","021300004",null,"BOULARD BAUQUAIRE - CUVEE MELANIE",0,0,0,0,"soldé",null,11.633333333333333,{"$f":"IFERROR(IF(J797=\"soldé\",0,VLOOKUP(SOLDE!C742,#REF!,8,0)),0)","v":0}]
["CMAU 191794/0","2016-03-15","021300005",null,"BOULARD BAUQUAIRE - GRANDE RESERVE DEMIES BOUTEILLES/ 37,5 CL",0,0,0,0,"soldé",null,11.633333333333333,{"$f":"IFERROR(IF(J798=\"soldé\",0,VLOOKUP(SOLDE!C743,#REF!,8,0)),0)","v":0}]
["CMAU 191794/0","2016-03-15","021300007",null,"BOULARD BAUQUAIRE - MAGNUM BRUT GRANDE RESERVE",3,84,28,84,28,null,11.633333333333333,{"$f":"IFERROR(IF(J799=\"soldé\",0,VLOOKUP(SOLDE!C744,#REF!,8,0)),0)","v":0}]
["CMAU 191794/0","2016-03-15","021300008",null,"BOULARD BAUQUAIRE - VIEILLES VIGNES TREPAIL",0,0,0,0,"soldé",null,11.633333333333333,{"$f":"IFERROR(IF(J800=\"soldé\",0,VLOOKUP(SOLDE!C745,#REF!,8,0)),0)","v":0}]
["CMAU 191794/0","2016-03-15","022800001",null,"BOUQUET DE LOIRE - BOUQUET DE MERLOT / VON DE PAYS D OC",0,0,0,0,"soldé",null,11.633333333333333,{"$f":"IFERROR(IF(J801=\"soldé\",0,VLOOKUP(SOLDE!C746,#REF!,8,0)),0)","v":0}]
["CMAU 191794/0","2016-03-15","DCJAA003418",null,"LAUDUC GRANDEAU - CHÂTEAU LAUDUC CLASSIC 2014 / BORDEAUX ROUGE",0,0,0,0,"soldé",null,11.633333333333333,{"$f":"IFERROR(IF(J802=\"soldé\",0,VLOOKUP(SOLDE!C747,#REF!,8,0)),0)","v":0}]
["CMAU 191794/0","2016-03-15","DCJAA002992",null,"LAUDUC GRANDEAU - CHÂTEAU LAUDUC CLASSIC 2014 / BORDEAUX BLANC",0,0,0,0,"soldé",null,11.633333333333333,{"$f":"IFERROR(IF(J803=\"soldé\",0,VLOOKUP(SOLDE!C748,#REF!,8,0)),0)","v":0}]
["CMAU 191794/0","2016-03-15","021310010",null,"GRANDS CHAIS DE France - CHAVALIER A LICHINE MERLO / ROUGE",{"$f":"IFERROR(G804/H804,0)","v":0},0,0,0,"soldé",null,11.633333333333333,{"$f":"IFERROR(IF(J804=\"soldé\",0,VLOOKUP(SOLDE!C749,#REF!,8,0)),0)","v":0}]
["CMAU 191794/0","2016-03-15","021900027",null,"GRANDS CHAIS DE France - DOMAINE TOULAL GUERROUANE / ROSE",0,0,0,0,"soldé",null,11.633333333333333,{"$f":"IFERROR(IF(J805=\"soldé\",0,VLOOKUP(SOLDE!C750,#REF!,8,0)),0)","v":0}]
["CMAU 191794/0","2016-03-15","021900012",null,"GRANDS CHAIS DE France - WHISKY BOURBON JACK DANIEL'S - 70 CL",0,0,0,0,"soldé",null,11.633333333333333,{"$f":"IFERROR(IF(J806=\"soldé\",0,VLOOKUP(SOLDE!C751,#REF!,8,0)),0)","v":0}]
["CMAU 191794/0","2016-03-15","021900029",null,"GRANDS CHAIS DE France - WHISKY BOURBON JACK DANIEL'S - 1 L",12,240,20,240,20,null,11.633333333333333,{"$f":"IFERROR(IF(J807=\"soldé\",0,VLOOKUP(SOLDE!C752,#REF!,8,0)),0)","v":0}]
["CMAU 191794/0","2016-03-15","021900415",null,"LACHETEAU - CHINON ROUGE / M MARTIN LES BERNIERES",0,0,0,0,"soldé",null,11.633333333333333,{"$f":"IFERROR(IF(J808=\"soldé\",0,VLOOKUP(SOLDE!C753,#REF!,8,0)),0)","v":0}]
["CMAU 191794/0","2016-03-15","021900425",null,"LACHETEAU - POUILLY FUME / BLANC",0,0,0,0,"soldé",null,11.633333333333333,{"$f":"IFERROR(IF(J809=\"soldé\",0,VLOOKUP(SOLDE!C754,#REF!,8,0)),0)","v":0}]
["CMAU 191794/0","2016-03-15","021900207",null,"LACHETEAU - BOURGUEIL ROUGE / M MARTIN LE PREVOT",0,0,0,0,"soldé",null,11.633333333333333,{"$f":"IFERROR(IF(J810=\"soldé\",0,VLOOKUP(SOLDE!C755,#REF!,8,0)),0)","v":0}]
["CMAU 191794/0","2016-03-15","021900110",null,"LACHETEAU - TOURAINE / M MARTIN LE CLOUQUIN",0,0,0,0,"soldé",null,11.633333333333333,{"$f":"IFERROR(IF(J811=\"soldé\",0,VLOOKUP(SOLDE!C756,#REF!,8,0)),0)","v":0}]
["CMAU 191794/0","2016-03-15","024100001",null,"UCCOAR SAS - ALLEE DES FRENES / BORDEAUX ROUGE",6,150,25,150,25,null,11.633333333333333,{"$f":"IFERROR(IF(J812=\"soldé\",0,VLOOKUP(SOLDE!C757,#REF!,8,0)),0)","v":0}]
["CMAU 191794/0","2016-03-15","022600100",null,"HENRY FESSY - BROUILLY",0,0,0,0,"soldé",null,11.633333333333333,{"$f":"IFERROR(IF(J813=\"soldé\",0,VLOOKUP(SOLDE!C758,#REF!,8,0)),0)","v":0}]
["CMAU 191794/0","2016-03-15","022600102",null,"HENRY FESSY - MOULIN A VENT",0,0,0,0,"soldé",null,11.633333333333333,{"$f":"IFERROR(IF(J814=\"soldé\",0,VLOOKUP(SOLDE!C759,#REF!,8,0)),0)","v":0}]
["CMAU 191794/0","2016-03-15","022600103",null,"HENRY FESSY - SAINT AMOUR",0,0,0,0,"soldé",null,11.633333333333333,{"$f":"IFERROR(IF(J815=\"soldé\",0,VLOOKUP(SOLDE!C760,#REF!,8,0)),0)","v":0}]
["CMAU 191794/0","2016-03-15","021900560",null,"LOUIS LATOUR - PINOT NOIR BOURGOGNE",0,0,0,0,"soldé",null,11.633333333333333,{"$f":"IFERROR(IF(J816=\"soldé\",0,VLOOKUP(SOLDE!C761,#REF!,8,0)),0)","v":0}]
["CMAU 191794/0","2016-03-15","021900501",null,"PERNOD RICARD - RICARD / 1L",12,240,20,240,20,null,11.633333333333333,{"$f":"IFERROR(IF(J817=\"soldé\",0,VLOOKUP(SOLDE!C762,#REF!,8,0)),0)","v":0}]
["CMAU 191794/0","2016-03-15","021900503-6",null,"PERNOD RICARD - CLAN CAMPBELL 70 CL x6",6,24,4,24,4,null,11.633333333333333,{"$f":"IFERROR(IF(J818=\"soldé\",0,VLOOKUP(SOLDE!C763,#REF!,8,0)),0)","v":0}]
["CMAU 191794/0","2016-03-15","021900505",null,"PERNOD RICARD - CHIVAS REGAL WISKY 12 YO / ETUI",12,60,5,60,5,null,11.633333333333333,{"$f":"IFERROR(IF(J819=\"soldé\",0,VLOOKUP(SOLDE!C764,#REF!,8,0)),0)","v":0}]
["CMAU 191794/0","2016-03-15","021900506",null,"PERNOD RICARD - CHIVAS REGAL WISKY 18 YO ",6,6,1,6,1,null,11.633333333333333,{"$f":"IFERROR(IF(J820=\"soldé\",0,VLOOKUP(SOLDE!C765,#REF!,8,0)),0)","v":0}]
["CMAU 191794/0","2016-03-15","021900652",null,"PERNOD RICARD - CHIVAS REGAL WISKY 18 YO / 1L ETUI",6,30,5,30,5,null,11.633333333333333,{"$f":"IFERROR(IF(J821=\"soldé\",0,VLOOKUP(SOLDE!C766,#REF!,8,0)),0)","v":0}]
["CMAU 191794/0","2016-03-15","IAHAA113127",null,"PERNOD RICARD - BALLANTINE'S FINEST WHISKY ",12,276,23,276,23,null,11.633333333333333,{"$f":"IFERROR(IF(J822=\"soldé\",0,VLOOKUP(SOLDE!C767,#REF!,8,0)),0)","v":0}]
["CMAU 191794/0","2016-03-15","IAHAA110225",null,"PERNOD RICARD - BALLANTINE'S WISKY 12 YO / ETUI",0,0,0,0,"soldé",null,11.633333333333333,{"$f":"IFERROR(IF(J823=\"soldé\",0,VLOOKUP(SOLDE!C768,#REF!,8,0)),0)","v":0}]
["CMAU 191794/0","2016-03-15","021900525",null,"PERNOD RICARD -MUMM CHAMPAGNE CORDON ROUGE",6,60,10,60,10,null,11.633333333333333,{"$f":"IFERROR(IF(J824=\"soldé\",0,VLOOKUP(SOLDE!C769,#REF!,8,0)),0)","v":0}]
["GESU 666717/1","2016-04-20","021500267",null,"UNIONS DE VIGNERONS C.R CELLIER DES DAUPHINS - COTES DU RHONE CHÂTEAU DE L'ESTAGNOL ROUGE",0,0,0,0,"soldé",null,10.433333333333334,{"$f":"IFERROR(IF(J825=\"soldé\",0,VLOOKUP(SOLDE!C770,#REF!,8,0)),0)","v":0}]
["GESU 666717/1","2016-04-20","021500269",null,"UNION DES VIGNERONS C.R CELLIER DES DAUPHINS -IGP MEDITERRANEE BLANC BIB 5L",4,64,16,64,16,null,10.433333333333334,{"$f":"IFERROR(IF(J826=\"soldé\",0,VLOOKUP(SOLDE!C771,#REF!,8,0)),0)","v":0}]
["GESU 666717/1","2016-04-20","021500270",null,"UNION DES VIGNERONS C.R CELLIER DES DAUPHINS -IGP MEDITERRANEE ROSE BIB 5L",0,0,0,0,"soldé",null,10.433333333333334,{"$f":"IFERROR(IF(J827=\"soldé\",0,VLOOKUP(SOLDE!C772,#REF!,8,0)),0)","v":0}]
["GESU 666717/1","2016-04-20","021310255",null,"MAITRES VIGNERONS - SAINT ROCH ROSE 2014",12,120,10,120,10,null,10.433333333333334,{"$f":"IFERROR(IF(J828=\"soldé\",0,VLOOKUP(SOLDE!C773,#REF!,8,0)),0)","v":0}]
["GESU 666717/1","2016-04-20","021310250",null,"MAITRES VIGNERONS - GOURMANDISE ROUGE",12,84,7,84,7,{"$f":"J829-M829-N829-O829-P829-Q829-R829","v":7},10.433333333333334,{"$f":"IFERROR(IF(J829=\"soldé\",0,VLOOKUP(SOLDE!C774,#REF!,8,0)),0)","v":0}]
["GESU 666717/1","2016-04-20","DCAAA000379",null,"HOREAU BEYLOT - CH. HAUT CLOQUET POMEROL 2011",0,0,0,0,"soldé",null,10.433333333333334,{"$f":"IFERROR(IF(J830=\"soldé\",0,VLOOKUP(SOLDE!C775,#REF!,8,0)),0)","v":0}]
["GESU 666717/1","2016-04-20","DCAAA610256",null,"HOREAU BEYLOT - CH. MARTINET GC SAINT EMILION GRAND CRU",0,0,0,0,"soldé",null,10.433333333333334,{"$f":"IFERROR(IF(J831=\"soldé\",0,VLOOKUP(SOLDE!C776,#REF!,8,0)),0)","v":0}]
["GESU 666717/1","2016-04-20","DCAAA000676",null,"HOREAU BEYLOT - CH. HAUT CLOQUET POMEROL 2013",0,0,0,{"$f":"G832","v":0},"soldé",null,10.433333333333334,{"$f":"IFERROR(IF(J832=\"soldé\",0,VLOOKUP(SOLDE!C777,#REF!,8,0)),0)","v":0}]
["GESU 666717/1","2016-04-20","021500203",null,"PAUL JABOULET - COTES DU RHONE PARALLELE 45 ROUGE",6,90,15,90,15,{"$f":"J833-M833-N833-O833-P833-Q833-R833","v":9},10.433333333333334,6]
["GESU 666717/1","2016-04-20","021310303",null,"SARL CPESO - IGP CITE CARCASSONNE ROUGE, DOMAINE AUZIAS CUVEE MONSIEUR",0,0,0,0,{"$f":"IF(H834<=0,\"soldé\",H834)","v":"soldé"},null,{"$f":"(TODAY()-B834)/30","v":10.433333333333334},{"$f":"IFERROR(IF(J834=\"soldé\",0,VLOOKUP(SOLDE!C779,#REF!,8,0)),0)","v":0}]
["GESU 666717/1","2016-04-20","021310304",null,"SARL CPESO - VDP CARCASSONNE ROSE, DOMAINE AUZIAS",0,0,0,0,"soldé",null,10.433333333333334,{"$f":"IFERROR(IF(J835=\"soldé\",0,VLOOKUP(SOLDE!C780,#REF!,8,0)),0)","v":0}]
["GESU 666717/1","2016-04-20","021310317",null,"SARL CPESO - SAINT CHINIAN ROUGE, COL DE L'ORB",6,54,9,54,9,null,10.433333333333334,{"$f":"IFERROR(IF(J836=\"soldé\",0,VLOOKUP(SOLDE!C781,#REF!,8,0)),0)","v":0}]
["GESU 666717/1","2016-04-20","DABAA502717",null,"SARL CPESO - BORDEAUX ROUGE, CH. LAMOTHE ST GERMAIN",6,120,20,120,20,null,10.433333333333334,{"$f":"IFERROR(IF(J837=\"soldé\",0,VLOOKUP(SOLDE!C782,#REF!,8,0)),0)","v":0}]
["GESU 666717/1","2016-04-20","DABAA355257",null,"SARL CPESO - BORDEAUX ROUGE, CH. TREILLE DE CANDALE",6,120,20,120,20,null,10.433333333333334,{"$f":"IFERROR(IF(J838=\"soldé\",0,VLOOKUP(SOLDE!C783,#REF!,8,0)),0)","v":0}]
["GESU 666717/1","2016-04-20","021320101",null,"SARL CPESO - BORDEAUX ENTRE DEUX MERS BLANC SEC, CHÂTEAU TREILLE DE CANDALE",0,0,0,0,"soldé",null,10.433333333333334,{"$f":"IFERROR(IF(J839=\"soldé\",0,VLOOKUP(SOLDE!C784,#REF!,8,0)),0)","v":0}]
["GESU 666717/1","2016-04-20","021320300",null,"SARL CPESO - BORDEAUX ROUGE, MARQUIS DE BALMONT",6,102,17,102,17,{"$f":"J840-M840-N840-O840-P840-Q840-R840","v":17},10.433333333333334,{"$f":"IFERROR(IF(J840=\"soldé\",0,VLOOKUP(SOLDE!C785,#REF!,8,0)),0)","v":0}]
["GESU 666717/1","2016-04-20","021310450",null,"SARL CPESO - HAUTES COTES DE BEAUNES BLANC, DOMAINE BERGER RIVES",0,0,0,0,"soldé",null,10.433333333333334,{"$f":"IFERROR(IF(J841=\"soldé\",0,VLOOKUP(SOLDE!C786,#REF!,8,0)),0)","v":0}]
["GESU 666717/1","2016-04-20","DBFAA100018",null,"CHÂTEAU DU TARIQUET - DOMAINE DU TARIQUET CLASSIC  COTES DE GASCOGNE IGP BLANC",6,372,62,372,62,null,10.433333333333334,{"$f":"IFERROR(IF(J842=\"soldé\",0,VLOOKUP(SOLDE!C787,#REF!,8,0)),0)","v":0}]
["GESU 666717/1","2016-04-20","DBFAA100025",null,"CHÂTEAU DU TARIQUET - DOMAINE DU TARIQUET PREMIERES GRIVES  COTES DE GASCOGNE IGP BLANC",6,138,23,138,23,null,10.433333333333334,{"$f":"IFERROR(IF(J843=\"soldé\",0,VLOOKUP(SOLDE!C788,#REF!,8,0)),0)","v":0}]
["GESU 666717/1","2016-04-20","022800100",null,"CIDRES BIGOUD - CIDRE LE BRUN ARTISANAL BRUT",12,120,10,120,10,{"$f":"J844-M844-N844-O844-P844-Q844-R844","v":10},10.433333333333334,{"$f":"IFERROR(IF(J844=\"soldé\",0,VLOOKUP(SOLDE!C789,#REF!,8,0)),0)","v":0}]
["GESU 666717/1","2016-04-20","DAVAA000015",null,"SIMONET FEBVRE - BOURGONE ALIGOTE",12,36,3,36,3,null,10.433333333333334,{"$f":"IFERROR(IF(J845=\"soldé\",0,VLOOKUP(SOLDE!C790,#REF!,8,0)),0)","v":0}]
["GESU 666717/1","2016-04-20","DAGAB001508",null,"CIE VINICOLE BARON EDMOND DE ROTHSCHILD - LES GRANGES 2012, DOMAINES BARONS DE ROTHSCHILD",0,0,0,0,"soldé",null,10.433333333333334,{"$f":"IFERROR(IF(J846=\"soldé\",0,VLOOKUP(SOLDE!C791,#REF!,8,0)),0)","v":0}]
["GESU 666717/1","2016-04-20","021500203",null,"PAUL JABOULET - COTES DU RHONE PARALLELE 45 ROUGE",6,36,6,36,6,{"$f":"J847-M847-N847-O847-P847-Q847-R847","v":0},10.433333333333334,6]
["GESU 666717/1","2016-04-20","021400576",null,"CORDIER - CH. LA CROIX SAINT JACQUES 2014",0,0,0,0,"soldé",null,10.433333333333334,{"$f":"IFERROR(IF(J848=\"soldé\",0,VLOOKUP(SOLDE!C793,#REF!,8,0)),0)","v":0}]
["GESU 666717/1","2016-04-20","DAGAA504471",null,"CORDIER - LA CROIX BACALAN CORDIER",0,0,0,0,"soldé",null,10.433333333333334,{"$f":"IFERROR(IF(J849=\"soldé\",0,VLOOKUP(SOLDE!C794,#REF!,8,0)),0)","v":0}]
["GESU 666717/1","2016-04-20","DAGAA302015",null,"CORDIER - CH. DU GARDE \"LA COTE DE MONS\" CC",6,330,55,330,55,null,10.433333333333334,{"$f":"IFERROR(IF(J850=\"soldé\",0,VLOOKUP(SOLDE!C795,#REF!,8,0)),0)","v":0}]
["GESU 666717/1","2016-04-20","DAGAA304033",null,"CORDIER - CH, ANDRON \"FUT\" CC",6,60,10,60,10,null,10.433333333333334,{"$f":"IFERROR(IF(J851=\"soldé\",0,VLOOKUP(SOLDE!C796,#REF!,8,0)),0)","v":0}]
["GESU 666717/1","2016-04-20","DAGAA502965",null,"CORDIER - CH. FOUGERE LA NOBLEAR.PA.15 CC",0,0,0,0,"soldé",null,10.433333333333334,{"$f":"IFERROR(IF(J852=\"soldé\",0,VLOOKUP(SOLDE!C797,#REF!,8,0)),0)","v":0}]
["CMAU 076556/6","2016-05-09","021300001",null,"BOULARD BAUQUAIRE - CHAMPAGNE ROSE",6,60,10,60,10,null,9.8000000000000007,{"$f":"IFERROR(IF(J853=\"soldé\",0,VLOOKUP(SOLDE!C800,#REF!,8,0)),0)","v":0}]
["CMAU 076556/6","2016-05-09","021300002",null,"BOULARD BAUQUAIRE - CHAMPAGNE GRANDE RESERVE",6,54,9,54,9,null,9.8000000000000007,{"$f":"IFERROR(IF(J854=\"soldé\",0,VLOOKUP(SOLDE!C801,#REF!,8,0)),0)","v":0}]
["CMAU 076556/6","2016-05-09","021300004",null,"BOULARD BAUQUAIRE - CUVEE MELANIE",6,60,10,60,10,null,9.8000000000000007,{"$f":"IFERROR(IF(J855=\"soldé\",0,VLOOKUP(SOLDE!C802,#REF!,8,0)),0)","v":0}]
["CMAU 076556/6","2016-05-09","021300005",null,"BOULARD BAUQUAIRE - CHAMPAGNE GRANDE RESERVE DEMIES BOUTEILLES",6,60,10,60,10,null,9.8000000000000007,{"$f":"IFERROR(IF(J856=\"soldé\",0,VLOOKUP(SOLDE!C803,#REF!,8,0)),0)","v":0}]
["CMAU 076556/6","2016-05-09","021300006",null,"BOULARD BAUQUAIRE - CHAMPAGNE TRADITION DEMI-SEC",6,60,10,60,10,null,9.8000000000000007,{"$f":"IFERROR(IF(J857=\"soldé\",0,VLOOKUP(SOLDE!C804,#REF!,8,0)),0)","v":0}]
["CMAU 076556/6","2016-05-09","021300007",null,"BOULARD BAUQUAIRE - CHAMPAGNE MAGNUM BRUT GRANDE RESERVE",3,21,7,21,7,null,9.8000000000000007,{"$f":"IFERROR(IF(J858=\"soldé\",0,VLOOKUP(SOLDE!C805,#REF!,8,0)),0)","v":0}]
["CMAU 076556/6","2016-05-09","021300009",null,"BOULARD BAUQUAIRE - CHAMPAGNE BRUT TRADITION",6,444,74,444,74,null,9.8000000000000007,{"$f":"IFERROR(IF(J859=\"soldé\",0,VLOOKUP(SOLDE!C806,#REF!,8,0)),0)","v":0}]
["CMAU 076556/6","2016-05-09","022800001",null,"BOUQUET DE LOIRE - BOUQUET MERLOT",6,180,30,180,30,{"$f":"J860-M860-N860-O860-P860-Q860-R860","v":15},9.8000000000000007,15]
["CMAU 076556/6","2016-05-09","022800002",null,"BOUQUET DE LOIRE - BOUQUET DE PINOT NOIR",6,60,10,60,10,null,9.8000000000000007,{"$f":"IFERROR(IF(J861=\"soldé\",0,VLOOKUP(SOLDE!C808,#REF!,8,0)),0)","v":0}]
["CMAU 076556/6","2016-05-09","022800001",null,"BOUQUET DE LOIRE - BOUQUET MERLOT",6,30,5,30,5,{"$f":"J862-M862-N862-O862-P862-Q862-R862","v":0},9.8000000000000007,5]
["CMAU 076556/6","2016-05-09","022800003",null,"BOUQUET DE LOIRE - BOUQUET DE SYRAH ROSE",6,360,60,360,60,null,9.8000000000000007,{"$f":"IFERROR(IF(J863=\"soldé\",0,VLOOKUP(SOLDE!C810,#REF!,8,0)),0)","v":0}]
["CMAU 076556/6","2016-05-09","DAPAA003986",null,"BOUQUET DE LOIRE - COTEAUX DE LAYON DOM. DE LA DUCQUERIE",6,30,5,30,5,null,9.8000000000000007,{"$f":"IFERROR(IF(J864=\"soldé\",0,VLOOKUP(SOLDE!C811,#REF!,8,0)),0)","v":0}]
["CMAU 076556/6","2016-05-09","DCIAA202140",null,"DOMAINE R. DUBOIS - BOURGOGNE HAUTES COTES DE BEAUNE \"LE MONTBATOIS\" BLANC 2014",0,0,0,0,"soldé",null,9.8000000000000007,{"$f":"IFERROR(IF(J865=\"soldé\",0,VLOOKUP(SOLDE!C812,#REF!,8,0)),0)","v":0}]
["CMAU 076556/6","2016-05-09","DCIAA211135",null,"DOMAINE R. DUBOIS - BOURGOGNE PASSETOUTGRAINS ROUGE",6,210,35,210,35,null,9.8000000000000007,{"$f":"IFERROR(IF(J866=\"soldé\",0,VLOOKUP(SOLDE!C813,#REF!,8,0)),0)","v":0}]
["CMAU 076556/6","2016-05-09","DCIAA212149",null,"DOMAINE R. DUBOIS - BOURGOGNE ROUGE PINOT NOIR",6,90,15,90,15,null,9.8000000000000007,{"$f":"IFERROR(IF(J867=\"soldé\",0,VLOOKUP(SOLDE!C814,#REF!,8,0)),0)","v":0}]
["CMAU 076556/6","2016-05-09","DCIAA240135",null,"DOMAINE R. DUBOIS - COTES DE NUIT VILLAGES ROUGE",{"$f":"IFERROR(G868/H868,0)","v":0},0,0,0,"soldé",null,9.8000000000000007,{"$f":"IFERROR(IF(J868=\"soldé\",0,VLOOKUP(SOLDE!C815,#REF!,8,0)),0)","v":0}]
["CMAU 076556/6","2016-05-09","DAGAJ000014",null,"MOULIN DE LA ROQUE - LES ADRETS ROUGE 2013",6,30,5,30,5,null,9.8000000000000007,{"$f":"IFERROR(IF(J869=\"soldé\",0,VLOOKUP(SOLDE!C816,#REF!,8,0)),0)","v":0}]
["CMAU 076556/6","2016-05-09","DAGAJ000021",null,"MOULIN DE LA ROQUE - LES ADRETS ROSE 2014",6,60,10,60,10,null,9.8000000000000007,{"$f":"IFERROR(IF(J870=\"soldé\",0,VLOOKUP(SOLDE!C817,#REF!,8,0)),0)","v":0}]
["CMAU 076556/6","2016-05-09","021500203",null,"PAUL JABOULET - COTES DU RHONE PARALLELE 45 ROUGE",6,120,20,120,20,{"$f":"J871-M871-N871-O871-P871-Q871-R871","v":20},9.8000000000000007,0]
["CMAU 076556/6","2016-05-09","DAEAA450558",null,"PAUL JABOULET - VENTOUX LES TRAVERSES ROUGE",6,60,10,60,10,null,9.8000000000000007,{"$f":"IFERROR(IF(J872=\"soldé\",0,VLOOKUP(SOLDE!C819,#REF!,8,0)),0)","v":0}]
["CMAU 076556/6","2016-05-09","DCAAA300430",null,"HOREAU BEYLOT - CH. SEGUELONGUE MRP MEDOC",0,0,0,0,"soldé",null,9.8000000000000007,{"$f":"IFERROR(IF(J873=\"soldé\",0,VLOOKUP(SOLDE!C820,#REF!,8,0)),0)","v":0}]
["CMAU 076556/6","2016-05-09","DCAAA000676",null,"HOREAU BEYLOT - CH.  HAUT CLOQUET POMEROL",6,54,9,54,9,null,9.8000000000000007,{"$f":"IFERROR(IF(J874=\"soldé\",0,VLOOKUP(SOLDE!C821,#REF!,8,0)),0)","v":0}]
["CMAU 076556/6","2016-05-09","021320016",null,"HOREAU BEYLOT - CH.  MARTINET GC SAINT EMILION GRAND CRU",6,66,11,66,11,null,9.8000000000000007,{"$f":"IFERROR(IF(J875=\"soldé\",0,VLOOKUP(SOLDE!C822,#REF!,8,0)),0)","v":0}]
["CMAU 076556/6","2016-05-09","021310256",null,"LES MAITRES VIGNERONS - GOURMANDISE ROSE 75 CL",0,0,0,0,"soldé",null,9.8000000000000007,{"$f":"IFERROR(IF(J876=\"soldé\",0,VLOOKUP(SOLDE!C823,#REF!,8,0)),0)","v":0}]
["CMAU 076556/6","2016-05-09","021310257",null,"LES MAITRES VIGNERONS - SAINT ROCH ROSE 75 CL",0,0,0,0,"soldé",null,9.8000000000000007,{"$f":"IFERROR(IF(J877=\"soldé\",0,VLOOKUP(SOLDE!C824,#REF!,8,0)),0)","v":0}]
["CMAU 076556/6","2016-05-09","021310256",null,"LES MAITRES VIGNERONS - GOURMANDISE ROSE 75 CL",12,1104,92,1104,92,{"$f":"J878-M878-N878-O878-P878-Q878-R878","v":92},9.8000000000000007,{"$f":"IFERROR(IF(J878=\"soldé\",0,VLOOKUP(SOLDE!C825,#REF!,8,0)),0)","v":0}]
["CMAU 076556/6","2016-05-09","021310257",null,"LES MAITRES VIGNERONS - SAINT ROCH ROSE 75 CL",12,228,19,228,19,{"$f":"J879-M879-N879-O879-P879-Q879-R879","v":19},9.8000000000000007,{"$f":"IFERROR(IF(J879=\"soldé\",0,VLOOKUP(SOLDE!C826,#REF!,8,0)),0)","v":0}]
["CMAU 076556/6","2016-05-09","DAGAA406645",null,"CORDIER - CH. LA CROIX DE QUEYNAC BORDEAUX ROUGE",6,90,15,90,15,null,9.8000000000000007,{"$f":"IFERROR(IF(J880=\"soldé\",0,VLOOKUP(SOLDE!C827,#REF!,8,0)),0)","v":0}]
["CMAU 076556/6","2016-05-09","DAGAA501623",null,"CORDIER - CH. BEL AIR BORDEAUX ROUGE",12,180,15,180,15,null,9.8000000000000007,{"$f":"IFERROR(IF(J881=\"soldé\",0,VLOOKUP(SOLDE!C828,#REF!,8,0)),0)","v":0}]
["CMAU 076556/6","2016-05-09","021400576",null,"CORDIER - CH. LA CROIX SAINT JACQUES ",6,96,16,96,16,null,9.8000000000000007,{"$f":"IFERROR(IF(J882=\"soldé\",0,VLOOKUP(SOLDE!C829,#REF!,8,0)),0)","v":0}]
["CMAU 076556/6","2016-05-09","DAGAA504471",null,"CORDIER - LA CROIX BACALAN CORDIER BORGEAUX ROUGE",6,42,7,42,7,null,9.8000000000000007,{"$f":"IFERROR(IF(J883=\"soldé\",0,VLOOKUP(SOLDE!C830,#REF!,8,0)),0)","v":0}]
["CMAU 076556/6","2016-05-09","DAGAA502965",null,"CORDIER - FOUGERE LA NOBLEAR PA. 15CC BORDEAUX ROUGE",6,120,20,120,20,null,9.8000000000000007,{"$f":"IFERROR(IF(J884=\"soldé\",0,VLOOKUP(SOLDE!C831,#REF!,8,0)),0)","v":0}]
["CMAU 076556/6","2016-05-09","DAGAA302015",null,"CORDIER - CH. DU GARDE LA COTE DE MONS CC BORDEAUX ROUGE",6,90,15,90,15,null,9.8000000000000007,{"$f":"IFERROR(IF(J885=\"soldé\",0,VLOOKUP(SOLDE!C832,#REF!,8,0)),0)","v":0}]
["CMAU 076556/6","2016-05-09","021400800",null,"CORDIER - CH. ROC DE CANDALE",6,24,4,24,4,null,9.8000000000000007,{"$f":"IFERROR(IF(J886=\"soldé\",0,VLOOKUP(SOLDE!C833,#REF!,8,0)),0)","v":0}]
["CMAU 076556/6","2016-05-09","DAGAA304033",null,"CORDIER - CH. ANDRON FUT CC",6,120,20,120,20,null,9.8000000000000007,{"$f":"IFERROR(IF(J887=\"soldé\",0,VLOOKUP(SOLDE!C834,#REF!,8,0)),0)","v":0}]
["CMAU 076556/6","2016-05-09","021400580",null,"CORDIER/MESTREZAT - CH. MENEY SAINT ESTEPHE",6,18,3,18,3,null,9.8000000000000007,{"$f":"IFERROR(IF(J888=\"soldé\",0,VLOOKUP(SOLDE!C835,#REF!,8,0)),0)","v":0}]
["CMAU 076556/6","2016-05-09","DAGAB001508",null,"COMPAGNIE VINICOLE BARON EDMOND DE ROTHSCHILD - LES GRANGES 2012",12,36,3,36,3,null,9.8000000000000007,{"$f":"IFERROR(IF(J889=\"soldé\",0,VLOOKUP(SOLDE!C836,#REF!,8,0)),0)","v":0}]
["CMAU 076556/6","2016-05-09","DAGAB001454",null,"COMPAGNIE VINICOLE BARON EDMOND DE ROTHSCHILD - CH. DES LAURETS 2012",12,48,4,48,4,null,9.8000000000000007,{"$f":"IFERROR(IF(J890=\"soldé\",0,VLOOKUP(SOLDE!C837,#REF!,8,0)),0)","v":0}]
["CMAU 076556/6","2016-05-09","021900504",null,"PERNOD RICARD - BALLANTINES FINEST WHISKY",12,120,10,120,10,null,9.8000000000000007,{"$f":"IFERROR(IF(J891=\"soldé\",0,VLOOKUP(SOLDE!C838,#REF!,8,0)),0)","v":0}]
["CMAU 076556/6","2016-05-09",21900507,null,"PERNOD RICARD - LONG JOHN WHISKY",0,0,0,0,"soldé",null,9.8000000000000007,{"$f":"IFERROR(IF(J892=\"soldé\",0,VLOOKUP(SOLDE!C839,#REF!,8,0)),0)","v":0}]
["CMAU 076556/6","2016-05-09","021900512",null,"PERNOD RICARD - OLMEGA TEQUILA GOLD",6,54,9,54,9,null,9.8000000000000007,{"$f":"IFERROR(IF(J893=\"soldé\",0,VLOOKUP(SOLDE!C840,#REF!,8,0)),0)","v":0}]
["CMAU 076556/6","2016-05-09","021900514",null,"PERNOD RICARD - SUZE AMER 1L",12,24,2,24,2,null,9.8000000000000007,{"$f":"IFERROR(IF(J894=\"soldé\",0,VLOOKUP(SOLDE!C841,#REF!,8,0)),0)","v":0}]
["CMAU 076556/6","2016-05-09","IAHAA080927",null,"PERNOD RICARD - HAVANA CLUB RHUM ANEJO ESPECIAL",6,60,10,60,10,null,9.8000000000000007,{"$f":"IFERROR(IF(J895=\"soldé\",0,VLOOKUP(SOLDE!C842,#REF!,8,0)),0)","v":0}]
["CMAU 076556/6","2016-05-09","021900521",null,"PERNOD RICARD - ROYAL SALUTE WHISKY 40% 21 YO",6,24,4,{"$f":"G896","v":24},4,null,9.8000000000000007,{"$f":"IFERROR(IF(J896=\"soldé\",0,VLOOKUP(SOLDE!C843,#REF!,8,0)),0)","v":0}]
["CMAU 076556/6","2016-05-09","021900604",null,"PERNOD RICARD - BALLANTINES WHISKY 12 YO NRF ETUI",0,0,0,0,"soldé",null,9.8000000000000007,{"$f":"IFERROR(IF(J897=\"soldé\",0,VLOOKUP(SOLDE!C844,#REF!,8,0)),0)","v":0}]
["CMAU 076556/6","2016-05-09","022000007",null,"TORRES - SAN VALENTIN PARRELADA",12,48,4,48,{"$f":"IF(H898<=0,\"soldé\",H898)","v":4},{"$f":"J898-M898-N898-O898-P898-Q898-R898","v":4},{"$f":"(TODAY()-B898)/30","v":9.8000000000000007},{"$f":"IFERROR(IF(J898=\"soldé\",0,VLOOKUP(SOLDE!C845,#REF!,8,0)),0)","v":0}]
["CMAU 076556/6","2016-05-09","GAAAA003386",null,"TORRES - SAN VALENTIN GARNACHA",12,84,7,84,7,null,9.8000000000000007,{"$f":"IFERROR(IF(J899=\"soldé\",0,VLOOKUP(SOLDE!C846,#REF!,8,0)),0)","v":0}]
["CMAU 076556/6","2016-05-09","022000000",null,"TORRES - SANGRE DE TORO",12,84,7,84,7,null,9.8000000000000007,{"$f":"IFERROR(IF(J900=\"soldé\",0,VLOOKUP(SOLDE!C847,#REF!,8,0)),0)","v":0}]
["TCNU 458829/0","2016-05-26","021310303",null,"SARL CPESO - DOMAINE AUZIAS CUVEE MONSIEUR - ROUGE",6,30,5,30,5,null,9.2333333333333325,{"$f":"IFERROR(IF(J901=\"soldé\",0,VLOOKUP(SOLDE!C848,#REF!,8,0)),0)","v":0}]
["TCNU 458829/0","2016-05-26","021310304",null,"SARL CPESO - DOMAINE AUZIAS  - VDP CARCASSONE ROSE",6,90,15,90,15,null,9.2333333333333325,{"$f":"IFERROR(IF(J902=\"soldé\",0,VLOOKUP(SOLDE!C849,#REF!,8,0)),0)","v":0}]
["TCNU 458829/0","2016-05-26","021310317",null,"SARL CPESO - COL DE L'ORB - SAINT CHINIAN ROUGE OR",6,120,20,120,20,null,9.2333333333333325,{"$f":"IFERROR(IF(J903=\"soldé\",0,VLOOKUP(SOLDE!C850,#REF!,8,0)),0)","v":0}]
["TCNU 458829/0","2016-05-26","021310318",null,"SARL CPESO - COL DE L'ORB - SAINT CHINIAN ROUGE 86/100 WS (x12)",0,0,0,0,"soldé",null,9.2333333333333325,{"$f":"IFERROR(IF(J904=\"soldé\",0,VLOOKUP(SOLDE!C851,#REF!,8,0)),0)","v":0}]
["TCNU 458829/0","2016-05-26","DABAA502717",null,"SARL CPESO - CHÂTEAU LAMOTHE ST GERMAIN - ROUGE",6,240,40,240,40,null,9.2333333333333325,{"$f":"IFERROR(IF(J905=\"soldé\",0,VLOOKUP(SOLDE!C852,#REF!,8,0)),0)","v":0}]
["TCNU 458829/0","2016-05-26","021310450",null,"SARL CPESO - DOMAINE BERGER-RIVES - HTES COTES DE BEAUNES BLANC",0,0,0,0,"soldé",null,9.2333333333333325,{"$f":"IFERROR(IF(J906=\"soldé\",0,VLOOKUP(SOLDE!C853,#REF!,8,0)),0)","v":0}]
["TCNU 458829/0","2016-05-26","021310430",null,"SARL CPESO - MAISON JEAN BAPTISTE BEJOT - PETIT CHABLIS BLANC",6,24,4,24,4,null,9.2333333333333325,{"$f":"IFERROR(IF(J907=\"soldé\",0,VLOOKUP(SOLDE!C854,#REF!,8,0)),0)","v":0}]
["TCNU 458829/0","2016-05-26","021500257",null,"UNIONS DES VIGNERONS /CELLIER DES DAUPHINS - CROZES HERMITAGE LA TOUVIERE ROUGE",0,0,0,0,"soldé",null,9.2333333333333325,{"$f":"IFERROR(IF(J908=\"soldé\",0,VLOOKUP(SOLDE!C855,#REF!,8,0)),0)","v":0}]
["TCNU 458829/0","2016-05-26","021500264",null,"UNIONS DES VIGNERONS /CELLIER DES DAUPHINS - VACQUEYRAS AOC ROUGE",6,162,27,162,27,null,9.2333333333333325,{"$f":"IFERROR(IF(J909=\"soldé\",0,VLOOKUP(SOLDE!C856,#REF!,8,0)),0)","v":0}]
["TCNU 458829/0","2016-05-26","022000003",null,"MIGUEL TORRES - TORRES DE CASTA ROSADO",12,36,3,36,3,null,9.2333333333333325,{"$f":"IFERROR(IF(J910=\"soldé\",0,VLOOKUP(SOLDE!C857,#REF!,8,0)),0)","v":0}]
["TCNU 458829/0","2016-05-26","022000007",null,"MIGUEL TORRES - TORRES SAN VALENTIN PARELLADA",12,120,10,120,10,{"$f":"J911-M911-N911-O911-P911-Q911-R911","v":10},9.2333333333333325]
["TCNU 458829/0","2016-05-26","021310114",null,"PRODUCTEURS PLAIMONT - AOC MADIRAN ROUGE",0,0,0,0,"soldé",null,9.2333333333333325,{"$f":"IFERROR(IF(J912=\"soldé\",0,VLOOKUP(SOLDE!C859,#REF!,8,0)),0)","v":0}]
["TCNU 458829/0","2016-05-26","021310118",null,"PRODUCTEURS PLAIMONT - AOC SAINT MONT BLANC CHEMINS DES PELERINS",6,120,20,120,20,null,9.2333333333333325,{"$f":"IFERROR(IF(J913=\"soldé\",0,VLOOKUP(SOLDE!C860,#REF!,8,0)),0)","v":0}]
["TCNU 458829/0","2016-05-26","DACAB691667",null,"CHÂTEAU DE LA ROULERIE - ANJOU ROUGE, LE P'TIT CAB",0,0,0,0,"soldé",null,9.2333333333333325,{"$f":"IFERROR(IF(J914=\"soldé\",0,VLOOKUP(SOLDE!C861,#REF!,8,0)),0)","v":0}]
["TCNU 458829/0","2016-05-26","024100001",null,"UCCOAR SAS - ALLEE DES FRENES BORDEAUX ROUGE",6,240,40,240,40,null,9.2333333333333325,{"$f":"IFERROR(IF(J915=\"soldé\",0,VLOOKUP(SOLDE!C862,#REF!,8,0)),0)","v":0}]
["TCNU 458829/0","2016-05-26","DARAA061257",null,"LES GRANDS CHAIS DE France - VIN PAYS D'OC / IGP PAYS D'OC ROUGE ESCHENAUER ",0,0,0,0,"soldé",null,9.2333333333333325,{"$f":"IFERROR(IF(J916=\"soldé\",0,VLOOKUP(SOLDE!C863,#REF!,8,0)),0)","v":0}]
["TCNU 458829/0","2016-05-26","021310013",null,"LES GRANDS CHAIS DE France - CIDRE BRUT JEAN LORET BRUT",6,120,20,120,20,null,9.2333333333333325,{"$f":"IFERROR(IF(J917=\"soldé\",0,VLOOKUP(SOLDE!C864,#REF!,8,0)),0)","v":0}]
["TCNU 458829/0","2016-05-26","021900027",null,"LES GRANDS CHAIS DE France - DOMAINE TOULAL GUERROUANE ROSE",6,60,10,60,10,null,9.2333333333333325,{"$f":"IFERROR(IF(J918=\"soldé\",0,VLOOKUP(SOLDE!C865,#REF!,8,0)),0)","v":0}]
["TCNU 458829/0","2016-05-26","021310015",null,"LES GRANDS CHAIS DE France - ARMAGNAC AOC - PRINCE ARIGNAC VS + CANISTER",0,0,0,0,"soldé",null,9.2333333333333325,{"$f":"IFERROR(IF(J919=\"soldé\",0,VLOOKUP(SOLDE!C866,#REF!,8,0)),0)","v":0}]
["TCNU 458829/0","2016-05-26","021900012",null,"LES GRANDS CHAIS DE France - WISKY BOURBON JACK DANIEL'S",12,192,16,192,16,{"$f":"J920-M920-N920-O920-P920-Q920-R920","v":16},9.2333333333333325,{"$f":"IFERROR(IF(J920=\"soldé\",0,VLOOKUP(SOLDE!C867,#REF!,8,0)),0)","v":0}]
["TCNU 458829/0","2016-05-26","021900415",null,"LACHETEAU - CHINON M MARTIN LES BERNIERES ROUGE",6,90,15,90,15,null,9.2333333333333325,{"$f":"IFERROR(IF(J921=\"soldé\",0,VLOOKUP(SOLDE!C870,#REF!,8,0)),0)","v":0}]
["TCNU 458829/0","2016-05-26","021900425",null,"LACHETEAU - POUILLY FUME BLANC",6,90,15,90,15,null,9.2333333333333325,{"$f":"IFERROR(IF(J922=\"soldé\",0,VLOOKUP(SOLDE!C871,#REF!,8,0)),0)","v":0}]
["TCNU 458829/0","2016-05-26","021310303",null,"SARL CPESO - DOMAINE AUZIAS CUVEE MONSIEUR - ROUGE - IGP CITE CARCOSONNE ",6,30,5,30,5,null,9.2333333333333325,{"$f":"IFERROR(IF(J923=\"soldé\",0,VLOOKUP(SOLDE!C872,#REF!,8,0)),0)","v":0}]
["TCNU 458829/0","2016-05-26","021310304",null,"SARL CPESO - DOMAINE AUZIAS ROSE - VDP CARCASONNE ROSE",6,30,5,30,5,null,9.2333333333333325,{"$f":"IFERROR(IF(J924=\"soldé\",0,VLOOKUP(SOLDE!C873,#REF!,8,0)),0)","v":0}]
["TCNU 458829/0","2016-05-26","DABAA355257",null,"SARL CPESO - CHÂTEAU TREILLE DE CANDALE - BORDEAUX ROUGE",6,120,20,120,20,null,9.2333333333333325,{"$f":"IFERROR(IF(J925=\"soldé\",0,VLOOKUP(SOLDE!C874,#REF!,8,0)),0)","v":0}]
["TCNU 458829/0","2016-05-26","021320101",null,"SARL CPESO - CHÂTEAU TREILLE DE CANDALE - BORDEAUX BLANC SEC",6,120,20,120,20,{"$f":"J926-M926-N926-O926-P926-Q926-R926","v":20},9.2333333333333325,{"$f":"IFERROR(IF(J926=\"soldé\",0,VLOOKUP(SOLDE!C875,#REF!,8,0)),0)","v":0}]
["TCNU 458829/0","2016-05-26","021310450",null,"SARL CPESO - DOMAINE BERGER-RIVES - HTES COTES DE BEAUNES BLANC",6,60,10,60,10,null,9.2333333333333325,{"$f":"IFERROR(IF(J927=\"soldé\",0,VLOOKUP(SOLDE!C876,#REF!,8,0)),0)","v":0}]
["TCNU 458829/0","2016-05-26","021300009",null,"BOULARD BAUQUAIRE - CHAMPAGNE BRUT TRADITION ",6,300,50,300,50,null,9.2333333333333325,{"$f":"IFERROR(IF(J928=\"soldé\",0,VLOOKUP(SOLDE!C877,#REF!,8,0)),0)","v":0}]
["TCNU 458829/0","2016-05-26","021300001",null,"BOULARD BAUQUAIRE - CHAMPAGNE ROSE",6,120,20,120,20,null,9.2333333333333325,{"$f":"IFERROR(IF(J929=\"soldé\",0,VLOOKUP(SOLDE!C878,#REF!,8,0)),0)","v":0}]
["TCNU 458829/0","2016-05-26","DAKAA815251",null,"H CUVELIER & FILS - CHÂTEAU LACROIX SAINT ESTEPHE - ROUGE",0,0,0,0,"soldé",null,9.2333333333333325,{"$f":"IFERROR(IF(J930=\"soldé\",0,VLOOKUP(SOLDE!C879,#REF!,8,0)),0)","v":0}]
["TCNU 458829/0","2016-05-26","DBZAE602030",null,"ADVINI - IGP COTES CATALANES ROUGE / CANON DU MARECHAL ROUGE ",0,0,0,0,"soldé",null,9.2333333333333325,{"$f":"IFERROR(IF(J931=\"soldé\",0,VLOOKUP(SOLDE!C880,#REF!,8,0)),0)","v":0}]
["TCNU 458829/0","2016-05-26","DBZAE070037",null,"ADVINI - IGP COTES CATALANES ROSE / CANON DU MARECHAL ROSE",{"$f":"IFERROR(G932/H932,0)","v":0},0,0,0,"soldé",null,9.2333333333333325,{"$f":"IFERROR(IF(J932=\"soldé\",0,VLOOKUP(SOLDE!C881,#REF!,8,0)),0)","v":0}]
["TCNU 458829/0","2016-05-26","DBZAE260513",null,"ADVINI - IGP COTES CATALANES BLANC / CANON DU MARECHAL BLANC",0,0,0,0,"soldé",null,9.2333333333333325,{"$f":"IFERROR(IF(J933=\"soldé\",0,VLOOKUP(SOLDE!C882,#REF!,8,0)),0)","v":0}]
["TCNU 458829/0","2016-05-26","DBZAE000024",null,"ADVINI - AOP COTES DU ROUSSILLON VILLAGES  / EGO ROUGE",0,0,0,0,"soldé",null,9.2333333333333325,{"$f":"IFERROR(IF(J934=\"soldé\",0,VLOOKUP(SOLDE!C883,#REF!,8,0)),0)","v":0}]
["TCNU 458829/0","2016-05-26","DBZAB719481",null,"ADVINI - AOP COTES DE PROVENCE - ESPRIT GASSIER ROSE",0,0,0,0,"soldé",null,9.2333333333333325,{"$f":"IFERROR(IF(J935=\"soldé\",0,VLOOKUP(SOLDE!C884,#REF!,8,0)),0)","v":0}]
["TCNU 458829/0","2016-05-26","DBZAA750855",null,"ADVINI - IGP SABLE DE CAMARGUE / DN LE PIVE GRIS ROSE",0,0,0,0,"soldé",null,9.2333333333333325,{"$f":"IFERROR(IF(J936=\"soldé\",0,VLOOKUP(SOLDE!C885,#REF!,8,0)),0)","v":0}]
["TCNU 458829/0","2016-05-26","DBZAA774776",null,"ADVINI - AOP LANGUEDOC GRES DE MONTPELLIER / MAS DE LUNE ROUGE",6,30,5,30,5,null,9.2333333333333325,{"$f":"IFERROR(IF(J937=\"soldé\",0,VLOOKUP(SOLDE!C886,#REF!,8,0)),0)","v":0}]
["TCNU 458829/0","2016-05-26","DBZAB180359",null,"ADVINI - AOP COTES DE PROVENCE 2014 - LA SANTONNIERE ROSE 75 CL",6,180,30,180,30,null,9.2333333333333325,{"$f":"IFERROR(IF(J938=\"soldé\",0,VLOOKUP(SOLDE!C887,#REF!,8,0)),0)","v":0}]
["TCNU 458829/0","2016-05-26","DBZAB180458",null,"ADVINI - AOP COTES DE PROVENCE 2015  - LA SANTONNIERE ROSE 37,5 CL",12,12,1,12,1,null,9.2333333333333325,{"$f":"IFERROR(IF(J939=\"soldé\",0,VLOOKUP(SOLDE!C888,#REF!,8,0)),0)","v":0}]
["TCLU 719886/9","2016-08-11","021900560",null,"LOUIS LATOUR - PINOT NOIR BOURGOGNE",6,78,13,78,13,null,6.666666666666667,{"$f":"IFERROR(IF(J940=\"soldé\",0,VLOOKUP(SOLDE!C937,#REF!,8,0)),0)","v":0}]
["CMAU  213380/9","2016-09-07","021900027",null,"LES GRANDS CHAIS DE France - VIN DU MAROC ROSE (DMNE TOULAL)",6,600,100,600,100,null,5.7666666666666666,{"$f":"IFERROR(IF(J941=\"soldé\",0,VLOOKUP(SOLDE!C938,#REF!,8,0)),0)","v":0}]
["CMAU  213380/9","2016-09-07","021900031",null,"LES GRANDS CHAIS DE France - VIN DU MAROC ROUGE (DMNE TOULAL)",6,300,50,300,50,null,5.7666666666666666,{"$f":"IFERROR(IF(J942=\"soldé\",0,VLOOKUP(SOLDE!C939,#REF!,8,0)),0)","v":0}]
["CMAU  213380/9","2016-09-07","021900012",null,"LES GRANDS CHAIS DE France - WHISKY JACK DANIEL'S 70CL",12,204,17,204,17,{"$f":"J943-M943-N943-O943-P943-Q943-R943","v":17},5.7666666666666666]
["CMAU  213380/9","2016-09-07","022000007",null,"MIGUEL TORRES - TORRES SAN VALENTIN PARELLADA",12,96,8,96,8,{"$f":"J944-M944-N944-O944-P944-Q944-R944","v":8},5.7666666666666666,{"$f":"IFERROR(IF(J944=\"soldé\",0,VLOOKUP(SOLDE!C941,#REF!,8,0)),0)","v":0}]
["CMAU  213380/9","2016-09-07","022000005",null,"MIGUEL TORRES - TORRES SAN VALENTIN GARNACHA",12,300,25,300,25,null,5.7666666666666666,{"$f":"IFERROR(IF(J945=\"soldé\",0,VLOOKUP(SOLDE!C942,#REF!,8,0)),0)","v":0}]
["CMAU  213380/9","2016-09-07","022000007",null,"MIGUEL TORRES - TORRES SAN VALENTIN PARELLADA",12,204,17,204,17,{"$f":"J946-M946-N946-O946-P946-Q946-R946","v":17},5.7666666666666666,0]
["CMAU  213380/9","2016-09-07","021400576",null,"CORDIER - CH. LA CROIX SAINT JACQUES 2014",6,216,36,216,36,null,5.7666666666666666,{"$f":"IFERROR(IF(J947=\"soldé\",0,VLOOKUP(SOLDE!C944,#REF!,8,0)),0)","v":0}]
["CMAU  213380/9","2016-09-07","021900547",null,"LOUIS ROEDERER - CRISTAL BRUT 2007",6,18,3,18,3,null,5.7666666666666666,{"$f":"IFERROR(IF(J948=\"soldé\",0,VLOOKUP(SOLDE!C945,#REF!,8,0)),0)","v":0}]
["CMAU  213380/9","2016-09-07","021900700",null,"LOUIS ROEDERER - CRISTAL BRUT 2007 - COFFRET MILLESIME",6,48,8,48,8,null,5.7666666666666666,{"$f":"IFERROR(IF(J949=\"soldé\",0,VLOOKUP(SOLDE!C946,#REF!,8,0)),0)","v":0}]
["CMAU  213380/9","2016-09-07","021900542",null,"LOUIS ROEDERER - CHÂTEAU HAUT BEAUSEJOUR 2012",6,24,4,24,4,null,5.7666666666666666,{"$f":"IFERROR(IF(J950=\"soldé\",0,VLOOKUP(SOLDE!C947,#REF!,8,0)),0)","v":0}]
["CMAU  213380/9","2016-09-07","021900543",null,"LOUIS ROEDERER - CHÂTEAU DE PEZ 2012 (CAISSE BOIS)",6,96,16,96,16,null,5.7666666666666666,{"$f":"IFERROR(IF(J951=\"soldé\",0,VLOOKUP(SOLDE!C948,#REF!,8,0)),0)","v":0}]
["CMAU  213380/9","2016-09-07","021900506",null,"PERNOD RICARD - CHIVAS REGAL WHISKY 18 YO ",6,294,49,294,49,null,5.7666666666666666,{"$f":"IFERROR(IF(J952=\"soldé\",0,VLOOKUP(SOLDE!C949,#REF!,8,0)),0)","v":0}]
["CMAU  213380/9","2016-09-07","021900507",null,"PERNOD RICARD - LONG JOHN WHISKY 70 CL ",12,516,43,516,43,null,5.7666666666666666,{"$f":"IFERROR(IF(J953=\"soldé\",0,VLOOKUP(SOLDE!C950,#REF!,8,0)),0)","v":0}]
["CMAU  213380/9","2016-09-07","021900514",null,"PERNOD RICARD - SUZE AMER 100 CL",12,12,1,12,1,null,5.7666666666666666,{"$f":"IFERROR(IF(J954=\"soldé\",0,VLOOKUP(SOLDE!C951,#REF!,8,0)),0)","v":0}]
["CMAU  213380/9","2016-09-07","IAHAA110225",null,"PERNOD RICARD - BALLANTINE'S WHISKY 12 YO 70 CL",12,60,5,60,5,null,5.7666666666666666,{"$f":"IFERROR(IF(J955=\"soldé\",0,VLOOKUP(SOLDE!C952,#REF!,8,0)),0)","v":0}]
["CMAU  213380/9","2016-09-07","021900521",null,"PERNOD RICARD - ROYAL SALUTE WHISKY 21 YO 70CL (ETUIS)",6,30,5,30,5,null,5.7666666666666666,{"$f":"IFERROR(IF(J956=\"soldé\",0,VLOOKUP(SOLDE!C953,#REF!,8,0)),0)","v":0}]
["CMAU 064057/4","2016-10-07","021101003",null,"CAMUS - BERNEROY CALVADOS",0,0,0,0,"soldé",null,4.7666666666666666,{"$f":"IFERROR(IF(J957=\"soldé\",0,VLOOKUP(SOLDE!C954,#REF!,8,0)),0)","v":0}]
["CMAU 064057/4","2016-10-07","DCJAA003470",null,"GRANDEAU LAUDUC - CHÂTEAU LAUDUC CLASSIC 2015 - ROSE",6,468,78,468,78,null,4.7666666666666666,{"$f":"IFERROR(IF(J958=\"soldé\",0,VLOOKUP(SOLDE!C955,#REF!,8,0)),0)","v":0}]
["CMAU 064057/4","2016-10-07","022800100",null,"CIDRES BIGOUD - CIDRE LE BRUN ARTISANAL",12,48,4,48,4,{"$f":"J959-M959-N959-O959-P959-Q959-R959","v":4},4.7666666666666666,0]
["CMAU 064057/4","2016-10-07","DALAA307095",null,"PRODUCTEURS PLAIMONT - IGP COTES GASCOGNE BLANC 2015 ECHO INDIGO",6,90,15,{"$f":"G960","v":90},15,null,4.7666666666666666,{"$f":"IFERROR(IF(J960=\"soldé\",0,VLOOKUP(SOLDE!C957,#REF!,8,0)),0)","v":0}]
["CMAU 064057/4","2016-10-07","DALAA446268",null,"PRODUCTEURS PLAIMONT - IGP COTES GASCOGNE ROUGE 2016 ECHO INDIGO",6,210,35,210,35,null,4.7666666666666666,{"$f":"IFERROR(IF(J961=\"soldé\",0,VLOOKUP(SOLDE!C958,#REF!,8,0)),0)","v":0}]
["CMAU 064057/4","2016-10-07","DALAA460752",null,"PRODUCTEURS PLAIMONT - AOC SAINT MONT ROUGE - EMPREINTE ROUGE",6,30,5,30,{"$f":"IF(H962<=0,\"soldé\",H962)","v":5},null,{"$f":"(TODAY()-B962)/30","v":4.7666666666666666},{"$f":"IFERROR(IF(J962=\"soldé\",0,VLOOKUP(SOLDE!C959,#REF!,8,0)),0)","v":0}]
["CMAU 064057/4","2016-10-07","DALAA423290",null,"PRODUCTEURS PLAIMONT - AOC PACHERENC BLANC DOUX 2014",0,0,0,0,"soldé",null,4.7666666666666666,{"$f":"IFERROR(IF(J963=\"soldé\",0,VLOOKUP(SOLDE!C960,#REF!,8,0)),0)","v":0}]
["CMAU 064057/4","2016-10-07","DALAA347213",null,"PRODUCTEURS PLAIMONT - AOC SAINT MONT ROSE 2015 ROSE D'ENFER",6,210,35,210,35,null,4.7666666666666666,{"$f":"IFERROR(IF(J964=\"soldé\",0,VLOOKUP(SOLDE!C961,#REF!,8,0)),0)","v":0}]
["CMAU 064057/4","2016-10-07","DAEAA450558",null,"PAUL JABOULET AINE - VENTOUX LES TRAVERSES ROUGE 2014",6,60,10,60,10,null,4.7666666666666666,{"$f":"IFERROR(IF(J965=\"soldé\",0,VLOOKUP(SOLDE!C962,#REF!,8,0)),0)","v":0}]
["CMAU 064057/4","2016-10-07","DAGAA506000",null,"ETS CORDIER - CH. HAUT BASCALA BRONZE BORDEAU ROUGE",6,330,55,330,55,null,4.7666666666666666,{"$f":"IFERROR(IF(J966=\"soldé\",0,VLOOKUP(SOLDE!C963,#REF!,8,0)),0)","v":0}]
["CMAU 064057/4","2016-10-07","DAGAA734019",null,"ETS CORDIER - PAJZOS HARSLEVELU TOKAJI BLANC MOELLEUX",6,30,5,30,5,null,4.7666666666666666,{"$f":"IFERROR(IF(J967=\"soldé\",0,VLOOKUP(SOLDE!C964,#REF!,8,0)),0)","v":0}]
["CMAU 064057/4","2016-10-07","021200410",null,"ETS CORDIER - CH. LA TUILERIE ROUGE ",6,150,25,150,25,null,4.7666666666666666,{"$f":"IFERROR(IF(J968=\"soldé\",0,VLOOKUP(SOLDE!C965,#REF!,8,0)),0)","v":0}]
["CMAU 064057/4","2016-10-07","021900650",null,"PERNOD RICARD - CLAN CAMPBELL 1L",0,0,0,0,"soldé",null,4.7666666666666666,{"$f":"IFERROR(IF(J969=\"soldé\",0,VLOOKUP(SOLDE!C966,#REF!,8,0)),0)","v":0}]
["CMAU 064057/4","2016-10-07","021900505",null,"PERNOD RICARD - CHIVAS REGAL 12 YO - 70 CL",12,96,8,96,8,null,4.7666666666666666,{"$f":"IFERROR(IF(J970=\"soldé\",0,VLOOKUP(SOLDE!C967,#REF!,8,0)),0)","v":0}]
["CMAU 064057/4","2016-10-07","IAIAA042397",null,"LES GRANDS CHAIS DE France - LIQUEUR WHISKY US JACK & HONEY",6,192,32,192,32,null,4.7666666666666666,{"$f":"IFERROR(IF(J971=\"soldé\",0,VLOOKUP(SOLDE!C968,#REF!,8,0)),0)","v":0}]
["CMAU 064057/4","2016-10-07","021310010",null,"LES GRANDS CHAIS DE France - CHEVALIER A LICHINE MERLO -ROUGE",4,236,59,236,59,null,4.7666666666666666,{"$f":"IFERROR(IF(J972=\"soldé\",0,VLOOKUP(SOLDE!C969,#REF!,8,0)),0)","v":0}]
["CMAU 064057/4","2016-10-07","DARAA061257",null,"LES GRANDS CHAIS DE France - ESCHENAUER CABS - ROUGE",4,240,60,240,60,null,4.7666666666666666,{"$f":"IFERROR(IF(J973=\"soldé\",0,VLOOKUP(SOLDE!C970,#REF!,8,0)),0)","v":0}]
["CMAU 064057/4","2016-10-07","021900030",null,"LES GRANDS CHAIS DE France -  LA DOMAL - ROUGE",6,30,5,30,5,null,4.7666666666666666,{"$f":"IFERROR(IF(J974=\"soldé\",0,VLOOKUP(SOLDE!C971,#REF!,8,0)),0)","v":0}]
["CMAU 064057/4","2016-10-07","021310015",null,"LES GRANDS CHAIS DE France - PRINCE ARIGNAC VS + CANISTER",6,48,8,48,8,null,4.7666666666666666,{"$f":"IFERROR(IF(J975=\"soldé\",0,VLOOKUP(SOLDE!C972,#REF!,8,0)),0)","v":0}]
["CMAU 064057/4","2016-10-07","DBZAB716633",null,"ADVINI - AMALIA ROSE",6,120,20,120,20,null,4.7666666666666666,{"$f":"IFERROR(IF(J976=\"soldé\",0,VLOOKUP(SOLDE!C973,#REF!,8,0)),0)","v":0}]
["CMAU 064057/4","2016-10-07","DBZAE000024",null,"ADVINI - EGO ROUGE",6,12,2,12,2,null,4.7666666666666666,{"$f":"IFERROR(IF(J977=\"soldé\",0,VLOOKUP(SOLDE!C974,#REF!,8,0)),0)","v":0}]
["CMAU 064057/4","2016-10-07","DBZAB180458",null,"ADVINI - LA SANTONNIERE ROSE",12,60,5,60,5,null,4.7666666666666666,{"$f":"IFERROR(IF(J978=\"soldé\",0,VLOOKUP(SOLDE!C975,#REF!,8,0)),0)","v":0}]
["CMAU 064057/4","2016-10-07","DBZAE260513",null,"ADVINI - CANON DU MARECHAL BLANC",6,36,6,36,6,null,4.7666666666666666,{"$f":"IFERROR(IF(J979=\"soldé\",0,VLOOKUP(SOLDE!C976,#REF!,8,0)),0)","v":0}]
["CMAU 064057/4","2016-10-07","DBZAE070037",null,"ADVINI - CANON DU MARECHAL ROSE",6,36,6,36,6,null,4.7666666666666666,{"$f":"IFERROR(IF(J980=\"soldé\",0,VLOOKUP(SOLDE!C977,#REF!,8,0)),0)","v":0}]
["CMAU 064057/4","2016-10-07","DBZAE602030",null,"ADVINI - CANON DU MARECHAL ROUGE",6,36,6,36,6,null,4.7666666666666666,{"$f":"IFERROR(IF(J981=\"soldé\",0,VLOOKUP(SOLDE!C978,#REF!,8,0)),0)","v":0}]
["CMAU 064057/4","2016-10-07","DBZAA774776",null,"ADVINI - MAS DE LUNES ROUGE",6,48,8,48,8,null,4.7666666666666666,{"$f":"IFERROR(IF(J982=\"soldé\",0,VLOOKUP(SOLDE!C979,#REF!,8,0)),0)","v":0}]
["CMAU 064057/4","2016-10-07","021102017",null,"ADVINI - JC PEPIN ROUGE MERLOT - BIB",1,486,486,486,486,null,4.7666666666666666,{"$f":"IFERROR(IF(J983=\"soldé\",0,VLOOKUP(SOLDE!C980,#REF!,8,0)),0)","v":0}]
["CMAU 064057/4","2016-10-07","021102018",null,"ADVINI - JC PEPIN ROSE CINSAULT - BIB",1,250,250,250,250,null,4.7666666666666666,{"$f":"IFERROR(IF(J984=\"soldé\",0,VLOOKUP(SOLDE!C981,#REF!,8,0)),0)","v":0}]
["CMAU 064057/4","2016-10-07","021900430",null,"LACHETEAU - MUSCADET BLANC / CH. GOULAINE PAPILLON / LIE",12,24,2,24,2,null,4.7666666666666666,{"$f":"IFERROR(IF(J985=\"soldé\",0,VLOOKUP(SOLDE!C982,#REF!,8,0)),0)","v":0}]
["CMAU 064057/4","2016-10-07","021900205",null,"LACHETEAU - MUSCADET BLANC / CH. GOULAINE PUY FERRAND / LIE",6,72,12,72,12,null,4.7666666666666666,{"$f":"IFERROR(IF(J986=\"soldé\",0,VLOOKUP(SOLDE!C983,#REF!,8,0)),0)","v":0}]
["CMAU 064057/4","2016-10-07","021900424",null,"LACHETEAU - MUSCADET BLANC / CH. GOULAINE PAPILLON",6,12,2,12,2,null,4.7666666666666666,{"$f":"IFERROR(IF(J987=\"soldé\",0,VLOOKUP(SOLDE!C984,#REF!,8,0)),0)","v":0}]
["CMAU 064057/4","2016-10-07","021900404",null,"LACHETEAU - ST NICOLAS DE BOURGUEIL ROUGE",6,48,8,48,8,{"$f":"J988-M988-N988-O988-P988-Q988-R988","v":8},4.7666666666666666,{"$f":"IFERROR(IF(J988=\"soldé\",0,VLOOKUP(SOLDE!C985,#REF!,8,0)),0)","v":0}]
["CMAU 064057/4","2016-10-07","DCIAA242134",null,"RAPHAEL DUBOIS - VOSNE ROMANEE LES CHALANDINS ROUGE",6,18,3,18,3,null,4.7666666666666666,{"$f":"IFERROR(IF(J989=\"soldé\",0,VLOOKUP(SOLDE!C986,#REF!,8,0)),0)","v":0}]
["CMAU 064057/4","2016-10-07","DCIAA244121",null,"RAPHAEL DUBOIS - GEVREY CHAMBERTIN ROUGE",6,30,5,30,5,null,4.7666666666666666,{"$f":"IFERROR(IF(J990=\"soldé\",0,VLOOKUP(SOLDE!C987,#REF!,8,0)),0)","v":0}]
["CMAU 064057/4","2016-10-07","DCIAA202140",null,"RAPHAEL DUBOIS - GBOURGONE HTES COTES DE BEAUNE LE MONTBATOIS BLANC",0,0,0,0,"soldé",null,4.7666666666666666,{"$f":"IFERROR(IF(J991=\"soldé\",0,VLOOKUP(SOLDE!C988,#REF!,8,0)),0)","v":0}]
["CMAU 064057/4","2016-10-07","DCIAA230136",null,"RAPHAEL DUBOIS - SAVIGNY LES BEAUNE ROUGES ",6,30,5,30,5,null,4.7666666666666666,{"$f":"IFERROR(IF(J992=\"soldé\",0,VLOOKUP(SOLDE!C989,#REF!,8,0)),0)","v":0}]
["CMAU 064057/4","2016-10-07","DCIAA240135",null,"RAPHAEL DUBOIS - COTE DE NUITS VILLAGES ROUGE",6,60,10,60,10,null,4.7666666666666666,{"$f":"IFERROR(IF(J993=\"soldé\",0,VLOOKUP(SOLDE!C990,#REF!,8,0)),0)","v":0}]
["CMAU 064057/4","2016-10-07","DCIAA241132",null,"RAPHAEL DUBOIS - NUITS SAINT GEORGES ROUGE",6,30,5,30,5,null,4.7666666666666666,{"$f":"IFERROR(IF(J994=\"soldé\",0,VLOOKUP(SOLDE!C991,#REF!,8,0)),0)","v":0}]
["CMAU 064057/4","2016-10-07","DCIAA250141",null,"RAPHAEL DUBOIS - SAVIGNY LES BEAUNE 1ER CRU LES NARBANTONS ROUGE 2014",6,30,5,30,5,null,4.7666666666666666,{"$f":"IFERROR(IF(J995=\"soldé\",0,VLOOKUP(SOLDE!C992,#REF!,8,0)),0)","v":0}]
["CMAU 426257/5","2016-11-24","021310256",null,"LES MAITRES VIGNERONS - GOURMANDISE ROSE (x12)",{"$f":"IFERROR(G996/H996,0)","v":12},2004,167,2004,167,{"$f":"J996-M996-N996-O996-P996-Q996-R996","v":167},3.1666666666666665,0]
["CMAU 426257/5","2016-11-24","021310257",null,"LES MAITRES VIGNERONS - SAINT ROCH ROSE (x12)",12,120,10,120,10,{"$f":"J997-M997-N997-O997-P997-Q997-R997","v":10},3.1666666666666665,0]
["CMAU 426257/5","2016-11-24","021310252",null,"LES MAITRES VIGNERONS - GOURMANDISE BLANC (x12)",12,12,1,12,1,null,3.1666666666666665,{"$f":"IFERROR(IF(J998=\"soldé\",0,VLOOKUP(SOLDE!C995,#REF!,8,0)),0)","v":0}]
["CMAU 426257/5","2016-11-24","021310256",null,"LES MAITRES VIGNERONS - GOURMANDISE ROSE (x12)",12,324,27,324,27,{"$f":"J999-M999-N999-O999-P999-Q999-R999","v":27},3.1666666666666665]
["CMAU 426257/5","2016-11-24","021310257-6",null,"LES MAITRES VIGNERONS - SAINT ROCH (x6)",6,36,6,36,6,null,3.1666666666666665,{"$f":"IFERROR(IF(J1000=\"soldé\",0,VLOOKUP(SOLDE!C997,#REF!,8,0)),0)","v":0}]
["CMAU 426257/5","2016-11-24","021310317",null,"CPESO - SAINT CHINIAN ROUGE / COL DE L'ORB",6,12,2,12,2,null,3.1666666666666665,{"$f":"IFERROR(IF(J1001=\"soldé\",0,VLOOKUP(SOLDE!C998,#REF!,8,0)),0)","v":0}]
["CMAU 426257/5","2016-11-24","DABAA355257",null,"CPESO - BORDEAUX ROUGE / CH. TREILLE DE CANDALE",6,216,36,216,36,null,3.1666666666666665,{"$f":"IFERROR(IF(J1002=\"soldé\",0,VLOOKUP(SOLDE!C999,#REF!,8,0)),0)","v":0}]
["CMAU 426257/5","2016-11-24","021320101",null,"CPESO - BORDEAU ENTRE DEUX MERS BLANC SEC / CH. TREILLE DE CANDALE",6,330,55,330,55,{"$f":"J1003-M1003-N1003-O1003-P1003-Q1003-R1003","v":55},3.1666666666666665,0]
["CMAU 426257/5","2016-11-24","DABAA600635",null,"CPESO - BORDEAUX ROUGE / CH. LAMOTHE ST GERMAIN",6,60,10,60,10,null,3.1666666666666665,{"$f":"IFERROR(IF(J1004=\"soldé\",0,VLOOKUP(SOLDE!C1001,#REF!,8,0)),0)","v":0}]
["CMAU 426257/5","2016-11-24","021310325",null,"CPESO - COTES DE BLAYE / CH. CAZEAUX",12,132,11,132,11,null,3.1666666666666665,{"$f":"IFERROR(IF(J1005=\"soldé\",0,VLOOKUP(SOLDE!C1002,#REF!,8,0)),0)","v":0}]
["CMAU 426257/5","2016-11-24","021310315",null,"CPESO - GEWURZTRAIMINER / JULES MULLER",6,24,4,24,4,null,3.1666666666666665,{"$f":"IFERROR(IF(J1006=\"soldé\",0,VLOOKUP(SOLDE!C1003,#REF!,8,0)),0)","v":0}]
["TRLU 382312/3","2016-11-15","‘022800100",null,"CIDRE LE BRUN ARTISANAL ",12,900,75,900,75,null,3.4666666666666668,{"$f":"IFERROR(IF(J1007=\"soldé\",0,VLOOKUP(SOLDE!C1004,#REF!,8,0)),0)","v":0}]
["CMAU 186380/2","2016-12-02","021300618",null,"AMARULA LIQUEUR 70 CL",6,144,24,144,24,null,2.9,{"$f":"IFERROR(IF(J1008=\"soldé\",0,VLOOKUP(SOLDE!C1005,#REF!,8,0)),0)","v":0}]
["CMAU 186380/2","2016-12-02","021202001",null,"ALTO ESTATE ROUGE 2011",6,48,8,48,8,null,2.9,{"$f":"IFERROR(IF(J1009=\"soldé\",0,VLOOKUP(SOLDE!C1006,#REF!,8,0)),0)","v":0}]
["CMAU 186380/2","2016-12-02","021100114",null,"NEDERBURG WINEMASTER’S CHARDONNAY",6,600,100,600,100,null,2.9,{"$f":"IFERROR(IF(J1010=\"soldé\",0,VLOOKUP(SOLDE!C1007,#REF!,8,0)),0)","v":0}]
["CMAU 186380/2","2016-12-02","021100340",null,"NEDERBURG WINEMASTER’S RHINE RIESLING",6,240,40,240,40,null,2.9,{"$f":"IFERROR(IF(J1011=\"soldé\",0,VLOOKUP(SOLDE!C1008,#REF!,8,0)),0)","v":0}]
["CMAU 186380/2","2016-12-02","021100300",null,"NEDERBURG 1ERE CUVEE BRUT",12,324,27,324,27,null,2.9,{"$f":"IFERROR(IF(J1012=\"soldé\",0,VLOOKUP(SOLDE!C1009,#REF!,8,0)),0)","v":0}]
["CMAU 186380/2","2016-12-02","021100301",null,"NEDERBURG SAUVIGNON BLANC",6,120,20,120,20,null,2.9,{"$f":"IFERROR(IF(J1013=\"soldé\",0,VLOOKUP(SOLDE!C1010,#REF!,8,0)),0)","v":0}]
["CMAU 186380/2","2016-12-02","021100119",null,"NEDERBURG SHIRAZ",6,360,60,360,60,null,2.9,{"$f":"IFERROR(IF(J1014=\"soldé\",0,VLOOKUP(SOLDE!C1011,#REF!,8,0)),0)","v":0}]
["CMAU 186380/2","2016-12-02","022300502",null,"NEETHLINGSHOF UNWOODED CHARDONNAY",6,114,19,114,19,null,2.9,{"$f":"IFERROR(IF(J1015=\"soldé\",0,VLOOKUP(SOLDE!C1012,#REF!,8,0)),0)","v":0}]
["CMAU 186380/2","2016-12-02","021200310",null,"ZONNEBLOEM CHARDONNAY",6,600,100,600,100,null,2.9,{"$f":"IFERROR(IF(J1016=\"soldé\",0,VLOOKUP(SOLDE!C1013,#REF!,8,0)),0)","v":0}]
["CMAU 186380/2","2016-12-02","021200311",null,"ZONNEBLOEM SAUVIGNON BLANC",6,240,40,240,40,null,2.9,{"$f":"IFERROR(IF(J1017=\"soldé\",0,VLOOKUP(SOLDE!C1014,#REF!,8,0)),0)","v":0}]
["CMAU 186380/2","2016-12-02","021300618",null,"AMARULA LIQUEUR 70 CL",6,24,4,24,4,null,2.9,{"$f":"IFERROR(IF(J1018=\"soldé\",0,VLOOKUP(SOLDE!C1015,#REF!,8,0)),0)","v":0}]
["CMAU 186380/2","2016-12-02","021201002",null,"PLAISIR DE MERLE CHARDONNAY",0,0,0,0,"soldé",null,2.9,{"$f":"IFERROR(IF(J1019=\"soldé\",0,VLOOKUP(SOLDE!C1016,#REF!,8,0)),0)","v":0}]
["CMAU 186380/2","2016-12-02","022300401",null,"FLEUR DU CAP CHARDONNAY",6,198,33,198,33,null,2.9,{"$f":"IFERROR(IF(J1020=\"soldé\",0,VLOOKUP(SOLDE!C1017,#REF!,8,0)),0)","v":0}]
["CMAU 186380/2","2016-12-02","022300502",null,"NEETHLINGSHOF UNWOODED CHARDONNAY",6,24,4,24,4,null,2.9,{"$f":"IFERROR(IF(J1021=\"soldé\",0,VLOOKUP(SOLDE!C1018,#REF!,8,0)),0)","v":0}]
["CMAU 186380/2","2016-12-02","021200310",null,"ZONNEBLOEM CHARDONNAY",6,60,10,60,10,null,2.9,{"$f":"IFERROR(IF(J1022=\"soldé\",0,VLOOKUP(SOLDE!C1019,#REF!,8,0)),0)","v":0}]
["CMAU 186380/2","2016-12-02","021100340",null,"NEDERBURG WINEMASTER’S RHINE RIESLING",6,264,44,264,44,null,2.9,{"$f":"IFERROR(IF(J1023=\"soldé\",0,VLOOKUP(SOLDE!C1020,#REF!,8,0)),0)","v":0}]
["CMAU 186380/2","2016-12-02","EADAJ201600",null,"DROSTDY HOF ROUGE 5L",4,120,30,{"$f":"G1024","v":120},30,null,2.9,{"$f":"IFERROR(IF(J1024=\"soldé\",0,VLOOKUP(SOLDE!C1021,#REF!,8,0)),0)","v":0}]
["CMAU 598908/6","2017-01-11","021300618",null,"AMARULA LIQUEUR 70CL",6,48,8,48,8,null,1.5666666666666667,{"$f":"IFERROR(IF(J1025=\"soldé\",0,VLOOKUP(SOLDE!C1022,#REF!,8,0)),0)","v":0}]
["CMAU 598908/6","2017-01-12","022300338",null,"DROSTDY HOF ADELPRACHT 14",6,18,3,18,{"$f":"IF(H1026<=0,\"soldé\",H1026)","v":3},null,{"$f":"(TODAY()-B1026)/30","v":1.5333333333333334},{"$f":"IFERROR(IF(J1026=\"soldé\",0,VLOOKUP(SOLDE!C1023,#REF!,8,0)),0)","v":0}]
["CMAU 598908/6","2017-01-13","EADAJ201600",null,"DROSTDY HOF ROUGE 5L",4,12,3,12,3,null,1.5,{"$f":"IFERROR(IF(J1027=\"soldé\",0,VLOOKUP(SOLDE!C1024,#REF!,8,0)),0)","v":0}]
["CMAU 598908/6","2017-01-14","022300400",null,"FLEUR DU CAP CABERNET SAUVIGNON",6,78,13,78,13,null,1.4666666666666666,{"$f":"IFERROR(IF(J1028=\"soldé\",0,VLOOKUP(SOLDE!C1025,#REF!,8,0)),0)","v":0}]
["CMAU 598908/6","2017-01-15","022300401",null,"FLEUR DU CAP CHARDONNAY",6,18,3,18,3,null,1.4333333333333333,{"$f":"IFERROR(IF(J1029=\"soldé\",0,VLOOKUP(SOLDE!C1026,#REF!,8,0)),0)","v":0}]
["CMAU 598908/6","2017-01-16","022300403",null,"FLEUR DU CAP PINOTAGE",6,18,3,18,3,null,1.4,{"$f":"IFERROR(IF(J1030=\"soldé\",0,VLOOKUP(SOLDE!C1027,#REF!,8,0)),0)","v":0}]
["CMAU 598908/6","2017-01-19","021200616",null,"LIBERTAS CHENIN BLANC",6,12,2,12,2,null,1.3,{"$f":"IFERROR(IF(J1031=\"soldé\",0,VLOOKUP(SOLDE!C1030,#REF!,8,0)),0)","v":0}]
["CMAU 598908/6","2017-01-20","021200617",null,"LIBERTAS MERLOT",6,24,4,24,4,null,1.2666666666666666,{"$f":"IFERROR(IF(J1032=\"soldé\",0,VLOOKUP(SOLDE!C1031,#REF!,8,0)),0)","v":0}]
["CMAU 598908/6","2017-01-21","021200701",null,"NEDERBURG WM RHINE RIESLING",6,276,46,276,46,null,1.2333333333333334,{"$f":"IFERROR(IF(J1033=\"soldé\",0,VLOOKUP(SOLDE!C1032,#REF!,8,0)),0)","v":0}]
["CMAU 598908/6","2017-01-22","021100106",null,"NEDERBURG BARONNE CABERNET SAUVIGNON",6,12,2,12,2,null,1.2,{"$f":"IFERROR(IF(J1034=\"soldé\",0,VLOOKUP(SOLDE!C1033,#REF!,8,0)),0)","v":0}]
["CMAU 598908/6","2017-01-23","022300502",null,"NEETHLINGSHOF UNWOODED CHARDONAY",6,72,12,72,12,null,1.1666666666666667,{"$f":"IFERROR(IF(J1035=\"soldé\",0,VLOOKUP(SOLDE!C1034,#REF!,8,0)),0)","v":0}]
["CMAU 598908/6","2017-01-24","022300568",null,"NEETHLING SHIRAZ 11",6,30,5,30,5,null,1.1333333333333333,{"$f":"IFERROR(IF(J1036=\"soldé\",0,VLOOKUP(SOLDE!C1035,#REF!,8,0)),0)","v":0}]
["CMAU 598908/6","2017-01-25","021200517",null,"OBIKWA CABERNET SAUVIGNON",6,42,7,42,7,null,1.1000000000000001,{"$f":"IFERROR(IF(J1037=\"soldé\",0,VLOOKUP(SOLDE!C1036,#REF!,8,0)),0)","v":0}]
["CMAU 598908/6","2017-01-26","021200511",null,"OBIKWA CHARDONNAY",6,138,23,138,23,null,1.0666666666666667,{"$f":"IFERROR(IF(J1038=\"soldé\",0,VLOOKUP(SOLDE!C1037,#REF!,8,0)),0)","v":0}]
["CMAU 598908/6","2017-01-27","021201002",null,"PLAISIR DE MERLE CHARDONNAY",6,174,29,174,29,null,1.0333333333333334,{"$f":"IFERROR(IF(J1039=\"soldé\",0,VLOOKUP(SOLDE!C1038,#REF!,8,0)),0)","v":0}]
["CMAU 598908/6","2017-01-28","021201004",null,"PLAISIR DE MERLE SAUVIGNON BLANC",6,60,10,60,10,null,1,{"$f":"IFERROR(IF(J1040=\"soldé\",0,VLOOKUP(SOLDE!C1039,#REF!,8,0)),0)","v":0}]
["CMAU 598908/6","2017-01-30","021200310",null,"ZONNEBLOEM CHARDONNAY 12",6,240,40,240,40,null,0.93333333333333335,{"$f":"IFERROR(IF(J1041=\"soldé\",0,VLOOKUP(SOLDE!C1041,#REF!,8,0)),0)","v":0}]
["CMAU 598908/6","2017-01-31","021200309",null,"ZONNEBLOEM SHIRAZ 12",6,36,6,36,6,null,0.9,{"$f":"IFERROR(IF(J1042=\"soldé\",0,VLOOKUP(SOLDE!C1042,#REF!,8,0)),0)","v":0}]

{"sheet":"BDX","index":3,"n_rows":7,"n_cols":5,"rows_kept":7,"cut":false,"hidden":false,"merged":[[0,8,0,12]]}
[]
[]
[]
[]
[]
["CODE ART","LIB ART","Bouteilles/Cartons","TC","DATE"]
["DCIAA211135",{"$f":"VLOOKUP(A7,SOLDE!C:F,3,0)","v":"DOMAINE R. DUBOIS - BOURGOGNE PASSETOUTGRAINS ROUGE"},null,"MSCU 394215/8","2014-06-06"]

{"sheet":"Données","index":4,"n_rows":5,"n_cols":3,"rows_kept":5,"cut":false,"hidden":false,"merged":[]}
[]
[null,"CAXU 631779/0  ","2013-12-08"]
[null,"MEDU 349062/4","2013-12-08"]
[null,"MSCU 394215/8","2014-06-06"]
[null,"MSCU 017755/9","2016-03-03"]