{"text_format":"1","workbook":"xlsx","n_sheets":5,"sheets":["Feuil1","Formulaire 2","rechercheV","semaines","Feuil2"],"not_rendered":{"charts":0,"images":0,"macros":1,"external_links":0,"defined_names":28,"comments":1,"pivot_tables":0},"unopened":[],"bounds":{"document_bytes":16777216,"sheet_cells":100000,"rows_first":2000,"rows_last":500,"rows_between":2000,"halvings":0,"cell_chars":16384,"cell_head_chars":4096},"cells_cut":0,"cells_raw":0,"read":"whole","date_system":"1900"}

{"sheet":"Feuil1","index":0,"n_rows":5,"n_cols":187,"rows_kept":5,"cut":false,"hidden":false,"merged":[]}
[null,null,null,1,2,"3",4,5,"6",7,8,"9",10,11,"12",13,14,"15",16,17,"18",19,20,"21",22,1,2,"3",4,5,"6",7,8,"9",10,11,"12",13,14,"15",16,17,"18",19,20,"21",22,1,2,"3",4,5,"6",7,8,"9",10,11,"12",13,14,"15",16,17,"18",19,20,"21",22,1,2,"3",4,5,"6",7,8,"9",10,11,"12",13,14,"15",16,17,"18",19,20,"21",22,1,2,"3",4,5,"6",7,8,"9",10,11,"12",13,14,"15",16,17,"18",19,20,"21",22,1,2,"3",4,5,"6",7,8,"9",10,11,"12",13,14,"15",16,17,"18",19,20,"21",22,1,2,"3",4,5,"6",7,8,"9",10,11,"12",13,14,"15",16,17,"18",19,20,"21",22,1,2,"3",4,5,"6",7,8,"9",10,11,"12",13,14,"15",16,17,"18",19,20,"21",22,1,2,3,4,5,6,7,8]
["2017-01-02","test","test",1,2,3,4,5,6,7,8,9,10,11,12,13,14,15,16,17,18,19,20,21,22,23,24,25,26,27,28,29,30,31,32,33,34,35,36,37,38,39,40,41,42,43,44,45,46,47,48,49,50,51,52,53,54,55,56,57,58,59,60,61,62,63,64,65,66,67,68,69,70,71,72,73,74,75,76,77,78,79,80,81,82,83,84,85,86,87,88,89,90,91,92,93,94,95,96,97,98,99,100,101,102,103,104,105,106,107,108,109,110,111,112,113,114,115,116,117,118,119,120,121,122,123,124,125,126,127,128,129,130,131,132,133,134,135,136,137,138,139,140,141,142,143,144,145,146,147,148,149,150,151,152,153,154,155,156,157,158,159,160,161,162,163,164,165,166,167,168,169,170,171,172,173,174,175,176,"1","2","3","4","5","6","7","8"]
["2017-01-03",null,null,1,2,3,4,5,6,7,8,9,10,11,12,13,14,15,16,17,18,19,20,21,22,23,24,25,26,27,28,29,30,31,32,33,34,35,36,37,38,39,40,41,42,43,44,null,null,null,null,null,null,null,null,null,null,null,null,null,null,null,null,null,null,null,null,null,null,null,null,null,null,null,null,null,null,null,null,null,null,null,null,null,null,null,null,null,null,null,null,null,null,null,null,null,null,null,null,null,null,null,null,null,null,null,null,null,null,null,null,null,null,null,null,null,null,null,null,null,null,null,null,null,null,null,null,null,null,null,null,null,null,null,null,null,null,null,null,null,null,null,null,null,null,null,null,null,null,null,null,null,null,null,null,null,null,null,null,null,null,null,null,null,null,null,null,null,null,null,null,null,null,null,null,null,null,null,228,"BON","BON","BON","BON","BON","BON","BON","BON"]
["2017-01-04"]
["2017-01-05"]

{"sheet":"Formulaire 2","index":1,"n_rows":12,"n_cols":13,"rows_kept":12,"cut":false,"hidden":false,"merged":[]}
["SEM DRH","SEM CENTRAL","POSTE","DATE","libellé court","libellé long","type","classe lbc","classe lbl","heure","position","non localisé","observations"]
[{"$f":"IFERROR(VLOOKUP(D2,semaines!A:C,2,FALSE),\"\")","v":1},{"$f":"IFERROR(VLOOKUP(D2,semaines!A:C,3,FALSE),\"\")","v":1},"POSTE 1","2017-01-02","AAA001","ALPHAPRIMO","AAA","TECH01","TECHNIQUES 01","0800Z","1732S 14933O",null,"blablabla"]
[{"$f":"IFERROR(VLOOKUP(D3,semaines!A:C,2,FALSE),\"\")","v":1},{"$f":"IFERROR(VLOOKUP(D3,semaines!A:C,3,FALSE),\"\")","v":2},"POSTE 2","2017-01-07","AAB001","ALPHASECUNDO","BBB","TECH02","TECHNIQUES 02","1000Z",null,"X","sans commentaire"]
[{"$f":"IFERROR(VLOOKUP(D4,semaines!A:C,2,FALSE),\"\")","v":2},{"$f":"IFERROR(VLOOKUP(D4,semaines!A:C,3,FALSE),\"\")","v":2},"POSTE 3","2017-01-08","BBB999","NI","NI","NI","NI","0830Z",null,"X"]
[{"$f":"IFERROR(VLOOKUP(D5,semaines!A:C,2,FALSE),\"\")","v":8},{"$f":"IFERROR(VLOOKUP(D5,semaines!A:C,3,FALSE),\"\")","v":8},"POSTE 4","2017-02-23","AAA003","CHARLIEPRIMO","III","TECH09","TECHNIQUES 09","15:25","df","NON LOCALISE","ds<vsd"]
[{"$f":"IFERROR(VLOOKUP(D6,semaines!A:C,2,FALSE),\"\")","v":8},{"$f":"IFERROR(VLOOKUP(D6,semaines!A:C,3,FALSE),\"\")","v":8},"POSTE 5","2017-02-23","AAD002","BRAVOQUARTO","HHH","TECH08","TECHNIQUES 08","14:00","sf"]
[{"$f":"IFERROR(VLOOKUP(D7,semaines!A:C,2,FALSE),\"\")","v":""},{"$f":"IFERROR(VLOOKUP(D7,semaines!A:C,3,FALSE),\"\")","v":""},"POSTE 6"]
[{"$f":"IFERROR(VLOOKUP(D8,semaines!A:C,2,FALSE),\"\")","v":8},{"$f":"IFERROR(VLOOKUP(D8,semaines!A:C,3,FALSE),\"\")","v":9},"POSTE 7","2017-02-25","AAC003","CHARLIETERTIO","KKK","TECH11","TECHNIQUES 11","23:00","bf","NON LOCALISE","<x"]
[{"$f":"IFERROR(VLOOKUP(D9,semaines!A:C,2,FALSE),\"\")","v":8},{"$f":"IFERROR(VLOOKUP(D9,semaines!A:C,3,FALSE),\"\")","v":8},"POSTE 8","2017-02-24","AAC001","ALPHATERTIO","CCC","TECH03","TECHNIQUES 03","14:30","dzVZEv","X","zaQCA"]
[null,null,"Poste 3","2017-02-02","AAC002","BRAVOTERTIO","GGG","TECH07","TECHNIQUES 07","40:30","Cc","X","cCQ"]
[null,null,"Poste 7","2017-02-24","AAC003","CHARLIETERTIO","KKK","TECH11","TECHNIQUES 11",null,null,"X",""]
[null,null,"Poste 5","2017-02-21","AAC002","BRAVOTERTIO","GGG","TECH07","TECHNIQUES 07","14:30","dVs<dv<s",null,""]

{"sheet":"rechercheV","index":2,"n_rows":13,"n_cols":7,"rows_kept":13,"cut":false,"hidden":false,"merged":[]}
["libellé court","libellé long","type","classe lbc","classe lbl","centre","LOCA"]
["AAA001","ALPHAPRIMO","AAA","TECH01","TECHNIQUES 01","NORD","LILLE"]
["AAB001","ALPHASECUNDO","BBB","TECH02","TECHNIQUES 02","NORD","DUNKERQUE"]
["AAC001","ALPHATERTIO","CCC","TECH03","TECHNIQUES 03","SUD","TOULON"]
["AAD001","ALPHAQUARTO","DDD","TECH04","TECHNIQUES 04","OUEST","RENNES"]
["AAA002","BRAVOPRIMO","EEE","TECH05","TECHNIQUES 05","OUEST","BREST"]
["AAB002","BRAVOSECUNDO","FFF","TECH06","TECHNIQUES 06","EST","REIMS"]
["AAC002","BRAVOTERTIO","GGG","TECH07","TECHNIQUES 07","EST","STRASBOURG"]
["AAD002","BRAVOQUARTO","HHH","TECH08","TECHNIQUES 08","CENTRE","BOURGES"]
["AAA003","CHARLIEPRIMO","III","TECH09","TECHNIQUES 09","CENTRE","CLERMONT"]
["AAB003","CHARLIESECUNDO","JJJ","TECH10","TECHNIQUES 10","NORD OUEST","CHERBOURG"]
["AAC003","CHARLIETERTIO","KKK","TECH11","TECHNIQUES 11","SUD","MARSEILLE"]
["AAD003","CHARLIEQUARTO","LLL","TECH12","TECHNIQUES 12","SUD OUEST","PERPIGNAN"]

{"sheet":"semaines","index":3,"n_rows":59,"n_cols":3,"rows_kept":59,"cut":false,"hidden":false,"merged":[]}
[null,"SEM DRH","SEM CENTRAL"]
["2017-01-01",1,1]
["2017-01-02",1,1]
["2017-01-03",1,1]
["2017-01-04",1,1]
["2017-01-05",1,1]
["2017-01-06",1,1]
["2017-01-07",1,2]
["2017-01-08",2,2]
["2017-01-09",2,2]
["2017-01-10",2,2]
["2017-01-11",2,2]
["2017-01-12",2,2]
["2017-01-13",2,2]
["2017-01-14",2,3]
["2017-01-15",3,3]
["2017-01-16",3,3]
["2017-01-17",3,3]
["2017-01-18",3,3]
["2017-01-19",3,3]
["2017-01-20",3,3]
["2017-01-21",3,4]
["2017-01-22",4,4]
["2017-01-23",4,4]
["2017-01-24",4,4]
["2017-01-25",4,4]
["2017-01-26",4,4]
["2017-01-27",4,4]
["2017-01-28",4,5]
["2017-01-29",5,5]
["2017-01-30",5,5]
["2017-01-31",5,5]
["2017-02-01",5,5]
["2017-02-02",5,5]
["2017-02-03",5,5]
["2017-02-04",5,6]
["2017-02-05",6,6]
["2017-02-06",6,6]
["2017-02-07",6,6]
["2017-02-08",6,6]
["2017-02-09",6,6]
["2017-02-10",6,6]
["2017-02-11",6,7]
["2017-02-12",7,7]
["2017-02-13",7,7]
["2017-02-14",7,7]
["2017-02-15",7,7]
["2017-02-16",7,7]
["2017-02-17",7,7]
["2017-02-18",7,8]
["2017-02-19",8,8]
["2017-02-20",8,8]
["2017-02-21",8,8]
["2017-02-22",8,8]
["2017-02-23",8,8]
["2017-02-24",8,8]
["2017-02-25",8,9]
["2017-02-26",9,9]
[null,9]

{"sheet":"Feuil2","index":4,"n_rows":25,"n_cols":3,"rows_kept":25,"cut":false,"hidden":false,"merged":[]}
[]
[]
[]
[]
[]
[]
[]
[]
[]
[]
[]
[]
[]
[]
[]
[]
[]
[]
[]
[]
[]
[]
[]
[null,null,"le poste 1, textbox 1 à 22 doivent renseigner la feuil 1 des colonnes D à Y, la combobox 2 qualité du poste 1 doit renseigner la colonne FX"]
[null,null,"le poste 2 textbox 24 à 45 doivent renseigner la feuil 1 des colonnes Z à AU, la combobox3 qualité du poste 2 doit renseigner la colonne FY"]