{"text_format":"1","workbook":"xlsx","n_sheets":7,"sheets":["PARAMETRES","Salaries","Juin","Juillet","Aout","Pâques","Dialogue4"],"not_rendered":{"charts":0,"images":2,"macros":1,"external_links":1,"defined_names":9,"comments":0,"pivot_tables":0},"unopened":[{"sheet":"Dialogue4","index":6,"reason":"not_a_worksheet"}],"bounds":{"document_bytes":16777216,"sheet_cells":100000,"rows_first":2000,"rows_last":500,"rows_between":2000,"halvings":0,"cell_chars":16384,"cell_head_chars":4096},"cells_cut":0,"cells_raw":0,"read":"whole","date_system":"1900"}

{"sheet":"PARAMETRES","index":0,"n_rows":0,"n_cols":0,"rows_kept":0,"cut":false,"hidden":false,"merged":[]}

{"sheet":"Salaries","index":1,"n_rows":20,"n_cols":28,"rows_kept":20,"cut":false,"hidden":false,"merged":[[2,8,2,19]]}
[null,null,null,null,null,null,null,null,null,null,null,null,null,null,null,null,null,null,null,null,null,null,null,null,4,{"$f":"LOOKUP(Y1,AA5:AB104)","v":"Paul"}]
[]
[null,null,null,null,null,"H","H","H","HEURES TRAVAILLEES PAR MOIS"]
["N°","NOM",null,null,null,"Théo","Solde","Réel",6,7,8,9,10,11,12,1,2,3,4,5]
[1,"Albert",null,null,null,192,{"$f":"IF(F5=0,\"\",H5-F5)","v":0},{"$f":"IF(F5<>0,SUMIF(I5:T5,\"<>#N/A\"),\"\")","v":192},{"$f":"IF($B5=\"\",\" \",VLOOKUP($B5,Juin!$A$6:$AH$101,34,FALSE)+VLOOKUP($B5,Juin!$A$6:$DB$101,106,FALSE))","v":48},{"$f":"IF($B5=\"\",\" \",VLOOKUP($B5,Juillet!$A$6:$AH$89,34,FALSE)+VLOOKUP($B5,Juillet!$A$6:$DB$89,106,FALSE))","v":88},{"$f":"IF($B5=\"\",\" \",INDEX(Aout!$AH$6:$AH$89,MATCH(B5,Aout!$A$6:$A$89,0))+INDEX(Aout!$DC$6:$DC$89,MATCH(B5,Aout!$A$6:$A$89,0)))","v":56},null,null,null,null,null,null,null,null,null,null,null,null,null,null,null,1,"Albert"]
[2,"Jacques",null,null,null,400,{"$f":"IF(F6=0,\"\",H6-F6)","v":8},{"$f":"IF(F6<>0,SUMIF(I6:T6,\"<>#N/A\"),\"\")","v":408},{"$f":"IF($B6=\"\",\" \",VLOOKUP($B6,Juin!$A$6:$AH$101,34,FALSE)+VLOOKUP($B6,Juin!$A$6:$DB$101,106,FALSE))","v":136},{"$f":"IF($B6=\"\",\" \",VLOOKUP($B6,Juillet!$A$6:$AH$89,34,FALSE)+VLOOKUP($B6,Juillet!$A$6:$DB$89,106,FALSE))","v":112},{"$f":"IF($B6=\"\",\" \",INDEX(Aout!$AH$6:$AH$89,MATCH(B6,Aout!$A$6:$A$89,0))+INDEX(Aout!$DC$6:$DC$89,MATCH(B6,Aout!$A$6:$A$89,0)))","v":160},null,null,null,null,null,null,null,null,null,null,null,null,null,null,null,2,"Jacques"]
[3,"Marcel",null,null,null,0,{"$f":"IF(F7=0,\"\",H7-F7)","v":""},{"$f":"IF(F7<>0,SUMIF(I7:T7,\"<>#N/A\"),\"\")","v":""},{"$f":"IF($B7=\"\",\" \",VLOOKUP($B7,Juin!$A$6:$AH$101,34,FALSE)+VLOOKUP($B7,Juin!$A$6:$DB$101,106,FALSE))","v":{"$error":"#N/A"}},{"$f":"IF($B7=\"\",\" \",VLOOKUP($B7,Juillet!$A$6:$AH$89,34,FALSE)+VLOOKUP($B7,Juillet!$A$6:$DB$89,106,FALSE))","v":{"$error":"#N/A"}},{"$f":"IF($B7=\"\",\" \",INDEX(Aout!$AH$6:$AH$89,MATCH(B7,Aout!$A$6:$A$89,0))+INDEX(Aout!$DC$6:$DC$89,MATCH(B7,Aout!$A$6:$A$89,0)))","v":{"$error":"#N/A"}},null,null,null,null,null,null,null,null,null,null,null,null,null,null,null,3,"Marcel"]
[4,"Paul",null,null,null,456,{"$f":"IF(F8=0,\"\",H8-F8)","v":-136},{"$f":"IF(F8<>0,SUMIF(I8:T8,\"<>#N/A\"),\"\")","v":320},{"$f":"IF($B8=\"\",\" \",VLOOKUP($B8,Juin!$A$6:$AH$101,34,FALSE)+VLOOKUP($B8,Juin!$A$6:$DB$101,106,FALSE))","v":144},{"$f":"IF($B8=\"\",\" \",VLOOKUP($B8,Juillet!$A$6:$AH$89,34,FALSE)+VLOOKUP($B8,Juillet!$A$6:$DB$89,106,FALSE))","v":88},{"$f":"IF($B8=\"\",\" \",INDEX(Aout!$AH$6:$AH$89,MATCH(B8,Aout!$A$6:$A$89,0))+INDEX(Aout!$DC$6:$DC$89,MATCH(B8,Aout!$A$6:$A$89,0)))","v":88},null,null,null,null,null,null,null,null,null,null,null,null,null,null,null,4,"Paul"]
[5,"Pierre",null,null,null,440,{"$f":"IF(F9=0,\"\",H9-F9)","v":-8},{"$f":"IF(F9<>0,SUMIF(I9:T9,\"<>#N/A\"),\"\")","v":432},{"$f":"IF($B9=\"\",\" \",VLOOKUP($B9,Juin!$A$6:$AH$101,34,FALSE)+VLOOKUP($B9,Juin!$A$6:$DB$101,106,FALSE))","v":152},{"$f":"IF($B9=\"\",\" \",VLOOKUP($B9,Juillet!$A$6:$AH$89,34,FALSE)+VLOOKUP($B9,Juillet!$A$6:$DB$89,106,FALSE))","v":144},{"$f":"IF($B9=\"\",\" \",INDEX(Aout!$AH$6:$AH$89,MATCH(B9,Aout!$A$6:$A$89,0))+INDEX(Aout!$DC$6:$DC$89,MATCH(B9,Aout!$A$6:$A$89,0)))","v":136},null,null,null,null,null,null,null,null,null,null,null,null,null,null,null,5,"Pierre"]
[6,null,null,null,null,null,{"$f":"IF(F10=0,\"\",H10-F10)","v":""},{"$f":"IF(F10<>0,SUMIF(I10:T10,\"<>#N/A\"),\"\")","v":""},{"$f":"IF($B10=\"\",\" \",VLOOKUP($B10,Juin!$A$6:$AH$101,34,FALSE)+VLOOKUP($B10,Juin!$A$6:$DB$101,106,FALSE))","v":" "},{"$f":"IF($B10=\"\",\" \",VLOOKUP($B10,Juillet!$A$6:$AH$89,34,FALSE)+VLOOKUP($B10,Juillet!$A$6:$DB$89,106,FALSE))","v":" "},{"$f":"IF($B10=\"\",\" \",INDEX(Aout!$AH$6:$AH$89,MATCH(B10,Aout!$A$6:$A$89,0))+INDEX(Aout!$DC$6:$DC$89,MATCH(B10,Aout!$A$6:$A$89,0)))","v":" "},null,null,null,null,null,null,null,null,null,null,null,null,null,null,null,6]
{"$rows_left_out":11}
{"sheet":"Juin","index":2,"n_rows":89,"n_cols":106,"rows_kept":89,"cut":false,"hidden":false,"merged":[[3,102,3,103],[3,104,3,105],[0,2,3,32]]}
[null,null,"JUIN",null,null,null,null,null,null,null,null,null,null,null,null,null,null,null,null,null,null,null,null,null,null,null,null,null,null,null,null,null,null,null,null,null,null,null,null,null,null,null,null,null,null,null,null,null,null,null,null,null,null,null,null,null,null,null,null,null,null,null,null,null,null,null,null,null,null,null,null,null,null,null,null,null,null,null,null,null,null,null,null,null,null,null,null,null,null,null,null,null,null,null,null,null,null,null,null,null,1]
[]
[]
[null,null,null,null,null,null,null,null,null,null,null,null,null,null,null,null,null,null,null,null,null,null,null,null,null,null,null,null,null,null,null,null,null,"Mois",null,null,null,null,null,null,null,null,null,null,null,null,null,null,null,null,null,null,null,null,null,null,null,null,null,null,null,null,null,null,null,null,null,null,null,null,null,null,null,null,null,null,null,null,null,null,null,null,null,null,null,null,null,null,null,null,null,null,null,null,null,null,null,null,null,null,null,"CP","Solde année",null,"Maladie"]
[null,"J",1,2,3,4,5,6,7,8,9,10,11,12,13,14,15,16,17,18,19,20,21,22,23,24,25,26,27,28,29,30,null,"H",null,null,null,null,null,null,null,null,null,null,null,null,null,null,null,null,null,null,null,null,null,null,null,null,null,null,null,null,null,null,null,null,null,null,null,null,null,null,null,null,null,null,null,null,null,null,null,null,null,null,null,null,null,null,null,null,null,null,null,null,null,null,null,null,null,null,null,"J","H","J","J","H Théo"]
["Paul",{"$f":"COUNTA(C6:AG6)-CX6-DA6","v":18},"X","X","X",null,null,null,"X","X","X","X",null,null,"X","X","X",null,null,null,"X","X","X","X",null,null,"X","X","X","X",null,null,null,{"$f":"B6*8","v":144},null,null,null,null,null,null,null,null,null,null,null,null,null,null,null,null,null,null,null,null,null,null,null,null,null,null,null,null,null,null,null,null,null,null,null,null,null,null,null,null,null,null,null,null,null,null,null,null,null,null,null,null,null,null,null,null,null,null,null,null,null,null,null,null,null,null,null,{"$f":"COUNTIF(C6:AG6,\"CP\")","v":0},{"$f":"IF($A6=0,\" \",VLOOKUP($A6,Salaries!$B$5:$G$104,6))","v":-136},{"$f":"IFERROR(CY6/8,\"\")","v":-17},{"$f":"COUNTIF(C6:AG6,\"MAL\")+COUNTIF(C6:AG6,\"AT\")","v":0},0]
["Jacques",{"$f":"COUNTA(C7:AG7)-CX7-DA7","v":17},null,null,null,"X","X","X",null,null,"X","X","X","X",null,null,null,"X","X","X",null,null,"X","X","X",null,null,null,"X","X","X","X",null,{"$f":"B7*8","v":136},null,null,null,null,null,null,null,null,null,null,null,null,null,null,null,null,null,null,null,null,null,null,null,null,null,null,null,null,null,null,null,null,null,null,null,null,null,null,null,null,null,null,null,null,null,null,null,null,null,null,null,null,null,null,null,null,null,null,null,null,null,null,null,null,null,null,null,{"$f":"COUNTIF(C7:AG7,\"CP\")","v":0},{"$f":"IF($A7=0,\" \",VLOOKUP($A7,Salaries!$B$5:$G$104,6))","v":8},1,{"$f":"COUNTIF(C7:AG7,\"MAL\")+COUNTIF(C7:AG7,\"AT\")","v":0},0]
["Pierre",19,"X","X","X",null,null,"X","X","X",null,null,"X","X","X","X",null,null,"X","X","X","X",null,null,null,"X","X","X",null,null,"X","X",null,152,null,null,null,null,null,null,null,null,null,null,null,null,null,null,null,null,null,null,null,null,null,null,null,null,null,null,null,null,null,null,null,null,null,null,null,null,null,null,null,null,null,null,null,null,null,null,null,null,null,null,null,null,null,null,null,null,null,null,null,null,null,null,null,null,null,null,null,0,{"$f":"IF($A8=0,\" \",VLOOKUP($A8,Salaries!$B$5:$G$104,6))","v":-8},-1,0,0]
["Albert",4,null,null,null,"X","X",null,null,null,null,"MAL","MAL","MAL","MAL","MAL","MAL","MAL",null,null,null,null,null,null,"X","X",null,null,null,null,null,null,null,32,null,null,null,null,null,null,null,null,null,null,null,null,null,null,null,null,null,null,null,null,null,null,null,null,null,null,null,null,null,null,null,null,null,null,null,null,null,null,null,null,null,null,null,null,null,null,null,null,null,null,null,null,null,null,null,null,null,null,null,null,null,null,null,null,null,null,null,0,{"$f":"IF($A9=0,\" \",VLOOKUP($A9,Salaries!$B$5:$G$104,6))","v":0},0,7,16]
[null,0,null,null,null,null,null,null,null,null,null,null,null,null,null,null,null,null,null,null,null,null,null,null,null,null,null,null,null,null,null,null,null,0,null,null,null,null,null,null,null,null,null,null,null,null,null,null,null,null,null,null,null,null,null,null,null,null,null,null,null,null,null,null,null,null,null,null,null,null,null,null,null,null,null,null,null,null,null,null,null,null,null,null,null,null,null,null,null,null,null,null,null,null,null,null,null,null,null,null,null,0,{"$f":"IF($A10=0,\" \",VLOOKUP($A10,Salaries!$B$5:$G$104,6))","v":" "},"",0,0]
{"$rows_left_out":80}
{"sheet":"Juillet","index":3,"n_rows":89,"n_cols":106,"rows_kept":89,"cut":false,"hidden":false,"merged":[[3,102,3,103],[0,2,3,32],[3,104,3,105]]}
[null,null,"JUILLET",null,null,null,null,null,null,null,null,null,null,null,null,null,null,null,null,null,null,null,null,null,null,null,null,null,null,null,null,null,null,null,null,null,null,null,null,null,null,null,null,null,null,null,null,null,null,null,null,null,null,null,null,null,null,null,null,null,null,null,null,null,null,null,null,null,null,null,null,null,null,null,null,null,null,null,null,null,null,null,null,null,null,null,null,null,null,null,null,null,null,null,null,null,null,null,null,null,1]
[]
[]
[null,null,null,null,null,null,null,null,null,null,null,null,null,null,null,null,null,null,null,null,null,null,null,null,null,null,null,null,null,null,null,null,null,"Mois",null,null,null,null,null,null,null,null,null,null,null,null,null,null,null,null,null,null,null,null,null,null,null,null,null,null,null,null,null,null,null,null,null,null,null,null,null,null,null,null,null,null,null,null,null,null,null,null,null,null,null,null,null,null,null,null,null,null,null,null,null,null,null,null,null,null,null,"CP","Solde année",null,"Maladie"]
[null,"J",1,2,3,4,5,6,7,8,9,10,11,12,13,14,15,16,17,18,19,20,21,22,23,24,25,26,27,28,29,30,31,"H",null,null,null,null,null,null,null,null,null,null,null,null,null,null,null,null,null,null,null,null,null,null,null,null,null,null,null,null,null,null,null,null,null,null,null,null,null,null,null,null,null,null,null,null,null,null,null,null,null,null,null,null,null,null,null,null,null,null,null,null,null,null,null,null,null,null,null,"J","H","J","J","H Théo"]
["Jacques",{"$f":"COUNTA(C6:AG6)-CX6-DA6","v":14},"X","X","X",null,null,null,"X","X","X","X",null,null,"X","X","X",null,null,null,"CP","CP","CP","CP","CP","CP","CP","X","X","X",null,null,"X",{"$f":"B6*8","v":112},null,null,null,null,null,null,null,null,null,null,null,null,null,null,null,null,null,null,null,null,null,null,null,null,null,null,null,null,null,null,null,null,null,null,null,null,null,null,null,null,null,null,null,null,null,null,null,null,null,null,null,null,null,null,null,null,null,null,null,null,null,null,null,null,null,null,null,{"$f":"COUNTIF(C6:AG6,\"CP\")","v":7},{"$f":"IF($A6=0,\" \",VLOOKUP($A6,Salaries!$B$5:$G$104,6))","v":8},{"$f":"IFERROR(CY6/8,\"\")","v":1},{"$f":"COUNTIF(C6:AG6,\"MAL\")+COUNTIF(C6:AG6,\"AT\")","v":0},0]
["Pierre",{"$f":"COUNTA(C7:AG7)-CX7-DA7","v":18},null,null,null,"X","X","X",null,null,"X","X","X","X",null,null,null,"X","X","X",null,null,"X","X","X","X",null,null,"X","X","X","X",null,{"$f":"B7*8","v":144},null,null,null,null,null,null,null,null,null,null,null,null,null,null,null,null,null,null,null,null,null,null,null,null,null,null,null,null,null,null,null,null,null,null,null,null,null,null,null,null,null,null,null,null,null,null,null,null,null,null,null,null,null,null,null,null,null,null,null,null,null,null,null,null,null,null,null,{"$f":"COUNTIF(C7:AG7,\"CP\")","v":0},{"$f":"IF($A7=0,\" \",VLOOKUP($A7,Salaries!$B$5:$G$104,6))","v":-8},{"$f":"IFERROR(CY7/8,\"\")","v":-1},{"$f":"COUNTIF(C7:AG7,\"MAL\")+COUNTIF(C7:AG7,\"AT\")","v":0},0]
["Paul",11,null,null,null,null,null,null,null,null,null,null,null,null,null,null,null,null,"X","X","X","X",null,null,"X","X","X","X",null,null,"X","X","X",88,null,null,null,null,null,null,null,null,null,null,null,null,null,null,null,null,null,null,null,null,null,null,null,null,null,null,null,null,null,null,null,null,null,null,null,null,null,null,null,null,null,null,null,null,null,null,null,null,null,null,null,null,null,null,null,null,null,null,null,null,null,null,null,null,null,null,null,0,{"$f":"IF($A8=0,\" \",VLOOKUP($A8,Salaries!$B$5:$G$104,6))","v":-136},-17,0,0]
["Paul",9,"X","X",null,null,"X","X","X","X",null,null,"X","X","X",null,null,null,null,null,null,null,null,null,null,null,null,null,null,null,null,null,null,72,null,null,null,null,null,null,null,null,null,null,null,null,null,null,null,null,null,null,null,null,null,null,null,null,null,null,null,null,null,null,null,null,null,null,null,null,null,null,null,null,null,null,null,null,null,null,null,null,null,null,null,null,null,null,null,null,null,null,null,null,null,null,null,null,null,null,null,0,{"$f":"IF($A9=0,\" \",VLOOKUP($A9,Salaries!$B$5:$G$104,6))","v":-136},-17,0,0]
["Albert",11,null,null,"X","X",null,null,null,null,null,null,null,null,null,"X","X","X",null,null,"X","X","X","X",null,null,"X",null,null,null,null,null,"X",88,null,null,null,null,null,null,null,null,null,null,null,null,null,null,null,null,null,null,null,null,null,null,null,null,null,null,null,null,null,null,null,null,null,null,null,null,null,null,null,null,null,null,null,null,null,null,null,null,null,null,null,null,null,null,null,null,null,null,null,null,null,null,null,null,null,null,null,0,{"$f":"IF($A10=0,\" \",VLOOKUP($A10,Salaries!$B$5:$G$104,6))","v":0},0,0,0]
{"$rows_left_out":80}
{"sheet":"Aout","index":4,"n_rows":89,"n_cols":107,"rows_kept":89,"cut":false,"hidden":false,"merged":[[3,103,3,104],[0,2,3,32],[3,105,3,106]]}
[null,null,"AOUT",null,null,null,null,null,null,null,null,null,null,null,null,null,null,null,null,null,null,null,null,null,null,null,null,null,null,null,null,null,null,null,null,null,null,null,null,null,null,null,null,null,null,null,null,null,null,null,null,null,null,null,null,null,null,null,null,null,null,null,null,null,null,null,null,null,null,null,null,null,null,null,null,null,null,null,null,null,null,null,null,null,null,null,null,null,null,null,null,null,null,null,null,null,null,null,null,null,1]
[]
[]
[null,null,null,null,null,null,null,null,null,null,null,null,null,null,null,null,null,null,null,null,null,null,null,null,null,null,null,null,null,null,null,null,null,"Mois",null,null,null,null,null,null,null,null,null,null,null,null,null,null,null,null,null,null,null,null,null,null,null,null,null,null,null,null,null,null,null,null,null,null,null,null,null,null,null,null,null,null,null,null,null,null,null,null,null,null,null,null,null,null,null,null,null,null,null,null,null,null,null,null,null,null,null,"CP",null,"Solde année",null,"Maladie"]
[null,"J",1,2,3,4,5,6,7,8,9,10,11,12,13,14,15,16,17,18,19,20,21,22,23,24,25,26,27,28,29,30,31,"H",null,null,null,null,null,null,null,null,null,null,null,null,null,null,null,null,null,null,null,null,null,null,null,null,null,null,null,null,null,null,null,null,null,null,null,null,null,null,null,null,null,null,null,null,null,null,null,null,null,null,null,null,null,null,null,null,null,null,null,null,null,null,null,null,null,null,null,"J",null,"H","J","J","H Théo"]
["Jacques",{"$f":"COUNTA(C6:AG6)-CX6-DB6","v":20},"X","X","X",null,null,null,"X","X","X","X",null,null,"X","X","X","X",null,null,"X","X","X","X",null,null,"X","X","X","X",null,null,"X",{"$f":"B6*8","v":160},null,null,null,null,null,null,null,null,null,null,null,null,null,null,null,null,null,null,null,null,null,null,null,null,null,null,null,null,null,null,null,null,null,null,null,null,null,null,null,null,null,null,null,null,null,null,null,null,null,null,null,null,null,null,null,null,null,null,null,null,null,null,null,null,null,null,null,{"$f":"COUNTIF(C6:AG6,\"CP\")","v":0},{"$f":"IF($A6=0,\" \",VLOOKUP($A6,Salaries!$B$5:$G$104,6))","v":8},{"$f":"IF($A6=0,\" \",VLOOKUP($A6,Salaries!$B$5:$G$104,6))","v":8},{"$f":"IFERROR(CZ6/8,\"\")","v":1},{"$f":"COUNTIF(C6:AG6,\"MAL\")+COUNTIF(C6:AG6,\"AT\")","v":0},0]
["Pierre",{"$f":"COUNTA(C7:AG7)-CX7-DB7","v":17},null,null,null,"X","X","X",null,null,"X","X","X","X",null,null,null,"X","X","X",null,null,"X","X","X",null,null,null,"X","X","X","X",null,{"$f":"B7*8","v":136},null,null,null,null,null,null,null,null,null,null,null,null,null,null,null,null,null,null,null,null,null,null,null,null,null,null,null,null,null,null,null,null,null,null,null,null,null,null,null,null,null,null,null,null,null,null,null,null,null,null,null,null,null,null,null,null,null,null,null,null,null,null,null,null,null,null,null,{"$f":"COUNTIF(C7:AG7,\"CP\")","v":0},{"$f":"IF($A7=0,\" \",VLOOKUP($A7,Salaries!$B$5:$G$104,6))","v":-8},{"$f":"IF($A7=0,\" \",VLOOKUP($A7,Salaries!$B$5:$G$104,6))","v":-8},{"$f":"IFERROR(CZ7/8,\"\")","v":-1},{"$f":"COUNTIF(C7:AG7,\"MAL\")+COUNTIF(C7:AG7,\"AT\")","v":0},0]
["Paul",11,null,null,null,null,null,null,null,null,null,null,null,null,null,null,null,null,"X","X","X","X",null,null,"X","X","X","X",null,null,"X","X","X",88,null,null,null,null,null,null,null,null,null,null,null,null,null,null,null,null,null,null,null,null,null,null,null,null,null,null,null,null,null,null,null,null,null,null,null,null,null,null,null,null,null,null,null,null,null,null,null,null,null,null,null,null,null,null,null,null,null,null,null,null,null,null,null,null,null,null,null,0,{"$f":"IF($A8=0,\" \",VLOOKUP($A8,Salaries!$B$5:$G$104,6))","v":-136},{"$f":"IF($A8=0,\" \",VLOOKUP($A8,Salaries!$B$5:$G$104,6))","v":-136},-17,0,0]
["Paul",8,"X","X","X",null,null,"X","X","X",null,null,"X","X",null,null,null,null,null,null,null,null,null,null,null,null,null,null,null,null,null,null,null,64,null,null,null,null,null,null,null,null,null,null,null,null,null,null,null,null,null,null,null,null,null,null,null,null,null,null,null,null,null,null,null,null,null,null,null,null,null,null,null,null,null,null,null,null,null,null,null,null,null,null,null,null,null,null,null,null,null,null,null,null,null,null,null,null,null,null,null,0,{"$f":"IF($A9=0,\" \",VLOOKUP($A9,Salaries!$B$5:$G$104,6))","v":-136},{"$f":"IF($A9=0,\" \",VLOOKUP($A9,Salaries!$B$5:$G$104,6))","v":-136},-17,0,0]
["Albert",7,null,null,null,"X","X",null,null,null,null,null,null,null,"X","X","X",null,null,null,null,null,null,null,null,"X",null,null,null,null,null,null,"X",56,null,null,null,null,null,null,null,null,null,null,null,null,null,null,null,null,null,null,null,null,null,null,null,null,null,null,null,null,null,null,null,null,null,null,null,null,null,null,null,null,null,null,null,null,null,null,null,null,null,null,null,null,null,null,null,null,null,null,null,null,null,null,null,null,null,null,null,0,{"$f":"IF($A10=0,\" \",VLOOKUP($A10,Salaries!$B$5:$G$104,6))","v":0},{"$f":"IF($A10=0,\" \",VLOOKUP($A10,Salaries!$B$5:$G$104,6))","v":0},0,0]
{"$rows_left_out":80}
{"sheet":"Pâques","index":5,"n_rows":79,"n_cols":32,"rows_kept":79,"cut":false,"hidden":true,"merged":[]}
[null,"Année",null,"Pâques",null,null,null,null,null,null,null,null,"Année",null,"Pâques A+1",null,null,null,null,null,null,null,null,"Année",null,"Pâques A-1"]
[null,2017,null,{"$f":"TEXT(D66,\"jj\")&\" \"&TEXT(D68,\"mmmm\")&\" \"&B2","v":"16 avril 2017"},null,null,"2017-03-22",null,null,null,null,null,2018,null,{"$f":"TEXT(O66,\"jj\")&\" \"&TEXT(O68,\"mmmm\")&\" \"&M2","v":"01 avril 2018"},null,null,"2018-03-22",null,null,null,null,null,2016,null,{"$f":"TEXT(Z66,\"jj\")&\" \"&TEXT(Z68,\"mmmm\")&\" \"&X2","v":"27 mars 2016"},null,null,"2016-03-22"]
[]
[]
[null,"Calcul de G",{"$f":"INT(B2/19)","v":106},{"$f":"19*C5","v":2014},{"$f":"B2-D5","v":3},null,null,null,"G=",{"$f":"E5","v":3},null,null,"Calcul de G",{"$f":"INT(M2/19)","v":106},{"$f":"19*N5","v":2014},{"$f":"M2-O5","v":4},null,null,null,"G=",{"$f":"P5","v":4},null,null,"Calcul de G",{"$f":"INT(X2/19)","v":106},{"$f":"19*Y5","v":2014},{"$f":"X2-Z5","v":2},null,null,null,"G=",{"$f":"AA5","v":2}]
[]
[null,"Calcul de C",{"$f":"INT(B2/100)","v":20},null,null,null,null,null,"C=",{"$f":"C7","v":20},null,null,"Calcul de C",{"$f":"INT(M2/100)","v":20},null,null,null,null,null,"C=",{"$f":"N7","v":20},null,null,"Calcul de C",{"$f":"INT(X2/100)","v":20},null,null,null,null,null,"C=",{"$f":"Y7","v":20}]
[]
[null,"Calcul de C4",{"$f":"INT(C7/4)","v":5},null,null,null,null,null,"C4=",{"$f":"C9","v":5},null,null,"Calcul de C4",{"$f":"INT(N7/4)","v":5},null,null,null,null,null,"C4=",{"$f":"N9","v":5},null,null,"Calcul de C4",{"$f":"INT(Y7/4)","v":5},null,null,null,null,null,"C4=",{"$f":"Y9","v":5}]
[]
{"$rows_left_out":69}