{"text_format":"1","workbook":"xlsx","n_sheets":16,"sheets":["Paramètrage","Base","Exercices","Programmes","Accueil","GraphExercices","GraphJSP","ParNom","ParExercice","ParNomXL","ParExerciceXL","ModelGraph","ParNomData","ParExerciceData","ParNomXLData","ParExerciceXLData"],"not_rendered":{"charts":56,"images":6,"macros":1,"external_links":0,"defined_names":4,"comments":0,"pivot_tables":0},"unopened":[],"bounds":{"document_bytes":16777216,"sheet_cells":100000,"rows_first":2000,"rows_last":500,"rows_between":2000,"halvings":0,"cell_chars":16384,"cell_head_chars":4096},"cells_cut":0,"cells_raw":0,"read":"whole","date_system":"1900"}

{"sheet":"Paramètrage","index":0,"n_rows":16,"n_cols":9,"rows_kept":16,"cut":false,"hidden":false,"merged":[]}
["JSP 3","Groupe Année","Date de naissance",null,"Programmes",null,"Groupes musculaires",null,"Animateur"]
[]
["Nom1",3,"xx/xx/xxxx",null,"Entrainement N°1",null,"Full body",null,"Annimateur 1"]
["Nom2",3,"xx/xx/xxxx",null,"Entrainement N°2",null,"Abdominaux",null,"Annimateur 2"]
["Nom3",3,"xx/xx/xxxx",null,"Entrainement N°3",null,"Dos"]
["Nom4",3,"xx/xx/xxxx",null,"Entrainement N°4",null,"Pectoraux"]
["Nom5",3,"xx/xx/xxxx",null,null,null,"Membres supérieurs"]
["Nom6",3,"xx/xx/xxxx",null,null,null,"Membres inférieurs"]
["Nom7",4,"xx/xx/xxxx",null,null,null,"Cardio"]
["Nom8",4,"xx/xx/xxxx"]
["Nom9",4,"xx/xx/xxxx"]
["Nom10",4,"xx/xx/xxxx"]
["Nom11",4,"xx/xx/xxxx"]
["Nom12",4,"xx/xx/xxxx"]
["Nom13",4,"xx/xx/xxxx"]
["Nom14",4,"xx/xx/xxxx"]

{"sheet":"Base","index":1,"n_rows":84,"n_cols":10,"rows_kept":84,"cut":false,"hidden":false,"merged":[]}
["N° de session","Date de la saisie","Date de l'entrainement","Animateur 1","Animateur 2","Programme réalisé","Nom du JSP","        Nom de l'exercice","Résultat","Commentaires"]
[1,"2016-01-11","2016-01-11",null,null,"Entrainement N°1","Nom3","Exercice N°1",5]
[1,"2016-11-01","2016-02-12",null,null,"Entrainement N°2","Nom1","Exercice N°1",10]
[1,"2016-11-01","2016-05-13",null,null,"Entrainement N°4","Nom1","Exercice N°1",10]
[2,"2016-10-25","2016-11-14",null,null,"Entrainement N°4","Nom1","Exercice N°1",5]
[3,"2016-11-03","2016-11-03",null,null,"Entrainement N°4","Nom1","Exercice N°10",5]
[4,"2016-12-12","2016-12-12",null,null,"Entrainement N°1","Nom1","Exercice N°10",10]
[4,"2016-12-12","2016-12-13",null,null,"Entrainement N°1","Nom1","Exercice N°10",10]
[4,"2016-12-12","2016-12-14",null,null,"Entrainement N°1","Nom1","Exercice N°10",5]
[4,"2016-12-12","2016-12-15",null,null,"Entrainement N°1","Nom1","Exercice N°10",10]
[4,"2016-12-12","2016-12-16",null,null,"Entrainement N°1","Nom1","Exercice N°10",10]
[4,"2016-11-04","2016-11-04",null,null,"Entrainement N°4","Nom3","Exercice N°10",5]
[4,"2016-12-12","2016-12-12",null,null,"Entrainement N°1","Nom3","Exercice N°10","ABS"]
[3,"2016-11-03","2016-11-03",null,null,"Entrainement N°2","Nom1","Exercice N°11",10]
[4,"2016-12-12","2016-12-12",null,null,"Entrainement N°1","Nom1","Exercice N°11",5]
[4,"2016-12-12","2016-12-13",null,null,"Entrainement N°1","Nom1","Exercice N°11",10]
[4,"2016-12-12","2016-12-14",null,null,"Entrainement N°1","Nom1","Exercice N°11",5]
[4,"2016-12-12","2016-12-15",null,null,"Entrainement N°1","Nom1","Exercice N°11",5]
[4,"2016-12-12","2016-12-16",null,null,"Entrainement N°1","Nom1","Exercice N°11",10]
[4,"2016-12-12","2016-12-17",null,null,"Entrainement N°1","Nom3","Exercice N°11",10]
[3,"2016-11-03","2016-11-03",null,null,"Entrainement N°4","Nom1","Exercice N°12",5]
[4,"2016-12-12","2016-12-12",null,null,"Entrainement N°1","Nom1","Exercice N°12",10]
[4,"2016-12-12","2016-12-11",null,null,"Entrainement N°1","Nom1","Exercice N°12",10]
[4,"2016-12-12","2016-12-14",null,null,"Entrainement N°1","Nom1","Exercice N°12",5]
[4,"2016-12-12","2016-12-10",null,null,"Entrainement N°1","Nom1","Exercice N°12","ABS"]
[4,"2016-12-12","2016-12-16",null,null,"Entrainement N°1","Nom1","Exercice N°12",10]
[4,"2016-12-12","2016-12-17",null,null,"Entrainement N°1","Nom1","Exercice N°12",5]
[4,"2016-12-12","2016-12-18",null,null,"Entrainement N°1","Nom1","Exercice N°12",10]
[4,"2016-11-04","2016-11-04",null,null,"Entrainement N°4","Nom3","Exercice N°12",5]
[4,"2016-12-12","2016-12-12",null,null,"Entrainement N°1","Nom3","Exercice N°12",5]
[3,"2016-11-03","2016-11-03",null,null,"Entrainement N°1","Nom1","Exercice N°2",10]
[4,"2016-11-04","2016-11-14",null,null,"Entrainement N°1","Nom1","Exercice N°2",10]
[4,"2016-11-04","2016-11-05",null,null,"Entrainement N°1","Nom1","Exercice N°3",5]
[4,"2016-11-04","2016-11-06",null,null,"Entrainement N°1","Nom1","Exercice N°3",10]
[4,"2016-11-04","2016-11-07",null,null,"Entrainement N°1","Nom1","Exercice N°3",10]
[4,"2016-11-04","2016-11-08",null,null,"Entrainement N°1","Nom1","Exercice N°3",5]
[3,"2016-11-03","2016-11-03",null,null,"Entrainement N°1","Nom1","Exercice N°3","ABS"]
[4,"2016-11-04","2016-11-04",null,null,"Entrainement N°1","Nom1","Exercice N°3",10]
[1,"2016-11-01","2016-11-01",null,null,"Entrainement N°2","Nom1","Exercice N°3",5]
[2,"2016-10-21","2016-10-21",null,null,"Entrainement N°4","Nom1","Exercice N°3",10]
[3,"2016-11-03","2016-11-03",null,null,"Entrainement N°4","Nom1","Exercice N°7",5]
[3,"2016-11-03","2016-11-04",null,null,"Entrainement N°4","Nom1","Exercice N°7",5]
[4,"2016-12-12","2016-12-12",null,null,"Entrainement N°1","Nom1","Exercice N°7",10]
[4,"2016-12-12","2016-12-13",null,null,"Entrainement N°1","Nom1","Exercice N°7",10]
[4,"2016-12-12","2016-12-14",null,null,"Entrainement N°1","Nom1","Exercice N°7",5]
[4,"2016-12-12","2016-12-15",null,null,"Entrainement N°1","Nom1","Exercice N°7",10]
[4,"2016-12-12","2016-12-16",null,null,"Entrainement N°1","Nom1","Exercice N°7",10]
[3,"2016-11-03","2016-11-03",null,null,"Entrainement N°4","Nom2","Exercice N°7",5]
[3,"2016-11-03","2016-11-04",null,null,"Entrainement N°4","Nom2","Exercice N°7","ABS"]
[3,"2016-11-03","2016-11-05",null,null,"Entrainement N°4","Nom2","Exercice N°7",10]
[3,"2016-11-03","2016-11-06",null,null,"Entrainement N°4","Nom3","Exercice N°7",5]
[4,"2016-11-04","2016-11-04",null,null,"Entrainement N°4","Nom3","Exercice N°7",10]
[4,"2016-12-12","2016-12-12",null,null,"Entrainement N°1","Nom3","Exercice N°7",5]
[3,"2016-11-03","2016-11-03",null,null,"Entrainement N°4","Nom4","Exercice N°7",5]
[3,"2016-11-03","2016-11-04",null,null,"Entrainement N°4","Nom4","Exercice N°7",10]
[3,"2016-11-03","2016-11-05",null,null,"Entrainement N°4","Nom4","Exercice N°7",10]
[3,"2016-11-03","2016-11-06",null,null,"Entrainement N°4","Nom5","Exercice N°7",5]
[3,"2016-11-03","2016-11-07",null,null,"Entrainement N°4","Nom5","Exercice N°7",10]
[3,"2016-11-03","2016-11-08",null,null,"Entrainement N°4","Nom5","Exercice N°7",10]
[3,"2016-11-03","2016-11-09",null,null,"Entrainement N°4","Nom1","Exercice N°7",5]
[3,"2016-11-03","2016-11-10",null,null,"Entrainement N°4","Nom6","Exercice N°7","ABS"]
[3,"2016-11-03","2016-11-11",null,null,"Entrainement N°4","Nom6","Exercice N°7",10]
[3,"2016-11-03","2016-11-12",null,null,"Entrainement N°4","Nom6","Exercice N°7",5]
[3,"2016-11-03","2016-11-13",null,null,"Entrainement N°3","Nom1","Exercice N°8",10]
[3,"2016-11-03","2016-11-03",null,null,"Entrainement N°4","Nom1","Exercice N°8",5]
[3,"2016-11-04","2016-11-04",null,null,"Entrainement N°3","Nom1","Exercice N°8",5]
[3,"2016-11-03","2016-11-03",null,null,"Entrainement N°4","Nom2","Exercice N°8",10]
[3,"2016-11-03","2016-11-04",null,null,"Entrainement N°4","Nom2","Exercice N°8",10]
[3,"2016-11-03","2016-11-05",null,null,"Entrainement N°4","Nom2","Exercice N°8",5]
[3,"2016-11-03","2016-11-06",null,null,"Entrainement N°4","Nom3","Exercice N°8",10]
[4,"2016-11-04","2016-11-04",null,null,"Entrainement N°4","Nom3","Exercice N°8",10]
[3,"2016-11-03","2016-11-03",null,null,"Entrainement N°4","Nom4","Exercice N°8",5]
[3,"2016-11-03","2016-11-04",null,null,"Entrainement N°4","Nom4","Exercice N°8","ABS"]
[3,"2016-11-03","2016-11-05",null,null,"Entrainement N°4","Nom4","Exercice N°8",10]
[3,"2016-11-03","2016-11-06",null,null,"Entrainement N°4","Nom5","Exercice N°8",5]
[3,"2016-11-03","2016-11-07",null,null,"Entrainement N°4","Nom5","Exercice N°8",10]
[3,"2016-11-03","2016-11-08",null,null,"Entrainement N°4","Nom5","Exercice N°8",5]
[3,"2016-11-03","2016-11-09",null,null,"Entrainement N°4","Nom1","Exercice N°8",5]
[3,"2016-11-03","2016-11-10",null,null,"Entrainement N°3","Nom6","Exercice N°8",10]
[3,"2016-11-03","2016-11-11",null,null,"Entrainement N°4","Nom6","Exercice N°8",10]
[3,"2016-11-03","2016-11-12",null,null,"Entrainement N°4","Nom6","Exercice N°8",5]
[3,"2016-11-03","2016-11-13",null,null,"Entrainement N°4","Nom1","Exercice N°9",10]
[3,"2016-11-04","2016-11-04",null,null,"Entrainement N°3","Nom1","Exercice N°9",10]
[4,"2016-11-04","2016-11-05",null,null,"Entrainement N°4","Nom3","Exercice N°9",5]

{"sheet":"Exercices","index":2,"n_rows":14,"n_cols":6,"rows_kept":14,"cut":false,"hidden":false,"merged":[[0,1,1,1],[0,0,1,0],[0,2,0,5]]}
["Nom de l'excercice","Description de l'exercice","Groupes musculaires travaillées"]
[null,null,1,2,3,4]
["Exercice N°1","Effectuer une répulsion parralèle au sol. Plusieurs position peuvent être adoptées: écartées, sérrées, sur les genoux…","Pectoraux","Dos","Membres supérieurs"]
["Exercice N°2","Réaliser des abdominaux en travaillant l'intégralité du corps: abdominaux centraux, obliques…","Abdominaux"]
["Exercice N°3","Effectuer une extension suivi d'une pompe.","Full body"]
["Exercice N°4","Effectuer une flexion complète des menbres inférieurs.","Membres inférieurs"]
["Exercice N°5","Effectuer une flexion d'une jambe en gardant la jambe opposé tendu vers l'arrière.","Membres inférieurs"]
["Exercice N°6","Effectuer un mouvvement complet de tirage vertical à l'aide des bras uniquement (sans mouvements parasites) et en veillant à ce que le menton passe au dessus de la barre.","Membres supérieurs"]
["Exercice N°7","Départ bras tendu, pied croisé puis effectuer une traction complète en maintenant le menton au dessus de la barre sans le poser dessus.","Membres supérieurs"]
["Exercice N°8","Réaliser la montée de la corde.","Membres supérieurs","Abdominaux"]
["Exercice N°9","Se maintenir en position de planches parralèlement au sol, avant bras plaqués au sol.","Abdominaux"]
["Exercice N°10","Se placer dos à un mur en simulant la position assise en veillant à ce que les jambes soient fléchies au niveau du genou en respectant un angle de 90°","Membres inférieurs"]
["Exercice N°11","Départ jambes et bras tendus sur un banc. Réaliser la descente du corp en fléchéssant les coudes jusqu'à toucher le sol. Revenir en position initiale.","Membres inférieurs"]
["Exercice N°12","Courir sur la distance demandée en évitant tout arrêt.","Cardio"]

{"sheet":"Programmes","index":3,"n_rows":5,"n_cols":7,"rows_kept":5,"cut":false,"hidden":false,"merged":[]}
["Entrainement N°1",null,"Entrainement N°2",null,"Entrainement N°3",null,"Entrainement N°4"]
["Exercice N°7"]
["Exercice N°10"]
["Exercice N°11"]
["Exercice N°12"]

{"sheet":"Accueil","index":4,"n_rows":12,"n_cols":13,"rows_kept":12,"cut":false,"hidden":false,"merged":[[1,1,4,18],[11,4,14,7],[11,12,14,15]]}
[]
[null,"Suivi des indicateurs "]
[]
[]
[]
[]
[]
[]
[]
[]
[]
[null,null,null,null,"Suivi hebdomadaire",null,null,null,null,null,null,null,"Suivi annuel"]

{"sheet":"GraphExercices","index":5,"n_rows":30,"n_cols":8,"rows_kept":30,"cut":false,"hidden":false,"merged":[]}
[""]
["",null,null,null,null,null,null,"Comparaison des Exercices"]
[]
[]
[null,null,"Nb. 1","Nb. 0","ABS","Total"]
[{"$f":"IF(Exercices!$A3=\"\",\"\",Exercices!$A3)","v":"Exercice N°1"},null,{"$f":"IF($A$1=\"\",COUNTIFS(Base!$H:$H,$A6,Base!$I:$I,1),COUNTIFS(Base!$G:$G,$A$1,Base!$H:$H,$A6,Base!$I:$I,1))","v":0},{"$f":"IF($A$1=\"\",COUNTIFS(Base!$H:$H,$A6,Base!$I:$I,0),COUNTIFS(Base!$G:$G,$A$1,Base!$H:$H,$A6,Base!$I:$I,0))","v":0},{"$f":"IF($A$1=\"\",COUNTIFS(Base!$H:$H,$A6,Base!$I:$I,$E$5),COUNTIFS(Base!$G:$G,$A$1,Base!$H:$H,$A6,Base!$I:$I,$E$5))","v":0},{"$f":"IF($A6=\"\",\"\",IF($A$1=\"\",COUNTIF(Base!$H:$H,$A6),COUNTIFS(Base!$G:$G,$A$1,Base!$H:$H,$A6)))","v":4}]
[{"$f":"IF(Exercices!$A4=\"\",\"\",Exercices!$A4)","v":"Exercice N°2"},null,{"$f":"IF($A$1=\"\",COUNTIFS(Base!$H:$H,$A7,Base!$I:$I,1),COUNTIFS(Base!$G:$G,$A$1,Base!$H:$H,$A7,Base!$I:$I,1))","v":0},{"$f":"IF($A$1=\"\",COUNTIFS(Base!$H:$H,$A7,Base!$I:$I,0),COUNTIFS(Base!$G:$G,$A$1,Base!$H:$H,$A7,Base!$I:$I,0))","v":0},{"$f":"IF($A$1=\"\",COUNTIFS(Base!$H:$H,$A7,Base!$I:$I,$E$5),COUNTIFS(Base!$G:$G,$A$1,Base!$H:$H,$A7,Base!$I:$I,$E$5))","v":0},{"$f":"IF($A7=\"\",\"\",IF($A$1=\"\",COUNTIF(Base!$H:$H,$A7),COUNTIFS(Base!$G:$G,$A$1,Base!$H:$H,$A7)))","v":2}]
[{"$f":"IF(Exercices!$A5=\"\",\"\",Exercices!$A5)","v":"Exercice N°3"},null,{"$f":"IF($A$1=\"\",COUNTIFS(Base!$H:$H,$A8,Base!$I:$I,1),COUNTIFS(Base!$G:$G,$A$1,Base!$H:$H,$A8,Base!$I:$I,1))","v":0},{"$f":"IF($A$1=\"\",COUNTIFS(Base!$H:$H,$A8,Base!$I:$I,0),COUNTIFS(Base!$G:$G,$A$1,Base!$H:$H,$A8,Base!$I:$I,0))","v":0},{"$f":"IF($A$1=\"\",COUNTIFS(Base!$H:$H,$A8,Base!$I:$I,$E$5),COUNTIFS(Base!$G:$G,$A$1,Base!$H:$H,$A8,Base!$I:$I,$E$5))","v":1},{"$f":"IF($A8=\"\",\"\",IF($A$1=\"\",COUNTIF(Base!$H:$H,$A8),COUNTIFS(Base!$G:$G,$A$1,Base!$H:$H,$A8)))","v":8}]
[{"$f":"IF(Exercices!$A6=\"\",\"\",Exercices!$A6)","v":"Exercice N°4"},null,{"$f":"IF($A$1=\"\",COUNTIFS(Base!$H:$H,$A9,Base!$I:$I,1),COUNTIFS(Base!$G:$G,$A$1,Base!$H:$H,$A9,Base!$I:$I,1))","v":0},{"$f":"IF($A$1=\"\",COUNTIFS(Base!$H:$H,$A9,Base!$I:$I,0),COUNTIFS(Base!$G:$G,$A$1,Base!$H:$H,$A9,Base!$I:$I,0))","v":0},{"$f":"IF($A$1=\"\",COUNTIFS(Base!$H:$H,$A9,Base!$I:$I,$E$5),COUNTIFS(Base!$G:$G,$A$1,Base!$H:$H,$A9,Base!$I:$I,$E$5))","v":0},{"$f":"IF($A9=\"\",\"\",IF($A$1=\"\",COUNTIF(Base!$H:$H,$A9),COUNTIFS(Base!$G:$G,$A$1,Base!$H:$H,$A9)))","v":0}]
[{"$f":"IF(Exercices!$A7=\"\",\"\",Exercices!$A7)","v":"Exercice N°5"},null,{"$f":"IF($A$1=\"\",COUNTIFS(Base!$H:$H,$A10,Base!$I:$I,1),COUNTIFS(Base!$G:$G,$A$1,Base!$H:$H,$A10,Base!$I:$I,1))","v":0},{"$f":"IF($A$1=\"\",COUNTIFS(Base!$H:$H,$A10,Base!$I:$I,0),COUNTIFS(Base!$G:$G,$A$1,Base!$H:$H,$A10,Base!$I:$I,0))","v":0},{"$f":"IF($A$1=\"\",COUNTIFS(Base!$H:$H,$A10,Base!$I:$I,$E$5),COUNTIFS(Base!$G:$G,$A$1,Base!$H:$H,$A10,Base!$I:$I,$E$5))","v":0},{"$f":"IF($A10=\"\",\"\",IF($A$1=\"\",COUNTIF(Base!$H:$H,$A10),COUNTIFS(Base!$G:$G,$A$1,Base!$H:$H,$A10)))","v":0}]
[{"$f":"IF(Exercices!$A8=\"\",\"\",Exercices!$A8)","v":"Exercice N°6"},null,{"$f":"IF($A$1=\"\",COUNTIFS(Base!$H:$H,$A11,Base!$I:$I,1),COUNTIFS(Base!$G:$G,$A$1,Base!$H:$H,$A11,Base!$I:$I,1))","v":0},{"$f":"IF($A$1=\"\",COUNTIFS(Base!$H:$H,$A11,Base!$I:$I,0),COUNTIFS(Base!$G:$G,$A$1,Base!$H:$H,$A11,Base!$I:$I,0))","v":0},{"$f":"IF($A$1=\"\",COUNTIFS(Base!$H:$H,$A11,Base!$I:$I,$E$5),COUNTIFS(Base!$G:$G,$A$1,Base!$H:$H,$A11,Base!$I:$I,$E$5))","v":0},{"$f":"IF($A11=\"\",\"\",IF($A$1=\"\",COUNTIF(Base!$H:$H,$A11),COUNTIFS(Base!$G:$G,$A$1,Base!$H:$H,$A11)))","v":0}]
[{"$f":"IF(Exercices!$A9=\"\",\"\",Exercices!$A9)","v":"Exercice N°7"},null,{"$f":"IF($A$1=\"\",COUNTIFS(Base!$H:$H,$A12,Base!$I:$I,1),COUNTIFS(Base!$G:$G,$A$1,Base!$H:$H,$A12,Base!$I:$I,1))","v":0},{"$f":"IF($A$1=\"\",COUNTIFS(Base!$H:$H,$A12,Base!$I:$I,0),COUNTIFS(Base!$G:$G,$A$1,Base!$H:$H,$A12,Base!$I:$I,0))","v":0},{"$f":"IF($A$1=\"\",COUNTIFS(Base!$H:$H,$A12,Base!$I:$I,$E$5),COUNTIFS(Base!$G:$G,$A$1,Base!$H:$H,$A12,Base!$I:$I,$E$5))","v":2},{"$f":"IF($A12=\"\",\"\",IF($A$1=\"\",COUNTIF(Base!$H:$H,$A12),COUNTIFS(Base!$G:$G,$A$1,Base!$H:$H,$A12)))","v":23}]
[{"$f":"IF(Exercices!$A10=\"\",\"\",Exercices!$A10)","v":"Exercice N°8"},null,{"$f":"IF($A$1=\"\",COUNTIFS(Base!$H:$H,$A13,Base!$I:$I,1),COUNTIFS(Base!$G:$G,$A$1,Base!$H:$H,$A13,Base!$I:$I,1))","v":0},{"$f":"IF($A$1=\"\",COUNTIFS(Base!$H:$H,$A13,Base!$I:$I,0),COUNTIFS(Base!$G:$G,$A$1,Base!$H:$H,$A13,Base!$I:$I,0))","v":0},{"$f":"IF($A$1=\"\",COUNTIFS(Base!$H:$H,$A13,Base!$I:$I,$E$5),COUNTIFS(Base!$G:$G,$A$1,Base!$H:$H,$A13,Base!$I:$I,$E$5))","v":1},{"$f":"IF($A13=\"\",\"\",IF($A$1=\"\",COUNTIF(Base!$H:$H,$A13),COUNTIFS(Base!$G:$G,$A$1,Base!$H:$H,$A13)))","v":18}]
[{"$f":"IF(Exercices!$A11=\"\",\"\",Exercices!$A11)","v":"Exercice N°9"},null,{"$f":"IF($A$1=\"\",COUNTIFS(Base!$H:$H,$A14,Base!$I:$I,1),COUNTIFS(Base!$G:$G,$A$1,Base!$H:$H,$A14,Base!$I:$I,1))","v":0},{"$f":"IF($A$1=\"\",COUNTIFS(Base!$H:$H,$A14,Base!$I:$I,0),COUNTIFS(Base!$G:$G,$A$1,Base!$H:$H,$A14,Base!$I:$I,0))","v":0},{"$f":"IF($A$1=\"\",COUNTIFS(Base!$H:$H,$A14,Base!$I:$I,$E$5),COUNTIFS(Base!$G:$G,$A$1,Base!$H:$H,$A14,Base!$I:$I,$E$5))","v":0},{"$f":"IF($A14=\"\",\"\",IF($A$1=\"\",COUNTIF(Base!$H:$H,$A14),COUNTIFS(Base!$G:$G,$A$1,Base!$H:$H,$A14)))","v":3}]
[{"$f":"IF(Exercices!$A12=\"\",\"\",Exercices!$A12)","v":"Exercice N°10"},null,{"$f":"IF($A$1=\"\",COUNTIFS(Base!$H:$H,$A15,Base!$I:$I,1),COUNTIFS(Base!$G:$G,$A$1,Base!$H:$H,$A15,Base!$I:$I,1))","v":0},{"$f":"IF($A$1=\"\",COUNTIFS(Base!$H:$H,$A15,Base!$I:$I,0),COUNTIFS(Base!$G:$G,$A$1,Base!$H:$H,$A15,Base!$I:$I,0))","v":0},{"$f":"IF($A$1=\"\",COUNTIFS(Base!$H:$H,$A15,Base!$I:$I,$E$5),COUNTIFS(Base!$G:$G,$A$1,Base!$H:$H,$A15,Base!$I:$I,$E$5))","v":1},{"$f":"IF($A15=\"\",\"\",IF($A$1=\"\",COUNTIF(Base!$H:$H,$A15),COUNTIFS(Base!$G:$G,$A$1,Base!$H:$H,$A15)))","v":8}]
[{"$f":"IF(Exercices!$A13=\"\",\"\",Exercices!$A13)","v":"Exercice N°11"},null,{"$f":"IF($A$1=\"\",COUNTIFS(Base!$H:$H,$A16,Base!$I:$I,1),COUNTIFS(Base!$G:$G,$A$1,Base!$H:$H,$A16,Base!$I:$I,1))","v":0},{"$f":"IF($A$1=\"\",COUNTIFS(Base!$H:$H,$A16,Base!$I:$I,0),COUNTIFS(Base!$G:$G,$A$1,Base!$H:$H,$A16,Base!$I:$I,0))","v":0},{"$f":"IF($A$1=\"\",COUNTIFS(Base!$H:$H,$A16,Base!$I:$I,$E$5),COUNTIFS(Base!$G:$G,$A$1,Base!$H:$H,$A16,Base!$I:$I,$E$5))","v":0},{"$f":"IF($A16=\"\",\"\",IF($A$1=\"\",COUNTIF(Base!$H:$H,$A16),COUNTIFS(Base!$G:$G,$A$1,Base!$H:$H,$A16)))","v":7}]
[{"$f":"IF(Exercices!$A14=\"\",\"\",Exercices!$A14)","v":"Exercice N°12"},null,{"$f":"IF($A$1=\"\",COUNTIFS(Base!$H:$H,$A17,Base!$I:$I,1),COUNTIFS(Base!$G:$G,$A$1,Base!$H:$H,$A17,Base!$I:$I,1))","v":0},{"$f":"IF($A$1=\"\",COUNTIFS(Base!$H:$H,$A17,Base!$I:$I,0),COUNTIFS(Base!$G:$G,$A$1,Base!$H:$H,$A17,Base!$I:$I,0))","v":0},{"$f":"IF($A$1=\"\",COUNTIFS(Base!$H:$H,$A17,Base!$I:$I,$E$5),COUNTIFS(Base!$G:$G,$A$1,Base!$H:$H,$A17,Base!$I:$I,$E$5))","v":1},{"$f":"IF($A17=\"\",\"\",IF($A$1=\"\",COUNTIF(Base!$H:$H,$A17),COUNTIFS(Base!$G:$G,$A$1,Base!$H:$H,$A17)))","v":10}]
[{"$f":"IF(Exercices!$A15=\"\",\"\",Exercices!$A15)","v":""},null,{"$f":"IF($A$1=\"\",COUNTIFS(Base!$H:$H,$A18,Base!$I:$I,1),COUNTIFS(Base!$G:$G,$A$1,Base!$H:$H,$A18,Base!$I:$I,1))","v":0},{"$f":"IF($A$1=\"\",COUNTIFS(Base!$H:$H,$A18,Base!$I:$I,0),COUNTIFS(Base!$G:$G,$A$1,Base!$H:$H,$A18,Base!$I:$I,0))","v":0},{"$f":"IF($A$1=\"\",COUNTIFS(Base!$H:$H,$A18,Base!$I:$I,$E$5),COUNTIFS(Base!$G:$G,$A$1,Base!$H:$H,$A18,Base!$I:$I,$E$5))","v":0},{"$f":"IF($A18=\"\",\"\",IF($A$1=\"\",COUNTIF(Base!$H:$H,$A18),COUNTIFS(Base!$G:$G,$A$1,Base!$H:$H,$A18)))","v":""}]
[{"$f":"IF(Exercices!$A16=\"\",\"\",Exercices!$A16)","v":""},null,{"$f":"IF($A$1=\"\",COUNTIFS(Base!$H:$H,$A19,Base!$I:$I,1),COUNTIFS(Base!$G:$G,$A$1,Base!$H:$H,$A19,Base!$I:$I,1))","v":0},{"$f":"IF($A$1=\"\",COUNTIFS(Base!$H:$H,$A19,Base!$I:$I,0),COUNTIFS(Base!$G:$G,$A$1,Base!$H:$H,$A19,Base!$I:$I,0))","v":0},{"$f":"IF($A$1=\"\",COUNTIFS(Base!$H:$H,$A19,Base!$I:$I,$E$5),COUNTIFS(Base!$G:$G,$A$1,Base!$H:$H,$A19,Base!$I:$I,$E$5))","v":0},{"$f":"IF($A19=\"\",\"\",IF($A$1=\"\",COUNTIF(Base!$H:$H,$A19),COUNTIFS(Base!$G:$G,$A$1,Base!$H:$H,$A19)))","v":""}]
[{"$f":"IF(Exercices!$A17=\"\",\"\",Exercices!$A17)","v":""},null,{"$f":"IF($A$1=\"\",COUNTIFS(Base!$H:$H,$A20,Base!$I:$I,1),COUNTIFS(Base!$G:$G,$A$1,Base!$H:$H,$A20,Base!$I:$I,1))","v":0},{"$f":"IF($A$1=\"\",COUNTIFS(Base!$H:$H,$A20,Base!$I:$I,0),COUNTIFS(Base!$G:$G,$A$1,Base!$H:$H,$A20,Base!$I:$I,0))","v":0},{"$f":"IF($A$1=\"\",COUNTIFS(Base!$H:$H,$A20,Base!$I:$I,$E$5),COUNTIFS(Base!$G:$G,$A$1,Base!$H:$H,$A20,Base!$I:$I,$E$5))","v":0},{"$f":"IF($A20=\"\",\"\",IF($A$1=\"\",COUNTIF(Base!$H:$H,$A20),COUNTIFS(Base!$G:$G,$A$1,Base!$H:$H,$A20)))","v":""}]
[{"$f":"IF(Exercices!$A18=\"\",\"\",Exercices!$A18)","v":""},null,{"$f":"IF($A$1=\"\",COUNTIFS(Base!$H:$H,$A21,Base!$I:$I,1),COUNTIFS(Base!$G:$G,$A$1,Base!$H:$H,$A21,Base!$I:$I,1))","v":0},{"$f":"IF($A$1=\"\",COUNTIFS(Base!$H:$H,$A21,Base!$I:$I,0),COUNTIFS(Base!$G:$G,$A$1,Base!$H:$H,$A21,Base!$I:$I,0))","v":0},{"$f":"IF($A$1=\"\",COUNTIFS(Base!$H:$H,$A21,Base!$I:$I,$E$5),COUNTIFS(Base!$G:$G,$A$1,Base!$H:$H,$A21,Base!$I:$I,$E$5))","v":0},{"$f":"IF($A21=\"\",\"\",IF($A$1=\"\",COUNTIF(Base!$H:$H,$A21),COUNTIFS(Base!$G:$G,$A$1,Base!$H:$H,$A21)))","v":""}]
[{"$f":"IF(Exercices!$A19=\"\",\"\",Exercices!$A19)","v":""},null,{"$f":"IF($A$1=\"\",COUNTIFS(Base!$H:$H,$A22,Base!$I:$I,1),COUNTIFS(Base!$G:$G,$A$1,Base!$H:$H,$A22,Base!$I:$I,1))","v":0},{"$f":"IF($A$1=\"\",COUNTIFS(Base!$H:$H,$A22,Base!$I:$I,0),COUNTIFS(Base!$G:$G,$A$1,Base!$H:$H,$A22,Base!$I:$I,0))","v":0},{"$f":"IF($A$1=\"\",COUNTIFS(Base!$H:$H,$A22,Base!$I:$I,$E$5),COUNTIFS(Base!$G:$G,$A$1,Base!$H:$H,$A22,Base!$I:$I,$E$5))","v":0},{"$f":"IF($A22=\"\",\"\",IF($A$1=\"\",COUNTIF(Base!$H:$H,$A22),COUNTIFS(Base!$G:$G,$A$1,Base!$H:$H,$A22)))","v":""}]
[{"$f":"IF(Exercices!$A20=\"\",\"\",Exercices!$A20)","v":""},null,{"$f":"IF($A$1=\"\",COUNTIFS(Base!$H:$H,$A23,Base!$I:$I,1),COUNTIFS(Base!$G:$G,$A$1,Base!$H:$H,$A23,Base!$I:$I,1))","v":0},{"$f":"IF($A$1=\"\",COUNTIFS(Base!$H:$H,$A23,Base!$I:$I,0),COUNTIFS(Base!$G:$G,$A$1,Base!$H:$H,$A23,Base!$I:$I,0))","v":0},{"$f":"IF($A$1=\"\",COUNTIFS(Base!$H:$H,$A23,Base!$I:$I,$E$5),COUNTIFS(Base!$G:$G,$A$1,Base!$H:$H,$A23,Base!$I:$I,$E$5))","v":0},{"$f":"IF($A23=\"\",\"\",IF($A$1=\"\",COUNTIF(Base!$H:$H,$A23),COUNTIFS(Base!$G:$G,$A$1,Base!$H:$H,$A23)))","v":""}]
[{"$f":"IF(Exercices!$A21=\"\",\"\",Exercices!$A21)","v":""},null,{"$f":"IF($A$1=\"\",COUNTIFS(Base!$H:$H,$A24,Base!$I:$I,1),COUNTIFS(Base!$G:$G,$A$1,Base!$H:$H,$A24,Base!$I:$I,1))","v":0},{"$f":"IF($A$1=\"\",COUNTIFS(Base!$H:$H,$A24,Base!$I:$I,0),COUNTIFS(Base!$G:$G,$A$1,Base!$H:$H,$A24,Base!$I:$I,0))","v":0},{"$f":"IF($A$1=\"\",COUNTIFS(Base!$H:$H,$A24,Base!$I:$I,$E$5),COUNTIFS(Base!$G:$G,$A$1,Base!$H:$H,$A24,Base!$I:$I,$E$5))","v":0},{"$f":"IF($A24=\"\",\"\",IF($A$1=\"\",COUNTIF(Base!$H:$H,$A24),COUNTIFS(Base!$G:$G,$A$1,Base!$H:$H,$A24)))","v":""}]
[{"$f":"IF(Exercices!$A22=\"\",\"\",Exercices!$A22)","v":""},null,{"$f":"IF($A$1=\"\",COUNTIFS(Base!$H:$H,$A25,Base!$I:$I,1),COUNTIFS(Base!$G:$G,$A$1,Base!$H:$H,$A25,Base!$I:$I,1))","v":0},{"$f":"IF($A$1=\"\",COUNTIFS(Base!$H:$H,$A25,Base!$I:$I,0),COUNTIFS(Base!$G:$G,$A$1,Base!$H:$H,$A25,Base!$I:$I,0))","v":0},{"$f":"IF($A$1=\"\",COUNTIFS(Base!$H:$H,$A25,Base!$I:$I,$E$5),COUNTIFS(Base!$G:$G,$A$1,Base!$H:$H,$A25,Base!$I:$I,$E$5))","v":0},{"$f":"IF($A25=\"\",\"\",IF($A$1=\"\",COUNTIF(Base!$H:$H,$A25),COUNTIFS(Base!$G:$G,$A$1,Base!$H:$H,$A25)))","v":""}]
[{"$f":"IF(Exercices!$A23=\"\",\"\",Exercices!$A23)","v":""},null,{"$f":"IF($A$1=\"\",COUNTIFS(Base!$H:$H,$A26,Base!$I:$I,1),COUNTIFS(Base!$G:$G,$A$1,Base!$H:$H,$A26,Base!$I:$I,1))","v":0},{"$f":"IF($A$1=\"\",COUNTIFS(Base!$H:$H,$A26,Base!$I:$I,0),COUNTIFS(Base!$G:$G,$A$1,Base!$H:$H,$A26,Base!$I:$I,0))","v":0},{"$f":"IF($A$1=\"\",COUNTIFS(Base!$H:$H,$A26,Base!$I:$I,$E$5),COUNTIFS(Base!$G:$G,$A$1,Base!$H:$H,$A26,Base!$I:$I,$E$5))","v":0},{"$f":"IF($A26=\"\",\"\",IF($A$1=\"\",COUNTIF(Base!$H:$H,$A26),COUNTIFS(Base!$G:$G,$A$1,Base!$H:$H,$A26)))","v":""}]
[{"$f":"IF(Exercices!$A24=\"\",\"\",Exercices!$A24)","v":""},null,{"$f":"IF($A$1=\"\",COUNTIFS(Base!$H:$H,$A27,Base!$I:$I,1),COUNTIFS(Base!$G:$G,$A$1,Base!$H:$H,$A27,Base!$I:$I,1))","v":0},{"$f":"IF($A$1=\"\",COUNTIFS(Base!$H:$H,$A27,Base!$I:$I,0),COUNTIFS(Base!$G:$G,$A$1,Base!$H:$H,$A27,Base!$I:$I,0))","v":0},{"$f":"IF($A$1=\"\",COUNTIFS(Base!$H:$H,$A27,Base!$I:$I,$E$5),COUNTIFS(Base!$G:$G,$A$1,Base!$H:$H,$A27,Base!$I:$I,$E$5))","v":0},{"$f":"IF($A27=\"\",\"\",IF($A$1=\"\",COUNTIF(Base!$H:$H,$A27),COUNTIFS(Base!$G:$G,$A$1,Base!$H:$H,$A27)))","v":""}]
[{"$f":"IF(Exercices!$A25=\"\",\"\",Exercices!$A25)","v":""},null,{"$f":"IF($A$1=\"\",COUNTIFS(Base!$H:$H,$A28,Base!$I:$I,1),COUNTIFS(Base!$G:$G,$A$1,Base!$H:$H,$A28,Base!$I:$I,1))","v":0},{"$f":"IF($A$1=\"\",COUNTIFS(Base!$H:$H,$A28,Base!$I:$I,0),COUNTIFS(Base!$G:$G,$A$1,Base!$H:$H,$A28,Base!$I:$I,0))","v":0},{"$f":"IF($A$1=\"\",COUNTIFS(Base!$H:$H,$A28,Base!$I:$I,$E$5),COUNTIFS(Base!$G:$G,$A$1,Base!$H:$H,$A28,Base!$I:$I,$E$5))","v":0},{"$f":"IF($A28=\"\",\"\",IF($A$1=\"\",COUNTIF(Base!$H:$H,$A28),COUNTIFS(Base!$G:$G,$A$1,Base!$H:$H,$A28)))","v":""}]
[{"$f":"IF(Exercices!$A26=\"\",\"\",Exercices!$A26)","v":""},null,{"$f":"IF($A$1=\"\",COUNTIFS(Base!$H:$H,$A29,Base!$I:$I,1),COUNTIFS(Base!$G:$G,$A$1,Base!$H:$H,$A29,Base!$I:$I,1))","v":0},{"$f":"IF($A$1=\"\",COUNTIFS(Base!$H:$H,$A29,Base!$I:$I,0),COUNTIFS(Base!$G:$G,$A$1,Base!$H:$H,$A29,Base!$I:$I,0))","v":0},{"$f":"IF($A$1=\"\",COUNTIFS(Base!$H:$H,$A29,Base!$I:$I,$E$5),COUNTIFS(Base!$G:$G,$A$1,Base!$H:$H,$A29,Base!$I:$I,$E$5))","v":0},{"$f":"IF($A29=\"\",\"\",IF($A$1=\"\",COUNTIF(Base!$H:$H,$A29),COUNTIFS(Base!$G:$G,$A$1,Base!$H:$H,$A29)))","v":""}]
[{"$f":"IF(Exercices!$A27=\"\",\"\",Exercices!$A27)","v":""},null,{"$f":"IF($A$1=\"\",COUNTIFS(Base!$H:$H,$A30,Base!$I:$I,1),COUNTIFS(Base!$G:$G,$A$1,Base!$H:$H,$A30,Base!$I:$I,1))","v":0},{"$f":"IF($A$1=\"\",COUNTIFS(Base!$H:$H,$A30,Base!$I:$I,0),COUNTIFS(Base!$G:$G,$A$1,Base!$H:$H,$A30,Base!$I:$I,0))","v":0},{"$f":"IF($A$1=\"\",COUNTIFS(Base!$H:$H,$A30,Base!$I:$I,$E$5),COUNTIFS(Base!$G:$G,$A$1,Base!$H:$H,$A30,Base!$I:$I,$E$5))","v":0},{"$f":"IF($A30=\"\",\"\",IF($A$1=\"\",COUNTIF(Base!$H:$H,$A30),COUNTIFS(Base!$G:$G,$A$1,Base!$H:$H,$A30)))","v":""}]

{"sheet":"GraphJSP","index":6,"n_rows":30,"n_cols":8,"rows_kept":30,"cut":false,"hidden":false,"merged":[]}
[""]
["",null,null,null,null,null,null,"Comparaison des JSP"]
[]
[]
[null,null,"Nb.  1","Nb. 0","ABS","Total"]
[{"$f":"IF(Paramètrage!$A3=\"\",\"\",Paramètrage!$A3)","v":"Nom1"},null,{"$f":"IF($A$2=\"\",COUNTIFS(Base!$G:$G,$A6,Base!$I:$I,1),COUNTIFS(Base!$G:$G,$A6,Base!$H:$H,$A$2,Base!$I:$I,1))","v":0},{"$f":"IF($A$2=\"\",COUNTIFS(Base!$G:$G,$A6,Base!$I:$I,0),COUNTIFS(Base!$G:$G,$A6,Base!$H:$H,$A$2,Base!$I:$I,0))","v":0},{"$f":"IF($A$2=\"\",COUNTIFS(Base!$G:$G,$A6,Base!$I:$I,\"ABS\"),COUNTIFS(Base!$G:$G,$A6,Base!$H:$H,$A$2,Base!$I:$I,\"ABS\"))","v":2},{"$f":"IF($A6=\"\",\"\",IF($A$2=\"\",COUNTIF(Base!$G:$G,$A6),COUNTIFS(Base!$G:$G,$A6,Base!$H:$H,$A$2)))","v":47}]
[{"$f":"IF(Paramètrage!$A4=\"\",\"\",Paramètrage!$A4)","v":"Nom2"},null,{"$f":"IF($A$2=\"\",COUNTIFS(Base!$G:$G,$A7,Base!$I:$I,1),COUNTIFS(Base!$G:$G,$A7,Base!$H:$H,$A$2,Base!$I:$I,1))","v":0},{"$f":"IF($A$2=\"\",COUNTIFS(Base!$G:$G,$A7,Base!$I:$I,0),COUNTIFS(Base!$G:$G,$A7,Base!$H:$H,$A$2,Base!$I:$I,0))","v":0},{"$f":"IF($A$2=\"\",COUNTIFS(Base!$G:$G,$A7,Base!$I:$I,\"ABS\"),COUNTIFS(Base!$G:$G,$A7,Base!$H:$H,$A$2,Base!$I:$I,\"ABS\"))","v":1},{"$f":"IF($A7=\"\",\"\",IF($A$2=\"\",COUNTIF(Base!$G:$G,$A7),COUNTIFS(Base!$G:$G,$A7,Base!$H:$H,$A$2)))","v":6}]
[{"$f":"IF(Paramètrage!$A5=\"\",\"\",Paramètrage!$A5)","v":"Nom3"},null,{"$f":"IF($A$2=\"\",COUNTIFS(Base!$G:$G,$A8,Base!$I:$I,1),COUNTIFS(Base!$G:$G,$A8,Base!$H:$H,$A$2,Base!$I:$I,1))","v":0},{"$f":"IF($A$2=\"\",COUNTIFS(Base!$G:$G,$A8,Base!$I:$I,0),COUNTIFS(Base!$G:$G,$A8,Base!$H:$H,$A$2,Base!$I:$I,0))","v":0},{"$f":"IF($A$2=\"\",COUNTIFS(Base!$G:$G,$A8,Base!$I:$I,\"ABS\"),COUNTIFS(Base!$G:$G,$A8,Base!$H:$H,$A$2,Base!$I:$I,\"ABS\"))","v":1},{"$f":"IF($A8=\"\",\"\",IF($A$2=\"\",COUNTIF(Base!$G:$G,$A8),COUNTIFS(Base!$G:$G,$A8,Base!$H:$H,$A$2)))","v":12}]
[{"$f":"IF(Paramètrage!$A6=\"\",\"\",Paramètrage!$A6)","v":"Nom4"},null,{"$f":"IF($A$2=\"\",COUNTIFS(Base!$G:$G,$A9,Base!$I:$I,1),COUNTIFS(Base!$G:$G,$A9,Base!$H:$H,$A$2,Base!$I:$I,1))","v":0},{"$f":"IF($A$2=\"\",COUNTIFS(Base!$G:$G,$A9,Base!$I:$I,0),COUNTIFS(Base!$G:$G,$A9,Base!$H:$H,$A$2,Base!$I:$I,0))","v":0},{"$f":"IF($A$2=\"\",COUNTIFS(Base!$G:$G,$A9,Base!$I:$I,\"ABS\"),COUNTIFS(Base!$G:$G,$A9,Base!$H:$H,$A$2,Base!$I:$I,\"ABS\"))","v":1},{"$f":"IF($A9=\"\",\"\",IF($A$2=\"\",COUNTIF(Base!$G:$G,$A9),COUNTIFS(Base!$G:$G,$A9,Base!$H:$H,$A$2)))","v":6}]
[{"$f":"IF(Paramètrage!$A7=\"\",\"\",Paramètrage!$A7)","v":"Nom5"},null,{"$f":"IF($A$2=\"\",COUNTIFS(Base!$G:$G,$A10,Base!$I:$I,1),COUNTIFS(Base!$G:$G,$A10,Base!$H:$H,$A$2,Base!$I:$I,1))","v":0},{"$f":"IF($A$2=\"\",COUNTIFS(Base!$G:$G,$A10,Base!$I:$I,0),COUNTIFS(Base!$G:$G,$A10,Base!$H:$H,$A$2,Base!$I:$I,0))","v":0},{"$f":"IF($A$2=\"\",COUNTIFS(Base!$G:$G,$A10,Base!$I:$I,\"ABS\"),COUNTIFS(Base!$G:$G,$A10,Base!$H:$H,$A$2,Base!$I:$I,\"ABS\"))","v":0},{"$f":"IF($A10=\"\",\"\",IF($A$2=\"\",COUNTIF(Base!$G:$G,$A10),COUNTIFS(Base!$G:$G,$A10,Base!$H:$H,$A$2)))","v":6}]
[{"$f":"IF(Paramètrage!$A8=\"\",\"\",Paramètrage!$A8)","v":"Nom6"},null,{"$f":"IF($A$2=\"\",COUNTIFS(Base!$G:$G,$A11,Base!$I:$I,1),COUNTIFS(Base!$G:$G,$A11,Base!$H:$H,$A$2,Base!$I:$I,1))","v":0},{"$f":"IF($A$2=\"\",COUNTIFS(Base!$G:$G,$A11,Base!$I:$I,0),COUNTIFS(Base!$G:$G,$A11,Base!$H:$H,$A$2,Base!$I:$I,0))","v":0},{"$f":"IF($A$2=\"\",COUNTIFS(Base!$G:$G,$A11,Base!$I:$I,\"ABS\"),COUNTIFS(Base!$G:$G,$A11,Base!$H:$H,$A$2,Base!$I:$I,\"ABS\"))","v":1},{"$f":"IF($A11=\"\",\"\",IF($A$2=\"\",COUNTIF(Base!$G:$G,$A11),COUNTIFS(Base!$G:$G,$A11,Base!$H:$H,$A$2)))","v":6}]
[{"$f":"IF(Paramètrage!$A9=\"\",\"\",Paramètrage!$A9)","v":"Nom7"},null,{"$f":"IF($A$2=\"\",COUNTIFS(Base!$G:$G,$A12,Base!$I:$I,1),COUNTIFS(Base!$G:$G,$A12,Base!$H:$H,$A$2,Base!$I:$I,1))","v":0},{"$f":"IF($A$2=\"\",COUNTIFS(Base!$G:$G,$A12,Base!$I:$I,0),COUNTIFS(Base!$G:$G,$A12,Base!$H:$H,$A$2,Base!$I:$I,0))","v":0},{"$f":"IF($A$2=\"\",COUNTIFS(Base!$G:$G,$A12,Base!$I:$I,\"ABS\"),COUNTIFS(Base!$G:$G,$A12,Base!$H:$H,$A$2,Base!$I:$I,\"ABS\"))","v":0},{"$f":"IF($A12=\"\",\"\",IF($A$2=\"\",COUNTIF(Base!$G:$G,$A12),COUNTIFS(Base!$G:$G,$A12,Base!$H:$H,$A$2)))","v":0}]
[{"$f":"IF(Paramètrage!$A10=\"\",\"\",Paramètrage!$A10)","v":"Nom8"},null,{"$f":"IF($A$2=\"\",COUNTIFS(Base!$G:$G,$A13,Base!$I:$I,1),COUNTIFS(Base!$G:$G,$A13,Base!$H:$H,$A$2,Base!$I:$I,1))","v":0},{"$f":"IF($A$2=\"\",COUNTIFS(Base!$G:$G,$A13,Base!$I:$I,0),COUNTIFS(Base!$G:$G,$A13,Base!$H:$H,$A$2,Base!$I:$I,0))","v":0},{"$f":"IF($A$2=\"\",COUNTIFS(Base!$G:$G,$A13,Base!$I:$I,\"ABS\"),COUNTIFS(Base!$G:$G,$A13,Base!$H:$H,$A$2,Base!$I:$I,\"ABS\"))","v":0},{"$f":"IF($A13=\"\",\"\",IF($A$2=\"\",COUNTIF(Base!$G:$G,$A13),COUNTIFS(Base!$G:$G,$A13,Base!$H:$H,$A$2)))","v":0}]
[{"$f":"IF(Paramètrage!$A11=\"\",\"\",Paramètrage!$A11)","v":"Nom9"},null,{"$f":"IF($A$2=\"\",COUNTIFS(Base!$G:$G,$A14,Base!$I:$I,1),COUNTIFS(Base!$G:$G,$A14,Base!$H:$H,$A$2,Base!$I:$I,1))","v":0},{"$f":"IF($A$2=\"\",COUNTIFS(Base!$G:$G,$A14,Base!$I:$I,0),COUNTIFS(Base!$G:$G,$A14,Base!$H:$H,$A$2,Base!$I:$I,0))","v":0},{"$f":"IF($A$2=\"\",COUNTIFS(Base!$G:$G,$A14,Base!$I:$I,\"ABS\"),COUNTIFS(Base!$G:$G,$A14,Base!$H:$H,$A$2,Base!$I:$I,\"ABS\"))","v":0},{"$f":"IF($A14=\"\",\"\",IF($A$2=\"\",COUNTIF(Base!$G:$G,$A14),COUNTIFS(Base!$G:$G,$A14,Base!$H:$H,$A$2)))","v":0}]
[{"$f":"IF(Paramètrage!$A12=\"\",\"\",Paramètrage!$A12)","v":"Nom10"},null,{"$f":"IF($A$2=\"\",COUNTIFS(Base!$G:$G,$A15,Base!$I:$I,1),COUNTIFS(Base!$G:$G,$A15,Base!$H:$H,$A$2,Base!$I:$I,1))","v":0},{"$f":"IF($A$2=\"\",COUNTIFS(Base!$G:$G,$A15,Base!$I:$I,0),COUNTIFS(Base!$G:$G,$A15,Base!$H:$H,$A$2,Base!$I:$I,0))","v":0},{"$f":"IF($A$2=\"\",COUNTIFS(Base!$G:$G,$A15,Base!$I:$I,\"ABS\"),COUNTIFS(Base!$G:$G,$A15,Base!$H:$H,$A$2,Base!$I:$I,\"ABS\"))","v":0},{"$f":"IF($A15=\"\",\"\",IF($A$2=\"\",COUNTIF(Base!$G:$G,$A15),COUNTIFS(Base!$G:$G,$A15,Base!$H:$H,$A$2)))","v":0}]
[{"$f":"IF(Paramètrage!$A13=\"\",\"\",Paramètrage!$A13)","v":"Nom11"},null,{"$f":"IF($A$2=\"\",COUNTIFS(Base!$G:$G,$A16,Base!$I:$I,1),COUNTIFS(Base!$G:$G,$A16,Base!$H:$H,$A$2,Base!$I:$I,1))","v":0},{"$f":"IF($A$2=\"\",COUNTIFS(Base!$G:$G,$A16,Base!$I:$I,0),COUNTIFS(Base!$G:$G,$A16,Base!$H:$H,$A$2,Base!$I:$I,0))","v":0},{"$f":"IF($A$2=\"\",COUNTIFS(Base!$G:$G,$A16,Base!$I:$I,\"ABS\"),COUNTIFS(Base!$G:$G,$A16,Base!$H:$H,$A$2,Base!$I:$I,\"ABS\"))","v":0},{"$f":"IF($A16=\"\",\"\",IF($A$2=\"\",COUNTIF(Base!$G:$G,$A16),COUNTIFS(Base!$G:$G,$A16,Base!$H:$H,$A$2)))","v":0}]
[{"$f":"IF(Paramètrage!$A14=\"\",\"\",Paramètrage!$A14)","v":"Nom12"},null,{"$f":"IF($A$2=\"\",COUNTIFS(Base!$G:$G,$A17,Base!$I:$I,1),COUNTIFS(Base!$G:$G,$A17,Base!$H:$H,$A$2,Base!$I:$I,1))","v":0},{"$f":"IF($A$2=\"\",COUNTIFS(Base!$G:$G,$A17,Base!$I:$I,0),COUNTIFS(Base!$G:$G,$A17,Base!$H:$H,$A$2,Base!$I:$I,0))","v":0},{"$f":"IF($A$2=\"\",COUNTIFS(Base!$G:$G,$A17,Base!$I:$I,\"ABS\"),COUNTIFS(Base!$G:$G,$A17,Base!$H:$H,$A$2,Base!$I:$I,\"ABS\"))","v":0},{"$f":"IF($A17=\"\",\"\",IF($A$2=\"\",COUNTIF(Base!$G:$G,$A17),COUNTIFS(Base!$G:$G,$A17,Base!$H:$H,$A$2)))","v":0}]
[{"$f":"IF(Paramètrage!$A15=\"\",\"\",Paramètrage!$A15)","v":"Nom13"},null,{"$f":"IF($A$2=\"\",COUNTIFS(Base!$G:$G,$A18,Base!$I:$I,1),COUNTIFS(Base!$G:$G,$A18,Base!$H:$H,$A$2,Base!$I:$I,1))","v":0},{"$f":"IF($A$2=\"\",COUNTIFS(Base!$G:$G,$A18,Base!$I:$I,0),COUNTIFS(Base!$G:$G,$A18,Base!$H:$H,$A$2,Base!$I:$I,0))","v":0},{"$f":"IF($A$2=\"\",COUNTIFS(Base!$G:$G,$A18,Base!$I:$I,\"ABS\"),COUNTIFS(Base!$G:$G,$A18,Base!$H:$H,$A$2,Base!$I:$I,\"ABS\"))","v":0},{"$f":"IF($A18=\"\",\"\",IF($A$2=\"\",COUNTIF(Base!$G:$G,$A18),COUNTIFS(Base!$G:$G,$A18,Base!$H:$H,$A$2)))","v":0}]
[{"$f":"IF(Paramètrage!$A16=\"\",\"\",Paramètrage!$A16)","v":"Nom14"},null,{"$f":"IF($A$2=\"\",COUNTIFS(Base!$G:$G,$A19,Base!$I:$I,1),COUNTIFS(Base!$G:$G,$A19,Base!$H:$H,$A$2,Base!$I:$I,1))","v":0},{"$f":"IF($A$2=\"\",COUNTIFS(Base!$G:$G,$A19,Base!$I:$I,0),COUNTIFS(Base!$G:$G,$A19,Base!$H:$H,$A$2,Base!$I:$I,0))","v":0},{"$f":"IF($A$2=\"\",COUNTIFS(Base!$G:$G,$A19,Base!$I:$I,\"ABS\"),COUNTIFS(Base!$G:$G,$A19,Base!$H:$H,$A$2,Base!$I:$I,\"ABS\"))","v":0},{"$f":"IF($A19=\"\",\"\",IF($A$2=\"\",COUNTIF(Base!$G:$G,$A19),COUNTIFS(Base!$G:$G,$A19,Base!$H:$H,$A$2)))","v":0}]
[{"$f":"IF(Paramètrage!$A17=\"\",\"\",Paramètrage!$A17)","v":""},null,{"$f":"IF($A$2=\"\",COUNTIFS(Base!$G:$G,$A20,Base!$I:$I,1),COUNTIFS(Base!$G:$G,$A20,Base!$H:$H,$A$2,Base!$I:$I,1))","v":0},{"$f":"IF($A$2=\"\",COUNTIFS(Base!$G:$G,$A20,Base!$I:$I,0),COUNTIFS(Base!$G:$G,$A20,Base!$H:$H,$A$2,Base!$I:$I,0))","v":0},{"$f":"IF($A$2=\"\",COUNTIFS(Base!$G:$G,$A20,Base!$I:$I,\"ABS\"),COUNTIFS(Base!$G:$G,$A20,Base!$H:$H,$A$2,Base!$I:$I,\"ABS\"))","v":0},{"$f":"IF($A20=\"\",\"\",IF($A$2=\"\",COUNTIF(Base!$G:$G,$A20),COUNTIFS(Base!$G:$G,$A20,Base!$H:$H,$A$2)))","v":""}]
[{"$f":"IF(Paramètrage!$A18=\"\",\"\",Paramètrage!$A18)","v":""},null,{"$f":"IF($A$2=\"\",COUNTIFS(Base!$G:$G,$A21,Base!$I:$I,1),COUNTIFS(Base!$G:$G,$A21,Base!$H:$H,$A$2,Base!$I:$I,1))","v":0},{"$f":"IF($A$2=\"\",COUNTIFS(Base!$G:$G,$A21,Base!$I:$I,0),COUNTIFS(Base!$G:$G,$A21,Base!$H:$H,$A$2,Base!$I:$I,0))","v":0},{"$f":"IF($A$2=\"\",COUNTIFS(Base!$G:$G,$A21,Base!$I:$I,\"ABS\"),COUNTIFS(Base!$G:$G,$A21,Base!$H:$H,$A$2,Base!$I:$I,\"ABS\"))","v":0},{"$f":"IF($A21=\"\",\"\",IF($A$2=\"\",COUNTIF(Base!$G:$G,$A21),COUNTIFS(Base!$G:$G,$A21,Base!$H:$H,$A$2)))","v":""}]
[{"$f":"IF(Paramètrage!$A19=\"\",\"\",Paramètrage!$A19)","v":""},null,{"$f":"IF($A$2=\"\",COUNTIFS(Base!$G:$G,$A22,Base!$I:$I,1),COUNTIFS(Base!$G:$G,$A22,Base!$H:$H,$A$2,Base!$I:$I,1))","v":0},{"$f":"IF($A$2=\"\",COUNTIFS(Base!$G:$G,$A22,Base!$I:$I,0),COUNTIFS(Base!$G:$G,$A22,Base!$H:$H,$A$2,Base!$I:$I,0))","v":0},{"$f":"IF($A$2=\"\",COUNTIFS(Base!$G:$G,$A22,Base!$I:$I,\"ABS\"),COUNTIFS(Base!$G:$G,$A22,Base!$H:$H,$A$2,Base!$I:$I,\"ABS\"))","v":0},{"$f":"IF($A22=\"\",\"\",IF($A$2=\"\",COUNTIF(Base!$G:$G,$A22),COUNTIFS(Base!$G:$G,$A22,Base!$H:$H,$A$2)))","v":""}]
[{"$f":"IF(Paramètrage!$A20=\"\",\"\",Paramètrage!$A20)","v":""},null,{"$f":"IF($A$2=\"\",COUNTIFS(Base!$G:$G,$A23,Base!$I:$I,1),COUNTIFS(Base!$G:$G,$A23,Base!$H:$H,$A$2,Base!$I:$I,1))","v":0},{"$f":"IF($A$2=\"\",COUNTIFS(Base!$G:$G,$A23,Base!$I:$I,0),COUNTIFS(Base!$G:$G,$A23,Base!$H:$H,$A$2,Base!$I:$I,0))","v":0},{"$f":"IF($A$2=\"\",COUNTIFS(Base!$G:$G,$A23,Base!$I:$I,\"ABS\"),COUNTIFS(Base!$G:$G,$A23,Base!$H:$H,$A$2,Base!$I:$I,\"ABS\"))","v":0},{"$f":"IF($A23=\"\",\"\",IF($A$2=\"\",COUNTIF(Base!$G:$G,$A23),COUNTIFS(Base!$G:$G,$A23,Base!$H:$H,$A$2)))","v":""}]
[{"$f":"IF(Paramètrage!$A21=\"\",\"\",Paramètrage!$A21)","v":""},null,{"$f":"IF($A$2=\"\",COUNTIFS(Base!$G:$G,$A24,Base!$I:$I,1),COUNTIFS(Base!$G:$G,$A24,Base!$H:$H,$A$2,Base!$I:$I,1))","v":0},{"$f":"IF($A$2=\"\",COUNTIFS(Base!$G:$G,$A24,Base!$I:$I,0),COUNTIFS(Base!$G:$G,$A24,Base!$H:$H,$A$2,Base!$I:$I,0))","v":0},{"$f":"IF($A$2=\"\",COUNTIFS(Base!$G:$G,$A24,Base!$I:$I,\"ABS\"),COUNTIFS(Base!$G:$G,$A24,Base!$H:$H,$A$2,Base!$I:$I,\"ABS\"))","v":0},{"$f":"IF($A24=\"\",\"\",IF($A$2=\"\",COUNTIF(Base!$G:$G,$A24),COUNTIFS(Base!$G:$G,$A24,Base!$H:$H,$A$2)))","v":""}]
[{"$f":"IF(Paramètrage!$A22=\"\",\"\",Paramètrage!$A22)","v":""},null,{"$f":"IF($A$2=\"\",COUNTIFS(Base!$G:$G,$A25,Base!$I:$I,1),COUNTIFS(Base!$G:$G,$A25,Base!$H:$H,$A$2,Base!$I:$I,1))","v":0},{"$f":"IF($A$2=\"\",COUNTIFS(Base!$G:$G,$A25,Base!$I:$I,0),COUNTIFS(Base!$G:$G,$A25,Base!$H:$H,$A$2,Base!$I:$I,0))","v":0},{"$f":"IF($A$2=\"\",COUNTIFS(Base!$G:$G,$A25,Base!$I:$I,\"ABS\"),COUNTIFS(Base!$G:$G,$A25,Base!$H:$H,$A$2,Base!$I:$I,\"ABS\"))","v":0},{"$f":"IF($A25=\"\",\"\",IF($A$2=\"\",COUNTIF(Base!$G:$G,$A25),COUNTIFS(Base!$G:$G,$A25,Base!$H:$H,$A$2)))","v":""}]
[{"$f":"IF(Paramètrage!$A23=\"\",\"\",Paramètrage!$A23)","v":""},null,{"$f":"IF($A$2=\"\",COUNTIFS(Base!$G:$G,$A26,Base!$I:$I,1),COUNTIFS(Base!$G:$G,$A26,Base!$H:$H,$A$2,Base!$I:$I,1))","v":0},{"$f":"IF($A$2=\"\",COUNTIFS(Base!$G:$G,$A26,Base!$I:$I,0),COUNTIFS(Base!$G:$G,$A26,Base!$H:$H,$A$2,Base!$I:$I,0))","v":0},{"$f":"IF($A$2=\"\",COUNTIFS(Base!$G:$G,$A26,Base!$I:$I,\"ABS\"),COUNTIFS(Base!$G:$G,$A26,Base!$H:$H,$A$2,Base!$I:$I,\"ABS\"))","v":0},{"$f":"IF($A26=\"\",\"\",IF($A$2=\"\",COUNTIF(Base!$G:$G,$A26),COUNTIFS(Base!$G:$G,$A26,Base!$H:$H,$A$2)))","v":""}]
[{"$f":"IF(Paramètrage!$A24=\"\",\"\",Paramètrage!$A24)","v":""},null,{"$f":"IF($A$2=\"\",COUNTIFS(Base!$G:$G,$A27,Base!$I:$I,1),COUNTIFS(Base!$G:$G,$A27,Base!$H:$H,$A$2,Base!$I:$I,1))","v":0},{"$f":"IF($A$2=\"\",COUNTIFS(Base!$G:$G,$A27,Base!$I:$I,0),COUNTIFS(Base!$G:$G,$A27,Base!$H:$H,$A$2,Base!$I:$I,0))","v":0},{"$f":"IF($A$2=\"\",COUNTIFS(Base!$G:$G,$A27,Base!$I:$I,\"ABS\"),COUNTIFS(Base!$G:$G,$A27,Base!$H:$H,$A$2,Base!$I:$I,\"ABS\"))","v":0},{"$f":"IF($A27=\"\",\"\",IF($A$2=\"\",COUNTIF(Base!$G:$G,$A27),COUNTIFS(Base!$G:$G,$A27,Base!$H:$H,$A$2)))","v":""}]
[{"$f":"IF(Paramètrage!$A25=\"\",\"\",Paramètrage!$A25)","v":""},null,{"$f":"IF($A$2=\"\",COUNTIFS(Base!$G:$G,$A28,Base!$I:$I,1),COUNTIFS(Base!$G:$G,$A28,Base!$H:$H,$A$2,Base!$I:$I,1))","v":0},{"$f":"IF($A$2=\"\",COUNTIFS(Base!$G:$G,$A28,Base!$I:$I,0),COUNTIFS(Base!$G:$G,$A28,Base!$H:$H,$A$2,Base!$I:$I,0))","v":0},{"$f":"IF($A$2=\"\",COUNTIFS(Base!$G:$G,$A28,Base!$I:$I,\"ABS\"),COUNTIFS(Base!$G:$G,$A28,Base!$H:$H,$A$2,Base!$I:$I,\"ABS\"))","v":0},{"$f":"IF($A28=\"\",\"\",IF($A$2=\"\",COUNTIF(Base!$G:$G,$A28),COUNTIFS(Base!$G:$G,$A28,Base!$H:$H,$A$2)))","v":""}]
[{"$f":"IF(Paramètrage!$A26=\"\",\"\",Paramètrage!$A26)","v":""},null,{"$f":"IF($A$2=\"\",COUNTIFS(Base!$G:$G,$A29,Base!$I:$I,1),COUNTIFS(Base!$G:$G,$A29,Base!$H:$H,$A$2,Base!$I:$I,1))","v":0},{"$f":"IF($A$2=\"\",COUNTIFS(Base!$G:$G,$A29,Base!$I:$I,0),COUNTIFS(Base!$G:$G,$A29,Base!$H:$H,$A$2,Base!$I:$I,0))","v":0},{"$f":"IF($A$2=\"\",COUNTIFS(Base!$G:$G,$A29,Base!$I:$I,\"ABS\"),COUNTIFS(Base!$G:$G,$A29,Base!$H:$H,$A$2,Base!$I:$I,\"ABS\"))","v":0},{"$f":"IF($A29=\"\",\"\",IF($A$2=\"\",COUNTIF(Base!$G:$G,$A29),COUNTIFS(Base!$G:$G,$A29,Base!$H:$H,$A$2)))","v":""}]
[{"$f":"IF(Paramètrage!$A27=\"\",\"\",Paramètrage!$A27)","v":""},null,{"$f":"IF($A$2=\"\",COUNTIFS(Base!$G:$G,$A30,Base!$I:$I,1),COUNTIFS(Base!$G:$G,$A30,Base!$H:$H,$A$2,Base!$I:$I,1))","v":0},{"$f":"IF($A$2=\"\",COUNTIFS(Base!$G:$G,$A30,Base!$I:$I,0),COUNTIFS(Base!$G:$G,$A30,Base!$H:$H,$A$2,Base!$I:$I,0))","v":0},{"$f":"IF($A$2=\"\",COUNTIFS(Base!$G:$G,$A30,Base!$I:$I,\"ABS\"),COUNTIFS(Base!$G:$G,$A30,Base!$H:$H,$A$2,Base!$I:$I,\"ABS\"))","v":0},{"$f":"IF($A30=\"\",\"\",IF($A$2=\"\",COUNTIF(Base!$G:$G,$A30),COUNTIFS(Base!$G:$G,$A30,Base!$H:$H,$A$2)))","v":""}]

{"sheet":"ParNom","index":7,"n_rows":323,"n_cols":2,"rows_kept":323,"cut":false,"hidden":false,"merged":[]}
["Nom1","Exercice N°1"]
[]
[]
[]
[]
[]
[]
[]
[]
[]
[]
[]
[]
[]
["Nom1","Exercice N°10"]
[]
[]
[]
[]
[]
[]
[]
[]
[]
[]
[]
[]
[]
["Nom1","Exercice N°11"]
[]
[]
[]
[]
[]
[]
[]
[]
[]
[]
[]
[]
[]
["Nom1","Exercice N°12"]
[]
[]
[]
[]
[]
[]
[]
[]
[]
[]
[]
[]
[]
["Nom1","Exercice N°2"]
[]
[]
[]
[]
[]
[]
[]
[]
[]
[]
[]
[]
[]
["Nom1","Exercice N°3"]
[]
[]
[]
[]
[]
[]
[]
[]
[]
[]
[]
[]
[]
["Nom1","Exercice N°7"]
[]
[]
[]
[]
[]
[]
[]
[]
[]
[]
[]
[]
[]
["Nom1","Exercice N°8"]
[]
[]
[]
[]
[]
[]
[]
[]
[]
[]
[]
[]
[]
["Nom1","Exercice N°9"]
[]
[]
[]
[]
[]
[]
[]
[]
[]
[]
[]
[]
[]
["Nom2","Exercice N°7"]
[]
[]
[]
[]
[]
[]
[]
[]
[]
[]
[]
[]
[]
["Nom2","Exercice N°8"]
[]
[]
[]
[]
[]
[]
[]
[]
[]
[]
[]
[]
[]
["Nom3","Exercice N°1"]
[]
[]
[]
[]
[]
[]
[]
[]
[]
[]
[]
[]
[]
["Nom3","Exercice N°10"]
[]
[]
[]
[]
[]
[]
[]
[]
[]
[]
[]
[]
[]
["Nom3","Exercice N°11"]
[]
[]
[]
[]
[]
[]
[]
[]
[]
[]
[]
[]
[]
["Nom3","Exercice N°12"]
[]
[]
[]
[]
[]
[]
[]
[]
[]
[]
[]
[]
[]
["Nom3","Exercice N°7"]
[]
[]
[]
[]
[]
[]
[]
[]
[]
[]
[]
[]
[]
["Nom3","Exercice N°8"]
[]
[]
[]
[]
[]
[]
[]
[]
[]
[]
[]
[]
[]
["Nom3","Exercice N°9"]
[]
[]
[]
[]
[]
[]
[]
[]
[]
[]
[]
[]
[]
["Nom4","Exercice N°7"]
[]
[]
[]
[]
[]
[]
[]
[]
[]
[]
[]
[]
[]
["Nom4","Exercice N°8"]
[]
[]
[]
[]
[]
[]
[]
[]
[]
[]
[]
[]
[]
["Nom5","Exercice N°7"]
[]
[]
[]
[]
[]
[]
[]
[]
[]
[]
[]
[]
[]
["Nom5","Exercice N°8"]
[]
[]
[]
[]
[]
[]
[]
[]
[]
[]
[]
[]
[]
["Nom6","Exercice N°7"]
[]
[]
[]
[]
[]
[]
[]
[]
[]
[]
[]
[]
[]
["Nom6","Exercice N°8"]

{"sheet":"ParExercice","index":8,"n_rows":310,"n_cols":2,"rows_kept":310,"cut":false,"hidden":false,"merged":[]}
["Exercice N°1","Nom1"]
["2016-10-25"]
[]
[]
[]
[]
[]
[]
[]
[]
[]
[]
[]
[]
["Exercice N°10","Nom1"]
["2016-10-25"]
[]
[]
[]
[]
[]
[]
[]
[]
[]
[]
[]
[]
["Exercice N°10","Nom3"]
["2016-10-25"]
[]
[]
[]
[]
[]
[]
[]
[]
[]
[]
[]
[]
["Exercice N°11","Nom1"]
["2016-10-25"]
[]
[]
[]
[]
[]
[]
[]
[]
[]
[]
[]
[]
["Exercice N°11","Nom3"]
["2016-10-25"]
[]
[]
[]
[]
[]
[]
[]
[]
[]
[]
[]
[]
["Exercice N°12","Nom1"]
["2016-10-25"]
[]
[]
[]
[]
[]
[]
[]
[]
[]
[]
[]
[]
["Exercice N°12","Nom3"]
["2016-10-25"]
[]
[]
[]
[]
[]
[]
[]
[]
[]
[]
[]
[]
["Exercice N°2","Nom1"]
["2016-10-25"]
[]
[]
[]
[]
[]
[]
[]
[]
[]
[]
[]
[]
["Exercice N°3","Nom1"]
["2016-10-25"]
[]
[]
[]
[]
[]
[]
[]
[]
[]
[]
[]
[]
["Exercice N°7","Nom1"]
["2016-10-25"]
[]
[]
[]
[]
[]
[]
[]
[]
[]
[]
[]
[]
["Exercice N°7","Nom2"]
["2016-10-25"]
[]
[]
[]
[]
[]
[]
[]
[]
[]
[]
[]
[]
["Exercice N°7","Nom3"]
["2016-10-25"]
[]
[]
[]
[]
[]
[]
[]
[]
[]
[]
[]
[]
["Exercice N°7","Nom4"]
["2016-10-25"]
[]
[]
[]
[]
[]
[]
[]
[]
[]
[]
[]
[]
["Exercice N°7","Nom5"]
["2016-10-25"]
[]
[]
[]
[]
[]
[]
[]
[]
[]
[]
[]
[]
["Exercice N°7","Nom6"]
["2016-10-25"]
[]
[]
[]
[]
[]
[]
[]
[]
[]
[]
[]
[]
["Exercice N°8","Nom1"]
["2016-10-25"]
[]
[]
[]
[]
[]
[]
[]
[]
[]
[]
[]
[]
["Exercice N°8","Nom2"]
["2016-10-25"]
[]
[]
[]
[]
[]
[]
[]
[]
[]
[]
[]
[]
["Exercice N°8","Nom3"]
["2016-10-25"]
[]
[]
[]
[]
[]
[]
[]
[]
[]
[]
[]
[]
["Exercice N°8","Nom4"]
["2016-10-25"]
[]
[]
[]
[]
[]
[]
[]
[]
[]
[]
[]
[]
["Exercice N°8","Nom5"]
["2016-10-25"]
[]
[]
[]
[]
[]
[]
[]
[]
[]
[]
[]
[]
["Exercice N°8","Nom6"]
["2016-10-25"]
[]
[]
[]
[]
[]
[]
[]
[]
[]
[]
[]
[]
["Exercice N°9","Nom1"]
["2016-10-25"]
[]
[]
[]
[]
[]
[]
[]
[]
[]
[]
[]
[]
["Exercice N°9","Nom3"]
["2016-10-25"]

{"sheet":"ParNomXL","index":9,"n_rows":72,"n_cols":2,"rows_kept":72,"cut":false,"hidden":false,"merged":[]}
["Nom1","Récapitulatif"]
["2016-10-25"]
[]
[]
[]
[]
[]
[]
[]
[]
[]
[]
[]
[]
["Nom2","Récapitulatif"]
["2016-10-25"]
[]
[]
[]
[]
[]
[]
[]
[]
[]
[]
[]
[]
["Nom3","Récapitulatif"]
["2016-10-25"]
[]
[]
[]
[]
[]
[]
[]
[]
[]
[]
[]
[]
["Nom4","Récapitulatif"]
["2016-10-25"]
[]
[]
[]
[]
[]
[]
[]
[]
[]
[]
[]
[]
["Nom5","Récapitulatif"]
["2016-10-25"]
[]
[]
[]
[]
[]
[]
[]
[]
[]
[]
[]
[]
["Nom6","Récapitulatif"]
["2016-10-25"]

{"sheet":"ParExerciceXL","index":10,"n_rows":2,"n_cols":2,"rows_kept":2,"cut":false,"hidden":false,"merged":[]}
["Pas de données disponibles"]
["2016-10-25","2016-10-25"]

{"sheet":"ModelGraph","index":11,"n_rows":6,"n_cols":6,"rows_kept":6,"cut":false,"hidden":false,"merged":[]}
["Date","Résultat",null,null,null,"Modèle de graphique qui sera utilisé pour la génération des graphiques \"ParNom\" et \"ParExercice\""]
["2016-01-01",1]
["2016-02-01",2,null,null,null,"Placer le graphique n'importe où dans la feuille"]
["2016-03-01",3]
["2016-04-01",4]
["2016-05-01",5]

{"sheet":"ParNomData","index":12,"n_rows":77,"n_cols":4,"rows_kept":77,"cut":false,"hidden":false,"merged":[]}
["Nom1","Exercice N°1","2016-11-12",10]
[null,null,"2016-11-13",10]
[null,null,"2016-11-14",5]
["Nom1","Exercice N°10","2016-11-03",5]
[null,null,"2016-12-12",10]
[null,null,"2016-12-13",10]
[null,null,"2016-12-14",5]
[null,null,"2016-12-15",10]
[null,null,"2016-12-16",10]
["Nom1","Exercice N°11","2016-11-03",10]
[null,null,"2016-12-12",5]
[null,null,"2016-12-13",10]
[null,null,"2016-12-14",5]
[null,null,"2016-12-15",5]
[null,null,"2016-12-16",10]
["Nom1","Exercice N°12","2016-11-03",5]
[null,null,"2016-12-11",10]
[null,null,"2016-12-12",10]
[null,null,"2016-12-14",5]
[null,null,"2016-12-16",10]
[null,null,"2016-12-17",5]
[null,null,"2016-12-18",10]
["Nom1","Exercice N°2","2016-11-03",10]
[null,null,"2016-11-14",10]
["Nom1","Exercice N°3","2016-10-21",10]
[null,null,"2016-11-01",5]
[null,null,"2016-11-04",10]
[null,null,"2016-11-05",5]
[null,null,"2016-11-06",10]
[null,null,"2016-11-07",10]
[null,null,"2016-11-08",5]
["Nom1","Exercice N°7","2016-11-03",5]
[null,null,"2016-11-04",5]
[null,null,"2016-11-09",5]
[null,null,"2016-12-12",10]
[null,null,"2016-12-13",10]
[null,null,"2016-12-14",5]
[null,null,"2016-12-15",10]
[null,null,"2016-12-16",10]
["Nom1","Exercice N°8","2016-11-03",5]
[null,null,"2016-11-04",5]
[null,null,"2016-11-09",5]
[null,null,"2016-11-13",10]
["Nom1","Exercice N°9","2016-11-04",10]
[null,null,"2016-11-13",10]
["Nom2","Exercice N°7","2016-11-03",5]
[null,null,"2016-11-05",10]
["Nom2","Exercice N°8","2016-11-03",10]
[null,null,"2016-11-04",10]
[null,null,"2016-11-05",5]
["Nom3","Exercice N°1","2016-01-11",5]
["Nom3","Exercice N°10","2016-11-04",5]
["Nom3","Exercice N°11","2016-12-17",10]
["Nom3","Exercice N°12","2016-11-04",5]
[null,null,"2016-12-12",5]
["Nom3","Exercice N°7","2016-11-04",10]
[null,null,"2016-11-06",5]
[null,null,"2016-12-12",5]
["Nom3","Exercice N°8","2016-11-04",10]
[null,null,"2016-11-06",10]
["Nom3","Exercice N°9","2016-11-05",5]
["Nom4","Exercice N°7","2016-11-03",5]
[null,null,"2016-11-04",10]
[null,null,"2016-11-05",10]
["Nom4","Exercice N°8","2016-11-03",5]
[null,null,"2016-11-05",10]
["Nom5","Exercice N°7","2016-11-06",5]
[null,null,"2016-11-07",10]
[null,null,"2016-11-08",10]
["Nom5","Exercice N°8","2016-11-06",5]
[null,null,"2016-11-07",10]
[null,null,"2016-11-08",5]
["Nom6","Exercice N°7","2016-11-11",10]
[null,null,"2016-11-12",5]
["Nom6","Exercice N°8","2016-11-10",10]
[null,null,"2016-11-11",10]
[null,null,"2016-11-12",5]

{"sheet":"ParExerciceData","index":13,"n_rows":77,"n_cols":4,"rows_kept":77,"cut":false,"hidden":false,"merged":[]}
["Exercice N°1","Nom1","2016-10-26",2]
[null,null,"2016-11-01",3]
["Exercice N°10","Nom1","2016-11-03",5]
[null,null,"2016-12-12",8]
[null,null,"2016-12-13",6]
[null,null,"2016-12-14",4]
[null,null,"2016-12-15",9]
[null,null,"2016-12-16",1]
["Exercice N°10","Nom3","2016-11-04",4]
[null,null,"2016-12-12",3]
["Exercice N°11","Nom1","2016-11-03",2]
[null,null,"2016-12-12",5]
[null,null,"2016-12-13",8]
[null,null,"2016-12-14",6]
[null,null,"2016-12-15",4]
[null,null,"2016-12-16",9]
["Exercice N°11","Nom3","2016-12-17",1]
["Exercice N°12","Nom1","2016-11-03",4]
[null,null,"2016-12-10",8]
[null,null,"2016-12-11",2]
[null,null,"2016-12-12",3]
[null,null,"2016-12-14",5]
[null,null,"2016-12-16",6]
[null,null,"2016-12-18",3]
["Exercice N°12","Nom3","2016-11-04",2]
[null,null,"2016-12-12",5]
["Exercice N°2","Nom1","2016-11-03",8]
[null,null,"2016-11-04",6]
["Exercice N°3","Nom1","2016-11-01",5]
[null,null,"2016-11-03",3]
[null,null,"2016-11-04",2]
[null,null,"2016-11-05",4]
[null,null,"2016-11-06",9]
[null,null,"2016-11-07",1]
[null,null,"2016-11-08",4]
["Exercice N°7","Nom1","2016-11-03",6]
[null,null,"2016-11-04",4]
[null,null,"2016-11-09",4]
[null,null,"2016-12-12",9]
[null,null,"2016-12-13",1]
[null,null,"2016-12-14",4]
[null,null,"2016-12-15",3]
[null,null,"2016-12-16",2]
["Exercice N°7","Nom2","2016-11-03",5]
[null,null,"2016-11-04",8]
[null,null,"2016-11-05",6]
["Exercice N°7","Nom3","2016-11-04",3]
[null,null,"2016-12-12",2]
["Exercice N°7","Nom4","2016-11-03",5]
[null,null,"2016-11-04",8]
[null,null,"2016-11-05",6]
["Exercice N°7","Nom5","2016-11-06",4]
[null,null,"2016-11-07",9]
[null,null,"2016-11-08",1]
["Exercice N°7","Nom6","2016-11-10",3]
[null,null,"2016-11-11",2]
[null,null,"2016-11-12",5]
["Exercice N°8","Nom1","2016-11-03",6]
[null,null,"2016-11-04",4]
[null,null,"2016-11-09",5]
[null,null,"2016-11-13",8]
["Exercice N°8","Nom2","2016-11-03",9]
[null,null,"2016-11-04",1]
[null,null,"2016-11-05",4]
["Exercice N°8","Nom3","2016-11-04",2]
[null,null,"2016-11-06",3]
["Exercice N°8","Nom4","2016-11-03",5]
[null,null,"2016-11-04",8]
[null,null,"2016-11-05",6]
["Exercice N°8","Nom5","2016-11-07",3]
[null,null,"2016-11-08",2]
["Exercice N°8","Nom6","2016-11-10",8]
[null,null,"2016-11-11",6]
[null,null,"2016-11-12",4]
["Exercice N°9","Nom1","2016-11-04",1]
[null,null,"2016-11-13",9]
["Exercice N°9","Nom3","2016-11-05",4]

{"sheet":"ParNomXLData","index":14,"n_rows":77,"n_cols":4,"rows_kept":77,"cut":false,"hidden":false,"merged":[]}
["Nom1","Récapitulatif","Exercice N°1 26/10/2016",2]
[null,null,"Exercice N°1 01/11/2016",3]
[null,null,"Exercice N°10 03/11/2016",5]
[null,null,"Exercice N°10 12/12/2016",8]
[null,null,"Exercice N°10 13/12/2016",6]
[null,null,"Exercice N°10 14/12/2016",4]
[null,null,"Exercice N°10 15/12/2016",9]
[null,null,"Exercice N°10 16/12/2016",1]
[null,null,"Exercice N°11 03/11/2016",2]
[null,null,"Exercice N°11 12/12/2016",5]
[null,null,"Exercice N°11 13/12/2016",8]
[null,null,"Exercice N°11 14/12/2016",6]
[null,null,"Exercice N°11 15/12/2016",4]
[null,null,"Exercice N°11 16/12/2016",9]
[null,null,"Exercice N°12 03/11/2016",4]
[null,null,"Exercice N°12 10/12/2016",8]
[null,null,"Exercice N°12 11/12/2016",2]
[null,null,"Exercice N°12 12/12/2016",3]
[null,null,"Exercice N°12 14/12/2016",5]
[null,null,"Exercice N°12 16/12/2016",6]
[null,null,"Exercice N°12 18/12/2016",3]
[null,null,"Exercice N°2 03/11/2016",8]
[null,null,"Exercice N°2 04/11/2016",6]
[null,null,"Exercice N°3 01/11/2016",5]
[null,null,"Exercice N°3 03/11/2016",3]
[null,null,"Exercice N°3 04/11/2016",2]
[null,null,"Exercice N°3 05/11/2016",4]
[null,null,"Exercice N°3 06/11/2016",9]
[null,null,"Exercice N°3 07/11/2016",1]
[null,null,"Exercice N°3 08/11/2016",4]
[null,null,"Exercice N°7 03/11/2016",6]
[null,null,"Exercice N°7 04/11/2016",4]
[null,null,"Exercice N°7 09/11/2016",4]
[null,null,"Exercice N°7 12/12/2016",9]
[null,null,"Exercice N°7 13/12/2016",1]
[null,null,"Exercice N°7 14/12/2016",4]
[null,null,"Exercice N°7 15/12/2016",3]
[null,null,"Exercice N°7 16/12/2016",2]
[null,null,"Exercice N°8 03/11/2016",6]
[null,null,"Exercice N°8 04/11/2016",4]
[null,null,"Exercice N°8 09/11/2016",5]
[null,null,"Exercice N°8 13/11/2016",8]
[null,null,"Exercice N°9 04/11/2016",1]
[null,null,"Exercice N°9 13/11/2016",9]
["Nom2","Récapitulatif","Exercice N°7 03/11/2016",5]
[null,null,"Exercice N°7 04/11/2016",8]
[null,null,"Exercice N°7 05/11/2016",6]
[null,null,"Exercice N°8 03/11/2016",9]
[null,null,"Exercice N°8 04/11/2016",1]
[null,null,"Exercice N°8 05/11/2016",4]
["Nom3","Récapitulatif","Exercice N°10 04/11/2016",4]
[null,null,"Exercice N°10 12/12/2016",3]
[null,null,"Exercice N°11 17/12/2016",1]
[null,null,"Exercice N°12 04/11/2016",2]
[null,null,"Exercice N°12 12/12/2016",5]
[null,null,"Exercice N°7 04/11/2016",3]
[null,null,"Exercice N°7 12/12/2016",2]
[null,null,"Exercice N°8 04/11/2016",2]
[null,null,"Exercice N°8 06/11/2016",3]
[null,null,"Exercice N°9 05/11/2016",4]
["Nom4","Récapitulatif","Exercice N°7 03/11/2016",5]
[null,null,"Exercice N°7 04/11/2016",8]
[null,null,"Exercice N°7 05/11/2016",6]
[null,null,"Exercice N°8 03/11/2016",5]
[null,null,"Exercice N°8 04/11/2016",8]
[null,null,"Exercice N°8 05/11/2016",6]
["Nom5","Récapitulatif","Exercice N°7 06/11/2016",4]
[null,null,"Exercice N°7 07/11/2016",9]
[null,null,"Exercice N°7 08/11/2016",1]
[null,null,"Exercice N°8 07/11/2016",3]
[null,null,"Exercice N°8 08/11/2016",2]
["Nom6","Récapitulatif","Exercice N°7 10/11/2016",3]
[null,null,"Exercice N°7 11/11/2016",2]
[null,null,"Exercice N°7 12/11/2016",5]
[null,null,"Exercice N°8 10/11/2016",8]
[null,null,"Exercice N°8 11/11/2016",6]
[null,null,"Exercice N°8 12/11/2016",4]

{"sheet":"ParExerciceXLData","index":15,"n_rows":0,"n_cols":0,"rows_kept":0,"cut":false,"hidden":false,"merged":[]}