{"text_format":"1","workbook":"xlsx","n_sheets":3,"sheets":["Choix","Données","Infos"],"not_rendered":{"charts":0,"images":0,"macros":1,"external_links":1,"defined_names":0,"comments":0,"pivot_tables":0},"unopened":[],"bounds":{"document_bytes":16777216,"sheet_cells":100000,"rows_first":2000,"rows_last":500,"rows_between":2000,"halvings":0,"cell_chars":16384,"cell_head_chars":4096},"cells_cut":0,"cells_raw":0,"read":"whole","date_system":"1900"}

{"sheet":"Choix","index":0,"n_rows":20,"n_cols":4,"rows_kept":20,"cut":false,"hidden":false,"merged":[]}
[]
[]
[]
[]
[]
[]
[]
[]
[]
[]
[]
[null,"1er défi:",null,"Si je choisis FR, alors dans la cellule B7 de l'onglet donnée, devra apparaître \"client\"."]
[null,null,null,"Si je choisis NL, alors dans la cellule B7 de l'onglet donnée, devra apparaître \"klanten\"."]
[]
[null,null,null,"ATTENTION, il faut bien savoir qu'une vingtaine de règles comme celle-ci seront à developper."]
[]
[]
[]
[null,"2ème défi",null,"Dans l'onglet \"info\" se trouve également des infos, si j'ai choisi FR, alors dans la cellule B13 de l'onglet \"Données\", doit apparaître \"Belgique\"."]
[null,null,null,"Dans l'onglet \"info\" se trouve également des infos, si j'ai choisi NL alors dans la cellule B13 de l'onglet \"Données\", doit apparaître \"België\"."]

{"sheet":"Données","index":1,"n_rows":13,"n_cols":3,"rows_kept":13,"cut":false,"hidden":false,"merged":[[6,2,6,5],[7,2,7,5],[8,1,8,5],[9,1,9,5],[10,2,10,5],[11,1,11,5],[12,2,12,5]]}
[]
[]
[]
[]
[]
[]
[null,null,1]
[null,"Contact:"]
[null,{"$f":"VLOOKUP(C7,[1]KLANTLIJST!#REF!,2)","v":{"$error":"#REF!"}}]
[null,{"$f":"VLOOKUP(C7,[1]KLANTLIJST!#REF!,3)","v":{"$error":"#REF!"}}]
[null,{"$f":"VLOOKUP(C7,[1]KLANTLIJST!#REF!,4)","v":{"$error":"#REF!"}},{"$f":"VLOOKUP(C7,[1]KLANTLIJST!#REF!,5)","v":{"$error":"#REF!"}}]
[null,{"$f":"VLOOKUP(C7,[1]KLANTLIJST!#REF!,6)","v":{"$error":"#REF!"}}]
[null,null,{"$f":"VLOOKUP(C7,[1]KLANTLIJST!#REF!,7)","v":{"$error":"#REF!"}}]

{"sheet":"Infos","index":2,"n_rows":6,"n_cols":4,"rows_kept":6,"cut":false,"hidden":false,"merged":[]}
[]
[]
[]
[]
[null,null,"MOL","GEEL"]
[null,null,"Belgique","België"]