{"text_format":"1","workbook":"xlsx","n_sheets":3,"sheets":["Feuil1","Feuil2","Feuil3"],"not_rendered":{"charts":0,"images":0,"macros":1,"external_links":1,"defined_names":3,"comments":0,"pivot_tables":0},"unopened":[],"bounds":{"document_bytes":16777216,"sheet_cells":100000,"rows_first":2000,"rows_last":500,"rows_between":2000,"halvings":0,"cell_chars":16384,"cell_head_chars":4096},"cells_cut":0,"cells_raw":0,"read":"whole","date_system":"1900"}

{"sheet":"Feuil1","index":0,"n_rows":18,"n_cols":10,"rows_kept":18,"cut":false,"hidden":false,"merged":[[1,1,1,2]]}
[]
[null,"        MAGASIN",null,null,null,null,"    QUANTITÉ TOTAL DE FIN DE JOURNÉE"]
["Désignation","Quantiée","Prix  unitaire","Total",null,null,"Total cable 0,5","Total cable 1,5","Total cable 2,5","Total cable 3,5"]
["cable 0,5",null,{"$f":"IFERROR(INDEX([1]!tarif,MATCH($A4,diver,0),1),\"\")","v":0.45},{"$f":"SUM(C4*B4)","v":0}]
["cable 1,5",null,{"$f":"IFERROR(INDEX([1]!tarif,MATCH($A5,diver,0),1),\"\")","v":0.89},{"$f":"SUM(C5*B5)","v":0}]
["cable 2,5",null,{"$f":"IFERROR(INDEX([1]!tarif,MATCH($A6,diver,0),1),\"\")","v":4.2300000000000004},0]
["cable 3,5",null,{"$f":"IFERROR(INDEX([1]!tarif,MATCH($A7,diver,0),1),\"\")","v":7.85},0]
[]
[]
[]
[]
[]
[]
[]
[null,null,null,"bonjour,"]
[null,null,null,"voila ce que je voudrait faire pour une gestion de stock"]
[null,null,null,"Pour avoir un total de chaque diamètre séparé"]
[null,null,null,null,null,null,"Merci"]

{"sheet":"Feuil2","index":1,"n_rows":18,"n_cols":3,"rows_kept":18,"cut":false,"hidden":false,"merged":[]}
["cable 0,5",0.45,1]
["cable 1,5",0.89,2]
["cable 2,5",4.2300000000000004,3]
["cable 3,5",7.85,4]
[null,null,5]
[null,null,6]
[null,null,7]
[null,null,8]
[null,null,9]
[null,null,10]
[null,null,11]
[null,null,12]
[null,null,13]
[null,null,14]
[null,null,15]
[null,null,16]
[null,null,17]
[null,null,0]

{"sheet":"Feuil3","index":2,"n_rows":0,"n_cols":0,"rows_kept":0,"cut":false,"hidden":false,"merged":[]}