{"text_format":"1","workbook":"xlsx","n_sheets":5,"sheets":["Planning S1","Planning S2","Saisie","Listes","Stats"],"not_rendered":{"charts":0,"images":0,"macros":1,"external_links":0,"defined_names":18,"comments":1,"pivot_tables":2},"unopened":[],"bounds":{"document_bytes":16777216,"sheet_cells":100000,"rows_first":2000,"rows_last":500,"rows_between":2000,"halvings":0,"cell_chars":16384,"cell_head_chars":4096},"cells_cut":0,"cells_raw":0,"read":"whole","date_system":"1900"}

{"sheet":"Planning S1","index":0,"n_rows":33,"n_cols":366,"rows_kept":33,"cut":false,"hidden":false,"merged":[[1,227,1,230],[1,288,1,291],[1,135,1,138],[1,166,1,169],[1,13,1,16],[1,43,1,46],[1,75,1,78],[1,105,1,108],[1,196,1,199]]}
[2017]
[1,null,null,null,null,null,null,null,null,null,null,null,null,"Janvier",null,null,null,null,null,null,null,null,null,null,null,null,null,null,null,null,null,null,null,null,null,null,null,null,null,null,null,null,null,"Février",null,null,null,null,null,null,null,null,null,null,null,null,null,null,null,null,null,null,null,null,null,null,null,null,null,null,null,null,null,null,null,"Mars",null,null,null,null,null,null,null,null,null,null,null,null,null,null,null,null,null,null,null,null,null,null,null,null,null,null,null,null,null,"Avril",null,null,null,null,null,null,null,null,null,null,null,null,null,null,null,null,null,null,null,null,null,null,null,null,null,null,null,null,null,"Mai",null,null,null,null,null,null,null,null,null,null,null,null,null,null,null,null,null,null,null,null,null,null,null,null,null,null,null,null,null,null,"Juin",null,null,null,null,null,null,null,null,null,null,null,null,null,null,null,null,null,null,null,null,null,null,null,null,null,null,null,null,null,"Juillet",null,null,null,null,null,null,null,null,null,null,null,null,null,null,null,null,null,null,null,null,null,null,null,null,null,null,null,null,null,null,"Août",null,null,null,null,null,null,null,null,null,null,null,null,null,null,null,null,null,null,null,null,null,null,null,null,null,null,null,null,null,"Septembre",null,null,null,null,null,null,null,null,null,null,null,null,null,null,null,null,null,null,null,null,null,null,null,null,null,null,null,null,null,null,"Octobre",null,null,null,null,null,null,null,null,null,null,null,null,null,null,null,null,null,null,null,null,null,null,null,null,null,null,null,null,null,"Novembre",null,null,null,null,null,null,null,null,null,null,null,null,null,null,null,null,null,null,null,null,null,null,null,null,null,null,null,null,null,null,"Décembre"]
[]
[null,{"$f":"DATE(An,1,1)","v":"2017-01-01"},{"$f":"B4+1","v":"2017-01-02"},{"$f":"C4+1","v":"2017-01-03"},"2017-01-04","2017-01-05","2017-01-06","2017-01-07","2017-01-08","2017-01-09","2017-01-10","2017-01-11","2017-01-12","2017-01-13","2017-01-14","2017-01-15","2017-01-16","2017-01-17","2017-01-18","2017-01-19","2017-01-20","2017-01-21","2017-01-22","2017-01-23","2017-01-24","2017-01-25","2017-01-26","2017-01-27","2017-01-28","2017-01-29","2017-01-30","2017-01-31","2017-02-01","2017-02-02","2017-02-03","2017-02-04","2017-02-05","2017-02-06","2017-02-07","2017-02-08","2017-02-09","2017-02-10","2017-02-11","2017-02-12","2017-02-13","2017-02-14","2017-02-15","2017-02-16","2017-02-17","2017-02-18","2017-02-19","2017-02-20","2017-02-21","2017-02-22","2017-02-23","2017-02-24","2017-02-25","2017-02-26","2017-02-27","2017-02-28","2017-03-01","2017-03-02","2017-03-03","2017-03-04","2017-03-05","2017-03-06","2017-03-07",{"$f":"BO4+1","v":"2017-03-08"},"2017-03-09","2017-03-10","2017-03-11","2017-03-12","2017-03-13","2017-03-14","2017-03-15","2017-03-16","2017-03-17","2017-03-18","2017-03-19","2017-03-20","2017-03-21","2017-03-22","2017-03-23","2017-03-24","2017-03-25","2017-03-26","2017-03-27","2017-03-28","2017-03-29","2017-03-30","2017-03-31","2017-04-01","2017-04-02","2017-04-03","2017-04-04","2017-04-05","2017-04-06","2017-04-07","2017-04-08","2017-04-09","2017-04-10","2017-04-11","2017-04-12","2017-04-13","2017-04-14","2017-04-15","2017-04-16","2017-04-17","2017-04-18","2017-04-19","2017-04-20","2017-04-21","2017-04-22","2017-04-23","2017-04-24","2017-04-25","2017-04-26","2017-04-27","2017-04-28","2017-04-29","2017-04-30","2017-05-01","2017-05-02","2017-05-03","2017-05-04","2017-05-05","2017-05-06","2017-05-07","2017-05-08","2017-05-09","2017-05-10",{"$f":"EA4+1","v":"2017-05-11"},"2017-05-12","2017-05-13","2017-05-14","2017-05-15","2017-05-16","2017-05-17","2017-05-18","2017-05-19","2017-05-20","2017-05-21","2017-05-22","2017-05-23","2017-05-24","2017-05-25","2017-05-26","2017-05-27","2017-05-28","2017-05-29","2017-05-30","2017-05-31","2017-06-01","2017-06-02","2017-06-03","2017-06-04","2017-06-05","2017-06-06","2017-06-07","2017-06-08","2017-06-09","2017-06-10","2017-06-11","2017-06-12","2017-06-13","2017-06-14","2017-06-15","2017-06-16","2017-06-17","2017-06-18","2017-06-19","2017-06-20","2017-06-21","2017-06-22","2017-06-23","2017-06-24","2017-06-25","2017-06-26","2017-06-27","2017-06-28","2017-06-29","2017-06-30","2017-07-01","2017-07-02","2017-07-03","2017-07-04","2017-07-05","2017-07-06","2017-07-07","2017-07-08","2017-07-09","2017-07-10","2017-07-11","2017-07-12","2017-07-13",{"$f":"GM4+1","v":"2017-07-14"},"2017-07-15","2017-07-16","2017-07-17","2017-07-18","2017-07-19","2017-07-20","2017-07-21","2017-07-22","2017-07-23","2017-07-24","2017-07-25","2017-07-26","2017-07-27","2017-07-28","2017-07-29","2017-07-30","2017-07-31","2017-08-01","2017-08-02","2017-08-03","2017-08-04","2017-08-05","2017-08-06","2017-08-07","2017-08-08","2017-08-09","2017-08-10","2017-08-11","2017-08-12","2017-08-13","2017-08-14","2017-08-15","2017-08-16","2017-08-17","2017-08-18","2017-08-19","2017-08-20","2017-08-21","2017-08-22","2017-08-23","2017-08-24","2017-08-25","2017-08-26","2017-08-27","2017-08-28","2017-08-29","2017-08-30","2017-08-31","2017-09-01","2017-09-02","2017-09-03","2017-09-04","2017-09-05","2017-09-06","2017-09-07","2017-09-08","2017-09-09","2017-09-10","2017-09-11","2017-09-12","2017-09-13","2017-09-14","2017-09-15",{"$f":"IY4+1","v":"2017-09-16"},"2017-09-17","2017-09-18","2017-09-19","2017-09-20","2017-09-21","2017-09-22","2017-09-23","2017-09-24","2017-09-25","2017-09-26","2017-09-27","2017-09-28","2017-09-29","2017-09-30","2017-10-01","2017-10-02","2017-10-03","2017-10-04","2017-10-05","2017-10-06","2017-10-07","2017-10-08","2017-10-09","2017-10-10","2017-10-11",{"$f":"JY4+1","v":"2017-10-12"},"2017-10-13","2017-10-14","2017-10-15","2017-10-16","2017-10-17","2017-10-18","2017-10-19","2017-10-20","2017-10-21","2017-10-22","2017-10-23","2017-10-24","2017-10-25","2017-10-26","2017-10-27","2017-10-28","2017-10-29","2017-10-30","2017-10-31","2017-11-01","2017-11-02","2017-11-03","2017-11-04","2017-11-05","2017-11-06","2017-11-07","2017-11-08","2017-11-09","2017-11-10","2017-11-11","2017-11-12","2017-11-13","2017-11-14","2017-11-15","2017-11-16","2017-11-17","2017-11-18",{"$f":"LK4+1","v":"2017-11-19"},"2017-11-20","2017-11-21","2017-11-22","2017-11-23","2017-11-24","2017-11-25","2017-11-26","2017-11-27","2017-11-28","2017-11-29","2017-11-30","2017-12-01","2017-12-02","2017-12-03","2017-12-04","2017-12-05","2017-12-06","2017-12-07","2017-12-08","2017-12-09","2017-12-10","2017-12-11","2017-12-12","2017-12-13","2017-12-14","2017-12-15","2017-12-16","2017-12-17","2017-12-18","2017-12-19","2017-12-20","2017-12-21","2017-12-22","2017-12-23","2017-12-24","2017-12-25","2017-12-26","2017-12-27","2017-12-28","2017-12-29","2017-12-30",{"$f":"NA4+1","v":"2017-12-31"}]
["NOM",{"$f":"B4","v":"2017-01-01"},{"$f":"C4","v":"2017-01-02"},"2017-01-03","2017-01-04","2017-01-05","2017-01-06","2017-01-07","2017-01-08","2017-01-09","2017-01-10","2017-01-11","2017-01-12","2017-01-13","2017-01-14","2017-01-15","2017-01-16","2017-01-17","2017-01-18","2017-01-19","2017-01-20","2017-01-21","2017-01-22","2017-01-23","2017-01-24","2017-01-25","2017-01-26","2017-01-27","2017-01-28","2017-01-29","2017-01-30","2017-01-31","2017-02-01","2017-02-02","2017-02-03","2017-02-04","2017-02-05","2017-02-06","2017-02-07","2017-02-08","2017-02-09","2017-02-10","2017-02-11","2017-02-12","2017-02-13","2017-02-14","2017-02-15","2017-02-16","2017-02-17","2017-02-18","2017-02-19","2017-02-20","2017-02-21","2017-02-22","2017-02-23","2017-02-24","2017-02-25","2017-02-26","2017-02-27","2017-02-28",{"$f":"BI4","v":"2017-03-01"},"2017-03-02",{"$f":"BK4","v":"2017-03-03"},"2017-03-04","2017-03-05","2017-03-06","2017-03-07","2017-03-08","2017-03-09","2017-03-10","2017-03-11","2017-03-12","2017-03-13","2017-03-14","2017-03-15","2017-03-16",{"$f":"BY4","v":"2017-03-17"},"2017-03-18","2017-03-19","2017-03-20","2017-03-21","2017-03-22","2017-03-23","2017-03-24","2017-03-25","2017-03-26","2017-03-27","2017-03-28","2017-03-29","2017-03-30","2017-03-31","2017-04-01","2017-04-02","2017-04-03","2017-04-04","2017-04-05","2017-04-06","2017-04-07","2017-04-08","2017-04-09","2017-04-10","2017-04-11","2017-04-12","2017-04-13","2017-04-14","2017-04-15","2017-04-16","2017-04-17","2017-04-18","2017-04-19","2017-04-20","2017-04-21","2017-04-22",{"$f":"DJ4","v":"2017-04-23"},"2017-04-24","2017-04-25","2017-04-26","2017-04-27","2017-04-28","2017-04-29","2017-04-30","2017-05-01",{"$f":"DS4","v":"2017-05-02"},"2017-05-03","2017-05-04","2017-05-05","2017-05-06","2017-05-07","2017-05-08","2017-05-09","2017-05-10","2017-05-11","2017-05-12","2017-05-13","2017-05-14","2017-05-15","2017-05-16","2017-05-17","2017-05-18","2017-05-19","2017-05-20","2017-05-21","2017-05-22","2017-05-23","2017-05-24","2017-05-25",{"$f":"EQ4","v":"2017-05-26"},"2017-05-27","2017-05-28","2017-05-29","2017-05-30","2017-05-31","2017-06-01","2017-06-02","2017-06-03","2017-06-04","2017-06-05","2017-06-06","2017-06-07","2017-06-08","2017-06-09","2017-06-10","2017-06-11","2017-06-12","2017-06-13","2017-06-14","2017-06-15","2017-06-16","2017-06-17","2017-06-18","2017-06-19","2017-06-20","2017-06-21","2017-06-22","2017-06-23","2017-06-24","2017-06-25","2017-06-26","2017-06-27","2017-06-28","2017-06-29","2017-06-30","2017-07-01","2017-07-02","2017-07-03","2017-07-04","2017-07-05","2017-07-06","2017-07-07","2017-07-08","2017-07-09","2017-07-10","2017-07-11","2017-07-12","2017-07-13","2017-07-14","2017-07-15","2017-07-16","2017-07-17","2017-07-18","2017-07-19","2017-07-20","2017-07-21","2017-07-22","2017-07-23","2017-07-24","2017-07-25",{"$f":"GZ4","v":"2017-07-26"},"2017-07-27","2017-07-28","2017-07-29","2017-07-30","2017-07-31","2017-08-01","2017-08-02","2017-08-03","2017-08-04","2017-08-05","2017-08-06","2017-08-07","2017-08-08","2017-08-09","2017-08-10","2017-08-11","2017-08-12","2017-08-13","2017-08-14","2017-08-15","2017-08-16","2017-08-17","2017-08-18","2017-08-19","2017-08-20","2017-08-21","2017-08-22","2017-08-23","2017-08-24","2017-08-25","2017-08-26","2017-08-27","2017-08-28","2017-08-29","2017-08-30","2017-08-31","2017-09-01","2017-09-02","2017-09-03","2017-09-04","2017-09-05","2017-09-06","2017-09-07","2017-09-08","2017-09-09","2017-09-10","2017-09-11","2017-09-12","2017-09-13","2017-09-14","2017-09-15","2017-09-16","2017-09-17","2017-09-18","2017-09-19","2017-09-20","2017-09-21","2017-09-22","2017-09-23","2017-09-24","2017-09-25","2017-09-26","2017-09-27",{"$f":"JL4","v":"2017-09-28"},"2017-09-29","2017-09-30","2017-10-01","2017-10-02","2017-10-03","2017-10-04","2017-10-05","2017-10-06","2017-10-07","2017-10-08","2017-10-09","2017-10-10","2017-10-11","2017-10-12","2017-10-13","2017-10-14","2017-10-15","2017-10-16","2017-10-17","2017-10-18","2017-10-19","2017-10-20","2017-10-21","2017-10-22","2017-10-23","2017-10-24","2017-10-25","2017-10-26","2017-10-27","2017-10-28","2017-10-29","2017-10-30","2017-10-31","2017-11-01","2017-11-02","2017-11-03","2017-11-04","2017-11-05","2017-11-06","2017-11-07","2017-11-08","2017-11-09","2017-11-10","2017-11-11","2017-11-12","2017-11-13","2017-11-14","2017-11-15","2017-11-16","2017-11-17","2017-11-18","2017-11-19","2017-11-20","2017-11-21","2017-11-22","2017-11-23","2017-11-24","2017-11-25","2017-11-26","2017-11-27","2017-11-28","2017-11-29","2017-11-30",{"$f":"LX4","v":"2017-12-01"},"2017-12-02","2017-12-03","2017-12-04","2017-12-05","2017-12-06","2017-12-07","2017-12-08","2017-12-09","2017-12-10","2017-12-11","2017-12-12","2017-12-13","2017-12-14","2017-12-15","2017-12-16","2017-12-17","2017-12-18","2017-12-19","2017-12-20","2017-12-21","2017-12-22","2017-12-23","2017-12-24","2017-12-25","2017-12-26","2017-12-27","2017-12-28","2017-12-29","2017-12-30",{"$f":"NB4","v":"2017-12-31"}]
[{"$f":"Listes!A2","v":"Dupont 1"},{"$f":"pos_congés($A6,B$5)","v":""},{"$f":"pos_congés($A6,C$5)","v":"C"},"","","","","","",{"$f":"pos_congés($A6,J$5)","v":""},"","","","","","","","",{"$f":"pos_congés($A6,S$5)","v":""},"","","","","F","F","F","","","","","","","","","","","","","","","","","","","","","","","","","","","","","","","","","","","","","","","","","","","","","","","","","","","","","","","","",{"$f":"pos_congés($A6,CE$5)","v":""},"","","","","","","","","","","","","","","","","","","","","","","","","","","","","","","","","","","","","","","","","","","","","","","","","","","","","","","","","","","","","","","",{"$f":"pos_congés($A6,EQ$5)","v":""},"","","","","","","","","","","","","","","","","","","","","","","","","","","","","","","","","","","",{"$f":"pos_congés($A6,GA$5)","v":""},"","","","","","","","","","","","","","","","","","","","","","","","","","","","","","","","","","","","","","","","","","","","","","","","","","","","","","","","","","","","",{"$f":"pos_congés($A6,IJ$5)","v":""},"","","","","","","","","","","","","","","","","","","","","","","","","","","","","","","","","","","","","","","","","","","","","","","","","","","","","","","","","","","","","","","",{"$f":"pos_congés($A6,KV$5)","v":""},"","","","","","","","","","","","","","","","","","","","","","","","","","","","","","","","","","","","","","","","","","","","","","","","","","","","","","","","","",""]
[{"$f":"Listes!A3","v":"Dupont 2"},{"$f":"pos_congés($A7,B$5)","v":""},"","","","","","R1/2","","","","","","",{"$f":"pos_congés($A7,O$5)","v":""},"","","","","","","","","","","","","","","","","","","","","","","","","","","","","","","","","","","","","","","","","","","","","","","","","","","","","","","","","","","","","","","","","","","","","","","","","","","","","","","","","","","","","","","","","","","","","","","","","","","","","","","","","","","","","","","","","","","","","","","","","","","","","","","","","","","","","","","","","","","","","","","","","","","","","","","","","","","","","","","","","","","","","","","","","","","","","","","","","","","","","","","","","","","","","","","","","","","","","","","","","","","","","","","","","","","","","","","","","","","","","","","","","","","","","","","","","","","","","","","","","","","","","","","","","","","","","","","","","","","","","","","","","","","","","","","","","","","","","","","","","","","","","","","","","","","","","","","","","","","","","","","","","","","","","","","","","","","","","","","","","","","","","","","","","","","","","","","","","","","","","","","","","","","","","","",""]
[{"$f":"Listes!A4","v":"Dupont 3"},"","","","","","","","","","","","","","","","","","","","","","","","","","","","","","C","C","","","","","","","","","","","","","","","","","","","","","","","","","","","","","","","","","","","","","","","","","","","","","","","","","","","","","","","","","","","","","","","","","","","","","","","","","","","","","","","","","","","","","","","","","","","","","","","","","","","","","","","","","","","","","","","","","","","","","","","","","","","","","","","","","","","","","","","","","","","","","","","","","","","","","","","","","","","","","","","","","","","","","","","","","","","","","","","","","","","","","","","","","","","","","","","","","","","","","","","","","","","","","","","","","","","","","","","","","","","","","","","","","","","","","","","","","","","","","","","","","","","","","","","","","","","","","","","","","","","","","","","","","","","","","","","","","","","","","","","","","","","","","","","","","","","","","","","","","","","","","","","","","","","","","","","","","","","","","","","","","","","","","","","","","","","","","",""]
[{"$f":"Listes!A5","v":"Dupont 4"},"","","","","","","","","","C1/2","","","","","","","","","","","","","","","","","","","","","","","","","","","","","","","","","","","","","","","","","","","","","","","","","","","","","","","","","","","","","","","","","","","","","","","","","","","","","","","","","","","","","","","","","","","","","","","","","","","","","","","","","","","","","","","","","","","","","","","","","","","","","","","","","","","","","","",{"$f":"pos_congés($A9,EP$5)","v":""},"","","","","","","","","","","","","","","","","","","","","","","","","","","","","","","","","","","","","","","F","F","F","F","F","F","F","","","","","","","","","","","","","","","","","","","","","","","","","","","","","","","","","","","","","","","","","","","","","","","","","","","","","","","","","","","","","","","","","","","","","","","","","","","","","","","","","","","","","","","","","","","","","","","","","","","","","","","","","","","","","","","","","","","",{"$f":"pos_congés($A9,KU$5)","v":""},"","","","","","","","","","","","","","","","","","","","","","","","","","","","","","","","","","","","","","","","","","","","","","","","","","","","","","","","","","",""]
[{"$f":"Listes!A6","v":"Dupont 5"},"","","","","","","","","","","","M","M","M","","","","","","","","","","","","","","","","","","","","","","","","","","","","","","","","","","","","","","","","","","","","","","","","","","","","","","","","","","","","","","","","","","","",{"$f":"pos_congés($A10,CE$5)","v":""},"","","","","","","","","","","","","","","","","","","","","","","","","","","","","","","","","","","","","","","","","","","","","","","","","","","","","","","","","","","","","","","","","","","","","","","","","","","","","","","","","","","","","","","","","","","","","","","","","","","","","","","","","","","","","","",{"$f":"pos_congés($A10,GL$5)","v":""},"","","","","","","","","","","","","","","","","","","","","","","","","","","","","","","","","","","","","","","","","","","","","","","","","",{"$f":"pos_congés($A10,IJ$5)","v":""},"","","","","","","","","","","","","","","","","","","","","","","","","","","","","","","","","","","","","","","","","","","","","","","","","","","","","","","","","","","","","","","","","","","","","","","","","","","","","","","","","","","","","","","","","","","","","","","","","","","","","","","","","","","","","","","","","","","","","","","","","",""]
[{"$f":"Listes!A7","v":"Dupont 6"},"","","","","","","C","C","C","C","C","C","C","C","C","C","C","C","C","C","C","C","","","","","","","","","","","",{"$f":"pos_congés($A11,AI$5)","v":""},"","","","","","","","","","","","","","","","","","","","","","","","","","","","","","","","","","","","","","","","","","","","","","","","","","","","","","","","","","","","","","","","","","","","","","","","","","","","","","","","","","","","","","","","","","","","","","","","","","","","","","","","","","","","","","","","","","","","","","","","","","","","","","","","","","","","","","","","","","","","","","","","","","","",{"$f":"pos_congés($A11,GA$5)","v":""},"","","","","","","","","","","","","","","","","","","","","","","","","","","","","","","","","","","","","","","","","","","","","","","","","","","","","","","","","","","","","","","","","","","","","","","","","","","","","","","","","","","","","","","","","","","","","","","","","","","","","","","","","","","","","","","","","","","","","","","","","","","","","","","","","","","","","","","","","","","","","","","","","","","","","","","","","","","","","","","","","","","","","","","","","","","","","","","","","","","","","","",""]
[{"$f":"Listes!A8","v":"Dupont 7"},"","","","","","","","","","","","","","","","","",{"$f":"pos_congés($A12,S$5)","v":""},"","","","","","","","","","","","","","","","","","","","","","","","","","","","","","","","","","","","","","","","","","","","","","","","","","","","","","","","","","","","","","","","","","","","","","","","","","","","","","","","","","","","","","","","","","","","","","","","","","","","","","","","","","","","","","","","","","","","","","","","","","","","","","","","","","","","","","","","","","","","","","","","","","","","","","","","","","","","","","","","","","","","","","","","","","","","","","","","","","","","","","","","","","","","","","","","","","","","","","","","","","","","","","","","","","","","","","","","","","","","","","","","","","","","","","","","","","","","","","","","","","","","","","","","","","","","","","","","","","","","","","","","","","","","","","","","","","","","","","","","","","","","","","","","","","","","","","","","","","","","","","","","","","","","","","","","","","","","","","","","","","","","","","","","","","","","","","","","","","","","","","","","","","",""]
[{"$f":"Listes!A9","v":"Dupont 8"},"","","","","","","","","R1/2","","","","","","","","","","","","","","","","C","C","","","","","","","","","","","","","","","","","","","","","","","","","","","","","","","","","","","","","","","","","","","","","","","","","","","","","","","","","","","","","","","","","","","","","","","","","","","","","","","","","","","","","","","","","","","","","","","","","","","","","","","","","","","","","","","","","","","","","","",{"$f":"pos_congés($A13,EP$5)","v":""},"","","","","","","","","","","","","","","","",{"$f":"pos_congés($A13,FG$5)","v":""},"","","","","","","","","","","","","","","",{"$f":"pos_congés($A13,FW$5)","v":""},"","","","","","C","C","C","C","C","C","C","C","C","C","C","C","C","C","C","C","C","C","C","C","C","C","C","C","C","C","C","C","","","","","","","","","","","","","","","","","","","","","","","","","","","","","","","","","","","","","","","","","","","","","","","","","","","","","","","","","","","","","","","","","","","","","","","","","","","","","","","","","","","","","","","","","","","","","","",{"$f":"pos_congés($A13,KU$5)","v":""},"","","","","","","","","","","","","","","","","","","","","","","","","","","","","","","","","","","","","","","","","","","","",{"$f":"pos_congés($A13,MN$5)","v":""},"","","","","","","","","","","","","",""]
[{"$f":"Listes!A10","v":"Dupont 9"},"","","","","","","","","","","","","","","","","","","","","","","","","","","","","","","","","","","","","","","","","","","","","","","","","","","","","","","","","","","","","","","","","","","","","","","","","","","","","","","","","","","","","","","","","","","","","","","","","","","","","","","","","","","","","","","","","","","","","","","","","","","","","","","","","","","","","","","","","","","","","","","","","",{"$f":"pos_congés($A14,EQ$5)","v":""},"","","","","","","","","","","","","","","","","","","","","","","","","","","","","","","","","","","","","","","","","","","","","","","","","","","","","","","","","","","","","","","","","","","","","","","","","","","","","","","","","","","","","","","","","","","","","","","","",{"$f":"pos_congés($A14,IJ$5)","v":""},"","","","","","","","","","","","","","","","","","","","","","","","","","","","","","","","","","","","","","","","","","","","","","","","","","","","","","","","","","","","","","","","","","","","","","","","","","","","","","","","","","","","","","","","","","","","","","","","","","","","","","","","","","","","","","","","","","","","","","","","","",""]
[{"$f":"Listes!A11","v":"Dupont 10"},"","","","","","","","","","","","","","","","","","","","","","","","","","","","","","","","","","","","","","","","","","","","","","","","","","","","","","","","","","","","","",{"$f":"pos_congés($A15,BK$5)","v":""},"","","","","","","","","","","","","","","",{"$f":"pos_congés($A15,CA$5)","v":""},"","","","","","","","","","","","","","","","","","","","","","","","","","","","","","","","","","","","","","","","","","","","","","","","","","","","","","","","","","","","","","","","","","","","","","","","","","","","","","","","","","","","","","","","","","","","","","","","","","","","","","","","","","","","","","","","","","","","","","","","","","","","","","","","","","","","","","","","","","","","","","","","","","","","","","","","","","","","","","","","","","","","","","","","","","","","","","","","","","","","","","","","","","","","","","","","","","","","","","","","","","","","","","","","","","","","","","","","","","","","","","","","","","","","","","","","","","","","","","","","","","","","","","","","","","","","","","","","","","","","","","","","","","","","","","","","","","","","","","","","","","","","","","",""]
[{"$f":"Listes!A12","v":"Dupont 11"},"","","","","","","","","","","","","","","","","","","","","","","","","","","","","","","","","","","","","","","","","","","","","","","","","",{"$f":"pos_congés($A16,AY$5)","v":""},"","","","","","","","","","","","","","","","","","","","","","","","","","","","","","","","","","","","","","","","","","","","","","","","","","","","","","","","","","","","","","","","","","","","","","","","","","","","","","","","","","","","","","","","","","","","","","","","","","","","","","","","","","","","","","","","","","","","","","","","","","","","","","","","","","","","","","","","","","","","","","","","","","","","","","","","","","","","","","","","","","","","","","","","","","","","","","","","","","","","","",{"$f":"pos_congés($A16,HY$5)","v":""},"","","","","","","","","","","","","","","","","","","","","","","","","","","","","","","","","","","","","","","","","","","","","","","","","","","","","","","","","","","","","","","","","","","","","","","","","","","","","","","","","","","","","","","","","","","","","","","","","","","","","","","","","","","","","","","","","","","","","","","","","","","","","","","","","","","","",""]
[{"$f":"Listes!A13","v":"Dupont 12"},"","","","","","","","","","","","","","","","","","","","","","","","","","","","","","","","","","","","","","","","","","","","","","","","","","","","","","","","","","","","","","","","","","","","","","","","","","","","","","","","","","","","","","","","","","","","","","","","","","","","","","","","","","","","","","","","","","","","","","","","","","","","","","","","","","","","","","","","","","","","","","","",{"$f":"pos_congés($A17,EO$5)","v":""},"","","","","","","","","","","","","","","","","","","","","","","","","","","","","","","","","","","","","","","","","","","","","","","","","","","","","","","","","","","","","","","","","","","","","","","","","","","","","","","","","","","","","","","","","","","","","","","","","","","","","","","","","","","","","","","","","","","","","","","","","","","","","","","","","","","","","","","","","","","","","","","","","","","","","","","","","","","","","","","","","",{"$f":"pos_congés($A17,KU$5)","v":""},"","","","","","","","","","","","","","","","","","","","","","","","","","","","","","","","","","","","","","","","","","","","","","","","","","","","","","","","","","",""]
[{"$f":"Listes!A14","v":"Dupont 13"},"","","","","","","","","","","","","","","","","","","","","","","","","","","","","","","","","","","","","","","","","","","","","","","","","","","","","","","","","","","","","","","","","","","","","","","","","","","","","","","","","","","","","","","","","","","","","",{"$f":"pos_congés($A18,CQ$5)","v":""},"","","","","","","","","","","","","","","",{"$f":"pos_congés($A18,DG$5)","v":""},"","","","","","","","","","","","","","","",{"$f":"pos_congés($A18,DW$5)","v":""},"","","","","","","","","","","","","","","",{"$f":"pos_congés($A18,EM$5)","v":""},"","","","","","","","","","","","","","","","","","","","","","","","","","","","","","","","","","","","","","","","","","","","","","","","","","","","","","","","","","","","","","","","","","","","","","","","","","","","","","","","","","","","","","",{"$f":"pos_congés($A18,HV$5)","v":""},"","","","","","","","","","","","","","","",{"$f":"pos_congés($A18,IL$5)","v":""},"","","","","","","","","","","","","","","",{"$f":"pos_congés($A18,JB$5)","v":""},"","","","","","","","","","","","","","","",{"$f":"pos_congés($A18,JR$5)","v":""},"","","","","","","","","","","","","","","",{"$f":"pos_congés($A18,KH$5)","v":""},"","","","","","","","","","","","","","","","","","","","","","","","","","","","","","","","","","","","","","","","","","","","","","","","","","","","","","","","","","","","","","","","","","","","","","","",""]
[{"$f":"Listes!A15","v":"Dupont 14"},"","","","","","","","","","","","","","","","","","","","","","","","","","","","","","","","","","","","","","","","","","","","","","","","","","","","","","","","","","","","","","","","","","","","","","","","","","","","","","","","","","","","","","","","","","","","","","","","","","","","","","","","","","","","","","","","","","","","","","","","","","","","","","","","","","","","","","","","","","","","","","","","","","","","","","","","","","","","","","","","","","","","","","","","","","","","","","","","","","","","","",{"$f":"pos_congés($A19,GA$5)","v":""},"","","","","","","","","","","","","","","",{"$f":"pos_congés($A19,GQ$5)","v":""},"","","","","","","","","","","","","","","",{"$f":"pos_congés($A19,HG$5)","v":""},"","","","","","","","","","","","","","","","","","","","","","","","","","","","","","","","","","","","","","","","","","","","","","","","","","","","","","","","","","","","","","","","","","","","","","","","","","","","","","","","","","","","","","","","","","","","","","","","","","","","","","","","","","","","","","","","","","","","","","","","","","","","","","","","","","","","","","","","","","","","","","","","","","","","","","",""]
[{"$f":"Listes!A16","v":"Dupont 15"},"","","","","","","","","","","","","","","","","","","","","","","","","","","","","","","","","","","","","","","","","","","","","","","","","","","","","","","","","","","","","","","","","","","","","","","","","","","","","","","","","","","","","","","","","","","","","","","","","","","","","","","","","","","","","","","","","","","","","","","","","","","","","","","","","","","","","","","","","","","","","","","","","","","","","","","","","","","","","","","","","","","","","","","","","","","","","","","","","","","","","","","","","","","","","","","","","","","","","","","","","","","","","","","","","","","","","","","","","","","","","","","","","","","","","","","","","","","","","","","","","","","","","","","","","","","","","","","","","","","","","","","","","","","","","","","","","","","","","","","","","","","","","","","","","","","","","","","","","","","","","","","","","","","","","","","","","","","","","","","","","","","","","","","","","","","","","","","","","","","","","","","","","","","","","","","","","","","","","","","","","","","","",""]
[{"$f":"Listes!A17","v":"Dupont 16"},"","","","","","","","","","","","","","","","","","","","","","","","","","","","","","","","","","","","","","","","","","","","","","","","","","","","","","","","","","","","","","","","","","","","","","","","","","","","","","","","","","","","","","","","","","","","","","","","","","","","","","","","","","","","","","","","","","","","","","","","","","","","","","","","","","","","","","","","","","","","","","","","","","","","","","","","","","","","","","","","","","","","","","","","","","","","","","","","","","","","","","","","","","","","","","","","","","","","","","","","","","","","","","","","","","","","","","","","","","","","","","","","","","","","","","","","","","","","","","","","","","","","","","","","","","","","","","","","","","","","","","","","","","","","","","","","","","","","","","","","","","","","","","","","","","","","","","","","","","","","","","","","","","","","","","","","","","","","","","","","","","","","","","","","","","","","","","","","","","","","","","","","","","","","",{"$f":"pos_congés($A21,ML$5)","v":""},"","","","","","","","","","","","","","","",""]
[{"$f":"Listes!A18","v":"Dupont 17"},"","","","","","","","","","","","","","","","",{"$f":"pos_congés($A22,R$5)","v":""},"","","","","","","","","","","","","","","","","","","","","","","","","","","","","","","","","","","","","","","","","","","","","","","","","","","","","","","","","","","","","","","","","","","","","","","","","","","","","","","","","","","","","","","","","","","","","","","","","","","","","","","","","","","","","","","","","","","","","","","","","","","","","","","","","","","","","","","","","","","","","","","","","","","","","","","","","","","","","","","","","","","","","","","","","","","","","","","","","","","","","","","","","","","","","","","","","","","","","","","","","","","","","","","","","","","","","","","","","","","","","","","","","","","","","","","","","","","","","","","","","","","","","","","","","","","","","","","","","","","","","","","","","","","","","","","","","","","","","","","","","","","","","","","","","","","",{"$f":"pos_congés($A22,KX$5)","v":""},"","","","","","","","","","","","","","","",{"$f":"pos_congés($A22,LN$5)","v":""},"","","","","","","","","","","","","","","",{"$f":"pos_congés($A22,MD$5)","v":""},"","","","","","","","","","","","","","","","","","","","","","","",""]
[{"$f":"Listes!A19","v":"Dupont 18"},{"$f":"pos_congés($A23,B$5)","v":""},"","","","","","","","","","","","","","","","","","","","","","","","","","","","","","","","","","","","","","","","","","","","","","","","","","","","","","","","","","","","","","","","","","","","","","","","","","","","","","","","","","","","","","","","","","","","","","","","","","","","","","","","","","","","","","","","","","","","","","","","","","","","","","","","","","","","","","","","","","","","","","","","","","","","","","","","","","","","","","","","","","","","","","","","","","","","","","","","","","","","","","","","","","","","","","","","","","","","","","","","","","","","","","","","","","","","","","","","","","","","","","","","","","","","","","","","","","","","","","","","","","","","","","","","","","","","","","","","","","","","","","","","","","","","","","","","","","","","","","","","","","","","","","","","","","","","","","","","","","","","","","","","","","","","","","","","","","","","","","","","","","","","","","","","","","","","","","","","","","","","","","","","","","","","","","","","","","","","","","","","","","","",""]
[{"$f":"Listes!A20","v":"Dupont 19"},"","","","","","","","","","","","","","","","","","","","","","","","","","","","","","","","","","","","","","","","","","","","","","","","","","","","","","","","","","","","","","","","","","","","","","","","","","","","","","","","","","","","","","","","","","","","","","","","","","","","","","","","","","","","","","","","","","","","","","","","","","","","","","","","","","","","","","","","","","","","","","","","","","","","","","","","","","","","","","","","","","","","","","","","","","","","","","","","","","","","","","","","","","","","","","","","","","","","","","","","","","","","","","","","","","","","","","","","","","","","","","","","","","","","","","","","","","","","","","","","","","","","","","","","","","","","","","","","","","","","","","","","","","","","","","","","","","","","","","","","","","","","","","","","","","","","","","","","","","","","","","","","","","","","","","","","","","","","","","","","","","","","","","","","","","","","","","","","","","","","","","","","","","","","","","","","","","","","","","","","","","","","",""]
[{"$f":"Listes!A21","v":"Dupont 20"},"","","","","","","","","","","","","","","","","","","","","","","","","","","","","","","","","","","","","","","","","","","","","","","","","","","","","","","","","","","","","","","","","","","","","","","","","","","","","","","","","","","","","","","","","","","","","","","","","","","","","","","","","","","","","","","","","","","","","","","","","","","","","","","","","","","","","","","","","","","","","","","","","","","","","","","","","","","","","","","","","","","","","","","","","","","","","","","","","","","","","","","","","","","","","","","","","","","","","","","","","","","","","","","","","","","","","","","","","","","","","","","","","","","","","","","","","","","","","","","","","","","","","","","","","","","","","","","","","","","","","","","","","","","","","","","","","","","","","","","","","","","","","","","","","","","","","","","","","","","","","","","","","","","","","","","","","","","","","","","","","","","","","","","","","","","","","","","","","","","","","","","","","","","","","","","","","","","","","","","","","","","","",""]
[{"$f":"Listes!A22","v":"Dupont 21"},{"$f":"SUMPRODUCT((Noms=$A26)*(B$4>=Debut)*(B$4<=Fin))","v":0},0,0,0,0,0,0,0,0,0,{"$f":"SUMPRODUCT((Noms=$A26)*(L$4>=Debut)*(L$4<=Fin))","v":0},0,0,0,0,0,0,0,0,0,{"$f":"SUMPRODUCT((Noms=$A26)*(V$4>=Debut)*(V$4<=Fin))","v":0},0,0,0,0,0,0,0,0,0,0,{"$f":"SUMPRODUCT((Noms=$A26)*(AG$4>=Debut)*(AG$4<=Fin))","v":0},0,0,0,0,0,0,0,0,0,0,0,0,0,0,0,0,0,0,0,0,0,0,0,0,0,0,0,{"$f":"SUMPRODUCT((Noms=$A26)*(BI$4>=Debut)*(BI$4<=Fin))","v":0},0,0,0,0,0,0,0,0,0,0,0,0,0,0,0,0,0,0,0,0,0,0,0,0,0,0,0,0,0,0,0,0,0,0,0,0,0,0,0,0,0,0,0,0,0,0,0,0,0,0,0,0,0,0,0,0,0,0,0,0,0,0,0,{"$f":"SUMPRODUCT((Noms=$A26)*(DU$4>=Debut)*(DU$4<=Fin))","v":0},0,0,0,0,0,0,0,0,0,0,0,0,0,0,0,0,0,0,0,0,0,0,0,0,0,0,0,0,0,0,0,0,0,0,0,0,0,0,0,0,0,0,0,0,0,0,0,0,0,0,0,0,0,0,0,0,0,{"$f":"SUMPRODUCT((Noms=$A26)*(GA$4>=Debut)*(GA$4<=Fin))","v":0},0,0,0,0,0,0,0,0,0,0,0,0,0,0,0,0,0,0,0,0,0,0,0,0,0,0,0,0,0,0,0,0,0,0,0,0,0,0,0,0,0,0,0,0,0,0,0,0,0,0,0,0,0,0,0,0,0,0,0,0,{"$f":"SUMPRODUCT((Noms=$A26)*(IJ$4>=Debut)*(IJ$4<=Fin))","v":0},0,0,0,0,0,0,0,0,0,0,0,0,0,0,0,0,0,0,0,0,0,0,0,0,0,0,0,0,0,0,0,0,0,0,0,0,0,0,0,0,0,0,0,0,0,0,0,0,0,0,0,0,0,0,0,0,0,0,0,0,0,0,0,{"$f":"SUMPRODUCT((Noms=$A26)*(KV$4>=Debut)*(KV$4<=Fin))","v":0},0,0,0,0,0,0,0,0,0,0,0,0,0,0,0,0,0,0,0,0,0,0,0,0,0,0,0,0,0,0,0,0,0,0,0,0,0,0,0,0,0,0,0,0,0,0,0,0,0,0,0,0,0,0,0,0,0,0]
[{"$f":"Listes!A23","v":"Dupont 22"},0,0,0,0,0,0,0,0,0,0,0,0,0,0,0,0,0,0,0,0,0,0,0,0,0,0,0,0,0,0,0,0,0,0,0,0,0,0,0,0,0,0,0,0,0,0,0,0,0,0,0,0,0,0,0,0,0,0,0,0,0,0,0,0,0,0,0,0,0,0,0,0,0,0,0,0,0,0,0,0,0,0,0,0,0,0,0,0,0,0,0,0,0,0,0,0,0,0,0,0,0,0,0,0,0,0,0,0,0,0,0,0,0,0,0,0,0,0,0,0,0,0,0,0,0,0,0,0,0,0,0,0,0,0,0,0,0,0,0,0,0,0,0,0,0,0,0,0,0,0,0,0,0,0,0,0,0,0,0,0,0,0,0,0,0,0,0,0,0,0,0,0,0,0,0,0,0,0,0,0,0,0,0,0,0,0,0,0,0,0,0,0,0,0,0,0,0,0,0,0,0,0,0,0,0,0,0,0,0,0,0,0,0,0,0,0,0,0,0,0,0,0,0,0,0,0,0,0,0,0,0,0,0,0,0,0,0,0,0,0,0,0,0,0,0,0,0,0,0,0,0,0,0,0,0,0,0,0,0,0,0,0,0,0,0,0,0,0,0,0,0,0,0,0,0,0,0,0,0,0,0,0,0,0,0,0,0,0,0,0,0,0,0,0,0,0,0,0,0,0,0,0,0,0,0,0,0,0,0,0,0,0,0,0,0,0,0,0,0,0,0,0,0,0,0,0,0,0,0,0,0,0,0,0,0,0,0,0,0,0,0,0,0,0,0,0,0,0,0,0,0,0,0,0,0,0,0,0,0,0,0,0,0,0,0]
[{"$f":"Listes!A24","v":"Dupont 23"},0,0,0,0,0,0,0,0,0,0,0,0,0,0,0,0,0,0,0,0,0,0,0,0,0,0,0,0,0,0,0,0,0,0,0,0,0,0,0,0,0,0,0,0,0,0,0,0,0,0,0,0,0,0,0,0,0,0,0,0,0,0,0,0,0,0,0,0,0,0,0,0,0,0,0,0,0,0,0,0,0,0,0,0,0,0,0,0,0,0,0,0,0,0,0,0,0,0,0,0,0,0,0,0,0,0,0,0,0,0,0,0,0,0,0,0,0,0,0,0,0,0,{"$f":"SUMPRODUCT((Noms=$A28)*(DT$4>=Debut)*(DT$4<=Fin))","v":0},0,0,0,0,0,0,0,0,0,0,0,0,0,0,0,0,0,0,0,0,0,0,0,0,0,0,0,0,0,0,0,0,0,0,0,0,0,0,0,0,0,0,0,0,0,0,0,0,0,0,0,0,0,0,0,0,0,0,0,0,0,0,0,0,0,0,0,0,0,0,0,0,0,0,0,0,0,0,0,0,0,0,0,0,0,0,0,0,0,0,0,0,0,0,0,0,0,0,0,0,0,0,0,0,0,0,0,0,0,0,0,0,0,0,0,0,0,0,0,0,0,0,0,0,0,0,0,0,0,0,0,0,0,0,0,0,0,0,0,0,0,0,0,0,0,0,0,0,0,0,0,0,0,0,0,0,0,0,0,0,0,0,0,0,0,0,0,0,0,0,0,0,0,0,0,0,0,0,0,0,0,0,0,0,0,0,0,0,0,0,0,0,0,0,0,0,0,0,0,0,0,0,0,0,0,0,0,0,0,0,0,0,0,0,0,0,0,0,0,0,0,0,0,0,0,0,0,0,0,0,0,0,0,0,0,0,0,0,0,0,0,0]
[{"$f":"Listes!A25","v":"Dupont 24"},0,0,0,0,0,0,0,0,0,0,0,0,0,0,0,0,0,0,0,0,0,0,{"$f":"SUMPRODUCT((Noms=$A29)*(X$4>=Debut)*(X$4<=Fin))","v":0},0,0,0,0,0,0,0,0,0,0,0,0,0,0,0,0,0,0,0,0,0,0,0,0,0,0,0,0,0,0,0,0,0,0,0,0,0,0,0,0,0,0,0,0,0,0,0,0,0,0,0,0,0,0,0,0,0,0,0,0,0,0,0,{"$f":"SUMPRODUCT((Noms=$A29)*(CJ$4>=Debut)*(CJ$4<=Fin))","v":0},0,0,0,0,0,0,0,0,0,0,0,0,0,0,0,0,0,0,0,0,0,0,0,0,0,0,0,0,0,0,0,0,0,0,0,0,0,0,0,0,0,0,0,0,0,0,0,0,0,0,0,0,0,0,0,0,0,0,0,0,0,0,0,0,0,0,0,0,0,0,0,0,0,0,0,0,0,0,0,0,0,0,0,0,0,0,0,0,0,0,0,0,0,0,0,0,0,0,0,0,0,0,0,0,0,0,0,0,0,0,0,0,0,0,0,0,0,0,0,0,0,0,0,0,0,0,0,0,0,0,0,0,0,0,0,0,0,0,0,0,0,0,0,0,0,0,0,0,0,0,0,0,0,0,0,0,0,0,0,0,0,0,0,0,0,0,0,0,0,0,0,0,0,0,0,0,0,0,0,0,0,0,0,0,0,0,0,0,0,0,0,0,0,0,0,0,0,0,0,0,0,0,0,0,0,0,0,0,0,0,0,0,0,0,0,0,0,0,{"$f":"SUMPRODUCT((Noms=$A29)*(KU$4>=Debut)*(KU$4<=Fin))","v":0},0,0,0,0,0,0,0,0,0,0,0,0,0,0,0,0,0,0,0,0,0,0,0,0,0,0,0,0,0,0,0,0,0,0,0,0,0,0,0,0,0,0,0,0,0,0,0,0,0,0,0,0,0,0,0,0,0,0,0]
[{"$f":"Listes!A26","v":"Dupont 25"},0,0,0,0,0,0,0,0,0,0,0,0,0,0,0,0,0,0,0,0,0,0,0,0,0,0,0,0,0,0,0,0,0,0,0,0,0,0,0,0,0,0,0,0,0,0,0,0,0,0,0,0,0,0,0,0,0,0,0,0,0,0,0,0,0,0,0,0,0,0,0,0,0,0,0,0,0,0,0,0,0,0,0,0,0,0,0,0,0,0,0,0,0,0,0,0,0,0,0,0,0,0,0,0,0,0,0,0,0,0,0,0,0,0,0,0,0,0,0,0,0,0,0,0,0,0,0,0,0,0,0,0,0,0,0,0,0,0,0,0,0,0,0,0,0,0,0,0,0,0,0,0,0,0,0,0,0,0,0,0,0,0,0,0,0,0,0,0,0,0,0,0,0,0,0,0,0,0,0,0,0,0,0,0,0,0,0,0,0,0,0,0,{"$f":"SUMPRODUCT((Noms=$A30)*(GL$4>=Debut)*(GL$4<=Fin))","v":0},0,0,0,0,0,0,0,0,0,0,0,0,0,0,0,{"$f":"SUMPRODUCT((Noms=$A30)*(HB$4>=Debut)*(HB$4<=Fin))","v":0},0,0,0,0,0,0,0,0,0,0,0,0,0,0,0,{"$f":"SUMPRODUCT((Noms=$A30)*(HR$4>=Debut)*(HR$4<=Fin))","v":0},0,0,0,0,0,0,0,0,0,0,0,0,0,0,0,{"$f":"SUMPRODUCT((Noms=$A30)*(IH$4>=Debut)*(IH$4<=Fin))","v":0},0,0,0,0,0,0,0,0,0,0,0,0,0,0,0,{"$f":"SUMPRODUCT((Noms=$A30)*(IX$4>=Debut)*(IX$4<=Fin))","v":0},0,0,0,0,0,0,0,0,0,0,0,0,0,0,0,{"$f":"SUMPRODUCT((Noms=$A30)*(JN$4>=Debut)*(JN$4<=Fin))","v":0},0,0,0,0,0,0,0,0,0,0,0,0,0,0,0,{"$f":"SUMPRODUCT((Noms=$A30)*(KD$4>=Debut)*(KD$4<=Fin))","v":0},0,0,0,0,0,0,0,0,0,0,0,0,0,0,0,{"$f":"SUMPRODUCT((Noms=$A30)*(KT$4>=Debut)*(KT$4<=Fin))","v":0},0,0,0,0,0,0,0,0,0,0,0,0,0,0,0,0,0,0,0,0,0,0,0,0,0,0,0,0,0,0,0,0,0,0,0,0,0,0,0,0,0,0,0,0,0,0,0,0,0,0,0,0,0,0,0,0,0,0,0,0]
[{"$f":"Listes!A27","v":"Dupont 26"},0,0,0,0,0,0,0,0,0,0,0,0,0,0,0,0,0,0,0,0,0,0,0,0,0,0,0,0,0,0,0,0,0,0,0,0,0,0,0,0,0,0,0,0,0,0,0,0,0,0,0,0,0,0,0,0,0,0,0,0,0,0,0,0,0,0,0,0,0,0,0,0,0,0,0,0,0,0,0,0,0,0,0,0,0,0,0,0,0,0,0,0,0,0,0,0,0,0,0,0,0,0,0,0,0,0,0,0,0,0,0,0,0,0,0,0,0,0,0,0,0,0,0,0,0,0,0,0,0,0,0,0,0,0,0,0,0,0,0,0,0,0,0,0,0,0,0,0,0,0,0,0,0,0,0,0,0,0,0,0,0,0,0,0,0,0,0,0,0,0,0,0,0,0,0,0,0,0,0,0,0,{"$f":"SUMPRODUCT((Noms=$A31)*(GA$4>=Debut)*(GA$4<=Fin))","v":0},0,0,0,0,0,0,0,0,0,0,0,0,0,0,0,0,0,0,0,0,0,0,0,0,0,0,0,0,0,0,0,0,0,0,0,0,0,0,0,0,0,0,0,0,0,0,0,0,0,0,0,0,0,0,0,0,0,0,0,0,0,0,0,0,0,0,0,0,0,0,0,0,0,0,0,0,0,0,0,0,0,0,0,0,0,0,0,0,0,0,0,0,0,0,0,0,0,0,0,0,0,0,0,0,0,0,0,0,0,0,0,0,0,0,0,0,0,0,0,0,0,0,0,0,0,0,0,0,0,0,0,0,0,0,0,0,0,0,0,0,0,0,0,0,0,0,0,0,0,0,0,0,0,0,0,0,0,0,0,0,0,0,0,0,0,0,0,0,0,0,0,0,0,0,0,0,0,0,0,0,0,0,0]
[{"$f":"Listes!A28","v":"Dupont 27"},0,0,0,0,0,0,0,0,0,0,0,0,0,0,0,0,0,0,0,0,0,0,0,0,0,0,0,0,0,0,0,0,0,0,0,0,0,0,0,0,0,0,0,0,0,0,0,0,0,0,0,0,0,0,0,0,0,0,0,0,0,0,0,0,0,0,0,0,0,0,0,0,0,0,0,0,0,0,0,0,0,0,0,0,0,{"$f":"SUMPRODUCT((Noms=$A32)*(CI$4>=Debut)*(CI$4<=Fin))","v":0},0,0,0,0,0,0,0,0,0,0,0,0,0,0,0,0,0,0,0,0,0,0,0,0,0,0,0,0,0,0,0,0,0,0,0,0,0,0,0,0,0,0,0,0,0,0,0,0,0,0,0,0,0,0,0,0,0,0,0,0,0,0,0,{"$f":"SUMPRODUCT((Noms=$A32)*(EU$4>=Debut)*(EU$4<=Fin))","v":0},0,0,0,0,0,0,0,0,0,0,0,0,0,0,0,0,0,0,0,0,0,0,0,0,0,0,0,0,0,0,0,0,0,0,0,0,0,0,0,0,0,0,0,0,0,0,0,0,0,0,0,0,0,0,0,0,0,0,0,0,0,0,0,0,0,0,0,0,0,0,0,0,0,0,0,0,0,0,0,0,0,0,0,0,0,0,0,0,0,0,0,0,0,0,0,0,0,0,0,0,0,0,0,0,0,0,0,0,0,0,0,0,0,0,0,0,0,0,0,0,0,0,0,0,0,0,0,0,0,0,0,0,0,0,0,0,0,0,0,0,0,0,0,0,0,0,0,0,0,0,0,0,0,0,0,0,0,0,0,0,0,0,0,0,0,0,0,0,0,0,0,0,0,0,0,0,0,0,0,0,0,0,0,0,0,0,0,0,0,0,0,0,0,0,0,0,0,0,0,0,0,0,0,0,0,0,0,0,0,0,0,0,0,0,0]
[{"$f":"Listes!A29","v":"Dupont 28"},0,0,0,0,0,0,0,0,0,0,0,0,0,0,0,0,0,0,0,0,0,0,0,0,0,0,0,0,0,0,0,0,0,0,0,0,0,0,0,0,0,0,0,0,0,0,0,0,0,0,0,0,0,0,0,0,0,0,0,0,0,0,0,0,0,0,0,0,0,0,0,0,0,0,0,0,0,0,0,0,0,0,0,0,0,0,0,0,0,0,0,0,0,0,0,0,0,0,0,0,0,0,0,0,0,0,0,0,0,0,0,0,0,0,0,0,0,0,0,0,0,0,0,0,0,0,0,0,0,0,0,0,0,0,0,0,0,0,0,0,0,0,0,0,0,0,0,0,0,0,0,0,0,0,0,0,0,0,0,0,0,0,0,0,0,0,0,0,0,0,0,0,0,0,0,0,0,0,0,0,0,0,0,0,0,0,0,0,0,0,0,0,0,0,0,0,0,0,0,0,0,0,0,0,0,0,0,0,0,0,0,0,0,0,0,0,0,0,0,0,0,0,0,0,0,0,0,0,0,0,0,0,0,0,0,0,0,0,0,0,0,0,0,0,0,0,0,0,0,0,0,0,0,0,0,0,0,0,0,0,0,0,0,0,0,0,0,0,0,0,0,0,0,0,0,0,0,0,0,0,0,0,0,0,0,0,0,0,0,0,0,0,0,0,0,0,0,0,0,0,0,0,0,0,0,0,0,0,0,0,0,0,0,0,0,0,0,0,0,0,{"$f":"SUMPRODUCT((Noms=$A33)*(LJ$4>=Debut)*(LJ$4<=Fin))","v":0},0,0,0,0,0,0,0,0,0,0,0,0,0,0,0,0,0,0,0,0,0,0,0,0,0,0,0,0,0,0,0,0,0,0,0,0,0,0,0,0,0,0,0,0]

{"sheet":"Planning S2","index":1,"n_rows":29,"n_cols":122,"rows_kept":29,"cut":false,"hidden":true,"merged":[[1,13,1,16],[1,43,1,46]]}
[2016]
[null,null,null,null,null,null,null,null,null,null,null,null,null,"Janvier",null,null,null,null,null,null,null,null,null,null,null,null,null,null,null,null,null,null,null,null,null,null,null,null,null,null,null,null,null,"Février"]
[]
[null,{"$f":"DATE(An,MONTH(1&N2),1)","v":"2016-01-01"},{"$f":"B4+1","v":"2016-01-02"},{"$f":"C4+1","v":"2016-01-03"},"2016-01-04","2016-01-05","2016-01-06","2016-01-07","2016-01-08","2016-01-09","2016-01-10","2016-01-11",{"$f":"L4+1","v":"2016-01-12"},"2016-01-13",{"$f":"N4+1","v":"2016-01-14"},"2016-01-15","2016-01-16","2016-01-17","2016-01-18","2016-01-19","2016-01-20","2016-01-21","2016-01-22","2016-01-23","2016-01-24","2016-01-25","2016-01-26","2016-01-27","2016-01-28","2016-01-29","2016-01-30","2016-01-31",{"$f":"DATE(An,MONTH(1&AR2),1)","v":"2016-02-01"},{"$f":"AG4+1","v":"2016-02-02"},{"$f":"AH4+1","v":"2016-02-03"},"2016-02-04","2016-02-05","2016-02-06","2016-02-07","2016-02-08","2016-02-09","2016-02-10","2016-02-11","2016-02-12","2016-02-13","2016-02-14","2016-02-15","2016-02-16","2016-02-17","2016-02-18","2016-02-19","2016-02-20","2016-02-21","2016-02-22","2016-02-23","2016-02-24","2016-02-25","2016-02-26","2016-02-27","2016-02-28","2016-02-29","2016-03-01","2016-03-02","2016-03-03","2016-03-04","2016-03-05","2016-03-06","2016-03-07","2016-03-08","2016-03-09","2016-03-10","2016-03-11","2016-03-12","2016-03-13","2016-03-14","2016-03-15","2016-03-16","2016-03-17","2016-03-18","2016-03-19","2016-03-20","2016-03-21","2016-03-22","2016-03-23","2016-03-24","2016-03-25","2016-03-26","2016-03-27","2016-03-28","2016-03-29","2016-03-30","2016-03-31","2016-04-01","2016-04-02","2016-04-03","2016-04-04","2016-04-05","2016-04-06",{"$f":"CT4+1","v":"2016-04-07"},"2016-04-08","2016-04-09","2016-04-10","2016-04-11","2016-04-12","2016-04-13","2016-04-14","2016-04-15","2016-04-16","2016-04-17","2016-04-18","2016-04-19","2016-04-20","2016-04-21","2016-04-22","2016-04-23","2016-04-24","2016-04-25","2016-04-26","2016-04-27","2016-04-28","2016-04-29","2016-04-30"]
["NOM",{"$f":"B4","v":"2016-01-01"},{"$f":"C4","v":"2016-01-02"},"2016-01-03","2016-01-04","2016-01-05","2016-01-06","2016-01-07","2016-01-08","2016-01-09","2016-01-10","2016-01-11","2016-01-12","2016-01-13","2016-01-14","2016-01-15","2016-01-16","2016-01-17","2016-01-18","2016-01-19","2016-01-20","2016-01-21","2016-01-22","2016-01-23","2016-01-24","2016-01-25","2016-01-26","2016-01-27","2016-01-28","2016-01-29","2016-01-30","2016-01-31","2016-02-01","2016-02-02","2016-02-03","2016-02-04","2016-02-05","2016-02-06","2016-02-07","2016-02-08","2016-02-09","2016-02-10","2016-02-11","2016-02-12","2016-02-13","2016-02-14","2016-02-15","2016-02-16","2016-02-17","2016-02-18","2016-02-19","2016-02-20","2016-02-21","2016-02-22","2016-02-23","2016-02-24","2016-02-25","2016-02-26","2016-02-27","2016-02-28","2016-02-29","2016-03-01","2016-03-02","2016-03-03","2016-03-04","2016-03-05",{"$f":"BO4","v":"2016-03-06"},"2016-03-07","2016-03-08","2016-03-09","2016-03-10","2016-03-11","2016-03-12","2016-03-13","2016-03-14","2016-03-15","2016-03-16","2016-03-17","2016-03-18","2016-03-19","2016-03-20","2016-03-21","2016-03-22","2016-03-23","2016-03-24","2016-03-25","2016-03-26","2016-03-27","2016-03-28","2016-03-29","2016-03-30","2016-03-31","2016-04-01","2016-04-02","2016-04-03","2016-04-04","2016-04-05","2016-04-06","2016-04-07","2016-04-08","2016-04-09","2016-04-10","2016-04-11","2016-04-12","2016-04-13","2016-04-14","2016-04-15","2016-04-16","2016-04-17","2016-04-18","2016-04-19","2016-04-20","2016-04-21","2016-04-22","2016-04-23","2016-04-24","2016-04-25","2016-04-26","2016-04-27","2016-04-28","2016-04-29","2016-04-30"]
[{"$f":"INDEX(ColA,MIN(IF((MONTH(Debut)=MONTH(1&$N$2))+(MONTH(Fin)=MONTH(1&$N$2)),IF(COUNTIF(A$5:A5,Noms)=0,ROW(Noms)))))&\"\"","v":"Dupont 1"},{"$f":"SUMPRODUCT((Noms=$A6)*(B$4>=Debut)*(B$4<=Fin))","v":0},{"$f":"SUMPRODUCT((Noms=$A6)*(C$4>=Debut)*(C$4<=Fin))","v":0},0,0,0,0,0,0,0,0,0,0,0,0,0,0,0,{"$f":"SUMPRODUCT((Noms=$A6)*(S$4>=Debut)*(S$4<=Fin))","v":0},0,0,0,0,0,0,0,0,0,0,0,0,0,0,0,{"$f":"SUMPRODUCT((Noms=$A6)*(AI$4>=Debut)*(AI$4<=Fin))","v":0},0,0,0,0,0,0,0,0,0,0,0,0,0,0,0,0,0,0,0,0,0,0,0,0,0]
[{"$f":"INDEX(ColA,MIN(IF((MONTH(Debut)=MONTH(1&$N$2))+(MONTH(Fin)=MONTH(1&$N$2)),IF(COUNTIF(A$5:A6,Noms)=0,ROW(Noms)))))&\"\"","v":"Dupont 3"},{"$f":"SUMPRODUCT((Noms=$A7)*(B$4>=Debut)*(B$4<=Fin))","v":0},0,0,0,0,0,0,0,0,0,0,0,0,0,0,0,0,0,0,0,0,0,0,0,0,0,0,0,0,0,0,0,0,0,0,0,0,0,0,0,0,0,0,0,0,0,0,0,0,0,0,0,0,0,0,0,0,0,0]
[{"$f":"INDEX(ColA,MIN(IF((MONTH(Debut)=MONTH(1&$N$2))+(MONTH(Fin)=MONTH(1&$N$2)),IF(COUNTIF(A$5:A7,Noms)=0,ROW(Noms)))))&\"\"","v":"Dupont 5"},{"$f":"SUMPRODUCT((Noms=$A8)*(B$4>=Debut)*(B$4<=Fin))","v":0},0,0,0,0,0,0,0,0,0,0,0,0,0,0,0,0,0,0,0,0,0,0,0,0,0,0,0,0,0,0,0,0,0,0,0,0,0,0,0,0,0,0,0,0,0,0,0,0,0,0,0,0,0,0,0,0,0,0]
[{"$f":"INDEX(ColA,MIN(IF((MONTH(Debut)=MONTH(1&$N$2))+(MONTH(Fin)=MONTH(1&$N$2)),IF(COUNTIF(A$5:A8,Noms)=0,ROW(Noms)))))&\"\"","v":"Dupont 4"},0,0,0,0,0,0,0,0,0,0,0,0,0,0,0,0,0,0,0,0,0,0,0,0,0,0,0,0,0,0,0,0,0,0,0,0,0,0,0,0,0,0,0,0,0,0,0,0,0,0,0,0,0,0,0,0,0,0,0]
[{"$f":"INDEX(ColA,MIN(IF((MONTH(Debut)=MONTH(1&$N$2))+(MONTH(Fin)=MONTH(1&$N$2)),IF(COUNTIF(A$5:A9,Noms)=0,ROW(Noms)))))&\"\"","v":"Dupont 6"},0,0,0,0,0,0,0,0,0,0,0,0,0,0,0,0,0,0,0,0,0,0,0,0,0,0,0,0,0,0,0,0,0,0,0,0,0,0,0,0,0,0,0,0,0,0,0,0,0,0,0,0,0,0,0,0,0,0,0]
[{"$f":"INDEX(ColA,MIN(IF((MONTH(Debut)=MONTH(1&$N$2))+(MONTH(Fin)=MONTH(1&$N$2)),IF(COUNTIF(A$5:A10,Noms)=0,ROW(Noms)))))&\"\"","v":"Dupont 2"},0,0,0,0,0,0,0,0,0,0,0,0,0,0,0,0,0,0,0,0,0,0,0,0,0,0,0,0,0,0,0,0,0,0,0,0,0,0,0,0,0,0,0,0,0,0,0,0,0,0,0,0,0,0,0,0,0,0,0]
[{"$f":"INDEX(ColA,MIN(IF((MONTH(Debut)=MONTH(1&$N$2))+(MONTH(Fin)=MONTH(1&$N$2)),IF(COUNTIF(A$5:A11,Noms)=0,ROW(Noms)))))&\"\"","v":"Dupont 8"},0,0,0,0,0,0,0,0,0,0,0,0,0,0,0,0,0,0,0,0,0,0,0,0,0,0,0,0,0,0,0,0,0,0,0,0,0,0,0,0,0,0,0,0,0,0,0,0,0,0,0,0,0,0,0,0,0,0,0]
[{"$f":"INDEX(ColA,MIN(IF((MONTH(Debut)=MONTH(1&$N$2))+(MONTH(Fin)=MONTH(1&$N$2)),IF(COUNTIF(A$5:A12,Noms)=0,ROW(Noms)))))&\"\"","v":"Dupont 9"},0,0,0,0,0,0,0,0,0,0,0,0,0,0,0,0,0,0,0,0,0,0,0,0,0,0,0,0,0,0,0,0,0,0,0,0,0,0,0,0,0,0,0,0,0,0,0,0,0,0,0,0,0,0,0,0,0,0,0]
[{"$f":"INDEX(ColA,MIN(IF((MONTH(Debut)=MONTH(1&$N$2))+(MONTH(Fin)=MONTH(1&$N$2)),IF(COUNTIF(A$5:A13,Noms)=0,ROW(Noms)))))&\"\"","v":""},0,0,0,0,0,0,0,0,0,0,0,0,0,0,0,0,0,0,0,0,0,0,0,0,0,0,0,0,0,0,0,0,0,0,0,0,0,0,0,0,0,0,0,0,0,0,0,0,0,0,0,0,0,0,0,0,0,0,0]
[{"$f":"INDEX(ColA,MIN(IF((MONTH(Debut)=MONTH(1&$N$2))+(MONTH(Fin)=MONTH(1&$N$2)),IF(COUNTIF(A$5:A14,Noms)=0,ROW(Noms)))))&\"\"","v":""},0,0,0,0,0,0,0,0,0,0,0,0,0,0,0,0,0,0,0,0,0,0,0,0,0,0,0,0,0,0,0,0,0,0,0,0,0,0,0,0,0,0,0,0,0,0,0,0,0,0,0,0,0,0,{"$f":"SUMPRODUCT((Noms=$A15)*(BD$4>=Debut)*(BD$4<=Fin))","v":0},0,0,0,0]
[{"$f":"INDEX(ColA,MIN(IF((MONTH(Debut)=MONTH(1&$N$2))+(MONTH(Fin)=MONTH(1&$N$2)),IF(COUNTIF(A$5:A15,Noms)=0,ROW(Noms)))))&\"\"","v":""},0,0,0,0,0,0,0,0,0,0,0,0,0,0,0,0,0,0,0,0,0,0,0,0,0,0,0,0,0,0,0,0,0,{"$f":"SUMPRODUCT((Noms=$A16)*(AI$4>=Debut)*(AI$4<=Fin))","v":0},0,0,0,0,0,0,0,0,0,0,0,0,0,0,0,0,0,0,0,0,0,0,0,0,0]
[{"$f":"INDEX(ColA,MIN(IF((MONTH(Debut)=MONTH(1&$N$2))+(MONTH(Fin)=MONTH(1&$N$2)),IF(COUNTIF(A$5:A16,Noms)=0,ROW(Noms)))))&\"\"","v":""},0,0,0,0,0,0,0,0,0,0,0,0,0,0,0,0,0,0,0,0,0,0,0,0,0,0,0,0,0,0,0,0,0,0,0,0,0,0,0,0,0,0,0,0,0,0,0,0,0,0,0,0,0,0,0,0,0,0,0]
[{"$f":"INDEX(ColA,MIN(IF((MONTH(Debut)=MONTH(1&$N$2))+(MONTH(Fin)=MONTH(1&$N$2)),IF(COUNTIF(A$5:A17,Noms)=0,ROW(Noms)))))&\"\"","v":""},0,0,0,0,0,0,0,0,0,0,0,0,0,0,0,0,0,0,0,0,0,0,0,0,0,0,0,0,0,0,0,0,0,0,0,0,0,0,0,0,0,0,0,0,0,0,0,0,0,0,0,0,0,0,0,0,0,0,0]
[{"$f":"INDEX(ColA,MIN(IF((MONTH(Debut)=MONTH(1&$N$2))+(MONTH(Fin)=MONTH(1&$N$2)),IF(COUNTIF(A$5:A18,Noms)=0,ROW(Noms)))))&\"\"","v":""},0,0,0,0,0,0,0,0,0,0,0,0,0,0,0,0,0,0,0,0,0,0,0,0,0,0,0,0,0,0,0,0,0,0,0,0,0,0,0,0,0,0,0,0,0,0,0,0,0,0,0,0,0,0,0,0,0,0,0]
[{"$f":"INDEX(ColA,MIN(IF((MONTH(Debut)=MONTH(1&$N$2))+(MONTH(Fin)=MONTH(1&$N$2)),IF(COUNTIF(A$5:A19,Noms)=0,ROW(Noms)))))&\"\"","v":""},0,0,0,0,0,0,0,0,0,0,0,0,0,0,0,0,0,0,0,0,0,0,0,0,0,0,0,0,0,0,0,0,0,0,0,0,0,0,0,0,0,0,0,0,0,0,0,0,0,0,0,0,0,0,0,0,0,0,0]
[{"$f":"INDEX(ColA,MIN(IF((MONTH(Debut)=MONTH(1&$N$2))+(MONTH(Fin)=MONTH(1&$N$2)),IF(COUNTIF(A$5:A20,Noms)=0,ROW(Noms)))))&\"\"","v":""},0,0,0,0,0,0,0,0,0,0,0,0,0,0,0,0,0,0,0,0,0,0,0,0,0,0,0,0,0,0,0,0,{"$f":"SUMPRODUCT((Noms=$A21)*(AH$4>=Debut)*(AH$4<=Fin))","v":0},0,0,0,0,0,0,0,0,0,0,0,0,0,0,0,0,0,0,0,0,0,0,0,0,0,0]
[{"$f":"INDEX(ColA,MIN(IF((MONTH(Debut)=MONTH(1&$N$2))+(MONTH(Fin)=MONTH(1&$N$2)),IF(COUNTIF(A$5:A21,Noms)=0,ROW(Noms)))))&\"\"","v":""},0,0,0,0,0,0,0,0,0,0,0,0,0,0,0,0,0,{"$f":"SUMPRODUCT((Noms=$A22)*(S$4>=Debut)*(S$4<=Fin))","v":0},0,0,0,0,0,0,0,0,0,0,0,0,0,0,0,0,0,0,0,0,0,0,0,0,0,0,0,0,0,0,0,0,0,0,0,0,0,0,0,0,0]
[{"$f":"INDEX(ColA,MIN(IF((MONTH(Debut)=MONTH(1&$N$2))+(MONTH(Fin)=MONTH(1&$N$2)),IF(COUNTIF(A$5:A22,Noms)=0,ROW(Noms)))))&\"\"","v":""},0,0,0,0,0,0,0,0,0,0,0,0,0,0,0,0,0,0,0,0,0,0,0,0,0,0,0,0,0,0,0,0,0,0,0,0,0,0,0,0,0,0,0,0,0,0,0,0,0,0,0,0,0,0,0,0,0,0,0]
[{"$f":"INDEX(ColA,MIN(IF((MONTH(Debut)=MONTH(1&$N$2))+(MONTH(Fin)=MONTH(1&$N$2)),IF(COUNTIF(A$5:A23,Noms)=0,ROW(Noms)))))&\"\"","v":""},0,0,0,0,0,0,0,0,0,0,0,0,0,0,0,0,0,0,0,0,0,0,0,0,0,0,0,0,0,0,0,0,0,0,0,0,0,0,0,0,0,0,0,0,0,0,0,0,0,0,0,0,0,0,0,0,0,0,0]
[{"$f":"INDEX(ColA,MIN(IF((MONTH(Debut)=MONTH(1&$N$2))+(MONTH(Fin)=MONTH(1&$N$2)),IF(COUNTIF(A$5:A24,Noms)=0,ROW(Noms)))))&\"\"","v":""},0,0,0,0,0,0,0,0,0,0,0,0,0,0,0,0,0,0,0,0,0,0,0,0,0,0,0,0,0,0,0,0,0,0,0,0,0,0,0,0,0,0,0,0,0,0,0,0,0,0,0,0,0,0,0,0,0,0,0]
[{"$f":"INDEX(ColA,MIN(IF((MONTH(Debut)=MONTH(1&$N$2))+(MONTH(Fin)=MONTH(1&$N$2)),IF(COUNTIF(A$5:A25,Noms)=0,ROW(Noms)))))&\"\"","v":""},0,0,0,0,0,0,0,0,0,0,0,0,0,0,0,0,0,0,0,0,0,0,0,0,0,0,0,0,0,0,0,0,0,0,0,0,0,0,0,0,0,0,0,0,0,0,0,0,0,0,0,0,0,0,0,0,0,0,0]
[{"$f":"INDEX(ColA,MIN(IF((MONTH(Debut)=MONTH(1&$N$2))+(MONTH(Fin)=MONTH(1&$N$2)),IF(COUNTIF(A$5:A26,Noms)=0,ROW(Noms)))))&\"\"","v":""},0,0,0,0,0,0,0,0,0,0,0,0,0,0,0,0,0,0,0,0,0,0,0,0,0,0,0,0,0,0,0,0,0,0,0,0,0,0,0,0,0,0,0,0,0,0,0,0,0,0,0,0,0,0,0,0,0,0,0]
[{"$f":"INDEX(ColA,MIN(IF((MONTH(Debut)=MONTH(1&$N$2))+(MONTH(Fin)=MONTH(1&$N$2)),IF(COUNTIF(A$5:A27,Noms)=0,ROW(Noms)))))&\"\"","v":""},0,0,0,0,0,0,0,0,0,0,0,0,0,0,0,0,0,0,0,0,0,0,0,0,0,0,0,0,0,0,0,0,0,0,0,0,0,0,0,0,0,0,0,0,0,0,0,0,0,0,0,0,0,0,0,0,0,0,0]
[{"$f":"INDEX(ColA,MIN(IF((MONTH(Debut)=MONTH(1&$N$2))+(MONTH(Fin)=MONTH(1&$N$2)),IF(COUNTIF(A$5:A28,Noms)=0,ROW(Noms)))))&\"\"","v":""},0,0,0,0,0,0,0,0,0,0,0,0,0,0,0,0,0,0,0,0,0,0,0,0,0,0,0,0,0,0,0,0,0,0,0,0,0,0,0,0,0,0,0,0,0,0,0,0,0,0,0,0,0,0,0,0,0,0,0]

{"sheet":"Saisie","index":2,"n_rows":17,"n_cols":7,"rows_kept":17,"cut":false,"hidden":false,"merged":[]}
[]
["Noms","Debut","Fin","Motif","Demi-journée","Suppression","durée"]
["Dupont 1","2017-01-09","2017-01-09","CONGES",null,null,{"$f":"IF(F3,0,(C3-B3+1)/IF(E3,2,1))","v":1}]
["Dupont 3","2017-01-06","2017-01-09","CONGES",false,null,{"$f":"IF(F4,0,(C4-B4+1)/IF(E4,2,1))","v":4}]
["Dupont 5","2017-01-12","2017-01-14","MALADIE",null,null,3]
["Dupont 4","2017-01-10","2017-01-10","CONGES",true,null,0.5]
["Dupont 6","2017-01-07","2017-01-22","CONGES",false,null,16]
["Dupont 2","2017-01-07","2017-01-07","RECUP",true,null,0.5]
["Dupont 1","2017-01-23","2017-01-25","FORMATION",false,null,3]
["Dupont 3","2017-01-30","2017-01-31","CONGES",false,null,2]
["Dupont 8","2017-01-25","2017-01-26","CONGES",false,null,2]
["Dupont 8","2017-01-09","2017-01-09","RECUP",true,null,0.5]
["Dupont 1","2017-01-02","2017-01-02","CONGES",false,null,1]
["Dupont 9","2017-01-18","2017-01-18","RECUP",true,true,0]
["Dupont 9","2017-01-09","2017-01-09","RECUP",true,true,0]
["Dupont 8","2017-07-03","2017-07-30","CONGES",false,null,28]
["Dupont 4","2017-07-03","2017-07-09","FORMATION",false,null,7]

{"sheet":"Listes","index":3,"n_rows":29,"n_cols":17,"rows_kept":29,"cut":false,"hidden":false,"merged":[[0,4,0,5]]}
["Noms",null,"Mois",null,"FERIES",null,null,null,"Années",null,"Motif",null,null,null,null,null,"http://forum.excel-pratique.com/excel/planning-de-conges-t34687.html"]
["Dupont 1",null,"Janvier",null,{"$f":"DATE(An,1,1)","v":"2017-01-01"},"Premier de l'an",null,null,2016,null,"CONGES","Zones nommées"]
["Dupont 2",null,"Février",null,{"$f":"DATE(An,3,29.56+0.979*MOD(204-11*MOD(An,19),30)-WEEKDAY(DATE(An,3,28.56+0.979*MOD(204-11*MOD(An,19),30))))","v":"2017-04-16"},"Pâques",null,null,2017,null,"RECUP","An","=Planning!$A$1"]
["Dupont 3",null,"Mars",null,{"$f":"E3+1","v":"2017-04-17"},"Lundi de Pâques",null,null,2018,null,"MALADIE","Années",{"$f":"Listes!$I$2:$I$14","v":2018}]
["Dupont 4",null,"Avril",null,{"$f":"E3+39","v":"2017-05-25"},"Ascension",null,null,2019,null,"FORMATION","ColA","=Saisie!$A:$A"]
["Dupont 5",null,"Mai",null,{"$f":"E3+49","v":"2017-06-04"},"Pentecôte",null,null,2020,null,null,"Debut","=DECALER(Saisie!$B$3;;;NBVAL(Saisie!$B:$B)-1)"]
["Dupont 6",null,"Juin",null,{"$f":"DATE(An,7,14)","v":"2017-07-14"},"Fête nat.",null,null,2021,null,null,"Ferie","=DECALER(Listes!$E$2;;;NBVAL(Listes!$E:$E)-1)"]
["Dupont 7",null,"Juillet",null,{"$f":"DATE(An,8,15)","v":"2017-08-15"},"Assomption",null,null,2022,null,null,"Fin","=DECALER(Saisie!$C$3;;;NBVAL(Saisie!$C:$C)-1)"]
["Dupont 8",null,"Août",null,{"$f":"DATE(An,11,1)","v":"2017-11-01"},"Toussaint",null,null,2023,null,null,"Mois","=Listes!$C$2:$C$13"]
["Dupont 9",null,"Septembre",null,{"$f":"DATE(An,11,11)","v":"2017-11-11"},"Armistice",null,null,2024,null,null,"Nom","=DECALER(Listes!$A$2;;;NBVAL(Listes!$A:$A)-1)"]
["Dupont 10",null,"Octobre",null,{"$f":"DATE(An+1,1,1)","v":"2018-01-01"},"Premier de l'an",null,null,2025,null,null,"Noms","=DECALER(Saisie!$A$3;;;NBVAL(Saisie!$A:$A)-1)"]
["Dupont 11",null,"Novembre",null,{"$f":"DATE(An+1,3,29.56+0.979*MOD(204-11*MOD(An+1,19),30)-WEEKDAY(DATE(An+1,3,28.56+0.979*MOD(204-11*MOD(An+1,19),30))))","v":"2018-04-01"},"Pâques",null,null,2026]
["Dupont 12",null,"Décembre",null,{"$f":"E12+1","v":"2018-04-02"},"Lundi de Pâques",null,null,2027]
["Dupont 13",null,null,null,{"$f":"E12+39","v":"2018-05-10"},"Ascension",null,null,2028]
["Dupont 14",null,null,null,{"$f":"E12+49","v":"2018-05-20"},"Pentecôte"]
["Dupont 15",null,null,null,{"$f":"DATE(An+1,7,14)","v":"2018-07-14"},"Fête nat."]
["Dupont 16",null,null,null,{"$f":"DATE(An+1,8,15)","v":"2018-08-15"},"Assomption"]
["Dupont 17",null,null,null,{"$f":"DATE(An+1,11,1)","v":"2018-11-01"},"Toussaint"]
["Dupont 18",null,null,null,{"$f":"DATE(An+1,11,11)","v":"2018-11-11"},"Armistice"]
["Dupont 19"]
["Dupont 20"]
["Dupont 21"]
["Dupont 22"]
["Dupont 23"]
["Dupont 24"]
["Dupont 25"]
["Dupont 26"]
["Dupont 27"]
["Dupont 28"]

{"sheet":"Stats","index":4,"n_rows":13,"n_cols":13,"rows_kept":13,"cut":false,"hidden":false,"merged":[]}
[]
[]
[" Durée","Motifs",null,null,null,null,null," Durée","Motifs"]
["Noms","CONGES","FORMATION","MALADIE","RECUP","Total général",null,"Dates","CONGES","FORMATION","MALADIE","RECUP","Total général"]
["Dupont 1",2,3,null,null,5,null,"2017"]
["Dupont 2",null,null,null,0.5,0.5,null,"janv",26.5,3,3,1,33.5]
["Dupont 3",6,null,null,null,6,null,"juil",28,7,null,null,35]
["Dupont 4",0.5,7,null,null,7.5,null,"Total général",54.5,10,3,1,68.5]
["Dupont 5",null,null,3,null,3]
["Dupont 6",16,null,null,null,16]
["Dupont 8",30,null,null,0.5,30.5]
["Dupont 9",null,null,null,0,0]
["Total général",54.5,10,3,1,68.5]