{"text_format":"1","workbook":"xlsx","n_sheets":4,"sheets":["Données","Planning Lundi","Planning Dimanche","Feuil1"],"not_rendered":{"charts":0,"images":0,"macros":1,"external_links":0,"defined_names":3,"comments":0,"pivot_tables":0},"unopened":[],"bounds":{"document_bytes":16777216,"sheet_cells":100000,"rows_first":2000,"rows_last":500,"rows_between":2000,"halvings":0,"cell_chars":16384,"cell_head_chars":4096},"cells_cut":0,"cells_raw":0,"read":"whole","date_system":"1900"}

{"sheet":"Données","index":0,"n_rows":185,"n_cols":16,"rows_kept":185,"cut":false,"hidden":false,"merged":[]}
["Planning","N°cde","Tps de fab","HT","clients","Nbs cellule","Concatener","Conversion","Fait","Colonne3",null,null,1,"heures",4,"cellules"]
["020000","Maintenance",2,null," machine",{"$f":"ROUNDDOWN(H2,0)","v":8},{"$f":"CONCATENATE(B2, E2)","v":"Maintenance machine"},{"$f":"SUM(C2*$O$1/$M$1)","v":8},"x"]
["020101",1611670,1.1599999999999999,null," Aa",{"$f":"ROUNDDOWN(H3,0)","v":4},"1611670 Aa",4.6399999999999997,"x"]
["020102",1612613,3,null," D",12,"1612613 D",12,"x"]
["020103",1612612,3.27,null," E",13,"1612612 E",13.08]
["020104",1612614,1.55,null," S",6,"1612614 S",6.2]
["020105",1612528,6.04,null," P",24,"1612528 P",24.16]
["020106",1612529,3.09,null," A",12,"1612529 A",12.36]
["020107",1612516,1.62,null," Z",6,"1612516 Z",6.48]
["020108",1612577,3.78,null," P",15,"1612577 P",15.12]
["020109",1612469,5.38,null," L",21,"1612469 L",21.52]
["020110",1612479,18.38,null," B",73,"1612479 B",73.52]
["020111",1612462,0.25,null," C",1,"1612462 C",1]
["020112",1612445,15.63,null," F",62,"1612445 F",62.52]
["020113",1612429,10,null," G",40,"1612429 G",40]
["020114",1612412,16.25,null," H",65,"1612412 H",65]
["020115",1612395,3.27,null," I",13,"1612395 I",13.08]
["020116",1612378,5,null," J",20,"1612378 J",20]
["020117",1612361,7,null," K",28,"1612361 K",28]
["020118",1612344,8.5399999999999991,null," L",34,"1612344 L",34.159999999999997]
["020119",1612327,0.25,null," M",1,"1612327 M",1]
["020120",1612310,8,null," N",32,"1612310 N",32]
["020121",1612293,7.53,null," O",30,"1612293 O",30.12]
["020122",1612277,6.02,null," Q",24,"1612277 Q",24.08]
["020123",1612259,5.2033333333333296,null," R",20,"1612259 R",20.813333333333318]
["020124",1612242,4.2133333333333303,null," S",16,"1612242 S",16.853333333333321]
["020125",1612225,3.2233333333333301,null," T",12,"1612225 T",12.89333333333332]
["020126",1612208,2.2333333333333298,null," U",8,"1612208 U",8.9333333333333194]
["020127",1612191,1.2433333333333301,null," V",4,"1612191 V",4.9733333333333203]
["020128",1612174,0.25333333333333402,null," W",1,"1612174 W",1.0133333333333361]
[null,null,null,null,null,null,null,{"$f":"IFERROR(IF(INDEX(F:F,MATCH(H30,G:G,0))>COUNTIF($H$16:H30,H30),H30,INDEX(G:G,MATCH(H30,G:G,0)+1)),\"\")","v":""}]
[]
[]
[]
[]
[]
[]
[]
[]
[]
[]
[]
[]
[]
[]
[]
[]
[]
[]
[]
[]
[]
[]
[]
[]
[]
[]
[]
[]
[]
[]
[]
[]
[]
[]
[]
[]
[]
[]
[]
[]
[]
[]
[]
[]
[]
[]
[]
[]
[]
[]
[]
[]
[]
[]
[]
[]
[]
[]
[]
[]
[]
[]
[]
[]
[]
[]
[]
[]
[]
[]
[]
[]
[]
[]
[]
[]
[]
[]
[]
[]
[]
[]
[]
[]
[]
[]
[]
[]
[]
[]
[]
[]
[]
[]
[]
[]
[]
[]
[]
[]
[]
[]
[]
[]
[]
[]
[]
[]
[]
[]
[]
[]
[]
[]
[]
[]
[]
[]
[]
[]
[]
[]
[]
[]
[]
[]
[]
[]
[]
[]
[]
[]
[]
[]
[]
[]
[]
[]
[]
[]
[]
[]
[]
[]
[]
[]
[]
[]
[null,null,null,null,null,null,null,{"$f":"IFERROR(IF(INDEX(F:F,MATCH(H179,G:G,0))>COUNTIF($H$16:H179,H179),H179,INDEX(G:G,MATCH(H179,G:G,0)+1)),\"\")","v":""}]
[null,null,null,null,null,null,null,{"$f":"IFERROR(IF(INDEX(F:F,MATCH(H180,G:G,0))>COUNTIF($H$16:H180,H180),H180,INDEX(G:G,MATCH(H180,G:G,0)+1)),\"\")","v":""}]
[null,null,null,null,null,null,null,{"$f":"IFERROR(IF(INDEX(F:F,MATCH(H181,G:G,0))>COUNTIF($H$16:H181,H181),H181,INDEX(G:G,MATCH(H181,G:G,0)+1)),\"\")","v":""}]
[null,null,null,null,null,null,null,{"$f":"IFERROR(IF(INDEX(F:F,MATCH(H182,G:G,0))>COUNTIF($H$16:H182,H182),H182,INDEX(G:G,MATCH(H182,G:G,0)+1)),\"\")","v":""}]
[null,null,null,null,null,null,null,{"$f":"IFERROR(IF(INDEX(F:F,MATCH(H183,G:G,0))>COUNTIF($H$16:H183,H183),H183,INDEX(G:G,MATCH(H183,G:G,0)+1)),\"\")","v":""}]
[null,null,null,null,null,null,null,{"$f":"IFERROR(IF(INDEX(F:F,MATCH(H184,G:G,0))>COUNTIF($H$16:H184,H184),H184,INDEX(G:G,MATCH(H184,G:G,0)+1)),\"\")","v":""}]

{"sheet":"Planning Lundi","index":1,"n_rows":478,"n_cols":14,"rows_kept":478,"cut":false,"hidden":false,"merged":[[46,0,49,1],[42,0,45,1],[38,0,41,1],[94,0,97,1],[90,0,93,1],[86,0,89,1],[82,0,85,1],[78,0,81,1],[74,0,77,1],[70,0,73,1],[66,0,69,1],[62,0,65,1],[58,0,61,1],[54,0,57,1],[50,0,53,1],[1,0,1,1],[2,0,5,1],[34,0,37,1],[30,0,33,1],[26,0,29,1],[22,0,25,1],[18,0,21,1],[14,0,17,1],[10,0,13,1],[6,0,9,1],[59,2,64,2],[65,2,88,2],[89,2,97,2],[2,3,4,3],[5,3,10,3],[11,3,25,3],[26,3,46,3],[47,3,97,3],[2,2,21,2],[22,2,29,2],[30,2,33,2],[34,2,45,2],[46,2,58,2],[2,4,23,4],[25,4,86,4],[87,4,97,4],[2,5,30,5],[31,5,95,5],[96,5,97,5],[2,7,31,7],[32,7,49,7],[50,7,97,7],[2,8,97,8],[2,6,12,6],[13,6,32,6],[33,6,60,6],[61,6,94,6],[96,6,97,6]]}
["S",1,"Lundi","Mardi","Mercredi","Jeudi","Vendredi","Samedi","Dimanche",null,null,null,null,{"$f":"Données!#REF!","v":{"$error":"#REF!"}}]
[2017,null,"2016-01-02",{"$f":"C2+1","v":"2016-01-03"},{"$f":"C2+2","v":"2016-01-04"},{"$f":"C2+3","v":"2016-01-05"},{"$f":"C2+4","v":"2016-01-06"},{"$f":"C2+5","v":"2016-01-07"},{"$f":"C2+6","v":"2016-01-08"},null,null,null,null,{"$f":"IFERROR(IF(INDEX(Données!Q:Q,MATCH(N1,Données!R:R,0))>COUNTIF($C1:N$3,N1),N1,INDEX(Données!R:R,MATCH(N1,Données!R:R,0)+1)),\"\")","v":"Maintenance machine"}]
["Minuit",null," ","1612529 A","1612479 B","1612429 G","1612395 I","1612310 N"," "]
[]
[]
[null,null,null,"1612516 Z"]
["1h"]
[]
[]
[]
["2h"]
[null,null,null,"1612577 P"]
[]
[null,null,null,null,null,null,"1612378 J"]
["3h"]
[]
[]
[]
["4h"]
[]
[]
[]
["5h",null,"Maintenance machine"]
[]
[null,null,null,null,"1612462 C"]
[null,null,null,null,"1612445 F"]
["6h",null,null,"1612469 L"]
[]
[]
[]
["7h",null,"1611670 A"]
[null,null,null,null,null,"1612412 H"]
[null,null,null,null,null,null,null,"1612293 O"]
[null,null,null,null,null,null,"1612361 K"]
["8h",null,"1612613 D"]
[]
[]
[]
["9h"]
[]
[]
[]
["10h"]
[]
[]
[]
["11h",null,"1612612 E"]
[null,null,null,"1612479 B"]
[]
[]
["12h",null,null,null,null,null,null," "]
[]
[]
[]
["13h"]
[]
[]
[]
["14h"]
[null,null,"1612614 S"]
[]
[null,null,null,null,null,null,"1612344 L"]
["15h"]
[]
[]
[null,null,"1612528 P"]
["16h"]
[]
[]
[]
["17h"]
[]
[]
[]
["18h"]
[]
[]
[]
["19h"]
[]
[]
[]
["20h"]
[]
[]
[]
["21h"]
[null,null,null,null,"1612429 G"]
[]
[null,null,"1612529 A"]
["22h"]
[]
[]
[]
["23h"]
[null,null,null,null,null,null,"1612327 M"]
[null,null,null,null,null,"1612395 I","1612310 N"]
[]
[]
[]
[]
[]
[]
[]
[]
[]
[]
[]
[]
[]
[]
[]
[]
[]
[]
[]
[]
[]
[]
[]
[]
[]
[]
[]
[]
[]
[]
[]
[]
[]
[]
[]
[]
[]
[]
[]
[]
[]
[]
[]
[]
[]
[]
[]
[]
[]
[]
[]
[]
[]
[]
[]
[]
[]
[]
[]
[]
[]
[]
[]
[]
[]
[]
[]
[]
[]
[]
[]
[]
[]
[]
[]
[]
[]
[]
[]
[]
[]
[]
[]
[]
[]
[]
[]
[]
[]
[]
[]
[]
[]
[]
[]
[]
[]
[]
[]
[]
[]
[]
[]
[]
[]
[]
[]
[]
[]
[]
[]
[]
[]
[]
[]
[]
[]
[]
[]
[]
[]
[]
[]
[]
[]
[]
[]
[]
[]
[]
[]
[]
[]
[]
[]
[]
[]
[]
[]
[]
[]
[]
[]
[]
[]
[]
[]
[]
[]
[]
[]
[]
[]
[]
[]
[]
[]
[]
[]
[]
[]
[]
[]
[]
[]
[]
[]
[]
[]
[]
[]
[]
[]
[]
[]
[]
[]
[]
[]
[]
[]
[]
[]
[]
[]
[]
[]
[]
[]
[]
[]
[]
[]
[]
[]
[]
[]
[]
[]
[]
[]
[]
[]
[]
[]
[]
[]
[]
[]
[]
[]
[]
[]
[]
[]
[]
[]
[]
[]
[]
[]
[]
[]
[]
[]
[]
[]
[]
[]
[]
[]
[]
[]
[]
[]
[]
[]
[]
[]
[]
[]
[]
[]
[]
[]
[]
[]
[]
[]
[]
[]
[]
[]
[]
[]
[]
[]
[]
[]
[null,null,null,null,null,null,null,""]
[null,null,null,null,null,null,null,""]
[null,null,null,null,null,null,null,""]
[null,null,null,null,null,null,null,""]
[null,null,null,null,null,null,null,""]
[null,null,null,null,null,null,null,""]
[null,null,null,null,null,null,null,""]
[null,null,null,null,null,null,null,""]
[null,null,null,null,null,null,null,""]
[null,null,null,null,null,null,null,""]
[null,null,null,null,null,null,null,""]
[null,null,null,null,null,null,null,""]
[null,null,null,null,null,null,null,""]
[null,null,null,null,null,null,null,""]
[null,null,null,null,null,null,null,""]
[null,null,null,null,null,null,null,""]
[null,null,null,null,null,null,null,""]
[null,null,null,null,null,null,null,""]
[null,null,null,null,null,null,null,""]
[null,null,null,null,null,null,null,""]
[null,null,null,null,null,null,null,""]
[null,null,null,null,null,null,null,""]
[null,null,null,null,null,null,null,""]
[null,null,null,null,null,null,null,""]
[null,null,null,null,null,null,null,""]
[null,null,null,null,null,null,null,""]
[null,null,null,null,null,null,null,""]
[null,null,null,null,null,null,null,""]
[null,null,null,null,null,null,null,""]
[null,null,null,null,null,null,null,""]
[null,null,null,null,null,null,null,""]
[null,null,null,null,null,null,null,""]
[null,null,null,null,null,null,null,""]
[null,null,null,null,null,null,null,""]
[null,null,null,null,null,null,null,""]
[null,null,null,null,null,null,null,""]
[null,null,null,null,null,null,null,""]
[null,null,null,null,null,null,null,""]
[null,null,null,null,null,null,null,""]
[null,null,null,null,null,null,null,""]
[null,null,null,null,null,null,null,""]
[null,null,null,null,null,null,null,""]
[null,null,null,null,null,null,null,""]
[null,null,null,null,null,null,null,""]
{"$rows_left_out":79}
{"sheet":"Planning Dimanche","index":2,"n_rows":311,"n_cols":14,"rows_kept":311,"cut":false,"hidden":false,"merged":[[18,0,21,1],[1,0,1,1],[2,0,5,1],[6,0,9,1],[10,0,13,1],[14,0,17,1],[66,0,69,1],[22,0,25,1],[26,0,29,1],[30,0,33,1],[34,0,37,1],[38,0,41,1],[42,0,45,1],[46,0,49,1],[50,0,53,1],[54,0,57,1],[58,0,61,1],[62,0,65,1],[94,0,97,1],[70,0,73,1],[74,0,77,1],[78,0,81,1],[82,0,85,1],[86,0,89,1],[90,0,93,1]]}
["S",1,"Dimanche","Lundi","Mardi","Mercredi","Jeudi","Vendredi","Samedi",null,null,null,null,{"$f":"Données!#REF!","v":{"$error":"#REF!"}}]
[2017,null,"2017-03-05",{"$f":"C2+1","v":"2017-03-06"},{"$f":"C2+2","v":"2017-03-07"},{"$f":"C2+3","v":"2017-03-08"},{"$f":"C2+4","v":"2017-03-09"},{"$f":"C2+5","v":"2017-03-10"},{"$f":"C2+6","v":"2017-03-11"},null,null,null,null,{"$f":"IFERROR(IF(INDEX(Données!Q:Q,MATCH(N1,Données!R:R,0))>COUNTIF($C1:N$3,N1),N1,INDEX(Données!R:R,MATCH(N1,Données!R:R,0)+1)),\"\")","v":"Maintenance machine"}]
["Minuit",null,null,null,null,null,null,null,""]
[null,null,null,null,null,null,null,null,""]
[null,null,null,null,null,null,null,null,""]
[null,null,null,null,null,null,null,null,""]
["1h",null,null,null,null,null,null,null,""]
[null,null,null,null,null,null,null,null,""]
[null,null,null,null,null,null,null,null,""]
[null,null,null,null,null,null,null,null,""]
["2h",null,null,null,null,null,null,null,""]
[null,null,null,null,null,null,null,null,""]
[null,null,null,null,null,null,null,null,""]
[null,null,null,null,null,null,null,null,""]
["3h",null,null,null,null,null,null,null,""]
[null,null,null,null,null,null,null,null,""]
[null,null,null,null,null,null,null,null,""]
[null,null,null,null,null,null,null,null,""]
["4h",null,null,null,null,null,null,null,""]
[null,null,null,null,null,null,null,null,""]
[null,null,null,null,null,null,null,null,""]
[null,null,null,null,null,null,null,null,""]
["5h",null,null,null,null,null,null,null,""]
[null,null,null,null,null,null,null,null,""]
[null,null,null,null,null,null,null,null,""]
[null,null,null,null,null,null,null,null,""]
["6h",null,null,null,null,null,null,null,""]
[null,null,null,null,null,null,null,null,""]
[null,null,null,null,null,null,null,null,""]
[null,null,null,null,null,null,null,null,""]
["7h",null,null,null,null,null,null,null,""]
[null,null,null,null,null,null,null,null,""]
[null,null,null,null,null,null,null,null,""]
[null,null,null,null,null,null,null,null,""]
["8h",null,null,null,null,null,null,null,""]
[null,null,null,null,null,null,null,null,""]
[null,null,null,null,null,null,null,null,""]
[null,null,null,null,null,null,null,null,""]
["9h",null,null,null,null,null,null,null,""]
[null,null,null,null,null,null,null,null,""]
[null,null,null,null,null,null,null,null,""]
[null,null,null,null,null,null,null,null,""]
["10h",null,null,null,null,null,null,null,""]
[null,null,null,null,null,null,null,null,""]
[null,null,null,null,null,null,null,null,""]
[null,null,null,null,null,null,null,null,""]
["11h",null,null,null,null,null,null,null,""]
[null,null,null,null,null,null,null,null,""]
[null,null,null,null,null,null,null,null,""]
[null,null,null,null,null,null,null,null,""]
["12h",null,null,null,null,null,null,null,""]
[null,null,null,null,null,null,null,null,""]
[null,null,null,null,null,null,null,null,""]
[null,null,null,null,null,null,null,null,""]
["13h",null,null,null,null,null,null,null,""]
[null,null,null,null,null,null,null,null,""]
[null,null,null,null,null,null,null,null,""]
[null,null,null,null,null,null,null,null,""]
["14h",null,null,null,null,null,null,null,""]
[null,null,null,null,null,null,null,null,""]
[null,null,null,null,null,null,null,null,""]
[null,null,null,null,null,null,null,null,""]
["15h",null,null,null,null,null,null,null,""]
[null,null,null,null,null,null,null,null,""]
[null,null,null,null,null,null,null,null,""]
[null,null,null,null,null,null,null,null,""]
["16h",null,null,null,null,null,null,null,""]
[null,null,null,null,null,null,null,null,""]
[null,null,null,null,null,null,null,null,""]
[null,null,null,null,null,null,null,null,""]
["17h",null,null,null,null,null,null,null,""]
[null,null,null,null,null,null,null,null,""]
[null,null,null,null,null,null,null,null,""]
[null,null,null,null,null,null,null,null,""]
["18h",null,null,null,null,null,null,null,""]
[null,null,null,null,null,null,null,null,""]
[null,null,null,null,null,null,null,null,""]
[null,null,null,null,null,null,null,null,""]
["19h",null,null,null,null,null,null,null,""]
[null,null,null,null,null,null,null,null,""]
[null,null,null,null,null,null,null,null,""]
[null,null,null,null,null,null,null,null,""]
["20h",null,{"$f":"Données!G2","v":"Maintenance machine"},null,null,null,null,null,""]
[null,null,{"$f":"IFERROR(IF(INDEX(Données!F:F,MATCH(C83,Données!G:G,0))>COUNTIF($C$3:C83,C83),C83,INDEX(Données!G:G,MATCH(C83,Données!G:G,0)+1)),\"\")","v":"Maintenance machine"},null,null,null,null,null,""]
[null,null,null,null,null,null,null,null,""]
[null,null,null,null,null,null,null,null,""]
["21h",null,null,null,null,null,null,null,""]
[null,null,null,null,null,null,null,null,""]
[null,null,null,null,null,null,null,null,""]
[null,null,null,null,null,null,null,null,""]
["22h",null,null,null,null,null,null,null,""]
[null,null,null,null,null,null,null,null,""]
[null,null,null,null,null,null,null,null,""]
[null,null,null,null,null,null,null,null,""]
["23h",null,null,null,null,null,null,null,""]
[null,null,null,null,null,null,null,null,""]
[null,null,null,null,null,null,null,null,""]
[null,null,null,null,null,null,null,null,""]
[null,null,null,null,null,null,null,null,""]
[null,null,null,null,null,null,null,null,""]
[null,null,null,null,null,null,null,null,""]
[null,null,null,null,null,null,null,null,""]
[null,null,null,null,null,null,null,null,""]
[null,null,null,null,null,null,null,null,""]
[null,null,null,null,null,null,null,null,""]
[null,null,null,null,null,null,null,null,""]
[null,null,null,null,null,null,null,null,""]
[null,null,null,null,null,null,null,null,""]
[null,null,null,null,null,null,null,null,""]
[null,null,null,null,null,null,null,null,""]
[null,null,null,null,null,null,null,null,""]
[null,null,null,null,null,null,null,null,""]
[null,null,null,null,null,null,null,null,""]
[null,null,null,null,null,null,null,null,""]
[null,null,null,null,null,null,null,null,""]
[null,null,null,null,null,null,null,null,""]
[null,null,null,null,null,null,null,null,""]
[null,null,null,null,null,null,null,null,""]
[null,null,null,null,null,null,null,null,""]
[null,null,null,null,null,null,null,null,""]
[null,null,null,null,null,null,null,null,""]
[null,null,null,null,null,null,null,null,""]
[null,null,null,null,null,null,null,null,""]
[null,null,null,null,null,null,null,null,""]
[null,null,null,null,null,null,null,null,""]
[null,null,null,null,null,null,null,null,""]
[null,null,null,null,null,null,null,null,""]
[null,null,null,null,null,null,null,null,""]
[null,null,null,null,null,null,null,null,""]
[null,null,null,null,null,null,null,null,""]
[null,null,null,null,null,null,null,null,""]
[null,null,null,null,null,null,null,null,""]
[null,null,null,null,null,null,null,null,""]
[null,null,null,null,null,null,null,null,""]
[]
[]
[]
[]
[]
[]
[]
[]
[]
[]
[]
[]
[]
[]
[]
[]
[]
[]
[]
[]
[]
[]
[]
[]
[]
[]
[]
[]
[]
[]
[]
[]
[]
[]
[]
[]
[]
[]
[]
[]
[]
[]
[]
[]
[]
[]
[]
[]
[]
[]
[]
[]
[]
[]
[]
[]
[]
[]
[]
[]
[]
[]
[]
[]
[]
[]
[]
[]
[]
[]
[]
[]
[]
[]
[]
[]
[]
[]
[]
[]
[]
[]
[]
[]
[]
[]
[]
[]
[]
[]
[]
[]
[]
[]
[]
[]
[]
[]
[]
[]
[]
[]
[]
[]
[]
[]
[]
[]
[]
[]
[]
[]
[]
[]
[]
[]
[]
[]
[]
[]
[]
[]
[]
[]
[]
[]
[]
[]
[]
[]
[]
[]
[]
[]
[]
[]
[]
[]
[]
[]
[]
[]
[]
[]
[]
[]
[]
[]
[]
[]
[]
[]
[]
[]
[]
[]
[]
[]
[null,null,null,null,null,null,null,""]
[null,null,null,null,null,null,null,""]
[null,null,null,null,null,null,null,""]
[null,null,null,null,null,null,null,""]
[null,null,null,null,null,null,null,""]
[null,null,null,null,null,null,null,""]
[null,null,null,null,null,null,null,""]
[null,null,null,null,null,null,null,""]
[null,null,null,null,null,null,null,""]
[null,null,null,null,null,null,null,""]
[null,null,null,null,null,null,null,""]
[null,null,null,null,null,null,null,""]
[null,null,null,null,null,null,null,""]
[null,null,null,null,null,null,null,""]
[null,null,null,null,null,null,null,""]
[null,null,null,null,null,null,null,""]
[null,null,null,null,null,null,null,""]
[null,null,null,null,null,null,null,""]
[null,null,null,null,null,null,null,""]

{"sheet":"Feuil1","index":3,"n_rows":0,"n_cols":0,"rows_kept":0,"cut":false,"hidden":false,"merged":[]}