{"text_format":"1","workbook":"xlsx","n_sheets":7,"sheets":["SEM 1","SEM 2","SEM 3","SEM 4","SEM 5","JANVIER","SEM 5+"],"not_rendered":{"charts":0,"images":0,"macros":1,"external_links":0,"defined_names":6,"comments":0,"pivot_tables":12},"unopened":[],"bounds":{"document_bytes":16777216,"sheet_cells":100000,"rows_first":2000,"rows_last":500,"rows_between":2000,"halvings":0,"cell_chars":16384,"cell_head_chars":4096},"cells_cut":0,"cells_raw":0,"read":"whole","date_system":"1900"}

{"sheet":"SEM 1","index":0,"n_rows":41,"n_cols":33,"rows_kept":41,"cut":false,"hidden":false,"merged":[[9,1,16,1],[17,1,24,1],[25,1,32,1],[33,1,40,1],[1,0,8,0],[9,0,16,0],[17,0,24,0],[25,0,32,0],[33,0,40,0],[1,1,8,1]]}
["JOUR","DATE","CODE","Heure","Départ / Retour","Départ","ADRESSE 1","Arrivée","ADRESSE 2","Km Parcourus","Transporteur","Type de camions","Emission CO2","Facturable","N° bon\nV-HA","N° bon\nV-MAT","N° Facture transporteur","Nombre de transport","Facturé sur VMAT","Commande hors délai et/ou rajout","Tarif refacturé aux chantiers","Tarif transporteur",null,"Commentaires"]
["Lundi ","2016-01-02",null,"07H00","DEPART","ADOMA",{"$f":"+IFERROR(VLOOKUP(F2,#REF!,2),\"\")","v":""},"BLANCHE CASTILLE",{"$f":"+IFERROR(HLOOKUP(H2,#REF!,2),\"\")","v":""},{"$f":"+IFERROR(INDEX(#REF!,MATCH('SEM 1'!$G2,#REF!,0),MATCH('SEM 1'!$I2,#REF!,0)),\"\")","v":""},"LOISEAU",null,null,"Facturable",null,null,null,4,"OUI","RAJOUT",null,null,null,null,null,"Transporteurs","Somme de Km Parcourus","Somme de Nombre de transport",null,"TOTAL refacturation par Transporteur","Facturé sur VMAT"]
[null,null,null,"07H30","DEPART","BLANCHE CASTILLE",{"$f":"+IFERROR(VLOOKUP(F3,#REF!,2),\"\")","v":""},"CIVAUX DUS ",{"$f":"+IFERROR(HLOOKUP(H3,#REF!,2),\"\")","v":""},{"$f":"+IFERROR(INDEX(#REF!,MATCH('SEM 1'!$G3,#REF!,0),MATCH('SEM 1'!$I3,#REF!,0)),\"\")","v":""},"BRANGEON",null,null,"Facturable",null,null,null,1,"NON","RAJOUT",null,null,null,null,null,"BRANGEON",169,1,null,"Transporteurs","OUI","NON","Total général"]
[null,null,null,null,null,null,{"$f":"+IFERROR(VLOOKUP(F4,#REF!,2),\"\")","v":""},null,{"$f":"+IFERROR(HLOOKUP(H4,#REF!,2),\"\")","v":""},{"$f":"+IFERROR(INDEX(#REF!,MATCH('SEM 1'!$G4,#REF!,0),MATCH('SEM 1'!$I4,#REF!,0)),\"\")","v":""},null,null,null,null,null,null,null,null,null,null,null,null,null,null,null,"LOISEAU",106,4,null,"BRANGEON"]
[null,null,null,null,null,null,{"$f":"+IFERROR(VLOOKUP(F5,#REF!,2),\"\")","v":""},null,{"$f":"+IFERROR(HLOOKUP(H5,#REF!,2),\"\")","v":""},{"$f":"+IFERROR(INDEX(#REF!,MATCH('SEM 1'!$G5,#REF!,0),MATCH('SEM 1'!$I5,#REF!,0)),\"\")","v":""},null,null,null,null,null,null,null,null,null,null,null,null,null,null,null,"Total général",275,5,null,"LOISEAU"]
[null,null,null,null,null,null,{"$f":"+IFERROR(VLOOKUP(F6,#REF!,2),\"\")","v":""},null,{"$f":"+IFERROR(HLOOKUP(H6,#REF!,2),\"\")","v":""},{"$f":"+IFERROR(INDEX(#REF!,MATCH('SEM 1'!$G6,#REF!,0),MATCH('SEM 1'!$I6,#REF!,0)),\"\")","v":""},null,null,null,null,null,null,null,null,null,null,null,null,null,null,null,null,null,null,null,"Total général"]
[null,null,null,null,null,null,{"$f":"+IFERROR(VLOOKUP(F7,#REF!,2),\"\")","v":""},null,{"$f":"+IFERROR(HLOOKUP(H7,#REF!,2),\"\")","v":""},{"$f":"+IFERROR(INDEX(#REF!,MATCH('SEM 1'!$G7,#REF!,0),MATCH('SEM 1'!$I7,#REF!,0)),\"\")","v":""}]
[null,null,null,null,null,null,{"$f":"+IFERROR(VLOOKUP(F8,#REF!,2),\"\")","v":""},null,{"$f":"+IFERROR(HLOOKUP(H8,#REF!,2),\"\")","v":""},{"$f":"+IFERROR(INDEX(#REF!,MATCH('SEM 1'!$G8,#REF!,0),MATCH('SEM 1'!$I8,#REF!,0)),\"\")","v":""}]
[null,null,null,null,null,null,{"$f":"+IFERROR(VLOOKUP(F9,#REF!,2),\"\")","v":""},null,{"$f":"+IFERROR(HLOOKUP(H9,#REF!,2),\"\")","v":""},{"$f":"+IFERROR(INDEX(#REF!,MATCH('SEM 1'!$G9,#REF!,0),MATCH('SEM 1'!$I9,#REF!,0)),\"\")","v":""}]
["Mardi ","2016-01-03",null,null,null,null,{"$f":"+IFERROR(VLOOKUP(F10,#REF!,2),\"\")","v":""},null,{"$f":"+IFERROR(HLOOKUP(H10,#REF!,2),\"\")","v":""},{"$f":"+IFERROR(INDEX(#REF!,MATCH('SEM 1'!$G10,#REF!,0),MATCH('SEM 1'!$I10,#REF!,0)),\"\")","v":""}]
{"$rows_left_out":32}
{"sheet":"SEM 2","index":1,"n_rows":41,"n_cols":33,"rows_kept":41,"cut":false,"hidden":false,"merged":[[25,0,32,0],[25,1,32,1],[33,0,40,0],[33,1,40,1],[1,0,8,0],[1,1,8,1],[9,0,16,0],[9,1,16,1],[17,0,24,0],[17,1,24,1]]}
["JOUR","DATE","CODE","Heure","Départ / Retour","Départ","ADRESSE 1","Arrivée","ADRESSE 2","Km Parcourus","Transporteur","Type de camions","Emission CO2","Facturable","N° bon\nV-HA","N° bon\nV-MAT","N° Facture transporteur","Nombre de transport","Facturé sur VMAT","Commande hors délai et/ou rajout","Tarif refacturé aux chantiers","Tarif transporteur",null,"Commentaires"]
["Lundi ","2016-01-09",null,"07H00","DEPART","ADOMA",{"$f":"+IFERROR(VLOOKUP(F2,#REF!,2),\"\")","v":""},"BLANCHE CASTILLE",{"$f":"+IFERROR(HLOOKUP(H2,#REF!,2),\"\")","v":""},{"$f":"+IFERROR(INDEX(#REF!,MATCH('SEM 2'!$G2,#REF!,0),MATCH('SEM 2'!$I2,#REF!,0)),\"\")","v":""},"LOISEAU",null,null,"Facturable",null,null,null,4,"OUI","RAJOUT",null,null,null,null,null,"Transporteurs","Somme de Km Parcourus","Somme de Nombre de transport",null,"TOTAL refacturation par Transporteur","Facturé sur VMAT"]
[null,null,null,"07H30","DEPART","BLANCHE CASTILLE",{"$f":"+IFERROR(VLOOKUP(F3,#REF!,2),\"\")","v":""},"CIVAUX DUS ",{"$f":"+IFERROR(HLOOKUP(H3,#REF!,2),\"\")","v":""},{"$f":"+IFERROR(INDEX(#REF!,MATCH('SEM 2'!$G3,#REF!,0),MATCH('SEM 2'!$I3,#REF!,0)),\"\")","v":""},"BRANGEON",null,null,"Facturable",null,null,null,1,"NON","RAJOUT",null,null,null,null,null,"BRANGEON",169,1,null,"Transporteurs","OUI","NON","Total général"]
[null,null,null,null,null,null,{"$f":"+IFERROR(VLOOKUP(F4,#REF!,2),\"\")","v":""},null,{"$f":"+IFERROR(HLOOKUP(H4,#REF!,2),\"\")","v":""},{"$f":"+IFERROR(INDEX(#REF!,MATCH('SEM 2'!$G4,#REF!,0),MATCH('SEM 2'!$I4,#REF!,0)),\"\")","v":""},null,null,null,null,null,null,null,null,null,null,null,null,null,null,null,"LOISEAU",106,4,null,"BRANGEON"]
[null,null,null,null,null,null,{"$f":"+IFERROR(VLOOKUP(F5,#REF!,2),\"\")","v":""},null,{"$f":"+IFERROR(HLOOKUP(H5,#REF!,2),\"\")","v":""},{"$f":"+IFERROR(INDEX(#REF!,MATCH('SEM 2'!$G5,#REF!,0),MATCH('SEM 2'!$I5,#REF!,0)),\"\")","v":""},null,null,null,null,null,null,null,null,null,null,null,null,null,null,null,"Total général",275,5,null,"LOISEAU"]
[null,null,null,null,null,null,{"$f":"+IFERROR(VLOOKUP(F6,#REF!,2),\"\")","v":""},null,{"$f":"+IFERROR(HLOOKUP(H6,#REF!,2),\"\")","v":""},{"$f":"+IFERROR(INDEX(#REF!,MATCH('SEM 2'!$G6,#REF!,0),MATCH('SEM 2'!$I6,#REF!,0)),\"\")","v":""},null,null,null,null,null,null,null,null,null,null,null,null,null,null,null,null,null,null,null,"Total général"]
[null,null,null,null,null,null,{"$f":"+IFERROR(VLOOKUP(F7,#REF!,2),\"\")","v":""},null,{"$f":"+IFERROR(HLOOKUP(H7,#REF!,2),\"\")","v":""},{"$f":"+IFERROR(INDEX(#REF!,MATCH('SEM 2'!$G7,#REF!,0),MATCH('SEM 2'!$I7,#REF!,0)),\"\")","v":""}]
[null,null,null,null,null,null,{"$f":"+IFERROR(VLOOKUP(F8,#REF!,2),\"\")","v":""},null,{"$f":"+IFERROR(HLOOKUP(H8,#REF!,2),\"\")","v":""},{"$f":"+IFERROR(INDEX(#REF!,MATCH('SEM 2'!$G8,#REF!,0),MATCH('SEM 2'!$I8,#REF!,0)),\"\")","v":""}]
[null,null,null,null,null,null,{"$f":"+IFERROR(VLOOKUP(F9,#REF!,2),\"\")","v":""},null,{"$f":"+IFERROR(HLOOKUP(H9,#REF!,2),\"\")","v":""},{"$f":"+IFERROR(INDEX(#REF!,MATCH('SEM 2'!$G9,#REF!,0),MATCH('SEM 2'!$I9,#REF!,0)),\"\")","v":""}]
["Mardi ","2016-01-10",null,null,null,null,{"$f":"+IFERROR(VLOOKUP(F10,#REF!,2),\"\")","v":""},null,{"$f":"+IFERROR(HLOOKUP(H10,#REF!,2),\"\")","v":""},{"$f":"+IFERROR(INDEX(#REF!,MATCH('SEM 2'!$G10,#REF!,0),MATCH('SEM 2'!$I10,#REF!,0)),\"\")","v":""}]
{"$rows_left_out":32}
{"sheet":"SEM 3","index":2,"n_rows":41,"n_cols":33,"rows_kept":41,"cut":false,"hidden":false,"merged":[[25,0,32,0],[25,1,32,1],[33,0,40,0],[33,1,40,1],[1,0,8,0],[1,1,8,1],[9,0,16,0],[9,1,16,1],[17,0,24,0],[17,1,24,1]]}
["JOUR","DATE","CODE","Heure","Départ / Retour","Départ","ADRESSE 1","Arrivée","ADRESSE 2","Km Parcourus","Transporteur","Type de camions","Emission CO2","Facturable","N° bon\nV-HA","N° bon\nV-MAT","N° Facture transporteur","Nombre de transport","Facturé sur VMAT","Commande hors délai et/ou rajout","Tarif refacturé aux chantiers","Tarif transporteur",null,"Commentaires"]
["Lundi ","2016-01-16",null,"07H00","DEPART","ADOMA",{"$f":"+IFERROR(VLOOKUP(F2,#REF!,2),\"\")","v":""},"BLANCHE CASTILLE",{"$f":"+IFERROR(HLOOKUP(H2,#REF!,2),\"\")","v":""},{"$f":"+IFERROR(INDEX(#REF!,MATCH('SEM 3'!$G2,#REF!,0),MATCH('SEM 3'!$I2,#REF!,0)),\"\")","v":""},"LOISEAU",null,null,"Facturable",null,null,null,4,"OUI","RAJOUT",null,null,null,null,null,"Transporteurs","Somme de Km Parcourus","Somme de Nombre de transport",null,"TOTAL refacturation par Transporteur","Facturé sur VMAT"]
[null,null,null,"07H30","DEPART","BLANCHE CASTILLE",{"$f":"+IFERROR(VLOOKUP(F3,#REF!,2),\"\")","v":""},"CIVAUX DUS ",{"$f":"+IFERROR(HLOOKUP(H3,#REF!,2),\"\")","v":""},{"$f":"+IFERROR(INDEX(#REF!,MATCH('SEM 3'!$G3,#REF!,0),MATCH('SEM 3'!$I3,#REF!,0)),\"\")","v":""},"BRANGEON",null,null,"Facturable",null,null,null,1,"NON","RAJOUT",null,null,null,null,null,"BRANGEON",169,1,null,"Transporteurs","OUI","NON","Total général"]
[null,null,null,null,null,null,{"$f":"+IFERROR(VLOOKUP(F4,#REF!,2),\"\")","v":""},null,{"$f":"+IFERROR(HLOOKUP(H4,#REF!,2),\"\")","v":""},{"$f":"+IFERROR(INDEX(#REF!,MATCH('SEM 3'!$G4,#REF!,0),MATCH('SEM 3'!$I4,#REF!,0)),\"\")","v":""},null,null,null,null,null,null,null,null,null,null,null,null,null,null,null,"LOISEAU",106,4,null,"BRANGEON"]
[null,null,null,null,null,null,{"$f":"+IFERROR(VLOOKUP(F5,#REF!,2),\"\")","v":""},null,{"$f":"+IFERROR(HLOOKUP(H5,#REF!,2),\"\")","v":""},{"$f":"+IFERROR(INDEX(#REF!,MATCH('SEM 3'!$G5,#REF!,0),MATCH('SEM 3'!$I5,#REF!,0)),\"\")","v":""},null,null,null,null,null,null,null,null,null,null,null,null,null,null,null,"Total général",275,5,null,"LOISEAU"]
[null,null,null,null,null,null,{"$f":"+IFERROR(VLOOKUP(F6,#REF!,2),\"\")","v":""},null,{"$f":"+IFERROR(HLOOKUP(H6,#REF!,2),\"\")","v":""},{"$f":"+IFERROR(INDEX(#REF!,MATCH('SEM 3'!$G6,#REF!,0),MATCH('SEM 3'!$I6,#REF!,0)),\"\")","v":""},null,null,null,null,null,null,null,null,null,null,null,null,null,null,null,null,null,null,null,"Total général"]
[null,null,null,null,null,null,{"$f":"+IFERROR(VLOOKUP(F7,#REF!,2),\"\")","v":""},null,{"$f":"+IFERROR(HLOOKUP(H7,#REF!,2),\"\")","v":""},{"$f":"+IFERROR(INDEX(#REF!,MATCH('SEM 3'!$G7,#REF!,0),MATCH('SEM 3'!$I7,#REF!,0)),\"\")","v":""}]
[null,null,null,null,null,null,{"$f":"+IFERROR(VLOOKUP(F8,#REF!,2),\"\")","v":""},null,{"$f":"+IFERROR(HLOOKUP(H8,#REF!,2),\"\")","v":""},{"$f":"+IFERROR(INDEX(#REF!,MATCH('SEM 3'!$G8,#REF!,0),MATCH('SEM 3'!$I8,#REF!,0)),\"\")","v":""}]
[null,null,null,null,null,null,{"$f":"+IFERROR(VLOOKUP(F9,#REF!,2),\"\")","v":""},null,{"$f":"+IFERROR(HLOOKUP(H9,#REF!,2),\"\")","v":""},{"$f":"+IFERROR(INDEX(#REF!,MATCH('SEM 3'!$G9,#REF!,0),MATCH('SEM 3'!$I9,#REF!,0)),\"\")","v":""}]
["Mardi ","2016-01-17",null,null,null,null,{"$f":"+IFERROR(VLOOKUP(F10,#REF!,2),\"\")","v":""},null,{"$f":"+IFERROR(HLOOKUP(H10,#REF!,2),\"\")","v":""},{"$f":"+IFERROR(INDEX(#REF!,MATCH('SEM 3'!$G10,#REF!,0),MATCH('SEM 3'!$I10,#REF!,0)),\"\")","v":""}]
{"$rows_left_out":32}
{"sheet":"SEM 4","index":3,"n_rows":41,"n_cols":33,"rows_kept":41,"cut":false,"hidden":false,"merged":[[25,0,32,0],[25,1,32,1],[33,0,40,0],[33,1,40,1],[1,0,8,0],[1,1,8,1],[9,0,16,0],[9,1,16,1],[17,0,24,0],[17,1,24,1]]}
["JOUR","DATE","CODE","Heure","Départ / Retour","Départ","ADRESSE 1","Arrivée","ADRESSE 2","Km Parcourus","Transporteur","Type de camions","Emission CO2","Facturable","N° bon\nV-HA","N° bon\nV-MAT","N° Facture transporteur","Nombre de transport","Facturé sur VMAT","Commande hors délai et/ou rajout","Tarif refacturé aux chantiers","Tarif transporteur",null,"Commentaires"]
["Lundi ","2016-01-23",null,"07H00","DEPART","ADOMA",{"$f":"+IFERROR(VLOOKUP(F2,#REF!,2),\"\")","v":""},"BLANCHE CASTILLE",{"$f":"+IFERROR(HLOOKUP(H2,#REF!,2),\"\")","v":""},{"$f":"+IFERROR(INDEX(#REF!,MATCH('SEM 4'!$G2,#REF!,0),MATCH('SEM 4'!$I2,#REF!,0)),\"\")","v":""},"LOISEAU",null,null,"Facturable",null,null,null,4,"OUI","RAJOUT",null,null,null,null,null,"Transporteurs","Somme de Km Parcourus","Somme de Nombre de transport",null,"TOTAL refacturation par Transporteur","Facturé sur VMAT"]
[null,null,null,"07H30","DEPART","BLANCHE CASTILLE",{"$f":"+IFERROR(VLOOKUP(F3,#REF!,2),\"\")","v":""},"CIVAUX DUS ",{"$f":"+IFERROR(HLOOKUP(H3,#REF!,2),\"\")","v":""},{"$f":"+IFERROR(INDEX(#REF!,MATCH('SEM 4'!$G3,#REF!,0),MATCH('SEM 4'!$I3,#REF!,0)),\"\")","v":""},"BRANGEON",null,null,"Facturable",null,null,null,1,"NON","RAJOUT",null,null,null,null,null,"BRANGEON",169,1,null,"Transporteurs","OUI","NON","Total général"]
[null,null,null,null,null,null,{"$f":"+IFERROR(VLOOKUP(F4,#REF!,2),\"\")","v":""},null,{"$f":"+IFERROR(HLOOKUP(H4,#REF!,2),\"\")","v":""},{"$f":"+IFERROR(INDEX(#REF!,MATCH('SEM 4'!$G4,#REF!,0),MATCH('SEM 4'!$I4,#REF!,0)),\"\")","v":""},null,null,null,null,null,null,null,null,null,null,null,null,null,null,null,"LOISEAU",106,4,null,"BRANGEON"]
[null,null,null,null,null,null,{"$f":"+IFERROR(VLOOKUP(F5,#REF!,2),\"\")","v":""},null,{"$f":"+IFERROR(HLOOKUP(H5,#REF!,2),\"\")","v":""},{"$f":"+IFERROR(INDEX(#REF!,MATCH('SEM 4'!$G5,#REF!,0),MATCH('SEM 4'!$I5,#REF!,0)),\"\")","v":""},null,null,null,null,null,null,null,null,null,null,null,null,null,null,null,"Total général",275,5,null,"LOISEAU"]
[null,null,null,null,null,null,{"$f":"+IFERROR(VLOOKUP(F6,#REF!,2),\"\")","v":""},null,{"$f":"+IFERROR(HLOOKUP(H6,#REF!,2),\"\")","v":""},{"$f":"+IFERROR(INDEX(#REF!,MATCH('SEM 4'!$G6,#REF!,0),MATCH('SEM 4'!$I6,#REF!,0)),\"\")","v":""},null,null,null,null,null,null,null,null,null,null,null,null,null,null,null,null,null,null,null,"Total général"]
[null,null,null,null,null,null,{"$f":"+IFERROR(VLOOKUP(F7,#REF!,2),\"\")","v":""},null,{"$f":"+IFERROR(HLOOKUP(H7,#REF!,2),\"\")","v":""},{"$f":"+IFERROR(INDEX(#REF!,MATCH('SEM 4'!$G7,#REF!,0),MATCH('SEM 4'!$I7,#REF!,0)),\"\")","v":""}]
[null,null,null,null,null,null,{"$f":"+IFERROR(VLOOKUP(F8,#REF!,2),\"\")","v":""},null,{"$f":"+IFERROR(HLOOKUP(H8,#REF!,2),\"\")","v":""},{"$f":"+IFERROR(INDEX(#REF!,MATCH('SEM 4'!$G8,#REF!,0),MATCH('SEM 4'!$I8,#REF!,0)),\"\")","v":""}]
[null,null,null,null,null,null,{"$f":"+IFERROR(VLOOKUP(F9,#REF!,2),\"\")","v":""},null,{"$f":"+IFERROR(HLOOKUP(H9,#REF!,2),\"\")","v":""},{"$f":"+IFERROR(INDEX(#REF!,MATCH('SEM 4'!$G9,#REF!,0),MATCH('SEM 4'!$I9,#REF!,0)),\"\")","v":""}]
["Mardi ","2016-01-24",null,null,null,null,{"$f":"+IFERROR(VLOOKUP(F10,#REF!,2),\"\")","v":""},null,{"$f":"+IFERROR(HLOOKUP(H10,#REF!,2),\"\")","v":""},{"$f":"+IFERROR(INDEX(#REF!,MATCH('SEM 4'!$G10,#REF!,0),MATCH('SEM 4'!$I10,#REF!,0)),\"\")","v":""}]
{"$rows_left_out":32}
{"sheet":"SEM 5","index":4,"n_rows":41,"n_cols":33,"rows_kept":41,"cut":false,"hidden":false,"merged":[[25,0,32,0],[25,1,32,1],[33,0,40,0],[33,1,40,1],[1,0,8,0],[1,1,8,1],[9,0,16,0],[9,1,16,1],[17,0,24,0],[17,1,24,1]]}
["JOUR","DATE","CODE","Heure","Départ / Retour","Départ","ADRESSE 1","Arrivée","ADRESSE 2","Km Parcourus","Transporteur","Type de camions","Emission CO2","Facturable","N° bon\nV-HA","N° bon\nV-MAT","N° Facture transporteur","Nombre de transport","Facturé sur VMAT","Commande hors délai et/ou rajout","Tarif refacturé aux chantiers","Tarif transporteur",null,"Commentaires"]
["Lundi ","2016-01-30",null,"07H00","DEPART","ADOMA",{"$f":"+IFERROR(VLOOKUP(F2,#REF!,2),\"\")","v":""},"BLANCHE CASTILLE",{"$f":"+IFERROR(HLOOKUP(H2,#REF!,2),\"\")","v":""},{"$f":"+IFERROR(INDEX(#REF!,MATCH('SEM 5'!$G2,#REF!,0),MATCH('SEM 5'!$I2,#REF!,0)),\"\")","v":""},"LOISEAU",null,null,"Facturable",null,null,null,4,"OUI","RAJOUT",null,null,null,null,null,"Transporteurs","Somme de Km Parcourus","Somme de Nombre de transport",null,"TOTAL refacturation par Transporteur","Facturé sur VMAT"]
[null,null,null,"07H30","DEPART","BLANCHE CASTILLE",{"$f":"+IFERROR(VLOOKUP(F3,#REF!,2),\"\")","v":""},"CIVAUX DUS ",{"$f":"+IFERROR(HLOOKUP(H3,#REF!,2),\"\")","v":""},{"$f":"+IFERROR(INDEX(#REF!,MATCH('SEM 5'!$G3,#REF!,0),MATCH('SEM 5'!$I3,#REF!,0)),\"\")","v":""},"BRANGEON",null,null,"Facturable",null,null,null,1,"NON","RAJOUT",null,null,null,null,null,"BRANGEON",169,1,null,"Transporteurs","OUI","NON","Total général"]
[null,null,null,null,null,null,{"$f":"+IFERROR(VLOOKUP(F4,#REF!,2),\"\")","v":""},null,{"$f":"+IFERROR(HLOOKUP(H4,#REF!,2),\"\")","v":""},{"$f":"+IFERROR(INDEX(#REF!,MATCH('SEM 5'!$G4,#REF!,0),MATCH('SEM 5'!$I4,#REF!,0)),\"\")","v":""},null,null,null,null,null,null,null,null,null,null,null,null,null,null,null,"LOISEAU",106,4,null,"BRANGEON"]
[null,null,null,null,null,null,{"$f":"+IFERROR(VLOOKUP(F5,#REF!,2),\"\")","v":""},null,{"$f":"+IFERROR(HLOOKUP(H5,#REF!,2),\"\")","v":""},{"$f":"+IFERROR(INDEX(#REF!,MATCH('SEM 5'!$G5,#REF!,0),MATCH('SEM 5'!$I5,#REF!,0)),\"\")","v":""},null,null,null,null,null,null,null,null,null,null,null,null,null,null,null,"Total général",275,5,null,"LOISEAU"]
[null,null,null,null,null,null,{"$f":"+IFERROR(VLOOKUP(F6,#REF!,2),\"\")","v":""},null,{"$f":"+IFERROR(HLOOKUP(H6,#REF!,2),\"\")","v":""},{"$f":"+IFERROR(INDEX(#REF!,MATCH('SEM 5'!$G6,#REF!,0),MATCH('SEM 5'!$I6,#REF!,0)),\"\")","v":""},null,null,null,null,null,null,null,null,null,null,null,null,null,null,null,null,null,null,null,"Total général"]
[null,null,null,null,null,null,{"$f":"+IFERROR(VLOOKUP(F7,#REF!,2),\"\")","v":""},null,{"$f":"+IFERROR(HLOOKUP(H7,#REF!,2),\"\")","v":""},{"$f":"+IFERROR(INDEX(#REF!,MATCH('SEM 5'!$G7,#REF!,0),MATCH('SEM 5'!$I7,#REF!,0)),\"\")","v":""}]
[null,null,null,null,null,null,{"$f":"+IFERROR(VLOOKUP(F8,#REF!,2),\"\")","v":""},null,{"$f":"+IFERROR(HLOOKUP(H8,#REF!,2),\"\")","v":""},{"$f":"+IFERROR(INDEX(#REF!,MATCH('SEM 5'!$G8,#REF!,0),MATCH('SEM 5'!$I8,#REF!,0)),\"\")","v":""}]
[null,null,null,null,null,null,{"$f":"+IFERROR(VLOOKUP(F9,#REF!,2),\"\")","v":""},null,{"$f":"+IFERROR(HLOOKUP(H9,#REF!,2),\"\")","v":""},{"$f":"+IFERROR(INDEX(#REF!,MATCH('SEM 5'!$G9,#REF!,0),MATCH('SEM 5'!$I9,#REF!,0)),\"\")","v":""}]
["Mardi ","2016-01-31",null,null,null,null,{"$f":"+IFERROR(VLOOKUP(F10,#REF!,2),\"\")","v":""},null,{"$f":"+IFERROR(HLOOKUP(H10,#REF!,2),\"\")","v":""},{"$f":"+IFERROR(INDEX(#REF!,MATCH('SEM 5'!$G10,#REF!,0),MATCH('SEM 5'!$I10,#REF!,0)),\"\")","v":""}]
{"$rows_left_out":32}
{"sheet":"JANVIER","index":5,"n_rows":2,"n_cols":3,"rows_kept":2,"cut":false,"hidden":false,"merged":[]}
["Transporteurs","Somme de Km Parcourus","Somme de Nombre de transport"]
["BRANGEON",169,1]

{"sheet":"SEM 5+","index":6,"n_rows":41,"n_cols":33,"rows_kept":41,"cut":false,"hidden":false,"merged":[[25,0,32,0],[25,1,32,1],[33,0,40,0],[33,1,40,1],[1,0,8,0],[1,1,8,1],[9,0,16,0],[9,1,16,1],[17,0,24,0],[17,1,24,1]]}
["JOUR","DATE","CODE","Heure","Départ / Retour","Départ","ADRESSE 1","Arrivée","ADRESSE 2","Km Parcourus","Transporteur","Type de camions","Emission CO2","Facturable","N° bon\nV-HA","N° bon\nV-MAT","N° Facture transporteur","Nombre de transport","Facturé sur VMAT","Commande hors délai et/ou rajout","Tarif refacturé aux chantiers","Tarif transporteur",null,"Commentaires"]
["Lundi ",null,null,"07H00","DEPART","ADOMA",{"$f":"+IFERROR(VLOOKUP(F2,#REF!,2),\"\")","v":""},"BLANCHE CASTILLE",{"$f":"+IFERROR(HLOOKUP(H2,#REF!,2),\"\")","v":""},{"$f":"+IFERROR(INDEX(#REF!,MATCH('SEM 5+'!$G2,#REF!,0),MATCH('SEM 5+'!$I2,#REF!,0)),\"\")","v":""},"LOISEAU",null,null,"Facturable",null,null,null,4,"OUI","RAJOUT",null,null,null,null,null,"Transporteurs","Somme de Km Parcourus","Somme de Nombre de transport",null,"TOTAL refacturation par Transporteur","Facturé sur VMAT"]
[null,null,null,"07H30","DEPART","BLANCHE CASTILLE",{"$f":"+IFERROR(VLOOKUP(F3,#REF!,2),\"\")","v":""},"CIVAUX DUS ",{"$f":"+IFERROR(HLOOKUP(H3,#REF!,2),\"\")","v":""},{"$f":"+IFERROR(INDEX(#REF!,MATCH('SEM 5+'!$G3,#REF!,0),MATCH('SEM 5+'!$I3,#REF!,0)),\"\")","v":""},"BRANGEON",null,null,"Facturable",null,null,null,1,"NON","RAJOUT",null,null,null,null,null,"BRANGEON",169,1,null,"Transporteurs","OUI","NON","Total général"]
[null,null,null,null,null,null,{"$f":"+IFERROR(VLOOKUP(F4,#REF!,2),\"\")","v":""},null,{"$f":"+IFERROR(HLOOKUP(H4,#REF!,2),\"\")","v":""},{"$f":"+IFERROR(INDEX(#REF!,MATCH('SEM 5+'!$G4,#REF!,0),MATCH('SEM 5+'!$I4,#REF!,0)),\"\")","v":""},null,null,null,null,null,null,null,null,null,null,null,null,null,null,null,"LOISEAU",106,4,null,"BRANGEON"]
[null,null,null,null,null,null,{"$f":"+IFERROR(VLOOKUP(F5,#REF!,2),\"\")","v":""},null,{"$f":"+IFERROR(HLOOKUP(H5,#REF!,2),\"\")","v":""},{"$f":"+IFERROR(INDEX(#REF!,MATCH('SEM 5+'!$G5,#REF!,0),MATCH('SEM 5+'!$I5,#REF!,0)),\"\")","v":""},null,null,null,null,null,null,null,null,null,null,null,null,null,null,null,"Total général",275,5,null,"LOISEAU"]
[null,null,null,null,null,null,{"$f":"+IFERROR(VLOOKUP(F6,#REF!,2),\"\")","v":""},null,{"$f":"+IFERROR(HLOOKUP(H6,#REF!,2),\"\")","v":""},{"$f":"+IFERROR(INDEX(#REF!,MATCH('SEM 5+'!$G6,#REF!,0),MATCH('SEM 5+'!$I6,#REF!,0)),\"\")","v":""},null,null,null,null,null,null,null,null,null,null,null,null,null,null,null,null,null,null,null,"Total général"]
[null,null,null,null,null,null,{"$f":"+IFERROR(VLOOKUP(F7,#REF!,2),\"\")","v":""},null,{"$f":"+IFERROR(HLOOKUP(H7,#REF!,2),\"\")","v":""},{"$f":"+IFERROR(INDEX(#REF!,MATCH('SEM 5+'!$G7,#REF!,0),MATCH('SEM 5+'!$I7,#REF!,0)),\"\")","v":""}]
[null,null,null,null,null,null,{"$f":"+IFERROR(VLOOKUP(F8,#REF!,2),\"\")","v":""},null,{"$f":"+IFERROR(HLOOKUP(H8,#REF!,2),\"\")","v":""},{"$f":"+IFERROR(INDEX(#REF!,MATCH('SEM 5+'!$G8,#REF!,0),MATCH('SEM 5+'!$I8,#REF!,0)),\"\")","v":""}]
[null,null,null,null,null,null,{"$f":"+IFERROR(VLOOKUP(F9,#REF!,2),\"\")","v":""},null,{"$f":"+IFERROR(HLOOKUP(H9,#REF!,2),\"\")","v":""},{"$f":"+IFERROR(INDEX(#REF!,MATCH('SEM 5+'!$G9,#REF!,0),MATCH('SEM 5+'!$I9,#REF!,0)),\"\")","v":""}]
["Mardi ",null,null,null,null,null,{"$f":"+IFERROR(VLOOKUP(F10,#REF!,2),\"\")","v":""},null,{"$f":"+IFERROR(HLOOKUP(H10,#REF!,2),\"\")","v":""},{"$f":"+IFERROR(INDEX(#REF!,MATCH('SEM 5+'!$G10,#REF!,0),MATCH('SEM 5+'!$I10,#REF!,0)),\"\")","v":""}]
{"$rows_left_out":31}