{"text_format":"1","workbook":"xlsx","n_sheets":2,"sheets":["Feuil1","Feuil2"],"not_rendered":{"charts":0,"images":0,"macros":0,"external_links":0,"defined_names":1,"comments":0,"pivot_tables":0},"unopened":[],"bounds":{"document_bytes":16777216,"sheet_cells":100000,"rows_first":2000,"rows_last":500,"rows_between":2000,"halvings":0,"cell_chars":16384,"cell_head_chars":4096},"cells_cut":0,"cells_raw":0,"read":"whole","date_system":"1900"}

{"sheet":"Feuil1","index":0,"n_rows":48,"n_cols":17,"rows_kept":48,"cut":false,"hidden":false,"merged":[]}
[]
[]
[]
[]
[]
[]
[]
[]
[]
[null,null,"Défaut","Mois","Fournisseur","2016-01-01","2016-02-01","2016-03-01","2016-04-01","2016-05-01","2016-06-01","2016-07-01","2016-08-01","2016-09-01","2016-10-01","2016-11-01","2016-12-01"]
{"$rows_left_out":39}
{"sheet":"Feuil2","index":1,"n_rows":40,"n_cols":17,"rows_kept":40,"cut":false,"hidden":false,"merged":[]}
[]
[null,null,"Défaut","Mois","Fournisseur","2016-01-01","2016-02-01","2016-03-01","2016-04-01","2016-05-01","2016-06-01","2016-07-01","2016-08-01","2016-09-01","2016-10-01","2016-11-01","2016-12-01"]
[null,{"$f":"Feuil1!B11","v":"12_Défaut_2Fournisseur_1"},{"$f":"IF(VLOOKUP($B3,Feuil1!$B:$Q,3,FALSE)=12,VLOOKUP($B3,Feuil1!$B:$Q,2,FALSE),\"\")","v":"Défaut_2"},{"$f":"IF(VLOOKUP($B3,Feuil1!$B:$Q,3,FALSE)=12,VLOOKUP($B3,Feuil1!$B:$Q,3,FALSE),\"\")","v":12},{"$f":"IF(VLOOKUP($B3,Feuil1!$B:$Q,3,FALSE)=12,VLOOKUP($B3,Feuil1!$B:$Q,4,FALSE),\"\")","v":"Fournisseur_1"},{"$f":"IF(IF(VLOOKUP($B3,Feuil1!$B:$Q,3,FALSE)=12,VLOOKUP($B3,Feuil1!$B:$Q,5,FALSE),\"\")=0,\"\",IF(VLOOKUP($B3,Feuil1!$B:$Q,3,FALSE)=12,VLOOKUP($B3,Feuil1!$B:$Q,5,FALSE)))","v":49},{"$f":"IF(IF(VLOOKUP($B3,Feuil1!$B:$Q,3,FALSE)=12,VLOOKUP($B3,Feuil1!$B:$Q,6,FALSE),\"\")=\"\",\"\",IF(VLOOKUP($B3,Feuil1!$B:$Q,3,FALSE)=12,VLOOKUP($B3,Feuil1!$B:$Q,6,FALSE)))","v":10},{"$f":"IF(IF(VLOOKUP($B3,Feuil1!$B:$Q,3,FALSE)=12,VLOOKUP($B3,Feuil1!$B:$Q,7,FALSE),\"\")=\"\",\"\",IF(VLOOKUP($B3,Feuil1!$B:$Q,3,FALSE)=12,VLOOKUP($B3,Feuil1!$B:$Q,7,FALSE)))","v":1},{"$f":"IF(IF(VLOOKUP($B3,Feuil1!$B:$Q,3,FALSE)=12,VLOOKUP($B3,Feuil1!$B:$Q,8,FALSE),\"\")=\"\",\"\",IF(VLOOKUP($B3,Feuil1!$B:$Q,3,FALSE)=12,VLOOKUP($B3,Feuil1!$B:$Q,8,FALSE)))","v":100},{"$f":"IF(IF(VLOOKUP($B3,Feuil1!$B:$Q,3,FALSE)=12,VLOOKUP($B3,Feuil1!$B:$Q,9,FALSE),\"\")=\"\",\"\",IF(VLOOKUP($B3,Feuil1!$B:$Q,3,FALSE)=12,VLOOKUP($B3,Feuil1!$B:$Q,9,FALSE)))","v":93},{"$f":"IF(IF(VLOOKUP($B3,Feuil1!$B:$Q,3,FALSE)=12,VLOOKUP($B3,Feuil1!$B:$Q,10,FALSE),\"\")=\"\",\"\",IF(VLOOKUP($B3,Feuil1!$B:$Q,3,FALSE)=12,VLOOKUP($B3,Feuil1!$B:$Q,10,FALSE)))","v":21},{"$f":"IF(IF(VLOOKUP($B3,Feuil1!$B:$Q,3,FALSE)=12,VLOOKUP($B3,Feuil1!$B:$Q,11,FALSE),\"\")=\"\",\"\",IF(VLOOKUP($B3,Feuil1!$B:$Q,3,FALSE)=12,VLOOKUP($B3,Feuil1!$B:$Q,11,FALSE),\"\"))","v":61},{"$f":"IF(IF(VLOOKUP($B3,Feuil1!$B:$Q,3,FALSE)=12,VLOOKUP($B3,Feuil1!$B:$Q,12,FALSE),\"\")=\"\",\"\",IF(VLOOKUP($B3,Feuil1!$B:$Q,3,FALSE)=12,VLOOKUP($B3,Feuil1!$B:$Q,12,FALSE),\"\"))","v":62},{"$f":"IF(IF(VLOOKUP($B3,Feuil1!$B:$Q,3,FALSE)=12,VLOOKUP($B3,Feuil1!$B:$Q,13,FALSE),\"\")=\"\",\"\",IF(VLOOKUP($B3,Feuil1!$B:$Q,3,FALSE)=12,VLOOKUP($B3,Feuil1!$B:$Q,13,FALSE),\"\"))","v":15},{"$f":"IF(IF(VLOOKUP($B3,Feuil1!$B:$Q,3,FALSE)=12,VLOOKUP($B3,Feuil1!$B:$Q,14,FALSE),\"\")=\"\",\"\",IF(VLOOKUP($B3,Feuil1!$B:$Q,3,FALSE)=12,VLOOKUP($B3,Feuil1!$B:$Q,14,FALSE),\"\"))","v":64},{"$f":"IF(IF(VLOOKUP($B3,Feuil1!$B:$Q,3,FALSE)=12,VLOOKUP($B3,Feuil1!$B:$Q,15,FALSE),\"\")=\"\",\"\",IF(VLOOKUP($B3,Feuil1!$B:$Q,3,FALSE)=12,VLOOKUP($B3,Feuil1!$B:$Q,15,FALSE),\"\"))","v":97},{"$f":"IF(IF(VLOOKUP($B3,Feuil1!$B:$Q,3,FALSE)=12,VLOOKUP($B3,Feuil1!$B:$Q,16,FALSE),\"\")=\"\",\"\",IF(VLOOKUP($B3,Feuil1!$B:$Q,3,FALSE)=12,VLOOKUP($B3,Feuil1!$B:$Q,16,FALSE),\"\"))","v":56}]
[null,{"$f":"Feuil1!B12","v":"12_Défaut_3Fournisseur_7"},{"$f":"IF(VLOOKUP($B4,Feuil1!$B:$Q,3,FALSE)=12,VLOOKUP($B4,Feuil1!$B:$Q,2,FALSE),\"\")","v":"Défaut_3"},{"$f":"IF(VLOOKUP($B4,Feuil1!$B:$Q,3,FALSE)=12,VLOOKUP($B4,Feuil1!$B:$Q,3,FALSE),\"\")","v":12},{"$f":"IF(VLOOKUP($B4,Feuil1!$B:$Q,3,FALSE)=12,VLOOKUP($B4,Feuil1!$B:$Q,4,FALSE),\"\")","v":"Fournisseur_7"},{"$f":"IF(IF(VLOOKUP($B4,Feuil1!$B:$Q,3,FALSE)=12,VLOOKUP($B4,Feuil1!$B:$Q,5,FALSE),\"\")=0,\"\",IF(VLOOKUP($B4,Feuil1!$B:$Q,3,FALSE)=12,VLOOKUP($B4,Feuil1!$B:$Q,5,FALSE)))","v":73},{"$f":"IF(IF(VLOOKUP($B4,Feuil1!$B:$Q,3,FALSE)=12,VLOOKUP($B4,Feuil1!$B:$Q,6,FALSE),\"\")=\"\",\"\",IF(VLOOKUP($B4,Feuil1!$B:$Q,3,FALSE)=12,VLOOKUP($B4,Feuil1!$B:$Q,6,FALSE)))","v":5},{"$f":"IF(IF(VLOOKUP($B4,Feuil1!$B:$Q,3,FALSE)=12,VLOOKUP($B4,Feuil1!$B:$Q,7,FALSE),\"\")=\"\",\"\",IF(VLOOKUP($B4,Feuil1!$B:$Q,3,FALSE)=12,VLOOKUP($B4,Feuil1!$B:$Q,7,FALSE)))","v":21},{"$f":"IF(IF(VLOOKUP($B4,Feuil1!$B:$Q,3,FALSE)=12,VLOOKUP($B4,Feuil1!$B:$Q,8,FALSE),\"\")=\"\",\"\",IF(VLOOKUP($B4,Feuil1!$B:$Q,3,FALSE)=12,VLOOKUP($B4,Feuil1!$B:$Q,8,FALSE)))","v":47},{"$f":"IF(IF(VLOOKUP($B4,Feuil1!$B:$Q,3,FALSE)=12,VLOOKUP($B4,Feuil1!$B:$Q,9,FALSE),\"\")=\"\",\"\",IF(VLOOKUP($B4,Feuil1!$B:$Q,3,FALSE)=12,VLOOKUP($B4,Feuil1!$B:$Q,9,FALSE)))","v":32},{"$f":"IF(IF(VLOOKUP($B4,Feuil1!$B:$Q,3,FALSE)=12,VLOOKUP($B4,Feuil1!$B:$Q,10,FALSE),\"\")=\"\",\"\",IF(VLOOKUP($B4,Feuil1!$B:$Q,3,FALSE)=12,VLOOKUP($B4,Feuil1!$B:$Q,10,FALSE)))","v":11},{"$f":"IF(IF(VLOOKUP($B4,Feuil1!$B:$Q,3,FALSE)=12,VLOOKUP($B4,Feuil1!$B:$Q,11,FALSE),\"\")=\"\",\"\",IF(VLOOKUP($B4,Feuil1!$B:$Q,3,FALSE)=12,VLOOKUP($B4,Feuil1!$B:$Q,11,FALSE),\"\"))","v":43},{"$f":"IF(IF(VLOOKUP($B4,Feuil1!$B:$Q,3,FALSE)=12,VLOOKUP($B4,Feuil1!$B:$Q,12,FALSE),\"\")=\"\",\"\",IF(VLOOKUP($B4,Feuil1!$B:$Q,3,FALSE)=12,VLOOKUP($B4,Feuil1!$B:$Q,12,FALSE),\"\"))","v":36},{"$f":"IF(IF(VLOOKUP($B4,Feuil1!$B:$Q,3,FALSE)=12,VLOOKUP($B4,Feuil1!$B:$Q,13,FALSE),\"\")=\"\",\"\",IF(VLOOKUP($B4,Feuil1!$B:$Q,3,FALSE)=12,VLOOKUP($B4,Feuil1!$B:$Q,13,FALSE),\"\"))","v":9},{"$f":"IF(IF(VLOOKUP($B4,Feuil1!$B:$Q,3,FALSE)=12,VLOOKUP($B4,Feuil1!$B:$Q,14,FALSE),\"\")=\"\",\"\",IF(VLOOKUP($B4,Feuil1!$B:$Q,3,FALSE)=12,VLOOKUP($B4,Feuil1!$B:$Q,14,FALSE),\"\"))","v":35},{"$f":"IF(IF(VLOOKUP($B4,Feuil1!$B:$Q,3,FALSE)=12,VLOOKUP($B4,Feuil1!$B:$Q,15,FALSE),\"\")=\"\",\"\",IF(VLOOKUP($B4,Feuil1!$B:$Q,3,FALSE)=12,VLOOKUP($B4,Feuil1!$B:$Q,15,FALSE),\"\"))","v":50},{"$f":"IF(IF(VLOOKUP($B4,Feuil1!$B:$Q,3,FALSE)=12,VLOOKUP($B4,Feuil1!$B:$Q,16,FALSE),\"\")=\"\",\"\",IF(VLOOKUP($B4,Feuil1!$B:$Q,3,FALSE)=12,VLOOKUP($B4,Feuil1!$B:$Q,16,FALSE),\"\"))","v":13}]
[null,{"$f":"Feuil1!B13","v":"12_Défaut_3Fournisseur_6"},{"$f":"IF(VLOOKUP($B5,Feuil1!$B:$Q,3,FALSE)=12,VLOOKUP($B5,Feuil1!$B:$Q,2,FALSE),\"\")","v":"Défaut_3"},{"$f":"IF(VLOOKUP($B5,Feuil1!$B:$Q,3,FALSE)=12,VLOOKUP($B5,Feuil1!$B:$Q,3,FALSE),\"\")","v":12},{"$f":"IF(VLOOKUP($B5,Feuil1!$B:$Q,3,FALSE)=12,VLOOKUP($B5,Feuil1!$B:$Q,4,FALSE),\"\")","v":"Fournisseur_6"},{"$f":"IF(IF(VLOOKUP($B5,Feuil1!$B:$Q,3,FALSE)=12,VLOOKUP($B5,Feuil1!$B:$Q,5,FALSE),\"\")=0,\"\",IF(VLOOKUP($B5,Feuil1!$B:$Q,3,FALSE)=12,VLOOKUP($B5,Feuil1!$B:$Q,5,FALSE)))","v":76},{"$f":"IF(IF(VLOOKUP($B5,Feuil1!$B:$Q,3,FALSE)=12,VLOOKUP($B5,Feuil1!$B:$Q,6,FALSE),\"\")=\"\",\"\",IF(VLOOKUP($B5,Feuil1!$B:$Q,3,FALSE)=12,VLOOKUP($B5,Feuil1!$B:$Q,6,FALSE)))","v":64},{"$f":"IF(IF(VLOOKUP($B5,Feuil1!$B:$Q,3,FALSE)=12,VLOOKUP($B5,Feuil1!$B:$Q,7,FALSE),\"\")=\"\",\"\",IF(VLOOKUP($B5,Feuil1!$B:$Q,3,FALSE)=12,VLOOKUP($B5,Feuil1!$B:$Q,7,FALSE)))","v":53},{"$f":"IF(IF(VLOOKUP($B5,Feuil1!$B:$Q,3,FALSE)=12,VLOOKUP($B5,Feuil1!$B:$Q,8,FALSE),\"\")=\"\",\"\",IF(VLOOKUP($B5,Feuil1!$B:$Q,3,FALSE)=12,VLOOKUP($B5,Feuil1!$B:$Q,8,FALSE)))","v":27},{"$f":"IF(IF(VLOOKUP($B5,Feuil1!$B:$Q,3,FALSE)=12,VLOOKUP($B5,Feuil1!$B:$Q,9,FALSE),\"\")=\"\",\"\",IF(VLOOKUP($B5,Feuil1!$B:$Q,3,FALSE)=12,VLOOKUP($B5,Feuil1!$B:$Q,9,FALSE)))","v":80},{"$f":"IF(IF(VLOOKUP($B5,Feuil1!$B:$Q,3,FALSE)=12,VLOOKUP($B5,Feuil1!$B:$Q,10,FALSE),\"\")=\"\",\"\",IF(VLOOKUP($B5,Feuil1!$B:$Q,3,FALSE)=12,VLOOKUP($B5,Feuil1!$B:$Q,10,FALSE)))","v":7},{"$f":"IF(IF(VLOOKUP($B5,Feuil1!$B:$Q,3,FALSE)=12,VLOOKUP($B5,Feuil1!$B:$Q,11,FALSE),\"\")=\"\",\"\",IF(VLOOKUP($B5,Feuil1!$B:$Q,3,FALSE)=12,VLOOKUP($B5,Feuil1!$B:$Q,11,FALSE),\"\"))","v":35},{"$f":"IF(IF(VLOOKUP($B5,Feuil1!$B:$Q,3,FALSE)=12,VLOOKUP($B5,Feuil1!$B:$Q,12,FALSE),\"\")=\"\",\"\",IF(VLOOKUP($B5,Feuil1!$B:$Q,3,FALSE)=12,VLOOKUP($B5,Feuil1!$B:$Q,12,FALSE),\"\"))","v":61},{"$f":"IF(IF(VLOOKUP($B5,Feuil1!$B:$Q,3,FALSE)=12,VLOOKUP($B5,Feuil1!$B:$Q,13,FALSE),\"\")=\"\",\"\",IF(VLOOKUP($B5,Feuil1!$B:$Q,3,FALSE)=12,VLOOKUP($B5,Feuil1!$B:$Q,13,FALSE),\"\"))","v":3},{"$f":"IF(IF(VLOOKUP($B5,Feuil1!$B:$Q,3,FALSE)=12,VLOOKUP($B5,Feuil1!$B:$Q,14,FALSE),\"\")=\"\",\"\",IF(VLOOKUP($B5,Feuil1!$B:$Q,3,FALSE)=12,VLOOKUP($B5,Feuil1!$B:$Q,14,FALSE),\"\"))","v":19},{"$f":"IF(IF(VLOOKUP($B5,Feuil1!$B:$Q,3,FALSE)=12,VLOOKUP($B5,Feuil1!$B:$Q,15,FALSE),\"\")=\"\",\"\",IF(VLOOKUP($B5,Feuil1!$B:$Q,3,FALSE)=12,VLOOKUP($B5,Feuil1!$B:$Q,15,FALSE),\"\"))","v":98},{"$f":"IF(IF(VLOOKUP($B5,Feuil1!$B:$Q,3,FALSE)=12,VLOOKUP($B5,Feuil1!$B:$Q,16,FALSE),\"\")=\"\",\"\",IF(VLOOKUP($B5,Feuil1!$B:$Q,3,FALSE)=12,VLOOKUP($B5,Feuil1!$B:$Q,16,FALSE),\"\"))","v":91}]
[null,{"$f":"Feuil1!B14","v":"12_Défaut_2Fournisseur_2"},{"$f":"IF(VLOOKUP($B6,Feuil1!$B:$Q,3,FALSE)=12,VLOOKUP($B6,Feuil1!$B:$Q,2,FALSE),\"\")","v":"Défaut_2"},{"$f":"IF(VLOOKUP($B6,Feuil1!$B:$Q,3,FALSE)=12,VLOOKUP($B6,Feuil1!$B:$Q,3,FALSE),\"\")","v":12},{"$f":"IF(VLOOKUP($B6,Feuil1!$B:$Q,3,FALSE)=12,VLOOKUP($B6,Feuil1!$B:$Q,4,FALSE),\"\")","v":"Fournisseur_2"},{"$f":"IF(IF(VLOOKUP($B6,Feuil1!$B:$Q,3,FALSE)=12,VLOOKUP($B6,Feuil1!$B:$Q,5,FALSE),\"\")=0,\"\",IF(VLOOKUP($B6,Feuil1!$B:$Q,3,FALSE)=12,VLOOKUP($B6,Feuil1!$B:$Q,5,FALSE)))","v":1},{"$f":"IF(IF(VLOOKUP($B6,Feuil1!$B:$Q,3,FALSE)=12,VLOOKUP($B6,Feuil1!$B:$Q,6,FALSE),\"\")=\"\",\"\",IF(VLOOKUP($B6,Feuil1!$B:$Q,3,FALSE)=12,VLOOKUP($B6,Feuil1!$B:$Q,6,FALSE)))","v":90},{"$f":"IF(IF(VLOOKUP($B6,Feuil1!$B:$Q,3,FALSE)=12,VLOOKUP($B6,Feuil1!$B:$Q,7,FALSE),\"\")=\"\",\"\",IF(VLOOKUP($B6,Feuil1!$B:$Q,3,FALSE)=12,VLOOKUP($B6,Feuil1!$B:$Q,7,FALSE)))","v":75},{"$f":"IF(IF(VLOOKUP($B6,Feuil1!$B:$Q,3,FALSE)=12,VLOOKUP($B6,Feuil1!$B:$Q,8,FALSE),\"\")=\"\",\"\",IF(VLOOKUP($B6,Feuil1!$B:$Q,3,FALSE)=12,VLOOKUP($B6,Feuil1!$B:$Q,8,FALSE)))","v":60},{"$f":"IF(IF(VLOOKUP($B6,Feuil1!$B:$Q,3,FALSE)=12,VLOOKUP($B6,Feuil1!$B:$Q,9,FALSE),\"\")=\"\",\"\",IF(VLOOKUP($B6,Feuil1!$B:$Q,3,FALSE)=12,VLOOKUP($B6,Feuil1!$B:$Q,9,FALSE)))","v":90},{"$f":"IF(IF(VLOOKUP($B6,Feuil1!$B:$Q,3,FALSE)=12,VLOOKUP($B6,Feuil1!$B:$Q,10,FALSE),\"\")=\"\",\"\",IF(VLOOKUP($B6,Feuil1!$B:$Q,3,FALSE)=12,VLOOKUP($B6,Feuil1!$B:$Q,10,FALSE)))","v":43},{"$f":"IF(IF(VLOOKUP($B6,Feuil1!$B:$Q,3,FALSE)=12,VLOOKUP($B6,Feuil1!$B:$Q,11,FALSE),\"\")=\"\",\"\",IF(VLOOKUP($B6,Feuil1!$B:$Q,3,FALSE)=12,VLOOKUP($B6,Feuil1!$B:$Q,11,FALSE),\"\"))","v":57},{"$f":"IF(IF(VLOOKUP($B6,Feuil1!$B:$Q,3,FALSE)=12,VLOOKUP($B6,Feuil1!$B:$Q,12,FALSE),\"\")=\"\",\"\",IF(VLOOKUP($B6,Feuil1!$B:$Q,3,FALSE)=12,VLOOKUP($B6,Feuil1!$B:$Q,12,FALSE),\"\"))","v":87},{"$f":"IF(IF(VLOOKUP($B6,Feuil1!$B:$Q,3,FALSE)=12,VLOOKUP($B6,Feuil1!$B:$Q,13,FALSE),\"\")=\"\",\"\",IF(VLOOKUP($B6,Feuil1!$B:$Q,3,FALSE)=12,VLOOKUP($B6,Feuil1!$B:$Q,13,FALSE),\"\"))","v":66},{"$f":"IF(IF(VLOOKUP($B6,Feuil1!$B:$Q,3,FALSE)=12,VLOOKUP($B6,Feuil1!$B:$Q,14,FALSE),\"\")=\"\",\"\",IF(VLOOKUP($B6,Feuil1!$B:$Q,3,FALSE)=12,VLOOKUP($B6,Feuil1!$B:$Q,14,FALSE),\"\"))","v":55},{"$f":"IF(IF(VLOOKUP($B6,Feuil1!$B:$Q,3,FALSE)=12,VLOOKUP($B6,Feuil1!$B:$Q,15,FALSE),\"\")=\"\",\"\",IF(VLOOKUP($B6,Feuil1!$B:$Q,3,FALSE)=12,VLOOKUP($B6,Feuil1!$B:$Q,15,FALSE),\"\"))","v":20},{"$f":"IF(IF(VLOOKUP($B6,Feuil1!$B:$Q,3,FALSE)=12,VLOOKUP($B6,Feuil1!$B:$Q,16,FALSE),\"\")=\"\",\"\",IF(VLOOKUP($B6,Feuil1!$B:$Q,3,FALSE)=12,VLOOKUP($B6,Feuil1!$B:$Q,16,FALSE),\"\"))","v":40}]
[null,{"$f":"Feuil1!B15","v":"12_Défaut_2Fournisseur_7"},{"$f":"IF(VLOOKUP($B7,Feuil1!$B:$Q,3,FALSE)=12,VLOOKUP($B7,Feuil1!$B:$Q,2,FALSE),\"\")","v":"Défaut_2"},{"$f":"IF(VLOOKUP($B7,Feuil1!$B:$Q,3,FALSE)=12,VLOOKUP($B7,Feuil1!$B:$Q,3,FALSE),\"\")","v":12},{"$f":"IF(VLOOKUP($B7,Feuil1!$B:$Q,3,FALSE)=12,VLOOKUP($B7,Feuil1!$B:$Q,4,FALSE),\"\")","v":"Fournisseur_7"},{"$f":"IF(IF(VLOOKUP($B7,Feuil1!$B:$Q,3,FALSE)=12,VLOOKUP($B7,Feuil1!$B:$Q,5,FALSE),\"\")=0,\"\",IF(VLOOKUP($B7,Feuil1!$B:$Q,3,FALSE)=12,VLOOKUP($B7,Feuil1!$B:$Q,5,FALSE)))","v":20},{"$f":"IF(IF(VLOOKUP($B7,Feuil1!$B:$Q,3,FALSE)=12,VLOOKUP($B7,Feuil1!$B:$Q,6,FALSE),\"\")=\"\",\"\",IF(VLOOKUP($B7,Feuil1!$B:$Q,3,FALSE)=12,VLOOKUP($B7,Feuil1!$B:$Q,6,FALSE)))","v":21},{"$f":"IF(IF(VLOOKUP($B7,Feuil1!$B:$Q,3,FALSE)=12,VLOOKUP($B7,Feuil1!$B:$Q,7,FALSE),\"\")=\"\",\"\",IF(VLOOKUP($B7,Feuil1!$B:$Q,3,FALSE)=12,VLOOKUP($B7,Feuil1!$B:$Q,7,FALSE)))","v":81},{"$f":"IF(IF(VLOOKUP($B7,Feuil1!$B:$Q,3,FALSE)=12,VLOOKUP($B7,Feuil1!$B:$Q,8,FALSE),\"\")=\"\",\"\",IF(VLOOKUP($B7,Feuil1!$B:$Q,3,FALSE)=12,VLOOKUP($B7,Feuil1!$B:$Q,8,FALSE)))","v":44},{"$f":"IF(IF(VLOOKUP($B7,Feuil1!$B:$Q,3,FALSE)=12,VLOOKUP($B7,Feuil1!$B:$Q,9,FALSE),\"\")=\"\",\"\",IF(VLOOKUP($B7,Feuil1!$B:$Q,3,FALSE)=12,VLOOKUP($B7,Feuil1!$B:$Q,9,FALSE)))","v":34},{"$f":"IF(IF(VLOOKUP($B7,Feuil1!$B:$Q,3,FALSE)=12,VLOOKUP($B7,Feuil1!$B:$Q,10,FALSE),\"\")=\"\",\"\",IF(VLOOKUP($B7,Feuil1!$B:$Q,3,FALSE)=12,VLOOKUP($B7,Feuil1!$B:$Q,10,FALSE)))","v":69},{"$f":"IF(IF(VLOOKUP($B7,Feuil1!$B:$Q,3,FALSE)=12,VLOOKUP($B7,Feuil1!$B:$Q,11,FALSE),\"\")=\"\",\"\",IF(VLOOKUP($B7,Feuil1!$B:$Q,3,FALSE)=12,VLOOKUP($B7,Feuil1!$B:$Q,11,FALSE),\"\"))","v":17},{"$f":"IF(IF(VLOOKUP($B7,Feuil1!$B:$Q,3,FALSE)=12,VLOOKUP($B7,Feuil1!$B:$Q,12,FALSE),\"\")=\"\",\"\",IF(VLOOKUP($B7,Feuil1!$B:$Q,3,FALSE)=12,VLOOKUP($B7,Feuil1!$B:$Q,12,FALSE),\"\"))","v":52},{"$f":"IF(IF(VLOOKUP($B7,Feuil1!$B:$Q,3,FALSE)=12,VLOOKUP($B7,Feuil1!$B:$Q,13,FALSE),\"\")=\"\",\"\",IF(VLOOKUP($B7,Feuil1!$B:$Q,3,FALSE)=12,VLOOKUP($B7,Feuil1!$B:$Q,13,FALSE),\"\"))","v":16},{"$f":"IF(IF(VLOOKUP($B7,Feuil1!$B:$Q,3,FALSE)=12,VLOOKUP($B7,Feuil1!$B:$Q,14,FALSE),\"\")=\"\",\"\",IF(VLOOKUP($B7,Feuil1!$B:$Q,3,FALSE)=12,VLOOKUP($B7,Feuil1!$B:$Q,14,FALSE),\"\"))","v":84},{"$f":"IF(IF(VLOOKUP($B7,Feuil1!$B:$Q,3,FALSE)=12,VLOOKUP($B7,Feuil1!$B:$Q,15,FALSE),\"\")=\"\",\"\",IF(VLOOKUP($B7,Feuil1!$B:$Q,3,FALSE)=12,VLOOKUP($B7,Feuil1!$B:$Q,15,FALSE),\"\"))","v":38},{"$f":"IF(IF(VLOOKUP($B7,Feuil1!$B:$Q,3,FALSE)=12,VLOOKUP($B7,Feuil1!$B:$Q,16,FALSE),\"\")=\"\",\"\",IF(VLOOKUP($B7,Feuil1!$B:$Q,3,FALSE)=12,VLOOKUP($B7,Feuil1!$B:$Q,16,FALSE),\"\"))","v":1}]
[null,{"$f":"Feuil1!B16","v":"12_Défaut_1Fournisseur_12"},{"$f":"IF(VLOOKUP($B8,Feuil1!$B:$Q,3,FALSE)=12,VLOOKUP($B8,Feuil1!$B:$Q,2,FALSE),\"\")","v":"Défaut_1"},{"$f":"IF(VLOOKUP($B8,Feuil1!$B:$Q,3,FALSE)=12,VLOOKUP($B8,Feuil1!$B:$Q,3,FALSE),\"\")","v":12},{"$f":"IF(VLOOKUP($B8,Feuil1!$B:$Q,3,FALSE)=12,VLOOKUP($B8,Feuil1!$B:$Q,4,FALSE),\"\")","v":"Fournisseur_12"},{"$f":"IF(IF(VLOOKUP($B8,Feuil1!$B:$Q,3,FALSE)=12,VLOOKUP($B8,Feuil1!$B:$Q,5,FALSE),\"\")=0,\"\",IF(VLOOKUP($B8,Feuil1!$B:$Q,3,FALSE)=12,VLOOKUP($B8,Feuil1!$B:$Q,5,FALSE)))","v":48},{"$f":"IF(IF(VLOOKUP($B8,Feuil1!$B:$Q,3,FALSE)=12,VLOOKUP($B8,Feuil1!$B:$Q,6,FALSE),\"\")=\"\",\"\",IF(VLOOKUP($B8,Feuil1!$B:$Q,3,FALSE)=12,VLOOKUP($B8,Feuil1!$B:$Q,6,FALSE)))","v":73},{"$f":"IF(IF(VLOOKUP($B8,Feuil1!$B:$Q,3,FALSE)=12,VLOOKUP($B8,Feuil1!$B:$Q,7,FALSE),\"\")=\"\",\"\",IF(VLOOKUP($B8,Feuil1!$B:$Q,3,FALSE)=12,VLOOKUP($B8,Feuil1!$B:$Q,7,FALSE)))","v":85},{"$f":"IF(IF(VLOOKUP($B8,Feuil1!$B:$Q,3,FALSE)=12,VLOOKUP($B8,Feuil1!$B:$Q,8,FALSE),\"\")=\"\",\"\",IF(VLOOKUP($B8,Feuil1!$B:$Q,3,FALSE)=12,VLOOKUP($B8,Feuil1!$B:$Q,8,FALSE)))","v":50},{"$f":"IF(IF(VLOOKUP($B8,Feuil1!$B:$Q,3,FALSE)=12,VLOOKUP($B8,Feuil1!$B:$Q,9,FALSE),\"\")=\"\",\"\",IF(VLOOKUP($B8,Feuil1!$B:$Q,3,FALSE)=12,VLOOKUP($B8,Feuil1!$B:$Q,9,FALSE)))","v":68},{"$f":"IF(IF(VLOOKUP($B8,Feuil1!$B:$Q,3,FALSE)=12,VLOOKUP($B8,Feuil1!$B:$Q,10,FALSE),\"\")=\"\",\"\",IF(VLOOKUP($B8,Feuil1!$B:$Q,3,FALSE)=12,VLOOKUP($B8,Feuil1!$B:$Q,10,FALSE)))","v":36},{"$f":"IF(IF(VLOOKUP($B8,Feuil1!$B:$Q,3,FALSE)=12,VLOOKUP($B8,Feuil1!$B:$Q,11,FALSE),\"\")=\"\",\"\",IF(VLOOKUP($B8,Feuil1!$B:$Q,3,FALSE)=12,VLOOKUP($B8,Feuil1!$B:$Q,11,FALSE),\"\"))","v":82},{"$f":"IF(IF(VLOOKUP($B8,Feuil1!$B:$Q,3,FALSE)=12,VLOOKUP($B8,Feuil1!$B:$Q,12,FALSE),\"\")=\"\",\"\",IF(VLOOKUP($B8,Feuil1!$B:$Q,3,FALSE)=12,VLOOKUP($B8,Feuil1!$B:$Q,12,FALSE),\"\"))","v":81},{"$f":"IF(IF(VLOOKUP($B8,Feuil1!$B:$Q,3,FALSE)=12,VLOOKUP($B8,Feuil1!$B:$Q,13,FALSE),\"\")=\"\",\"\",IF(VLOOKUP($B8,Feuil1!$B:$Q,3,FALSE)=12,VLOOKUP($B8,Feuil1!$B:$Q,13,FALSE),\"\"))","v":4},{"$f":"IF(IF(VLOOKUP($B8,Feuil1!$B:$Q,3,FALSE)=12,VLOOKUP($B8,Feuil1!$B:$Q,14,FALSE),\"\")=\"\",\"\",IF(VLOOKUP($B8,Feuil1!$B:$Q,3,FALSE)=12,VLOOKUP($B8,Feuil1!$B:$Q,14,FALSE),\"\"))","v":31},{"$f":"IF(IF(VLOOKUP($B8,Feuil1!$B:$Q,3,FALSE)=12,VLOOKUP($B8,Feuil1!$B:$Q,15,FALSE),\"\")=\"\",\"\",IF(VLOOKUP($B8,Feuil1!$B:$Q,3,FALSE)=12,VLOOKUP($B8,Feuil1!$B:$Q,15,FALSE),\"\"))","v":78},{"$f":"IF(IF(VLOOKUP($B8,Feuil1!$B:$Q,3,FALSE)=12,VLOOKUP($B8,Feuil1!$B:$Q,16,FALSE),\"\")=\"\",\"\",IF(VLOOKUP($B8,Feuil1!$B:$Q,3,FALSE)=12,VLOOKUP($B8,Feuil1!$B:$Q,16,FALSE),\"\"))","v":57}]
[null,{"$f":"Feuil1!B17","v":"12_Défaut_2Fournisseur_1"},{"$f":"IF(VLOOKUP($B9,Feuil1!$B:$Q,3,FALSE)=12,VLOOKUP($B9,Feuil1!$B:$Q,2,FALSE),\"\")","v":"Défaut_2"},{"$f":"IF(VLOOKUP($B9,Feuil1!$B:$Q,3,FALSE)=12,VLOOKUP($B9,Feuil1!$B:$Q,3,FALSE),\"\")","v":12},{"$f":"IF(VLOOKUP($B9,Feuil1!$B:$Q,3,FALSE)=12,VLOOKUP($B9,Feuil1!$B:$Q,4,FALSE),\"\")","v":"Fournisseur_1"},{"$f":"IF(IF(VLOOKUP($B9,Feuil1!$B:$Q,3,FALSE)=12,VLOOKUP($B9,Feuil1!$B:$Q,5,FALSE),\"\")=0,\"\",IF(VLOOKUP($B9,Feuil1!$B:$Q,3,FALSE)=12,VLOOKUP($B9,Feuil1!$B:$Q,5,FALSE)))","v":49},{"$f":"IF(IF(VLOOKUP($B9,Feuil1!$B:$Q,3,FALSE)=12,VLOOKUP($B9,Feuil1!$B:$Q,6,FALSE),\"\")=\"\",\"\",IF(VLOOKUP($B9,Feuil1!$B:$Q,3,FALSE)=12,VLOOKUP($B9,Feuil1!$B:$Q,6,FALSE)))","v":10},{"$f":"IF(IF(VLOOKUP($B9,Feuil1!$B:$Q,3,FALSE)=12,VLOOKUP($B9,Feuil1!$B:$Q,7,FALSE),\"\")=\"\",\"\",IF(VLOOKUP($B9,Feuil1!$B:$Q,3,FALSE)=12,VLOOKUP($B9,Feuil1!$B:$Q,7,FALSE)))","v":1},{"$f":"IF(IF(VLOOKUP($B9,Feuil1!$B:$Q,3,FALSE)=12,VLOOKUP($B9,Feuil1!$B:$Q,8,FALSE),\"\")=\"\",\"\",IF(VLOOKUP($B9,Feuil1!$B:$Q,3,FALSE)=12,VLOOKUP($B9,Feuil1!$B:$Q,8,FALSE)))","v":100},{"$f":"IF(IF(VLOOKUP($B9,Feuil1!$B:$Q,3,FALSE)=12,VLOOKUP($B9,Feuil1!$B:$Q,9,FALSE),\"\")=\"\",\"\",IF(VLOOKUP($B9,Feuil1!$B:$Q,3,FALSE)=12,VLOOKUP($B9,Feuil1!$B:$Q,9,FALSE)))","v":93},{"$f":"IF(IF(VLOOKUP($B9,Feuil1!$B:$Q,3,FALSE)=12,VLOOKUP($B9,Feuil1!$B:$Q,10,FALSE),\"\")=\"\",\"\",IF(VLOOKUP($B9,Feuil1!$B:$Q,3,FALSE)=12,VLOOKUP($B9,Feuil1!$B:$Q,10,FALSE)))","v":21},{"$f":"IF(IF(VLOOKUP($B9,Feuil1!$B:$Q,3,FALSE)=12,VLOOKUP($B9,Feuil1!$B:$Q,11,FALSE),\"\")=\"\",\"\",IF(VLOOKUP($B9,Feuil1!$B:$Q,3,FALSE)=12,VLOOKUP($B9,Feuil1!$B:$Q,11,FALSE),\"\"))","v":61},{"$f":"IF(IF(VLOOKUP($B9,Feuil1!$B:$Q,3,FALSE)=12,VLOOKUP($B9,Feuil1!$B:$Q,12,FALSE),\"\")=\"\",\"\",IF(VLOOKUP($B9,Feuil1!$B:$Q,3,FALSE)=12,VLOOKUP($B9,Feuil1!$B:$Q,12,FALSE),\"\"))","v":62},{"$f":"IF(IF(VLOOKUP($B9,Feuil1!$B:$Q,3,FALSE)=12,VLOOKUP($B9,Feuil1!$B:$Q,13,FALSE),\"\")=\"\",\"\",IF(VLOOKUP($B9,Feuil1!$B:$Q,3,FALSE)=12,VLOOKUP($B9,Feuil1!$B:$Q,13,FALSE),\"\"))","v":15},{"$f":"IF(IF(VLOOKUP($B9,Feuil1!$B:$Q,3,FALSE)=12,VLOOKUP($B9,Feuil1!$B:$Q,14,FALSE),\"\")=\"\",\"\",IF(VLOOKUP($B9,Feuil1!$B:$Q,3,FALSE)=12,VLOOKUP($B9,Feuil1!$B:$Q,14,FALSE),\"\"))","v":64},{"$f":"IF(IF(VLOOKUP($B9,Feuil1!$B:$Q,3,FALSE)=12,VLOOKUP($B9,Feuil1!$B:$Q,15,FALSE),\"\")=\"\",\"\",IF(VLOOKUP($B9,Feuil1!$B:$Q,3,FALSE)=12,VLOOKUP($B9,Feuil1!$B:$Q,15,FALSE),\"\"))","v":97},{"$f":"IF(IF(VLOOKUP($B9,Feuil1!$B:$Q,3,FALSE)=12,VLOOKUP($B9,Feuil1!$B:$Q,16,FALSE),\"\")=\"\",\"\",IF(VLOOKUP($B9,Feuil1!$B:$Q,3,FALSE)=12,VLOOKUP($B9,Feuil1!$B:$Q,16,FALSE),\"\"))","v":56}]
[null,{"$f":"Feuil1!B18","v":"12_Défaut_3Fournisseur_2"},{"$f":"IF(VLOOKUP($B10,Feuil1!$B:$Q,3,FALSE)=12,VLOOKUP($B10,Feuil1!$B:$Q,2,FALSE),\"\")","v":"Défaut_3"},{"$f":"IF(VLOOKUP($B10,Feuil1!$B:$Q,3,FALSE)=12,VLOOKUP($B10,Feuil1!$B:$Q,3,FALSE),\"\")","v":12},{"$f":"IF(VLOOKUP($B10,Feuil1!$B:$Q,3,FALSE)=12,VLOOKUP($B10,Feuil1!$B:$Q,4,FALSE),\"\")","v":"Fournisseur_2"},{"$f":"IF(IF(VLOOKUP($B10,Feuil1!$B:$Q,3,FALSE)=12,VLOOKUP($B10,Feuil1!$B:$Q,5,FALSE),\"\")=0,\"\",IF(VLOOKUP($B10,Feuil1!$B:$Q,3,FALSE)=12,VLOOKUP($B10,Feuil1!$B:$Q,5,FALSE)))","v":71},{"$f":"IF(IF(VLOOKUP($B10,Feuil1!$B:$Q,3,FALSE)=12,VLOOKUP($B10,Feuil1!$B:$Q,6,FALSE),\"\")=\"\",\"\",IF(VLOOKUP($B10,Feuil1!$B:$Q,3,FALSE)=12,VLOOKUP($B10,Feuil1!$B:$Q,6,FALSE)))","v":22},{"$f":"IF(IF(VLOOKUP($B10,Feuil1!$B:$Q,3,FALSE)=12,VLOOKUP($B10,Feuil1!$B:$Q,7,FALSE),\"\")=\"\",\"\",IF(VLOOKUP($B10,Feuil1!$B:$Q,3,FALSE)=12,VLOOKUP($B10,Feuil1!$B:$Q,7,FALSE)))","v":83},{"$f":"IF(IF(VLOOKUP($B10,Feuil1!$B:$Q,3,FALSE)=12,VLOOKUP($B10,Feuil1!$B:$Q,8,FALSE),\"\")=\"\",\"\",IF(VLOOKUP($B10,Feuil1!$B:$Q,3,FALSE)=12,VLOOKUP($B10,Feuil1!$B:$Q,8,FALSE)))","v":98},{"$f":"IF(IF(VLOOKUP($B10,Feuil1!$B:$Q,3,FALSE)=12,VLOOKUP($B10,Feuil1!$B:$Q,9,FALSE),\"\")=\"\",\"\",IF(VLOOKUP($B10,Feuil1!$B:$Q,3,FALSE)=12,VLOOKUP($B10,Feuil1!$B:$Q,9,FALSE)))","v":71},{"$f":"IF(IF(VLOOKUP($B10,Feuil1!$B:$Q,3,FALSE)=12,VLOOKUP($B10,Feuil1!$B:$Q,10,FALSE),\"\")=\"\",\"\",IF(VLOOKUP($B10,Feuil1!$B:$Q,3,FALSE)=12,VLOOKUP($B10,Feuil1!$B:$Q,10,FALSE)))","v":46},{"$f":"IF(IF(VLOOKUP($B10,Feuil1!$B:$Q,3,FALSE)=12,VLOOKUP($B10,Feuil1!$B:$Q,11,FALSE),\"\")=\"\",\"\",IF(VLOOKUP($B10,Feuil1!$B:$Q,3,FALSE)=12,VLOOKUP($B10,Feuil1!$B:$Q,11,FALSE),\"\"))","v":12},{"$f":"IF(IF(VLOOKUP($B10,Feuil1!$B:$Q,3,FALSE)=12,VLOOKUP($B10,Feuil1!$B:$Q,12,FALSE),\"\")=\"\",\"\",IF(VLOOKUP($B10,Feuil1!$B:$Q,3,FALSE)=12,VLOOKUP($B10,Feuil1!$B:$Q,12,FALSE),\"\"))","v":44},{"$f":"IF(IF(VLOOKUP($B10,Feuil1!$B:$Q,3,FALSE)=12,VLOOKUP($B10,Feuil1!$B:$Q,13,FALSE),\"\")=\"\",\"\",IF(VLOOKUP($B10,Feuil1!$B:$Q,3,FALSE)=12,VLOOKUP($B10,Feuil1!$B:$Q,13,FALSE),\"\"))","v":41},{"$f":"IF(IF(VLOOKUP($B10,Feuil1!$B:$Q,3,FALSE)=12,VLOOKUP($B10,Feuil1!$B:$Q,14,FALSE),\"\")=\"\",\"\",IF(VLOOKUP($B10,Feuil1!$B:$Q,3,FALSE)=12,VLOOKUP($B10,Feuil1!$B:$Q,14,FALSE),\"\"))","v":37},{"$f":"IF(IF(VLOOKUP($B10,Feuil1!$B:$Q,3,FALSE)=12,VLOOKUP($B10,Feuil1!$B:$Q,15,FALSE),\"\")=\"\",\"\",IF(VLOOKUP($B10,Feuil1!$B:$Q,3,FALSE)=12,VLOOKUP($B10,Feuil1!$B:$Q,15,FALSE),\"\"))","v":42},{"$f":"IF(IF(VLOOKUP($B10,Feuil1!$B:$Q,3,FALSE)=12,VLOOKUP($B10,Feuil1!$B:$Q,16,FALSE),\"\")=\"\",\"\",IF(VLOOKUP($B10,Feuil1!$B:$Q,3,FALSE)=12,VLOOKUP($B10,Feuil1!$B:$Q,16,FALSE),\"\"))","v":46}]
{"$rows_left_out":30}