{"text_format":"1","workbook":"xlsx","n_sheets":8,"sheets":["Accueil","Entrées","Sorties","Stock","Récap","Base","Feuil1","CdC"],"not_rendered":{"charts":0,"images":0,"macros":1,"external_links":0,"defined_names":12,"comments":0,"pivot_tables":0},"unopened":[],"bounds":{"document_bytes":16777216,"sheet_cells":100000,"rows_first":2000,"rows_last":500,"rows_between":2000,"halvings":0,"cell_chars":16384,"cell_head_chars":4096},"cells_cut":0,"cells_raw":0,"read":"whole","date_system":"1900"}

{"sheet":"Accueil","index":0,"n_rows":16,"n_cols":22,"rows_kept":16,"cut":false,"hidden":false,"merged":[]}
[]
[]
[]
[]
[null,null,null,null,null,null,null,null,null,null,null,null,null,null,null,null,null,null,null,null,null,"10"]
[]
[]
[]
[]
[]
[]
[]
[]
[]
["Identifiant=admin"]
["mot de passe=****"]

{"sheet":"Entrées","index":1,"n_rows":1170,"n_cols":9,"rows_kept":1170,"cut":false,"hidden":false,"merged":[[0,0,0,7]]}
["ENTREES",null,null,null,null,null,null,null,1]
["Date_Entrée","Référence Produit","Famille","Désignation","Qté ","Fournisseur","Prix","Commentaires",{"$f":"I1+1","v":2}]
["10/11/2016","IZ029702B",null,null,5]
["10/11/2016","IZ028802D",null,null,5]
["10/11/2016","IZ028802C",null,null,5]
["10/11/2016","IZ028102B",null,null,3]
["10/11/2016","IZ028102A",null,null,4]
["10/11/2016","IZ41007AR",null,null,10]
["10/11/2016","IZ41007AL",null,null,10]
["10/11/2016","IZ028809B",null,null,10]
["10/11/2016","IZ028809A",null,null,10]
["10/11/2016","IZ029709B",null,null,10]
["10/11/2016","IZ029709A",null,null,10]
["10/11/2016","20IZ400238",null,null,5]
["10/11/2016","IZ028806B",null,null,5]
["10/11/2016","IZ028806A",null,null,5]
["10/11/2016","IZ029906B",null,null,5]
["10/11/2016","IZ029906A",null,null,10]
["10/11/2016",8970438802,null,null,5]
["10/11/2016",8971103140,null,null,5]
["10/11/2016","278-97308868",null,null,4]
["10/11/2016",27894226829,null,null,6]
["10/11/2016",20897387346,null,null,2]
["10/11/2016","208094318910",null,null,20]
["10/11/2016",20587810146,null,null,30]
["10/11/2016","2080PG405",null,null,20]
["10/11/2016",2039405,null,null,5]
["10/11/2016","20YT-7216DC",null,null,6]
["10/11/2016","20TH2088D",null,null,10]
["10/11/2016",1594171,null,null,100]
["10/11/2016","27RD01069D",null,null,10]
["10/11/2016","RD02127R",null,null,3]
["10/11/2016","RD12057",null,null,10]
["10/11/2016","RD05008",null,null,10]
["10/11/2016","RD05007",null,null,5]
["10/11/2016","RD02069",null,null,10]
["10/11/2016","RD01146",null,null,4]
["10/11/2016","RD01101",null,null,4]
["10/11/2016","RD01097",null,null,2]
["10/11/2016","RD01095",null,null,2]
["10/11/2016","RD01090",null,null,10]
["10/11/2016","RD01086",null,null,20]
["10/11/2016","RD01077",null,null,5]
["10/11/2016","MG06-01054",null,null,20]
["10/11/2016","MG06-01039",null,null,20]
["10/11/2016","MG06-01037",null,null,10]
["10/11/2016","MG06-01036",null,null,10]
["10/11/2016","MG06-01014",null,null,10]
["10/11/2016","MG06-01013",null,null,20]
["10/11/2016","MG05-01095",null,null,50]
["10/11/2016","MG05-01087",null,null,15]
["10/11/2016","MG05-01032",null,null,10]
["10/11/2016","MG05-01025",null,null,5]
["10/11/2016","MG05-01001",null,null,5]
["10/11/2016","MG04-01271",null,null,10]
["10/11/2016","MG04-01191",null,null,20]
["10/11/2016","MG04-01174",null,null,25]
["10/11/2016","MG04-01131",null,null,30]
["10/11/2016","MG04-01082",null,null,10]
["10/11/2016","MG04-01064",null,null,5]
{"$rows_left_out":1111}
{"sheet":"Sorties","index":2,"n_rows":210,"n_cols":7,"rows_kept":210,"cut":false,"hidden":false,"merged":[[0,0,0,3]]}
["SORTIES",null,null,null,1]
["Référence Produit","Date_Sortie","Qté livrée","Commentaires",{"$f":"E1+1","v":2}]
["JAK4225100","2016-11-23",3,null,null,null,{"$f":"ISNUMBER(Date_S)","v":true}]
["224018760R","2016-11-23",20]
[27935,"2016-11-23",2]
["BJ-513","2016-11-23",1]
["MG02-09050","2016-11-23",2]
["BJ-513","2016-11-23",1]
["8-94165177","2016-11-23",1]
["B086","2016-11-23",10]
["ARCEBMIM140-0,50","2016-11-23",1]
["8-94165177","2016-11-23",1]
["B049","2016-11-23",2]
[7700500168,"2016-11-23",10]
["213-1609 LH","2016-11-23",1]
["213-1609 RH","2016-11-23",1]
["MG05-01001","2016-11-23",5]
["MG02-02048","2016-11-23",4]
["CLE-16MM","2016-11-23",3]
["CLE-21MM","2016-11-23",3]
["8-94113-583-0","2016-11-23",2]
["MG02-02043","2016-11-23",2]
[2712600,"2016-11-23",2]
["BGA-SILIC","2016-11-23",4]
["I115","2016-11-23",10]
["MI16","2016-11-23",2]
[10310,"2016-11-23",2]
["B076","2016-11-23",10]
["D4267","2016-11-23",5]
[8971103140,"2016-11-23",1]
["8-97035085","2016-11-23",1]
["MD050212","2016-11-23",10]
["MR534949","2016-11-23",1]
["8-94112-625BGF","2016-11-23",1]
["I138","2016-11-23",4]
["12649/10","2016-11-23",2]
["48548/10","2016-11-23",2]
["62246A","2016-11-23",1]
["F029","2016-11-23",2]
["F030","2016-11-23",2]
["F024","2016-11-23",2]
["B077","2016-11-23",10]
["B105","2016-11-23",10]
["PA-373AF","2016-11-23",2]
["B077","2016-11-23",10]
["UB93-41-400-353","2016-11-23",2]
["KK-13010","2016-11-23",1]
["D002","2016-11-23",2]
["S9YC","2016-11-23",2]
["8-94155314","2016-11-23",1]
["U941","2016-11-23",1]
["5FP-A0083","2016-11-23",1]
["M002T87271ZT","2016-11-23",1]
["F029","2016-11-23",2]
["F024","2016-11-23",2]
["MI16","2016-11-23",1]
["B106","2016-11-23",10]
["ISU045L","2016-11-23",1]
["B077","2016-11-23",30]
["B128","2016-11-23",10]
{"$rows_left_out":151}
{"sheet":"Stock","index":3,"n_rows":1020,"n_cols":2,"rows_kept":1020,"cut":false,"hidden":false,"merged":[[0,0,0,1]]}
[{"$f":"\"STOCKS de l'ANNEE: \" &Base!P1","v":"STOCKS de l'ANNEE: 2016"}]
["Référence Produit","Stock Actuel"]
["IZ028802C",{"$f":"VLOOKUP(A3,Récap!$A$4:$AB$1979,28,FALSE)","v":5}]
["IZ028802D",{"$f":"VLOOKUP(A4,Récap!$A$4:$AB$1979,28,FALSE)","v":5}]
["IZ029702A",{"$f":"VLOOKUP(A5,Récap!$A$4:$AB$1979,28,FALSE)","v":5}]
["IZ029702B",{"$f":"VLOOKUP(A6,Récap!$A$4:$AB$1979,28,FALSE)","v":5}]
["IZ020202AR",4]
["IZ020602AL",{"$f":"VLOOKUP(A8,Récap!$A$4:$AB$1979,28,FALSE)","v":4}]
["IZ020202AL",{"$f":"VLOOKUP(A9,Récap!$A$4:$AB$1979,28,FALSE)","v":1}]
["IZ020602AR",{"$f":"VLOOKUP(A10,Récap!$A$4:$AB$1979,28,FALSE)","v":2}]
[" IZ020602EL",{"$f":"VLOOKUP(A11,Récap!$A$4:$AB$1979,28,FALSE)","v":2}]
["IZ020602ER",{"$f":"VLOOKUP(A12,Récap!$A$4:$AB$1979,28,FALSE)","v":2}]
["IZ020214A",{"$f":"VLOOKUP(A13,Récap!$A$4:$AB$1979,28,FALSE)","v":0}]
["IZ020614A",{"$f":"VLOOKUP(A14,Récap!$A$4:$AB$1979,28,FALSE)","v":1}]
["IZ028114B",{"$f":"VLOOKUP(A15,Récap!$A$4:$AB$1979,28,FALSE)","v":1}]
["897367044-0296",{"$f":"VLOOKUP(A16,Récap!$A$4:$AB$1979,28,FALSE)","v":2}]
[8972358672,{"$f":"VLOOKUP(A17,Récap!$A$4:$AB$1979,28,FALSE)","v":1}]
["IZ028812C",{"$f":"VLOOKUP(A18,Récap!$A$4:$AB$1979,28,FALSE)","v":2}]
["IZ028812D",{"$f":"VLOOKUP(A19,Récap!$A$4:$AB$1979,28,FALSE)","v":1}]
["IZ028812A",{"$f":"VLOOKUP(A20,Récap!$A$4:$AB$1979,28,FALSE)","v":1}]
["IZ028812B",{"$f":"VLOOKUP(A21,Récap!$A$4:$AB$1979,28,FALSE)","v":1}]
["IZ020212AL",{"$f":"VLOOKUP(A22,Récap!$A$4:$AB$1979,28,FALSE)","v":1}]
["IZ020212AR",{"$f":"VLOOKUP(A23,Récap!$A$4:$AB$1979,28,FALSE)","v":1}]
[20897387346,{"$f":"VLOOKUP(A24,Récap!$A$4:$AB$1979,28,FALSE)","v":2}]
["278-97308868",{"$f":"VLOOKUP(A25,Récap!$A$4:$AB$1979,28,FALSE)","v":4}]
[27894226829,{"$f":"VLOOKUP(A26,Récap!$A$4:$AB$1979,28,FALSE)","v":6}]
[8971103140,{"$f":"VLOOKUP(A27,Récap!$A$4:$AB$1979,28,FALSE)","v":4}]
[8970438802,{"$f":"VLOOKUP(A28,Récap!$A$4:$AB$1979,28,FALSE)","v":5}]
["IZ029906A",{"$f":"VLOOKUP(A29,Récap!$A$4:$AB$1979,28,FALSE)","v":10}]
["IZ029906B",{"$f":"VLOOKUP(A30,Récap!$A$4:$AB$1979,28,FALSE)","v":5}]
["IZ028806A",{"$f":"VLOOKUP(A31,Récap!$A$4:$AB$1979,28,FALSE)","v":5}]
["IZ028806B",{"$f":"VLOOKUP(A32,Récap!$A$4:$AB$1979,28,FALSE)","v":5}]
["20IZ400238",{"$f":"VLOOKUP(A33,Récap!$A$4:$AB$1979,28,FALSE)","v":5}]
["IZ029709A",{"$f":"VLOOKUP(A34,Récap!$A$4:$AB$1979,28,FALSE)","v":10}]
["IZ029709B",{"$f":"VLOOKUP(A35,Récap!$A$4:$AB$1979,28,FALSE)","v":10}]
["IZ028809A",{"$f":"VLOOKUP(A36,Récap!$A$4:$AB$1979,28,FALSE)","v":10}]
["IZ028809B",{"$f":"VLOOKUP(A37,Récap!$A$4:$AB$1979,28,FALSE)","v":10}]
["IZ41007AL",{"$f":"VLOOKUP(A38,Récap!$A$4:$AB$1979,28,FALSE)","v":10}]
["IZ41007AR",{"$f":"VLOOKUP(A39,Récap!$A$4:$AB$1979,28,FALSE)","v":10}]
["IZ028102A",{"$f":"VLOOKUP(A40,Récap!$A$4:$AB$1979,28,FALSE)","v":4}]
["IZ028102B",{"$f":"VLOOKUP(A41,Récap!$A$4:$AB$1979,28,FALSE)","v":3}]
["RD01090",{"$f":"VLOOKUP(A42,Récap!$A$4:$AB$1979,28,FALSE)","v":10}]
["RD01095",{"$f":"VLOOKUP(A43,Récap!$A$4:$AB$1979,28,FALSE)","v":2}]
["RD01097",{"$f":"VLOOKUP(A44,Récap!$A$4:$AB$1979,28,FALSE)","v":2}]
["RD01101",{"$f":"VLOOKUP(A45,Récap!$A$4:$AB$1979,28,FALSE)","v":4}]
["RD01146",{"$f":"VLOOKUP(A46,Récap!$A$4:$AB$1979,28,FALSE)","v":4}]
["RD02069",{"$f":"VLOOKUP(A47,Récap!$A$4:$AB$1979,28,FALSE)","v":10}]
["RD05007",{"$f":"VLOOKUP(A48,Récap!$A$4:$AB$1979,28,FALSE)","v":5}]
["RD05008",{"$f":"VLOOKUP(A49,Récap!$A$4:$AB$1979,28,FALSE)","v":10}]
["RD12057",{"$f":"VLOOKUP(A50,Récap!$A$4:$AB$1979,28,FALSE)","v":10}]
["RD02127R",{"$f":"VLOOKUP(A51,Récap!$A$4:$AB$1979,28,FALSE)","v":3}]
["27RD01069D",{"$f":"VLOOKUP(A52,Récap!$A$4:$AB$1979,28,FALSE)","v":10}]
[1594171,{"$f":"VLOOKUP(A53,Récap!$A$4:$AB$1979,28,FALSE)","v":100}]
["20TH2088D",{"$f":"VLOOKUP(A54,Récap!$A$4:$AB$1979,28,FALSE)","v":10}]
["20YT-7216DC",{"$f":"VLOOKUP(A55,Récap!$A$4:$AB$1979,28,FALSE)","v":6}]
[2039405,{"$f":"VLOOKUP(A56,Récap!$A$4:$AB$1979,28,FALSE)","v":5}]
["2080PG405",{"$f":"VLOOKUP(A57,Récap!$A$4:$AB$1979,28,FALSE)","v":20}]
[20587810146,{"$f":"VLOOKUP(A58,Récap!$A$4:$AB$1979,28,FALSE)","v":31}]
["208094318910",{"$f":"VLOOKUP(A59,Récap!$A$4:$AB$1979,28,FALSE)","v":20}]
["MG04-01131",{"$f":"VLOOKUP(A60,Récap!$A$4:$AB$1979,28,FALSE)","v":30}]
{"$rows_left_out":961}
{"sheet":"Récap","index":4,"n_rows":1125,"n_cols":28,"rows_kept":1125,"cut":false,"hidden":false,"merged":[[1,25,1,27],[0,0,0,24],[1,13,1,14],[1,15,1,16],[1,17,1,18],[1,19,1,20],[1,21,1,22],[1,23,1,24],[1,1,1,2],[1,3,1,4],[1,5,1,6],[1,7,1,8],[1,9,1,10],[1,11,1,12]]}
[{"$f":"\"Récapitulatif Entrées et Sorties des Produits par mois pour l'ANNEE: \" &Base!P1","v":"Récapitulatif Entrées et Sorties des Produits par mois pour l'ANNEE: 2016"}]
["essai","JANVIER",null,"FEVRIER",null,"MARS",null,"AVRIL",null,"MAI",null,"JUIN",null,"JUILLET",null,"AOUT",null,"SEPTEMBRE",null,"OCTOBRE",null,"NOVEMBRE",null,"décembre",null,"TOTAUX"]
["Références produits","IN","OUT","IN","OUT","IN","OUT","IN","OUT","IN","OUT","IN","OUT","IN","OUT","IN","OUT","IN","OUT","IN","OUT","IN","OUT","IN ","OUT","IN","OUT","Rest_Réel"]
["IZ028802C",null,null,null,null,null,null,null,null,null,null,null,null,null,null,null,null,null,null,null,null,5,0,0,0,{"$f":"IF(A4=\"\",\"\",SUM(B4,D4,F4,H4,J4,L4,N4,P4,R4,T4,V4,X4))","v":5},{"$f":"IF(A4=\"\",\"\",SUM(C4,E4,G4,I4,K4,M4,O4,Q4,S4,U4,W4,Y4))","v":0},{"$f":"IF(A4=\"\",\"\",Z4-AA4)","v":5}]
["IZ028802D",null,null,null,null,null,null,null,null,null,null,null,null,null,null,null,null,null,null,null,null,5,0,0,0,{"$f":"IF(A5=\"\",\"\",SUM(B5,D5,F5,H5,J5,L5,N5,P5,R5,T5,V5,X5))","v":5},{"$f":"IF(A5=\"\",\"\",SUM(C5,E5,G5,I5,K5,M5,O5,Q5,S5,U5,W5,Y5))","v":0},{"$f":"IF(A5=\"\",\"\",Z5-AA5)","v":5}]
["IZ029702A",null,null,null,null,null,null,null,null,null,null,null,null,null,null,null,null,null,null,null,null,5,0,0,0,5,0,5]
["IZ029702B",null,null,null,null,null,null,null,null,null,null,null,null,null,null,null,null,null,null,null,null,5,0,0,0,5,0,5]
["IZ020202AR",null,null,null,null,null,null,null,null,null,null,null,null,null,null,null,null,null,null,null,null,5,0,0,1,5,1,4]
["IZ020602AL",null,null,null,null,null,null,null,null,null,null,null,null,null,null,null,null,null,null,null,null,4,0,0,0,4,0,4]
["IZ020202AL",null,null,null,null,null,null,null,null,null,null,null,null,null,null,null,null,null,null,null,null,2,1,0,0,2,1,1]
["IZ020602AR",null,null,null,null,null,null,null,null,null,null,null,null,null,null,null,null,null,null,null,null,2,0,0,0,2,0,2]
[" IZ020602EL",null,null,null,null,null,null,null,null,null,null,null,null,null,null,null,null,null,null,null,null,2,0,0,0,2,0,2]
["IZ020602ER",null,null,null,null,null,null,null,null,null,null,null,null,null,null,null,null,null,null,null,null,2,0,0,0,2,0,2]
["IZ020214A",null,null,null,null,null,null,null,null,null,null,null,null,null,null,null,null,null,null,null,null,0,0,0,0,0,0,0]
["IZ020614A",null,null,null,null,null,null,null,null,null,null,null,null,null,null,null,null,null,null,null,null,1,0,0,0,1,0,1]
["IZ028114B",null,null,null,null,null,null,null,null,null,null,null,null,null,null,null,null,null,null,null,null,1,0,0,0,1,0,1]
["897367044-0296",null,null,null,null,null,null,null,null,null,null,null,null,null,null,null,null,null,null,null,null,2,0,0,0,2,0,2]
[8972358672,null,null,null,null,null,null,null,null,null,null,null,null,null,null,null,null,null,null,null,null,1,0,0,0,1,0,1]
["IZ028812C",null,null,null,null,null,null,null,null,null,null,null,null,null,null,null,null,null,null,null,null,2,0,0,0,2,0,2]
["IZ028812D",null,null,null,null,null,null,null,null,null,null,null,null,null,null,null,null,null,null,null,null,1,0,0,0,1,0,1]
["IZ028812A",null,null,null,null,null,null,null,null,null,null,null,null,null,null,null,null,null,null,null,null,1,0,0,0,1,0,1]
["IZ028812B",null,null,null,null,null,null,null,null,null,null,null,null,null,null,null,null,null,null,null,null,1,0,0,0,1,0,1]
["IZ020212AL",null,null,null,null,null,null,null,null,null,null,null,null,null,null,null,null,null,null,null,null,1,0,0,0,1,0,1]
["IZ020212AR",null,null,null,null,null,null,null,null,null,null,null,null,null,null,null,null,null,null,null,null,1,0,0,0,1,0,1]
[20897387346,null,null,null,null,null,null,null,null,null,null,null,null,null,null,null,null,null,null,null,null,2,0,0,0,2,0,2]
["278-97308868",null,null,null,null,null,null,null,null,null,null,null,null,null,null,null,null,null,null,null,null,4,0,0,0,4,0,4]
[27894226829,null,null,null,null,null,null,null,null,null,null,null,null,null,null,null,null,null,null,null,null,6,0,0,0,6,0,6]
[8971103140,null,null,null,null,null,null,null,null,null,null,null,null,null,null,null,null,null,null,null,null,5,1,0,0,5,1,4]
[8970438802,null,null,null,null,null,null,null,null,null,null,null,null,null,null,null,null,null,null,null,null,5,0,0,0,5,0,5]
["IZ029906A",null,null,null,null,null,null,null,null,null,null,null,null,null,null,null,null,null,null,null,null,10,0,0,0,10,0,10]
["IZ029906B",null,null,null,null,null,null,null,null,null,null,null,null,null,null,null,null,null,null,null,null,5,0,0,0,5,0,5]
["IZ028806A",null,null,null,null,null,null,null,null,null,null,null,null,null,null,null,null,null,null,null,null,5,0,0,0,5,0,5]
["IZ028806B",null,null,null,null,null,null,null,null,null,null,null,null,null,null,null,null,null,null,null,null,5,0,0,0,5,0,5]
["20IZ400238",null,null,null,null,null,null,null,null,null,null,null,null,null,null,null,null,null,null,null,null,5,0,0,0,5,0,5]
["IZ029709A",null,null,null,null,null,null,null,null,null,null,null,null,null,null,null,null,null,null,null,null,10,0,0,0,10,0,10]
["IZ029709B",null,null,null,null,null,null,null,null,null,null,null,null,null,null,null,null,null,null,null,null,10,0,0,0,10,0,10]
["IZ028809A",null,null,null,null,null,null,null,null,null,null,null,null,null,null,null,null,null,null,null,null,10,0,0,0,10,0,10]
["IZ028809B",null,null,null,null,null,null,null,null,null,null,null,null,null,null,null,null,null,null,null,null,10,0,0,0,10,0,10]
["IZ41007AL",null,null,null,null,null,null,null,null,null,null,null,null,null,null,null,null,null,null,null,null,10,0,0,0,10,0,10]
["IZ41007AR",null,null,null,null,null,null,null,null,null,null,null,null,null,null,null,null,null,null,null,null,10,0,0,0,10,0,10]
["IZ028102A",null,null,null,null,null,null,null,null,null,null,null,null,null,null,null,null,null,null,null,null,4,0,0,0,4,0,4]
["IZ028102B",null,null,null,null,null,null,null,null,null,null,null,null,null,null,null,null,null,null,null,null,3,0,0,0,3,0,3]
["RD01090",null,null,null,null,null,null,null,null,null,null,null,null,null,null,null,null,null,null,null,null,10,0,0,0,10,0,10]
["RD01095",null,null,null,null,null,null,null,null,null,null,null,null,null,null,null,null,null,null,null,null,2,0,0,0,2,0,2]
["RD01097",null,null,null,null,null,null,null,null,null,null,null,null,null,null,null,null,null,null,null,null,2,0,0,0,2,0,2]
["RD01101",null,null,null,null,null,null,null,null,null,null,null,null,null,null,null,null,null,null,null,null,4,0,0,0,4,0,4]
["RD01146",null,null,null,null,null,null,null,null,null,null,null,null,null,null,null,null,null,null,null,null,4,0,0,0,4,0,4]
["RD02069",null,null,null,null,null,null,null,null,null,null,null,null,null,null,null,null,null,null,null,null,10,0,0,0,10,0,10]
["RD05007",null,null,null,null,null,null,null,null,null,null,null,null,null,null,null,null,null,null,null,null,5,0,0,0,5,0,5]
["RD05008",null,null,null,null,null,null,null,null,null,null,null,null,null,null,null,null,null,null,null,null,10,0,0,0,10,0,10]
["RD12057",null,null,null,null,null,null,null,null,null,null,null,null,null,null,null,null,null,null,null,null,10,0,0,0,10,0,10]
["RD02127R",null,null,null,null,null,null,null,null,null,null,null,null,null,null,null,null,null,null,null,null,3,0,0,0,3,0,3]
["27RD01069D",null,null,null,null,null,null,null,null,null,null,null,null,null,null,null,null,null,null,null,null,10,0,0,0,10,0,10]
[1594171,null,null,null,null,null,null,null,null,null,null,null,null,null,null,null,null,null,null,null,null,100,0,0,0,100,0,100]
["20TH2088D",null,null,null,null,null,null,null,null,null,null,null,null,null,null,null,null,null,null,null,null,10,0,0,0,10,0,10]
["20YT-7216DC",null,null,null,null,null,null,null,null,null,null,null,null,null,null,null,null,null,null,null,null,6,0,0,0,6,0,6]
[2039405,null,null,null,null,null,null,null,null,null,null,null,null,null,null,null,null,null,null,null,null,5,0,0,0,5,0,5]
["2080PG405",null,null,null,null,null,null,null,null,null,null,null,null,null,null,null,null,null,null,null,null,20,0,0,0,20,0,20]
[20587810146,null,null,null,null,null,null,null,null,null,null,null,null,null,null,null,null,null,null,null,null,31,0,0,0,31,0,31]
["208094318910",null,null,null,null,null,null,null,null,null,null,null,null,null,null,null,null,null,null,null,null,20,0,0,0,20,0,20]
{"$rows_left_out":1066}
{"sheet":"Base","index":5,"n_rows":1019,"n_cols":16,"rows_kept":1019,"cut":false,"hidden":false,"merged":[[4,6,11,6]]}
["Référence Produits","Famille","Désignation","Fournisseur","prix",null,null,null,null,null,"utilisateur","mdp",null,null,null,2016]
["IZ028802C",null,"a",null,null,null,null,null,null,null,"admin","****",null,null,null,2016]
["IZ029702A",null,"aa"]
["IZ020602AR",null,"Aaacb"]
["IZ029702B",null,"aab",null,null,null,"A utiliser uniquement si vous avez rajouté de nouvelles Références Produits en Col C"]
["IZ020202AR",null,"aabb"]
["IZ020202AL",null,"aabc"]
["IZ028802D",null,"ab"]
["IZ020602AL",null,"AB"]
[" IZ020602EL"]
["IZ020602ER"]
["IZ020214A"]
["IZ020614A"]
["IZ028114B"]
["897367044-0296"]
[8972358672]
["IZ028812C"]
["IZ028812D"]
["IZ028812A"]
["IZ028812B"]
["IZ020212AL"]
["IZ020212AR"]
[20897387346]
["278-97308868",null,"z"]
[27894226829,null,"zz"]
[8971103140,null,"az"]
[8970438802,null,"abz"]
["IZ029906A"]
["IZ029906B"]
["IZ028806A"]
["IZ028806B"]
["20IZ400238"]
["IZ029709A"]
["IZ029709B"]
["IZ028809A"]
["IZ028809B"]
["IZ41007AL"]
["IZ41007AR"]
["IZ028102A"]
["IZ028102B"]
["RD01090"]
["RD01095"]
["RD01097"]
["RD01101"]
["RD01146"]
["RD02069"]
["RD05007"]
["RD05008"]
["RD12057"]
["RD02127R"]
["27RD01069D"]
[1594171]
["20TH2088D"]
["20YT-7216DC"]
[2039405]
["2080PG405"]
[20587810146]
["208094318910"]
["MG04-01131"]
["MG04-01174"]
{"$rows_left_out":960}
{"sheet":"Feuil1","index":6,"n_rows":999,"n_cols":1,"rows_kept":999,"cut":false,"hidden":false,"merged":[]}
["IZ028802C"]
["IZ028802D"]
["IZ029702A"]
["IZ029702B"]
["IZ020202AR"]
["IZ020602AL"]
["IZ020202AL"]
["IZ020602AR"]
[" IZ020602EL"]
["IZ020602ER"]
["IZ020214A"]
["IZ020614A"]
["IZ028114B"]
["897367044-0296"]
[8972358672]
["IZ028812C"]
["IZ028812D"]
["IZ028812A"]
["IZ028812B"]
["IZ020212AL"]
["IZ020212AR"]
[20897387346]
["278-97308868"]
[27894226829]
[8971103140]
[8970438802]
["IZ029906A"]
["IZ029906B"]
["IZ028806A"]
["IZ028806B"]
["20IZ400238"]
["IZ029709A"]
["IZ029709B"]
["IZ028809A"]
["IZ028809B"]
["IZ41007AL"]
["IZ41007AR"]
["IZ028102A"]
["IZ028102B"]
["RD01090"]
["RD01095"]
["RD01097"]
["RD01101"]
["RD01146"]
["RD02069"]
["RD05007"]
["RD05008"]
["RD12057"]
["RD02127R"]
["27RD01069D"]
[1594171]
["20TH2088D"]
["20YT-7216DC"]
[2039405]
["2080PG405"]
[20587810146]
["208094318910"]
["MG04-01131"]
["MG04-01174"]
["MG04-01191"]
{"$rows_left_out":940}
{"sheet":"CdC","index":7,"n_rows":18,"n_cols":6,"rows_kept":18,"cut":false,"hidden":false,"merged":[]}
[]
[]
[]
[null,null,null,null,null,"Gérer un stock avec Excel"]
[]
[null,null,null,null,null,"safach - 8 déc. 2016 à 14:05 - Dernière réponse le 8 déc. 2016 à 14:18 safach "]
[null,null,null,null,null,"Ne plus suivre"]
[null,null,null,null,null,"Bonjour"]
[null,null,null,null,null,"Je me permets de demander de l’aide car j’en ai très besoin"]
[null,null,null,null,null,"J’ai un outil de gestion de stock que j’utilise pour faire les entrées stock et les sorties"]
[null,null,null,null,null,"Mais j’aimerai bien chercher les articles par l’intermédiaire de leurs désignations au lieu de leurs références (ou bien les deux si c’est possible)"]
[null,null,null,null,null,"Alors s’il y a quelqu’un qui peut m’aider à ajouter le critère de désignation aux formulaires des entrées et sorties ça sera très gentil de sa part"]
[null,null,null,null,null,"En addition, le formulaire « consultation » me permet de consulter un seul article alors est-il possible d’afficher les désignations similaires et leurs quantités en cherchant un article même par formules dans une autre feuille du classeur"]
[null,null,null,null,null,"S’il vous plait j’ai besoin de votre aide"]
[null,null,null,null,null,"Lien du classeur"]
[null,null,null,null,null,"https://mon-partage.fr/f/KFg9SdwG/"]
[null,null,null,null,null,"Merci d’avance"]
[null,null,null,null,null,"Cordialement"]