{"text_format":"1","workbook":"xlsx","n_sheets":8,"sheets":["Accueil","Entrées","Sorties","Stock","Récap","Base","Feuil1","CdC"],"not_rendered":{"charts":0,"images":0,"macros":1,"external_links":0,"defined_names":12,"comments":0,"pivot_tables":0},"unopened":[],"bounds":{"document_bytes":16777216,"sheet_cells":100000,"rows_first":2000,"rows_last":500,"rows_between":2000,"halvings":0,"cell_chars":16384,"cell_head_chars":4096},"cells_cut":0,"cells_raw":0,"read":"whole","date_system":"1900"}

{"sheet":"Accueil","index":0,"n_rows":16,"n_cols":22,"rows_kept":16,"cut":false,"hidden":false,"merged":[]}
[]
[]
[]
[]
[null,null,null,null,null,null,null,null,null,null,null,null,null,null,null,null,null,null,null,null,null,"10"]
[]
[]
[]
[]
[]
[]
[]
[]
[]
["Identifiant=admin"]
["mot de passe=****"]

{"sheet":"Entrées","index":1,"n_rows":1170,"n_cols":9,"rows_kept":1170,"cut":false,"hidden":false,"merged":[[0,0,0,7]]}
["ENTREES",null,null,null,null,null,null,null,1]
["Date_Entrée","Référence Produit","Famille","Désignation","Qté ","Fournisseur","Prix","Commentaires",{"$f":"I1+1","v":2}]
["10/11/2016","IZ029702B",null,null,5]
["10/11/2016","IZ028802D",null,null,5]
["10/11/2016","IZ028802C",null,null,5]
["10/11/2016","IZ028102B",null,null,3]
["10/11/2016","IZ028102A",null,null,4]
["10/11/2016","IZ41007AR",null,null,10]
["10/11/2016","IZ41007AL",null,null,10]
["10/11/2016","IZ028809B",null,null,10]
["10/11/2016","IZ028809A",null,null,10]
["10/11/2016","IZ029709B",null,null,10]
["10/11/2016","IZ029709A",null,null,10]
["10/11/2016","20IZ400238",null,null,5]
["10/11/2016","IZ028806B",null,null,5]
["10/11/2016","IZ028806A",null,null,5]
["10/11/2016","IZ029906B",null,null,5]
["10/11/2016","IZ029906A",null,null,10]
["10/11/2016",8970438802,null,null,5]
["10/11/2016",8971103140,null,null,5]
["10/11/2016","278-97308868",null,null,4]
["10/11/2016",27894226829,null,null,6]
["10/11/2016",20897387346,null,null,2]
["10/11/2016","208094318910",null,null,20]
["10/11/2016",20587810146,null,null,30]
["10/11/2016","2080PG405",null,null,20]
["10/11/2016",2039405,null,null,5]
["10/11/2016","20YT-7216DC",null,null,6]
["10/11/2016","20TH2088D",null,null,10]
["10/11/2016",1594171,null,null,100]
["10/11/2016","27RD01069D",null,null,10]
["10/11/2016","RD02127R",null,null,3]
["10/11/2016","RD12057",null,null,10]
["10/11/2016","RD05008",null,null,10]
["10/11/2016","RD05007",null,null,5]
["10/11/2016","RD02069",null,null,10]
["10/11/2016","RD01146",null,null,4]
["10/11/2016","RD01101",null,null,4]
["10/11/2016","RD01097",null,null,2]
["10/11/2016","RD01095",null,null,2]
["10/11/2016","RD01090",null,null,10]
["10/11/2016","RD01086",null,null,20]
["10/11/2016","RD01077",null,null,5]
["10/11/2016","MG06-01054",null,null,20]
["10/11/2016","MG06-01039",null,null,20]
["10/11/2016","MG06-01037",null,null,10]
["10/11/2016","MG06-01036",null,null,10]
["10/11/2016","MG06-01014",null,null,10]
["10/11/2016","MG06-01013",null,null,20]
["10/11/2016","MG05-01095",null,null,50]
["10/11/2016","MG05-01087",null,null,15]
["10/11/2016","MG05-01032",null,null,10]
["10/11/2016","MG05-01025",null,null,5]
["10/11/2016","MG05-01001",null,null,5]
["10/11/2016","MG04-01271",null,null,10]
["10/11/2016","MG04-01191",null,null,20]
["10/11/2016","MG04-01174",null,null,25]
["10/11/2016","MG04-01131",null,null,30]
["10/11/2016","MG04-01082",null,null,10]
["10/11/2016","MG04-01064",null,null,5]
["11/11/2016","MG06-01002",null,null,20]
["11/11/2016","MG04-01063",null,null,5]
["11/11/2016","MG04-01028",null,null,10]
["11/11/2016","MG04-01025",null,null,6]
["11/11/2016","MG04-01015",null,null,15]
["11/11/2016","MG04-01013",null,null,10]
["11/11/2016","MG04-01012",null,null,5]
["11/11/2016","MG04-01002",null,null,10]
["11/11/2016","MG03-08010",null,null,5]
["11/11/2016","MG03-08009",null,null,10]
["11/11/2016","MG02-13016",null,null,20]
["11/11/2016","MG02-13010",null,null,5]
["11/11/2016","MG02-08045",null,null,5]
["11/11/2016","MG02-11009",null,null,5]
["11/11/2016","MG02-09050",null,null,5]
["11/11/2016","MG02-05028",null,null,10]
["11/11/2016","MG02-05027",null,null,5]
["11/11/2016","MG02-04006",null,null,5]
["11/11/2016","MG02-03008",null,null,15]
["11/11/2016","MG02-02048",null,null,10]
["11/11/2016","MG02-02043",null,null,10]
["11/11/2016","MG02-02039",null,null,10]
["11/11/2016","MG02-02038",null,null,5]
["11/11/2016","MG02-01062",null,null,5]
["11/11/2016","MG02-01051",null,null,5]
["11/11/2016","MG02-01042",null,null,5]
["11/11/2016","MG02-01041",null,null,5]
["11/11/2016","MG02-01035",null,null,10]
["11/11/2016","MG02-01027",null,null,5]
["11/11/2016","MG02-01014",null,null,10]
["11/11/2016","MG02-01013",null,null,3]
["11/11/2016","MG02-01010",null,null,3]
["11/11/2016","MG01-05002",null,null,2]
["11/11/2016","MG01-01003",null,null,5]
["11/11/2016","MG01-01001",null,null,5]
["11/11/2016",10470,null,null,5]
["11/11/2016",10310,null,null,4]
["11/11/2016",10480,null,null,5]
["11/11/2016","10405P",null,null,25]
["11/11/2016",10435,null,null,5]
["11/11/2016",10465,null,null,3]
["11/11/2016",10550,null,null,5]
["11/11/2016",20170,null,null,50]
["11/11/2016",20130,null,null,5]
["11/11/2016",2712600,null,null,15]
["11/11/2016","MD719469",null,null,10]
["11/11/2016",27894101243,null,null,20]
["11/11/2016","27MD368858",null,null,20]
["11/11/2016","27MR148321",null,null,15]
["11/11/2016",7988060000,null,null,1]
["11/11/2016",7988070000,null,null,1]
["11/11/2016",7986610000,null,null,1]
["11/11/2016",7980260000,null,null,1]
["11/11/2016",798017000,null,null,1]
["11/11/2016",7980300000,null,null,1]
["11/11/2016",7997140000,null,null,1]
["11/11/2016",7997180000,null,null,1]
["11/11/2016","DD-588",null,null,5]
["11/11/2016","DD-587",null,null,5]
["11/11/2016","DD-505",null,null,2]
["11/11/2016","DD-506",null,null,2]
["11/11/2016","DD-219",null,null,1]
["11/11/2016","BE-202",null,null,1]
["11/11/2016","BE-203",null,null,1]
["11/11/2016","BE-236",null,null,1]
["11/11/2016","BE-253",null,null,1]
["11/11/2016","BE-500",null,null,5]
["11/11/2016","BE-501",null,null,5]
["11/11/2016","BE-532",null,null,2]
["11/11/2016","GI-337",null,null,4]
["11/11/2016","GI-338",null,null,2]
["11/11/2016","TI-512",null,null,6]
["11/11/2016","TI-517",null,null,6]
["11/11/2016","BJ-505",null,null,4]
["11/11/2016","BJ-508",null,null,4]
["11/11/2016","BJ-913",null,null,4]
["11/11/2016","BJ-906",null,null,2]
["11/11/2016","BJ-914",null,null,2]
["11/11/2016","BJ-915",null,null,2]
["11/11/2016","FA-523S",null,null,3]
["11/11/2016","FA-383S",null,null,5]
["11/11/2016","FO-912S",null,null,3]
["11/11/2016","FA-2010S",null,null,2]
["11/11/2016","FA-345S",null,null,2]
["11/11/2016","PA-582AF",null,null,3]
["11/11/2016","PA-323AF",null,null,2]
["11/11/2016","PA-373AF",null,null,2]
["11/11/2016","PA-247AF",null,null,1]
["11/11/2016","PA-256AF",null,null,1]
["11/11/2016","PA-269AF",null,null,1]
["11/11/2016","PA-115AF",null,null,1]
["11/11/2016","PA-123AF",null,null,1]
["11/11/2016","PA-143AF",null,null,1]
["11/11/2016","PA-800AF",null,null,1]
["11/11/2016","PA-504AF",null,null,2]
["11/11/2016","CS-593",null,null,4]
["11/11/2016","CY-599",null,null,3]
["11/11/2016","BJ-513",null,null,2]
["11/11/2016","BJ-514",null,null,2]
["11/11/2016","BJ-509",null,null,2]
["11/11/2016","CE-K00",null,null,20]
["11/11/2016","JO-502",null,null,2]
["11/11/2016","KK-15006",null,null,4]
["11/11/2016","KK-15005",null,null,2]
["11/11/2016","KK-13028",null,null,1]
["11/11/2016","KK-13010",null,null,1]
["11/11/2016","KK-22008",null,null,2]
["11/11/2016","KK-21008",null,null,2]
["11/11/2016","KK-23035",null,null,2]
["11/11/2016","72-6183",null,null,10]
["11/11/2016","72-6184",null,null,30]
["11/11/2016","2089447403012D",null,null,5]
["11/11/2016","8-94474031-3",null,null,2]
["11/11/2016","20002131609D",null,null,20]
["11/11/2016","20002131609G",null,null,20]
["11/11/2016","213-1609 LH",null,null,10]
["11/11/2016","213-1609 RH",null,null,10]
["11/11/2016",27894244409,null,null,5]
["11/11/2016","MG02-13002",null,null,3]
["11/11/2016","DQ124",null,null,10]
["11/11/2016",245010,null,null,2]
["11/11/2016",27587410308,null,null,5]
["11/11/2016","TN703",null,null,25]
["11/11/2016","0001",null,null,40]
["11/11/2016","0031",null,null,4]
["11/11/2016","RVN010/012",null,null,240]
["11/11/2016","0003-TUB",null,null,20]
["11/11/2016","BGA-SILIC",null,null,10]
["11/11/2016","0037",null,null,10]
["11/11/2016","27148IS",null,null,5]
["11/11/2016","0012",null,null,10]
["11/11/2016","0057",null,null,10]
["11/11/2016","0030",null,null,6]
["11/11/2016","A1319004",null,null,10]
["11/11/2016","IM3067",null,null,3]
["11/11/2016","IM3136",null,null,3]
["11/11/2016","MYH407",null,null,3]
["11/11/2016","IM3079Y",null,null,3]
["11/11/2016","S/3013",null,null,2]
["11/11/2016",150814,null,null,2]
["11/11/2016",139610,null,null,3]
["11/11/2016",137077,null,null,2]
["11/11/2016",137076,null,null,2]
["11/11/2016","HHR604",null,null,4]
["11/11/2016","HI10004-1ZT",null,null,2]
["11/11/2016","ZZ2009-09",null,null,4]
["11/11/2016",133749,null,null,4]
["11/11/2016",137075,null,null,4]
["11/11/2016",510200,null,null,5]
["11/11/2016",510000,null,null,2]
["11/11/2016",520300,null,null,5]
["11/11/2016",520400,null,null,3]
["11/11/2016",520600,null,null,2]
["11/11/2016",521400,null,null,2]
["11/11/2016",521600,null,null,2]
["11/11/2016","NOA-2215",null,null,25]
["11/11/2016","DEPQ5",null,null,50]
["11/11/2016","A1319002",null,null,40]
["11/11/2016","A1319001",null,null,40]
["11/11/2016",182501,null,null,5]
["11/11/2016",182502,null,null,5]
["11/11/2016",182503,null,null,5]
["11/11/2016",182504,null,null,5]
["11/11/2016",182505,null,null,5]
["11/11/2016",182506,null,null,10]
["11/11/2016",182507,null,null,5]
["11/11/2016",182508,null,null,5]
["11/11/2016",182510,null,null,5]
["11/11/2016",182511,null,null,5]
["11/11/2016",182512,null,null,5]
["11/11/2016",182513,null,null,5]
["11/11/2016",182514,null,null,5]
["11/11/2016",182515,null,null,5]
["11/11/2016",182516,null,null,5]
["11/11/2016",182517,null,null,5]
["11/11/2016",182518,null,null,5]
["11/11/2016",182519,null,null,5]
["11/11/2016",182520,null,null,5]
["11/11/2016",182521,null,null,5]
["11/11/2016","A0120109",null,null,2]
["11/11/2016","A0120102",null,null,1]
["11/11/2016","A0120108",null,null,2]
["11/11/2016","A0120100NM",null,null,2]
["11/11/2016","A0120101N",null,null,2]
["11/11/2016","A0120110",null,null,2]
["11/11/2016","A0120112",null,null,2]
["11/11/2016","ISZ-09/10",null,null,1]
["11/11/2016","SO150304-003",null,null,1]
["11/11/2016","0-124",null,null,1]
["11/11/2016","05-3421",null,null,1]
["11/11/2016","TW1622A-025",null,null,2]
["11/11/2016","SH-1622A-STD",null,null,2]
["11/11/2016","CB1070GP050",null,null,2]
["11/11/2016","CB1070A-025",null,null,2]
["11/11/2016","MS1622A-STD",null,null,2]
["11/11/2016","MS1622GP025",null,null,2]
["11/11/2016","CB1131A-075",null,null,2]
["11/11/2016","CB1131A-STD",null,null,2]
["11/11/2016","CB1131A-025",null,null,2]
["11/11/2016","MS1131A-025",null,null,2]
["11/11/2016","MS1131A-050",null,null,2]
["11/11/2016","MS1131A-STD",null,null,2]
["11/11/2016","CB2016A-STD",null,null,2]
["11/11/2016","SH1605BSTD",null,null,2]
["11/11/2016","MS1138GPSTD",null,null,2]
["11/11/2016","MS1138GP025",null,null,2]
["11/11/2016","MS1138GP075",null,null,2]
["11/11/2016","MS1138GP050",null,null,2]
["11/11/2016","PB1622J-STD",null,null,3]
["11/11/2016","PB-1802-JSF",null,null,3]
["11/11/2016","PB1605J-STD",null,null,3]
["11/11/2016","8-97139-142-0",null,null,4]
["11/11/2016","8-94128143",null,null,4]
["11/11/2016","8-94128141",null,null,4]
["11/11/2016","8-97179-357-0",null,null,4]
["11/11/2016","8-97179-357-0",null,null,4]
["11/11/2016","8-97179-358-0",null,null,4]
["11/11/2016","8-97179-359-0",null,null,4]
["11/11/2016","8-97179-360-0",null,null,4]
["11/11/2016","8-97167406",null,null,2]
["11/11/2016","8-97167406-353",null,null,2]
["11/11/2016","8-97062294",null,null,2]
["11/11/2016","ISU045L",null,null,1]
["11/11/2016","ISU045R",null,null,1]
["11/11/2016","8-94316-196-0",null,null,2]
["11/11/2016","IZ153-04G",null,null,2]
["11/11/2016","IZ153-04H",null,null,2]
["11/11/2016","IZ153-18E",null,null,3]
["11/11/2016","ZNP18346",null,null,2]
["11/11/2016","9-97107-348",null,null,4]
["11/11/2016","8-97033-864-0",null,null,8]
["11/11/2016","8-97219-509-2",null,null,8]
["11/11/2016","IZ151-33B",null,null,2]
["11/11/2016","AK4101",null,null,5]
["11/11/2016","AK4100",null,null,5]
["11/11/2016","AK6012",null,null,4]
["11/11/2016","MG04-01077",null,null,5]
["11/11/2016","5-11721-016-0",null,null,64]
["11/11/2016","8-94136-672",null,null,5]
["11/11/2016","5-47519-053",null,null,5]
["11/11/2016","8-94231-459",null,null,5]
["11/11/2016","TY319-31A",null,null,4]
["11/11/2016","TY319-31B",null,null,4]
["11/11/2016","TY319-31G",null,null,4]
["11/11/2016","47550-30100",null,null,6]
["11/11/2016","MD343565",null,null,20]
["11/11/2016","MD343566",null,null,20]
["11/11/2016","MB092437",null,null,20]
["11/11/2016","MB837719",null,null,20]
["12/11/2016","MD099211",null,null,10]
["12/11/2016","TY180-31A",null,null,2]
["12/11/2016","TY180-31B",null,null,2]
["12/11/2016","8-94161-141",null,null,2]
["12/11/2016","WLA2-16-460F",null,null,4]
["12/11/2016","WL0110155",null,null,20]
["12/11/2016","UG52-43-400",null,null,2]
["12/11/2016","MB285-31A",null,null,5]
["12/11/2016","MB285-31B",null,null,5]
["12/11/2016","MB285-31C",null,null,2]
["12/11/2016","MB285-31C",null,null,2]
["12/11/2016","MB285-31D",null,null,2]
["12/11/2016","9A0812A14",null,null,2]
["12/11/2016","5TB-A0320",null,null,2]
["12/11/2016","MB176309",null,null,10]
["12/11/2016","MB286-32B",null,null,4]
["12/11/2016","MB555192",null,null,2]
["12/11/2016","5ELS-A110-S",null,null,4]
["12/11/2016","DS144-22A",null,null,2]
["12/11/2016","DS144-22B",null,null,2]
["12/11/2016","DS144-32D",null,null,2]
["12/11/2016","MR992374",null,null,2]
["12/11/2016","8-94217784",null,null,20]
["12/11/2016","8-94217785",null,null,20]
["12/11/2016","8-94222-974",null,null,5]
["12/11/2016","8-94434-974-1",null,null,10]
["12/11/2016","8-94434-973-1",null,null,10]
["12/11/2016","IS-1132-BM-LH",null,null,2]
["12/11/2016","IS-1132-BM-RH",null,null,2]
["12/11/2016","IS11-1001-2-353 L",null,null,2]
["12/11/2016","IS11-1001-2-353 R",null,null,2]
["12/11/2016","ISU223L",null,null,5]
["12/11/2016","ISU223R",null,null,5]
["12/11/2016","IS10-1002-353 L",null,null,5]
["12/11/2016","IS10-1002-353 R",null,null,5]
["12/11/2016","ISU301L",null,null,5]
["12/11/2016","ISU301R",null,null,5]
["12/11/2016","8-94335625",null,null,10]
["12/11/2016","HD08-61002-1",null,null,4]
["12/11/2016","IS-5903",null,null,4]
["12/11/2016","CLE-16MM",null,null,20]
["12/11/2016","CLE-21MM",null,null,20]
["12/11/2016","04495-0K120",null,null,2]
["12/11/2016","04495-35180",null,null,2]
["12/11/2016","16210-54180",null,null,2]
["12/11/2016","16210-54210",null,null,2]
["12/11/2016","4600A106",null,null,2]
["12/11/2016","FT06-0106A",null,null,2]
["12/11/2016","FT06-0106B",null,null,2]
["12/11/2016","MG06-01021",null,null,40]
["12/11/2016","IZ009001-A",null,null,2]
["15/11/2016","IZ009001-B",null,null,2]
["15/11/2016","RD23008",null,null,10]
["15/11/2016",27210,null,null,5]
["15/11/2016","8-94237-366-1",null,null,2]
["15/11/2016","8-97368-263",null,null,4]
["15/11/2016","TY315-31A",null,null,2]
["15/11/2016","TY315-31B",null,null,2]
["15/11/2016","TY315-31C",null,null,2]
["15/11/2016","TY315-32A",null,null,2]
["15/11/2016","TY313-33A",null,null,2]
["15/11/2016","TY313-33B",null,null,2]
["15/11/2016","TY074-20C",null,null,1]
["15/11/2016","TY074-20D",null,null,1]
["15/11/2016",90431363,null,null,5]
["15/11/2016",90431364,null,null,5]
["15/11/2016","897942-296",null,null,2]
["15/11/2016","HD03-7001-B-LH",null,null,1]
["15/11/2016","HD03-7001-B-RH",null,null,1]
["15/11/2016","MZ180-20C",null,null,1]
["15/11/2016","MZ180-20D",null,null,1]
["15/11/2016","MZ180-25C",null,null,1]
["15/11/2016","MZ180-25D",null,null,1]
["15/11/2016","MZ180-30C",null,null,1]
["15/11/2016","MZ180-30D",null,null,1]
["15/11/2016","MZ180-30E",null,null,1]
["15/11/2016","MZ180-30F",null,null,1]
["15/11/2016","MZ430-20C",null,null,1]
["15/11/2016","MZ430-20D",null,null,1]
["15/11/2016","MZ430-25C",null,null,1]
["15/11/2016","MZ430-25D",null,null,1]
["15/11/2016","MZ430-25D",null,null,1]
["15/11/2016","UH71-32-320",null,null,2]
["15/11/2016","MZ180-30A",null,null,2]
["15/11/2016","MZ209-22A",null,null,2]
["15/11/2016","MZ209-22B",null,null,2]
["15/11/2016","WL11-10-100E",null,null,1]
["15/11/2016","MD348983",null,null,1]
["15/11/2016","M002T87271ZT",null,null,1]
["15/11/2016",20894133275,null,null,3]
["15/11/2016",20894247875,null,null,3]
["15/11/2016","LPR4172",null,null,12]
["15/11/2016","MD050196",null,null,6]
["15/11/2016","8-94165177",null,null,10]
["15/11/2016","8-94113-583-0",null,null,10]
["15/11/2016",73012,null,null,6]
["15/11/2016",73010,null,null,3]
["15/11/2016","2201A01",null,null,200]
["15/11/2016","2202A01",null,null,200]
["15/11/2016","JD-2001",null,null,2]
["15/11/2016","3AL922000961",null,null,6]
["15/11/2016","3AM922000971",null,null,2]
["15/11/2016",43246,null,null,5]
["15/11/2016",920382,null,null,2]
["15/11/2016",300333,null,null,6]
["15/11/2016",300428,null,null,6]
["15/11/2016","114-001",null,null,6]
["15/11/2016",3748,null,null,5]
["15/11/2016",3778,null,null,5]
["15/11/2016","8-94317667",null,null,5]
["15/11/2016","8-94317668",null,null,5]
["15/11/2016","N9YC",null,null,50]
["15/11/2016","C9YC",null,null,50]
["15/11/2016","S9YC",null,null,50]
["15/11/2016","L87YC",null,null,50]
["15/11/2016","RC10DMC",null,null,30]
["15/11/2016","RC10YCC",null,null,30]
["15/11/2016","4565-16",null,null,2]
["15/11/2016","U050",null,null,5]
["15/11/2016","U728/4",null,null,5]
["15/11/2016","U183",null,null,5]
["15/11/2016","U100",null,null,5]
["15/11/2016","U126",null,null,5]
["15/11/2016","U960",null,null,5]
["15/11/2016","U941",null,null,5]
["15/11/2016","ITE/3-12",null,null,10]
["15/11/2016","ITJS/3-12",null,null,10]
["15/11/2016","ITE/3-24",null,null,10]
["15/11/2016","RLP/5-12",null,null,10]
["15/11/2016","RLP/5-24",null,null,10]
["15/11/2016","MD050456",null,null,10]
["15/11/2016","MD303981",null,null,10]
["15/11/2016","405-16",null,null,30]
["15/11/2016","27149FD",null,null,50]
["15/11/2016",2755,null,null,30]
["15/11/2016",75801,null,null,10]
["15/11/2016","TS-118",null,null,15]
["15/11/2016","M8360",null,null,20]
["15/11/2016","MG02-16004",null,null,30]
["15/11/2016","D4267",null,null,30]
["15/11/2016","D4210",null,null,4]
["15/11/2016","D4209",null,null,10]
["15/11/2016","D4805",null,null,10]
["15/11/2016","D3062C",null,null,50]
["15/11/2016","D1041C",null,null,50]
["15/11/2016","D1202C",null,null,30]
["15/11/2016","D3116",null,null,20]
["15/11/2016","D1224C",null,null,10]
["15/11/2016","12649/10",null,null,10]
["15/11/2016","48548/10",null,null,9]
["15/11/2016","BT19Z-2",null,null,4]
["15/11/2016","48TKB3204R",null,null,3]
["15/11/2016","32008XJ",null,null,4]
["15/11/2016","32009XJ-A",null,null,4]
["15/11/2016",30208,null,null,10]
["15/11/2016","30208A",null,null,5]
["15/11/2016",30208,null,null,3]
["15/11/2016","BD25-9T12",null,null,6]
["15/11/2016","TM206C3^^UR",null,null,5]
["15/11/2016","6904ZZ",null,null,5]
["15/11/2016","6203VVC4",null,null,6]
["15/11/2016","B20-122C3^^UR7",null,null,5]
["15/11/2016","63/32/NC3",null,null,4]
["15/11/2016","30306J",null,null,4]
["15/11/2016","HR32307CN^0A",null,null,2]
["15/11/2016","6360-18",null,null,15]
["15/11/2016","27RD01161",null,null,50]
["15/11/2016","27HU2028",null,null,30]
["15/11/2016","LS-065",null,null,20]
["15/11/2016","AN301",null,null,5]
["15/11/2016","AN310",null,null,5]
["15/11/2016","2924-AN",null,null,5]
["15/11/2016","HS111002",null,null,6]
["15/11/2016","HS274001",null,null,6]
["15/11/2016","8-94112-625BGF",null,null,2]
["15/11/2016","MB012098BGF",null,null,2]
["15/11/2016","MB012098",null,null,2]
["15/11/2016","MD712383BGF",null,null,2]
["15/11/2016","MD712383",null,null,2]
["15/11/2016","UB93-41-400",null,null,2]
["15/11/2016","UB93-41-400-353",null,null,2]
["15/11/2016","UB39-41-920",null,null,2]
["15/11/2016","WL81-15-150A",null,null,2]
["15/11/2016","8-97129738",null,null,1]
["15/11/2016","WL51-12-420",null,null,1]
["15/11/2016","TH-2043C LH",null,null,10]
["15/11/2016","TH-2043C RH",null,null,10]
["15/11/2016","MB285-30E",null,null,5]
["15/11/2016","MB285-30F",null,null,5]
["15/11/2016","ST-1639",null,null,10]
["15/11/2016","9-37300-031",null,null,10]
["15/11/2016","9-37300-601",null,null,10]
["15/11/2016","S1Y8-26-38Z",null,null,2]
["15/11/2016","RD22022",null,null,2]
["15/11/2016","PT151",null,null,20]
["15/11/2016","MR296271-S",null,null,2]
["15/11/2016","MR277924",null,null,4]
["15/11/2016","MR241029",null,null,4]
["15/11/2016","MR133061",null,null,2]
["15/11/2016","MB581845",null,null,2]
["15/11/2016","MG01-12013",null,null,2]
["15/11/2016","MG01-12017",null,null,2]
["15/11/2016","MG01-12002LHD",null,null,5]
["15/11/2016",27935,null,null,2]
["15/11/2016","MD374223",null,null,1]
["15/11/2016","MD110165",null,null,1]
["15/11/2016","MD324967",null,null,10]
["15/11/2016","MD324966",null,null,10]
["15/11/2016","MD050212",null,null,10]
["15/11/2016","MB7681",null,null,2]
["15/11/2016","MB500813",null,null,4]
["15/11/2016","MB422203",null,null,2]
["15/11/2016","MB422204",null,null,2]
["15/11/2016","MB422204",null,null,2]
["15/11/2016","MB407061",null,null,2]
["15/11/2016","MB407030",null,null,2]
["15/11/2016","MB333-30A",null,null,2]
["15/11/2016","MB333-30B",null,null,2]
["15/11/2016","MB286-30M",null,null,2]
["15/11/2016","MB286-30N",null,null,2]
["15/11/2016","MB285-25A",null,null,4]
["15/11/2016","MB285-25B",null,null,4]
["15/11/2016","MB252-32A",null,null,20]
["15/11/2016","IZ090-32C",null,null,50]
["15/11/2016","IZ151-31A",null,null,1]
["15/11/2016","IZ151-31B",null,null,3]
["15/11/2016","IZ091-36F",null,null,2]
["15/11/2016","IZ091-29A",null,null,3]
["15/11/2016","8-97365743",null,null,3]
["15/11/2016","8-97377149",null,null,2]
["15/11/2016","8-97319-300",null,null,4]
["15/11/2016","8-97255-313",null,null,2]
["15/11/2016","8-97089-652",null,null,2]
["15/11/2016","8-96457-472",null,null,2]
["15/11/2016","8-97035085",null,null,4]
["15/11/2016","8-94438-300",null,null,2]
["15/11/2016","8-94434-996",null,null,2]
["15/11/2016","8-94434-995",null,null,2]
["15/11/2016","8-94328-109",null,null,2]
["15/11/2016","8-94328-108",null,null,2]
["15/11/2016","8-94376858",null,null,2]
["15/11/2016","897105012-0",null,null,2]
["15/11/2016","8-94232-282",null,null,10]
["15/11/2016","62246A",null,null,2]
["15/11/2016","5FP-A0083",null,null,2]
["15/11/2016","5FP-A0108",null,null,2]
["15/11/2016","5CK-A0006",null,null,5]
["15/11/2016","5-37211-001",null,null,2]
["15/11/2016","8-94171-858-B",null,null,2]
["15/11/2016","IZ029702A",null,null,5]
["15/11/2016","IZ020202AR",null,null,5]
["15/11/2016","IZ020602AL",null,null,2]
["15/11/2016","IZ020202AL",null,null,1]
["15/11/2016","IZ020602AR",null,null,2]
["15/11/2016","IZ020602AL",null,null,2]
["15/11/2016","IZ020602ER",null,null,2]
["15/11/2016","IZ020614A",null,null,1]
["15/11/2016","IZ028114B",null,null,1]
["15/11/2016","897367044-0296",null,null,2]
["15/11/2016",8972358672,null,null,1]
["15/11/2016","IZ028812C",null,null,2]
["15/11/2016","IZ028812D",null,null,1]
["15/11/2016","IZ028812A",null,null,1]
["15/11/2016","IZ028812B",null,null,1]
["15/11/2016","IZ020212AL",null,null,1]
["15/11/2016","IZ020212AR",null,null,1]
["16/11/2016","F033",null,null,5]
["16/11/2016","FO34",null,null,5]
["16/11/2016","F036",null,null,20]
["16/11/2016","R002",null,null,20]
["16/11/2016","R003",null,null,20]
["16/11/2016","R007",null,null,5]
["16/11/2016","R008",null,null,5]
["16/11/2016","R009",null,null,10]
["16/11/2016","R010",null,null,10]
["16/11/2016","R011",null,null,5]
["16/11/2016","R014",null,null,10]
["17/11/2016","D001",null,null,20]
["17/11/2016","D002",null,null,20]
["17/11/2016","D003",null,null,20]
["17/11/2016","TEN002",null,null,6]
["17/11/2016","TEN003",null,null,6]
["17/11/2016","TEN004",null,null,6]
["17/11/2016","TF03",null,null,10]
["17/11/2016","TF04",null,null,10]
["17/11/2016","TF05",null,null,10]
["17/11/2016","TF06",null,null,10]
["17/11/2016","TF07",null,null,10]
["17/11/2016","TF08",null,null,10]
["17/11/2016","TF10",null,null,10]
["17/11/2016","TF11",null,null,10]
["17/11/2016","TF13",null,null,10]
["17/11/2016","TF41",null,null,10]
["17/11/2016","TF40",null,null,10]
["17/11/2016","TF92",null,null,10]
["17/11/2016","TF39",null,null,10]
["17/11/2016","TF14",null,null,10]
["17/11/2016","TF15",null,null,10]
["17/11/2016","TF18",null,null,10]
["17/11/2016","TF20",null,null,10]
["17/11/2016","TF21",null,null,10]
["17/11/2016","TF22",null,null,10]
["17/11/2016","TF75",null,null,10]
["17/11/2016","TF23",null,null,10]
["17/11/2016","TF24",null,null,10]
["17/11/2016","TF25",null,null,10]
["17/11/2016","TF26",null,null,10]
["17/11/2016","TF27",null,null,10]
["17/11/2016","TF28",null,null,10]
["17/11/2016","TF29",null,null,10]
["17/11/2016","TF30",null,null,10]
["17/11/2016","TF31",null,null,10]
["17/11/2016","TF32",null,null,10]
["17/11/2016","TF33",null,null,10]
["17/11/2016","TF34",null,null,10]
["17/11/2016","TF35",null,null,10]
["17/11/2016","TF36",null,null,10]
["17/11/2016","TF126",null,null,10]
["17/11/2016","TF137",null,null,10]
["17/11/2016","TF69",null,null,10]
["17/11/2016","TF115",null,null,10]
["17/11/2016","TF116",null,null,10]
["17/11/2016","B124",null,null,10]
["17/11/2016","B136",null,null,10]
["17/11/2016","B125",null,null,10]
["17/11/2016","B145",null,null,10]
["17/11/2016","B147",null,null,10]
["17/11/2016","B126",null,null,10]
["17/11/2016","B106",null,null,10]
["17/11/2016","B128",null,null,10]
["17/11/2016","B129",null,null,10]
["17/11/2016","B114",null,null,10]
["17/11/2016","B146",null,null,10]
["17/11/2016","B108",null,null,10]
["17/11/2016","I001",null,null,10]
["17/11/2016","I002",null,null,6]
["17/11/2016","I003-N",null,null,4]
["17/11/2016","I005-N",null,null,4]
["17/11/2016","I007",null,null,6]
["17/11/2016","I008",null,null,10]
["17/11/2016","I009",null,null,30]
["17/11/2016","I020",null,null,50]
["17/11/2016","I022",null,null,4]
["17/11/2016","I023",null,null,10]
["17/11/2016","FO004",null,null,10]
["17/11/2016","FO005",null,null,10]
["17/11/2016","FO006",null,null,10]
["17/11/2016","FO007",null,null,10]
["17/11/2016","UM46-39-040",null,null,4]
["17/11/2016","FO009",null,null,10]
["17/11/2016","FO010",null,null,10]
["17/11/2016","FO011",null,null,10]
["17/11/2016","FO013",null,null,20]
["17/11/2016","FO014",null,null,20]
["17/11/2016","M002",null,null,10]
["17/11/2016","M003",null,null,10]
["17/11/2016","M004",null,null,10]
["17/11/2016","M006-N",null,null,4]
["17/11/2016","M012",null,null,4]
["17/11/2016","M011-N",null,null,4]
["17/11/2016","M013",null,null,10]
["17/11/2016","M014",null,null,10]
["17/11/2016","M015",null,null,6]
["17/11/2016","M016",null,null,20]
["17/11/2016","M017",null,null,20]
["17/11/2016","M019",null,null,20]
["17/11/2016","M023",null,null,20]
["17/11/2016","M024",null,null,10]
["17/11/2016","M025",null,null,50]
["17/11/2016","M026",null,null,50]
["17/11/2016","M027",null,null,10]
["17/11/2016","M030",null,null,30]
["17/11/2016","M031",null,null,6]
["17/11/2016","M033",null,null,6]
["17/11/2016","M034",null,null,6]
["17/11/2016","M036",null,null,6]
["17/11/2016","M037",null,null,50]
["17/11/2016","M038",null,null,50]
["17/11/2016","M039",null,null,50]
["17/11/2016","M040",null,null,10]
["17/11/2016","M043",null,null,5]
["17/11/2016","M046",null,null,5]
["17/11/2016","M050",null,null,6]
["17/11/2016","M052",null,null,5]
["17/11/2016","M054",null,null,5]
["17/11/2016","M055",null,null,20]
["17/11/2016","M056",null,null,6]
["17/11/2016","M057",null,null,6]
["17/11/2016","M058",null,null,3]
["17/11/2016","M059",null,null,5]
["17/11/2016","M060",null,null,20]
["17/11/2016","M061",null,null,10]
["17/11/2016","M076",null,null,4]
["17/11/2016","M077",null,null,4]
["17/11/2016","M079",null,null,4]
["17/11/2016","F001",null,null,9]
["17/11/2016","F004",null,null,10]
["17/11/2016","F005",null,null,4]
["17/11/2016","F006",null,null,4]
["17/11/2016","F007",null,null,4]
["17/11/2016","F008",null,null,4]
["17/11/2016","F009",null,null,4]
["17/11/2016","F017",null,null,4]
["17/11/2016","F018",null,null,4]
["17/11/2016","F019",null,null,4]
["17/11/2016","F019",null,null,26]
["17/11/2016","F028",null,null,5]
["17/11/2016","F029",null,null,5]
["17/11/2016","F032",null,null,50]
["17/11/2016","B001",null,null,20]
["17/11/2016","B002",null,null,10]
["17/11/2016","B003",null,null,20]
["17/11/2016","B004",null,null,30]
["17/11/2016","B005",null,null,5]
["17/11/2016","B006",null,null,10]
["17/11/2016","B008",null,null,10]
["17/11/2016","B009",null,null,10]
["17/11/2016","B013",null,null,6]
["17/11/2016","B014",null,null,20]
["17/11/2016","B016",null,null,50]
["17/11/2016","B018",null,null,25]
["18/11/2016","B020",null,null,10]
["18/11/2016","B023",null,null,10]
["18/11/2016","B026",null,null,50]
["18/11/2016","B027",null,null,50]
["18/11/2016","B038",null,null,10]
["18/11/2016","B039",null,null,10]
["18/11/2016","B041",null,null,10]
["18/11/2016","B042",null,null,30]
["18/11/2016","B047",null,null,20]
["18/11/2016","B048",null,null,6]
["18/11/2016","B049",null,null,10]
["18/11/2016","B055",null,null,30]
["18/11/2016","B057",null,null,20]
["18/11/2016","B067",null,null,20]
["18/11/2016","B068",null,null,20]
["18/11/2016","B070",null,null,10]
["18/11/2016","B073",null,null,10]
["18/11/2016","B074",null,null,10]
["18/11/2016","B075",null,null,10]
["18/11/2016","B076",null,null,50]
["18/11/2016","B080",null,null,50]
["18/11/2016","B081",null,null,10]
["18/11/2016","B082",null,null,10]
["18/11/2016","B084",null,null,5]
["18/11/2016","B085",null,null,20]
["18/11/2016","B086",null,null,50]
["18/11/2016","B087",null,null,5]
["18/11/2016","B089",null,null,5]
["18/11/2016","B092",null,null,10]
["18/11/2016","B093",null,null,20]
["18/11/2016","B094",null,null,50]
["18/11/2016","B097",null,null,10]
["18/11/2016","B099",null,null,5]
["18/11/2016","B112",null,null,5]
["18/11/2016","B130",null,null,5]
["18/11/2016","B132",null,null,5]
["18/11/2016","T001",null,null,5]
["18/11/2016","TEN001",null,null,4]
["18/11/2016","B142",null,null,10]
["18/11/2016","B138",null,null,10]
["18/11/2016","B140",null,null,10]
["18/11/2016","B143",null,null,10]
["18/11/2016","B141",null,null,10]
["18/11/2016","B144",null,null,10]
["18/11/2016","B116",null,null,10]
["18/11/2016","B109",null,null,10]
["18/11/2016","B111",null,null,10]
["18/11/2016","B115",null,null,10]
["18/11/2016","B107",null,null,10]
["18/11/2016","B110",null,null,10]
["18/11/2016","B104",null,null,10]
["18/11/2016","B117",null,null,10]
["18/11/2016","B118",null,null,10]
["18/11/2016","B120",null,null,10]
["18/11/2016","B121",null,null,10]
["18/11/2016","B122",null,null,10]
["18/11/2016","B105",null,null,10]
["18/11/2016","B137",null,null,10]
["18/11/2016","B139",null,null,10]
["18/11/2016","B123",null,null,10]
["18/11/2016","TF37",null,null,10]
["18/11/2016","TF70",null,null,10]
["18/11/2016","TF71",null,null,10]
["18/11/2016","TF82",null,null,10]
["18/11/2016","TF83",null,null,10]
["18/11/2016","TF89",null,null,10]
["18/11/2016","TF121",null,null,10]
["18/11/2016","B012",null,null,40]
["18/11/2016","B019",null,null,50]
["18/11/2016","B022",null,null,20]
["18/11/2016","B058",null,null,10]
["18/11/2016","B088",null,null,20]
["18/11/2016","B091",null,null,10]
["18/11/2016","B100",null,null,5]
["18/11/2016","B101",null,null,5]
["18/11/2016","F010",null,null,4]
["18/11/2016","F012",null,null,8]
["18/11/2016","F013",null,null,10]
["18/11/2016","F014",null,null,10]
["18/11/2016","F015",null,null,10]
["18/11/2016","F016",null,null,10]
["18/11/2016","F025",null,null,10]
["18/11/2016","F037",null,null,10]
["18/11/2016","I072",null,null,20]
["18/11/2016","8-94155315",null,null,4]
["18/11/2016","8-94155314",null,null,4]
["18/11/2016","9-4468001-1",null,null,4]
["18/11/2016","I086",null,null,6]
["18/11/2016","I089",null,null,6]
["18/11/2016","8-94472118",null,null,4]
["18/11/2016","I115",null,null,50]
["18/11/2016","I118",null,null,20]
["18/11/2016","894124868-2",null,null,4]
["18/11/2016","I165",null,null,4]
["18/11/2016","I183",null,null,4]
["18/11/2016","I184",null,null,50]
["18/11/2016","M001",null,null,10]
["18/11/2016","M035",null,null,6]
["18/11/2016","M041",null,null,10]
["18/11/2016","M042",null,null,5]
["18/11/2016","M045",null,null,5]
["18/11/2016","M048",null,null,5]
["18/11/2016","M049",null,null,5]
["18/11/2016","M053",null,null,2]
["18/11/2016","M062",null,null,2]
["18/11/2016","M063",null,null,10]
["18/11/2016","M064",null,null,2]
["18/11/2016","M084",null,null,2]
["18/11/2016","MI11",null,null,6]
["18/11/2016","JAK4225100",null,null,10]
["18/11/2016","MI15",null,null,2]
["18/11/2016","R004",null,null,30]
["18/11/2016","R005",null,null,30]
["18/11/2016","R012",null,null,5]
["18/11/2016","R013",null,null,50]
["18/11/2016","T051",null,null,5]
["18/11/2016","T053",null,null,10]
["18/11/2016","T067",null,null,10]
["18/11/2016","MR534949",null,null,6]
["18/11/2016","897028-970-2",null,null,6]
["18/11/2016","I093",null,null,20]
["18/11/2016",894241767,null,null,6]
["18/11/2016","96-97248860-0",null,null,6]
["18/11/2016","8-94440608",null,null,6]
["18/11/2016","I130",null,null,10]
["18/11/2016","I136",null,null,10]
["18/11/2016",894328800,null,null,6]
["18/11/2016","I162",null,null,6]
["18/11/2016","8-94334158",null,null,10]
["18/11/2016","8-94334159",null,null,10]
["18/11/2016","I138",null,null,10]
["18/11/2016","I189",null,null,2]
["18/11/2016","M005-N",null,null,4]
["18/11/2016","M007-N",null,null,4]
["18/11/2016","M010-N",null,null,4]
["18/11/2016","MR534949",null,null,6]
["18/11/2016","MI16",null,null,3]
["18/11/2016","MI20",null,null,6]
["18/11/2016","R007",null,null,10]
["18/11/2016","R008",null,null,10]
["18/11/2016","ST01",null,null,50]
["18/11/2016","ST02",null,null,50]
["18/11/2016","TF63",null,null,10]
["18/11/2016","I138",null,null,10]
["18/11/2016","B071",null,null,10]
["18/11/2016","B072",null,null,10]
["18/11/2016","F020",null,null,10]
["18/11/2016","F021",null,null,10]
["18/11/2016","F024",null,null,5]
["18/11/2016","F030",null,null,5]
["18/11/2016","FD002",null,null,20]
["18/11/2016","UM46-39-040",null,null,10]
["18/11/2016","FO011",null,null,50]
["18/11/2016","I004",null,null,30]
["18/11/2016","I006",null,null,50]
["18/11/2016","I010",null,null,5]
["18/11/2016","I011",null,null,100]
["18/11/2016","I012",null,null,64]
["18/11/2016","I013",null,null,240]
["18/11/2016","I019",null,null,200]
["18/11/2016","I021",null,null,10]
["18/11/2016","I027",null,null,10]
["18/11/2016","I032",null,null,50]
["18/11/2016","I035",null,null,20]
["18/11/2016","I039",null,null,50]
["18/11/2016","I042",null,null,12]
["18/11/2016","I043",null,null,10]
["18/11/2016","I048",null,null,20]
["18/11/2016","I056",null,null,30]
["18/11/2016","I066",null,null,6]
["18/11/2016","I071",null,null,20]
["18/11/2016","I073",null,null,30]
["18/11/2016","MG06-01037",null,null,5]
["18/11/2016","8-94172-018-0",null,null,2]
["18/11/2016","I066",null,null,1]
["18/11/2016","8-94440608",null,null,1]
["18/11/2016",894328800,null,null,1]
["18/11/2016","I006",null,null,10]
["18/11/2016","I071",null,null,10]
["18/11/2016","MG02-02048",null,null,4]
["18/11/2016","TH6702-82J",null,null,1]
["18/11/2016","B077",null,null,50]
["18/11/2016","8-94112-625BGF",null,null,1]
["18/11/2016",207094112625,null,null,2]
["18/11/2016","MR534949",null,null,1]
["18/11/2016","ISU328L",null,null,4]
["18/11/2016","ISU221L",null,null,2]
["18/11/2016","ISU221R",null,null,2]
["18/11/2016","5SR-A0205",null,null,1]
["18/11/2016","AK1230",null,null,2]
["18/11/2016","MD050212",null,null,10]
["18/11/2016","224018760R",null,null,20]
["18/11/2016",7700500168,null,null,10]
["18/11/2016",182509,null,null,5]
["18/11/2016","271918G",null,null,2]
["18/11/2016",8942313080,null,null,10]
["18/11/2016","MB831040",null,null,2]
["19/11/2016","MI26",null,null,4]
["19/11/2016","MI25",null,null,10]
["19/11/2016","MI24",null,null,6]
["19/11/2016","MI23",null,null,10]
["19/11/2016","MI21",null,null,4]
["19/11/2016","MI19",null,null,10]
["19/11/2016","MI18",null,null,5]
["19/11/2016","MI17",null,null,4]
["19/11/2016","MI13",null,null,4]
["19/11/2016","MI10",null,null,10]
["19/11/2016","MI08",null,null,10]
["19/11/2016","MI05",null,null,10]
["19/11/2016","MI03",null,null,8]
["19/11/2016","MI01-N",null,null,4]
["19/11/2016","MI02",null,null,20]
["19/11/2016","FD003-N",null,null,4]
["19/11/2016","8-94155314",null,null,1]
["23/11/2016","IZ028820B",null,null,1,null,null,""]
["23/11/2016",110806,null,null,1,null,null,""]
["23/11/2016","8-96457-472",null,null,2,null,null,""]
["23/11/2016","PIMA717PHD",null,null,10,null,null,""]
["23/11/2016","3AL922000961",null,null,1,null,null,""]
["23/11/2016",10470,null,null,2,null,null,""]
["23/11/2016","ISU285L",null,null,2,null,null,""]
["23/11/2016","ISU285R",null,null,2,null,null,""]
["23/11/2016","8-97365743",null,null,1,null,null,""]
["23/11/2016","D4267",null,null,5,null,null,""]
["23/11/2016",10310,null,null,2,null,null,""]
["23/11/2016","B076",null,null,10,null,null,""]
["23/11/2016","MI16",null,null,3,null,null,""]
["23/11/2016","MG05-01087",null,null,4,null,null,""]
["23/11/2016","UG52-43-400",null,null,1,null,null,""]
["23/11/2016","IBD-1373",null,null,2,null,null,""]
["23/11/2016","WLA2-16-460F",null,null,1,null,null,""]
["23/11/2016","FA-383S",null,null,4,null,null,""]
["23/11/2016",300428,null,null,3,null,null,""]
["23/11/2016","WL81-15-150A",null,null,1,null,null,""]
["23/11/2016","MZ180-30A",null,null,1,null,null,""]
["23/11/2016","8-94335625",null,null,4,null,null,""]
["23/11/2016","MG01-12002LHD",null,null,2,null,null,""]
["23/11/2016","8-97365743",null,null,2,null,null,""]
["23/11/2016","IZ090-32C",null,null,10,null,null,""]
["23/11/2016","MG02-13016",null,null,3,null,null,""]
["23/11/2016",182515,null,null,3,null,null,""]
["23/11/2016","5-37211-001",null,null,2,null,null,""]
["23/11/2016","5FP-A0108",null,null,2,null,null,""]
["23/11/2016","897105012-0",null,null,2,null,null,""]
["23/11/2016","U050",null,null,4,null,null,""]
["23/11/2016","5-47519-053",null,null,1,null,null,""]
["23/11/2016","2266-03-10",null,null,1,null,null,""]
["23/11/2016","MD050212",null,null,20,null,null,""]
["23/11/2016","ISU045L",null,null,2,null,null,""]
["23/11/2016",27935,null,null,1,null,null,""]
["23/11/2016","B106",null,null,10,null,null,""]
["23/11/2016","B145",null,null,10,null,null,""]
["23/11/2016","B086",null,null,10,null,null,""]
["23/11/2016","B121",null,null,10,null,null,""]
["23/11/2016","B117",null,null,10,null,null,""]
["23/11/2016","MB092437",null,null,5,null,null,""]
["23/11/2016","5-37211-001",null,null,2,null,null,""]
["23/11/2016","I009",null,null,10,null,null,""]
["23/11/2016","I138",null,null,2,null,null,""]
["23/11/2016","I019",null,null,25,null,null,""]
["23/11/2016","MD303981",null,null,4,null,null,""]
["23/11/2016",182517,null,null,2,null,null,""]
["23/11/2016",182503,null,null,1,null,null,""]
["23/11/2016","AX192766",null,null,1,null,null,""]
["23/11/2016","A379RU30MM",null,null,1,null,null,""]
["23/11/2016","A390R030MM",null,null,1,null,null,""]
["23/11/2016","IBD-1373",null,null,4,null,null,""]
["23/11/2016","MS1131A-050",null,null,1,null,null,""]
["23/11/2016",510200,null,null,1,null,null,""]
["23/11/2016"]
["23/11/2016","4148-10-10",null,null,1,null,null,""]
["23/11/2016","ARCEBMIM140-0,00",null,null,1,null,null,""]
["23/11/2016","ARCEBMIM140-0,50",null,null,1,null,null,""]
["23/11/2016","B077",null,null,40,null,null,""]
["23/11/2016","B128",null,null,10,null,null,""]
["23/11/2016","ISU223L",null,null,2,null,null,""]
["23/11/2016","ISU223R",null,null,2,null,null,""]
["23/11/2016","62246A",null,null,1,null,null,""]
["23/11/2016","F029",null,null,2,null,null,""]
["23/11/2016","F024",null,null,2,null,null,""]
["23/11/2016","F030",null,null,2,null,null,""]
["23/11/2016","B105",null,null,10,null,null,""]
["23/11/2016","UB93-41-400-353",null,null,2,null,null,""]
["23/11/2016","B077",null,null,60,null,null,""]
["23/11/2016","I003-N",null,null,4,null,null,""]
["23/11/2016","MI24",null,null,2,null,null,""]
["23/11/2016","MB7681",null,null,1,null,null,""]
["23/11/2016","8-94155314",null,null,1,null,null,""]
["23/11/2016","U941",null,null,1,null,null,""]
["23/11/2016","8-97381456",null,null,5,null,null,""]
["23/11/2016",153010,null,null,6,null,null,""]
["23/11/2016","879117254-1",null,null,1,null,null,""]
["23/11/2016",894311222,null,null,1,null,null,""]
["23/11/2016","8-94325768",null,null,1,null,null,""]
["23/11/2016","PA-137AF",null,null,1,null,null,""]
["23/11/2016","FT1506006R",null,null,1,null,null,""]
["23/11/2016",20587810146,null,null,1,null,null,""]
["23/11/2016",20587810294,null,null,1,null,null,""]
["23/11/2016","MA880183",null,null,1,null,null,""]
["23/11/2016","MA870169",null,null,1,null,null,""]
["23/11/2016","MI16",null,null,1,null,null,""]
["23/11/2016","B106",null,null,10,null,null,""]
["23/11/2016","5FP-A0083",null,null,1,null,null,""]
["23/11/2016","F024",null,null,2,null,null,""]
["23/11/2016","F029",null,null,2,null,null,""]
["23/11/2016","5-87831-081-0",null,null,10,null,null,""]
["23/11/2016","VC-500",null,null,1,null,null,""]
["23/11/2016","12649/10",null,null,2,null,null,""]
["23/11/2016","I138",null,null,4,null,null,""]
["23/11/2016","1900-04-18",null,null,1,null,null,""]
["23/11/2016","8-94463-830",null,null,2,null,null,""]
["23/11/2016","12649/10",null,null,1,null,null,""]
["23/11/2016","48548/10",null,null,1,null,null,""]
["23/11/2016","8-96457-472",null,null,1,null,null,""]
["24/11/2016","UJ06-66-122",null,null,2,null,null,""]
["24/11/2016","MD050312",null,null,10,null,null,""]
["24/11/2016","U187",null,null,5,null,null,""]
["24/11/2016","FT1506006R",null,null,1,null,null,""]
["24/11/2016","ARCEBMIM140-0,00",null,null,1,null,null,""]
["24/11/2016","B049",null,null,2,null,null,""]
["24/11/2016","213-1609 LH",null,null,1,null,null,""]
["24/11/2016","213-1609 RH",null,null,1,null,null,""]
["24/11/2016","RD01104",null,null,5,null,null,""]
["24/11/2016","MG02-02048",null,null,4,null,null,""]
["24/11/2016","CLE-16MM",null,null,3,null,null,""]
["24/11/2016","CLE-21MM",null,null,3,null,null,""]
["24/11/2016","8-94113-583-0",null,null,2,null,null,""]
["24/11/2016","MG02-02043",null,null,2,null,null,""]
["24/11/2016","9326-11-04",null,null,2,null,null,""]
["24/11/2016","1909-09-25",null,null,3,null,null,""]
["24/11/2016","1909-09-26",null,null,3,null,null,""]
["24/11/2016","1976-06-24",null,null,5,null,null,""]
["24/11/2016","I044",null,null,10,null,null,""]
["24/11/2016","MR277924",null,null,1,null,null,""]
["24/11/2016","MD050312",null,null,10,null,null,""]
["24/11/2016","ISC572086U",null,null,1,null,null,""]
["24/11/2016","LPR4172",null,null,6,null,null,""]
["24/11/2016","MB555192",null,null,2,null,null,""]
["24/11/2016","CB1131A-STD",null,null,2,null,null,""]
["24/11/2016","8-97368-263",null,null,1,null,null,""]
["24/11/2016","MG05-01095",null,null,10,null,null,""]
["24/11/2016","CY-599",null,null,3,null,null,""]
["24/11/2016","BD25-9T12",null,null,2,null,null,""]
["24/11/2016","TM206C3^^UR",null,null,2,null,null,""]
["24/11/2016","MD050312",null,null,3,null,null,""]
["24/11/2016","MD712383BGF",null,null,2,null,null,""]
["24/11/2016","8-97319-300",null,null,4,null,null,""]
["24/11/2016","U187",null,null,4,null,null,""]
["24/11/2016","1928-03-23",null,null,2,null,null,""]
["24/11/2016","B070",null,null,10,null,null,""]
["24/11/2016","MI16",null,null,3,null,null,""]
["24/11/2016","I115",null,null,10,null,null,""]
["24/11/2016","BGA-SILIC",null,null,4,null,null,""]
["24/11/2016","8-97035085",null,null,1,null,null,""]
["24/11/2016","UHY1-33-29Z",null,null,2,null,null,""]
["24/11/2016","UMY1-33-29",null,null,2,null,null,""]
["24/11/2016","IS11-1001-2-353 L",null,null,1,null,null,""]
["24/11/2016","IZ20011BS",null,null,1,null,null,""]
["24/11/2016","1905-08-30",null,null,4,null,null,""]
["24/11/2016","2282-01-17",null,null,2,null,null,""]
["24/11/2016","MB334-22J",null,null,2,null,null,""]
["24/11/2016","MB334-22I",null,null,2,null,null,""]
["24/11/2016","ARCEBMIM140-0,50",null,null,1,null,null,""]
["24/11/2016","224018760R",null,null,20,null,null,""]
["24/11/2016","8-94434-977",null,null,2,null,null,""]
["24/11/2016","8-94434-978",null,null,2,null,null,""]
["24/11/2016","2322-01-15",null,null,1,null,null,""]
["24/11/2016","HD15-5005",null,null,8,null,null,""]
["24/11/2016","215-19D4-AERH",null,null,1,null,null,""]
["24/11/2016",7700500168,null,null,20,null,null,""]
["24/11/2016",7700500168,null,null,8,null,null,""]
["24/11/2016","I071",null,null,13,null,null,""]
["24/11/2016","2201A01",null,null,200,null,null,""]
["24/11/2016","2201A01",null,null,200,null,null,""]
["25/11/2016","8-94434-974-1",null,null,5,null,null,""]
["26/11/2016","3187-04-22",null,null,1,null,null,""]
["26/11/2016","MR277924",null,null,3,null,null,""]
["26/11/2016","UJ06-66-122",null,null,1,null,null,""]
["26/11/2016","2422-09-09",null,null,1,null,null,""]
["26/11/2016","IZ020202AL",null,null,1,null,null,""]
["26/11/2016","I071",null,null,10,null,null,""]
["26/11/2016","2399-09-09",null,null,3,null,null,""]
["26/11/2016","IM3136",null,null,1,null,null,""]
["26/11/2016",4604444,null,null,1,null,null,""]
["26/11/2016",4604443,null,null,1,null,null,""]
["26/11/2016",7997140000,null,null,1,null,null,""]
["26/11/2016","8-97039190-3",null,null,1,null,null,""]
["26/11/2016","8-94467328",null,null,2,null,null,""]
["26/11/2016","JAK4225100",null,null,3,null,null,""]
["26/11/2016","1976-06-24",null,null,2,null,null,""]
["26/11/2016","BJ-513",null,null,1,null,null,""]
["26/11/2016","MG02-09050",null,null,2,null,null,""]
["26/11/2016","224018760R",null,null,20,null,null,""]
["26/11/2016","I042",null,null,20,null,null,""]
["26/11/2016","13011-54100",null,null,1,null,null,""]
["26/11/2016","MB831040",null,null,1,null,null,""]
["26/11/2016","27TH-2042CG",null,null,1,null,null,""]
["26/11/2016","2010TH2042-1G",null,null,2,null,null,""]
["26/11/2016","BGA-SILIC",null,null,10,null,null,""]
["26/11/2016","8-94434-974-1",null,null,2,null,null,""]
["26/11/2016","TF62",null,null,12,null,null,""]
["26/11/2016","I164",null,null,2,null,null,""]
["28/11/2016",20897921857,null,null,2,null,null,""]
["28/11/2016","MG02-02044",null,null,5,null,null,""]
["28/11/2016","2040VS6409",null,null,5,null,null,""]
["28/11/2016","PI45 9V",null,null,50,null,null,""]
["28/11/2016","MG02-13010",null,null,3,null,null,""]
["28/11/2016","MG02-13016",null,null,5,null,null,""]
["28/11/2016","RC10YCC",null,null,10,null,null,""]
["28/11/2016","I114",null,null,5,null,null,""]
["28/11/2016","RD23008",null,null,8,null,null,""]
["28/11/2016","8-94232-282",null,null,8,null,null,""]
["28/11/2016","I007",null,null,2,null,null,""]
["29/11/2016","RC10YCC",null,null,10,null,null,""]
["29/11/2016","MG02-13010",null,null,3,null,null,""]
["29/11/2016","MG02-13016",null,null,5,null,null,""]
["30/11/2016","FA-523S",null,null,1,null,null,""]
["30/11/2016","O-MD303972",null,null,2,null,null,""]
["30/11/2016","148688G",null,null,2,null,null,""]
["01/12/2016",8942313080,null,null,5,null,null,""]
["02/12/2016","ST-1639",null,null,5,null,null,""]
["03/12/2016","IZ07067GA7",null,null,1,null,null,""]
["06/12/2016","1ATAK",null,null,30,null,null,""]
["06/12/2016","ST-1639",null,null,5,null,null,""]
["06/12/2016","1905-12-01",null,null,2,null,null,""]
["06/12/2016","8-94435-140",null,null,1,null,null,""]
["06/12/2016","ISC506115U",null,null,1,null,null,""]
["06/12/2016","ISK2047",null,null,1,null,null,""]
["07/12/2016",6253029000,null,null,1,null,null,""]
["07/12/2016","HD19-1001",null,null,1,null,null,""]
["07/12/2016","HD19-1001-353 R",null,null,1,null,null,""]
["07/12/2016","ISU282L",null,null,1,null,null,""]
["07/12/2016","ISU282R",null,null,1,null,null,""]
["07/12/2016","ISU283L",null,null,1,null,null,""]
["07/12/2016","ISU283R",null,null,1,null,null,""]
["07/12/2016","Z102",null,null,2,null,null,""]
["07/12/2016","UH71-33-061B",null,null,1,null,null,""]
["07/12/2016","UH71-26-630A",null,null,1,null,null,""]
["07/12/2016","UH71-26-640A",null,null,1,null,null,""]
["07/12/2016","WL02-16-520A",null,null,1,null,null,""]

{"sheet":"Sorties","index":2,"n_rows":210,"n_cols":7,"rows_kept":210,"cut":false,"hidden":false,"merged":[[0,0,0,3]]}
["SORTIES",null,null,null,1]
["Référence Produit","Date_Sortie","Qté livrée","Commentaires",{"$f":"E1+1","v":2}]
["JAK4225100","2016-11-23",3,null,null,null,{"$f":"ISNUMBER(Date_S)","v":true}]
["224018760R","2016-11-23",20]
[27935,"2016-11-23",2]
["BJ-513","2016-11-23",1]
["MG02-09050","2016-11-23",2]
["BJ-513","2016-11-23",1]
["8-94165177","2016-11-23",1]
["B086","2016-11-23",10]
["ARCEBMIM140-0,50","2016-11-23",1]
["8-94165177","2016-11-23",1]
["B049","2016-11-23",2]
[7700500168,"2016-11-23",10]
["213-1609 LH","2016-11-23",1]
["213-1609 RH","2016-11-23",1]
["MG05-01001","2016-11-23",5]
["MG02-02048","2016-11-23",4]
["CLE-16MM","2016-11-23",3]
["CLE-21MM","2016-11-23",3]
["8-94113-583-0","2016-11-23",2]
["MG02-02043","2016-11-23",2]
[2712600,"2016-11-23",2]
["BGA-SILIC","2016-11-23",4]
["I115","2016-11-23",10]
["MI16","2016-11-23",2]
[10310,"2016-11-23",2]
["B076","2016-11-23",10]
["D4267","2016-11-23",5]
[8971103140,"2016-11-23",1]
["8-97035085","2016-11-23",1]
["MD050212","2016-11-23",10]
["MR534949","2016-11-23",1]
["8-94112-625BGF","2016-11-23",1]
["I138","2016-11-23",4]
["12649/10","2016-11-23",2]
["48548/10","2016-11-23",2]
["62246A","2016-11-23",1]
["F029","2016-11-23",2]
["F030","2016-11-23",2]
["F024","2016-11-23",2]
["B077","2016-11-23",10]
["B105","2016-11-23",10]
["PA-373AF","2016-11-23",2]
["B077","2016-11-23",10]
["UB93-41-400-353","2016-11-23",2]
["KK-13010","2016-11-23",1]
["D002","2016-11-23",2]
["S9YC","2016-11-23",2]
["8-94155314","2016-11-23",1]
["U941","2016-11-23",1]
["5FP-A0083","2016-11-23",1]
["M002T87271ZT","2016-11-23",1]
["F029","2016-11-23",2]
["F024","2016-11-23",2]
["MI16","2016-11-23",1]
["B106","2016-11-23",10]
["ISU045L","2016-11-23",1]
["B077","2016-11-23",30]
["B128","2016-11-23",10]
[510000,"2016-11-23",2]
[7997140000,"2016-11-23",1]
["ISU223L","2016-11-23",2]
["ISU223R","2016-11-23",2]
["I003-N","2016-11-23",4]
["MI24","2016-11-23",2]
["MB7681","2016-11-23",1]
["ISU045L","2016-11-23",1]
[182517,"2016-11-23",5]
[182518,"2016-11-23",5]
[182519,"2016-11-23",5]
[182521,"2016-11-23",5]
[182503,"2016-11-23",1]
[510200,"2016-11-23",1]
["5-47519-053","2016-11-23",1]
["MS1138GP050","2016-11-23",1]
[133749,"2016-11-23",1]
["MD050212","2016-11-23",10]
[27935,"2016-11-23",1]
["I183","2016-11-23",4]
["8-94155314","2016-11-23",1]
["8-96457-472","2016-11-23",2]
["3AL922000961","2016-11-23",2]
[10470,"2016-11-23",2]
["I066","2016-11-23",1]
["8-94440608","2016-11-23",1]
[894328800,"2016-11-23",1]
["I006","2016-11-23",10]
["I071","2016-11-23",10]
["MG02-02048","2016-11-23",4]
[10465,"2016-11-23",3]
["MG06-01037","2016-11-23",5]
["MD303981","2016-11-23",4]
["I019","2016-11-23",25]
["I138","2016-11-23",2]
["I009","2016-11-23",10]
["5-37211-001","2016-11-23",2]
["MB092437","2016-11-23",5]
["B117","2016-11-23",10]
["B121","2016-11-23",10]
["B086","2016-11-23",10]
["B145","2016-11-23",10]
["B106","2016-11-23",10]
["MG05-01087","2016-11-23",4]
["UG52-43-400","2016-11-23",1]
["U100","2016-11-23",4]
["IBD-1373","2016-11-23",2]
["WLA2-16-460F","2016-11-23",1]
["FA-383S","2016-11-23",4]
[300428,"2016-11-23",2]
["WL81-15-150A","2016-11-23",1]
["MZ180-30A","2016-11-23",1]
["8-94335625","2016-11-23",4]
["MG01-12002LHD","2016-11-23",2]
["IZ090-32C","2016-11-23",10]
["MG02-13016","2016-11-23",3]
[182515,"2016-11-23",3]
["5-37211-001","2016-11-23",2]
["5FP-A0108","2016-11-23",2]
["897105012-0","2016-11-23",2]
["U050","2016-11-23",4]
[182516,"2016-11-23",3]
["I042","2016-11-23",8]
["LPR4172","2016-11-23",6]
["MB555192","2016-11-23",2]
["CB1131A-STD","2016-11-23",2]
["FT1506006R","2016-11-23",1]
["8-97368-263","2016-11-23",2]
["U100","2016-11-23",1]
["U960","2016-11-23",2]
["MG05-01095","2016-11-23",10]
["PIMA717PHD","2016-11-23",10]
["CY-599","2016-11-23",3]
["BD25-9T12","2016-11-23",2]
["TM206C3^^UR","2016-11-23",2]
["B20-122C3^^UR7","2016-11-23",2]
["BT19Z-2","2016-11-23",3]
["IS11-1001-2-353 L","2016-11-23",1]
["MD712383BGF","2016-11-23",2]
["8-97319-300","2016-11-23",4]
["MB831040","2016-11-23",2]
["IZ020202AL","2016-11-24",1]
[182509,"2016-11-24",3]
["MD050312","2016-11-24",10]
["U187","2016-11-24",3]
["UJ06-66-122","2016-11-24",1]
["MR277924","2016-11-24",2]
["MR277924","2016-11-24",1]
["215-19D4-AERH","2016-11-24",1]
["IM3136","2016-11-24",1]
["8-94434-974-1","2016-11-25",2]
["BGA-SILIC","2016-11-25",10]
["IZ091-29A","2016-11-26",1]
["MG02-13002","2016-11-26",1]
["MG02-13010","2016-11-26",3]
["MG02-13016","2016-11-26",5]
["RC10YCC","2016-11-26",10]
["8-94317667","2016-11-26",2]
["8-94317668","2016-11-26",2]
["62246A","2016-11-28",1]
[4604443,"2016-11-28",1]
["RD23008","2016-11-28",4]
["8-94434-974-1","2016-11-28",3]
["8-94113-583-0","2016-11-28",3]
["I114","2016-11-28",5]
[20170,"2016-11-28",25]
["RVN010/012","2016-11-28",40]
["ST-1639","2016-11-28",5]
["8-94232-282","2016-11-28",10]
["I007","2016-11-28",6]
[182516,"2016-11-28",2]
[20897921857,"2016-11-28",2]
[133749,"2016-11-28",1]
["B077","2016-11-29",10]
["B120","2016-11-29",10]
["B121","2016-11-29",10]
["MG02-05027","2016-11-29",1]
["MG02-03008","2016-11-29",4]
["MG02-02044","2016-11-29",2]
["8-94325768","2016-11-29",1]
["MG02-13010","2016-11-29",3]
["MG02-13016","2016-11-29",5]
["RC10YCC","2016-11-29",10]
["MR277924","2016-11-30",1]
["MR277924","2016-11-30",1]
["MI08","2016-11-30",10]
["ISU223L","2016-11-30",1]
["ISU223R","2016-11-30",1]
[27935,"2016-11-30",2]
["VC-500","2016-11-30",1]
["MB407061","2016-12-01",1]
[8942313080,"2016-12-01",3]
[182513,"2016-12-01",3]
[182503,"2016-12-01",2]
[182505,"2016-12-01",2]
["I086","2016-12-01",2]
["MR534949","2016-12-01",1]
["TF35","2016-12-01",10]
["TF37","2016-12-01",10]
["TF39","2016-12-01",10]
["MG02-13016","2016-12-02",10]
["PI45 9V","2016-12-02",10]
["8-97179-357-0","2016-12-03",1]
["TH6702-82J","2016-12-03",1]
["IZ020202AR","2016-12-03",1]
["IS11-1001-2-353 R","2016-12-03",1]
["IZ07067GA7","2016-12-03",1]
["5-37211-001","2016-12-03",1]
["TF62","2016-12-03",1]
["I066","2016-12-03",1]

{"sheet":"Stock","index":3,"n_rows":1020,"n_cols":2,"rows_kept":1020,"cut":false,"hidden":false,"merged":[[0,0,0,1]]}
[{"$f":"\"STOCKS de l'ANNEE: \" &Base!P1","v":"STOCKS de l'ANNEE: 2016"}]
["Référence Produit","Stock Actuel"]
["IZ028802C",{"$f":"VLOOKUP(A3,Récap!$A$4:$AB$1979,28,FALSE)","v":5}]
["IZ028802D",{"$f":"VLOOKUP(A4,Récap!$A$4:$AB$1979,28,FALSE)","v":5}]
["IZ029702A",{"$f":"VLOOKUP(A5,Récap!$A$4:$AB$1979,28,FALSE)","v":5}]
["IZ029702B",{"$f":"VLOOKUP(A6,Récap!$A$4:$AB$1979,28,FALSE)","v":5}]
["IZ020202AR",4]
["IZ020602AL",{"$f":"VLOOKUP(A8,Récap!$A$4:$AB$1979,28,FALSE)","v":4}]
["IZ020202AL",{"$f":"VLOOKUP(A9,Récap!$A$4:$AB$1979,28,FALSE)","v":1}]
["IZ020602AR",{"$f":"VLOOKUP(A10,Récap!$A$4:$AB$1979,28,FALSE)","v":2}]
[" IZ020602EL",{"$f":"VLOOKUP(A11,Récap!$A$4:$AB$1979,28,FALSE)","v":2}]
["IZ020602ER",{"$f":"VLOOKUP(A12,Récap!$A$4:$AB$1979,28,FALSE)","v":2}]
["IZ020214A",{"$f":"VLOOKUP(A13,Récap!$A$4:$AB$1979,28,FALSE)","v":0}]
["IZ020614A",{"$f":"VLOOKUP(A14,Récap!$A$4:$AB$1979,28,FALSE)","v":1}]
["IZ028114B",{"$f":"VLOOKUP(A15,Récap!$A$4:$AB$1979,28,FALSE)","v":1}]
["897367044-0296",{"$f":"VLOOKUP(A16,Récap!$A$4:$AB$1979,28,FALSE)","v":2}]
[8972358672,{"$f":"VLOOKUP(A17,Récap!$A$4:$AB$1979,28,FALSE)","v":1}]
["IZ028812C",{"$f":"VLOOKUP(A18,Récap!$A$4:$AB$1979,28,FALSE)","v":2}]
["IZ028812D",{"$f":"VLOOKUP(A19,Récap!$A$4:$AB$1979,28,FALSE)","v":1}]
["IZ028812A",{"$f":"VLOOKUP(A20,Récap!$A$4:$AB$1979,28,FALSE)","v":1}]
["IZ028812B",{"$f":"VLOOKUP(A21,Récap!$A$4:$AB$1979,28,FALSE)","v":1}]
["IZ020212AL",{"$f":"VLOOKUP(A22,Récap!$A$4:$AB$1979,28,FALSE)","v":1}]
["IZ020212AR",{"$f":"VLOOKUP(A23,Récap!$A$4:$AB$1979,28,FALSE)","v":1}]
[20897387346,{"$f":"VLOOKUP(A24,Récap!$A$4:$AB$1979,28,FALSE)","v":2}]
["278-97308868",{"$f":"VLOOKUP(A25,Récap!$A$4:$AB$1979,28,FALSE)","v":4}]
[27894226829,{"$f":"VLOOKUP(A26,Récap!$A$4:$AB$1979,28,FALSE)","v":6}]
[8971103140,{"$f":"VLOOKUP(A27,Récap!$A$4:$AB$1979,28,FALSE)","v":4}]
[8970438802,{"$f":"VLOOKUP(A28,Récap!$A$4:$AB$1979,28,FALSE)","v":5}]
["IZ029906A",{"$f":"VLOOKUP(A29,Récap!$A$4:$AB$1979,28,FALSE)","v":10}]
["IZ029906B",{"$f":"VLOOKUP(A30,Récap!$A$4:$AB$1979,28,FALSE)","v":5}]
["IZ028806A",{"$f":"VLOOKUP(A31,Récap!$A$4:$AB$1979,28,FALSE)","v":5}]
["IZ028806B",{"$f":"VLOOKUP(A32,Récap!$A$4:$AB$1979,28,FALSE)","v":5}]
["20IZ400238",{"$f":"VLOOKUP(A33,Récap!$A$4:$AB$1979,28,FALSE)","v":5}]
["IZ029709A",{"$f":"VLOOKUP(A34,Récap!$A$4:$AB$1979,28,FALSE)","v":10}]
["IZ029709B",{"$f":"VLOOKUP(A35,Récap!$A$4:$AB$1979,28,FALSE)","v":10}]
["IZ028809A",{"$f":"VLOOKUP(A36,Récap!$A$4:$AB$1979,28,FALSE)","v":10}]
["IZ028809B",{"$f":"VLOOKUP(A37,Récap!$A$4:$AB$1979,28,FALSE)","v":10}]
["IZ41007AL",{"$f":"VLOOKUP(A38,Récap!$A$4:$AB$1979,28,FALSE)","v":10}]
["IZ41007AR",{"$f":"VLOOKUP(A39,Récap!$A$4:$AB$1979,28,FALSE)","v":10}]
["IZ028102A",{"$f":"VLOOKUP(A40,Récap!$A$4:$AB$1979,28,FALSE)","v":4}]
["IZ028102B",{"$f":"VLOOKUP(A41,Récap!$A$4:$AB$1979,28,FALSE)","v":3}]
["RD01090",{"$f":"VLOOKUP(A42,Récap!$A$4:$AB$1979,28,FALSE)","v":10}]
["RD01095",{"$f":"VLOOKUP(A43,Récap!$A$4:$AB$1979,28,FALSE)","v":2}]
["RD01097",{"$f":"VLOOKUP(A44,Récap!$A$4:$AB$1979,28,FALSE)","v":2}]
["RD01101",{"$f":"VLOOKUP(A45,Récap!$A$4:$AB$1979,28,FALSE)","v":4}]
["RD01146",{"$f":"VLOOKUP(A46,Récap!$A$4:$AB$1979,28,FALSE)","v":4}]
["RD02069",{"$f":"VLOOKUP(A47,Récap!$A$4:$AB$1979,28,FALSE)","v":10}]
["RD05007",{"$f":"VLOOKUP(A48,Récap!$A$4:$AB$1979,28,FALSE)","v":5}]
["RD05008",{"$f":"VLOOKUP(A49,Récap!$A$4:$AB$1979,28,FALSE)","v":10}]
["RD12057",{"$f":"VLOOKUP(A50,Récap!$A$4:$AB$1979,28,FALSE)","v":10}]
["RD02127R",{"$f":"VLOOKUP(A51,Récap!$A$4:$AB$1979,28,FALSE)","v":3}]
["27RD01069D",{"$f":"VLOOKUP(A52,Récap!$A$4:$AB$1979,28,FALSE)","v":10}]
[1594171,{"$f":"VLOOKUP(A53,Récap!$A$4:$AB$1979,28,FALSE)","v":100}]
["20TH2088D",{"$f":"VLOOKUP(A54,Récap!$A$4:$AB$1979,28,FALSE)","v":10}]
["20YT-7216DC",{"$f":"VLOOKUP(A55,Récap!$A$4:$AB$1979,28,FALSE)","v":6}]
[2039405,{"$f":"VLOOKUP(A56,Récap!$A$4:$AB$1979,28,FALSE)","v":5}]
["2080PG405",{"$f":"VLOOKUP(A57,Récap!$A$4:$AB$1979,28,FALSE)","v":20}]
[20587810146,{"$f":"VLOOKUP(A58,Récap!$A$4:$AB$1979,28,FALSE)","v":31}]
["208094318910",{"$f":"VLOOKUP(A59,Récap!$A$4:$AB$1979,28,FALSE)","v":20}]
["MG04-01131",{"$f":"VLOOKUP(A60,Récap!$A$4:$AB$1979,28,FALSE)","v":30}]
["MG04-01174",{"$f":"VLOOKUP(A61,Récap!$A$4:$AB$1979,28,FALSE)","v":25}]
["MG04-01191",{"$f":"VLOOKUP(A62,Récap!$A$4:$AB$1979,28,FALSE)","v":20}]
["MG04-01271",{"$f":"VLOOKUP(A63,Récap!$A$4:$AB$1979,28,FALSE)","v":10}]
["MG05-01001",{"$f":"VLOOKUP(A64,Récap!$A$4:$AB$1979,28,FALSE)","v":0}]
["MG05-01025",{"$f":"VLOOKUP(A65,Récap!$A$4:$AB$1979,28,FALSE)","v":5}]
["MG05-01032",{"$f":"VLOOKUP(A66,Récap!$A$4:$AB$1979,28,FALSE)","v":10}]
["MG05-01087",{"$f":"VLOOKUP(A67,Récap!$A$4:$AB$1979,28,FALSE)","v":15}]
["MG05-01095",{"$f":"VLOOKUP(A68,Récap!$A$4:$AB$1979,28,FALSE)","v":50}]
["MG06-01002-353",{"$f":"VLOOKUP(A69,Récap!$A$4:$AB$1979,28,FALSE)","v":0}]
["MG06-01013",{"$f":"VLOOKUP(A70,Récap!$A$4:$AB$1979,28,FALSE)","v":20}]
["MG06-01014",{"$f":"VLOOKUP(A71,Récap!$A$4:$AB$1979,28,FALSE)","v":10}]
["MG06-01036",{"$f":"VLOOKUP(A72,Récap!$A$4:$AB$1979,28,FALSE)","v":10}]
["MG06-01037",{"$f":"VLOOKUP(A73,Récap!$A$4:$AB$1979,28,FALSE)","v":10}]
["MG06-01039",{"$f":"VLOOKUP(A74,Récap!$A$4:$AB$1979,28,FALSE)","v":20}]
["MG06-01054",{"$f":"VLOOKUP(A75,Récap!$A$4:$AB$1979,28,FALSE)","v":20}]
["RD01077",{"$f":"VLOOKUP(A76,Récap!$A$4:$AB$1979,28,FALSE)","v":5}]
["RD01086",{"$f":"VLOOKUP(A77,Récap!$A$4:$AB$1979,28,FALSE)","v":20}]
["MG02-05027",4]
["MG02-05028",{"$f":"VLOOKUP(A79,Récap!$A$4:$AB$1979,28,FALSE)","v":10}]
["MG02-09050",{"$f":"VLOOKUP(A80,Récap!$A$4:$AB$1979,28,FALSE)","v":5}]
["MG02-11009",{"$f":"VLOOKUP(A81,Récap!$A$4:$AB$1979,28,FALSE)","v":5}]
["MG02-08045",{"$f":"VLOOKUP(A82,Récap!$A$4:$AB$1979,28,FALSE)","v":5}]
["MG02-13010",5]
["MG02-13016",10]
["MG03-08009",{"$f":"VLOOKUP(A85,Récap!$A$4:$AB$1979,28,FALSE)","v":10}]
["MG03-08010",{"$f":"VLOOKUP(A86,Récap!$A$4:$AB$1979,28,FALSE)","v":5}]
["MG04-01002",{"$f":"VLOOKUP(A87,Récap!$A$4:$AB$1979,28,FALSE)","v":10}]
["MG04-01012",{"$f":"VLOOKUP(A88,Récap!$A$4:$AB$1979,28,FALSE)","v":5}]
["MG04-01013",{"$f":"VLOOKUP(A89,Récap!$A$4:$AB$1979,28,FALSE)","v":10}]
["MG04-01015",{"$f":"VLOOKUP(A90,Récap!$A$4:$AB$1979,28,FALSE)","v":15}]
["MG04-01025",{"$f":"VLOOKUP(A91,Récap!$A$4:$AB$1979,28,FALSE)","v":6}]
["MG04-01028",{"$f":"VLOOKUP(A92,Récap!$A$4:$AB$1979,28,FALSE)","v":10}]
["MG04-01063",{"$f":"VLOOKUP(A93,Récap!$A$4:$AB$1979,28,FALSE)","v":5}]
["MG04-01064",{"$f":"VLOOKUP(A94,Récap!$A$4:$AB$1979,28,FALSE)","v":5}]
["MG04-01082",{"$f":"VLOOKUP(A95,Récap!$A$4:$AB$1979,28,FALSE)","v":10}]
["MG01-01001",{"$f":"VLOOKUP(A96,Récap!$A$4:$AB$1979,28,FALSE)","v":5}]
["MG01-01003",{"$f":"VLOOKUP(A97,Récap!$A$4:$AB$1979,28,FALSE)","v":5}]
["MG01-05002",{"$f":"VLOOKUP(A98,Récap!$A$4:$AB$1979,28,FALSE)","v":2}]
["MG02-01010",{"$f":"VLOOKUP(A99,Récap!$A$4:$AB$1979,28,FALSE)","v":3}]
["MG02-01013",{"$f":"VLOOKUP(A100,Récap!$A$4:$AB$1979,28,FALSE)","v":3}]
["MG02-01014",{"$f":"VLOOKUP(A101,Récap!$A$4:$AB$1979,28,FALSE)","v":10}]
["MG02-01027",{"$f":"VLOOKUP(A102,Récap!$A$4:$AB$1979,28,FALSE)","v":5}]
["MG02-01035",{"$f":"VLOOKUP(A103,Récap!$A$4:$AB$1979,28,FALSE)","v":10}]
["MG02-01041",{"$f":"VLOOKUP(A104,Récap!$A$4:$AB$1979,28,FALSE)","v":5}]
["MG02-01042",{"$f":"VLOOKUP(A105,Récap!$A$4:$AB$1979,28,FALSE)","v":5}]
["MG02-01051",{"$f":"VLOOKUP(A106,Récap!$A$4:$AB$1979,28,FALSE)","v":5}]
["MG02-01062",{"$f":"VLOOKUP(A107,Récap!$A$4:$AB$1979,28,FALSE)","v":5}]
["MG02-02038",{"$f":"VLOOKUP(A108,Récap!$A$4:$AB$1979,28,FALSE)","v":5}]
["MG02-02039",{"$f":"VLOOKUP(A109,Récap!$A$4:$AB$1979,28,FALSE)","v":10}]
["MG02-02043",{"$f":"VLOOKUP(A110,Récap!$A$4:$AB$1979,28,FALSE)","v":10}]
["MG02-02048",{"$f":"VLOOKUP(A111,Récap!$A$4:$AB$1979,28,FALSE)","v":10}]
["MG02-03008",11]
["MG02-04006",{"$f":"VLOOKUP(A113,Récap!$A$4:$AB$1979,28,FALSE)","v":5}]
[10470,{"$f":"VLOOKUP(A114,Récap!$A$4:$AB$1979,28,FALSE)","v":5}]
[10310,{"$f":"VLOOKUP(A115,Récap!$A$4:$AB$1979,28,FALSE)","v":6}]
[10480,{"$f":"VLOOKUP(A116,Récap!$A$4:$AB$1979,28,FALSE)","v":5}]
["10405P",{"$f":"VLOOKUP(A117,Récap!$A$4:$AB$1979,28,FALSE)","v":25}]
[10435,{"$f":"VLOOKUP(A118,Récap!$A$4:$AB$1979,28,FALSE)","v":5}]
[10465,{"$f":"VLOOKUP(A119,Récap!$A$4:$AB$1979,28,FALSE)","v":0}]
[10550,{"$f":"VLOOKUP(A120,Récap!$A$4:$AB$1979,28,FALSE)","v":5}]
[20170,25]
[20130,{"$f":"VLOOKUP(A122,Récap!$A$4:$AB$1979,28,FALSE)","v":5}]
[2712600,{"$f":"VLOOKUP(A123,Récap!$A$4:$AB$1979,28,FALSE)","v":15}]
["MD719469",{"$f":"VLOOKUP(A124,Récap!$A$4:$AB$1979,28,FALSE)","v":10}]
[27894101243,{"$f":"VLOOKUP(A125,Récap!$A$4:$AB$1979,28,FALSE)","v":20}]
["27MD368858",{"$f":"VLOOKUP(A126,Récap!$A$4:$AB$1979,28,FALSE)","v":20}]
["27MR148321",{"$f":"VLOOKUP(A127,Récap!$A$4:$AB$1979,28,FALSE)","v":15}]
[7988060000,{"$f":"VLOOKUP(A128,Récap!$A$4:$AB$1979,28,FALSE)","v":1}]
[7988070000,{"$f":"VLOOKUP(A129,Récap!$A$4:$AB$1979,28,FALSE)","v":1}]
[7986610000,{"$f":"VLOOKUP(A130,Récap!$A$4:$AB$1979,28,FALSE)","v":1}]
[7980260000,{"$f":"VLOOKUP(A131,Récap!$A$4:$AB$1979,28,FALSE)","v":1}]
[798017000,{"$f":"VLOOKUP(A132,Récap!$A$4:$AB$1979,28,FALSE)","v":1}]
[7980300000,{"$f":"VLOOKUP(A133,Récap!$A$4:$AB$1979,28,FALSE)","v":1}]
[7997140000,{"$f":"VLOOKUP(A134,Récap!$A$4:$AB$1979,28,FALSE)","v":1}]
[7997180000,{"$f":"VLOOKUP(A135,Récap!$A$4:$AB$1979,28,FALSE)","v":1}]
["DD-588",{"$f":"VLOOKUP(A136,Récap!$A$4:$AB$1979,28,FALSE)","v":5}]
["DD-587",{"$f":"VLOOKUP(A137,Récap!$A$4:$AB$1979,28,FALSE)","v":5}]
["DD-505",{"$f":"VLOOKUP(A138,Récap!$A$4:$AB$1979,28,FALSE)","v":2}]
["DD-506",{"$f":"VLOOKUP(A139,Récap!$A$4:$AB$1979,28,FALSE)","v":2}]
["DD-219",{"$f":"VLOOKUP(A140,Récap!$A$4:$AB$1979,28,FALSE)","v":1}]
["BE-202",{"$f":"VLOOKUP(A141,Récap!$A$4:$AB$1979,28,FALSE)","v":1}]
["BE-203",{"$f":"VLOOKUP(A142,Récap!$A$4:$AB$1979,28,FALSE)","v":1}]
["BE-236",{"$f":"VLOOKUP(A143,Récap!$A$4:$AB$1979,28,FALSE)","v":1}]
["BE-253",{"$f":"VLOOKUP(A144,Récap!$A$4:$AB$1979,28,FALSE)","v":1}]
["BE-500",{"$f":"VLOOKUP(A145,Récap!$A$4:$AB$1979,28,FALSE)","v":5}]
["BE-501",{"$f":"VLOOKUP(A146,Récap!$A$4:$AB$1979,28,FALSE)","v":5}]
["BE-532",{"$f":"VLOOKUP(A147,Récap!$A$4:$AB$1979,28,FALSE)","v":2}]
["GI-337",{"$f":"VLOOKUP(A148,Récap!$A$4:$AB$1979,28,FALSE)","v":4}]
["GI-338",{"$f":"VLOOKUP(A149,Récap!$A$4:$AB$1979,28,FALSE)","v":2}]
["TI-512",{"$f":"VLOOKUP(A150,Récap!$A$4:$AB$1979,28,FALSE)","v":6}]
["TI-517",{"$f":"VLOOKUP(A151,Récap!$A$4:$AB$1979,28,FALSE)","v":6}]
["BJ-505",{"$f":"VLOOKUP(A152,Récap!$A$4:$AB$1979,28,FALSE)","v":4}]
["BJ-508",{"$f":"VLOOKUP(A153,Récap!$A$4:$AB$1979,28,FALSE)","v":4}]
["BJ-913",{"$f":"VLOOKUP(A154,Récap!$A$4:$AB$1979,28,FALSE)","v":4}]
["BJ-906",{"$f":"VLOOKUP(A155,Récap!$A$4:$AB$1979,28,FALSE)","v":2}]
["BJ-914",{"$f":"VLOOKUP(A156,Récap!$A$4:$AB$1979,28,FALSE)","v":2}]
["BJ-915",{"$f":"VLOOKUP(A157,Récap!$A$4:$AB$1979,28,FALSE)","v":2}]
["FA-523S",4]
["FA-383S",{"$f":"VLOOKUP(A159,Récap!$A$4:$AB$1979,28,FALSE)","v":5}]
["FO-912S",{"$f":"VLOOKUP(A160,Récap!$A$4:$AB$1979,28,FALSE)","v":3}]
["FA-2010S",{"$f":"VLOOKUP(A161,Récap!$A$4:$AB$1979,28,FALSE)","v":2}]
["FA-345S",{"$f":"VLOOKUP(A162,Récap!$A$4:$AB$1979,28,FALSE)","v":2}]
["PA-582AF",{"$f":"VLOOKUP(A163,Récap!$A$4:$AB$1979,28,FALSE)","v":3}]
["PA-323AF",{"$f":"VLOOKUP(A164,Récap!$A$4:$AB$1979,28,FALSE)","v":2}]
["PA-373AF",{"$f":"VLOOKUP(A165,Récap!$A$4:$AB$1979,28,FALSE)","v":0}]
["PA-247AF",{"$f":"VLOOKUP(A166,Récap!$A$4:$AB$1979,28,FALSE)","v":1}]
["PA-256AF",{"$f":"VLOOKUP(A167,Récap!$A$4:$AB$1979,28,FALSE)","v":1}]
["PA-269AF",{"$f":"VLOOKUP(A168,Récap!$A$4:$AB$1979,28,FALSE)","v":1}]
["PA-115AF",{"$f":"VLOOKUP(A169,Récap!$A$4:$AB$1979,28,FALSE)","v":1}]
["PA-123AF",{"$f":"VLOOKUP(A170,Récap!$A$4:$AB$1979,28,FALSE)","v":1}]
["PA-143AF",{"$f":"VLOOKUP(A171,Récap!$A$4:$AB$1979,28,FALSE)","v":1}]
["PA-800AF",{"$f":"VLOOKUP(A172,Récap!$A$4:$AB$1979,28,FALSE)","v":1}]
["PA-504AF",{"$f":"VLOOKUP(A173,Récap!$A$4:$AB$1979,28,FALSE)","v":2}]
["CS-593",{"$f":"VLOOKUP(A174,Récap!$A$4:$AB$1979,28,FALSE)","v":4}]
["CY-599",{"$f":"VLOOKUP(A175,Récap!$A$4:$AB$1979,28,FALSE)","v":3}]
["BJ-513",{"$f":"VLOOKUP(A176,Récap!$A$4:$AB$1979,28,FALSE)","v":1}]
["BJ-514",{"$f":"VLOOKUP(A177,Récap!$A$4:$AB$1979,28,FALSE)","v":2}]
["BJ-509",{"$f":"VLOOKUP(A178,Récap!$A$4:$AB$1979,28,FALSE)","v":2}]
["CE-K00",{"$f":"VLOOKUP(A179,Récap!$A$4:$AB$1979,28,FALSE)","v":20}]
["JO-502",{"$f":"VLOOKUP(A180,Récap!$A$4:$AB$1979,28,FALSE)","v":2}]
["KK-15006",{"$f":"VLOOKUP(A181,Récap!$A$4:$AB$1979,28,FALSE)","v":4}]
["KK-15005",{"$f":"VLOOKUP(A182,Récap!$A$4:$AB$1979,28,FALSE)","v":2}]
["KK-13028",{"$f":"VLOOKUP(A183,Récap!$A$4:$AB$1979,28,FALSE)","v":1}]
["KK-13010",{"$f":"VLOOKUP(A184,Récap!$A$4:$AB$1979,28,FALSE)","v":0}]
["KK-22008",{"$f":"VLOOKUP(A185,Récap!$A$4:$AB$1979,28,FALSE)","v":2}]
["KK-21008",{"$f":"VLOOKUP(A186,Récap!$A$4:$AB$1979,28,FALSE)","v":2}]
["KK-23035",{"$f":"VLOOKUP(A187,Récap!$A$4:$AB$1979,28,FALSE)","v":2}]
["72-6183",{"$f":"VLOOKUP(A188,Récap!$A$4:$AB$1979,28,FALSE)","v":10}]
["72-6184",{"$f":"VLOOKUP(A189,Récap!$A$4:$AB$1979,28,FALSE)","v":30}]
["2089447403012D",{"$f":"VLOOKUP(A190,Récap!$A$4:$AB$1979,28,FALSE)","v":5}]
["8-94474031-3",{"$f":"VLOOKUP(A191,Récap!$A$4:$AB$1979,28,FALSE)","v":2}]
["20002131609D",{"$f":"VLOOKUP(A192,Récap!$A$4:$AB$1979,28,FALSE)","v":20}]
["20002131609G",{"$f":"VLOOKUP(A193,Récap!$A$4:$AB$1979,28,FALSE)","v":20}]
["213-1609 LH",{"$f":"VLOOKUP(A194,Récap!$A$4:$AB$1979,28,FALSE)","v":10}]
["213-1609 RH",{"$f":"VLOOKUP(A195,Récap!$A$4:$AB$1979,28,FALSE)","v":10}]
[27894244409,{"$f":"VLOOKUP(A196,Récap!$A$4:$AB$1979,28,FALSE)","v":5}]
["MG02-13002",{"$f":"VLOOKUP(A197,Récap!$A$4:$AB$1979,28,FALSE)","v":2}]
["DQ124",{"$f":"VLOOKUP(A198,Récap!$A$4:$AB$1979,28,FALSE)","v":10}]
[245010,{"$f":"VLOOKUP(A199,Récap!$A$4:$AB$1979,28,FALSE)","v":2}]
[27587410308,{"$f":"VLOOKUP(A200,Récap!$A$4:$AB$1979,28,FALSE)","v":5}]
["TN703",{"$f":"VLOOKUP(A201,Récap!$A$4:$AB$1979,28,FALSE)","v":25}]
["0001",{"$f":"VLOOKUP(A202,Récap!$A$4:$AB$1979,28,FALSE)","v":40}]
["0031",{"$f":"VLOOKUP(A203,Récap!$A$4:$AB$1979,28,FALSE)","v":4}]
["RVN010/012",200]
["0003-TUB",{"$f":"VLOOKUP(A205,Récap!$A$4:$AB$1979,28,FALSE)","v":20}]
["BGA-SILIC",{"$f":"VLOOKUP(A206,Récap!$A$4:$AB$1979,28,FALSE)","v":10}]
["0037",{"$f":"VLOOKUP(A207,Récap!$A$4:$AB$1979,28,FALSE)","v":10}]
["27148IS",{"$f":"VLOOKUP(A208,Récap!$A$4:$AB$1979,28,FALSE)","v":5}]
["0012",{"$f":"VLOOKUP(A209,Récap!$A$4:$AB$1979,28,FALSE)","v":10}]
["0057",{"$f":"VLOOKUP(A210,Récap!$A$4:$AB$1979,28,FALSE)","v":10}]
["0030",{"$f":"VLOOKUP(A211,Récap!$A$4:$AB$1979,28,FALSE)","v":6}]
["A1319004",{"$f":"VLOOKUP(A212,Récap!$A$4:$AB$1979,28,FALSE)","v":10}]
["IM3067",{"$f":"VLOOKUP(A213,Récap!$A$4:$AB$1979,28,FALSE)","v":3}]
["IM3136",{"$f":"VLOOKUP(A214,Récap!$A$4:$AB$1979,28,FALSE)","v":3}]
["MYH407",{"$f":"VLOOKUP(A215,Récap!$A$4:$AB$1979,28,FALSE)","v":3}]
["IM3079Y",{"$f":"VLOOKUP(A216,Récap!$A$4:$AB$1979,28,FALSE)","v":3}]
["S/3013",{"$f":"VLOOKUP(A217,Récap!$A$4:$AB$1979,28,FALSE)","v":2}]
[150814,{"$f":"VLOOKUP(A218,Récap!$A$4:$AB$1979,28,FALSE)","v":2}]
[139610,{"$f":"VLOOKUP(A219,Récap!$A$4:$AB$1979,28,FALSE)","v":3}]
[137077,{"$f":"VLOOKUP(A220,Récap!$A$4:$AB$1979,28,FALSE)","v":2}]
[137076,{"$f":"VLOOKUP(A221,Récap!$A$4:$AB$1979,28,FALSE)","v":2}]
["HHR604",{"$f":"VLOOKUP(A222,Récap!$A$4:$AB$1979,28,FALSE)","v":4}]
["HI10004-1ZT",{"$f":"VLOOKUP(A223,Récap!$A$4:$AB$1979,28,FALSE)","v":2}]
["ZZ2009-09",{"$f":"VLOOKUP(A224,Récap!$A$4:$AB$1979,28,FALSE)","v":4}]
[133749,3]
[137075,{"$f":"VLOOKUP(A226,Récap!$A$4:$AB$1979,28,FALSE)","v":4}]
[510200,{"$f":"VLOOKUP(A227,Récap!$A$4:$AB$1979,28,FALSE)","v":5}]
[510000,{"$f":"VLOOKUP(A228,Récap!$A$4:$AB$1979,28,FALSE)","v":0}]
[520300,{"$f":"VLOOKUP(A229,Récap!$A$4:$AB$1979,28,FALSE)","v":5}]
[520400,{"$f":"VLOOKUP(A230,Récap!$A$4:$AB$1979,28,FALSE)","v":3}]
[520600,{"$f":"VLOOKUP(A231,Récap!$A$4:$AB$1979,28,FALSE)","v":2}]
[521400,{"$f":"VLOOKUP(A232,Récap!$A$4:$AB$1979,28,FALSE)","v":2}]
[521600,{"$f":"VLOOKUP(A233,Récap!$A$4:$AB$1979,28,FALSE)","v":2}]
["NOA-2215",{"$f":"VLOOKUP(A234,Récap!$A$4:$AB$1979,28,FALSE)","v":25}]
["DEPQ5",{"$f":"VLOOKUP(A235,Récap!$A$4:$AB$1979,28,FALSE)","v":50}]
["A1319002",{"$f":"VLOOKUP(A236,Récap!$A$4:$AB$1979,28,FALSE)","v":40}]
["A1319001",{"$f":"VLOOKUP(A237,Récap!$A$4:$AB$1979,28,FALSE)","v":40}]
[182501,{"$f":"VLOOKUP(A238,Récap!$A$4:$AB$1979,28,FALSE)","v":5}]
[182502,{"$f":"VLOOKUP(A239,Récap!$A$4:$AB$1979,28,FALSE)","v":5}]
[182503,3]
[182504,{"$f":"VLOOKUP(A241,Récap!$A$4:$AB$1979,28,FALSE)","v":5}]
[182505,3]
[182506,{"$f":"VLOOKUP(A243,Récap!$A$4:$AB$1979,28,FALSE)","v":10}]
[182507,{"$f":"VLOOKUP(A244,Récap!$A$4:$AB$1979,28,FALSE)","v":5}]
[182508,{"$f":"VLOOKUP(A245,Récap!$A$4:$AB$1979,28,FALSE)","v":5}]
[182510,{"$f":"VLOOKUP(A246,Récap!$A$4:$AB$1979,28,FALSE)","v":5}]
[182511,{"$f":"VLOOKUP(A247,Récap!$A$4:$AB$1979,28,FALSE)","v":5}]
[182512,{"$f":"VLOOKUP(A248,Récap!$A$4:$AB$1979,28,FALSE)","v":5}]
[182513,2]
[182514,{"$f":"VLOOKUP(A250,Récap!$A$4:$AB$1979,28,FALSE)","v":5}]
[182515,{"$f":"VLOOKUP(A251,Récap!$A$4:$AB$1979,28,FALSE)","v":5}]
[182516,0]
[182517,{"$f":"VLOOKUP(A253,Récap!$A$4:$AB$1979,28,FALSE)","v":2}]
[182518,{"$f":"VLOOKUP(A254,Récap!$A$4:$AB$1979,28,FALSE)","v":0}]
[182519,{"$f":"VLOOKUP(A255,Récap!$A$4:$AB$1979,28,FALSE)","v":0}]
[182520,{"$f":"VLOOKUP(A256,Récap!$A$4:$AB$1979,28,FALSE)","v":5}]
[182521,{"$f":"VLOOKUP(A257,Récap!$A$4:$AB$1979,28,FALSE)","v":0}]
["A0120109",{"$f":"VLOOKUP(A258,Récap!$A$4:$AB$1979,28,FALSE)","v":2}]
["A0120102",{"$f":"VLOOKUP(A259,Récap!$A$4:$AB$1979,28,FALSE)","v":1}]
["A0120108",{"$f":"VLOOKUP(A260,Récap!$A$4:$AB$1979,28,FALSE)","v":2}]
["A0120100NM",{"$f":"VLOOKUP(A261,Récap!$A$4:$AB$1979,28,FALSE)","v":2}]
["A0120101N",{"$f":"VLOOKUP(A262,Récap!$A$4:$AB$1979,28,FALSE)","v":2}]
["A0120110",{"$f":"VLOOKUP(A263,Récap!$A$4:$AB$1979,28,FALSE)","v":2}]
["A0120112",{"$f":"VLOOKUP(A264,Récap!$A$4:$AB$1979,28,FALSE)","v":2}]
["ISZ-09/10",{"$f":"VLOOKUP(A265,Récap!$A$4:$AB$1979,28,FALSE)","v":1}]
["SO150304-003",{"$f":"VLOOKUP(A266,Récap!$A$4:$AB$1979,28,FALSE)","v":1}]
["0-124",{"$f":"VLOOKUP(A267,Récap!$A$4:$AB$1979,28,FALSE)","v":1}]
["05-3421",{"$f":"VLOOKUP(A268,Récap!$A$4:$AB$1979,28,FALSE)","v":1}]
["TW1622A-025",{"$f":"VLOOKUP(A269,Récap!$A$4:$AB$1979,28,FALSE)","v":2}]
["SH-1622A-STD",{"$f":"VLOOKUP(A270,Récap!$A$4:$AB$1979,28,FALSE)","v":2}]
["CB1070GP050",{"$f":"VLOOKUP(A271,Récap!$A$4:$AB$1979,28,FALSE)","v":2}]
["CB1070A-025",{"$f":"VLOOKUP(A272,Récap!$A$4:$AB$1979,28,FALSE)","v":2}]
["MS1622A-STD",{"$f":"VLOOKUP(A273,Récap!$A$4:$AB$1979,28,FALSE)","v":2}]
["MS1622GP025",{"$f":"VLOOKUP(A274,Récap!$A$4:$AB$1979,28,FALSE)","v":2}]
["CB1131A-075",{"$f":"VLOOKUP(A275,Récap!$A$4:$AB$1979,28,FALSE)","v":2}]
["CB1131A-STD",{"$f":"VLOOKUP(A276,Récap!$A$4:$AB$1979,28,FALSE)","v":2}]
["CB1131A-025",{"$f":"VLOOKUP(A277,Récap!$A$4:$AB$1979,28,FALSE)","v":2}]
["MS1131A-025",{"$f":"VLOOKUP(A278,Récap!$A$4:$AB$1979,28,FALSE)","v":2}]
["MS1131A-050",{"$f":"VLOOKUP(A279,Récap!$A$4:$AB$1979,28,FALSE)","v":3}]
["MS1131A-STD",{"$f":"VLOOKUP(A280,Récap!$A$4:$AB$1979,28,FALSE)","v":2}]
["CB2016A-STD",{"$f":"VLOOKUP(A281,Récap!$A$4:$AB$1979,28,FALSE)","v":2}]
["SH1605BSTD",{"$f":"VLOOKUP(A282,Récap!$A$4:$AB$1979,28,FALSE)","v":2}]
["MS1138GPSTD",{"$f":"VLOOKUP(A283,Récap!$A$4:$AB$1979,28,FALSE)","v":2}]
["MS1138GP025",{"$f":"VLOOKUP(A284,Récap!$A$4:$AB$1979,28,FALSE)","v":2}]
["MS1138GP075",{"$f":"VLOOKUP(A285,Récap!$A$4:$AB$1979,28,FALSE)","v":2}]
["MS1138GP050",{"$f":"VLOOKUP(A286,Récap!$A$4:$AB$1979,28,FALSE)","v":1}]
["PB1622J-STD",{"$f":"VLOOKUP(A287,Récap!$A$4:$AB$1979,28,FALSE)","v":3}]
["PB-1802-JSF",{"$f":"VLOOKUP(A288,Récap!$A$4:$AB$1979,28,FALSE)","v":3}]
["PB1605J-STD",{"$f":"VLOOKUP(A289,Récap!$A$4:$AB$1979,28,FALSE)","v":3}]
["WL11-10-100E",{"$f":"VLOOKUP(A290,Récap!$A$4:$AB$1979,28,FALSE)","v":1}]
["MD348983",{"$f":"VLOOKUP(A291,Récap!$A$4:$AB$1979,28,FALSE)","v":1}]
["AHI2006",{"$f":"VLOOKUP(A292,Récap!$A$4:$AB$1979,28,FALSE)","v":0}]
["M002T87271ZT",{"$f":"VLOOKUP(A293,Récap!$A$4:$AB$1979,28,FALSE)","v":0}]
[20894133275,{"$f":"VLOOKUP(A294,Récap!$A$4:$AB$1979,28,FALSE)","v":3}]
[20894247875,{"$f":"VLOOKUP(A295,Récap!$A$4:$AB$1979,28,FALSE)","v":3}]
["LPR4172",{"$f":"VLOOKUP(A296,Récap!$A$4:$AB$1979,28,FALSE)","v":12}]
["MD050196",{"$f":"VLOOKUP(A297,Récap!$A$4:$AB$1979,28,FALSE)","v":6}]
["8-94165177",{"$f":"VLOOKUP(A298,Récap!$A$4:$AB$1979,28,FALSE)","v":8}]
["8-94113-583-0",7]
[73012,{"$f":"VLOOKUP(A300,Récap!$A$4:$AB$1979,28,FALSE)","v":6}]
[73010,{"$f":"VLOOKUP(A301,Récap!$A$4:$AB$1979,28,FALSE)","v":3}]
["2201A01",{"$f":"VLOOKUP(A302,Récap!$A$4:$AB$1979,28,FALSE)","v":200}]
["2202A01",{"$f":"VLOOKUP(A303,Récap!$A$4:$AB$1979,28,FALSE)","v":200}]
["JD-2001",{"$f":"VLOOKUP(A304,Récap!$A$4:$AB$1979,28,FALSE)","v":2}]
["3AL922000961",{"$f":"VLOOKUP(A305,Récap!$A$4:$AB$1979,28,FALSE)","v":1}]
["3AM922000971",{"$f":"VLOOKUP(A306,Récap!$A$4:$AB$1979,28,FALSE)","v":6}]
[43246,{"$f":"VLOOKUP(A307,Récap!$A$4:$AB$1979,28,FALSE)","v":2}]
[920382,{"$f":"VLOOKUP(A308,Récap!$A$4:$AB$1979,28,FALSE)","v":5}]
[300333,{"$f":"VLOOKUP(A309,Récap!$A$4:$AB$1979,28,FALSE)","v":2}]
[300428,{"$f":"VLOOKUP(A310,Récap!$A$4:$AB$1979,28,FALSE)","v":7}]
["114-001",{"$f":"VLOOKUP(A311,Récap!$A$4:$AB$1979,28,FALSE)","v":6}]
[3748,{"$f":"VLOOKUP(A312,Récap!$A$4:$AB$1979,28,FALSE)","v":6}]
[3778,{"$f":"VLOOKUP(A313,Récap!$A$4:$AB$1979,28,FALSE)","v":5}]
["8-94317667",{"$f":"VLOOKUP(A314,Récap!$A$4:$AB$1979,28,FALSE)","v":3}]
["8-94317668",{"$f":"VLOOKUP(A315,Récap!$A$4:$AB$1979,28,FALSE)","v":3}]
["N9YC",{"$f":"VLOOKUP(A316,Récap!$A$4:$AB$1979,28,FALSE)","v":5}]
["C9YC",{"$f":"VLOOKUP(A317,Récap!$A$4:$AB$1979,28,FALSE)","v":50}]
["S9YC",{"$f":"VLOOKUP(A318,Récap!$A$4:$AB$1979,28,FALSE)","v":48}]
["L87YC",{"$f":"VLOOKUP(A319,Récap!$A$4:$AB$1979,28,FALSE)","v":50}]
["RC10DMC",{"$f":"VLOOKUP(A320,Récap!$A$4:$AB$1979,28,FALSE)","v":50}]
["RC10YCC",30]
["4565-16",{"$f":"VLOOKUP(A322,Récap!$A$4:$AB$1979,28,FALSE)","v":30}]
["U050",{"$f":"VLOOKUP(A323,Récap!$A$4:$AB$1979,28,FALSE)","v":2}]
["U728/4",{"$f":"VLOOKUP(A324,Récap!$A$4:$AB$1979,28,FALSE)","v":5}]
["U183",{"$f":"VLOOKUP(A325,Récap!$A$4:$AB$1979,28,FALSE)","v":5}]
["U100",{"$f":"VLOOKUP(A326,Récap!$A$4:$AB$1979,28,FALSE)","v":0}]
["U126",{"$f":"VLOOKUP(A327,Récap!$A$4:$AB$1979,28,FALSE)","v":5}]
["U960",{"$f":"VLOOKUP(A328,Récap!$A$4:$AB$1979,28,FALSE)","v":3}]
["U941",{"$f":"VLOOKUP(A329,Récap!$A$4:$AB$1979,28,FALSE)","v":5}]
["ITE/3-12",{"$f":"VLOOKUP(A330,Récap!$A$4:$AB$1979,28,FALSE)","v":5}]
["ITJS/3-12",{"$f":"VLOOKUP(A331,Récap!$A$4:$AB$1979,28,FALSE)","v":10}]
["ITE/3-24",{"$f":"VLOOKUP(A332,Récap!$A$4:$AB$1979,28,FALSE)","v":10}]
["RLP/5-12",{"$f":"VLOOKUP(A333,Récap!$A$4:$AB$1979,28,FALSE)","v":10}]
["RLP/5-24",{"$f":"VLOOKUP(A334,Récap!$A$4:$AB$1979,28,FALSE)","v":10}]
["MD050456",{"$f":"VLOOKUP(A335,Récap!$A$4:$AB$1979,28,FALSE)","v":10}]
["MD303981",{"$f":"VLOOKUP(A336,Récap!$A$4:$AB$1979,28,FALSE)","v":10}]
["405-16",{"$f":"VLOOKUP(A337,Récap!$A$4:$AB$1979,28,FALSE)","v":10}]
["27149FD",{"$f":"VLOOKUP(A338,Récap!$A$4:$AB$1979,28,FALSE)","v":30}]
[2755,{"$f":"VLOOKUP(A339,Récap!$A$4:$AB$1979,28,FALSE)","v":50}]
[75801,{"$f":"VLOOKUP(A340,Récap!$A$4:$AB$1979,28,FALSE)","v":30}]
["TS-118",{"$f":"VLOOKUP(A341,Récap!$A$4:$AB$1979,28,FALSE)","v":10}]
["M8360",{"$f":"VLOOKUP(A342,Récap!$A$4:$AB$1979,28,FALSE)","v":15}]
["MG02-16004",{"$f":"VLOOKUP(A343,Récap!$A$4:$AB$1979,28,FALSE)","v":20}]
["D4267",{"$f":"VLOOKUP(A344,Récap!$A$4:$AB$1979,28,FALSE)","v":30}]
["D4210",{"$f":"VLOOKUP(A345,Récap!$A$4:$AB$1979,28,FALSE)","v":30}]
["D4209",{"$f":"VLOOKUP(A346,Récap!$A$4:$AB$1979,28,FALSE)","v":4}]
["D4805",{"$f":"VLOOKUP(A347,Récap!$A$4:$AB$1979,28,FALSE)","v":10}]
["D3062C",{"$f":"VLOOKUP(A348,Récap!$A$4:$AB$1979,28,FALSE)","v":10}]
["D1041C",{"$f":"VLOOKUP(A349,Récap!$A$4:$AB$1979,28,FALSE)","v":50}]
["D1202C",{"$f":"VLOOKUP(A350,Récap!$A$4:$AB$1979,28,FALSE)","v":50}]
["D3116",{"$f":"VLOOKUP(A351,Récap!$A$4:$AB$1979,28,FALSE)","v":30}]
["D1224C",{"$f":"VLOOKUP(A352,Récap!$A$4:$AB$1979,28,FALSE)","v":20}]
["12649/10",{"$f":"VLOOKUP(A353,Récap!$A$4:$AB$1979,28,FALSE)","v":11}]
["48548/10",{"$f":"VLOOKUP(A354,Récap!$A$4:$AB$1979,28,FALSE)","v":9}]
["BT19Z-2",{"$f":"VLOOKUP(A355,Récap!$A$4:$AB$1979,28,FALSE)","v":6}]
["48TKB3204R",{"$f":"VLOOKUP(A356,Récap!$A$4:$AB$1979,28,FALSE)","v":4}]
["32008XJ",{"$f":"VLOOKUP(A357,Récap!$A$4:$AB$1979,28,FALSE)","v":3}]
["32009XJ-A",{"$f":"VLOOKUP(A358,Récap!$A$4:$AB$1979,28,FALSE)","v":4}]
[30208,{"$f":"VLOOKUP(A359,Récap!$A$4:$AB$1979,28,FALSE)","v":4}]
["30208A",{"$f":"VLOOKUP(A360,Récap!$A$4:$AB$1979,28,FALSE)","v":13}]
[30208,{"$f":"VLOOKUP(A361,Récap!$A$4:$AB$1979,28,FALSE)","v":4}]
["BD25-9T12",{"$f":"VLOOKUP(A362,Récap!$A$4:$AB$1979,28,FALSE)","v":13}]
["TM206C3^^UR",{"$f":"VLOOKUP(A363,Récap!$A$4:$AB$1979,28,FALSE)","v":6}]
["6904ZZ",{"$f":"VLOOKUP(A364,Récap!$A$4:$AB$1979,28,FALSE)","v":5}]
["6203VVC4",{"$f":"VLOOKUP(A365,Récap!$A$4:$AB$1979,28,FALSE)","v":5}]
["B20-122C3^^UR7",{"$f":"VLOOKUP(A366,Récap!$A$4:$AB$1979,28,FALSE)","v":4}]
["63/32/NC3",{"$f":"VLOOKUP(A367,Récap!$A$4:$AB$1979,28,FALSE)","v":5}]
["30306J",{"$f":"VLOOKUP(A368,Récap!$A$4:$AB$1979,28,FALSE)","v":4}]
["HR32307CN^0A",{"$f":"VLOOKUP(A369,Récap!$A$4:$AB$1979,28,FALSE)","v":4}]
["6360-18",{"$f":"VLOOKUP(A370,Récap!$A$4:$AB$1979,28,FALSE)","v":2}]
["27RD01161",{"$f":"VLOOKUP(A371,Récap!$A$4:$AB$1979,28,FALSE)","v":15}]
["27HU2028",{"$f":"VLOOKUP(A372,Récap!$A$4:$AB$1979,28,FALSE)","v":50}]
["LS-065",{"$f":"VLOOKUP(A373,Récap!$A$4:$AB$1979,28,FALSE)","v":30}]
["AN301",{"$f":"VLOOKUP(A374,Récap!$A$4:$AB$1979,28,FALSE)","v":20}]
["AN310",{"$f":"VLOOKUP(A375,Récap!$A$4:$AB$1979,28,FALSE)","v":5}]
["2924-AN",{"$f":"VLOOKUP(A376,Récap!$A$4:$AB$1979,28,FALSE)","v":5}]
["HS111002",{"$f":"VLOOKUP(A377,Récap!$A$4:$AB$1979,28,FALSE)","v":5}]
["HS274001",{"$f":"VLOOKUP(A378,Récap!$A$4:$AB$1979,28,FALSE)","v":6}]
["8-97139-142-0",{"$f":"VLOOKUP(A379,Récap!$A$4:$AB$1979,28,FALSE)","v":6}]
["8-94128143",{"$f":"VLOOKUP(A380,Récap!$A$4:$AB$1979,28,FALSE)","v":4}]
["8-94128141",{"$f":"VLOOKUP(A381,Récap!$A$4:$AB$1979,28,FALSE)","v":4}]
["8-97179-357-0",3]
["8-97179-358-0",{"$f":"VLOOKUP(A383,Récap!$A$4:$AB$1979,28,FALSE)","v":8}]
["8-97179-359-0",{"$f":"VLOOKUP(A384,Récap!$A$4:$AB$1979,28,FALSE)","v":4}]
["8-97179-360-0",{"$f":"VLOOKUP(A385,Récap!$A$4:$AB$1979,28,FALSE)","v":4}]
["8-97167406",{"$f":"VLOOKUP(A386,Récap!$A$4:$AB$1979,28,FALSE)","v":4}]
["8-97167406-353",{"$f":"VLOOKUP(A387,Récap!$A$4:$AB$1979,28,FALSE)","v":2}]
["8-97062294",{"$f":"VLOOKUP(A388,Récap!$A$4:$AB$1979,28,FALSE)","v":2}]
["ISU045L",{"$f":"VLOOKUP(A389,Récap!$A$4:$AB$1979,28,FALSE)","v":2}]
["ISU045R",{"$f":"VLOOKUP(A390,Récap!$A$4:$AB$1979,28,FALSE)","v":1}]
["8-94316-196-0",{"$f":"VLOOKUP(A391,Récap!$A$4:$AB$1979,28,FALSE)","v":1}]
["IZ153-04G",{"$f":"VLOOKUP(A392,Récap!$A$4:$AB$1979,28,FALSE)","v":2}]
["IZ153-04H",{"$f":"VLOOKUP(A393,Récap!$A$4:$AB$1979,28,FALSE)","v":2}]
["IZ153-18E",{"$f":"VLOOKUP(A394,Récap!$A$4:$AB$1979,28,FALSE)","v":2}]
["ZNP18346",{"$f":"VLOOKUP(A395,Récap!$A$4:$AB$1979,28,FALSE)","v":3}]
["9-97107-348",{"$f":"VLOOKUP(A396,Récap!$A$4:$AB$1979,28,FALSE)","v":2}]
["8-97033-864-0",{"$f":"VLOOKUP(A397,Récap!$A$4:$AB$1979,28,FALSE)","v":4}]
["8-97219-509-2",{"$f":"VLOOKUP(A398,Récap!$A$4:$AB$1979,28,FALSE)","v":8}]
["IZ151-33B",{"$f":"VLOOKUP(A399,Récap!$A$4:$AB$1979,28,FALSE)","v":8}]
["AK4101",{"$f":"VLOOKUP(A400,Récap!$A$4:$AB$1979,28,FALSE)","v":2}]
["AK4100",{"$f":"VLOOKUP(A401,Récap!$A$4:$AB$1979,28,FALSE)","v":5}]
["AK6012",{"$f":"VLOOKUP(A402,Récap!$A$4:$AB$1979,28,FALSE)","v":5}]
["MG04-01077",{"$f":"VLOOKUP(A403,Récap!$A$4:$AB$1979,28,FALSE)","v":4}]
["5-11721-016-0",{"$f":"VLOOKUP(A404,Récap!$A$4:$AB$1979,28,FALSE)","v":5}]
["8-94136-672",{"$f":"VLOOKUP(A405,Récap!$A$4:$AB$1979,28,FALSE)","v":64}]
["5-47519-053",{"$f":"VLOOKUP(A406,Récap!$A$4:$AB$1979,28,FALSE)","v":5}]
["8-94231-459",{"$f":"VLOOKUP(A407,Récap!$A$4:$AB$1979,28,FALSE)","v":5}]
["TY319-31A",{"$f":"VLOOKUP(A408,Récap!$A$4:$AB$1979,28,FALSE)","v":5}]
["TY319-31B",{"$f":"VLOOKUP(A409,Récap!$A$4:$AB$1979,28,FALSE)","v":4}]
["TY319-31G",{"$f":"VLOOKUP(A410,Récap!$A$4:$AB$1979,28,FALSE)","v":4}]
["47550-30100",{"$f":"VLOOKUP(A411,Récap!$A$4:$AB$1979,28,FALSE)","v":4}]
["MD343565",{"$f":"VLOOKUP(A412,Récap!$A$4:$AB$1979,28,FALSE)","v":6}]
["MD343566",{"$f":"VLOOKUP(A413,Récap!$A$4:$AB$1979,28,FALSE)","v":20}]
["MB092437",{"$f":"VLOOKUP(A414,Récap!$A$4:$AB$1979,28,FALSE)","v":20}]
["MB837719",{"$f":"VLOOKUP(A415,Récap!$A$4:$AB$1979,28,FALSE)","v":20}]
["MD099211",{"$f":"VLOOKUP(A416,Récap!$A$4:$AB$1979,28,FALSE)","v":20}]
["TY180-31A",{"$f":"VLOOKUP(A417,Récap!$A$4:$AB$1979,28,FALSE)","v":10}]
["TY180-31B",{"$f":"VLOOKUP(A418,Récap!$A$4:$AB$1979,28,FALSE)","v":2}]
["8-94161-141",{"$f":"VLOOKUP(A419,Récap!$A$4:$AB$1979,28,FALSE)","v":2}]
["WLA2-16-460F",{"$f":"VLOOKUP(A420,Récap!$A$4:$AB$1979,28,FALSE)","v":2}]
["WL0110155",{"$f":"VLOOKUP(A421,Récap!$A$4:$AB$1979,28,FALSE)","v":4}]
["UG52-43-400",{"$f":"VLOOKUP(A422,Récap!$A$4:$AB$1979,28,FALSE)","v":20}]
["MB285-31A",{"$f":"VLOOKUP(A423,Récap!$A$4:$AB$1979,28,FALSE)","v":2}]
["MB285-31B",{"$f":"VLOOKUP(A424,Récap!$A$4:$AB$1979,28,FALSE)","v":5}]
["MB285-31C",{"$f":"VLOOKUP(A425,Récap!$A$4:$AB$1979,28,FALSE)","v":5}]
["MB285-31D",{"$f":"VLOOKUP(A426,Récap!$A$4:$AB$1979,28,FALSE)","v":4}]
["9A0812A14",{"$f":"VLOOKUP(A427,Récap!$A$4:$AB$1979,28,FALSE)","v":2}]
["5TB-A0320",{"$f":"VLOOKUP(A428,Récap!$A$4:$AB$1979,28,FALSE)","v":2}]
["MB176309",{"$f":"VLOOKUP(A429,Récap!$A$4:$AB$1979,28,FALSE)","v":2}]
["MB286-32B",{"$f":"VLOOKUP(A430,Récap!$A$4:$AB$1979,28,FALSE)","v":10}]
["MB555192",{"$f":"VLOOKUP(A431,Récap!$A$4:$AB$1979,28,FALSE)","v":4}]
["5ELS-A110-S",{"$f":"VLOOKUP(A432,Récap!$A$4:$AB$1979,28,FALSE)","v":2}]
["DS144-22A",{"$f":"VLOOKUP(A433,Récap!$A$4:$AB$1979,28,FALSE)","v":4}]
["DS144-22B",{"$f":"VLOOKUP(A434,Récap!$A$4:$AB$1979,28,FALSE)","v":2}]
["DS144-32D",{"$f":"VLOOKUP(A435,Récap!$A$4:$AB$1979,28,FALSE)","v":2}]
["MR992374",{"$f":"VLOOKUP(A436,Récap!$A$4:$AB$1979,28,FALSE)","v":2}]
["8-94217784",{"$f":"VLOOKUP(A437,Récap!$A$4:$AB$1979,28,FALSE)","v":2}]
["8-94217785",{"$f":"VLOOKUP(A438,Récap!$A$4:$AB$1979,28,FALSE)","v":20}]
["8-94222-974",{"$f":"VLOOKUP(A439,Récap!$A$4:$AB$1979,28,FALSE)","v":20}]
["8-94434-974-1",7]
["8-94434-973-1",{"$f":"VLOOKUP(A441,Récap!$A$4:$AB$1979,28,FALSE)","v":10}]
["IS-1132-BM-LH",{"$f":"VLOOKUP(A442,Récap!$A$4:$AB$1979,28,FALSE)","v":10}]
["IS-1132-BM-RH",{"$f":"VLOOKUP(A443,Récap!$A$4:$AB$1979,28,FALSE)","v":2}]
["IS11-1001-2-353 L",{"$f":"VLOOKUP(A444,Récap!$A$4:$AB$1979,28,FALSE)","v":2}]
["IS11-1001-2-353 R",1]
["ISU223L",1]
["ISU223R",4]
["IS10-1002-353 L",{"$f":"VLOOKUP(A448,Récap!$A$4:$AB$1979,28,FALSE)","v":5}]
["IS10-1002-353 R",{"$f":"VLOOKUP(A449,Récap!$A$4:$AB$1979,28,FALSE)","v":5}]
["ISU301L",{"$f":"VLOOKUP(A450,Récap!$A$4:$AB$1979,28,FALSE)","v":5}]
["ISU301R",{"$f":"VLOOKUP(A451,Récap!$A$4:$AB$1979,28,FALSE)","v":5}]
["8-94335625",{"$f":"VLOOKUP(A452,Récap!$A$4:$AB$1979,28,FALSE)","v":5}]
["HD08-61002-1",{"$f":"VLOOKUP(A453,Récap!$A$4:$AB$1979,28,FALSE)","v":10}]
["IS-5903",{"$f":"VLOOKUP(A454,Récap!$A$4:$AB$1979,28,FALSE)","v":4}]
["CLE-16MM",{"$f":"VLOOKUP(A455,Récap!$A$4:$AB$1979,28,FALSE)","v":4}]
["CLE-21MM",{"$f":"VLOOKUP(A456,Récap!$A$4:$AB$1979,28,FALSE)","v":20}]
["04495-0K120",{"$f":"VLOOKUP(A457,Récap!$A$4:$AB$1979,28,FALSE)","v":20}]
["04495-35180",{"$f":"VLOOKUP(A458,Récap!$A$4:$AB$1979,28,FALSE)","v":2}]
["16210-54180",{"$f":"VLOOKUP(A459,Récap!$A$4:$AB$1979,28,FALSE)","v":2}]
["16210-54210",{"$f":"VLOOKUP(A460,Récap!$A$4:$AB$1979,28,FALSE)","v":2}]
["4600A106",{"$f":"VLOOKUP(A461,Récap!$A$4:$AB$1979,28,FALSE)","v":2}]
["FT06-0106A",{"$f":"VLOOKUP(A462,Récap!$A$4:$AB$1979,28,FALSE)","v":2}]
["FT06-0106B",{"$f":"VLOOKUP(A463,Récap!$A$4:$AB$1979,28,FALSE)","v":2}]
["MG06-01021",{"$f":"VLOOKUP(A464,Récap!$A$4:$AB$1979,28,FALSE)","v":2}]
["IZ009001-A",{"$f":"VLOOKUP(A465,Récap!$A$4:$AB$1979,28,FALSE)","v":40}]
["IZ009001-B",{"$f":"VLOOKUP(A466,Récap!$A$4:$AB$1979,28,FALSE)","v":2}]
["RD23008",6]
[27210,{"$f":"VLOOKUP(A468,Récap!$A$4:$AB$1979,28,FALSE)","v":10}]
["8-94237-366-1",{"$f":"VLOOKUP(A469,Récap!$A$4:$AB$1979,28,FALSE)","v":5}]
["8-97368-263",{"$f":"VLOOKUP(A470,Récap!$A$4:$AB$1979,28,FALSE)","v":1}]
["TY315-31A",{"$f":"VLOOKUP(A471,Récap!$A$4:$AB$1979,28,FALSE)","v":4}]
["TY315-31B",{"$f":"VLOOKUP(A472,Récap!$A$4:$AB$1979,28,FALSE)","v":2}]
["TY315-31C",{"$f":"VLOOKUP(A473,Récap!$A$4:$AB$1979,28,FALSE)","v":2}]
["TY315-32A",{"$f":"VLOOKUP(A474,Récap!$A$4:$AB$1979,28,FALSE)","v":2}]
["TY313-33A",{"$f":"VLOOKUP(A475,Récap!$A$4:$AB$1979,28,FALSE)","v":2}]
["TY313-33B",{"$f":"VLOOKUP(A476,Récap!$A$4:$AB$1979,28,FALSE)","v":2}]
["TY074-20C",{"$f":"VLOOKUP(A477,Récap!$A$4:$AB$1979,28,FALSE)","v":2}]
["TY074-20D",{"$f":"VLOOKUP(A478,Récap!$A$4:$AB$1979,28,FALSE)","v":1}]
[90431363,{"$f":"VLOOKUP(A479,Récap!$A$4:$AB$1979,28,FALSE)","v":1}]
[90431364,{"$f":"VLOOKUP(A480,Récap!$A$4:$AB$1979,28,FALSE)","v":5}]
["897942-296",{"$f":"VLOOKUP(A481,Récap!$A$4:$AB$1979,28,FALSE)","v":5}]
["HD03-7001-B-LH",{"$f":"VLOOKUP(A482,Récap!$A$4:$AB$1979,28,FALSE)","v":2}]
["HD03-7001-B-RH",{"$f":"VLOOKUP(A483,Récap!$A$4:$AB$1979,28,FALSE)","v":1}]
["MZ180-20C",{"$f":"VLOOKUP(A484,Récap!$A$4:$AB$1979,28,FALSE)","v":1}]
["MZ180-20D",{"$f":"VLOOKUP(A485,Récap!$A$4:$AB$1979,28,FALSE)","v":1}]
["MZ180-25C",{"$f":"VLOOKUP(A486,Récap!$A$4:$AB$1979,28,FALSE)","v":1}]
["MZ180-25D",{"$f":"VLOOKUP(A487,Récap!$A$4:$AB$1979,28,FALSE)","v":1}]
["MZ180-30C",{"$f":"VLOOKUP(A488,Récap!$A$4:$AB$1979,28,FALSE)","v":1}]
["MZ180-30D",{"$f":"VLOOKUP(A489,Récap!$A$4:$AB$1979,28,FALSE)","v":1}]
["MZ180-30E",{"$f":"VLOOKUP(A490,Récap!$A$4:$AB$1979,28,FALSE)","v":1}]
["MZ180-30F",{"$f":"VLOOKUP(A491,Récap!$A$4:$AB$1979,28,FALSE)","v":1}]
["MZ430-20C",{"$f":"VLOOKUP(A492,Récap!$A$4:$AB$1979,28,FALSE)","v":1}]
["MZ430-20D",{"$f":"VLOOKUP(A493,Récap!$A$4:$AB$1979,28,FALSE)","v":1}]
["MZ430-25C",{"$f":"VLOOKUP(A494,Récap!$A$4:$AB$1979,28,FALSE)","v":1}]
["MZ430-25D",{"$f":"VLOOKUP(A495,Récap!$A$4:$AB$1979,28,FALSE)","v":1}]
["UH71-32-320",{"$f":"VLOOKUP(A496,Récap!$A$4:$AB$1979,28,FALSE)","v":2}]
["MZ180-30A",{"$f":"VLOOKUP(A497,Récap!$A$4:$AB$1979,28,FALSE)","v":2}]
["MZ209-22A",{"$f":"VLOOKUP(A498,Récap!$A$4:$AB$1979,28,FALSE)","v":2}]
["MZ209-22B",{"$f":"VLOOKUP(A499,Récap!$A$4:$AB$1979,28,FALSE)","v":2}]
["8-94112-625BGF",{"$f":"VLOOKUP(A500,Récap!$A$4:$AB$1979,28,FALSE)","v":1}]
["MB012098BGF",{"$f":"VLOOKUP(A501,Récap!$A$4:$AB$1979,28,FALSE)","v":3}]
["MB012098",{"$f":"VLOOKUP(A502,Récap!$A$4:$AB$1979,28,FALSE)","v":2}]
["MD712383BGF",{"$f":"VLOOKUP(A503,Récap!$A$4:$AB$1979,28,FALSE)","v":2}]
["MD712383",{"$f":"VLOOKUP(A504,Récap!$A$4:$AB$1979,28,FALSE)","v":2}]
["UB93-41-400",{"$f":"VLOOKUP(A505,Récap!$A$4:$AB$1979,28,FALSE)","v":2}]
["UB93-41-400-353",{"$f":"VLOOKUP(A506,Récap!$A$4:$AB$1979,28,FALSE)","v":2}]
["UB39-41-920",{"$f":"VLOOKUP(A507,Récap!$A$4:$AB$1979,28,FALSE)","v":2}]
["WL81-15-150A",{"$f":"VLOOKUP(A508,Récap!$A$4:$AB$1979,28,FALSE)","v":2}]
["8-97129738",{"$f":"VLOOKUP(A509,Récap!$A$4:$AB$1979,28,FALSE)","v":2}]
["WL51-12-420",{"$f":"VLOOKUP(A510,Récap!$A$4:$AB$1979,28,FALSE)","v":1}]
["TH-2043C LH",{"$f":"VLOOKUP(A511,Récap!$A$4:$AB$1979,28,FALSE)","v":1}]
["TH-2043C RH",{"$f":"VLOOKUP(A512,Récap!$A$4:$AB$1979,28,FALSE)","v":10}]
["MB285-30E",{"$f":"VLOOKUP(A513,Récap!$A$4:$AB$1979,28,FALSE)","v":10}]
["MB285-30F",{"$f":"VLOOKUP(A514,Récap!$A$4:$AB$1979,28,FALSE)","v":5}]
["ST-1639",10]
["9-37300-031",{"$f":"VLOOKUP(A516,Récap!$A$4:$AB$1979,28,FALSE)","v":10}]
["9-37300-601",{"$f":"VLOOKUP(A517,Récap!$A$4:$AB$1979,28,FALSE)","v":10}]
["S1Y8-26-38Z",{"$f":"VLOOKUP(A518,Récap!$A$4:$AB$1979,28,FALSE)","v":10}]
["RD22022",{"$f":"VLOOKUP(A519,Récap!$A$4:$AB$1979,28,FALSE)","v":2}]
["PT151",{"$f":"VLOOKUP(A520,Récap!$A$4:$AB$1979,28,FALSE)","v":2}]
["MR296271-S",{"$f":"VLOOKUP(A521,Récap!$A$4:$AB$1979,28,FALSE)","v":20}]
["MR277924",1]
["MR241029",{"$f":"VLOOKUP(A523,Récap!$A$4:$AB$1979,28,FALSE)","v":4}]
["MR133061",{"$f":"VLOOKUP(A524,Récap!$A$4:$AB$1979,28,FALSE)","v":4}]
["MB581845",{"$f":"VLOOKUP(A525,Récap!$A$4:$AB$1979,28,FALSE)","v":2}]
["MG01-12013",{"$f":"VLOOKUP(A526,Récap!$A$4:$AB$1979,28,FALSE)","v":2}]
["MG01-12017",{"$f":"VLOOKUP(A527,Récap!$A$4:$AB$1979,28,FALSE)","v":2}]
["MG01-12002LHD",{"$f":"VLOOKUP(A528,Récap!$A$4:$AB$1979,28,FALSE)","v":2}]
[27935,8]
["MD374223",{"$f":"VLOOKUP(A530,Récap!$A$4:$AB$1979,28,FALSE)","v":2}]
["MD110165",{"$f":"VLOOKUP(A531,Récap!$A$4:$AB$1979,28,FALSE)","v":1}]
["MD324967",{"$f":"VLOOKUP(A532,Récap!$A$4:$AB$1979,28,FALSE)","v":1}]
["MD324966",{"$f":"VLOOKUP(A533,Récap!$A$4:$AB$1979,28,FALSE)","v":10}]
["MD050212",{"$f":"VLOOKUP(A534,Récap!$A$4:$AB$1979,28,FALSE)","v":10}]
["MB7681",{"$f":"VLOOKUP(A535,Récap!$A$4:$AB$1979,28,FALSE)","v":20}]
["MB500813",{"$f":"VLOOKUP(A536,Récap!$A$4:$AB$1979,28,FALSE)","v":2}]
["MB422203",{"$f":"VLOOKUP(A537,Récap!$A$4:$AB$1979,28,FALSE)","v":4}]
["MB422204",{"$f":"VLOOKUP(A538,Récap!$A$4:$AB$1979,28,FALSE)","v":2}]
["MB407061",3]
["MB407030",{"$f":"VLOOKUP(A540,Récap!$A$4:$AB$1979,28,FALSE)","v":2}]
["MB333-30A",{"$f":"VLOOKUP(A541,Récap!$A$4:$AB$1979,28,FALSE)","v":2}]
["MB333-30B",{"$f":"VLOOKUP(A542,Récap!$A$4:$AB$1979,28,FALSE)","v":2}]
["MB286-30M",{"$f":"VLOOKUP(A543,Récap!$A$4:$AB$1979,28,FALSE)","v":2}]
["MB286-30N",{"$f":"VLOOKUP(A544,Récap!$A$4:$AB$1979,28,FALSE)","v":2}]
["MB285-25A",{"$f":"VLOOKUP(A545,Récap!$A$4:$AB$1979,28,FALSE)","v":2}]
["MB285-25B",{"$f":"VLOOKUP(A546,Récap!$A$4:$AB$1979,28,FALSE)","v":4}]
["MB252-32A",{"$f":"VLOOKUP(A547,Récap!$A$4:$AB$1979,28,FALSE)","v":4}]
["IZ090-32C",{"$f":"VLOOKUP(A548,Récap!$A$4:$AB$1979,28,FALSE)","v":20}]
["IZ151-31A",{"$f":"VLOOKUP(A549,Récap!$A$4:$AB$1979,28,FALSE)","v":50}]
["IZ151-31B",{"$f":"VLOOKUP(A550,Récap!$A$4:$AB$1979,28,FALSE)","v":1}]
["IZ091-36F",{"$f":"VLOOKUP(A551,Récap!$A$4:$AB$1979,28,FALSE)","v":3}]
["IZ091-29A",{"$f":"VLOOKUP(A552,Récap!$A$4:$AB$1979,28,FALSE)","v":1}]
["8-97365743",{"$f":"VLOOKUP(A553,Récap!$A$4:$AB$1979,28,FALSE)","v":6}]
["8-97377149",{"$f":"VLOOKUP(A554,Récap!$A$4:$AB$1979,28,FALSE)","v":3}]
["8-97319-300",{"$f":"VLOOKUP(A555,Récap!$A$4:$AB$1979,28,FALSE)","v":2}]
["8-97255-313",{"$f":"VLOOKUP(A556,Récap!$A$4:$AB$1979,28,FALSE)","v":4}]
["8-97089-652",{"$f":"VLOOKUP(A557,Récap!$A$4:$AB$1979,28,FALSE)","v":2}]
["8-96457-472",{"$f":"VLOOKUP(A558,Récap!$A$4:$AB$1979,28,FALSE)","v":3}]
["8-97035085",{"$f":"VLOOKUP(A559,Récap!$A$4:$AB$1979,28,FALSE)","v":2}]
["8-94438-300",{"$f":"VLOOKUP(A560,Récap!$A$4:$AB$1979,28,FALSE)","v":4}]
["8-94434-996",{"$f":"VLOOKUP(A561,Récap!$A$4:$AB$1979,28,FALSE)","v":2}]
["8-94434-995",{"$f":"VLOOKUP(A562,Récap!$A$4:$AB$1979,28,FALSE)","v":2}]
["8-94328-109",{"$f":"VLOOKUP(A563,Récap!$A$4:$AB$1979,28,FALSE)","v":2}]
["8-94328-108",{"$f":"VLOOKUP(A564,Récap!$A$4:$AB$1979,28,FALSE)","v":2}]
["8-94376858",{"$f":"VLOOKUP(A565,Récap!$A$4:$AB$1979,28,FALSE)","v":2}]
["897105012-0",{"$f":"VLOOKUP(A566,Récap!$A$4:$AB$1979,28,FALSE)","v":2}]
["8-94232-282",0]
["62246A",{"$f":"VLOOKUP(A568,Récap!$A$4:$AB$1979,28,FALSE)","v":9}]
["5FP-A0083",{"$f":"VLOOKUP(A569,Récap!$A$4:$AB$1979,28,FALSE)","v":2}]
["5FP-A0108",{"$f":"VLOOKUP(A570,Récap!$A$4:$AB$1979,28,FALSE)","v":2}]
["5CK-A0006",{"$f":"VLOOKUP(A571,Récap!$A$4:$AB$1979,28,FALSE)","v":2}]
["5-37211-001",4]
["8-94171-858-B",{"$f":"VLOOKUP(A573,Récap!$A$4:$AB$1979,28,FALSE)","v":2}]
["MG06-01002",{"$f":"VLOOKUP(A574,Récap!$A$4:$AB$1979,28,FALSE)","v":2}]
["TF37",10]
["TF70",{"$f":"VLOOKUP(A576,Récap!$A$4:$AB$1979,28,FALSE)","v":10}]
["TF71",{"$f":"VLOOKUP(A577,Récap!$A$4:$AB$1979,28,FALSE)","v":10}]
["TF82",{"$f":"VLOOKUP(A578,Récap!$A$4:$AB$1979,28,FALSE)","v":10}]
["TF83",{"$f":"VLOOKUP(A579,Récap!$A$4:$AB$1979,28,FALSE)","v":10}]
["TF89",{"$f":"VLOOKUP(A580,Récap!$A$4:$AB$1979,28,FALSE)","v":10}]
["TF121",{"$f":"VLOOKUP(A581,Récap!$A$4:$AB$1979,28,FALSE)","v":10}]
["B012",{"$f":"VLOOKUP(A582,Récap!$A$4:$AB$1979,28,FALSE)","v":10}]
["B019",{"$f":"VLOOKUP(A583,Récap!$A$4:$AB$1979,28,FALSE)","v":40}]
["B022",{"$f":"VLOOKUP(A584,Récap!$A$4:$AB$1979,28,FALSE)","v":50}]
["B058",{"$f":"VLOOKUP(A585,Récap!$A$4:$AB$1979,28,FALSE)","v":20}]
["B088",{"$f":"VLOOKUP(A586,Récap!$A$4:$AB$1979,28,FALSE)","v":10}]
["B091",{"$f":"VLOOKUP(A587,Récap!$A$4:$AB$1979,28,FALSE)","v":20}]
["B100",{"$f":"VLOOKUP(A588,Récap!$A$4:$AB$1979,28,FALSE)","v":10}]
["B101",{"$f":"VLOOKUP(A589,Récap!$A$4:$AB$1979,28,FALSE)","v":5}]
["F010",{"$f":"VLOOKUP(A590,Récap!$A$4:$AB$1979,28,FALSE)","v":5}]
["F012",{"$f":"VLOOKUP(A591,Récap!$A$4:$AB$1979,28,FALSE)","v":4}]
["F013",{"$f":"VLOOKUP(A592,Récap!$A$4:$AB$1979,28,FALSE)","v":8}]
["F014",{"$f":"VLOOKUP(A593,Récap!$A$4:$AB$1979,28,FALSE)","v":10}]
["F015",{"$f":"VLOOKUP(A594,Récap!$A$4:$AB$1979,28,FALSE)","v":10}]
["F016",{"$f":"VLOOKUP(A595,Récap!$A$4:$AB$1979,28,FALSE)","v":10}]
["F025",{"$f":"VLOOKUP(A596,Récap!$A$4:$AB$1979,28,FALSE)","v":10}]
["F037",{"$f":"VLOOKUP(A597,Récap!$A$4:$AB$1979,28,FALSE)","v":10}]
["I072",{"$f":"VLOOKUP(A598,Récap!$A$4:$AB$1979,28,FALSE)","v":10}]
["8-94155315",{"$f":"VLOOKUP(A599,Récap!$A$4:$AB$1979,28,FALSE)","v":20}]
["8-94155314",{"$f":"VLOOKUP(A600,Récap!$A$4:$AB$1979,28,FALSE)","v":3}]
["9-4468001-1",{"$f":"VLOOKUP(A601,Récap!$A$4:$AB$1979,28,FALSE)","v":5}]
["I086",2]
["I089",{"$f":"VLOOKUP(A603,Récap!$A$4:$AB$1979,28,FALSE)","v":6}]
["8-94472118",{"$f":"VLOOKUP(A604,Récap!$A$4:$AB$1979,28,FALSE)","v":6}]
["I115",{"$f":"VLOOKUP(A605,Récap!$A$4:$AB$1979,28,FALSE)","v":4}]
["I118",{"$f":"VLOOKUP(A606,Récap!$A$4:$AB$1979,28,FALSE)","v":50}]
["894124868-2",{"$f":"VLOOKUP(A607,Récap!$A$4:$AB$1979,28,FALSE)","v":20}]
["I165",{"$f":"VLOOKUP(A608,Récap!$A$4:$AB$1979,28,FALSE)","v":4}]
["I183",{"$f":"VLOOKUP(A609,Récap!$A$4:$AB$1979,28,FALSE)","v":0}]
["I184",{"$f":"VLOOKUP(A610,Récap!$A$4:$AB$1979,28,FALSE)","v":4}]
["M001",{"$f":"VLOOKUP(A611,Récap!$A$4:$AB$1979,28,FALSE)","v":50}]
["M035",{"$f":"VLOOKUP(A612,Récap!$A$4:$AB$1979,28,FALSE)","v":10}]
["M041",{"$f":"VLOOKUP(A613,Récap!$A$4:$AB$1979,28,FALSE)","v":6}]
["M042",{"$f":"VLOOKUP(A614,Récap!$A$4:$AB$1979,28,FALSE)","v":10}]
["M045",{"$f":"VLOOKUP(A615,Récap!$A$4:$AB$1979,28,FALSE)","v":5}]
["M048",{"$f":"VLOOKUP(A616,Récap!$A$4:$AB$1979,28,FALSE)","v":5}]
["M049",{"$f":"VLOOKUP(A617,Récap!$A$4:$AB$1979,28,FALSE)","v":5}]
["M053",{"$f":"VLOOKUP(A618,Récap!$A$4:$AB$1979,28,FALSE)","v":5}]
["M062",{"$f":"VLOOKUP(A619,Récap!$A$4:$AB$1979,28,FALSE)","v":2}]
["M063",{"$f":"VLOOKUP(A620,Récap!$A$4:$AB$1979,28,FALSE)","v":2}]
["M064",{"$f":"VLOOKUP(A621,Récap!$A$4:$AB$1979,28,FALSE)","v":10}]
["M084",{"$f":"VLOOKUP(A622,Récap!$A$4:$AB$1979,28,FALSE)","v":2}]
["MI11",{"$f":"VLOOKUP(A623,Récap!$A$4:$AB$1979,28,FALSE)","v":2}]
["JAK4225100",{"$f":"VLOOKUP(A624,Récap!$A$4:$AB$1979,28,FALSE)","v":6}]
["M116",{"$f":"VLOOKUP(A625,Récap!$A$4:$AB$1979,28,FALSE)","v":10}]
["R004",{"$f":"VLOOKUP(A626,Récap!$A$4:$AB$1979,28,FALSE)","v":0}]
["R005",{"$f":"VLOOKUP(A627,Récap!$A$4:$AB$1979,28,FALSE)","v":30}]
["R012",{"$f":"VLOOKUP(A628,Récap!$A$4:$AB$1979,28,FALSE)","v":30}]
["R013",{"$f":"VLOOKUP(A629,Récap!$A$4:$AB$1979,28,FALSE)","v":5}]
["T051",{"$f":"VLOOKUP(A630,Récap!$A$4:$AB$1979,28,FALSE)","v":50}]
["T053",{"$f":"VLOOKUP(A631,Récap!$A$4:$AB$1979,28,FALSE)","v":5}]
["T067",{"$f":"VLOOKUP(A632,Récap!$A$4:$AB$1979,28,FALSE)","v":10}]
["MR534949",8]
["897028-970-2",{"$f":"VLOOKUP(A634,Récap!$A$4:$AB$1979,28,FALSE)","v":13}]
["I093",{"$f":"VLOOKUP(A635,Récap!$A$4:$AB$1979,28,FALSE)","v":6}]
[894241767,{"$f":"VLOOKUP(A636,Récap!$A$4:$AB$1979,28,FALSE)","v":20}]
["96-97248860-0",{"$f":"VLOOKUP(A637,Récap!$A$4:$AB$1979,28,FALSE)","v":6}]
["8-94440608",{"$f":"VLOOKUP(A638,Récap!$A$4:$AB$1979,28,FALSE)","v":5}]
["I130",{"$f":"VLOOKUP(A639,Récap!$A$4:$AB$1979,28,FALSE)","v":7}]
["I136",{"$f":"VLOOKUP(A640,Récap!$A$4:$AB$1979,28,FALSE)","v":10}]
[894328800,{"$f":"VLOOKUP(A641,Récap!$A$4:$AB$1979,28,FALSE)","v":9}]
["I162",{"$f":"VLOOKUP(A642,Récap!$A$4:$AB$1979,28,FALSE)","v":7}]
["8-94334158",{"$f":"VLOOKUP(A643,Récap!$A$4:$AB$1979,28,FALSE)","v":6}]
["8-94334159",{"$f":"VLOOKUP(A644,Récap!$A$4:$AB$1979,28,FALSE)","v":10}]
["I138",{"$f":"VLOOKUP(A645,Récap!$A$4:$AB$1979,28,FALSE)","v":10}]
["I189",{"$f":"VLOOKUP(A646,Récap!$A$4:$AB$1979,28,FALSE)","v":20}]
["M005-N",{"$f":"VLOOKUP(A647,Récap!$A$4:$AB$1979,28,FALSE)","v":2}]
["M007-N",{"$f":"VLOOKUP(A648,Récap!$A$4:$AB$1979,28,FALSE)","v":4}]
["M010-N",{"$f":"VLOOKUP(A649,Récap!$A$4:$AB$1979,28,FALSE)","v":4}]
["MI16",{"$f":"VLOOKUP(A650,Récap!$A$4:$AB$1979,28,FALSE)","v":8}]
["MI20",{"$f":"VLOOKUP(A651,Récap!$A$4:$AB$1979,28,FALSE)","v":3}]
["R007",{"$f":"VLOOKUP(A652,Récap!$A$4:$AB$1979,28,FALSE)","v":6}]
["R008",{"$f":"VLOOKUP(A653,Récap!$A$4:$AB$1979,28,FALSE)","v":15}]
["ST01",{"$f":"VLOOKUP(A654,Récap!$A$4:$AB$1979,28,FALSE)","v":15}]
["ST02",{"$f":"VLOOKUP(A655,Récap!$A$4:$AB$1979,28,FALSE)","v":50}]
["TF63",{"$f":"VLOOKUP(A656,Récap!$A$4:$AB$1979,28,FALSE)","v":50}]
["I138",{"$f":"VLOOKUP(A657,Récap!$A$4:$AB$1979,28,FALSE)","v":10}]
["B071",{"$f":"VLOOKUP(A658,Récap!$A$4:$AB$1979,28,FALSE)","v":20}]
["B072",{"$f":"VLOOKUP(A659,Récap!$A$4:$AB$1979,28,FALSE)","v":10}]
["F020",{"$f":"VLOOKUP(A660,Récap!$A$4:$AB$1979,28,FALSE)","v":10}]
["F021",{"$f":"VLOOKUP(A661,Récap!$A$4:$AB$1979,28,FALSE)","v":10}]
["F024",{"$f":"VLOOKUP(A662,Récap!$A$4:$AB$1979,28,FALSE)","v":10}]
["F030",{"$f":"VLOOKUP(A663,Récap!$A$4:$AB$1979,28,FALSE)","v":5}]
["FD002",{"$f":"VLOOKUP(A664,Récap!$A$4:$AB$1979,28,FALSE)","v":5}]
["UM46-39-040",{"$f":"VLOOKUP(A665,Récap!$A$4:$AB$1979,28,FALSE)","v":20}]
["FO011",{"$f":"VLOOKUP(A666,Récap!$A$4:$AB$1979,28,FALSE)","v":14}]
["I004",{"$f":"VLOOKUP(A667,Récap!$A$4:$AB$1979,28,FALSE)","v":60}]
["I006",{"$f":"VLOOKUP(A668,Récap!$A$4:$AB$1979,28,FALSE)","v":20}]
["I010",{"$f":"VLOOKUP(A669,Récap!$A$4:$AB$1979,28,FALSE)","v":60}]
["I011",{"$f":"VLOOKUP(A670,Récap!$A$4:$AB$1979,28,FALSE)","v":5}]
["I012",{"$f":"VLOOKUP(A671,Récap!$A$4:$AB$1979,28,FALSE)","v":100}]
["I013",{"$f":"VLOOKUP(A672,Récap!$A$4:$AB$1979,28,FALSE)","v":64}]
["I019",{"$f":"VLOOKUP(A673,Récap!$A$4:$AB$1979,28,FALSE)","v":240}]
["I021",{"$f":"VLOOKUP(A674,Récap!$A$4:$AB$1979,28,FALSE)","v":200}]
["I027",{"$f":"VLOOKUP(A675,Récap!$A$4:$AB$1979,28,FALSE)","v":10}]
["I032",{"$f":"VLOOKUP(A676,Récap!$A$4:$AB$1979,28,FALSE)","v":10}]
["I035",{"$f":"VLOOKUP(A677,Récap!$A$4:$AB$1979,28,FALSE)","v":50}]
["I039",{"$f":"VLOOKUP(A678,Récap!$A$4:$AB$1979,28,FALSE)","v":20}]
["I042",{"$f":"VLOOKUP(A679,Récap!$A$4:$AB$1979,28,FALSE)","v":62}]
["I043",{"$f":"VLOOKUP(A680,Récap!$A$4:$AB$1979,28,FALSE)","v":12}]
["I048",{"$f":"VLOOKUP(A681,Récap!$A$4:$AB$1979,28,FALSE)","v":10}]
["I056",{"$f":"VLOOKUP(A682,Récap!$A$4:$AB$1979,28,FALSE)","v":20}]
["I066",28]
["I071",{"$f":"VLOOKUP(A684,Récap!$A$4:$AB$1979,28,FALSE)","v":20}]
["I073",{"$f":"VLOOKUP(A685,Récap!$A$4:$AB$1979,28,FALSE)","v":30}]
["B001",{"$f":"VLOOKUP(A686,Récap!$A$4:$AB$1979,28,FALSE)","v":30}]
["B002",{"$f":"VLOOKUP(A687,Récap!$A$4:$AB$1979,28,FALSE)","v":20}]
["B003",{"$f":"VLOOKUP(A688,Récap!$A$4:$AB$1979,28,FALSE)","v":10}]
["B004",{"$f":"VLOOKUP(A689,Récap!$A$4:$AB$1979,28,FALSE)","v":20}]
["B005",{"$f":"VLOOKUP(A690,Récap!$A$4:$AB$1979,28,FALSE)","v":30}]
["B006",{"$f":"VLOOKUP(A691,Récap!$A$4:$AB$1979,28,FALSE)","v":5}]
["B008",{"$f":"VLOOKUP(A692,Récap!$A$4:$AB$1979,28,FALSE)","v":10}]
["B009",{"$f":"VLOOKUP(A693,Récap!$A$4:$AB$1979,28,FALSE)","v":10}]
["B013",{"$f":"VLOOKUP(A694,Récap!$A$4:$AB$1979,28,FALSE)","v":10}]
["B014",{"$f":"VLOOKUP(A695,Récap!$A$4:$AB$1979,28,FALSE)","v":6}]
["B016",{"$f":"VLOOKUP(A696,Récap!$A$4:$AB$1979,28,FALSE)","v":20}]
["B018",{"$f":"VLOOKUP(A697,Récap!$A$4:$AB$1979,28,FALSE)","v":50}]
["B020",{"$f":"VLOOKUP(A698,Récap!$A$4:$AB$1979,28,FALSE)","v":25}]
["B023",{"$f":"VLOOKUP(A699,Récap!$A$4:$AB$1979,28,FALSE)","v":10}]
["B026",{"$f":"VLOOKUP(A700,Récap!$A$4:$AB$1979,28,FALSE)","v":10}]
["B027",{"$f":"VLOOKUP(A701,Récap!$A$4:$AB$1979,28,FALSE)","v":50}]
["B038",{"$f":"VLOOKUP(A702,Récap!$A$4:$AB$1979,28,FALSE)","v":50}]
["B039",{"$f":"VLOOKUP(A703,Récap!$A$4:$AB$1979,28,FALSE)","v":10}]
["B041",{"$f":"VLOOKUP(A704,Récap!$A$4:$AB$1979,28,FALSE)","v":10}]
["B042",{"$f":"VLOOKUP(A705,Récap!$A$4:$AB$1979,28,FALSE)","v":10}]
["B047",{"$f":"VLOOKUP(A706,Récap!$A$4:$AB$1979,28,FALSE)","v":30}]
["B048",{"$f":"VLOOKUP(A707,Récap!$A$4:$AB$1979,28,FALSE)","v":20}]
["B049",{"$f":"VLOOKUP(A708,Récap!$A$4:$AB$1979,28,FALSE)","v":6}]
["B055",{"$f":"VLOOKUP(A709,Récap!$A$4:$AB$1979,28,FALSE)","v":10}]
["B057",{"$f":"VLOOKUP(A710,Récap!$A$4:$AB$1979,28,FALSE)","v":30}]
["B067",{"$f":"VLOOKUP(A711,Récap!$A$4:$AB$1979,28,FALSE)","v":20}]
["B068",{"$f":"VLOOKUP(A712,Récap!$A$4:$AB$1979,28,FALSE)","v":20}]
["B070",{"$f":"VLOOKUP(A713,Récap!$A$4:$AB$1979,28,FALSE)","v":30}]
["B073",{"$f":"VLOOKUP(A714,Récap!$A$4:$AB$1979,28,FALSE)","v":10}]
["B074",{"$f":"VLOOKUP(A715,Récap!$A$4:$AB$1979,28,FALSE)","v":10}]
["B075",{"$f":"VLOOKUP(A716,Récap!$A$4:$AB$1979,28,FALSE)","v":10}]
["B076",{"$f":"VLOOKUP(A717,Récap!$A$4:$AB$1979,28,FALSE)","v":10}]
["B080",{"$f":"VLOOKUP(A718,Récap!$A$4:$AB$1979,28,FALSE)","v":50}]
["B081",{"$f":"VLOOKUP(A719,Récap!$A$4:$AB$1979,28,FALSE)","v":50}]
["B082",{"$f":"VLOOKUP(A720,Récap!$A$4:$AB$1979,28,FALSE)","v":10}]
["B084",{"$f":"VLOOKUP(A721,Récap!$A$4:$AB$1979,28,FALSE)","v":10}]
["B085",{"$f":"VLOOKUP(A722,Récap!$A$4:$AB$1979,28,FALSE)","v":5}]
["B086",{"$f":"VLOOKUP(A723,Récap!$A$4:$AB$1979,28,FALSE)","v":10}]
["B087",{"$f":"VLOOKUP(A724,Récap!$A$4:$AB$1979,28,FALSE)","v":50}]
["B089",{"$f":"VLOOKUP(A725,Récap!$A$4:$AB$1979,28,FALSE)","v":5}]
["B092",{"$f":"VLOOKUP(A726,Récap!$A$4:$AB$1979,28,FALSE)","v":5}]
["B093",{"$f":"VLOOKUP(A727,Récap!$A$4:$AB$1979,28,FALSE)","v":10}]
["B094",{"$f":"VLOOKUP(A728,Récap!$A$4:$AB$1979,28,FALSE)","v":20}]
["B097",{"$f":"VLOOKUP(A729,Récap!$A$4:$AB$1979,28,FALSE)","v":50}]
["B099",{"$f":"VLOOKUP(A730,Récap!$A$4:$AB$1979,28,FALSE)","v":10}]
["B112",{"$f":"VLOOKUP(A731,Récap!$A$4:$AB$1979,28,FALSE)","v":5}]
["B130",{"$f":"VLOOKUP(A732,Récap!$A$4:$AB$1979,28,FALSE)","v":5}]
["B132",{"$f":"VLOOKUP(A733,Récap!$A$4:$AB$1979,28,FALSE)","v":5}]
["T001",{"$f":"VLOOKUP(A734,Récap!$A$4:$AB$1979,28,FALSE)","v":5}]
["TEN001",{"$f":"VLOOKUP(A735,Récap!$A$4:$AB$1979,28,FALSE)","v":5}]
["B142",{"$f":"VLOOKUP(A736,Récap!$A$4:$AB$1979,28,FALSE)","v":4}]
["B138",{"$f":"VLOOKUP(A737,Récap!$A$4:$AB$1979,28,FALSE)","v":10}]
["B140",{"$f":"VLOOKUP(A738,Récap!$A$4:$AB$1979,28,FALSE)","v":10}]
["B143",{"$f":"VLOOKUP(A739,Récap!$A$4:$AB$1979,28,FALSE)","v":10}]
["B141",{"$f":"VLOOKUP(A740,Récap!$A$4:$AB$1979,28,FALSE)","v":10}]
["B144",{"$f":"VLOOKUP(A741,Récap!$A$4:$AB$1979,28,FALSE)","v":10}]
["B116",{"$f":"VLOOKUP(A742,Récap!$A$4:$AB$1979,28,FALSE)","v":10}]
["B109",{"$f":"VLOOKUP(A743,Récap!$A$4:$AB$1979,28,FALSE)","v":10}]
["B111",{"$f":"VLOOKUP(A744,Récap!$A$4:$AB$1979,28,FALSE)","v":10}]
["B115",{"$f":"VLOOKUP(A745,Récap!$A$4:$AB$1979,28,FALSE)","v":10}]
["B107",{"$f":"VLOOKUP(A746,Récap!$A$4:$AB$1979,28,FALSE)","v":10}]
["B110",{"$f":"VLOOKUP(A747,Récap!$A$4:$AB$1979,28,FALSE)","v":10}]
["B104",{"$f":"VLOOKUP(A748,Récap!$A$4:$AB$1979,28,FALSE)","v":10}]
["B117",{"$f":"VLOOKUP(A749,Récap!$A$4:$AB$1979,28,FALSE)","v":10}]
["B118",{"$f":"VLOOKUP(A750,Récap!$A$4:$AB$1979,28,FALSE)","v":10}]
["B120",0]
["B121",0]
["B122",{"$f":"VLOOKUP(A753,Récap!$A$4:$AB$1979,28,FALSE)","v":10}]
["B105",{"$f":"VLOOKUP(A754,Récap!$A$4:$AB$1979,28,FALSE)","v":10}]
["B137",{"$f":"VLOOKUP(A755,Récap!$A$4:$AB$1979,28,FALSE)","v":10}]
["B139",{"$f":"VLOOKUP(A756,Récap!$A$4:$AB$1979,28,FALSE)","v":10}]
["B123",{"$f":"VLOOKUP(A757,Récap!$A$4:$AB$1979,28,FALSE)","v":10}]
["B124",{"$f":"VLOOKUP(A758,Récap!$A$4:$AB$1979,28,FALSE)","v":10}]
["B136",{"$f":"VLOOKUP(A759,Récap!$A$4:$AB$1979,28,FALSE)","v":10}]
["B125",{"$f":"VLOOKUP(A760,Récap!$A$4:$AB$1979,28,FALSE)","v":10}]
["B145",{"$f":"VLOOKUP(A761,Récap!$A$4:$AB$1979,28,FALSE)","v":10}]
["B147",{"$f":"VLOOKUP(A762,Récap!$A$4:$AB$1979,28,FALSE)","v":10}]
["B126",{"$f":"VLOOKUP(A763,Récap!$A$4:$AB$1979,28,FALSE)","v":10}]
["B106",{"$f":"VLOOKUP(A764,Récap!$A$4:$AB$1979,28,FALSE)","v":10}]
["B128",{"$f":"VLOOKUP(A765,Récap!$A$4:$AB$1979,28,FALSE)","v":10}]
["B129",{"$f":"VLOOKUP(A766,Récap!$A$4:$AB$1979,28,FALSE)","v":10}]
["B114",{"$f":"VLOOKUP(A767,Récap!$A$4:$AB$1979,28,FALSE)","v":10}]
["B146",{"$f":"VLOOKUP(A768,Récap!$A$4:$AB$1979,28,FALSE)","v":10}]
["B108",{"$f":"VLOOKUP(A769,Récap!$A$4:$AB$1979,28,FALSE)","v":10}]
["I001",{"$f":"VLOOKUP(A770,Récap!$A$4:$AB$1979,28,FALSE)","v":10}]
["I002",{"$f":"VLOOKUP(A771,Récap!$A$4:$AB$1979,28,FALSE)","v":10}]
["I003-N",{"$f":"VLOOKUP(A772,Récap!$A$4:$AB$1979,28,FALSE)","v":6}]
["I005-N",{"$f":"VLOOKUP(A773,Récap!$A$4:$AB$1979,28,FALSE)","v":4}]
["I007",0]
["I008",{"$f":"VLOOKUP(A775,Récap!$A$4:$AB$1979,28,FALSE)","v":6}]
["I009",{"$f":"VLOOKUP(A776,Récap!$A$4:$AB$1979,28,FALSE)","v":10}]
["I020",{"$f":"VLOOKUP(A777,Récap!$A$4:$AB$1979,28,FALSE)","v":30}]
["I022",{"$f":"VLOOKUP(A778,Récap!$A$4:$AB$1979,28,FALSE)","v":50}]
["I023",{"$f":"VLOOKUP(A779,Récap!$A$4:$AB$1979,28,FALSE)","v":4}]
["FO004",{"$f":"VLOOKUP(A780,Récap!$A$4:$AB$1979,28,FALSE)","v":10}]
["FO005",{"$f":"VLOOKUP(A781,Récap!$A$4:$AB$1979,28,FALSE)","v":10}]
["FO006",{"$f":"VLOOKUP(A782,Récap!$A$4:$AB$1979,28,FALSE)","v":10}]
["FO007",{"$f":"VLOOKUP(A783,Récap!$A$4:$AB$1979,28,FALSE)","v":10}]
["FO009",{"$f":"VLOOKUP(A784,Récap!$A$4:$AB$1979,28,FALSE)","v":10}]
["FO010",{"$f":"VLOOKUP(A785,Récap!$A$4:$AB$1979,28,FALSE)","v":10}]
["FO011",{"$f":"VLOOKUP(A786,Récap!$A$4:$AB$1979,28,FALSE)","v":14}]
["FO013",{"$f":"VLOOKUP(A787,Récap!$A$4:$AB$1979,28,FALSE)","v":60}]
["FO014",{"$f":"VLOOKUP(A788,Récap!$A$4:$AB$1979,28,FALSE)","v":20}]
["M002",{"$f":"VLOOKUP(A789,Récap!$A$4:$AB$1979,28,FALSE)","v":20}]
["M003",{"$f":"VLOOKUP(A790,Récap!$A$4:$AB$1979,28,FALSE)","v":10}]
["M004",{"$f":"VLOOKUP(A791,Récap!$A$4:$AB$1979,28,FALSE)","v":10}]
["M006-N",{"$f":"VLOOKUP(A792,Récap!$A$4:$AB$1979,28,FALSE)","v":10}]
["M012",{"$f":"VLOOKUP(A793,Récap!$A$4:$AB$1979,28,FALSE)","v":4}]
["M011-N",{"$f":"VLOOKUP(A794,Récap!$A$4:$AB$1979,28,FALSE)","v":4}]
["M013",{"$f":"VLOOKUP(A795,Récap!$A$4:$AB$1979,28,FALSE)","v":4}]
["M014",{"$f":"VLOOKUP(A796,Récap!$A$4:$AB$1979,28,FALSE)","v":10}]
["M015",{"$f":"VLOOKUP(A797,Récap!$A$4:$AB$1979,28,FALSE)","v":10}]
["M016",{"$f":"VLOOKUP(A798,Récap!$A$4:$AB$1979,28,FALSE)","v":6}]
["M017",{"$f":"VLOOKUP(A799,Récap!$A$4:$AB$1979,28,FALSE)","v":20}]
["M019",{"$f":"VLOOKUP(A800,Récap!$A$4:$AB$1979,28,FALSE)","v":20}]
["M023",{"$f":"VLOOKUP(A801,Récap!$A$4:$AB$1979,28,FALSE)","v":20}]
["M024",{"$f":"VLOOKUP(A802,Récap!$A$4:$AB$1979,28,FALSE)","v":20}]
["M025",{"$f":"VLOOKUP(A803,Récap!$A$4:$AB$1979,28,FALSE)","v":10}]
["M026",{"$f":"VLOOKUP(A804,Récap!$A$4:$AB$1979,28,FALSE)","v":50}]
["M027",{"$f":"VLOOKUP(A805,Récap!$A$4:$AB$1979,28,FALSE)","v":50}]
["M030",{"$f":"VLOOKUP(A806,Récap!$A$4:$AB$1979,28,FALSE)","v":10}]
["M031",{"$f":"VLOOKUP(A807,Récap!$A$4:$AB$1979,28,FALSE)","v":30}]
["M033",{"$f":"VLOOKUP(A808,Récap!$A$4:$AB$1979,28,FALSE)","v":6}]
["M034",{"$f":"VLOOKUP(A809,Récap!$A$4:$AB$1979,28,FALSE)","v":6}]
["M036",{"$f":"VLOOKUP(A810,Récap!$A$4:$AB$1979,28,FALSE)","v":6}]
["M037",{"$f":"VLOOKUP(A811,Récap!$A$4:$AB$1979,28,FALSE)","v":6}]
["M038",{"$f":"VLOOKUP(A812,Récap!$A$4:$AB$1979,28,FALSE)","v":50}]
["M039",{"$f":"VLOOKUP(A813,Récap!$A$4:$AB$1979,28,FALSE)","v":50}]
["M040",{"$f":"VLOOKUP(A814,Récap!$A$4:$AB$1979,28,FALSE)","v":50}]
["M043",{"$f":"VLOOKUP(A815,Récap!$A$4:$AB$1979,28,FALSE)","v":10}]
["M046",{"$f":"VLOOKUP(A816,Récap!$A$4:$AB$1979,28,FALSE)","v":5}]
["M050",{"$f":"VLOOKUP(A817,Récap!$A$4:$AB$1979,28,FALSE)","v":5}]
["M052",{"$f":"VLOOKUP(A818,Récap!$A$4:$AB$1979,28,FALSE)","v":6}]
["M054",{"$f":"VLOOKUP(A819,Récap!$A$4:$AB$1979,28,FALSE)","v":5}]
["M055",{"$f":"VLOOKUP(A820,Récap!$A$4:$AB$1979,28,FALSE)","v":5}]
["M056",{"$f":"VLOOKUP(A821,Récap!$A$4:$AB$1979,28,FALSE)","v":20}]
["M057",{"$f":"VLOOKUP(A822,Récap!$A$4:$AB$1979,28,FALSE)","v":6}]
["M058",{"$f":"VLOOKUP(A823,Récap!$A$4:$AB$1979,28,FALSE)","v":6}]
["M059",{"$f":"VLOOKUP(A824,Récap!$A$4:$AB$1979,28,FALSE)","v":3}]
["M060",{"$f":"VLOOKUP(A825,Récap!$A$4:$AB$1979,28,FALSE)","v":5}]
["M061",{"$f":"VLOOKUP(A826,Récap!$A$4:$AB$1979,28,FALSE)","v":20}]
["M076",{"$f":"VLOOKUP(A827,Récap!$A$4:$AB$1979,28,FALSE)","v":10}]
["M077",{"$f":"VLOOKUP(A828,Récap!$A$4:$AB$1979,28,FALSE)","v":4}]
["M079",{"$f":"VLOOKUP(A829,Récap!$A$4:$AB$1979,28,FALSE)","v":4}]
["F001",{"$f":"VLOOKUP(A830,Récap!$A$4:$AB$1979,28,FALSE)","v":4}]
["F002",{"$f":"VLOOKUP(A831,Récap!$A$4:$AB$1979,28,FALSE)","v":9}]
["F004",{"$f":"VLOOKUP(A832,Récap!$A$4:$AB$1979,28,FALSE)","v":0}]
["F005",{"$f":"VLOOKUP(A833,Récap!$A$4:$AB$1979,28,FALSE)","v":10}]
["F006",{"$f":"VLOOKUP(A834,Récap!$A$4:$AB$1979,28,FALSE)","v":4}]
["F007",{"$f":"VLOOKUP(A835,Récap!$A$4:$AB$1979,28,FALSE)","v":4}]
["F008",{"$f":"VLOOKUP(A836,Récap!$A$4:$AB$1979,28,FALSE)","v":4}]
["F009",{"$f":"VLOOKUP(A837,Récap!$A$4:$AB$1979,28,FALSE)","v":4}]
["F011",{"$f":"VLOOKUP(A838,Récap!$A$4:$AB$1979,28,FALSE)","v":4}]
["F017",{"$f":"VLOOKUP(A839,Récap!$A$4:$AB$1979,28,FALSE)","v":0}]
["F018",{"$f":"VLOOKUP(A840,Récap!$A$4:$AB$1979,28,FALSE)","v":4}]
["F019",{"$f":"VLOOKUP(A841,Récap!$A$4:$AB$1979,28,FALSE)","v":4}]
["F027",{"$f":"VLOOKUP(A842,Récap!$A$4:$AB$1979,28,FALSE)","v":30}]
["F028",{"$f":"VLOOKUP(A843,Récap!$A$4:$AB$1979,28,FALSE)","v":0}]
["F029",{"$f":"VLOOKUP(A844,Récap!$A$4:$AB$1979,28,FALSE)","v":5}]
["F032",{"$f":"VLOOKUP(A845,Récap!$A$4:$AB$1979,28,FALSE)","v":5}]
["F033",{"$f":"VLOOKUP(A846,Récap!$A$4:$AB$1979,28,FALSE)","v":50}]
["FO34",{"$f":"VLOOKUP(A847,Récap!$A$4:$AB$1979,28,FALSE)","v":5}]
["F036",{"$f":"VLOOKUP(A848,Récap!$A$4:$AB$1979,28,FALSE)","v":5}]
["R002",{"$f":"VLOOKUP(A849,Récap!$A$4:$AB$1979,28,FALSE)","v":20}]
["R003",{"$f":"VLOOKUP(A850,Récap!$A$4:$AB$1979,28,FALSE)","v":20}]
["R007",{"$f":"VLOOKUP(A851,Récap!$A$4:$AB$1979,28,FALSE)","v":6}]
["R008",{"$f":"VLOOKUP(A852,Récap!$A$4:$AB$1979,28,FALSE)","v":15}]
["R009",{"$f":"VLOOKUP(A853,Récap!$A$4:$AB$1979,28,FALSE)","v":15}]
["R010",{"$f":"VLOOKUP(A854,Récap!$A$4:$AB$1979,28,FALSE)","v":10}]
["R011",{"$f":"VLOOKUP(A855,Récap!$A$4:$AB$1979,28,FALSE)","v":10}]
["R014",{"$f":"VLOOKUP(A856,Récap!$A$4:$AB$1979,28,FALSE)","v":5}]
["D001",{"$f":"VLOOKUP(A857,Récap!$A$4:$AB$1979,28,FALSE)","v":10}]
["D002",{"$f":"VLOOKUP(A858,Récap!$A$4:$AB$1979,28,FALSE)","v":18}]
["D003",{"$f":"VLOOKUP(A859,Récap!$A$4:$AB$1979,28,FALSE)","v":20}]
["TEN002",{"$f":"VLOOKUP(A860,Récap!$A$4:$AB$1979,28,FALSE)","v":20}]
["TEN003",{"$f":"VLOOKUP(A861,Récap!$A$4:$AB$1979,28,FALSE)","v":6}]
["TEN004",{"$f":"VLOOKUP(A862,Récap!$A$4:$AB$1979,28,FALSE)","v":6}]
["TF03",{"$f":"VLOOKUP(A863,Récap!$A$4:$AB$1979,28,FALSE)","v":6}]
["TF04",{"$f":"VLOOKUP(A864,Récap!$A$4:$AB$1979,28,FALSE)","v":10}]
["TF05",{"$f":"VLOOKUP(A865,Récap!$A$4:$AB$1979,28,FALSE)","v":10}]
["TF06",{"$f":"VLOOKUP(A866,Récap!$A$4:$AB$1979,28,FALSE)","v":10}]
["TF07",{"$f":"VLOOKUP(A867,Récap!$A$4:$AB$1979,28,FALSE)","v":10}]
["TF08",{"$f":"VLOOKUP(A868,Récap!$A$4:$AB$1979,28,FALSE)","v":10}]
["TF10",{"$f":"VLOOKUP(A869,Récap!$A$4:$AB$1979,28,FALSE)","v":10}]
["TF11",{"$f":"VLOOKUP(A870,Récap!$A$4:$AB$1979,28,FALSE)","v":10}]
["TF13",{"$f":"VLOOKUP(A871,Récap!$A$4:$AB$1979,28,FALSE)","v":10}]
["TF41",{"$f":"VLOOKUP(A872,Récap!$A$4:$AB$1979,28,FALSE)","v":10}]
["TF40",{"$f":"VLOOKUP(A873,Récap!$A$4:$AB$1979,28,FALSE)","v":10}]
["TF92",{"$f":"VLOOKUP(A874,Récap!$A$4:$AB$1979,28,FALSE)","v":10}]
["TF39",0]
["TF14",{"$f":"VLOOKUP(A876,Récap!$A$4:$AB$1979,28,FALSE)","v":10}]
["TF15",{"$f":"VLOOKUP(A877,Récap!$A$4:$AB$1979,28,FALSE)","v":10}]
["TF18",{"$f":"VLOOKUP(A878,Récap!$A$4:$AB$1979,28,FALSE)","v":10}]
["TF20",{"$f":"VLOOKUP(A879,Récap!$A$4:$AB$1979,28,FALSE)","v":10}]
["TF21",{"$f":"VLOOKUP(A880,Récap!$A$4:$AB$1979,28,FALSE)","v":10}]
["TF22",{"$f":"VLOOKUP(A881,Récap!$A$4:$AB$1979,28,FALSE)","v":10}]
["TF75",{"$f":"VLOOKUP(A882,Récap!$A$4:$AB$1979,28,FALSE)","v":10}]
["TF23",{"$f":"VLOOKUP(A883,Récap!$A$4:$AB$1979,28,FALSE)","v":10}]
["TF24",{"$f":"VLOOKUP(A884,Récap!$A$4:$AB$1979,28,FALSE)","v":10}]
["TF25",{"$f":"VLOOKUP(A885,Récap!$A$4:$AB$1979,28,FALSE)","v":10}]
["TF26",{"$f":"VLOOKUP(A886,Récap!$A$4:$AB$1979,28,FALSE)","v":10}]
["TF27",{"$f":"VLOOKUP(A887,Récap!$A$4:$AB$1979,28,FALSE)","v":10}]
["TF28",{"$f":"VLOOKUP(A888,Récap!$A$4:$AB$1979,28,FALSE)","v":10}]
["TF29",{"$f":"VLOOKUP(A889,Récap!$A$4:$AB$1979,28,FALSE)","v":10}]
["TF30",{"$f":"VLOOKUP(A890,Récap!$A$4:$AB$1979,28,FALSE)","v":10}]
["TF31",{"$f":"VLOOKUP(A891,Récap!$A$4:$AB$1979,28,FALSE)","v":10}]
["TF32",{"$f":"VLOOKUP(A892,Récap!$A$4:$AB$1979,28,FALSE)","v":10}]
["TF33",{"$f":"VLOOKUP(A893,Récap!$A$4:$AB$1979,28,FALSE)","v":10}]
["TF34",{"$f":"VLOOKUP(A894,Récap!$A$4:$AB$1979,28,FALSE)","v":10}]
["TF35",0]
["TF36",{"$f":"VLOOKUP(A896,Récap!$A$4:$AB$1979,28,FALSE)","v":10}]
["TF126",{"$f":"VLOOKUP(A897,Récap!$A$4:$AB$1979,28,FALSE)","v":10}]
["TF137",{"$f":"VLOOKUP(A898,Récap!$A$4:$AB$1979,28,FALSE)","v":10}]
["TF69",{"$f":"VLOOKUP(A899,Récap!$A$4:$AB$1979,28,FALSE)","v":10}]
["TF115",{"$f":"VLOOKUP(A900,Récap!$A$4:$AB$1979,28,FALSE)","v":10}]
["TF116",{"$f":"VLOOKUP(A901,Récap!$A$4:$AB$1979,28,FALSE)","v":10}]
["TH6702-82J",9]
["B077",41]
["8-94172-018-0",{"$f":"VLOOKUP(A904,Récap!$A$4:$AB$1979,28,FALSE)","v":50}]
["MI15",{"$f":"VLOOKUP(A905,Récap!$A$4:$AB$1979,28,FALSE)","v":2}]
[207094112625,{"$f":"VLOOKUP(A906,Récap!$A$4:$AB$1979,28,FALSE)","v":2}]
["ISU328L",{"$f":"VLOOKUP(A907,Récap!$A$4:$AB$1979,28,FALSE)","v":2}]
["ISU328L",{"$f":"VLOOKUP(A908,Récap!$A$4:$AB$1979,28,FALSE)","v":2}]
["ISU221L",{"$f":"VLOOKUP(A909,Récap!$A$4:$AB$1979,28,FALSE)","v":4}]
["ISU221R",{"$f":"VLOOKUP(A910,Récap!$A$4:$AB$1979,28,FALSE)","v":4}]
["5SR-A0205",{"$f":"VLOOKUP(A911,Récap!$A$4:$AB$1979,28,FALSE)","v":2}]
["AK1230",{"$f":"VLOOKUP(A912,Récap!$A$4:$AB$1979,28,FALSE)","v":2}]
["224018760R",{"$f":"VLOOKUP(A913,Récap!$A$4:$AB$1979,28,FALSE)","v":21}]
[7700500168,{"$f":"VLOOKUP(A914,Récap!$A$4:$AB$1979,28,FALSE)","v":20}]
[182509,{"$f":"VLOOKUP(A915,Récap!$A$4:$AB$1979,28,FALSE)","v":20}]
["271918G",{"$f":"VLOOKUP(A916,Récap!$A$4:$AB$1979,28,FALSE)","v":10}]
[8942313080,7]
["MB831040",{"$f":"VLOOKUP(A918,Récap!$A$4:$AB$1979,28,FALSE)","v":1}]
["MI26",{"$f":"VLOOKUP(A919,Récap!$A$4:$AB$1979,28,FALSE)","v":10}]
["MI25",{"$f":"VLOOKUP(A920,Récap!$A$4:$AB$1979,28,FALSE)","v":2}]
["MI24",{"$f":"VLOOKUP(A921,Récap!$A$4:$AB$1979,28,FALSE)","v":4}]
["MI23",{"$f":"VLOOKUP(A922,Récap!$A$4:$AB$1979,28,FALSE)","v":10}]
["MI21",{"$f":"VLOOKUP(A923,Récap!$A$4:$AB$1979,28,FALSE)","v":6}]
["MI19",{"$f":"VLOOKUP(A924,Récap!$A$4:$AB$1979,28,FALSE)","v":10}]
["MI18",{"$f":"VLOOKUP(A925,Récap!$A$4:$AB$1979,28,FALSE)","v":5}]
["MI17",{"$f":"VLOOKUP(A926,Récap!$A$4:$AB$1979,28,FALSE)","v":4}]
["MI13",{"$f":"VLOOKUP(A927,Récap!$A$4:$AB$1979,28,FALSE)","v":4}]
["MI10",{"$f":"VLOOKUP(A928,Récap!$A$4:$AB$1979,28,FALSE)","v":10}]
["MI08",0]
["MI05",{"$f":"VLOOKUP(A930,Récap!$A$4:$AB$1979,28,FALSE)","v":10}]
["MI03",{"$f":"VLOOKUP(A931,Récap!$A$4:$AB$1979,28,FALSE)","v":8}]
["MI01-N",{"$f":"VLOOKUP(A932,Récap!$A$4:$AB$1979,28,FALSE)","v":4}]
["MI02",{"$f":"VLOOKUP(A933,Récap!$A$4:$AB$1979,28,FALSE)","v":20}]
["FD003-N",{"$f":"VLOOKUP(A934,Récap!$A$4:$AB$1979,28,FALSE)","v":4}]
["8-94155314",{"$f":"VLOOKUP(A935,Récap!$A$4:$AB$1979,28,FALSE)","v":3}]
[{"$f":"IF(Base!A935=\"\",\"\",Base!A935)","v":"IZ028820B"},{"$f":"VLOOKUP(A936,Récap!$A$4:$AB$1979,28,FALSE)","v":1}]
[110806,{"$f":"VLOOKUP(A937,Récap!$A$4:$AB$1979,28,FALSE)","v":1}]
[{"$f":"IF(Base!A937=\"\",\"\",Base!A937)","v":"PIMA717PHD"},{"$f":"VLOOKUP(A938,Récap!$A$4:$AB$1979,28,FALSE)","v":0}]
[{"$f":"IF(Base!A938=\"\",\"\",Base!A938)","v":"ISU285L"},{"$f":"VLOOKUP(A939,Récap!$A$4:$AB$1979,28,FALSE)","v":2}]
[{"$f":"IF(Base!A939=\"\",\"\",Base!A939)","v":"ISU285R"},{"$f":"VLOOKUP(A940,Récap!$A$4:$AB$1979,28,FALSE)","v":2}]
[{"$f":"IF(Base!A940=\"\",\"\",Base!A940)","v":"IBD-1373"},{"$f":"VLOOKUP(A941,Récap!$A$4:$AB$1979,28,FALSE)","v":4}]
["AX192766",{"$f":"VLOOKUP(A942,Récap!$A$4:$AB$1979,28,FALSE)","v":1}]
["A379RU30MM",{"$f":"VLOOKUP(A943,Récap!$A$4:$AB$1979,28,FALSE)","v":1}]
["A390R030MM",{"$f":"VLOOKUP(A944,Récap!$A$4:$AB$1979,28,FALSE)","v":1}]
[821350,{"$f":"VLOOKUP(A945,Récap!$A$4:$AB$1979,28,FALSE)","v":1}]
["ARCEBMIM140-0,00",{"$f":"VLOOKUP(A946,Récap!$A$4:$AB$1979,28,FALSE)","v":2}]
["ARCEBMIM140-0,50",{"$f":"VLOOKUP(A947,Récap!$A$4:$AB$1979,28,FALSE)","v":1}]
["8-97381456",{"$f":"VLOOKUP(A948,Récap!$A$4:$AB$1979,28,FALSE)","v":5}]
[153010,{"$f":"VLOOKUP(A949,Récap!$A$4:$AB$1979,28,FALSE)","v":6}]
["879117254-1",{"$f":"VLOOKUP(A950,Récap!$A$4:$AB$1979,28,FALSE)","v":1}]
[894311222,{"$f":"VLOOKUP(A951,Récap!$A$4:$AB$1979,28,FALSE)","v":1}]
["8-94325768",0]
["PA-137AF",{"$f":"VLOOKUP(A953,Récap!$A$4:$AB$1979,28,FALSE)","v":1}]
["FT1506006R",{"$f":"VLOOKUP(A954,Récap!$A$4:$AB$1979,28,FALSE)","v":1}]
[2058281146,{"$f":"VLOOKUP(A955,Récap!$A$4:$AB$1979,28,FALSE)","v":0}]
[20587810294,{"$f":"VLOOKUP(A956,Récap!$A$4:$AB$1979,28,FALSE)","v":1}]
["MA880183",{"$f":"VLOOKUP(A957,Récap!$A$4:$AB$1979,28,FALSE)","v":1}]
["MA870169",{"$f":"VLOOKUP(A958,Récap!$A$4:$AB$1979,28,FALSE)","v":1}]
["5-87831-081-0",{"$f":"VLOOKUP(A959,Récap!$A$4:$AB$1979,28,FALSE)","v":10}]
["VC-500",0]
[109,{"$f":"VLOOKUP(A961,Récap!$A$4:$AB$1979,28,FALSE)","v":1}]
["8-94463-830",{"$f":"VLOOKUP(A962,Récap!$A$4:$AB$1979,28,FALSE)","v":2}]
["UJ06-66-122",{"$f":"VLOOKUP(A963,Récap!$A$4:$AB$1979,28,FALSE)","v":2}]
["MD050312",{"$f":"VLOOKUP(A964,Récap!$A$4:$AB$1979,28,FALSE)","v":13}]
["U187",{"$f":"VLOOKUP(A965,Récap!$A$4:$AB$1979,28,FALSE)","v":6}]
["RD01104",{"$f":"VLOOKUP(A966,Récap!$A$4:$AB$1979,28,FALSE)","v":5}]
[3556,{"$f":"VLOOKUP(A967,Récap!$A$4:$AB$1979,28,FALSE)","v":3}]
[3557,{"$f":"VLOOKUP(A968,Récap!$A$4:$AB$1979,28,FALSE)","v":3}]
["I044",{"$f":"VLOOKUP(A969,Récap!$A$4:$AB$1979,28,FALSE)","v":10}]
["ISC572086U",{"$f":"VLOOKUP(A970,Récap!$A$4:$AB$1979,28,FALSE)","v":1}]
["UHY1-33-29Z",{"$f":"VLOOKUP(A971,Récap!$A$4:$AB$1979,28,FALSE)","v":2}]
["UMY1-33-29",{"$f":"VLOOKUP(A972,Récap!$A$4:$AB$1979,28,FALSE)","v":2}]
["IZ20011BS",{"$f":"VLOOKUP(A973,Récap!$A$4:$AB$1979,28,FALSE)","v":1}]
[2069,{"$f":"VLOOKUP(A974,Récap!$A$4:$AB$1979,28,FALSE)","v":4}]
[139541,{"$f":"VLOOKUP(A975,Récap!$A$4:$AB$1979,28,FALSE)","v":2}]
["MB334-22J",{"$f":"VLOOKUP(A976,Récap!$A$4:$AB$1979,28,FALSE)","v":2}]
["MB334-22I",{"$f":"VLOOKUP(A977,Récap!$A$4:$AB$1979,28,FALSE)","v":2}]
["8-94434-977",{"$f":"VLOOKUP(A978,Récap!$A$4:$AB$1979,28,FALSE)","v":2}]
["8-94434-978",{"$f":"VLOOKUP(A979,Récap!$A$4:$AB$1979,28,FALSE)","v":2}]
[154148,{"$f":"VLOOKUP(A980,Récap!$A$4:$AB$1979,28,FALSE)","v":1}]
["HD15-5005",{"$f":"VLOOKUP(A981,Récap!$A$4:$AB$1979,28,FALSE)","v":8}]
["215-19D4-AERH",{"$f":"VLOOKUP(A982,Récap!$A$4:$AB$1979,28,FALSE)","v":0}]
["2201A01",{"$f":"VLOOKUP(A983,Récap!$A$4:$AB$1979,28,FALSE)","v":200}]
[470180,{"$f":"VLOOKUP(A984,Récap!$A$4:$AB$1979,28,FALSE)","v":1}]
[190910,{"$f":"VLOOKUP(A985,Récap!$A$4:$AB$1979,28,FALSE)","v":1}]
[4604444,{"$f":"VLOOKUP(A986,Récap!$A$4:$AB$1979,28,FALSE)","v":1}]
[4604443,{"$f":"VLOOKUP(A987,Récap!$A$4:$AB$1979,28,FALSE)","v":0}]
["8-97039190-3",{"$f":"VLOOKUP(A988,Récap!$A$4:$AB$1979,28,FALSE)","v":1}]
["8-94467328",{"$f":"VLOOKUP(A989,Récap!$A$4:$AB$1979,28,FALSE)","v":2}]
["13011-54100",{"$f":"VLOOKUP(A990,Récap!$A$4:$AB$1979,28,FALSE)","v":1}]
["TF62",11]
["I164",{"$f":"VLOOKUP(A992,Récap!$A$4:$AB$1979,28,FALSE)","v":2}]
["2010TH2042-1G",{"$f":"VLOOKUP(A993,Récap!$A$4:$AB$1979,28,FALSE)","v":2}]
["27TH-2042CG",{"$f":"VLOOKUP(A994,Récap!$A$4:$AB$1979,28,FALSE)","v":1}]
[20897921857,0]
["I114",0]
["MG02-02044",3]
["2040VS6409",5]
["PI45 9V",40]
["148688G",2]
["O-MD303972",2]
["IZ07067GA7",0]
["1ATAK",30]
[2162,2]
["8-94435-140",1]
["ISC506115U",1]
["ISK2047",1]
[6253029000,1]
["HD19-1001",1]
["HD19-1001-353 R",1]
["ISU282L",1]
["ISU282R",1]
["ISU283L",1]
["ISU283R",1]
["Z102",2]
["UH71-33-061B",1]
["UH71-26-630A",1]
["UH71-26-640A",1]
["WL02-16-520A",1]
["MD972001"]

{"sheet":"Récap","index":4,"n_rows":1125,"n_cols":28,"rows_kept":1125,"cut":false,"hidden":false,"merged":[[1,25,1,27],[0,0,0,24],[1,13,1,14],[1,15,1,16],[1,17,1,18],[1,19,1,20],[1,21,1,22],[1,23,1,24],[1,1,1,2],[1,3,1,4],[1,5,1,6],[1,7,1,8],[1,9,1,10],[1,11,1,12]]}
[{"$f":"\"Récapitulatif Entrées et Sorties des Produits par mois pour l'ANNEE: \" &Base!P1","v":"Récapitulatif Entrées et Sorties des Produits par mois pour l'ANNEE: 2016"}]
["essai","JANVIER",null,"FEVRIER",null,"MARS",null,"AVRIL",null,"MAI",null,"JUIN",null,"JUILLET",null,"AOUT",null,"SEPTEMBRE",null,"OCTOBRE",null,"NOVEMBRE",null,"décembre",null,"TOTAUX"]
["Références produits","IN","OUT","IN","OUT","IN","OUT","IN","OUT","IN","OUT","IN","OUT","IN","OUT","IN","OUT","IN","OUT","IN","OUT","IN","OUT","IN ","OUT","IN","OUT","Rest_Réel"]
["IZ028802C",null,null,null,null,null,null,null,null,null,null,null,null,null,null,null,null,null,null,null,null,5,0,0,0,{"$f":"IF(A4=\"\",\"\",SUM(B4,D4,F4,H4,J4,L4,N4,P4,R4,T4,V4,X4))","v":5},{"$f":"IF(A4=\"\",\"\",SUM(C4,E4,G4,I4,K4,M4,O4,Q4,S4,U4,W4,Y4))","v":0},{"$f":"IF(A4=\"\",\"\",Z4-AA4)","v":5}]
["IZ028802D",null,null,null,null,null,null,null,null,null,null,null,null,null,null,null,null,null,null,null,null,5,0,0,0,{"$f":"IF(A5=\"\",\"\",SUM(B5,D5,F5,H5,J5,L5,N5,P5,R5,T5,V5,X5))","v":5},{"$f":"IF(A5=\"\",\"\",SUM(C5,E5,G5,I5,K5,M5,O5,Q5,S5,U5,W5,Y5))","v":0},{"$f":"IF(A5=\"\",\"\",Z5-AA5)","v":5}]
["IZ029702A",null,null,null,null,null,null,null,null,null,null,null,null,null,null,null,null,null,null,null,null,5,0,0,0,5,0,5]
["IZ029702B",null,null,null,null,null,null,null,null,null,null,null,null,null,null,null,null,null,null,null,null,5,0,0,0,5,0,5]
["IZ020202AR",null,null,null,null,null,null,null,null,null,null,null,null,null,null,null,null,null,null,null,null,5,0,0,1,5,1,4]
["IZ020602AL",null,null,null,null,null,null,null,null,null,null,null,null,null,null,null,null,null,null,null,null,4,0,0,0,4,0,4]
["IZ020202AL",null,null,null,null,null,null,null,null,null,null,null,null,null,null,null,null,null,null,null,null,2,1,0,0,2,1,1]
["IZ020602AR",null,null,null,null,null,null,null,null,null,null,null,null,null,null,null,null,null,null,null,null,2,0,0,0,2,0,2]
[" IZ020602EL",null,null,null,null,null,null,null,null,null,null,null,null,null,null,null,null,null,null,null,null,2,0,0,0,2,0,2]
["IZ020602ER",null,null,null,null,null,null,null,null,null,null,null,null,null,null,null,null,null,null,null,null,2,0,0,0,2,0,2]
["IZ020214A",null,null,null,null,null,null,null,null,null,null,null,null,null,null,null,null,null,null,null,null,0,0,0,0,0,0,0]
["IZ020614A",null,null,null,null,null,null,null,null,null,null,null,null,null,null,null,null,null,null,null,null,1,0,0,0,1,0,1]
["IZ028114B",null,null,null,null,null,null,null,null,null,null,null,null,null,null,null,null,null,null,null,null,1,0,0,0,1,0,1]
["897367044-0296",null,null,null,null,null,null,null,null,null,null,null,null,null,null,null,null,null,null,null,null,2,0,0,0,2,0,2]
[8972358672,null,null,null,null,null,null,null,null,null,null,null,null,null,null,null,null,null,null,null,null,1,0,0,0,1,0,1]
["IZ028812C",null,null,null,null,null,null,null,null,null,null,null,null,null,null,null,null,null,null,null,null,2,0,0,0,2,0,2]
["IZ028812D",null,null,null,null,null,null,null,null,null,null,null,null,null,null,null,null,null,null,null,null,1,0,0,0,1,0,1]
["IZ028812A",null,null,null,null,null,null,null,null,null,null,null,null,null,null,null,null,null,null,null,null,1,0,0,0,1,0,1]
["IZ028812B",null,null,null,null,null,null,null,null,null,null,null,null,null,null,null,null,null,null,null,null,1,0,0,0,1,0,1]
["IZ020212AL",null,null,null,null,null,null,null,null,null,null,null,null,null,null,null,null,null,null,null,null,1,0,0,0,1,0,1]
["IZ020212AR",null,null,null,null,null,null,null,null,null,null,null,null,null,null,null,null,null,null,null,null,1,0,0,0,1,0,1]
[20897387346,null,null,null,null,null,null,null,null,null,null,null,null,null,null,null,null,null,null,null,null,2,0,0,0,2,0,2]
["278-97308868",null,null,null,null,null,null,null,null,null,null,null,null,null,null,null,null,null,null,null,null,4,0,0,0,4,0,4]
[27894226829,null,null,null,null,null,null,null,null,null,null,null,null,null,null,null,null,null,null,null,null,6,0,0,0,6,0,6]
[8971103140,null,null,null,null,null,null,null,null,null,null,null,null,null,null,null,null,null,null,null,null,5,1,0,0,5,1,4]
[8970438802,null,null,null,null,null,null,null,null,null,null,null,null,null,null,null,null,null,null,null,null,5,0,0,0,5,0,5]
["IZ029906A",null,null,null,null,null,null,null,null,null,null,null,null,null,null,null,null,null,null,null,null,10,0,0,0,10,0,10]
["IZ029906B",null,null,null,null,null,null,null,null,null,null,null,null,null,null,null,null,null,null,null,null,5,0,0,0,5,0,5]
["IZ028806A",null,null,null,null,null,null,null,null,null,null,null,null,null,null,null,null,null,null,null,null,5,0,0,0,5,0,5]
["IZ028806B",null,null,null,null,null,null,null,null,null,null,null,null,null,null,null,null,null,null,null,null,5,0,0,0,5,0,5]
["20IZ400238",null,null,null,null,null,null,null,null,null,null,null,null,null,null,null,null,null,null,null,null,5,0,0,0,5,0,5]
["IZ029709A",null,null,null,null,null,null,null,null,null,null,null,null,null,null,null,null,null,null,null,null,10,0,0,0,10,0,10]
["IZ029709B",null,null,null,null,null,null,null,null,null,null,null,null,null,null,null,null,null,null,null,null,10,0,0,0,10,0,10]
["IZ028809A",null,null,null,null,null,null,null,null,null,null,null,null,null,null,null,null,null,null,null,null,10,0,0,0,10,0,10]
["IZ028809B",null,null,null,null,null,null,null,null,null,null,null,null,null,null,null,null,null,null,null,null,10,0,0,0,10,0,10]
["IZ41007AL",null,null,null,null,null,null,null,null,null,null,null,null,null,null,null,null,null,null,null,null,10,0,0,0,10,0,10]
["IZ41007AR",null,null,null,null,null,null,null,null,null,null,null,null,null,null,null,null,null,null,null,null,10,0,0,0,10,0,10]
["IZ028102A",null,null,null,null,null,null,null,null,null,null,null,null,null,null,null,null,null,null,null,null,4,0,0,0,4,0,4]
["IZ028102B",null,null,null,null,null,null,null,null,null,null,null,null,null,null,null,null,null,null,null,null,3,0,0,0,3,0,3]
["RD01090",null,null,null,null,null,null,null,null,null,null,null,null,null,null,null,null,null,null,null,null,10,0,0,0,10,0,10]
["RD01095",null,null,null,null,null,null,null,null,null,null,null,null,null,null,null,null,null,null,null,null,2,0,0,0,2,0,2]
["RD01097",null,null,null,null,null,null,null,null,null,null,null,null,null,null,null,null,null,null,null,null,2,0,0,0,2,0,2]
["RD01101",null,null,null,null,null,null,null,null,null,null,null,null,null,null,null,null,null,null,null,null,4,0,0,0,4,0,4]
["RD01146",null,null,null,null,null,null,null,null,null,null,null,null,null,null,null,null,null,null,null,null,4,0,0,0,4,0,4]
["RD02069",null,null,null,null,null,null,null,null,null,null,null,null,null,null,null,null,null,null,null,null,10,0,0,0,10,0,10]
["RD05007",null,null,null,null,null,null,null,null,null,null,null,null,null,null,null,null,null,null,null,null,5,0,0,0,5,0,5]
["RD05008",null,null,null,null,null,null,null,null,null,null,null,null,null,null,null,null,null,null,null,null,10,0,0,0,10,0,10]
["RD12057",null,null,null,null,null,null,null,null,null,null,null,null,null,null,null,null,null,null,null,null,10,0,0,0,10,0,10]
["RD02127R",null,null,null,null,null,null,null,null,null,null,null,null,null,null,null,null,null,null,null,null,3,0,0,0,3,0,3]
["27RD01069D",null,null,null,null,null,null,null,null,null,null,null,null,null,null,null,null,null,null,null,null,10,0,0,0,10,0,10]
[1594171,null,null,null,null,null,null,null,null,null,null,null,null,null,null,null,null,null,null,null,null,100,0,0,0,100,0,100]
["20TH2088D",null,null,null,null,null,null,null,null,null,null,null,null,null,null,null,null,null,null,null,null,10,0,0,0,10,0,10]
["20YT-7216DC",null,null,null,null,null,null,null,null,null,null,null,null,null,null,null,null,null,null,null,null,6,0,0,0,6,0,6]
[2039405,null,null,null,null,null,null,null,null,null,null,null,null,null,null,null,null,null,null,null,null,5,0,0,0,5,0,5]
["2080PG405",null,null,null,null,null,null,null,null,null,null,null,null,null,null,null,null,null,null,null,null,20,0,0,0,20,0,20]
[20587810146,null,null,null,null,null,null,null,null,null,null,null,null,null,null,null,null,null,null,null,null,31,0,0,0,31,0,31]
["208094318910",null,null,null,null,null,null,null,null,null,null,null,null,null,null,null,null,null,null,null,null,20,0,0,0,20,0,20]
["MG04-01131",null,null,null,null,null,null,null,null,null,null,null,null,null,null,null,null,null,null,null,null,30,0,0,0,30,0,30]
["MG04-01174",null,null,null,null,null,null,null,null,null,null,null,null,null,null,null,null,null,null,null,null,25,0,0,0,25,0,25]
["MG04-01191",null,null,null,null,null,null,null,null,null,null,null,null,null,null,null,null,null,null,null,null,20,0,0,0,20,0,20]
["MG04-01271",null,null,null,null,null,null,null,null,null,null,null,null,null,null,null,null,null,null,null,null,10,0,0,0,10,0,10]
["MG05-01001",null,null,null,null,null,null,null,null,null,null,null,null,null,null,null,null,null,null,null,null,5,5,0,0,5,5,0]
["MG05-01025",null,null,null,null,null,null,null,null,null,null,null,null,null,null,null,null,null,null,null,null,5,0,0,0,5,0,5]
["MG05-01032",null,null,null,null,null,null,null,null,null,null,null,null,null,null,null,null,null,null,null,null,10,0,0,0,10,0,10]
["MG05-01087",null,null,null,null,null,null,null,null,null,null,null,null,null,null,null,null,null,null,null,null,19,4,0,0,19,4,15]
["MG05-01095",null,null,null,null,null,null,null,null,null,null,null,null,null,null,null,null,null,null,null,null,60,10,0,0,{"$f":"IF(A69=\"\",\"\",SUM(B69,D69,F69,H69,J69,L69,N69,P69,R69,T69,V69,X69))","v":60},{"$f":"IF(A69=\"\",\"\",SUM(C69,E69,G69,I69,K69,M69,O69,Q69,S69,U69,W69,Y69))","v":10},{"$f":"IF(A69=\"\",\"\",Z69-AA69)","v":50}]
["MG06-01002-353",null,null,null,null,null,null,null,null,null,null,null,null,null,null,null,null,null,null,null,null,0,0,0,0,0,0,0]
["MG06-01013",null,null,null,null,null,null,null,null,null,null,null,null,null,null,null,null,null,null,null,null,20,0,0,0,20,0,20]
["MG06-01014",null,null,null,null,null,null,null,null,null,null,null,null,null,null,null,null,null,null,null,null,10,0,0,0,10,0,10]
["MG06-01036",null,null,null,null,null,null,null,null,null,null,null,null,null,null,null,null,null,null,null,null,10,0,0,0,10,0,10]
["MG06-01037",null,null,null,null,null,null,null,null,null,null,null,null,null,null,null,null,null,null,null,null,15,5,0,0,15,5,10]
["MG06-01039",null,null,null,null,null,null,null,null,null,null,null,null,null,null,null,null,null,null,null,null,20,0,0,0,20,0,20]
["MG06-01054",null,null,null,null,null,null,null,null,null,null,null,null,null,null,null,null,null,null,null,null,20,0,0,0,20,0,20]
["RD01077",null,null,null,null,null,null,null,null,null,null,null,null,null,null,null,null,null,null,null,null,5,0,0,0,5,0,5]
["RD01086",null,null,null,null,null,null,null,null,null,null,null,null,null,null,null,null,null,null,null,null,20,0,0,0,20,0,20]
["MG02-05027",null,null,null,null,null,null,null,null,null,null,null,null,null,null,null,null,null,null,null,null,5,1,0,0,5,1,4]
["MG02-05028",null,null,null,null,null,null,null,null,null,null,null,null,null,null,null,null,null,null,null,null,10,0,0,0,10,0,10]
["MG02-09050",null,null,null,null,null,null,null,null,null,null,null,null,null,null,null,null,null,null,null,null,7,2,0,0,7,2,5]
["MG02-11009",null,null,null,null,null,null,null,null,null,null,null,null,null,null,null,null,null,null,null,null,5,0,0,0,5,0,5]
["MG02-08045",null,null,null,null,null,null,null,null,null,null,null,null,null,null,null,null,null,null,null,null,5,0,0,0,5,0,5]
["MG02-13010",null,null,null,null,null,null,null,null,null,null,null,null,null,null,null,null,null,null,null,null,11,6,0,0,11,6,5]
["MG02-13016",null,null,null,null,null,null,null,null,null,null,null,null,null,null,null,null,null,null,null,null,33,13,0,10,33,23,10]
["MG03-08009",null,null,null,null,null,null,null,null,null,null,null,null,null,null,null,null,null,null,null,null,10,0,0,0,10,0,10]
["MG03-08010",null,null,null,null,null,null,null,null,null,null,null,null,null,null,null,null,null,null,null,null,5,0,0,0,5,0,5]
["MG04-01002",null,null,null,null,null,null,null,null,null,null,null,null,null,null,null,null,null,null,null,null,10,0,0,0,10,0,10]
["MG04-01012",null,null,null,null,null,null,null,null,null,null,null,null,null,null,null,null,null,null,null,null,5,0,0,0,5,0,5]
["MG04-01013",null,null,null,null,null,null,null,null,null,null,null,null,null,null,null,null,null,null,null,null,10,0,0,0,10,0,10]
["MG04-01015",null,null,null,null,null,null,null,null,null,null,null,null,null,null,null,null,null,null,null,null,15,0,0,0,15,0,15]
["MG04-01025",null,null,null,null,null,null,null,null,null,null,null,null,null,null,null,null,null,null,null,null,6,0,0,0,6,0,6]
["MG04-01028",null,null,null,null,null,null,null,null,null,null,null,null,null,null,null,null,null,null,null,null,10,0,0,0,10,0,10]
["MG04-01063",null,null,null,null,null,null,null,null,null,null,null,null,null,null,null,null,null,null,null,null,5,0,0,0,5,0,5]
["MG04-01064",null,null,null,null,null,null,null,null,null,null,null,null,null,null,null,null,null,null,null,null,5,0,0,0,5,0,5]
["MG04-01082",null,null,null,null,null,null,null,null,null,null,null,null,null,null,null,null,null,null,null,null,10,0,0,0,10,0,10]
["MG01-01001",null,null,null,null,null,null,null,null,null,null,null,null,null,null,null,null,null,null,null,null,5,0,0,0,5,0,5]
["MG01-01003",null,null,null,null,null,null,null,null,null,null,null,null,null,null,null,null,null,null,null,null,5,0,0,0,5,0,5]
["MG01-05002",null,null,null,null,null,null,null,null,null,null,null,null,null,null,null,null,null,null,null,null,2,0,0,0,2,0,2]
["MG02-01010",null,null,null,null,null,null,null,null,null,null,null,null,null,null,null,null,null,null,null,null,3,0,0,0,3,0,3]
["MG02-01013",null,null,null,null,null,null,null,null,null,null,null,null,null,null,null,null,null,null,null,null,3,0,0,0,3,0,3]
["MG02-01014",null,null,null,null,null,null,null,null,null,null,null,null,null,null,null,null,null,null,null,null,10,0,0,0,10,0,10]
["MG02-01027",null,null,null,null,null,null,null,null,null,null,null,null,null,null,null,null,null,null,null,null,5,0,0,0,5,0,5]
["MG02-01035",null,null,null,null,null,null,null,null,null,null,null,null,null,null,null,null,null,null,null,null,10,0,0,0,10,0,10]
["MG02-01041",null,null,null,null,null,null,null,null,null,null,null,null,null,null,null,null,null,null,null,null,5,0,0,0,5,0,5]
["MG02-01042",null,null,null,null,null,null,null,null,null,null,null,null,null,null,null,null,null,null,null,null,5,0,0,0,5,0,5]
["MG02-01051",null,null,null,null,null,null,null,null,null,null,null,null,null,null,null,null,null,null,null,null,5,0,0,0,5,0,5]
["MG02-01062",null,null,null,null,null,null,null,null,null,null,null,null,null,null,null,null,null,null,null,null,5,0,0,0,5,0,5]
["MG02-02038",null,null,null,null,null,null,null,null,null,null,null,null,null,null,null,null,null,null,null,null,5,0,0,0,5,0,5]
["MG02-02039",null,null,null,null,null,null,null,null,null,null,null,null,null,null,null,null,null,null,null,null,10,0,0,0,10,0,10]
["MG02-02043",null,null,null,null,null,null,null,null,null,null,null,null,null,null,null,null,null,null,null,null,12,2,0,0,12,2,10]
["MG02-02048",null,null,null,null,null,null,null,null,null,null,null,null,null,null,null,null,null,null,null,null,18,8,0,0,18,8,10]
["MG02-03008",null,null,null,null,null,null,null,null,null,null,null,null,null,null,null,null,null,null,null,null,15,4,0,0,15,4,11]
["MG02-04006",null,null,null,null,null,null,null,null,null,null,null,null,null,null,null,null,null,null,null,null,5,0,0,0,5,0,5]
[10470,null,null,null,null,null,null,null,null,null,null,null,null,null,null,null,null,null,null,null,null,7,2,0,0,7,2,5]
[10310,null,null,null,null,null,null,null,null,null,null,null,null,null,null,null,null,null,null,null,null,8,2,0,0,8,2,6]
[10480,null,null,null,null,null,null,null,null,null,null,null,null,null,null,null,null,null,null,null,null,5,0,0,0,5,0,5]
["10405P",null,null,null,null,null,null,null,null,null,null,null,null,null,null,null,null,null,null,null,null,25,0,0,0,25,0,25]
[10435,null,null,null,null,null,null,null,null,null,null,null,null,null,null,null,null,null,null,null,null,5,0,0,0,5,0,5]
[10465,null,null,null,null,null,null,null,null,null,null,null,null,null,null,null,null,null,null,null,null,3,3,0,0,3,3,0]
[10550,null,null,null,null,null,null,null,null,null,null,null,null,null,null,null,null,null,null,null,null,5,0,0,0,5,0,5]
[20170,null,null,null,null,null,null,null,null,null,null,null,null,null,null,null,null,null,null,null,null,50,25,0,0,50,25,25]
[20130,null,null,null,null,null,null,null,null,null,null,null,null,null,null,null,null,null,null,null,null,5,0,0,0,5,0,5]
[2712600,null,null,null,null,null,null,null,null,null,null,null,null,null,null,null,null,null,null,null,null,17,2,0,0,17,2,15]
["MD719469",null,null,null,null,null,null,null,null,null,null,null,null,null,null,null,null,null,null,null,null,10,0,0,0,10,0,10]
[27894101243,null,null,null,null,null,null,null,null,null,null,null,null,null,null,null,null,null,null,null,null,20,0,0,0,20,0,20]
["27MD368858",null,null,null,null,null,null,null,null,null,null,null,null,null,null,null,null,null,null,null,null,20,0,0,0,20,0,20]
["27MR148321",null,null,null,null,null,null,null,null,null,null,null,null,null,null,null,null,null,null,null,null,15,0,0,0,15,0,15]
[7988060000,null,null,null,null,null,null,null,null,null,null,null,null,null,null,null,null,null,null,null,null,1,0,0,0,1,0,1]
[7988070000,null,null,null,null,null,null,null,null,null,null,null,null,null,null,null,null,null,null,null,null,1,0,0,0,1,0,1]
[7986610000,null,null,null,null,null,null,null,null,null,null,null,null,null,null,null,null,null,null,null,null,1,0,0,0,1,0,1]
[7980260000,null,null,null,null,null,null,null,null,null,null,null,null,null,null,null,null,null,null,null,null,1,0,0,0,1,0,1]
[798017000,null,null,null,null,null,null,null,null,null,null,null,null,null,null,null,null,null,null,null,null,1,0,0,0,{"$f":"IF(A133=\"\",\"\",SUM(B133,D133,F133,H133,J133,L133,N133,P133,R133,T133,V133,X133))","v":1},{"$f":"IF(A133=\"\",\"\",SUM(C133,E133,G133,I133,K133,M133,O133,Q133,S133,U133,W133,Y133))","v":0},{"$f":"IF(A133=\"\",\"\",Z133-AA133)","v":1}]
[7980300000,null,null,null,null,null,null,null,null,null,null,null,null,null,null,null,null,null,null,null,null,1,0,0,0,1,0,1]
[7997140000,null,null,null,null,null,null,null,null,null,null,null,null,null,null,null,null,null,null,null,null,2,1,0,0,2,1,1]
[7997180000,null,null,null,null,null,null,null,null,null,null,null,null,null,null,null,null,null,null,null,null,1,0,0,0,1,0,1]
["DD-588",null,null,null,null,null,null,null,null,null,null,null,null,null,null,null,null,null,null,null,null,5,0,0,0,5,0,5]
["DD-587",null,null,null,null,null,null,null,null,null,null,null,null,null,null,null,null,null,null,null,null,5,0,0,0,5,0,5]
["DD-505",null,null,null,null,null,null,null,null,null,null,null,null,null,null,null,null,null,null,null,null,2,0,0,0,2,0,2]
["DD-506",null,null,null,null,null,null,null,null,null,null,null,null,null,null,null,null,null,null,null,null,2,0,0,0,2,0,2]
["DD-219",null,null,null,null,null,null,null,null,null,null,null,null,null,null,null,null,null,null,null,null,1,0,0,0,1,0,1]
["BE-202",null,null,null,null,null,null,null,null,null,null,null,null,null,null,null,null,null,null,null,null,1,0,0,0,1,0,1]
["BE-203",null,null,null,null,null,null,null,null,null,null,null,null,null,null,null,null,null,null,null,null,1,0,0,0,1,0,1]
["BE-236",null,null,null,null,null,null,null,null,null,null,null,null,null,null,null,null,null,null,null,null,1,0,0,0,1,0,1]
["BE-253",null,null,null,null,null,null,null,null,null,null,null,null,null,null,null,null,null,null,null,null,1,0,0,0,1,0,1]
["BE-500",null,null,null,null,null,null,null,null,null,null,null,null,null,null,null,null,null,null,null,null,5,0,0,0,5,0,5]
["BE-501",null,null,null,null,null,null,null,null,null,null,null,null,null,null,null,null,null,null,null,null,5,0,0,0,5,0,5]
["BE-532",null,null,null,null,null,null,null,null,null,null,null,null,null,null,null,null,null,null,null,null,2,0,0,0,2,0,2]
["GI-337",null,null,null,null,null,null,null,null,null,null,null,null,null,null,null,null,null,null,null,null,4,0,0,0,4,0,4]
["GI-338",null,null,null,null,null,null,null,null,null,null,null,null,null,null,null,null,null,null,null,null,2,0,0,0,2,0,2]
["TI-512",null,null,null,null,null,null,null,null,null,null,null,null,null,null,null,null,null,null,null,null,6,0,0,0,6,0,6]
["TI-517",null,null,null,null,null,null,null,null,null,null,null,null,null,null,null,null,null,null,null,null,6,0,0,0,6,0,6]
["BJ-505",null,null,null,null,null,null,null,null,null,null,null,null,null,null,null,null,null,null,null,null,4,0,0,0,4,0,4]
["BJ-508",null,null,null,null,null,null,null,null,null,null,null,null,null,null,null,null,null,null,null,null,4,0,0,0,4,0,4]
["BJ-913",null,null,null,null,null,null,null,null,null,null,null,null,null,null,null,null,null,null,null,null,4,0,0,0,4,0,4]
["BJ-906",null,null,null,null,null,null,null,null,null,null,null,null,null,null,null,null,null,null,null,null,2,0,0,0,2,0,2]
["BJ-914",null,null,null,null,null,null,null,null,null,null,null,null,null,null,null,null,null,null,null,null,2,0,0,0,2,0,2]
["BJ-915",null,null,null,null,null,null,null,null,null,null,null,null,null,null,null,null,null,null,null,null,2,0,0,0,2,0,2]
["FA-523S",null,null,null,null,null,null,null,null,null,null,null,null,null,null,null,null,null,null,null,null,4,0,0,0,4,0,4]
["FA-383S",null,null,null,null,null,null,null,null,null,null,null,null,null,null,null,null,null,null,null,null,9,4,0,0,9,4,5]
["FO-912S",null,null,null,null,null,null,null,null,null,null,null,null,null,null,null,null,null,null,null,null,3,0,0,0,3,0,3]
["FA-2010S",null,null,null,null,null,null,null,null,null,null,null,null,null,null,null,null,null,null,null,null,2,0,0,0,2,0,2]
["FA-345S",null,null,null,null,null,null,null,null,null,null,null,null,null,null,null,null,null,null,null,null,2,0,0,0,2,0,2]
["PA-582AF",null,null,null,null,null,null,null,null,null,null,null,null,null,null,null,null,null,null,null,null,3,0,0,0,3,0,3]
["PA-323AF",null,null,null,null,null,null,null,null,null,null,null,null,null,null,null,null,null,null,null,null,2,0,0,0,2,0,2]
["PA-373AF",null,null,null,null,null,null,null,null,null,null,null,null,null,null,null,null,null,null,null,null,2,2,0,0,2,2,0]
["PA-247AF",null,null,null,null,null,null,null,null,null,null,null,null,null,null,null,null,null,null,null,null,1,0,0,0,1,0,1]
["PA-256AF",null,null,null,null,null,null,null,null,null,null,null,null,null,null,null,null,null,null,null,null,1,0,0,0,1,0,1]
["PA-269AF",null,null,null,null,null,null,null,null,null,null,null,null,null,null,null,null,null,null,null,null,1,0,0,0,1,0,1]
["PA-115AF",null,null,null,null,null,null,null,null,null,null,null,null,null,null,null,null,null,null,null,null,1,0,0,0,1,0,1]
["PA-123AF",null,null,null,null,null,null,null,null,null,null,null,null,null,null,null,null,null,null,null,null,1,0,0,0,1,0,1]
["PA-143AF",null,null,null,null,null,null,null,null,null,null,null,null,null,null,null,null,null,null,null,null,1,0,0,0,1,0,1]
["PA-800AF",null,null,null,null,null,null,null,null,null,null,null,null,null,null,null,null,null,null,null,null,1,0,0,0,1,0,1]
["PA-504AF",null,null,null,null,null,null,null,null,null,null,null,null,null,null,null,null,null,null,null,null,2,0,0,0,2,0,2]
["CS-593",null,null,null,null,null,null,null,null,null,null,null,null,null,null,null,null,null,null,null,null,4,0,0,0,4,0,4]
["CY-599",null,null,null,null,null,null,null,null,null,null,null,null,null,null,null,null,null,null,null,null,6,3,0,0,6,3,3]
["BJ-513",null,null,null,null,null,null,null,null,null,null,null,null,null,null,null,null,null,null,null,null,3,2,0,0,3,2,1]
["BJ-514",null,null,null,null,null,null,null,null,null,null,null,null,null,null,null,null,null,null,null,null,2,0,0,0,2,0,2]
["BJ-509",null,null,null,null,null,null,null,null,null,null,null,null,null,null,null,null,null,null,null,null,2,0,0,0,2,0,2]
["CE-K00",null,null,null,null,null,null,null,null,null,null,null,null,null,null,null,null,null,null,null,null,20,0,0,0,20,0,20]
["JO-502",null,null,null,null,null,null,null,null,null,null,null,null,null,null,null,null,null,null,null,null,2,0,0,0,2,0,2]
["KK-15006",null,null,null,null,null,null,null,null,null,null,null,null,null,null,null,null,null,null,null,null,4,0,0,0,4,0,4]
["KK-15005",null,null,null,null,null,null,null,null,null,null,null,null,null,null,null,null,null,null,null,null,2,0,0,0,2,0,2]
["KK-13028",null,null,null,null,null,null,null,null,null,null,null,null,null,null,null,null,null,null,null,null,1,0,0,0,1,0,1]
["KK-13010",null,null,null,null,null,null,null,null,null,null,null,null,null,null,null,null,null,null,null,null,1,1,0,0,1,1,0]
["KK-22008",null,null,null,null,null,null,null,null,null,null,null,null,null,null,null,null,null,null,null,null,2,0,0,0,2,0,2]
["KK-21008",null,null,null,null,null,null,null,null,null,null,null,null,null,null,null,null,null,null,null,null,2,0,0,0,2,0,2]
["KK-23035",null,null,null,null,null,null,null,null,null,null,null,null,null,null,null,null,null,null,null,null,2,0,0,0,2,0,2]
["72-6183",null,null,null,null,null,null,null,null,null,null,null,null,null,null,null,null,null,null,null,null,10,0,0,0,10,0,10]
["72-6184",null,null,null,null,null,null,null,null,null,null,null,null,null,null,null,null,null,null,null,null,30,0,0,0,30,0,30]
["2089447403012D",null,null,null,null,null,null,null,null,null,null,null,null,null,null,null,null,null,null,null,null,5,0,0,0,5,0,5]
["8-94474031-3",null,null,null,null,null,null,null,null,null,null,null,null,null,null,null,null,null,null,null,null,2,0,0,0,2,0,2]
["20002131609D",null,null,null,null,null,null,null,null,null,null,null,null,null,null,null,null,null,null,null,null,20,0,0,0,20,0,20]
["20002131609G",null,null,null,null,null,null,null,null,null,null,null,null,null,null,null,null,null,null,null,null,20,0,0,0,20,0,20]
["213-1609 LH",null,null,null,null,null,null,null,null,null,null,null,null,null,null,null,null,null,null,null,null,11,1,0,0,11,1,10]
["213-1609 RH",null,null,null,null,null,null,null,null,null,null,null,null,null,null,null,null,null,null,null,null,11,1,0,0,11,1,10]
[27894244409,null,null,null,null,null,null,null,null,null,null,null,null,null,null,null,null,null,null,null,null,5,0,0,0,{"$f":"IF(A197=\"\",\"\",SUM(B197,D197,F197,H197,J197,L197,N197,P197,R197,T197,V197,X197))","v":5},{"$f":"IF(A197=\"\",\"\",SUM(C197,E197,G197,I197,K197,M197,O197,Q197,S197,U197,W197,Y197))","v":0},{"$f":"IF(A197=\"\",\"\",Z197-AA197)","v":5}]
["MG02-13002",null,null,null,null,null,null,null,null,null,null,null,null,null,null,null,null,null,null,null,null,3,1,0,0,3,1,2]
["DQ124",null,null,null,null,null,null,null,null,null,null,null,null,null,null,null,null,null,null,null,null,10,0,0,0,10,0,10]
[245010,null,null,null,null,null,null,null,null,null,null,null,null,null,null,null,null,null,null,null,null,2,0,0,0,2,0,2]
[27587410308,null,null,null,null,null,null,null,null,null,null,null,null,null,null,null,null,null,null,null,null,5,0,0,0,5,0,5]
["TN703",null,null,null,null,null,null,null,null,null,null,null,null,null,null,null,null,null,null,null,null,25,0,0,0,25,0,25]
["0001",null,null,null,null,null,null,null,null,null,null,null,null,null,null,null,null,null,null,null,null,40,0,0,0,40,0,40]
["0031",null,null,null,null,null,null,null,null,null,null,null,null,null,null,null,null,null,null,null,null,4,0,0,0,4,0,4]
["RVN010/012",null,null,null,null,null,null,null,null,null,null,null,null,null,null,null,null,null,null,null,null,240,40,0,0,240,40,200]
["0003-TUB",null,null,null,null,null,null,null,null,null,null,null,null,null,null,null,null,null,null,null,null,20,0,0,0,20,0,20]
["BGA-SILIC",null,null,null,null,null,null,null,null,null,null,null,null,null,null,null,null,null,null,null,null,24,14,0,0,24,14,10]
["0037",null,null,null,null,null,null,null,null,null,null,null,null,null,null,null,null,null,null,null,null,10,0,0,0,10,0,10]
["27148IS",null,null,null,null,null,null,null,null,null,null,null,null,null,null,null,null,null,null,null,null,5,0,0,0,5,0,5]
["0012",null,null,null,null,null,null,null,null,null,null,null,null,null,null,null,null,null,null,null,null,10,0,0,0,10,0,10]
["0057",null,null,null,null,null,null,null,null,null,null,null,null,null,null,null,null,null,null,null,null,10,0,0,0,10,0,10]
["0030",null,null,null,null,null,null,null,null,null,null,null,null,null,null,null,null,null,null,null,null,6,0,0,0,6,0,6]
["A1319004",null,null,null,null,null,null,null,null,null,null,null,null,null,null,null,null,null,null,null,null,10,0,0,0,10,0,10]
["IM3067",null,null,null,null,null,null,null,null,null,null,null,null,null,null,null,null,null,null,null,null,3,0,0,0,3,0,3]
["IM3136",null,null,null,null,null,null,null,null,null,null,null,null,null,null,null,null,null,null,null,null,4,1,0,0,4,1,3]
["MYH407",null,null,null,null,null,null,null,null,null,null,null,null,null,null,null,null,null,null,null,null,3,0,0,0,3,0,3]
["IM3079Y",null,null,null,null,null,null,null,null,null,null,null,null,null,null,null,null,null,null,null,null,3,0,0,0,3,0,3]
["S/3013",null,null,null,null,null,null,null,null,null,null,null,null,null,null,null,null,null,null,null,null,2,0,0,0,2,0,2]
[150814,null,null,null,null,null,null,null,null,null,null,null,null,null,null,null,null,null,null,null,null,2,0,0,0,2,0,2]
[139610,null,null,null,null,null,null,null,null,null,null,null,null,null,null,null,null,null,null,null,null,3,0,0,0,3,0,3]
[137077,null,null,null,null,null,null,null,null,null,null,null,null,null,null,null,null,null,null,null,null,2,0,0,0,2,0,2]
[137076,null,null,null,null,null,null,null,null,null,null,null,null,null,null,null,null,null,null,null,null,2,0,0,0,2,0,2]
["HHR604",null,null,null,null,null,null,null,null,null,null,null,null,null,null,null,null,null,null,null,null,4,0,0,0,4,0,4]
["HI10004-1ZT",null,null,null,null,null,null,null,null,null,null,null,null,null,null,null,null,null,null,null,null,2,0,0,0,2,0,2]
["ZZ2009-09",null,null,null,null,null,null,null,null,null,null,null,null,null,null,null,null,null,null,null,null,4,0,0,0,4,0,4]
[133749,null,null,null,null,null,null,null,null,null,null,null,null,null,null,null,null,null,null,null,null,5,2,0,0,5,2,3]
[137075,null,null,null,null,null,null,null,null,null,null,null,null,null,null,null,null,null,null,null,null,4,0,0,0,4,0,4]
[510200,null,null,null,null,null,null,null,null,null,null,null,null,null,null,null,null,null,null,null,null,6,1,0,0,6,1,5]
[510000,null,null,null,null,null,null,null,null,null,null,null,null,null,null,null,null,null,null,null,null,2,2,0,0,2,2,0]
[520300,null,null,null,null,null,null,null,null,null,null,null,null,null,null,null,null,null,null,null,null,5,0,0,0,5,0,5]
[520400,null,null,null,null,null,null,null,null,null,null,null,null,null,null,null,null,null,null,null,null,3,0,0,0,3,0,3]
[520600,null,null,null,null,null,null,null,null,null,null,null,null,null,null,null,null,null,null,null,null,2,0,0,0,2,0,2]
[521400,null,null,null,null,null,null,null,null,null,null,null,null,null,null,null,null,null,null,null,null,2,0,0,0,2,0,2]
[521600,null,null,null,null,null,null,null,null,null,null,null,null,null,null,null,null,null,null,null,null,2,0,0,0,2,0,2]
["NOA-2215",null,null,null,null,null,null,null,null,null,null,null,null,null,null,null,null,null,null,null,null,25,0,0,0,25,0,25]
["DEPQ5",null,null,null,null,null,null,null,null,null,null,null,null,null,null,null,null,null,null,null,null,50,0,0,0,50,0,50]
["A1319002",null,null,null,null,null,null,null,null,null,null,null,null,null,null,null,null,null,null,null,null,40,0,0,0,40,0,40]
["A1319001",null,null,null,null,null,null,null,null,null,null,null,null,null,null,null,null,null,null,null,null,40,0,0,0,40,0,40]
[182501,null,null,null,null,null,null,null,null,null,null,null,null,null,null,null,null,null,null,null,null,5,0,0,0,5,0,5]
[182502,null,null,null,null,null,null,null,null,null,null,null,null,null,null,null,null,null,null,null,null,5,0,0,0,5,0,5]
[182503,null,null,null,null,null,null,null,null,null,null,null,null,null,null,null,null,null,null,null,null,6,1,0,2,6,3,3]
[182504,null,null,null,null,null,null,null,null,null,null,null,null,null,null,null,null,null,null,null,null,5,0,0,0,5,0,5]
[182505,null,null,null,null,null,null,null,null,null,null,null,null,null,null,null,null,null,null,null,null,5,0,0,2,5,2,3]
[182506,null,null,null,null,null,null,null,null,null,null,null,null,null,null,null,null,null,null,null,null,10,0,0,0,10,0,10]
[182507,null,null,null,null,null,null,null,null,null,null,null,null,null,null,null,null,null,null,null,null,5,0,0,0,5,0,5]
[182508,null,null,null,null,null,null,null,null,null,null,null,null,null,null,null,null,null,null,null,null,5,0,0,0,5,0,5]
[182510,null,null,null,null,null,null,null,null,null,null,null,null,null,null,null,null,null,null,null,null,5,0,0,0,5,0,5]
[182511,null,null,null,null,null,null,null,null,null,null,null,null,null,null,null,null,null,null,null,null,5,0,0,0,5,0,5]
[182512,null,null,null,null,null,null,null,null,null,null,null,null,null,null,null,null,null,null,null,null,5,0,0,0,5,0,5]
[182513,null,null,null,null,null,null,null,null,null,null,null,null,null,null,null,null,null,null,null,null,5,0,0,3,5,3,2]
[182514,null,null,null,null,null,null,null,null,null,null,null,null,null,null,null,null,null,null,null,null,5,0,0,0,5,0,5]
[182515,null,null,null,null,null,null,null,null,null,null,null,null,null,null,null,null,null,null,null,null,8,3,0,0,8,3,5]
[182516,null,null,null,null,null,null,null,null,null,null,null,null,null,null,null,null,null,null,null,null,5,5,0,0,5,5,0]
[182517,null,null,null,null,null,null,null,null,null,null,null,null,null,null,null,null,null,null,null,null,7,5,0,0,7,5,2]
[182518,null,null,null,null,null,null,null,null,null,null,null,null,null,null,null,null,null,null,null,null,5,5,0,0,5,5,0]
[182519,null,null,null,null,null,null,null,null,null,null,null,null,null,null,null,null,null,null,null,null,5,5,0,0,5,5,0]
[182520,null,null,null,null,null,null,null,null,null,null,null,null,null,null,null,null,null,null,null,null,5,0,0,0,5,0,5]
[182521,null,null,null,null,null,null,null,null,null,null,null,null,null,null,null,null,null,null,null,null,5,5,0,0,5,5,0]
["A0120109",null,null,null,null,null,null,null,null,null,null,null,null,null,null,null,null,null,null,null,null,2,0,0,0,2,0,2]
["A0120102",null,null,null,null,null,null,null,null,null,null,null,null,null,null,null,null,null,null,null,null,1,0,0,0,1,0,1]
["A0120108",null,null,null,null,null,null,null,null,null,null,null,null,null,null,null,null,null,null,null,null,2,0,0,0,{"$f":"IF(A261=\"\",\"\",SUM(B261,D261,F261,H261,J261,L261,N261,P261,R261,T261,V261,X261))","v":2},{"$f":"IF(A261=\"\",\"\",SUM(C261,E261,G261,I261,K261,M261,O261,Q261,S261,U261,W261,Y261))","v":0},{"$f":"IF(A261=\"\",\"\",Z261-AA261)","v":2}]
["A0120100NM",null,null,null,null,null,null,null,null,null,null,null,null,null,null,null,null,null,null,null,null,2,0,0,0,2,0,2]
["A0120101N",null,null,null,null,null,null,null,null,null,null,null,null,null,null,null,null,null,null,null,null,2,0,0,0,2,0,2]
["A0120110",null,null,null,null,null,null,null,null,null,null,null,null,null,null,null,null,null,null,null,null,2,0,0,0,2,0,2]
["A0120112",null,null,null,null,null,null,null,null,null,null,null,null,null,null,null,null,null,null,null,null,2,0,0,0,2,0,2]
["ISZ-09/10",null,null,null,null,null,null,null,null,null,null,null,null,null,null,null,null,null,null,null,null,1,0,0,0,1,0,1]
["SO150304-003",null,null,null,null,null,null,null,null,null,null,null,null,null,null,null,null,null,null,null,null,1,0,0,0,1,0,1]
["0-124",null,null,null,null,null,null,null,null,null,null,null,null,null,null,null,null,null,null,null,null,1,0,0,0,1,0,1]
["05-3421",null,null,null,null,null,null,null,null,null,null,null,null,null,null,null,null,null,null,null,null,1,0,0,0,1,0,1]
["TW1622A-025",null,null,null,null,null,null,null,null,null,null,null,null,null,null,null,null,null,null,null,null,2,0,0,0,2,0,2]
["SH-1622A-STD",null,null,null,null,null,null,null,null,null,null,null,null,null,null,null,null,null,null,null,null,2,0,0,0,2,0,2]
["CB1070GP050",null,null,null,null,null,null,null,null,null,null,null,null,null,null,null,null,null,null,null,null,2,0,0,0,2,0,2]
["CB1070A-025",null,null,null,null,null,null,null,null,null,null,null,null,null,null,null,null,null,null,null,null,2,0,0,0,2,0,2]
["MS1622A-STD",null,null,null,null,null,null,null,null,null,null,null,null,null,null,null,null,null,null,null,null,2,0,0,0,2,0,2]
["MS1622GP025",null,null,null,null,null,null,null,null,null,null,null,null,null,null,null,null,null,null,null,null,2,0,0,0,2,0,2]
["CB1131A-075",null,null,null,null,null,null,null,null,null,null,null,null,null,null,null,null,null,null,null,null,2,0,0,0,2,0,2]
["CB1131A-STD",null,null,null,null,null,null,null,null,null,null,null,null,null,null,null,null,null,null,null,null,4,2,0,0,4,2,2]
["CB1131A-025",null,null,null,null,null,null,null,null,null,null,null,null,null,null,null,null,null,null,null,null,2,0,0,0,2,0,2]
["MS1131A-025",null,null,null,null,null,null,null,null,null,null,null,null,null,null,null,null,null,null,null,null,2,0,0,0,2,0,2]
["MS1131A-050",null,null,null,null,null,null,null,null,null,null,null,null,null,null,null,null,null,null,null,null,3,0,0,0,3,0,3]
["MS1131A-STD",null,null,null,null,null,null,null,null,null,null,null,null,null,null,null,null,null,null,null,null,2,0,0,0,2,0,2]
["CB2016A-STD",null,null,null,null,null,null,null,null,null,null,null,null,null,null,null,null,null,null,null,null,2,0,0,0,2,0,2]
["SH1605BSTD",null,null,null,null,null,null,null,null,null,null,null,null,null,null,null,null,null,null,null,null,2,0,0,0,2,0,2]
["MS1138GPSTD",null,null,null,null,null,null,null,null,null,null,null,null,null,null,null,null,null,null,null,null,2,0,0,0,2,0,2]
["MS1138GP025",null,null,null,null,null,null,null,null,null,null,null,null,null,null,null,null,null,null,null,null,2,0,0,0,2,0,2]
["MS1138GP075",null,null,null,null,null,null,null,null,null,null,null,null,null,null,null,null,null,null,null,null,2,0,0,0,2,0,2]
["MS1138GP050",null,null,null,null,null,null,null,null,null,null,null,null,null,null,null,null,null,null,null,null,2,1,0,0,2,1,1]
["PB1622J-STD",null,null,null,null,null,null,null,null,null,null,null,null,null,null,null,null,null,null,null,null,3,0,0,0,3,0,3]
["PB-1802-JSF",null,null,null,null,null,null,null,null,null,null,null,null,null,null,null,null,null,null,null,null,3,0,0,0,3,0,3]
["PB1605J-STD",null,null,null,null,null,null,null,null,null,null,null,null,null,null,null,null,null,null,null,null,3,0,0,0,3,0,3]
["WL11-10-100E",null,null,null,null,null,null,null,null,null,null,null,null,null,null,null,null,null,null,null,null,1,0,0,0,1,0,1]
["MD348983",null,null,null,null,null,null,null,null,null,null,null,null,null,null,null,null,null,null,null,null,1,0,0,0,1,0,1]
["AHI2006",null,null,null,null,null,null,null,null,null,null,null,null,null,null,null,null,null,null,null,null,0,0,0,0,0,0,0]
["M002T87271ZT",null,null,null,null,null,null,null,null,null,null,null,null,null,null,null,null,null,null,null,null,1,1,0,0,1,1,0]
[20894133275,null,null,null,null,null,null,null,null,null,null,null,null,null,null,null,null,null,null,null,null,3,0,0,0,3,0,3]
[20894247875,null,null,null,null,null,null,null,null,null,null,null,null,null,null,null,null,null,null,null,null,3,0,0,0,3,0,3]
["LPR4172",null,null,null,null,null,null,null,null,null,null,null,null,null,null,null,null,null,null,null,null,18,6,0,0,18,6,12]
["MD050196",null,null,null,null,null,null,null,null,null,null,null,null,null,null,null,null,null,null,null,null,6,0,0,0,6,0,6]
["8-94165177",null,null,null,null,null,null,null,null,null,null,null,null,null,null,null,null,null,null,null,null,10,2,0,0,10,2,8]
["8-94113-583-0",null,null,null,null,null,null,null,null,null,null,null,null,null,null,null,null,null,null,null,null,12,5,0,0,12,5,7]
[73012,null,null,null,null,null,null,null,null,null,null,null,null,null,null,null,null,null,null,null,null,6,0,0,0,6,0,6]
[73010,null,null,null,null,null,null,null,null,null,null,null,null,null,null,null,null,null,null,null,null,3,0,0,0,3,0,3]
["2201A01",null,null,null,null,null,null,null,null,null,null,null,null,null,null,null,null,null,null,null,null,200,0,0,0,200,0,200]
["2202A01",null,null,null,null,null,null,null,null,null,null,null,null,null,null,null,null,null,null,null,null,200,0,0,0,{"$f":"IF(A304=\"\",\"\",SUM(B304,D304,F304,H304,J304,L304,N304,P304,R304,T304,V304,X304))","v":200},{"$f":"IF(A304=\"\",\"\",SUM(C304,E304,G304,I304,K304,M304,O304,Q304,S304,U304,W304,Y304))","v":0},{"$f":"IF(A304=\"\",\"\",Z304-AA304)","v":200}]
["JD-2001",null,null,null,null,null,null,null,null,null,null,null,null,null,null,null,null,null,null,null,null,2,0,0,0,2,0,2]
["3AL922000961",null,null,null,null,null,null,null,null,null,null,null,null,null,null,null,null,null,null,null,null,3,2,0,0,3,2,1]
["3AM922000971",null,null,null,null,null,null,null,null,null,null,null,null,null,null,null,null,null,null,null,null,6,0,0,0,6,0,6]
[43246,null,null,null,null,null,null,null,null,null,null,null,null,null,null,null,null,null,null,null,null,2,0,0,0,2,0,2]
[920382,null,null,null,null,null,null,null,null,null,null,null,null,null,null,null,null,null,null,null,null,5,0,0,0,5,0,5]
[300333,null,null,null,null,null,null,null,null,null,null,null,null,null,null,null,null,null,null,null,null,2,0,0,0,2,0,2]
[300428,null,null,null,null,null,null,null,null,null,null,null,null,null,null,null,null,null,null,null,null,9,2,0,0,9,2,7]
["114-001",null,null,null,null,null,null,null,null,null,null,null,null,null,null,null,null,null,null,null,null,6,0,0,0,6,0,6]
[3748,null,null,null,null,null,null,null,null,null,null,null,null,null,null,null,null,null,null,null,null,6,0,0,0,6,0,6]
[3778,null,null,null,null,null,null,null,null,null,null,null,null,null,null,null,null,null,null,null,null,5,0,0,0,5,0,5]
["8-94317667",null,null,null,null,null,null,null,null,null,null,null,null,null,null,null,null,null,null,null,null,5,2,0,0,5,2,3]
["8-94317668",null,null,null,null,null,null,null,null,null,null,null,null,null,null,null,null,null,null,null,null,5,2,0,0,5,2,3]
["N9YC",null,null,null,null,null,null,null,null,null,null,null,null,null,null,null,null,null,null,null,null,5,0,0,0,5,0,5]
["C9YC",null,null,null,null,null,null,null,null,null,null,null,null,null,null,null,null,null,null,null,null,50,0,0,0,{"$f":"IF(A318=\"\",\"\",SUM(B318,D318,F318,H318,J318,L318,N318,P318,R318,T318,V318,X318))","v":50},0,50]
["S9YC",null,null,null,null,null,null,null,null,null,null,null,null,null,null,null,null,null,null,null,null,50,2,0,0,50,2,48]
["L87YC",null,null,null,null,null,null,null,null,null,null,null,null,null,null,null,null,null,null,null,null,50,0,0,0,50,0,50]
["RC10DMC",null,null,null,null,null,null,null,null,null,null,null,null,null,null,null,null,null,null,null,null,50,0,0,0,50,0,50]
["RC10YCC",null,null,null,null,null,null,null,null,null,null,null,null,null,null,null,null,null,null,null,null,50,20,0,0,50,20,30]
["4565-16",null,null,null,null,null,null,null,null,null,null,null,null,null,null,null,null,null,null,null,null,30,0,0,0,30,0,30]
["U050",null,null,null,null,null,null,null,null,null,null,null,null,null,null,null,null,null,null,null,null,6,4,0,0,6,4,2]
["U728/4",null,null,null,null,null,null,null,null,null,null,null,null,null,null,null,null,null,null,null,null,5,0,0,0,{"$f":"IF(A325=\"\",\"\",SUM(B325,D325,F325,H325,J325,L325,N325,P325,R325,T325,V325,X325))","v":5},{"$f":"IF(A325=\"\",\"\",SUM(C325,E325,G325,I325,K325,M325,O325,Q325,S325,U325,W325,Y325))","v":0},{"$f":"IF(A325=\"\",\"\",Z325-AA325)","v":5}]
["U183",null,null,null,null,null,null,null,null,null,null,null,null,null,null,null,null,null,null,null,null,5,0,0,0,5,0,5]
["U100",null,null,null,null,null,null,null,null,null,null,null,null,null,null,null,null,null,null,null,null,5,5,0,0,5,5,0]
["U126",null,null,null,null,null,null,null,null,null,null,null,null,null,null,null,null,null,null,null,null,5,0,0,0,5,0,5]
["U960",null,null,null,null,null,null,null,null,null,null,null,null,null,null,null,null,null,null,null,null,5,2,0,0,5,2,3]
["U941",null,null,null,null,null,null,null,null,null,null,null,null,null,null,null,null,null,null,null,null,6,1,0,0,6,1,5]
["ITE/3-12",null,null,null,null,null,null,null,null,null,null,null,null,null,null,null,null,null,null,null,null,5,0,0,0,5,0,5]
["ITJS/3-12",null,null,null,null,null,null,null,null,null,null,null,null,null,null,null,null,null,null,null,null,10,0,0,0,10,0,10]
["ITE/3-24",null,null,null,null,null,null,null,null,null,null,null,null,null,null,null,null,null,null,null,null,10,0,0,0,10,0,10]
["RLP/5-12",null,null,null,null,null,null,null,null,null,null,null,null,null,null,null,null,null,null,null,null,10,0,0,0,10,0,10]
["RLP/5-24",null,null,null,null,null,null,null,null,null,null,null,null,null,null,null,null,null,null,null,null,10,0,0,0,10,0,10]
["MD050456",null,null,null,null,null,null,null,null,null,null,null,null,null,null,null,null,null,null,null,null,10,0,0,0,10,0,10]
["MD303981",null,null,null,null,null,null,null,null,null,null,null,null,null,null,null,null,null,null,null,null,14,4,0,0,14,4,10]
["405-16",null,null,null,null,null,null,null,null,null,null,null,null,null,null,null,null,null,null,null,null,10,0,0,0,10,0,10]
["27149FD",null,null,null,null,null,null,null,null,null,null,null,null,null,null,null,null,null,null,null,null,30,0,0,0,30,0,30]
[2755,null,null,null,null,null,null,null,null,null,null,null,null,null,null,null,null,null,null,null,null,50,0,0,0,50,0,50]
[75801,null,null,null,null,null,null,null,null,null,null,null,null,null,null,null,null,null,null,null,null,30,0,0,0,30,0,30]
["TS-118",null,null,null,null,null,null,null,null,null,null,null,null,null,null,null,null,null,null,null,null,10,0,0,0,10,0,10]
["M8360",null,null,null,null,null,null,null,null,null,null,null,null,null,null,null,null,null,null,null,null,15,0,0,0,15,0,15]
["MG02-16004",null,null,null,null,null,null,null,null,null,null,null,null,null,null,null,null,null,null,null,null,20,0,0,0,20,0,20]
["D4267",null,null,null,null,null,null,null,null,null,null,null,null,null,null,null,null,null,null,null,null,35,5,0,0,35,5,30]
["D4210",null,null,null,null,null,null,null,null,null,null,null,null,null,null,null,null,null,null,null,null,30,0,0,0,30,0,30]
["D4209",null,null,null,null,null,null,null,null,null,null,null,null,null,null,null,null,null,null,null,null,4,0,0,0,4,0,4]
["D4805",null,null,null,null,null,null,null,null,null,null,null,null,null,null,null,null,null,null,null,null,10,0,0,0,10,0,10]
["D3062C",null,null,null,null,null,null,null,null,null,null,null,null,null,null,null,null,null,null,null,null,10,0,0,0,10,0,10]
["D1041C",null,null,null,null,null,null,null,null,null,null,null,null,null,null,null,null,null,null,null,null,50,0,0,0,50,0,50]
["D1202C",null,null,null,null,null,null,null,null,null,null,null,null,null,null,null,null,null,null,null,null,50,0,0,0,50,0,50]
["D3116",null,null,null,null,null,null,null,null,null,null,null,null,null,null,null,null,null,null,null,null,30,0,0,0,30,0,30]
["D1224C",null,null,null,null,null,null,null,null,null,null,null,null,null,null,null,null,null,null,null,null,20,0,0,0,20,0,20]
["12649/10",null,null,null,null,null,null,null,null,null,null,null,null,null,null,null,null,null,null,null,null,13,2,0,0,13,2,11]
["48548/10",null,null,null,null,null,null,null,null,null,null,null,null,null,null,null,null,null,null,null,null,11,2,0,0,11,2,9]
["BT19Z-2",null,null,null,null,null,null,null,null,null,null,null,null,null,null,null,null,null,null,null,null,9,3,0,0,9,3,6]
["48TKB3204R",null,null,null,null,null,null,null,null,null,null,null,null,null,null,null,null,null,null,null,null,4,0,0,0,4,0,4]
["32008XJ",null,null,null,null,null,null,null,null,null,null,null,null,null,null,null,null,null,null,null,null,3,0,0,0,3,0,3]
["32009XJ-A",null,null,null,null,null,null,null,null,null,null,null,null,null,null,null,null,null,null,null,null,4,0,0,0,4,0,4]
[30208,null,null,null,null,null,null,null,null,null,null,null,null,null,null,null,null,null,null,null,null,4,0,0,0,4,0,4]
["30208A",null,null,null,null,null,null,null,null,null,null,null,null,null,null,null,null,null,null,null,null,13,0,0,0,13,0,13]
[30208,null,null,null,null,null,null,null,null,null,null,null,null,null,null,null,null,null,null,null,null,5,0,0,0,5,0,5]
["BD25-9T12",null,null,null,null,null,null,null,null,null,null,null,null,null,null,null,null,null,null,null,null,15,2,0,0,15,2,13]
["TM206C3^^UR",null,null,null,null,null,null,null,null,null,null,null,null,null,null,null,null,null,null,null,null,8,2,0,0,8,2,6]
["6904ZZ",null,null,null,null,null,null,null,null,null,null,null,null,null,null,null,null,null,null,null,null,5,0,0,0,5,0,5]
["6203VVC4",null,null,null,null,null,null,null,null,null,null,null,null,null,null,null,null,null,null,null,null,5,0,0,0,5,0,5]
["B20-122C3^^UR7",null,null,null,null,null,null,null,null,null,null,null,null,null,null,null,null,null,null,null,null,6,2,0,0,6,2,4]
["63/32/NC3",null,null,null,null,null,null,null,null,null,null,null,null,null,null,null,null,null,null,null,null,5,0,0,0,5,0,5]
["30306J",null,null,null,null,null,null,null,null,null,null,null,null,null,null,null,null,null,null,null,null,4,0,0,0,4,0,4]
["HR32307CN^0A",null,null,null,null,null,null,null,null,null,null,null,null,null,null,null,null,null,null,null,null,4,0,0,0,4,0,4]
["6360-18",null,null,null,null,null,null,null,null,null,null,null,null,null,null,null,null,null,null,null,null,2,0,0,0,2,0,2]
["27RD01161",null,null,null,null,null,null,null,null,null,null,null,null,null,null,null,null,null,null,null,null,15,0,0,0,15,0,15]
["27HU2028",null,null,null,null,null,null,null,null,null,null,null,null,null,null,null,null,null,null,null,null,50,0,0,0,50,0,50]
["LS-065",null,null,null,null,null,null,null,null,null,null,null,null,null,null,null,null,null,null,null,null,30,0,0,0,30,0,30]
["AN301",null,null,null,null,null,null,null,null,null,null,null,null,null,null,null,null,null,null,null,null,20,0,0,0,20,0,20]
["AN310",null,null,null,null,null,null,null,null,null,null,null,null,null,null,null,null,null,null,null,null,5,0,0,0,5,0,5]
["2924-AN",null,null,null,null,null,null,null,null,null,null,null,null,null,null,null,null,null,null,null,null,5,0,0,0,5,0,5]
["HS111002",null,null,null,null,null,null,null,null,null,null,null,null,null,null,null,null,null,null,null,null,5,0,0,0,5,0,5]
["HS274001",null,null,null,null,null,null,null,null,null,null,null,null,null,null,null,null,null,null,null,null,6,0,0,0,6,0,6]
["8-97139-142-0",null,null,null,null,null,null,null,null,null,null,null,null,null,null,null,null,null,null,null,null,6,0,0,0,6,0,6]
["8-94128143",null,null,null,null,null,null,null,null,null,null,null,null,null,null,null,null,null,null,null,null,4,0,0,0,4,0,4]
["8-94128141",null,null,null,null,null,null,null,null,null,null,null,null,null,null,null,null,null,null,null,null,4,0,0,0,4,0,4]
["8-97179-357-0",null,null,null,null,null,null,null,null,null,null,null,null,null,null,null,null,null,null,null,null,4,0,0,1,4,1,3]
["8-97179-358-0",null,null,null,null,null,null,null,null,null,null,null,null,null,null,null,null,null,null,null,null,8,0,0,0,8,0,8]
["8-97179-359-0",null,null,null,null,null,null,null,null,null,null,null,null,null,null,null,null,null,null,null,null,4,0,0,0,4,0,4]
["8-97179-360-0",null,null,null,null,null,null,null,null,null,null,null,null,null,null,null,null,null,null,null,null,4,0,0,0,4,0,4]
["8-97167406",null,null,null,null,null,null,null,null,null,null,null,null,null,null,null,null,null,null,null,null,4,0,0,0,4,0,4]
["8-97167406-353",null,null,null,null,null,null,null,null,null,null,null,null,null,null,null,null,null,null,null,null,2,0,0,0,2,0,2]
["8-97062294",null,null,null,null,null,null,null,null,null,null,null,null,null,null,null,null,null,null,null,null,2,0,0,0,{"$f":"IF(A389=\"\",\"\",SUM(B389,D389,F389,H389,J389,L389,N389,P389,R389,T389,V389,X389))","v":2},{"$f":"IF(A389=\"\",\"\",SUM(C389,E389,G389,I389,K389,M389,O389,Q389,S389,U389,W389,Y389))","v":0},{"$f":"IF(A389=\"\",\"\",Z389-AA389)","v":2}]
["ISU045L",null,null,null,null,null,null,null,null,null,null,null,null,null,null,null,null,null,null,null,null,4,2,0,0,4,2,2]
["ISU045R",null,null,null,null,null,null,null,null,null,null,null,null,null,null,null,null,null,null,null,null,1,0,0,0,1,0,1]
["8-94316-196-0",null,null,null,null,null,null,null,null,null,null,null,null,null,null,null,null,null,null,null,null,1,0,0,0,1,0,1]
["IZ153-04G",null,null,null,null,null,null,null,null,null,null,null,null,null,null,null,null,null,null,null,null,2,0,0,0,2,0,2]
["IZ153-04H",null,null,null,null,null,null,null,null,null,null,null,null,null,null,null,null,null,null,null,null,2,0,0,0,2,0,2]
["IZ153-18E",null,null,null,null,null,null,null,null,null,null,null,null,null,null,null,null,null,null,null,null,2,0,0,0,2,0,2]
["ZNP18346",null,null,null,null,null,null,null,null,null,null,null,null,null,null,null,null,null,null,null,null,3,0,0,0,3,0,3]
["9-97107-348",null,null,null,null,null,null,null,null,null,null,null,null,null,null,null,null,null,null,null,null,2,0,0,0,2,0,2]
["8-97033-864-0",null,null,null,null,null,null,null,null,null,null,null,null,null,null,null,null,null,null,null,null,4,0,0,0,4,0,4]
["8-97219-509-2",null,null,null,null,null,null,null,null,null,null,null,null,null,null,null,null,null,null,null,null,8,0,0,0,8,0,8]
["IZ151-33B",null,null,null,null,null,null,null,null,null,null,null,null,null,null,null,null,null,null,null,null,8,0,0,0,8,0,8]
["AK4101",null,null,null,null,null,null,null,null,null,null,null,null,null,null,null,null,null,null,null,null,2,0,0,0,2,0,2]
["AK4100",null,null,null,null,null,null,null,null,null,null,null,null,null,null,null,null,null,null,null,null,5,0,0,0,5,0,5]
["AK6012",null,null,null,null,null,null,null,null,null,null,null,null,null,null,null,null,null,null,null,null,5,0,0,0,5,0,5]
["MG04-01077",null,null,null,null,null,null,null,null,null,null,null,null,null,null,null,null,null,null,null,null,4,0,0,0,4,0,4]
["5-11721-016-0",null,null,null,null,null,null,null,null,null,null,null,null,null,null,null,null,null,null,null,null,5,0,0,0,5,0,5]
["8-94136-672",null,null,null,null,null,null,null,null,null,null,null,null,null,null,null,null,null,null,null,null,64,0,0,0,64,0,64]
["5-47519-053",null,null,null,null,null,null,null,null,null,null,null,null,null,null,null,null,null,null,null,null,6,1,0,0,6,1,5]
["8-94231-459",null,null,null,null,null,null,null,null,null,null,null,null,null,null,null,null,null,null,null,null,5,0,0,0,5,0,5]
["TY319-31A",null,null,null,null,null,null,null,null,null,null,null,null,null,null,null,null,null,null,null,null,5,0,0,0,5,0,5]
["TY319-31B",null,null,null,null,null,null,null,null,null,null,null,null,null,null,null,null,null,null,null,null,4,0,0,0,4,0,4]
["TY319-31G",null,null,null,null,null,null,null,null,null,null,null,null,null,null,null,null,null,null,null,null,4,0,0,0,4,0,4]
["47550-30100",null,null,null,null,null,null,null,null,null,null,null,null,null,null,null,null,null,null,null,null,4,0,0,0,4,0,4]
["MD343565",null,null,null,null,null,null,null,null,null,null,null,null,null,null,null,null,null,null,null,null,6,0,0,0,6,0,6]
["MD343566",null,null,null,null,null,null,null,null,null,null,null,null,null,null,null,null,null,null,null,null,20,0,0,0,20,0,20]
["MB092437",null,null,null,null,null,null,null,null,null,null,null,null,null,null,null,null,null,null,null,null,25,5,0,0,25,5,20]
["MB837719",null,null,null,null,null,null,null,null,null,null,null,null,null,null,null,null,null,null,null,null,20,0,0,0,20,0,20]
["MD099211",null,null,null,null,null,null,null,null,null,null,null,null,null,null,null,null,null,null,null,null,20,0,0,0,20,0,20]
["TY180-31A",null,null,null,null,null,null,null,null,null,null,null,null,null,null,null,null,null,null,null,null,10,0,0,0,10,0,10]
["TY180-31B",null,null,null,null,null,null,null,null,null,null,null,null,null,null,null,null,null,null,null,null,2,0,0,0,2,0,2]
["8-94161-141",null,null,null,null,null,null,null,null,null,null,null,null,null,null,null,null,null,null,null,null,2,0,0,0,2,0,2]
["WLA2-16-460F",null,null,null,null,null,null,null,null,null,null,null,null,null,null,null,null,null,null,null,null,3,1,0,0,3,1,2]
["WL0110155",null,null,null,null,null,null,null,null,null,null,null,null,null,null,null,null,null,null,null,null,4,0,0,0,4,0,4]
["UG52-43-400",null,null,null,null,null,null,null,null,null,null,null,null,null,null,null,null,null,null,null,null,21,1,0,0,21,1,20]
["MB285-31A",null,null,null,null,null,null,null,null,null,null,null,null,null,null,null,null,null,null,null,null,2,0,0,0,2,0,2]
["MB285-31B",null,null,null,null,null,null,null,null,null,null,null,null,null,null,null,null,null,null,null,null,5,0,0,0,5,0,5]
["MB285-31C",null,null,null,null,null,null,null,null,null,null,null,null,null,null,null,null,null,null,null,null,5,0,0,0,5,0,5]
["MB285-31D",null,null,null,null,null,null,null,null,null,null,null,null,null,null,null,null,null,null,null,null,4,0,0,0,4,0,4]
["9A0812A14",null,null,null,null,null,null,null,null,null,null,null,null,null,null,null,null,null,null,null,null,2,0,0,0,2,0,2]
["5TB-A0320",null,null,null,null,null,null,null,null,null,null,null,null,null,null,null,null,null,null,null,null,2,0,0,0,2,0,2]
["MB176309",null,null,null,null,null,null,null,null,null,null,null,null,null,null,null,null,null,null,null,null,2,0,0,0,2,0,2]
["MB286-32B",null,null,null,null,null,null,null,null,null,null,null,null,null,null,null,null,null,null,null,null,10,0,0,0,10,0,10]
["MB555192",null,null,null,null,null,null,null,null,null,null,null,null,null,null,null,null,null,null,null,null,6,2,0,0,6,2,4]
["5ELS-A110-S",null,null,null,null,null,null,null,null,null,null,null,null,null,null,null,null,null,null,null,null,2,0,0,0,2,0,2]
["DS144-22A",null,null,null,null,null,null,null,null,null,null,null,null,null,null,null,null,null,null,null,null,4,0,0,0,4,0,4]
["DS144-22B",null,null,null,null,null,null,null,null,null,null,null,null,null,null,null,null,null,null,null,null,2,0,0,0,2,0,2]
["DS144-32D",null,null,null,null,null,null,null,null,null,null,null,null,null,null,null,null,null,null,null,null,2,0,0,0,2,0,2]
["MR992374",null,null,null,null,null,null,null,null,null,null,null,null,null,null,null,null,null,null,null,null,2,0,0,0,2,0,2]
["8-94217784",null,null,null,null,null,null,null,null,null,null,null,null,null,null,null,null,null,null,null,null,2,0,0,0,2,0,2]
["8-94217785",null,null,null,null,null,null,null,null,null,null,null,null,null,null,null,null,null,null,null,null,20,0,0,0,20,0,20]
["8-94222-974",null,null,null,null,null,null,null,null,null,null,null,null,null,null,null,null,null,null,null,null,20,0,0,0,20,0,20]
["8-94434-974-1",null,null,null,null,null,null,null,null,null,null,null,null,null,null,null,null,null,null,null,null,12,5,0,0,12,5,7]
["8-94434-973-1",null,null,null,null,null,null,null,null,null,null,null,null,null,null,null,null,null,null,null,null,10,0,0,0,10,0,10]
["IS-1132-BM-LH",null,null,null,null,null,null,null,null,null,null,null,null,null,null,null,null,null,null,null,null,10,0,0,0,10,0,10]
["IS-1132-BM-RH",null,null,null,null,null,null,null,null,null,null,null,null,null,null,null,null,null,null,null,null,2,0,0,0,2,0,2]
["IS11-1001-2-353 L",null,null,null,null,null,null,null,null,null,null,null,null,null,null,null,null,null,null,null,null,3,1,0,0,3,1,2]
["IS11-1001-2-353 R",null,null,null,null,null,null,null,null,null,null,null,null,null,null,null,null,null,null,null,null,2,0,0,1,2,1,1]
["ISU223L",null,null,null,null,null,null,null,null,null,null,null,null,null,null,null,null,null,null,null,null,4,3,0,0,4,3,1]
["ISU223R",null,null,null,null,null,null,null,null,null,null,null,null,null,null,null,null,null,null,null,null,7,3,0,0,7,3,4]
["IS10-1002-353 L",null,null,null,null,null,null,null,null,null,null,null,null,null,null,null,null,null,null,null,null,5,0,0,0,5,0,5]
["IS10-1002-353 R",null,null,null,null,null,null,null,null,null,null,null,null,null,null,null,null,null,null,null,null,5,0,0,0,5,0,5]
["ISU301L",null,null,null,null,null,null,null,null,null,null,null,null,null,null,null,null,null,null,null,null,5,0,0,0,5,0,5]
["ISU301R",null,null,null,null,null,null,null,null,null,null,null,null,null,null,null,null,null,null,null,null,5,0,0,0,5,0,5]
["8-94335625",null,null,null,null,null,null,null,null,null,null,null,null,null,null,null,null,null,null,null,null,9,4,0,0,{"$f":"IF(A453=\"\",\"\",SUM(B453,D453,F453,H453,J453,L453,N453,P453,R453,T453,V453,X453))","v":9},{"$f":"IF(A453=\"\",\"\",SUM(C453,E453,G453,I453,K453,M453,O453,Q453,S453,U453,W453,Y453))","v":4},{"$f":"IF(A453=\"\",\"\",Z453-AA453)","v":5}]
["HD08-61002-1",null,null,null,null,null,null,null,null,null,null,null,null,null,null,null,null,null,null,null,null,10,0,0,0,10,0,10]
["IS-5903",null,null,null,null,null,null,null,null,null,null,null,null,null,null,null,null,null,null,null,null,4,0,0,0,4,0,4]
["CLE-16MM",null,null,null,null,null,null,null,null,null,null,null,null,null,null,null,null,null,null,null,null,7,3,0,0,7,3,4]
["CLE-21MM",null,null,null,null,null,null,null,null,null,null,null,null,null,null,null,null,null,null,null,null,23,3,0,0,23,3,20]
["04495-0K120",null,null,null,null,null,null,null,null,null,null,null,null,null,null,null,null,null,null,null,null,20,0,0,0,20,0,20]
["04495-35180",null,null,null,null,null,null,null,null,null,null,null,null,null,null,null,null,null,null,null,null,2,0,0,0,2,0,2]
["16210-54180",null,null,null,null,null,null,null,null,null,null,null,null,null,null,null,null,null,null,null,null,2,0,0,0,2,0,2]
["16210-54210",null,null,null,null,null,null,null,null,null,null,null,null,null,null,null,null,null,null,null,null,2,0,0,0,2,0,2]
["4600A106",null,null,null,null,null,null,null,null,null,null,null,null,null,null,null,null,null,null,null,null,2,0,0,0,2,0,2]
["FT06-0106A",null,null,null,null,null,null,null,null,null,null,null,null,null,null,null,null,null,null,null,null,2,0,0,0,2,0,2]
["FT06-0106B",null,null,null,null,null,null,null,null,null,null,null,null,null,null,null,null,null,null,null,null,2,0,0,0,2,0,2]
["MG06-01021",null,null,null,null,null,null,null,null,null,null,null,null,null,null,null,null,null,null,null,null,2,0,0,0,2,0,2]
["IZ009001-A",null,null,null,null,null,null,null,null,null,null,null,null,null,null,null,null,null,null,null,null,40,0,0,0,40,0,40]
["IZ009001-B",null,null,null,null,null,null,null,null,null,null,null,null,null,null,null,null,null,null,null,null,2,0,0,0,2,0,2]
["RD23008",null,null,null,null,null,null,null,null,null,null,null,null,null,null,null,null,null,null,null,null,10,4,0,0,10,4,6]
[27210,null,null,null,null,null,null,null,null,null,null,null,null,null,null,null,null,null,null,null,null,10,0,0,0,10,0,10]
["8-94237-366-1",null,null,null,null,null,null,null,null,null,null,null,null,null,null,null,null,null,null,null,null,5,0,0,0,5,0,5]
["8-97368-263",null,null,null,null,null,null,null,null,null,null,null,null,null,null,null,null,null,null,null,null,3,2,0,0,3,2,1]
["TY315-31A",null,null,null,null,null,null,null,null,null,null,null,null,null,null,null,null,null,null,null,null,4,0,0,0,4,0,4]
["TY315-31B",null,null,null,null,null,null,null,null,null,null,null,null,null,null,null,null,null,null,null,null,2,0,0,0,2,0,2]
["TY315-31C",null,null,null,null,null,null,null,null,null,null,null,null,null,null,null,null,null,null,null,null,2,0,0,0,2,0,2]
["TY315-32A",null,null,null,null,null,null,null,null,null,null,null,null,null,null,null,null,null,null,null,null,2,0,0,0,2,0,2]
["TY313-33A",null,null,null,null,null,null,null,null,null,null,null,null,null,null,null,null,null,null,null,null,2,0,0,0,2,0,2]
["TY313-33B",null,null,null,null,null,null,null,null,null,null,null,null,null,null,null,null,null,null,null,null,2,0,0,0,2,0,2]
["TY074-20C",null,null,null,null,null,null,null,null,null,null,null,null,null,null,null,null,null,null,null,null,2,0,0,0,2,0,2]
["TY074-20D",null,null,null,null,null,null,null,null,null,null,null,null,null,null,null,null,null,null,null,null,1,0,0,0,1,0,1]
[90431363,null,null,null,null,null,null,null,null,null,null,null,null,null,null,null,null,null,null,null,null,1,0,0,0,1,0,1]
[90431364,null,null,null,null,null,null,null,null,null,null,null,null,null,null,null,null,null,null,null,null,5,0,0,0,5,0,5]
["897942-296",null,null,null,null,null,null,null,null,null,null,null,null,null,null,null,null,null,null,null,null,5,0,0,0,5,0,5]
["HD03-7001-B-LH",null,null,null,null,null,null,null,null,null,null,null,null,null,null,null,null,null,null,null,null,2,0,0,0,2,0,2]
["HD03-7001-B-RH",null,null,null,null,null,null,null,null,null,null,null,null,null,null,null,null,null,null,null,null,1,0,0,0,1,0,1]
["MZ180-20C",null,null,null,null,null,null,null,null,null,null,null,null,null,null,null,null,null,null,null,null,1,0,0,0,1,0,1]
["MZ180-20D",null,null,null,null,null,null,null,null,null,null,null,null,null,null,null,null,null,null,null,null,1,0,0,0,1,0,1]
["MZ180-25C",null,null,null,null,null,null,null,null,null,null,null,null,null,null,null,null,null,null,null,null,1,0,0,0,1,0,1]
["MZ180-25D",null,null,null,null,null,null,null,null,null,null,null,null,null,null,null,null,null,null,null,null,1,0,0,0,1,0,1]
["MZ180-30C",null,null,null,null,null,null,null,null,null,null,null,null,null,null,null,null,null,null,null,null,1,0,0,0,1,0,1]
["MZ180-30D",null,null,null,null,null,null,null,null,null,null,null,null,null,null,null,null,null,null,null,null,1,0,0,0,1,0,1]
["MZ180-30E",null,null,null,null,null,null,null,null,null,null,null,null,null,null,null,null,null,null,null,null,1,0,0,0,1,0,1]
["MZ180-30F",null,null,null,null,null,null,null,null,null,null,null,null,null,null,null,null,null,null,null,null,1,0,0,0,1,0,1]
["MZ430-20C",null,null,null,null,null,null,null,null,null,null,null,null,null,null,null,null,null,null,null,null,1,0,0,0,1,0,1]
["MZ430-20D",null,null,null,null,null,null,null,null,null,null,null,null,null,null,null,null,null,null,null,null,1,0,0,0,1,0,1]
["MZ430-25C",null,null,null,null,null,null,null,null,null,null,null,null,null,null,null,null,null,null,null,null,1,0,0,0,1,0,1]
["MZ430-25D",null,null,null,null,null,null,null,null,null,null,null,null,null,null,null,null,null,null,null,null,1,0,0,0,1,0,1]
["UH71-32-320",null,null,null,null,null,null,null,null,null,null,null,null,null,null,null,null,null,null,null,null,2,0,0,0,2,0,2]
["MZ180-30A",null,null,null,null,null,null,null,null,null,null,null,null,null,null,null,null,null,null,null,null,3,1,0,0,3,1,2]
["MZ209-22A",null,null,null,null,null,null,null,null,null,null,null,null,null,null,null,null,null,null,null,null,2,0,0,0,2,0,2]
["MZ209-22B",null,null,null,null,null,null,null,null,null,null,null,null,null,null,null,null,null,null,null,null,2,0,0,0,2,0,2]
["8-94112-625BGF",null,null,null,null,null,null,null,null,null,null,null,null,null,null,null,null,null,null,null,null,2,1,0,0,2,1,1]
["MB012098BGF",null,null,null,null,null,null,null,null,null,null,null,null,null,null,null,null,null,null,null,null,3,0,0,0,3,0,3]
["MB012098",null,null,null,null,null,null,null,null,null,null,null,null,null,null,null,null,null,null,null,null,2,0,0,0,2,0,2]
["MD712383BGF",null,null,null,null,null,null,null,null,null,null,null,null,null,null,null,null,null,null,null,null,4,2,0,0,4,2,2]
["MD712383",null,null,null,null,null,null,null,null,null,null,null,null,null,null,null,null,null,null,null,null,2,0,0,0,2,0,2]
["UB93-41-400",null,null,null,null,null,null,null,null,null,null,null,null,null,null,null,null,null,null,null,null,2,0,0,0,2,0,2]
["UB93-41-400-353",null,null,null,null,null,null,null,null,null,null,null,null,null,null,null,null,null,null,null,null,4,2,0,0,4,2,2]
["UB39-41-920",null,null,null,null,null,null,null,null,null,null,null,null,null,null,null,null,null,null,null,null,2,0,0,0,2,0,2]
["WL81-15-150A",null,null,null,null,null,null,null,null,null,null,null,null,null,null,null,null,null,null,null,null,3,1,0,0,3,1,2]
["8-97129738",null,null,null,null,null,null,null,null,null,null,null,null,null,null,null,null,null,null,null,null,2,0,0,0,2,0,2]
["WL51-12-420",null,null,null,null,null,null,null,null,null,null,null,null,null,null,null,null,null,null,null,null,1,0,0,0,1,0,1]
["TH-2043C LH",null,null,null,null,null,null,null,null,null,null,null,null,null,null,null,null,null,null,null,null,1,0,0,0,1,0,1]
["TH-2043C RH",null,null,null,null,null,null,null,null,null,null,null,null,null,null,null,null,null,null,null,null,10,0,0,0,10,0,10]
["MB285-30E",null,null,null,null,null,null,null,null,null,null,null,null,null,null,null,null,null,null,null,null,10,0,0,0,10,0,10]
["MB285-30F",null,null,null,null,null,null,null,null,null,null,null,null,null,null,null,null,null,null,null,null,5,0,0,0,5,0,5]
["ST-1639",null,null,null,null,null,null,null,null,null,null,null,null,null,null,null,null,null,null,null,null,5,5,10,0,15,5,10]
["9-37300-031",null,null,null,null,null,null,null,null,null,null,null,null,null,null,null,null,null,null,null,null,10,0,0,0,{"$f":"IF(A517=\"\",\"\",SUM(B517,D517,F517,H517,J517,L517,N517,P517,R517,T517,V517,X517))","v":10},{"$f":"IF(A517=\"\",\"\",SUM(C517,E517,G517,I517,K517,M517,O517,Q517,S517,U517,W517,Y517))","v":0},{"$f":"IF(A517=\"\",\"\",Z517-AA517)","v":10}]
["9-37300-601",null,null,null,null,null,null,null,null,null,null,null,null,null,null,null,null,null,null,null,null,10,0,0,0,10,0,10]
["S1Y8-26-38Z",null,null,null,null,null,null,null,null,null,null,null,null,null,null,null,null,null,null,null,null,10,0,0,0,10,0,10]
["RD22022",null,null,null,null,null,null,null,null,null,null,null,null,null,null,null,null,null,null,null,null,2,0,0,0,2,0,2]
["PT151",null,null,null,null,null,null,null,null,null,null,null,null,null,null,null,null,null,null,null,null,2,0,0,0,2,0,2]
["MR296271-S",null,null,null,null,null,null,null,null,null,null,null,null,null,null,null,null,null,null,null,null,20,0,0,0,20,0,20]
["MR277924",null,null,null,null,null,null,null,null,null,null,null,null,null,null,null,null,null,null,null,null,6,5,0,0,6,5,1]
["MR241029",null,null,null,null,null,null,null,null,null,null,null,null,null,null,null,null,null,null,null,null,4,0,0,0,4,0,4]
["MR133061",null,null,null,null,null,null,null,null,null,null,null,null,null,null,null,null,null,null,null,null,4,0,0,0,4,0,4]
["MB581845",null,null,null,null,null,null,null,null,null,null,null,null,null,null,null,null,null,null,null,null,2,0,0,0,2,0,2]
["MG01-12013",null,null,null,null,null,null,null,null,null,null,null,null,null,null,null,null,null,null,null,null,2,0,0,0,2,0,2]
["MG01-12017",null,null,null,null,null,null,null,null,null,null,null,null,null,null,null,null,null,null,null,null,2,0,0,0,2,0,2]
["MG01-12002LHD",null,null,null,null,null,null,null,null,null,null,null,null,null,null,null,null,null,null,null,null,4,2,0,0,4,2,2]
[27935,null,null,null,null,null,null,null,null,null,null,null,null,null,null,null,null,null,null,null,null,13,5,0,0,13,5,8]
["MD374223",null,null,null,null,null,null,null,null,null,null,null,null,null,null,null,null,null,null,null,null,2,0,0,0,2,0,2]
["MD110165",null,null,null,null,null,null,null,null,null,null,null,null,null,null,null,null,null,null,null,null,1,0,0,0,1,0,1]
["MD324967",null,null,null,null,null,null,null,null,null,null,null,null,null,null,null,null,null,null,null,null,1,0,0,0,1,0,1]
["MD324966",null,null,null,null,null,null,null,null,null,null,null,null,null,null,null,null,null,null,null,null,10,0,0,0,10,0,10]
["MD050212",null,null,null,null,null,null,null,null,null,null,null,null,null,null,null,null,null,null,null,null,30,20,0,0,30,20,10]
["MB7681",null,null,null,null,null,null,null,null,null,null,null,null,null,null,null,null,null,null,null,null,21,1,0,0,21,1,20]
["MB500813",null,null,null,null,null,null,null,null,null,null,null,null,null,null,null,null,null,null,null,null,2,0,0,0,2,0,2]
["MB422203",null,null,null,null,null,null,null,null,null,null,null,null,null,null,null,null,null,null,null,null,4,0,0,0,4,0,4]
["MB422204",null,null,null,null,null,null,null,null,null,null,null,null,null,null,null,null,null,null,null,null,2,0,0,0,2,0,2]
["MB407061",null,null,null,null,null,null,null,null,null,null,null,null,null,null,null,null,null,null,null,null,4,0,0,1,4,1,3]
["MB407030",null,null,null,null,null,null,null,null,null,null,null,null,null,null,null,null,null,null,null,null,2,0,0,0,2,0,2]
["MB333-30A",null,null,null,null,null,null,null,null,null,null,null,null,null,null,null,null,null,null,null,null,2,0,0,0,2,0,2]
["MB333-30B",null,null,null,null,null,null,null,null,null,null,null,null,null,null,null,null,null,null,null,null,2,0,0,0,2,0,2]
["MB286-30M",null,null,null,null,null,null,null,null,null,null,null,null,null,null,null,null,null,null,null,null,2,0,0,0,2,0,2]
["MB286-30N",null,null,null,null,null,null,null,null,null,null,null,null,null,null,null,null,null,null,null,null,2,0,0,0,2,0,2]
["MB285-25A",null,null,null,null,null,null,null,null,null,null,null,null,null,null,null,null,null,null,null,null,2,0,0,0,2,0,2]
["MB285-25B",null,null,null,null,null,null,null,null,null,null,null,null,null,null,null,null,null,null,null,null,4,0,0,0,4,0,4]
["MB252-32A",null,null,null,null,null,null,null,null,null,null,null,null,null,null,null,null,null,null,null,null,4,0,0,0,4,0,4]
["IZ090-32C",null,null,null,null,null,null,null,null,null,null,null,null,null,null,null,null,null,null,null,null,30,10,0,0,30,10,20]
["IZ151-31A",null,null,null,null,null,null,null,null,null,null,null,null,null,null,null,null,null,null,null,null,50,0,0,0,50,0,50]
["IZ151-31B",null,null,null,null,null,null,null,null,null,null,null,null,null,null,null,null,null,null,null,null,1,0,0,0,1,0,1]
["IZ091-36F",null,null,null,null,null,null,null,null,null,null,null,null,null,null,null,null,null,null,null,null,3,0,0,0,3,0,3]
["IZ091-29A",null,null,null,null,null,null,null,null,null,null,null,null,null,null,null,null,null,null,null,null,2,1,0,0,2,1,1]
["8-97365743",null,null,null,null,null,null,null,null,null,null,null,null,null,null,null,null,null,null,null,null,6,0,0,0,6,0,6]
["8-97377149",null,null,null,null,null,null,null,null,null,null,null,null,null,null,null,null,null,null,null,null,3,0,0,0,3,0,3]
["8-97319-300",null,null,null,null,null,null,null,null,null,null,null,null,null,null,null,null,null,null,null,null,6,4,0,0,6,4,2]
["8-97255-313",null,null,null,null,null,null,null,null,null,null,null,null,null,null,null,null,null,null,null,null,4,0,0,0,4,0,4]
["8-97089-652",null,null,null,null,null,null,null,null,null,null,null,null,null,null,null,null,null,null,null,null,2,0,0,0,2,0,2]
["8-96457-472",null,null,null,null,null,null,null,null,null,null,null,null,null,null,null,null,null,null,null,null,5,2,0,0,5,2,3]
["8-97035085",null,null,null,null,null,null,null,null,null,null,null,null,null,null,null,null,null,null,null,null,3,1,0,0,3,1,2]
["8-94438-300",null,null,null,null,null,null,null,null,null,null,null,null,null,null,null,null,null,null,null,null,4,0,0,0,4,0,4]
["8-94434-996",null,null,null,null,null,null,null,null,null,null,null,null,null,null,null,null,null,null,null,null,2,0,0,0,2,0,2]
["8-94434-995",null,null,null,null,null,null,null,null,null,null,null,null,null,null,null,null,null,null,null,null,2,0,0,0,2,0,2]
["8-94328-109",null,null,null,null,null,null,null,null,null,null,null,null,null,null,null,null,null,null,null,null,2,0,0,0,2,0,2]
["8-94328-108",null,null,null,null,null,null,null,null,null,null,null,null,null,null,null,null,null,null,null,null,2,0,0,0,2,0,2]
["8-94376858",null,null,null,null,null,null,null,null,null,null,null,null,null,null,null,null,null,null,null,null,2,0,0,0,2,0,2]
["897105012-0",null,null,null,null,null,null,null,null,null,null,null,null,null,null,null,null,null,null,null,null,4,2,0,0,4,2,2]
["8-94232-282",null,null,null,null,null,null,null,null,null,null,null,null,null,null,null,null,null,null,null,null,10,10,0,0,10,10,0]
["62246A",null,null,null,null,null,null,null,null,null,null,null,null,null,null,null,null,null,null,null,null,11,2,0,0,11,2,9]
["5FP-A0083",null,null,null,null,null,null,null,null,null,null,null,null,null,null,null,null,null,null,null,null,3,1,0,0,3,1,2]
["5FP-A0108",null,null,null,null,null,null,null,null,null,null,null,null,null,null,null,null,null,null,null,null,4,2,0,0,4,2,2]
["5CK-A0006",null,null,null,null,null,null,null,null,null,null,null,null,null,null,null,null,null,null,null,null,2,0,0,0,2,0,2]
["5-37211-001",null,null,null,null,null,null,null,null,null,null,null,null,null,null,null,null,null,null,null,null,9,4,0,1,9,5,4]
["8-94171-858-B",null,null,null,null,null,null,null,null,null,null,null,null,null,null,null,null,null,null,null,null,2,0,0,0,2,0,2]
["MG06-01002",null,null,null,null,null,null,null,null,null,null,null,null,null,null,null,null,null,null,null,null,2,0,0,0,2,0,2]
["TF37",null,null,null,null,null,null,null,null,null,null,null,null,null,null,null,null,null,null,null,null,20,0,0,10,20,10,10]
["TF70",null,null,null,null,null,null,null,null,null,null,null,null,null,null,null,null,null,null,null,null,10,0,0,0,10,0,10]
["TF71",null,null,null,null,null,null,null,null,null,null,null,null,null,null,null,null,null,null,null,null,10,0,0,0,10,0,10]
["TF82",null,null,null,null,null,null,null,null,null,null,null,null,null,null,null,null,null,null,null,null,10,0,0,0,10,0,10]
["TF83",null,null,null,null,null,null,null,null,null,null,null,null,null,null,null,null,null,null,null,null,10,0,0,0,10,0,10]
["TF89",null,null,null,null,null,null,null,null,null,null,null,null,null,null,null,null,null,null,null,null,10,0,0,0,{"$f":"IF(A581=\"\",\"\",SUM(B581,D581,F581,H581,J581,L581,N581,P581,R581,T581,V581,X581))","v":10},{"$f":"IF(A581=\"\",\"\",SUM(C581,E581,G581,I581,K581,M581,O581,Q581,S581,U581,W581,Y581))","v":0},{"$f":"IF(A581=\"\",\"\",Z581-AA581)","v":10}]
["TF121",null,null,null,null,null,null,null,null,null,null,null,null,null,null,null,null,null,null,null,null,10,0,0,0,10,0,10]
["B012",null,null,null,null,null,null,null,null,null,null,null,null,null,null,null,null,null,null,null,null,10,0,0,0,10,0,10]
["B019",null,null,null,null,null,null,null,null,null,null,null,null,null,null,null,null,null,null,null,null,40,0,0,0,40,0,40]
["B022",null,null,null,null,null,null,null,null,null,null,null,null,null,null,null,null,null,null,null,null,50,0,0,0,50,0,50]
["B058",null,null,null,null,null,null,null,null,null,null,null,null,null,null,null,null,null,null,null,null,20,0,0,0,20,0,20]
["B088",null,null,null,null,null,null,null,null,null,null,null,null,null,null,null,null,null,null,null,null,10,0,0,0,10,0,10]
["B091",null,null,null,null,null,null,null,null,null,null,null,null,null,null,null,null,null,null,null,null,20,0,0,0,20,0,20]
["B100",null,null,null,null,null,null,null,null,null,null,null,null,null,null,null,null,null,null,null,null,10,0,0,0,10,0,10]
["B101",null,null,null,null,null,null,null,null,null,null,null,null,null,null,null,null,null,null,null,null,5,0,0,0,5,0,5]
["F010",null,null,null,null,null,null,null,null,null,null,null,null,null,null,null,null,null,null,null,null,5,0,0,0,5,0,5]
["F012",null,null,null,null,null,null,null,null,null,null,null,null,null,null,null,null,null,null,null,null,4,0,0,0,4,0,4]
["F013",null,null,null,null,null,null,null,null,null,null,null,null,null,null,null,null,null,null,null,null,8,0,0,0,8,0,8]
["F014",null,null,null,null,null,null,null,null,null,null,null,null,null,null,null,null,null,null,null,null,10,0,0,0,10,0,10]
["F015",null,null,null,null,null,null,null,null,null,null,null,null,null,null,null,null,null,null,null,null,10,0,0,0,10,0,10]
["F016",null,null,null,null,null,null,null,null,null,null,null,null,null,null,null,null,null,null,null,null,10,0,0,0,10,0,10]
["F025",null,null,null,null,null,null,null,null,null,null,null,null,null,null,null,null,null,null,null,null,10,0,0,0,10,0,10]
["F037",null,null,null,null,null,null,null,null,null,null,null,null,null,null,null,null,null,null,null,null,10,0,0,0,10,0,10]
["I072",null,null,null,null,null,null,null,null,null,null,null,null,null,null,null,null,null,null,null,null,10,0,0,0,10,0,10]
["8-94155315",null,null,null,null,null,null,null,null,null,null,null,null,null,null,null,null,null,null,null,null,20,0,0,0,20,0,20]
["8-94155314",null,null,null,null,null,null,null,null,null,null,null,null,null,null,null,null,null,null,null,null,5,2,0,0,5,2,3]
["9-4468001-1",null,null,null,null,null,null,null,null,null,null,null,null,null,null,null,null,null,null,null,null,5,0,0,0,5,0,5]
["I086",null,null,null,null,null,null,null,null,null,null,null,null,null,null,null,null,null,null,null,null,4,0,0,2,4,2,2]
["I089",null,null,null,null,null,null,null,null,null,null,null,null,null,null,null,null,null,null,null,null,6,0,0,0,6,0,6]
["8-94472118",null,null,null,null,null,null,null,null,null,null,null,null,null,null,null,null,null,null,null,null,6,0,0,0,6,0,6]
["I115",null,null,null,null,null,null,null,null,null,null,null,null,null,null,null,null,null,null,null,null,14,10,0,0,14,10,4]
["I118",null,null,null,null,null,null,null,null,null,null,null,null,null,null,null,null,null,null,null,null,50,0,0,0,50,0,50]
["894124868-2",null,null,null,null,null,null,null,null,null,null,null,null,null,null,null,null,null,null,null,null,20,0,0,0,20,0,20]
["I165",null,null,null,null,null,null,null,null,null,null,null,null,null,null,null,null,null,null,null,null,4,0,0,0,4,0,4]
["I183",null,null,null,null,null,null,null,null,null,null,null,null,null,null,null,null,null,null,null,null,4,4,0,0,4,4,0]
["I184",null,null,null,null,null,null,null,null,null,null,null,null,null,null,null,null,null,null,null,null,4,0,0,0,4,0,4]
["M001",null,null,null,null,null,null,null,null,null,null,null,null,null,null,null,null,null,null,null,null,50,0,0,0,50,0,50]
["M035",null,null,null,null,null,null,null,null,null,null,null,null,null,null,null,null,null,null,null,null,10,0,0,0,10,0,10]
["M041",null,null,null,null,null,null,null,null,null,null,null,null,null,null,null,null,null,null,null,null,6,0,0,0,6,0,6]
["M042",null,null,null,null,null,null,null,null,null,null,null,null,null,null,null,null,null,null,null,null,10,0,0,0,10,0,10]
["M045",null,null,null,null,null,null,null,null,null,null,null,null,null,null,null,null,null,null,null,null,5,0,0,0,5,0,5]
["M048",null,null,null,null,null,null,null,null,null,null,null,null,null,null,null,null,null,null,null,null,5,0,0,0,5,0,5]
["M049",null,null,null,null,null,null,null,null,null,null,null,null,null,null,null,null,null,null,null,null,5,0,0,0,5,0,5]
["M053",null,null,null,null,null,null,null,null,null,null,null,null,null,null,null,null,null,null,null,null,5,0,0,0,5,0,5]
["M062",null,null,null,null,null,null,null,null,null,null,null,null,null,null,null,null,null,null,null,null,2,0,0,0,2,0,2]
["M063",null,null,null,null,null,null,null,null,null,null,null,null,null,null,null,null,null,null,null,null,2,0,0,0,2,0,2]
["M064",null,null,null,null,null,null,null,null,null,null,null,null,null,null,null,null,null,null,null,null,10,0,0,0,10,0,10]
["M084",null,null,null,null,null,null,null,null,null,null,null,null,null,null,null,null,null,null,null,null,2,0,0,0,2,0,2]
["MI11",null,null,null,null,null,null,null,null,null,null,null,null,null,null,null,null,null,null,null,null,2,0,0,0,2,0,2]
["JAK4225100",null,null,null,null,null,null,null,null,null,null,null,null,null,null,null,null,null,null,null,null,9,3,0,0,9,3,6]
["M116",null,null,null,null,null,null,null,null,null,null,null,null,null,null,null,null,null,null,null,null,10,0,0,0,10,0,10]
["R004",null,null,null,null,null,null,null,null,null,null,null,null,null,null,null,null,null,null,null,null,0,0,0,0,0,0,0]
["R005",null,null,null,null,null,null,null,null,null,null,null,null,null,null,null,null,null,null,null,null,30,0,0,0,30,0,30]
["R012",null,null,null,null,null,null,null,null,null,null,null,null,null,null,null,null,null,null,null,null,30,0,0,0,30,0,30]
["R013",null,null,null,null,null,null,null,null,null,null,null,null,null,null,null,null,null,null,null,null,5,0,0,0,5,0,5]
["T051",null,null,null,null,null,null,null,null,null,null,null,null,null,null,null,null,null,null,null,null,50,0,0,0,50,0,50]
["T053",null,null,null,null,null,null,null,null,null,null,null,null,null,null,null,null,null,null,null,null,5,0,0,0,5,0,5]
["T067",null,null,null,null,null,null,null,null,null,null,null,null,null,null,null,null,null,null,null,null,10,0,0,0,10,0,10]
["MR534949",null,null,null,null,null,null,null,null,null,null,null,null,null,null,null,null,null,null,null,null,10,1,0,1,10,2,8]
["897028-970-2",null,null,null,null,null,null,null,null,null,null,null,null,null,null,null,null,null,null,null,null,13,0,0,0,13,0,13]
["I093",null,null,null,null,null,null,null,null,null,null,null,null,null,null,null,null,null,null,null,null,6,0,0,0,6,0,6]
[894241767,null,null,null,null,null,null,null,null,null,null,null,null,null,null,null,null,null,null,null,null,20,0,0,0,20,0,20]
["96-97248860-0",null,null,null,null,null,null,null,null,null,null,null,null,null,null,null,null,null,null,null,null,6,0,0,0,6,0,6]
["8-94440608",null,null,null,null,null,null,null,null,null,null,null,null,null,null,null,null,null,null,null,null,6,1,0,0,6,1,5]
["I130",null,null,null,null,null,null,null,null,null,null,null,null,null,null,null,null,null,null,null,null,7,0,0,0,7,0,7]
["I136",null,null,null,null,null,null,null,null,null,null,null,null,null,null,null,null,null,null,null,null,10,0,0,0,10,0,10]
[894328800,null,null,null,null,null,null,null,null,null,null,null,null,null,null,null,null,null,null,null,null,10,1,0,0,10,1,9]
["I162",null,null,null,null,null,null,null,null,null,null,null,null,null,null,null,null,null,null,null,null,7,0,0,0,7,0,7]
["8-94334158",null,null,null,null,null,null,null,null,null,null,null,null,null,null,null,null,null,null,null,null,6,0,0,0,6,0,6]
["8-94334159",null,null,null,null,null,null,null,null,null,null,null,null,null,null,null,null,null,null,null,null,10,0,0,0,{"$f":"IF(A645=\"\",\"\",SUM(B645,D645,F645,H645,J645,L645,N645,P645,R645,T645,V645,X645))","v":10},{"$f":"IF(A645=\"\",\"\",SUM(C645,E645,G645,I645,K645,M645,O645,Q645,S645,U645,W645,Y645))","v":0},{"$f":"IF(A645=\"\",\"\",Z645-AA645)","v":10}]
["I138",null,null,null,null,null,null,null,null,null,null,null,null,null,null,null,null,null,null,null,null,16,6,0,0,16,6,10]
["I189",null,null,null,null,null,null,null,null,null,null,null,null,null,null,null,null,null,null,null,null,20,0,0,0,20,0,20]
["M005-N",null,null,null,null,null,null,null,null,null,null,null,null,null,null,null,null,null,null,null,null,2,0,0,0,2,0,2]
["M007-N",null,null,null,null,null,null,null,null,null,null,null,null,null,null,null,null,null,null,null,null,4,0,0,0,4,0,4]
["M010-N",null,null,null,null,null,null,null,null,null,null,null,null,null,null,null,null,null,null,null,null,4,0,0,0,4,0,4]
["MI16",null,null,null,null,null,null,null,null,null,null,null,null,null,null,null,null,null,null,null,null,11,3,0,0,11,3,8]
["MI20",null,null,null,null,null,null,null,null,null,null,null,null,null,null,null,null,null,null,null,null,3,0,0,0,3,0,3]
["R007",null,null,null,null,null,null,null,null,null,null,null,null,null,null,null,null,null,null,null,null,6,0,0,0,6,0,6]
["R008",null,null,null,null,null,null,null,null,null,null,null,null,null,null,null,null,null,null,null,null,15,0,0,0,15,0,15]
["ST01",null,null,null,null,null,null,null,null,null,null,null,null,null,null,null,null,null,null,null,null,15,0,0,0,15,0,15]
["ST02",null,null,null,null,null,null,null,null,null,null,null,null,null,null,null,null,null,null,null,null,50,0,0,0,50,0,50]
["TF63",null,null,null,null,null,null,null,null,null,null,null,null,null,null,null,null,null,null,null,null,50,0,0,0,50,0,50]
["I138",null,null,null,null,null,null,null,null,null,null,null,null,null,null,null,null,null,null,null,null,10,0,0,0,10,0,10]
["B071",null,null,null,null,null,null,null,null,null,null,null,null,null,null,null,null,null,null,null,null,20,0,0,0,20,0,20]
["B072",null,null,null,null,null,null,null,null,null,null,null,null,null,null,null,null,null,null,null,null,10,0,0,0,10,0,10]
["F020",null,null,null,null,null,null,null,null,null,null,null,null,null,null,null,null,null,null,null,null,10,0,0,0,10,0,10]
["F021",null,null,null,null,null,null,null,null,null,null,null,null,null,null,null,null,null,null,null,null,10,0,0,0,10,0,10]
["F024",null,null,null,null,null,null,null,null,null,null,null,null,null,null,null,null,null,null,null,null,14,4,0,0,14,4,10]
["F030",null,null,null,null,null,null,null,null,null,null,null,null,null,null,null,null,null,null,null,null,7,2,0,0,7,2,5]
["FD002",null,null,null,null,null,null,null,null,null,null,null,null,null,null,null,null,null,null,null,null,5,0,0,0,5,0,5]
["UM46-39-040",null,null,null,null,null,null,null,null,null,null,null,null,null,null,null,null,null,null,null,null,20,0,0,0,20,0,20]
["FO011",null,null,null,null,null,null,null,null,null,null,null,null,null,null,null,null,null,null,null,null,14,0,0,0,14,0,14]
["I004",null,null,null,null,null,null,null,null,null,null,null,null,null,null,null,null,null,null,null,null,60,0,0,0,60,0,60]
["I006",null,null,null,null,null,null,null,null,null,null,null,null,null,null,null,null,null,null,null,null,30,10,0,0,30,10,20]
["I010",null,null,null,null,null,null,null,null,null,null,null,null,null,null,null,null,null,null,null,null,60,0,0,0,60,0,60]
["I011",null,null,null,null,null,null,null,null,null,null,null,null,null,null,null,null,null,null,null,null,5,0,0,0,5,0,5]
["I012",null,null,null,null,null,null,null,null,null,null,null,null,null,null,null,null,null,null,null,null,100,0,0,0,100,0,100]
["I013",null,null,null,null,null,null,null,null,null,null,null,null,null,null,null,null,null,null,null,null,64,0,0,0,64,0,64]
["I019",null,null,null,null,null,null,null,null,null,null,null,null,null,null,null,null,null,null,null,null,265,25,0,0,265,25,240]
["I021",null,null,null,null,null,null,null,null,null,null,null,null,null,null,null,null,null,null,null,null,200,0,0,0,200,0,200]
["I027",null,null,null,null,null,null,null,null,null,null,null,null,null,null,null,null,null,null,null,null,10,0,0,0,10,0,10]
["I032",null,null,null,null,null,null,null,null,null,null,null,null,null,null,null,null,null,null,null,null,10,0,0,0,10,0,10]
["I035",null,null,null,null,null,null,null,null,null,null,null,null,null,null,null,null,null,null,null,null,50,0,0,0,50,0,50]
["I039",null,null,null,null,null,null,null,null,null,null,null,null,null,null,null,null,null,null,null,null,20,0,0,0,20,0,20]
["I042",null,null,null,null,null,null,null,null,null,null,null,null,null,null,null,null,null,null,null,null,70,8,0,0,70,8,62]
["I043",null,null,null,null,null,null,null,null,null,null,null,null,null,null,null,null,null,null,null,null,12,0,0,0,12,0,12]
["I048",null,null,null,null,null,null,null,null,null,null,null,null,null,null,null,null,null,null,null,null,10,0,0,0,10,0,10]
["I056",null,null,null,null,null,null,null,null,null,null,null,null,null,null,null,null,null,null,null,null,20,0,0,0,20,0,20]
["I066",null,null,null,null,null,null,null,null,null,null,null,null,null,null,null,null,null,null,null,null,30,1,0,1,30,2,28]
["I071",null,null,null,null,null,null,null,null,null,null,null,null,null,null,null,null,null,null,null,null,30,10,0,0,30,10,20]
["I073",null,null,null,null,null,null,null,null,null,null,null,null,null,null,null,null,null,null,null,null,30,0,0,0,30,0,30]
["B001",null,null,null,null,null,null,null,null,null,null,null,null,null,null,null,null,null,null,null,null,30,0,0,0,30,0,30]
["B002",null,null,null,null,null,null,null,null,null,null,null,null,null,null,null,null,null,null,null,null,20,0,0,0,20,0,20]
["B003",null,null,null,null,null,null,null,null,null,null,null,null,null,null,null,null,null,null,null,null,10,0,0,0,10,0,10]
["B004",null,null,null,null,null,null,null,null,null,null,null,null,null,null,null,null,null,null,null,null,20,0,0,0,20,0,20]
["B005",null,null,null,null,null,null,null,null,null,null,null,null,null,null,null,null,null,null,null,null,30,0,0,0,30,0,30]
["B006",null,null,null,null,null,null,null,null,null,null,null,null,null,null,null,null,null,null,null,null,5,0,0,0,5,0,5]
["B008",null,null,null,null,null,null,null,null,null,null,null,null,null,null,null,null,null,null,null,null,10,0,0,0,10,0,10]
["B009",null,null,null,null,null,null,null,null,null,null,null,null,null,null,null,null,null,null,null,null,10,0,0,0,10,0,10]
["B013",null,null,null,null,null,null,null,null,null,null,null,null,null,null,null,null,null,null,null,null,10,0,0,0,10,0,10]
["B014",null,null,null,null,null,null,null,null,null,null,null,null,null,null,null,null,null,null,null,null,6,0,0,0,6,0,6]
["B016",null,null,null,null,null,null,null,null,null,null,null,null,null,null,null,null,null,null,null,null,20,0,0,0,20,0,20]
["B018",null,null,null,null,null,null,null,null,null,null,null,null,null,null,null,null,null,null,null,null,50,0,0,0,50,0,50]
["B020",null,null,null,null,null,null,null,null,null,null,null,null,null,null,null,null,null,null,null,null,25,0,0,0,25,0,25]
["B023",null,null,null,null,null,null,null,null,null,null,null,null,null,null,null,null,null,null,null,null,10,0,0,0,10,0,10]
["B026",null,null,null,null,null,null,null,null,null,null,null,null,null,null,null,null,null,null,null,null,10,0,0,0,10,0,10]
["B027",null,null,null,null,null,null,null,null,null,null,null,null,null,null,null,null,null,null,null,null,50,0,0,0,50,0,50]
["B038",null,null,null,null,null,null,null,null,null,null,null,null,null,null,null,null,null,null,null,null,50,0,0,0,50,0,50]
["B039",null,null,null,null,null,null,null,null,null,null,null,null,null,null,null,null,null,null,null,null,10,0,0,0,10,0,10]
["B041",null,null,null,null,null,null,null,null,null,null,null,null,null,null,null,null,null,null,null,null,10,0,0,0,10,0,10]
["B042",null,null,null,null,null,null,null,null,null,null,null,null,null,null,null,null,null,null,null,null,10,0,0,0,10,0,10]
["B047",null,null,null,null,null,null,null,null,null,null,null,null,null,null,null,null,null,null,null,null,30,0,0,0,30,0,30]
["B048",null,null,null,null,null,null,null,null,null,null,null,null,null,null,null,null,null,null,null,null,20,0,0,0,20,0,20]
["B049",null,null,null,null,null,null,null,null,null,null,null,null,null,null,null,null,null,null,null,null,8,2,0,0,{"$f":"IF(A709=\"\",\"\",SUM(B709,D709,F709,H709,J709,L709,N709,P709,R709,T709,V709,X709))","v":8},{"$f":"IF(A709=\"\",\"\",SUM(C709,E709,G709,I709,K709,M709,O709,Q709,S709,U709,W709,Y709))","v":2},{"$f":"IF(A709=\"\",\"\",Z709-AA709)","v":6}]
["B055",null,null,null,null,null,null,null,null,null,null,null,null,null,null,null,null,null,null,null,null,10,0,0,0,10,0,10]
["B057",null,null,null,null,null,null,null,null,null,null,null,null,null,null,null,null,null,null,null,null,30,0,0,0,30,0,30]
["B067",null,null,null,null,null,null,null,null,null,null,null,null,null,null,null,null,null,null,null,null,20,0,0,0,20,0,20]
["B068",null,null,null,null,null,null,null,null,null,null,null,null,null,null,null,null,null,null,null,null,20,0,0,0,20,0,20]
["B070",null,null,null,null,null,null,null,null,null,null,null,null,null,null,null,null,null,null,null,null,30,0,0,0,30,0,30]
["B073",null,null,null,null,null,null,null,null,null,null,null,null,null,null,null,null,null,null,null,null,10,0,0,0,10,0,10]
["B074",null,null,null,null,null,null,null,null,null,null,null,null,null,null,null,null,null,null,null,null,10,0,0,0,10,0,10]
["B075",null,null,null,null,null,null,null,null,null,null,null,null,null,null,null,null,null,null,null,null,10,0,0,0,10,0,10]
["B076",null,null,null,null,null,null,null,null,null,null,null,null,null,null,null,null,null,null,null,null,20,10,0,0,20,10,10]
["B080",null,null,null,null,null,null,null,null,null,null,null,null,null,null,null,null,null,null,null,null,50,0,0,0,50,0,50]
["B081",null,null,null,null,null,null,null,null,null,null,null,null,null,null,null,null,null,null,null,null,50,0,0,0,50,0,50]
["B082",null,null,null,null,null,null,null,null,null,null,null,null,null,null,null,null,null,null,null,null,10,0,0,0,10,0,10]
["B084",null,null,null,null,null,null,null,null,null,null,null,null,null,null,null,null,null,null,null,null,10,0,0,0,10,0,10]
["B085",null,null,null,null,null,null,null,null,null,null,null,null,null,null,null,null,null,null,null,null,5,0,0,0,5,0,5]
["B086",null,null,null,null,null,null,null,null,null,null,null,null,null,null,null,null,null,null,null,null,30,20,0,0,30,20,10]
["B087",null,null,null,null,null,null,null,null,null,null,null,null,null,null,null,null,null,null,null,null,50,0,0,0,50,0,50]
["B089",null,null,null,null,null,null,null,null,null,null,null,null,null,null,null,null,null,null,null,null,5,0,0,0,5,0,5]
["B092",null,null,null,null,null,null,null,null,null,null,null,null,null,null,null,null,null,null,null,null,5,0,0,0,5,0,5]
["B093",null,null,null,null,null,null,null,null,null,null,null,null,null,null,null,null,null,null,null,null,10,0,0,0,10,0,10]
["B094",null,null,null,null,null,null,null,null,null,null,null,null,null,null,null,null,null,null,null,null,20,0,0,0,20,0,20]
["B097",null,null,null,null,null,null,null,null,null,null,null,null,null,null,null,null,null,null,null,null,50,0,0,0,50,0,50]
["B099",null,null,null,null,null,null,null,null,null,null,null,null,null,null,null,null,null,null,null,null,10,0,0,0,10,0,10]
["B112",null,null,null,null,null,null,null,null,null,null,null,null,null,null,null,null,null,null,null,null,5,0,0,0,5,0,5]
["B130",null,null,null,null,null,null,null,null,null,null,null,null,null,null,null,null,null,null,null,null,5,0,0,0,5,0,5]
["B132",null,null,null,null,null,null,null,null,null,null,null,null,null,null,null,null,null,null,null,null,5,0,0,0,5,0,5]
["T001",null,null,null,null,null,null,null,null,null,null,null,null,null,null,null,null,null,null,null,null,5,0,0,0,5,0,5]
["TEN001",null,null,null,null,null,null,null,null,null,null,null,null,null,null,null,null,null,null,null,null,5,0,0,0,5,0,5]
["B142",null,null,null,null,null,null,null,null,null,null,null,null,null,null,null,null,null,null,null,null,4,0,0,0,4,0,4]
["B138",null,null,null,null,null,null,null,null,null,null,null,null,null,null,null,null,null,null,null,null,10,0,0,0,10,0,10]
["B140",null,null,null,null,null,null,null,null,null,null,null,null,null,null,null,null,null,null,null,null,10,0,0,0,10,0,10]
["B143",null,null,null,null,null,null,null,null,null,null,null,null,null,null,null,null,null,null,null,null,10,0,0,0,10,0,10]
["B141",null,null,null,null,null,null,null,null,null,null,null,null,null,null,null,null,null,null,null,null,10,0,0,0,10,0,10]
["B144",null,null,null,null,null,null,null,null,null,null,null,null,null,null,null,null,null,null,null,null,10,0,0,0,10,0,10]
["B116",null,null,null,null,null,null,null,null,null,null,null,null,null,null,null,null,null,null,null,null,10,0,0,0,10,0,10]
["B109",null,null,null,null,null,null,null,null,null,null,null,null,null,null,null,null,null,null,null,null,10,0,0,0,10,0,10]
["B111",null,null,null,null,null,null,null,null,null,null,null,null,null,null,null,null,null,null,null,null,10,0,0,0,10,0,10]
["B115",null,null,null,null,null,null,null,null,null,null,null,null,null,null,null,null,null,null,null,null,10,0,0,0,10,0,10]
["B107",null,null,null,null,null,null,null,null,null,null,null,null,null,null,null,null,null,null,null,null,10,0,0,0,10,0,10]
["B110",null,null,null,null,null,null,null,null,null,null,null,null,null,null,null,null,null,null,null,null,10,0,0,0,10,0,10]
["B104",null,null,null,null,null,null,null,null,null,null,null,null,null,null,null,null,null,null,null,null,10,0,0,0,10,0,10]
["B117",null,null,null,null,null,null,null,null,null,null,null,null,null,null,null,null,null,null,null,null,20,10,0,0,20,10,10]
["B118",null,null,null,null,null,null,null,null,null,null,null,null,null,null,null,null,null,null,null,null,10,0,0,0,10,0,10]
["B120",null,null,null,null,null,null,null,null,null,null,null,null,null,null,null,null,null,null,null,null,10,10,0,0,10,10,0]
["B121",null,null,null,null,null,null,null,null,null,null,null,null,null,null,null,null,null,null,null,null,20,20,0,0,20,20,0]
["B122",null,null,null,null,null,null,null,null,null,null,null,null,null,null,null,null,null,null,null,null,10,0,0,0,10,0,10]
["B105",null,null,null,null,null,null,null,null,null,null,null,null,null,null,null,null,null,null,null,null,20,10,0,0,20,10,10]
["B137",null,null,null,null,null,null,null,null,null,null,null,null,null,null,null,null,null,null,null,null,10,0,0,0,10,0,10]
["B139",null,null,null,null,null,null,null,null,null,null,null,null,null,null,null,null,null,null,null,null,10,0,0,0,10,0,10]
["B123",null,null,null,null,null,null,null,null,null,null,null,null,null,null,null,null,null,null,null,null,10,0,0,0,10,0,10]
["B124",null,null,null,null,null,null,null,null,null,null,null,null,null,null,null,null,null,null,null,null,10,0,0,0,10,0,10]
["B136",null,null,null,null,null,null,null,null,null,null,null,null,null,null,null,null,null,null,null,null,10,0,0,0,10,0,10]
["B125",null,null,null,null,null,null,null,null,null,null,null,null,null,null,null,null,null,null,null,null,10,0,0,0,10,0,10]
["B145",null,null,null,null,null,null,null,null,null,null,null,null,null,null,null,null,null,null,null,null,20,10,0,0,20,10,10]
["B147",null,null,null,null,null,null,null,null,null,null,null,null,null,null,null,null,null,null,null,null,10,0,0,0,10,0,10]
["B126",null,null,null,null,null,null,null,null,null,null,null,null,null,null,null,null,null,null,null,null,10,0,0,0,10,0,10]
["B106",null,null,null,null,null,null,null,null,null,null,null,null,null,null,null,null,null,null,null,null,30,20,0,0,30,20,10]
["B128",null,null,null,null,null,null,null,null,null,null,null,null,null,null,null,null,null,null,null,null,20,10,0,0,20,10,10]
["B129",null,null,null,null,null,null,null,null,null,null,null,null,null,null,null,null,null,null,null,null,10,0,0,0,10,0,10]
["B114",null,null,null,null,null,null,null,null,null,null,null,null,null,null,null,null,null,null,null,null,10,0,0,0,10,0,10]
["B146",null,null,null,null,null,null,null,null,null,null,null,null,null,null,null,null,null,null,null,null,10,0,0,0,10,0,10]
["B108",null,null,null,null,null,null,null,null,null,null,null,null,null,null,null,null,null,null,null,null,10,0,0,0,10,0,10]
["I001",null,null,null,null,null,null,null,null,null,null,null,null,null,null,null,null,null,null,null,null,10,0,0,0,10,0,10]
["I002",null,null,null,null,null,null,null,null,null,null,null,null,null,null,null,null,null,null,null,null,10,0,0,0,10,0,10]
["I003-N",null,null,null,null,null,null,null,null,null,null,null,null,null,null,null,null,null,null,null,null,10,4,0,0,{"$f":"IF(A773=\"\",\"\",SUM(B773,D773,F773,H773,J773,L773,N773,P773,R773,T773,V773,X773))","v":10},{"$f":"IF(A773=\"\",\"\",SUM(C773,E773,G773,I773,K773,M773,O773,Q773,S773,U773,W773,Y773))","v":4},{"$f":"IF(A773=\"\",\"\",Z773-AA773)","v":6}]
["I005-N",null,null,null,null,null,null,null,null,null,null,null,null,null,null,null,null,null,null,null,null,4,0,0,0,4,0,4]
["I007",null,null,null,null,null,null,null,null,null,null,null,null,null,null,null,null,null,null,null,null,6,6,0,0,6,6,0]
["I008",null,null,null,null,null,null,null,null,null,null,null,null,null,null,null,null,null,null,null,null,6,0,0,0,6,0,6]
["I009",null,null,null,null,null,null,null,null,null,null,null,null,null,null,null,null,null,null,null,null,20,10,0,0,20,10,10]
["I020",null,null,null,null,null,null,null,null,null,null,null,null,null,null,null,null,null,null,null,null,30,0,0,0,30,0,30]
["I022",null,null,null,null,null,null,null,null,null,null,null,null,null,null,null,null,null,null,null,null,50,0,0,0,50,0,50]
["I023",null,null,null,null,null,null,null,null,null,null,null,null,null,null,null,null,null,null,null,null,4,0,0,0,4,0,4]
["FO004",null,null,null,null,null,null,null,null,null,null,null,null,null,null,null,null,null,null,null,null,10,0,0,0,10,0,10]
["FO005",null,null,null,null,null,null,null,null,null,null,null,null,null,null,null,null,null,null,null,null,10,0,0,0,10,0,10]
["FO006",null,null,null,null,null,null,null,null,null,null,null,null,null,null,null,null,null,null,null,null,10,0,0,0,10,0,10]
["FO007",null,null,null,null,null,null,null,null,null,null,null,null,null,null,null,null,null,null,null,null,10,0,0,0,10,0,10]
["FO009",null,null,null,null,null,null,null,null,null,null,null,null,null,null,null,null,null,null,null,null,10,0,0,0,10,0,10]
["FO010",null,null,null,null,null,null,null,null,null,null,null,null,null,null,null,null,null,null,null,null,10,0,0,0,10,0,10]
["FO011",null,null,null,null,null,null,null,null,null,null,null,null,null,null,null,null,null,null,null,null,10,0,0,0,10,0,10]
["FO013",null,null,null,null,null,null,null,null,null,null,null,null,null,null,null,null,null,null,null,null,60,0,0,0,60,0,60]
["FO014",null,null,null,null,null,null,null,null,null,null,null,null,null,null,null,null,null,null,null,null,20,0,0,0,20,0,20]
["M002",null,null,null,null,null,null,null,null,null,null,null,null,null,null,null,null,null,null,null,null,20,0,0,0,20,0,20]
["M003",null,null,null,null,null,null,null,null,null,null,null,null,null,null,null,null,null,null,null,null,10,0,0,0,10,0,10]
["M004",null,null,null,null,null,null,null,null,null,null,null,null,null,null,null,null,null,null,null,null,10,0,0,0,10,0,10]
["M006-N",null,null,null,null,null,null,null,null,null,null,null,null,null,null,null,null,null,null,null,null,10,0,0,0,10,0,10]
["M012",null,null,null,null,null,null,null,null,null,null,null,null,null,null,null,null,null,null,null,null,4,0,0,0,4,0,4]
["M011-N",null,null,null,null,null,null,null,null,null,null,null,null,null,null,null,null,null,null,null,null,4,0,0,0,4,0,4]
["M013",null,null,null,null,null,null,null,null,null,null,null,null,null,null,null,null,null,null,null,null,4,0,0,0,4,0,4]
["M014",null,null,null,null,null,null,null,null,null,null,null,null,null,null,null,null,null,null,null,null,10,0,0,0,10,0,10]
["M015",null,null,null,null,null,null,null,null,null,null,null,null,null,null,null,null,null,null,null,null,10,0,0,0,10,0,10]
["M016",null,null,null,null,null,null,null,null,null,null,null,null,null,null,null,null,null,null,null,null,6,0,0,0,6,0,6]
["M017",null,null,null,null,null,null,null,null,null,null,null,null,null,null,null,null,null,null,null,null,20,0,0,0,20,0,20]
["M019",null,null,null,null,null,null,null,null,null,null,null,null,null,null,null,null,null,null,null,null,20,0,0,0,20,0,20]
["M023",null,null,null,null,null,null,null,null,null,null,null,null,null,null,null,null,null,null,null,null,20,0,0,0,20,0,20]
["M024",null,null,null,null,null,null,null,null,null,null,null,null,null,null,null,null,null,null,null,null,20,0,0,0,20,0,20]
["M025",null,null,null,null,null,null,null,null,null,null,null,null,null,null,null,null,null,null,null,null,10,0,0,0,10,0,10]
["M026",null,null,null,null,null,null,null,null,null,null,null,null,null,null,null,null,null,null,null,null,50,0,0,0,50,0,50]
["M027",null,null,null,null,null,null,null,null,null,null,null,null,null,null,null,null,null,null,null,null,50,0,0,0,50,0,50]
["M030",null,null,null,null,null,null,null,null,null,null,null,null,null,null,null,null,null,null,null,null,10,0,0,0,10,0,10]
["M031",null,null,null,null,null,null,null,null,null,null,null,null,null,null,null,null,null,null,null,null,30,0,0,0,30,0,30]
["M033",null,null,null,null,null,null,null,null,null,null,null,null,null,null,null,null,null,null,null,null,6,0,0,0,6,0,6]
["M034",null,null,null,null,null,null,null,null,null,null,null,null,null,null,null,null,null,null,null,null,6,0,0,0,6,0,6]
["M036",null,null,null,null,null,null,null,null,null,null,null,null,null,null,null,null,null,null,null,null,6,0,0,0,6,0,6]
["M037",null,null,null,null,null,null,null,null,null,null,null,null,null,null,null,null,null,null,null,null,6,0,0,0,6,0,6]
["M038",null,null,null,null,null,null,null,null,null,null,null,null,null,null,null,null,null,null,null,null,50,0,0,0,50,0,50]
["M039",null,null,null,null,null,null,null,null,null,null,null,null,null,null,null,null,null,null,null,null,50,0,0,0,50,0,50]
["M040",null,null,null,null,null,null,null,null,null,null,null,null,null,null,null,null,null,null,null,null,50,0,0,0,50,0,50]
["M043",null,null,null,null,null,null,null,null,null,null,null,null,null,null,null,null,null,null,null,null,10,0,0,0,10,0,10]
["M046",null,null,null,null,null,null,null,null,null,null,null,null,null,null,null,null,null,null,null,null,5,0,0,0,5,0,5]
["M050",null,null,null,null,null,null,null,null,null,null,null,null,null,null,null,null,null,null,null,null,5,0,0,0,5,0,5]
["M052",null,null,null,null,null,null,null,null,null,null,null,null,null,null,null,null,null,null,null,null,6,0,0,0,6,0,6]
["M054",null,null,null,null,null,null,null,null,null,null,null,null,null,null,null,null,null,null,null,null,5,0,0,0,5,0,5]
["M055",null,null,null,null,null,null,null,null,null,null,null,null,null,null,null,null,null,null,null,null,5,0,0,0,5,0,5]
["M056",null,null,null,null,null,null,null,null,null,null,null,null,null,null,null,null,null,null,null,null,20,0,0,0,20,0,20]
["M057",null,null,null,null,null,null,null,null,null,null,null,null,null,null,null,null,null,null,null,null,6,0,0,0,6,0,6]
["M058",null,null,null,null,null,null,null,null,null,null,null,null,null,null,null,null,null,null,null,null,6,0,0,0,6,0,6]
["M059",null,null,null,null,null,null,null,null,null,null,null,null,null,null,null,null,null,null,null,null,3,0,0,0,3,0,3]
["M060",null,null,null,null,null,null,null,null,null,null,null,null,null,null,null,null,null,null,null,null,5,0,0,0,5,0,5]
["M061",null,null,null,null,null,null,null,null,null,null,null,null,null,null,null,null,null,null,null,null,20,0,0,0,20,0,20]
["M076",null,null,null,null,null,null,null,null,null,null,null,null,null,null,null,null,null,null,null,null,10,0,0,0,10,0,10]
["M077",null,null,null,null,null,null,null,null,null,null,null,null,null,null,null,null,null,null,null,null,4,0,0,0,4,0,4]
["M079",null,null,null,null,null,null,null,null,null,null,null,null,null,null,null,null,null,null,null,null,4,0,0,0,4,0,4]
["F001",null,null,null,null,null,null,null,null,null,null,null,null,null,null,null,null,null,null,null,null,4,0,0,0,4,0,4]
["F002",null,null,null,null,null,null,null,null,null,null,null,null,null,null,null,null,null,null,null,null,9,0,0,0,9,0,9]
["F004",null,null,null,null,null,null,null,null,null,null,null,null,null,null,null,null,null,null,null,null,0,0,0,0,0,0,0]
["F005",null,null,null,null,null,null,null,null,null,null,null,null,null,null,null,null,null,null,null,null,10,0,0,0,10,0,10]
["F006",null,null,null,null,null,null,null,null,null,null,null,null,null,null,null,null,null,null,null,null,4,0,0,0,4,0,4]
["F007",null,null,null,null,null,null,null,null,null,null,null,null,null,null,null,null,null,null,null,null,4,0,0,0,4,0,4]
["F008",null,null,null,null,null,null,null,null,null,null,null,null,null,null,null,null,null,null,null,null,4,0,0,0,{"$f":"IF(A837=\"\",\"\",SUM(B837,D837,F837,H837,J837,L837,N837,P837,R837,T837,V837,X837))","v":4},{"$f":"IF(A837=\"\",\"\",SUM(C837,E837,G837,I837,K837,M837,O837,Q837,S837,U837,W837,Y837))","v":0},{"$f":"IF(A837=\"\",\"\",Z837-AA837)","v":4}]
["F009",null,null,null,null,null,null,null,null,null,null,null,null,null,null,null,null,null,null,null,null,4,0,0,0,4,0,4]
["F011",null,null,null,null,null,null,null,null,null,null,null,null,null,null,null,null,null,null,null,null,4,0,0,0,4,0,4]
["F017",null,null,null,null,null,null,null,null,null,null,null,null,null,null,null,null,null,null,null,null,0,0,0,0,0,0,0]
["F018",null,null,null,null,null,null,null,null,null,null,null,null,null,null,null,null,null,null,null,null,4,0,0,0,4,0,4]
["F019",null,null,null,null,null,null,null,null,null,null,null,null,null,null,null,null,null,null,null,null,4,0,0,0,4,0,4]
["F027",null,null,null,null,null,null,null,null,null,null,null,null,null,null,null,null,null,null,null,null,30,0,0,0,30,0,30]
["F028",null,null,null,null,null,null,null,null,null,null,null,null,null,null,null,null,null,null,null,null,0,0,0,0,0,0,0]
["F029",null,null,null,null,null,null,null,null,null,null,null,null,null,null,null,null,null,null,null,null,9,4,0,0,9,4,5]
["F032",null,null,null,null,null,null,null,null,null,null,null,null,null,null,null,null,null,null,null,null,5,0,0,0,5,0,5]
["F033",null,null,null,null,null,null,null,null,null,null,null,null,null,null,null,null,null,null,null,null,50,0,0,0,50,0,50]
["FO34",null,null,null,null,null,null,null,null,null,null,null,null,null,null,null,null,null,null,null,null,5,0,0,0,5,0,5]
["F036",null,null,null,null,null,null,null,null,null,null,null,null,null,null,null,null,null,null,null,null,5,0,0,0,5,0,5]
["R002",null,null,null,null,null,null,null,null,null,null,null,null,null,null,null,null,null,null,null,null,20,0,0,0,20,0,20]
["R003",null,null,null,null,null,null,null,null,null,null,null,null,null,null,null,null,null,null,null,null,20,0,0,0,20,0,20]
["R007",null,null,null,null,null,null,null,null,null,null,null,null,null,null,null,null,null,null,null,null,20,0,0,0,20,0,20]
["R008",null,null,null,null,null,null,null,null,null,null,null,null,null,null,null,null,null,null,null,null,15,0,0,0,15,0,15]
["R009",null,null,null,null,null,null,null,null,null,null,null,null,null,null,null,null,null,null,null,null,15,0,0,0,15,0,15]
["R010",null,null,null,null,null,null,null,null,null,null,null,null,null,null,null,null,null,null,null,null,10,0,0,0,10,0,10]
["R011",null,null,null,null,null,null,null,null,null,null,null,null,null,null,null,null,null,null,null,null,10,0,0,0,10,0,10]
["R014",null,null,null,null,null,null,null,null,null,null,null,null,null,null,null,null,null,null,null,null,5,0,0,0,5,0,5]
["D001",null,null,null,null,null,null,null,null,null,null,null,null,null,null,null,null,null,null,null,null,10,0,0,0,10,0,10]
["D002",null,null,null,null,null,null,null,null,null,null,null,null,null,null,null,null,null,null,null,null,20,2,0,0,20,2,18]
["D003",null,null,null,null,null,null,null,null,null,null,null,null,null,null,null,null,null,null,null,null,20,0,0,0,20,0,20]
["TEN002",null,null,null,null,null,null,null,null,null,null,null,null,null,null,null,null,null,null,null,null,20,0,0,0,20,0,20]
["TEN003",null,null,null,null,null,null,null,null,null,null,null,null,null,null,null,null,null,null,null,null,6,0,0,0,6,0,6]
["TEN004",null,null,null,null,null,null,null,null,null,null,null,null,null,null,null,null,null,null,null,null,6,0,0,0,6,0,6]
["TF03",null,null,null,null,null,null,null,null,null,null,null,null,null,null,null,null,null,null,null,null,6,0,0,0,6,0,6]
["TF04",null,null,null,null,null,null,null,null,null,null,null,null,null,null,null,null,null,null,null,null,10,0,0,0,10,0,10]
["TF05",null,null,null,null,null,null,null,null,null,null,null,null,null,null,null,null,null,null,null,null,10,0,0,0,10,0,10]
["TF06",null,null,null,null,null,null,null,null,null,null,null,null,null,null,null,null,null,null,null,null,10,0,0,0,10,0,10]
["TF07",null,null,null,null,null,null,null,null,null,null,null,null,null,null,null,null,null,null,null,null,10,0,0,0,10,0,10]
["TF08",null,null,null,null,null,null,null,null,null,null,null,null,null,null,null,null,null,null,null,null,10,0,0,0,10,0,10]
["TF10",null,null,null,null,null,null,null,null,null,null,null,null,null,null,null,null,null,null,null,null,10,0,0,0,10,0,10]
["TF11",null,null,null,null,null,null,null,null,null,null,null,null,null,null,null,null,null,null,null,null,10,0,0,0,10,0,10]
["TF13",null,null,null,null,null,null,null,null,null,null,null,null,null,null,null,null,null,null,null,null,10,0,0,0,10,0,10]
["TF41",null,null,null,null,null,null,null,null,null,null,null,null,null,null,null,null,null,null,null,null,10,0,0,0,10,0,10]
["TF40",null,null,null,null,null,null,null,null,null,null,null,null,null,null,null,null,null,null,null,null,10,0,0,0,10,0,10]
["TF92",null,null,null,null,null,null,null,null,null,null,null,null,null,null,null,null,null,null,null,null,10,0,0,0,10,0,10]
["TF39",null,null,null,null,null,null,null,null,null,null,null,null,null,null,null,null,null,null,null,null,10,0,0,10,10,10,0]
["TF14",null,null,null,null,null,null,null,null,null,null,null,null,null,null,null,null,null,null,null,null,10,0,0,0,10,0,10]
["TF15",null,null,null,null,null,null,null,null,null,null,null,null,null,null,null,null,null,null,null,null,10,0,0,0,10,0,10]
["TF18",null,null,null,null,null,null,null,null,null,null,null,null,null,null,null,null,null,null,null,null,10,0,0,0,10,0,10]
["TF20",null,null,null,null,null,null,null,null,null,null,null,null,null,null,null,null,null,null,null,null,10,0,0,0,10,0,10]
["TF21",null,null,null,null,null,null,null,null,null,null,null,null,null,null,null,null,null,null,null,null,10,0,0,0,10,0,10]
["TF22",null,null,null,null,null,null,null,null,null,null,null,null,null,null,null,null,null,null,null,null,10,0,0,0,10,0,10]
["TF75",null,null,null,null,null,null,null,null,null,null,null,null,null,null,null,null,null,null,null,null,10,0,0,0,10,0,10]
["TF23",null,null,null,null,null,null,null,null,null,null,null,null,null,null,null,null,null,null,null,null,10,0,0,0,10,0,10]
["TF24",null,null,null,null,null,null,null,null,null,null,null,null,null,null,null,null,null,null,null,null,10,0,0,0,10,0,10]
["TF25",null,null,null,null,null,null,null,null,null,null,null,null,null,null,null,null,null,null,null,null,10,0,0,0,10,0,10]
["TF26",null,null,null,null,null,null,null,null,null,null,null,null,null,null,null,null,null,null,null,null,10,0,0,0,10,0,10]
["TF27",null,null,null,null,null,null,null,null,null,null,null,null,null,null,null,null,null,null,null,null,10,0,0,0,10,0,10]
["TF28",null,null,null,null,null,null,null,null,null,null,null,null,null,null,null,null,null,null,null,null,10,0,0,0,10,0,10]
["TF29",null,null,null,null,null,null,null,null,null,null,null,null,null,null,null,null,null,null,null,null,10,0,0,0,10,0,10]
["TF30",null,null,null,null,null,null,null,null,null,null,null,null,null,null,null,null,null,null,null,null,10,0,0,0,10,0,10]
["TF31",null,null,null,null,null,null,null,null,null,null,null,null,null,null,null,null,null,null,null,null,10,0,0,0,10,0,10]
["TF32",null,null,null,null,null,null,null,null,null,null,null,null,null,null,null,null,null,null,null,null,10,0,0,0,10,0,10]
["TF33",null,null,null,null,null,null,null,null,null,null,null,null,null,null,null,null,null,null,null,null,10,0,0,0,10,0,10]
["TF34",null,null,null,null,null,null,null,null,null,null,null,null,null,null,null,null,null,null,null,null,10,0,0,0,10,0,10]
["TF35",null,null,null,null,null,null,null,null,null,null,null,null,null,null,null,null,null,null,null,null,10,0,0,10,10,10,0]
["TF36",null,null,null,null,null,null,null,null,null,null,null,null,null,null,null,null,null,null,null,null,10,0,0,0,10,0,10]
["TF126",null,null,null,null,null,null,null,null,null,null,null,null,null,null,null,null,null,null,null,null,10,0,0,0,10,0,10]
["TF137",null,null,null,null,null,null,null,null,null,null,null,null,null,null,null,null,null,null,null,null,10,0,0,0,10,0,10]
["TF69",null,null,null,null,null,null,null,null,null,null,null,null,null,null,null,null,null,null,null,null,10,0,0,0,10,0,10]
["TF115",null,null,null,null,null,null,null,null,null,null,null,null,null,null,null,null,null,null,null,null,10,0,0,0,{"$f":"IF(A901=\"\",\"\",SUM(B901,D901,F901,H901,J901,L901,N901,P901,R901,T901,V901,X901))","v":10},{"$f":"IF(A901=\"\",\"\",SUM(C901,E901,G901,I901,K901,M901,O901,Q901,S901,U901,W901,Y901))","v":0},{"$f":"IF(A901=\"\",\"\",Z901-AA901)","v":10}]
["TF116",null,null,null,null,null,null,null,null,null,null,null,null,null,null,null,null,null,null,null,null,10,0,0,0,10,0,10]
["TH6702-82J",null,null,null,null,null,null,null,null,null,null,null,null,null,null,null,null,null,null,null,null,10,0,0,1,10,1,9]
["B077",null,null,null,null,null,null,null,null,null,null,null,null,null,null,null,null,null,null,null,null,101,60,0,0,101,60,41]
["8-94172-018-0",null,null,null,null,null,null,null,null,null,null,null,null,null,null,null,null,null,null,null,null,50,0,0,0,50,0,50]
["MI15",null,null,null,null,null,null,null,null,null,null,null,null,null,null,null,null,null,null,null,null,2,0,0,0,2,0,2]
[207094112625,null,null,null,null,null,null,null,null,null,null,null,null,null,null,null,null,null,null,null,null,2,0,0,0,2,0,2]
["ISU328L",null,null,null,null,null,null,null,null,null,null,null,null,null,null,null,null,null,null,null,null,2,0,0,0,2,0,2]
["ISU328L",null,null,null,null,null,null,null,null,null,null,null,null,null,null,null,null,null,null,null,null,2,0,0,0,2,0,2]
["ISU221L",null,null,null,null,null,null,null,null,null,null,null,null,null,null,null,null,null,null,null,null,4,0,0,0,4,0,4]
["ISU221R",null,null,null,null,null,null,null,null,null,null,null,null,null,null,null,null,null,null,null,null,4,0,0,0,4,0,4]
["5SR-A0205",null,null,null,null,null,null,null,null,null,null,null,null,null,null,null,null,null,null,null,null,2,0,0,0,2,0,2]
["AK1230",null,null,null,null,null,null,null,null,null,null,null,null,null,null,null,null,null,null,null,null,2,0,0,0,2,0,2]
["224018760R",null,null,null,null,null,null,null,null,null,null,null,null,null,null,null,null,null,null,null,null,41,20,0,0,41,20,21]
[7700500168,null,null,null,null,null,null,null,null,null,null,null,null,null,null,null,null,null,null,null,null,30,10,0,0,30,10,20]
[182509,null,null,null,null,null,null,null,null,null,null,null,null,null,null,null,null,null,null,null,null,23,3,0,0,23,3,20]
["271918G",null,null,null,null,null,null,null,null,null,null,null,null,null,null,null,null,null,null,null,null,10,0,0,0,10,0,10]
[8942313080,null,null,null,null,null,null,null,null,null,null,null,null,null,null,null,null,null,null,null,null,5,0,5,3,10,3,7]
["MB831040",null,null,null,null,null,null,null,null,null,null,null,null,null,null,null,null,null,null,null,null,3,2,0,0,3,2,1]
["MI26",null,null,null,null,null,null,null,null,null,null,null,null,null,null,null,null,null,null,null,null,10,0,0,0,10,0,10]
["MI25",null,null,null,null,null,null,null,null,null,null,null,null,null,null,null,null,null,null,null,null,2,0,0,0,2,0,2]
["MI24",null,null,null,null,null,null,null,null,null,null,null,null,null,null,null,null,null,null,null,null,6,2,0,0,6,2,4]
["MI23",null,null,null,null,null,null,null,null,null,null,null,null,null,null,null,null,null,null,null,null,10,0,0,0,10,0,10]
["MI21",null,null,null,null,null,null,null,null,null,null,null,null,null,null,null,null,null,null,null,null,6,0,0,0,6,0,6]
["MI19",null,null,null,null,null,null,null,null,null,null,null,null,null,null,null,null,null,null,null,null,10,0,0,0,10,0,10]
["MI18",null,null,null,null,null,null,null,null,null,null,null,null,null,null,null,null,null,null,null,null,5,0,0,0,5,0,5]
["MI17",null,null,null,null,null,null,null,null,null,null,null,null,null,null,null,null,null,null,null,null,4,0,0,0,4,0,4]
["MI13",null,null,null,null,null,null,null,null,null,null,null,null,null,null,null,null,null,null,null,null,4,0,0,0,4,0,4]
["MI10",null,null,null,null,null,null,null,null,null,null,null,null,null,null,null,null,null,null,null,null,10,0,0,0,10,0,10]
["MI08",null,null,null,null,null,null,null,null,null,null,null,null,null,null,null,null,null,null,null,null,10,10,0,0,10,10,0]
["MI05",null,null,null,null,null,null,null,null,null,null,null,null,null,null,null,null,null,null,null,null,10,0,0,0,10,0,10]
["MI03",null,null,null,null,null,null,null,null,null,null,null,null,null,null,null,null,null,null,null,null,8,0,0,0,8,0,8]
["MI01-N",null,null,null,null,null,null,null,null,null,null,null,null,null,null,null,null,null,null,null,null,4,0,0,0,4,0,4]
["MI02",null,null,null,null,null,null,null,null,null,null,null,null,null,null,null,null,null,null,null,null,20,0,0,0,20,0,20]
["FD003-N",null,null,null,null,null,null,null,null,null,null,null,null,null,null,null,null,null,null,null,null,4,0,0,0,4,0,4]
["8-94155314",null,null,null,null,null,null,null,null,null,null,null,null,null,null,null,null,null,null,null,null,1,0,0,0,1,0,1]
[{"$f":"IF(Base!A935=\"\",\"\",Base!A935)","v":"IZ028820B"},null,null,null,null,null,null,null,null,null,null,null,null,null,null,null,null,null,null,null,null,1,null,null,null,1,0,1]
[110806,null,null,null,null,null,null,null,null,null,null,null,null,null,null,null,null,null,null,null,null,1,null,null,null,1,0,1]
[{"$f":"IF(Base!A937=\"\",\"\",Base!A937)","v":"PIMA717PHD"},null,null,null,null,null,null,null,null,null,null,null,null,null,null,null,null,null,null,null,null,10,10,null,null,10,10,0]
[{"$f":"IF(Base!A938=\"\",\"\",Base!A938)","v":"ISU285L"},null,null,null,null,null,null,null,null,null,null,null,null,null,null,null,null,null,null,null,null,2,null,null,null,2,0,2]
[{"$f":"IF(Base!A939=\"\",\"\",Base!A939)","v":"ISU285R"},null,null,null,null,null,null,null,null,null,null,null,null,null,null,null,null,null,null,null,null,2,null,null,null,2,0,2]
[{"$f":"IF(Base!A940=\"\",\"\",Base!A940)","v":"IBD-1373"},null,null,null,null,null,null,null,null,null,null,null,null,null,null,null,null,null,null,null,null,6,2,null,null,6,2,4]
["AX192766",null,null,null,null,null,null,null,null,null,null,null,null,null,null,null,null,null,null,null,null,1,null,null,null,1,0,1]
["A379RU30MM",null,null,null,null,null,null,null,null,null,null,null,null,null,null,null,null,null,null,null,null,1,null,null,null,1,0,1]
["A390R030MM",null,null,null,null,null,null,null,null,null,null,null,null,null,null,null,null,null,null,null,null,1,null,null,null,1,0,1]
[821350,null,null,null,null,null,null,null,null,null,null,null,null,null,null,null,null,null,null,null,null,1,null,null,null,1,0,1]
["ARCEBMIM140-0,00",null,null,null,null,null,null,null,null,null,null,null,null,null,null,null,null,null,null,null,null,2,null,null,null,2,0,2]
["ARCEBMIM140-0,50",null,null,null,null,null,null,null,null,null,null,null,null,null,null,null,null,null,null,null,null,2,1,null,null,2,1,1]
["8-97381456",null,null,null,null,null,null,null,null,null,null,null,null,null,null,null,null,null,null,null,null,5,null,null,null,5,0,5]
[153010,null,null,null,null,null,null,null,null,null,null,null,null,null,null,null,null,null,null,null,null,6,null,null,null,6,0,6]
["879117254-1",null,null,null,null,null,null,null,null,null,null,null,null,null,null,null,null,null,null,null,null,1,null,null,null,1,0,1]
[894311222,null,null,null,null,null,null,null,null,null,null,null,null,null,null,null,null,null,null,null,null,1,null,null,null,1,0,1]
["8-94325768",null,null,null,null,null,null,null,null,null,null,null,null,null,null,null,null,null,null,null,null,1,1,null,null,1,1,0]
["PA-137AF",null,null,null,null,null,null,null,null,null,null,null,null,null,null,null,null,null,null,null,null,1,null,null,null,1,0,1]
["FT1506006R",null,null,null,null,null,null,null,null,null,null,null,null,null,null,null,null,null,null,null,null,2,1,null,null,2,1,1]
[2058281146,null,null,null,null,null,null,null,null,null,null,null,null,null,null,null,null,null,null,null,null,null,null,null,null,0,0,0]
[20587810294,null,null,null,null,null,null,null,null,null,null,null,null,null,null,null,null,null,null,null,null,1,null,null,null,1,0,1]
["MA880183",null,null,null,null,null,null,null,null,null,null,null,null,null,null,null,null,null,null,null,null,1,null,null,null,{"$f":"IF(A958=\"\",\"\",SUM(B958,D958,F958,H958,J958,L958,N958,P958,R958,T958,V958,X958))","v":1},{"$f":"IF(A958=\"\",\"\",SUM(C958,E958,G958,I958,K958,M958,O958,Q958,S958,U958,W958,Y958))","v":0},{"$f":"IF(A958=\"\",\"\",Z958-AA958)","v":1}]
["MA870169",null,null,null,null,null,null,null,null,null,null,null,null,null,null,null,null,null,null,null,null,1,null,null,null,1,0,1]
["5-87831-081-0",null,null,null,null,null,null,null,null,null,null,null,null,null,null,null,null,null,null,null,null,10,null,null,null,10,0,10]
["VC-500",null,null,null,null,null,null,null,null,null,null,null,null,null,null,null,null,null,null,null,null,1,1,null,null,1,1,0]
[109,null,null,null,null,null,null,null,null,null,null,null,null,null,null,null,null,null,null,null,null,1,null,null,null,1,0,1]
["8-94463-830",null,null,null,null,null,null,null,null,null,null,null,null,null,null,null,null,null,null,null,null,2,null,null,null,2,0,2]
["UJ06-66-122",null,null,null,null,null,null,null,null,null,null,null,null,null,null,null,null,null,null,null,null,3,1,null,null,3,1,2]
["MD050312",null,null,null,null,null,null,null,null,null,null,null,null,null,null,null,null,null,null,null,null,23,10,null,null,23,10,13]
["U187",null,null,null,null,null,null,null,null,null,null,null,null,null,null,null,null,null,null,null,null,9,3,null,null,9,3,6]
["RD01104",null,null,null,null,null,null,null,null,null,null,null,null,null,null,null,null,null,null,null,null,5,null,null,null,5,0,5]
[3556,null,null,null,null,null,null,null,null,null,null,null,null,null,null,null,null,null,null,null,null,3,null,null,null,3,0,3]
[3557,null,null,null,null,null,null,null,null,null,null,null,null,null,null,null,null,null,null,null,null,3,null,null,null,3,0,3]
["I044",null,null,null,null,null,null,null,null,null,null,null,null,null,null,null,null,null,null,null,null,10,null,null,null,10,0,10]
["ISC572086U",null,null,null,null,null,null,null,null,null,null,null,null,null,null,null,null,null,null,null,null,1,null,null,null,1,0,1]
["UHY1-33-29Z",null,null,null,null,null,null,null,null,null,null,null,null,null,null,null,null,null,null,null,null,2,null,null,null,2,0,2]
["UMY1-33-29",null,null,null,null,null,null,null,null,null,null,null,null,null,null,null,null,null,null,null,null,2,null,null,null,2,0,2]
["IZ20011BS",null,null,null,null,null,null,null,null,null,null,null,null,null,null,null,null,null,null,null,null,1,null,null,null,1,0,1]
[2069,null,null,null,null,null,null,null,null,null,null,null,null,null,null,null,null,null,null,null,null,4,null,null,null,4,0,4]
[139541,null,null,null,null,null,null,null,null,null,null,null,null,null,null,null,null,null,null,null,null,2,null,null,null,2,0,2]
["MB334-22J",null,null,null,null,null,null,null,null,null,null,null,null,null,null,null,null,null,null,null,null,2,null,null,null,2,0,2]
["MB334-22I",null,null,null,null,null,null,null,null,null,null,null,null,null,null,null,null,null,null,null,null,2,null,null,null,2,0,2]
["8-94434-977",null,null,null,null,null,null,null,null,null,null,null,null,null,null,null,null,null,null,null,null,2,null,null,null,2,0,2]
["8-94434-978",null,null,null,null,null,null,null,null,null,null,null,null,null,null,null,null,null,null,null,null,2,null,null,null,2,0,2]
[154148,null,null,null,null,null,null,null,null,null,null,null,null,null,null,null,null,null,null,null,null,1,null,null,null,1,0,1]
["HD15-5005",null,null,null,null,null,null,null,null,null,null,null,null,null,null,null,null,null,null,null,null,8,null,null,null,8,0,8]
["215-19D4-AERH",null,null,null,null,null,null,null,null,null,null,null,null,null,null,null,null,null,null,null,null,1,1,null,null,1,1,0]
["2201A01",null,null,null,null,null,null,null,null,null,null,null,null,null,null,null,null,null,null,null,null,200,null,null,null,200,0,200]
[470180,null,null,null,null,null,null,null,null,null,null,null,null,null,null,null,null,null,null,null,null,1,null,null,null,1,0,1]
[190910,null,null,null,null,null,null,null,null,null,null,null,null,null,null,null,null,null,null,null,null,1,null,null,null,1,0,1]
[4604444,null,null,null,null,null,null,null,null,null,null,null,null,null,null,null,null,null,null,null,null,1,null,null,null,1,0,1]
[4604443,null,null,null,null,null,null,null,null,null,null,null,null,null,null,null,null,null,null,null,null,1,1,null,null,1,1,0]
["8-97039190-3",null,null,null,null,null,null,null,null,null,null,null,null,null,null,null,null,null,null,null,null,1,null,null,null,1,0,1]
["8-94467328",null,null,null,null,null,null,null,null,null,null,null,null,null,null,null,null,null,null,null,null,2,null,null,null,2,0,2]
["13011-54100",null,null,null,null,null,null,null,null,null,null,null,null,null,null,null,null,null,null,null,null,1,null,null,null,1,0,1]
["TF62",null,null,null,null,null,null,null,null,null,null,null,null,null,null,null,null,null,null,null,null,12,null,null,1,12,1,11]
["I164",null,null,null,null,null,null,null,null,null,null,null,null,null,null,null,null,null,null,null,null,2,null,null,null,2,0,2]
["2010TH2042-1G",null,null,null,null,null,null,null,null,null,null,null,null,null,null,null,null,null,null,null,null,2,null,null,null,2,0,2]
["27TH-2042CG",null,null,null,null,null,null,null,null,null,null,null,null,null,null,null,null,null,null,null,null,1,null,null,null,1,0,1]
[20897921857,null,null,null,null,null,null,null,null,null,null,null,null,null,null,null,null,null,null,null,null,2,2,null,null,2,2,0]
["I114",null,null,null,null,null,null,null,null,null,null,null,null,null,null,null,null,null,null,null,null,5,5,null,null,5,5,0]
["MG02-02044",null,null,null,null,null,null,null,null,null,null,null,null,null,null,null,null,null,null,null,null,5,2,null,null,5,2,3]
["2040VS6409",null,null,null,null,null,null,null,null,null,null,null,null,null,null,null,null,null,null,null,null,5,null,null,null,5,0,5]
["PI45 9V",null,null,null,null,null,null,null,null,null,null,null,null,null,null,null,null,null,null,null,null,50,null,null,10,50,10,40]
["148688G",null,null,null,null,null,null,null,null,null,null,null,null,null,null,null,null,null,null,null,null,2,null,null,null,2,0,2]
["O-MD303972",null,null,null,null,null,null,null,null,null,null,null,null,null,null,null,null,null,null,null,null,2,null,null,null,2,0,2]
["IZ07067GA7",null,null,null,null,null,null,null,null,null,null,null,null,null,null,null,null,null,null,null,null,null,null,1,1,1,1,0]
["1ATAK",null,null,null,null,null,null,null,null,null,null,null,null,null,null,null,null,null,null,null,null,null,null,30,null,30,0,30]
[2162,null,null,null,null,null,null,null,null,null,null,null,null,null,null,null,null,null,null,null,null,null,null,2,null,2,0,2]
["8-94435-140",null,null,null,null,null,null,null,null,null,null,null,null,null,null,null,null,null,null,null,null,null,null,1,null,1,0,1]
["ISC506115U",null,null,null,null,null,null,null,null,null,null,null,null,null,null,null,null,null,null,null,null,null,null,1,null,1,0,1]
["ISK2047",null,null,null,null,null,null,null,null,null,null,null,null,null,null,null,null,null,null,null,null,null,null,1,null,1,0,1]
[6253029000,null,null,null,null,null,null,null,null,null,null,null,null,null,null,null,null,null,null,null,null,null,null,1,null,1,0,1]
["HD19-1001",null,null,null,null,null,null,null,null,null,null,null,null,null,null,null,null,null,null,null,null,null,null,1,null,1,0,1]
["HD19-1001-353 R",null,null,null,null,null,null,null,null,null,null,null,null,null,null,null,null,null,null,null,null,null,null,1,null,1,0,1]
["ISU282L",null,null,null,null,null,null,null,null,null,null,null,null,null,null,null,null,null,null,null,null,null,null,1,null,1,0,1]
["ISU282R",null,null,null,null,null,null,null,null,null,null,null,null,null,null,null,null,null,null,null,null,null,null,1,null,1,0,1]
["ISU283L",null,null,null,null,null,null,null,null,null,null,null,null,null,null,null,null,null,null,null,null,null,null,1,null,1,0,1]
["ISU283R",null,null,null,null,null,null,null,null,null,null,null,null,null,null,null,null,null,null,null,null,null,null,1,null,1,0,1]
["Z102",null,null,null,null,null,null,null,null,null,null,null,null,null,null,null,null,null,null,null,null,null,null,2,null,2,0,2]
["UH71-33-061B",null,null,null,null,null,null,null,null,null,null,null,null,null,null,null,null,null,null,null,null,null,null,1,null,1,0,1]
["UH71-26-630A",null,null,null,null,null,null,null,null,null,null,null,null,null,null,null,null,null,null,null,null,null,null,1,null,1,0,1]
["UH71-26-640A",null,null,null,null,null,null,null,null,null,null,null,null,null,null,null,null,null,null,null,null,null,null,1,null,{"$f":"IF(A1019=\"\",\"\",SUM(B1019,D1019,F1019,H1019,J1019,L1019,N1019,P1019,R1019,T1019,V1019,X1019))","v":1},{"$f":"IF(A1019=\"\",\"\",SUM(C1019,E1019,G1019,I1019,K1019,M1019,O1019,Q1019,S1019,U1019,W1019,Y1019))","v":0},{"$f":"IF(A1019=\"\",\"\",Z1019-AA1019)","v":1}]
["WL02-16-520A",null,null,null,null,null,null,null,null,null,null,null,null,null,null,null,null,null,null,null,null,null,null,1,null,1,0,1]
["MD972001",null,null,null,null,null,null,null,null,null,null,null,null,null,null,null,null,null,null,null,null,null,null,null,null,0,0,0]
[{"$f":"IF(Base!A1022=\"\",\"\",Base!A1022)","v":""},null,null,null,null,null,null,null,null,null,null,null,null,null,null,null,null,null,null,null,null,null,null,null,null,"","",""]
[{"$f":"IF(Base!A1023=\"\",\"\",Base!A1023)","v":""},null,null,null,null,null,null,null,null,null,null,null,null,null,null,null,null,null,null,null,null,null,null,null,null,"","",""]
[{"$f":"IF(Base!A1024=\"\",\"\",Base!A1024)","v":""},null,null,null,null,null,null,null,null,null,null,null,null,null,null,null,null,null,null,null,null,null,null,null,null,"","",""]
[{"$f":"IF(Base!A1025=\"\",\"\",Base!A1025)","v":""},null,null,null,null,null,null,null,null,null,null,null,null,null,null,null,null,null,null,null,null,null,null,null,null,"","",""]
[{"$f":"IF(Base!A1026=\"\",\"\",Base!A1026)","v":""},null,null,null,null,null,null,null,null,null,null,null,null,null,null,null,null,null,null,null,null,null,null,null,null,"","",""]
[{"$f":"IF(Base!A1027=\"\",\"\",Base!A1027)","v":""},null,null,null,null,null,null,null,null,null,null,null,null,null,null,null,null,null,null,null,null,null,null,null,null,"","",""]
[{"$f":"IF(Base!A1028=\"\",\"\",Base!A1028)","v":""},null,null,null,null,null,null,null,null,null,null,null,null,null,null,null,null,null,null,null,null,null,null,null,null,"","",""]
[{"$f":"IF(Base!A1029=\"\",\"\",Base!A1029)","v":""},null,null,null,null,null,null,null,null,null,null,null,null,null,null,null,null,null,null,null,null,null,null,null,null,"","",""]
[{"$f":"IF(Base!A1030=\"\",\"\",Base!A1030)","v":""},null,null,null,null,null,null,null,null,null,null,null,null,null,null,null,null,null,null,null,null,null,null,null,null,"","",""]
[{"$f":"IF(Base!A1031=\"\",\"\",Base!A1031)","v":""},null,null,null,null,null,null,null,null,null,null,null,null,null,null,null,null,null,null,null,null,null,null,null,null,"","",""]
[{"$f":"IF(Base!A1032=\"\",\"\",Base!A1032)","v":""},null,null,null,null,null,null,null,null,null,null,null,null,null,null,null,null,null,null,null,null,null,null,null,null,"","",""]
[{"$f":"IF(Base!A1033=\"\",\"\",Base!A1033)","v":""},null,null,null,null,null,null,null,null,null,null,null,null,null,null,null,null,null,null,null,null,null,null,null,null,"","",""]
[{"$f":"IF(Base!A1034=\"\",\"\",Base!A1034)","v":""},null,null,null,null,null,null,null,null,null,null,null,null,null,null,null,null,null,null,null,null,null,null,null,null,"","",""]
[{"$f":"IF(Base!A1035=\"\",\"\",Base!A1035)","v":""},null,null,null,null,null,null,null,null,null,null,null,null,null,null,null,null,null,null,null,null,null,null,null,null,"","",""]
[{"$f":"IF(Base!A1036=\"\",\"\",Base!A1036)","v":""},null,null,null,null,null,null,null,null,null,null,null,null,null,null,null,null,null,null,null,null,null,null,null,null,"","",""]
[{"$f":"IF(Base!A1037=\"\",\"\",Base!A1037)","v":""},null,null,null,null,null,null,null,null,null,null,null,null,null,null,null,null,null,null,null,null,null,null,null,null,"","",""]
[{"$f":"IF(Base!A1038=\"\",\"\",Base!A1038)","v":""},null,null,null,null,null,null,null,null,null,null,null,null,null,null,null,null,null,null,null,null,null,null,null,null,"","",""]
[{"$f":"IF(Base!A1039=\"\",\"\",Base!A1039)","v":""},null,null,null,null,null,null,null,null,null,null,null,null,null,null,null,null,null,null,null,null,null,null,null,null,"","",""]
[{"$f":"IF(Base!A1040=\"\",\"\",Base!A1040)","v":""},null,null,null,null,null,null,null,null,null,null,null,null,null,null,null,null,null,null,null,null,null,null,null,null,"","",""]
[{"$f":"IF(Base!A1041=\"\",\"\",Base!A1041)","v":""},null,null,null,null,null,null,null,null,null,null,null,null,null,null,null,null,null,null,null,null,null,null,null,null,"","",""]
[{"$f":"IF(Base!A1042=\"\",\"\",Base!A1042)","v":""},null,null,null,null,null,null,null,null,null,null,null,null,null,null,null,null,null,null,null,null,null,null,null,null,"","",""]
[{"$f":"IF(Base!A1043=\"\",\"\",Base!A1043)","v":""},null,null,null,null,null,null,null,null,null,null,null,null,null,null,null,null,null,null,null,null,null,null,null,null,"","",""]
[{"$f":"IF(Base!A1044=\"\",\"\",Base!A1044)","v":""},null,null,null,null,null,null,null,null,null,null,null,null,null,null,null,null,null,null,null,null,null,null,null,null,"","",""]
[{"$f":"IF(Base!A1045=\"\",\"\",Base!A1045)","v":""},null,null,null,null,null,null,null,null,null,null,null,null,null,null,null,null,null,null,null,null,null,null,null,null,"","",""]
[{"$f":"IF(Base!A1046=\"\",\"\",Base!A1046)","v":""},null,null,null,null,null,null,null,null,null,null,null,null,null,null,null,null,null,null,null,null,null,null,null,null,"","",""]
[{"$f":"IF(Base!A1047=\"\",\"\",Base!A1047)","v":""},null,null,null,null,null,null,null,null,null,null,null,null,null,null,null,null,null,null,null,null,null,null,null,null,"","",""]
[{"$f":"IF(Base!A1048=\"\",\"\",Base!A1048)","v":""},null,null,null,null,null,null,null,null,null,null,null,null,null,null,null,null,null,null,null,null,null,null,null,null,"","",""]
[{"$f":"IF(Base!A1049=\"\",\"\",Base!A1049)","v":""},null,null,null,null,null,null,null,null,null,null,null,null,null,null,null,null,null,null,null,null,null,null,null,null,"","",""]
[{"$f":"IF(Base!A1050=\"\",\"\",Base!A1050)","v":""},null,null,null,null,null,null,null,null,null,null,null,null,null,null,null,null,null,null,null,null,null,null,null,null,"","",""]
[{"$f":"IF(Base!A1051=\"\",\"\",Base!A1051)","v":""},null,null,null,null,null,null,null,null,null,null,null,null,null,null,null,null,null,null,null,null,null,null,null,null,"","",""]
[{"$f":"IF(Base!A1052=\"\",\"\",Base!A1052)","v":""},null,null,null,null,null,null,null,null,null,null,null,null,null,null,null,null,null,null,null,null,null,null,null,null,"","",""]
[{"$f":"IF(Base!A1053=\"\",\"\",Base!A1053)","v":""},null,null,null,null,null,null,null,null,null,null,null,null,null,null,null,null,null,null,null,null,null,null,null,null,"","",""]
[{"$f":"IF(Base!A1054=\"\",\"\",Base!A1054)","v":""},null,null,null,null,null,null,null,null,null,null,null,null,null,null,null,null,null,null,null,null,null,null,null,null,"","",""]
[{"$f":"IF(Base!A1055=\"\",\"\",Base!A1055)","v":""},null,null,null,null,null,null,null,null,null,null,null,null,null,null,null,null,null,null,null,null,null,null,null,null,"","",""]
[{"$f":"IF(Base!A1056=\"\",\"\",Base!A1056)","v":""},null,null,null,null,null,null,null,null,null,null,null,null,null,null,null,null,null,null,null,null,null,null,null,null,"","",""]
[{"$f":"IF(Base!A1057=\"\",\"\",Base!A1057)","v":""},null,null,null,null,null,null,null,null,null,null,null,null,null,null,null,null,null,null,null,null,null,null,null,null,"","",""]
[{"$f":"IF(Base!A1058=\"\",\"\",Base!A1058)","v":""},null,null,null,null,null,null,null,null,null,null,null,null,null,null,null,null,null,null,null,null,null,null,null,null,"","",""]
[{"$f":"IF(Base!A1059=\"\",\"\",Base!A1059)","v":""},null,null,null,null,null,null,null,null,null,null,null,null,null,null,null,null,null,null,null,null,null,null,null,null,"","",""]
[{"$f":"IF(Base!A1060=\"\",\"\",Base!A1060)","v":""},null,null,null,null,null,null,null,null,null,null,null,null,null,null,null,null,null,null,null,null,null,null,null,null,"","",""]
[{"$f":"IF(Base!A1061=\"\",\"\",Base!A1061)","v":""},null,null,null,null,null,null,null,null,null,null,null,null,null,null,null,null,null,null,null,null,null,null,null,null,"","",""]
[{"$f":"IF(Base!A1062=\"\",\"\",Base!A1062)","v":""},null,null,null,null,null,null,null,null,null,null,null,null,null,null,null,null,null,null,null,null,null,null,null,null,"","",""]
[{"$f":"IF(Base!A1063=\"\",\"\",Base!A1063)","v":""},null,null,null,null,null,null,null,null,null,null,null,null,null,null,null,null,null,null,null,null,null,null,null,null,"","",""]
[{"$f":"IF(Base!A1064=\"\",\"\",Base!A1064)","v":""},null,null,null,null,null,null,null,null,null,null,null,null,null,null,null,null,null,null,null,null,null,null,null,null,"","",""]
[{"$f":"IF(Base!A1065=\"\",\"\",Base!A1065)","v":""},null,null,null,null,null,null,null,null,null,null,null,null,null,null,null,null,null,null,null,null,null,null,null,null,"","",""]
[{"$f":"IF(Base!A1066=\"\",\"\",Base!A1066)","v":""},null,null,null,null,null,null,null,null,null,null,null,null,null,null,null,null,null,null,null,null,null,null,null,null,"","",""]
[{"$f":"IF(Base!A1067=\"\",\"\",Base!A1067)","v":""},null,null,null,null,null,null,null,null,null,null,null,null,null,null,null,null,null,null,null,null,null,null,null,null,"","",""]
[{"$f":"IF(Base!A1068=\"\",\"\",Base!A1068)","v":""},null,null,null,null,null,null,null,null,null,null,null,null,null,null,null,null,null,null,null,null,null,null,null,null,"","",""]
[{"$f":"IF(Base!A1069=\"\",\"\",Base!A1069)","v":""},null,null,null,null,null,null,null,null,null,null,null,null,null,null,null,null,null,null,null,null,null,null,null,null,"","",""]
[{"$f":"IF(Base!A1070=\"\",\"\",Base!A1070)","v":""},null,null,null,null,null,null,null,null,null,null,null,null,null,null,null,null,null,null,null,null,null,null,null,null,"","",""]
[{"$f":"IF(Base!A1071=\"\",\"\",Base!A1071)","v":""},null,null,null,null,null,null,null,null,null,null,null,null,null,null,null,null,null,null,null,null,null,null,null,null,"","",""]
[{"$f":"IF(Base!A1072=\"\",\"\",Base!A1072)","v":""},null,null,null,null,null,null,null,null,null,null,null,null,null,null,null,null,null,null,null,null,null,null,null,null,"","",""]
[{"$f":"IF(Base!A1073=\"\",\"\",Base!A1073)","v":""},null,null,null,null,null,null,null,null,null,null,null,null,null,null,null,null,null,null,null,null,null,null,null,null,"","",""]
[{"$f":"IF(Base!A1074=\"\",\"\",Base!A1074)","v":""},null,null,null,null,null,null,null,null,null,null,null,null,null,null,null,null,null,null,null,null,null,null,null,null,"","",""]
[{"$f":"IF(Base!A1075=\"\",\"\",Base!A1075)","v":""},null,null,null,null,null,null,null,null,null,null,null,null,null,null,null,null,null,null,null,null,null,null,null,null,"","",""]
[{"$f":"IF(Base!A1076=\"\",\"\",Base!A1076)","v":""},null,null,null,null,null,null,null,null,null,null,null,null,null,null,null,null,null,null,null,null,null,null,null,null,"","",""]
[{"$f":"IF(Base!A1077=\"\",\"\",Base!A1077)","v":""},null,null,null,null,null,null,null,null,null,null,null,null,null,null,null,null,null,null,null,null,null,null,null,null,"","",""]
[{"$f":"IF(Base!A1078=\"\",\"\",Base!A1078)","v":""},null,null,null,null,null,null,null,null,null,null,null,null,null,null,null,null,null,null,null,null,null,null,null,null,"","",""]
[{"$f":"IF(Base!A1079=\"\",\"\",Base!A1079)","v":""},null,null,null,null,null,null,null,null,null,null,null,null,null,null,null,null,null,null,null,null,null,null,null,null,"","",""]
[{"$f":"IF(Base!A1080=\"\",\"\",Base!A1080)","v":""},null,null,null,null,null,null,null,null,null,null,null,null,null,null,null,null,null,null,null,null,null,null,null,null,"","",""]
[{"$f":"IF(Base!A1081=\"\",\"\",Base!A1081)","v":""},null,null,null,null,null,null,null,null,null,null,null,null,null,null,null,null,null,null,null,null,null,null,null,null,"","",""]
[{"$f":"IF(Base!A1082=\"\",\"\",Base!A1082)","v":""},null,null,null,null,null,null,null,null,null,null,null,null,null,null,null,null,null,null,null,null,null,null,null,null,"","",""]
[{"$f":"IF(Base!A1083=\"\",\"\",Base!A1083)","v":""},null,null,null,null,null,null,null,null,null,null,null,null,null,null,null,null,null,null,null,null,null,null,null,null,{"$f":"IF(A1083=\"\",\"\",SUM(B1083,D1083,F1083,H1083,J1083,L1083,N1083,P1083,R1083,T1083,V1083,X1083))","v":""},{"$f":"IF(A1083=\"\",\"\",SUM(C1083,E1083,G1083,I1083,K1083,M1083,O1083,Q1083,S1083,U1083,W1083,Y1083))","v":""},{"$f":"IF(A1083=\"\",\"\",Z1083-AA1083)","v":""}]
[{"$f":"IF(Base!A1084=\"\",\"\",Base!A1084)","v":""},null,null,null,null,null,null,null,null,null,null,null,null,null,null,null,null,null,null,null,null,null,null,null,null,"","",""]
[{"$f":"IF(Base!A1085=\"\",\"\",Base!A1085)","v":""},null,null,null,null,null,null,null,null,null,null,null,null,null,null,null,null,null,null,null,null,null,null,null,null,"","",""]
[{"$f":"IF(Base!A1086=\"\",\"\",Base!A1086)","v":""},null,null,null,null,null,null,null,null,null,null,null,null,null,null,null,null,null,null,null,null,null,null,null,null,"","",""]
[{"$f":"IF(Base!A1087=\"\",\"\",Base!A1087)","v":""},null,null,null,null,null,null,null,null,null,null,null,null,null,null,null,null,null,null,null,null,null,null,null,null,"","",""]
[{"$f":"IF(Base!A1088=\"\",\"\",Base!A1088)","v":""},null,null,null,null,null,null,null,null,null,null,null,null,null,null,null,null,null,null,null,null,null,null,null,null,"","",""]
[{"$f":"IF(Base!A1089=\"\",\"\",Base!A1089)","v":""},null,null,null,null,null,null,null,null,null,null,null,null,null,null,null,null,null,null,null,null,null,null,null,null,"","",""]
[{"$f":"IF(Base!A1090=\"\",\"\",Base!A1090)","v":""},null,null,null,null,null,null,null,null,null,null,null,null,null,null,null,null,null,null,null,null,null,null,null,null,"","",""]
[{"$f":"IF(Base!A1091=\"\",\"\",Base!A1091)","v":""},null,null,null,null,null,null,null,null,null,null,null,null,null,null,null,null,null,null,null,null,null,null,null,null,"","",""]
[{"$f":"IF(Base!A1092=\"\",\"\",Base!A1092)","v":""},null,null,null,null,null,null,null,null,null,null,null,null,null,null,null,null,null,null,null,null,null,null,null,null,"","",""]
[{"$f":"IF(Base!A1093=\"\",\"\",Base!A1093)","v":""},null,null,null,null,null,null,null,null,null,null,null,null,null,null,null,null,null,null,null,null,null,null,null,null,"","",""]
[{"$f":"IF(Base!A1094=\"\",\"\",Base!A1094)","v":""},null,null,null,null,null,null,null,null,null,null,null,null,null,null,null,null,null,null,null,null,null,null,null,null,"","",""]
[{"$f":"IF(Base!A1095=\"\",\"\",Base!A1095)","v":""},null,null,null,null,null,null,null,null,null,null,null,null,null,null,null,null,null,null,null,null,null,null,null,null,"","",""]
[{"$f":"IF(Base!A1096=\"\",\"\",Base!A1096)","v":""},null,null,null,null,null,null,null,null,null,null,null,null,null,null,null,null,null,null,null,null,null,null,null,null,"","",""]
[{"$f":"IF(Base!A1097=\"\",\"\",Base!A1097)","v":""},null,null,null,null,null,null,null,null,null,null,null,null,null,null,null,null,null,null,null,null,null,null,null,null,"","",""]
[{"$f":"IF(Base!A1098=\"\",\"\",Base!A1098)","v":""},null,null,null,null,null,null,null,null,null,null,null,null,null,null,null,null,null,null,null,null,null,null,null,null,"","",""]
[{"$f":"IF(Base!A1099=\"\",\"\",Base!A1099)","v":""},null,null,null,null,null,null,null,null,null,null,null,null,null,null,null,null,null,null,null,null,null,null,null,null,"","",""]
[{"$f":"IF(Base!A1100=\"\",\"\",Base!A1100)","v":""},null,null,null,null,null,null,null,null,null,null,null,null,null,null,null,null,null,null,null,null,null,null,null,null,"","",""]
[{"$f":"IF(Base!A1101=\"\",\"\",Base!A1101)","v":""},null,null,null,null,null,null,null,null,null,null,null,null,null,null,null,null,null,null,null,null,null,null,null,null,"","",""]
[{"$f":"IF(Base!A1102=\"\",\"\",Base!A1102)","v":""},null,null,null,null,null,null,null,null,null,null,null,null,null,null,null,null,null,null,null,null,null,null,null,null,"","",""]
[{"$f":"IF(Base!A1103=\"\",\"\",Base!A1103)","v":""},null,null,null,null,null,null,null,null,null,null,null,null,null,null,null,null,null,null,null,null,null,null,null,null,"","",""]
[{"$f":"IF(Base!A1104=\"\",\"\",Base!A1104)","v":""},null,null,null,null,null,null,null,null,null,null,null,null,null,null,null,null,null,null,null,null,null,null,null,null,"","",""]
[{"$f":"IF(Base!A1105=\"\",\"\",Base!A1105)","v":""},null,null,null,null,null,null,null,null,null,null,null,null,null,null,null,null,null,null,null,null,null,null,null,null,"","",""]
[{"$f":"IF(Base!A1106=\"\",\"\",Base!A1106)","v":""},null,null,null,null,null,null,null,null,null,null,null,null,null,null,null,null,null,null,null,null,null,null,null,null,"","",""]
[{"$f":"IF(Base!A1107=\"\",\"\",Base!A1107)","v":""},null,null,null,null,null,null,null,null,null,null,null,null,null,null,null,null,null,null,null,null,null,null,null,null,"","",""]
[{"$f":"IF(Base!A1108=\"\",\"\",Base!A1108)","v":""},null,null,null,null,null,null,null,null,null,null,null,null,null,null,null,null,null,null,null,null,null,null,null,null,"","",""]
[{"$f":"IF(Base!A1109=\"\",\"\",Base!A1109)","v":""},null,null,null,null,null,null,null,null,null,null,null,null,null,null,null,null,null,null,null,null,null,null,null,null,"","",""]
[{"$f":"IF(Base!A1110=\"\",\"\",Base!A1110)","v":""},null,null,null,null,null,null,null,null,null,null,null,null,null,null,null,null,null,null,null,null,null,null,null,null,"","",""]
[{"$f":"IF(Base!A1111=\"\",\"\",Base!A1111)","v":""},null,null,null,null,null,null,null,null,null,null,null,null,null,null,null,null,null,null,null,null,null,null,null,null,"","",""]
[{"$f":"IF(Base!A1112=\"\",\"\",Base!A1112)","v":""},null,null,null,null,null,null,null,null,null,null,null,null,null,null,null,null,null,null,null,null,null,null,null,null,"","",""]
[{"$f":"IF(Base!A1113=\"\",\"\",Base!A1113)","v":""},null,null,null,null,null,null,null,null,null,null,null,null,null,null,null,null,null,null,null,null,null,null,null,null,"","",""]
[{"$f":"IF(Base!A1114=\"\",\"\",Base!A1114)","v":""},null,null,null,null,null,null,null,null,null,null,null,null,null,null,null,null,null,null,null,null,null,null,null,null,"","",""]
[{"$f":"IF(Base!A1115=\"\",\"\",Base!A1115)","v":""},null,null,null,null,null,null,null,null,null,null,null,null,null,null,null,null,null,null,null,null,null,null,null,null,"","",""]
[{"$f":"IF(Base!A1116=\"\",\"\",Base!A1116)","v":""},null,null,null,null,null,null,null,null,null,null,null,null,null,null,null,null,null,null,null,null,null,null,null,null,"","",""]
[{"$f":"IF(Base!A1117=\"\",\"\",Base!A1117)","v":""},null,null,null,null,null,null,null,null,null,null,null,null,null,null,null,null,null,null,null,null,null,null,null,null,"","",""]
[{"$f":"IF(Base!A1118=\"\",\"\",Base!A1118)","v":""},null,null,null,null,null,null,null,null,null,null,null,null,null,null,null,null,null,null,null,null,null,null,null,null,"","",""]
[{"$f":"IF(Base!A1119=\"\",\"\",Base!A1119)","v":""},null,null,null,null,null,null,null,null,null,null,null,null,null,null,null,null,null,null,null,null,null,null,null,null,"","",""]
[{"$f":"IF(Base!A1120=\"\",\"\",Base!A1120)","v":""},null,null,null,null,null,null,null,null,null,null,null,null,null,null,null,null,null,null,null,null,null,null,null,null,"","",""]
[{"$f":"IF(Base!A1121=\"\",\"\",Base!A1121)","v":""},null,null,null,null,null,null,null,null,null,null,null,null,null,null,null,null,null,null,null,null,null,null,null,null,"","",""]
[{"$f":"IF(Base!A1122=\"\",\"\",Base!A1122)","v":""},null,null,null,null,null,null,null,null,null,null,null,null,null,null,null,null,null,null,null,null,null,null,null,null,"","",""]
[{"$f":"IF(Base!A1123=\"\",\"\",Base!A1123)","v":""},null,null,null,null,null,null,null,null,null,null,null,null,null,null,null,null,null,null,null,null,null,null,null,null,"","",""]
[{"$f":"IF(Base!A1124=\"\",\"\",Base!A1124)","v":""},null,null,null,null,null,null,null,null,null,null,null,null,null,null,null,null,null,null,null,null,null,null,null,null,"","",""]
[{"$f":"IF(Base!A1125=\"\",\"\",Base!A1125)","v":""},null,null,null,null,null,null,null,null,null,null,null,null,null,null,null,null,null,null,null,null,null,null,null,null,"","",""]

{"sheet":"Base","index":5,"n_rows":1019,"n_cols":16,"rows_kept":1019,"cut":false,"hidden":false,"merged":[[4,6,11,6]]}
["Référence Produits","Famille","Désignation","Fournisseur","prix",null,null,null,null,null,"utilisateur","mdp",null,null,null,2016]
["IZ028802C",null,"a",null,null,null,null,null,null,null,"admin","****",null,null,null,2016]
["IZ029702A",null,"aa"]
["IZ020602AR",null,"Aaacb"]
["IZ029702B",null,"aab",null,null,null,"A utiliser uniquement si vous avez rajouté de nouvelles Références Produits en Col C"]
["IZ020202AR",null,"aabb"]
["IZ020202AL",null,"aabc"]
["IZ028802D",null,"ab"]
["IZ020602AL",null,"AB"]
[" IZ020602EL"]
["IZ020602ER"]
["IZ020214A"]
["IZ020614A"]
["IZ028114B"]
["897367044-0296"]
[8972358672]
["IZ028812C"]
["IZ028812D"]
["IZ028812A"]
["IZ028812B"]
["IZ020212AL"]
["IZ020212AR"]
[20897387346]
["278-97308868",null,"z"]
[27894226829,null,"zz"]
[8971103140,null,"az"]
[8970438802,null,"abz"]
["IZ029906A"]
["IZ029906B"]
["IZ028806A"]
["IZ028806B"]
["20IZ400238"]
["IZ029709A"]
["IZ029709B"]
["IZ028809A"]
["IZ028809B"]
["IZ41007AL"]
["IZ41007AR"]
["IZ028102A"]
["IZ028102B"]
["RD01090"]
["RD01095"]
["RD01097"]
["RD01101"]
["RD01146"]
["RD02069"]
["RD05007"]
["RD05008"]
["RD12057"]
["RD02127R"]
["27RD01069D"]
[1594171]
["20TH2088D"]
["20YT-7216DC"]
[2039405]
["2080PG405"]
[20587810146]
["208094318910"]
["MG04-01131"]
["MG04-01174"]
["MG04-01191"]
["MG04-01271"]
["MG05-01001"]
["MG05-01025"]
["MG05-01032"]
["MG05-01087"]
["MG05-01095"]
["MG06-01002-353"]
["MG06-01013"]
["MG06-01014"]
["MG06-01036"]
["MG06-01037"]
["MG06-01039"]
["MG06-01054"]
["RD01077"]
["RD01086"]
["MG02-05027"]
["MG02-05028"]
["MG02-09050"]
["MG02-11009"]
["MG02-08045"]
["MG02-13010"]
["MG02-13016"]
["MG03-08009"]
["MG03-08010"]
["MG04-01002"]
["MG04-01012"]
["MG04-01013"]
["MG04-01015"]
["MG04-01025"]
["MG04-01028"]
["MG04-01063"]
["MG04-01064"]
["MG04-01082"]
["MG01-01001"]
["MG01-01003"]
["MG01-05002"]
["MG02-01010"]
["MG02-01013"]
["MG02-01014"]
["MG02-01027"]
["MG02-01035"]
["MG02-01041"]
["MG02-01042"]
["MG02-01051"]
["MG02-01062"]
["MG02-02038"]
["MG02-02039"]
["MG02-02043"]
["MG02-02048"]
["MG02-03008"]
["MG02-04006"]
[10470]
[10310]
[10480]
["10405P"]
[10435]
[10465]
[10550]
[20170]
[20130]
[2712600]
["MD719469"]
[27894101243]
["27MD368858"]
["27MR148321"]
[7988060000]
[7988070000]
[7986610000]
[7980260000]
[798017000]
[7980300000]
[7997140000]
[7997180000]
["DD-588"]
["DD-587"]
["DD-505"]
["DD-506"]
["DD-219"]
["BE-202"]
["BE-203"]
["BE-236"]
["BE-253"]
["BE-500"]
["BE-501"]
["BE-532"]
["GI-337"]
["GI-338"]
["TI-512"]
["TI-517"]
["BJ-505"]
["BJ-508"]
["BJ-913"]
["BJ-906"]
["BJ-914"]
["BJ-915"]
["FA-523S"]
["FA-383S"]
["FO-912S"]
["FA-2010S"]
["FA-345S"]
["PA-582AF"]
["PA-323AF"]
["PA-373AF"]
["PA-247AF"]
["PA-256AF"]
["PA-269AF"]
["PA-115AF"]
["PA-123AF"]
["PA-143AF"]
["PA-800AF"]
["PA-504AF"]
["CS-593"]
["CY-599"]
["BJ-513"]
["BJ-514"]
["BJ-509"]
["CE-K00"]
["JO-502"]
["KK-15006"]
["KK-15005"]
["KK-13028"]
["KK-13010"]
["KK-22008"]
["KK-21008"]
["KK-23035"]
["72-6183"]
["72-6184"]
["2089447403012D"]
["8-94474031-3"]
["20002131609D"]
["20002131609G"]
["213-1609 LH"]
["213-1609 RH"]
[27894244409]
["MG02-13002"]
["DQ124"]
[245010]
[27587410308]
["TN703"]
["0001"]
["0031"]
["RVN010/012"]
["0003-TUB"]
["BGA-SILIC"]
["0037"]
["27148IS"]
["0012"]
["0057"]
["0030"]
["A1319004"]
["IM3067"]
["IM3136"]
["MYH407"]
["IM3079Y"]
["S/3013"]
[150814]
[139610]
[137077]
[137076]
["HHR604"]
["HI10004-1ZT"]
["ZZ2009-09"]
[133749]
[137075]
[510200]
[510000]
[520300]
[520400]
[520600]
[521400]
[521600]
["NOA-2215"]
["DEPQ5"]
["A1319002"]
["A1319001"]
[182501]
[182502]
[182503]
[182504]
[182505]
[182506]
[182507]
[182508]
[182510]
[182511]
[182512]
[182513]
[182514]
[182515]
[182516]
[182517]
[182518]
[182519]
[182520]
[182521]
["A0120109"]
["A0120102"]
["A0120108"]
["A0120100NM"]
["A0120101N"]
["A0120110"]
["A0120112"]
["ISZ-09/10"]
["SO150304-003"]
["0-124"]
["05-3421"]
["TW1622A-025"]
["SH-1622A-STD"]
["CB1070GP050"]
["CB1070A-025"]
["MS1622A-STD"]
["MS1622GP025"]
["CB1131A-075"]
["CB1131A-STD"]
["CB1131A-025"]
["MS1131A-025"]
["MS1131A-050"]
["MS1131A-STD"]
["CB2016A-STD"]
["SH1605BSTD"]
["MS1138GPSTD"]
["MS1138GP025"]
["MS1138GP075"]
["MS1138GP050"]
["PB1622J-STD"]
["PB-1802-JSF"]
["PB1605J-STD"]
["WL11-10-100E"]
["MD348983"]
["AHI2006"]
["M002T87271ZT"]
[20894133275]
[20894247875]
["LPR4172"]
["MD050196"]
["8-94165177"]
["8-94113-583-0"]
[73012]
[73010]
["2201A01"]
["2202A01"]
["JD-2001"]
["3AL922000961"]
["3AM922000971"]
[43246]
[920382]
[300333]
[300428]
["114-001"]
[3748]
[3778]
["8-94317667"]
["8-94317668"]
["N9YC"]
["C9YC"]
["S9YC"]
["L87YC"]
["RC10DMC"]
["RC10YCC"]
["4565-16"]
["U050"]
["U728/4"]
["U183"]
["U100"]
["U126"]
["U960"]
["U941"]
["ITE/3-12"]
["ITJS/3-12"]
["ITE/3-24"]
["RLP/5-12"]
["RLP/5-24"]
["MD050456"]
["MD303981"]
["405-16"]
["27149FD"]
[2755]
[75801]
["TS-118"]
["M8360"]
["MG02-16004"]
["D4267"]
["D4210"]
["D4209"]
["D4805"]
["D3062C"]
["D1041C"]
["D1202C"]
["D3116"]
["D1224C"]
["12649/10"]
["48548/10"]
["BT19Z-2"]
["48TKB3204R"]
["32008XJ"]
["32009XJ-A"]
[30208]
["30208A"]
[30208]
["BD25-9T12"]
["TM206C3^^UR"]
["6904ZZ"]
["6203VVC4"]
["B20-122C3^^UR7"]
["63/32/NC3"]
["30306J"]
["HR32307CN^0A"]
["6360-18"]
["27RD01161"]
["27HU2028"]
["LS-065"]
["AN301"]
["AN310"]
["2924-AN"]
["HS111002"]
["HS274001"]
["8-97139-142-0"]
["8-94128143"]
["8-94128141"]
["8-97179-357-0"]
["8-97179-358-0"]
["8-97179-359-0"]
["8-97179-360-0"]
["8-97167406"]
["8-97167406-353"]
["8-97062294"]
["ISU045L"]
["ISU045R"]
["8-94316-196-0"]
["IZ153-04G"]
["IZ153-04H"]
["IZ153-18E"]
["ZNP18346"]
["9-97107-348"]
["8-97033-864-0"]
["8-97219-509-2"]
["IZ151-33B"]
["AK4101"]
["AK4100"]
["AK6012"]
["MG04-01077"]
["5-11721-016-0"]
["8-94136-672"]
["5-47519-053"]
["8-94231-459"]
["TY319-31A"]
["TY319-31B"]
["TY319-31G"]
["47550-30100"]
["MD343565"]
["MD343566"]
["MB092437"]
["MB837719"]
["MD099211"]
["TY180-31A"]
["TY180-31B"]
["8-94161-141"]
["WLA2-16-460F"]
["WL0110155"]
["UG52-43-400"]
["MB285-31A"]
["MB285-31B"]
["MB285-31C"]
["MB285-31D"]
["9A0812A14"]
["5TB-A0320"]
["MB176309"]
["MB286-32B"]
["MB555192"]
["5ELS-A110-S"]
["DS144-22A"]
["DS144-22B"]
["DS144-32D"]
["MR992374"]
["8-94217784"]
["8-94217785"]
["8-94222-974"]
["8-94434-974-1"]
["8-94434-973-1"]
["IS-1132-BM-LH"]
["IS-1132-BM-RH"]
["IS11-1001-2-353 L"]
["IS11-1001-2-353 R"]
["ISU223L"]
["ISU223R"]
["IS10-1002-353 L"]
["IS10-1002-353 R"]
["ISU301L"]
["ISU301R"]
["8-94335625"]
["HD08-61002-1"]
["IS-5903"]
["CLE-16MM"]
["CLE-21MM"]
["04495-0K120"]
["04495-35180"]
["16210-54180"]
["16210-54210"]
["4600A106"]
["FT06-0106A"]
["FT06-0106B"]
["MG06-01021"]
["IZ009001-A"]
["IZ009001-B"]
["RD23008"]
[27210]
["8-94237-366-1"]
["8-97368-263"]
["TY315-31A"]
["TY315-31B"]
["TY315-31C"]
["TY315-32A"]
["TY313-33A"]
["TY313-33B"]
["TY074-20C"]
["TY074-20D"]
[90431363]
[90431364]
["897942-296"]
["HD03-7001-B-LH"]
["HD03-7001-B-RH"]
["MZ180-20C"]
["MZ180-20D"]
["MZ180-25C"]
["MZ180-25D"]
["MZ180-30C"]
["MZ180-30D"]
["MZ180-30E"]
["MZ180-30F"]
["MZ430-20C"]
["MZ430-20D"]
["MZ430-25C"]
["MZ430-25D"]
["UH71-32-320"]
["MZ180-30A"]
["MZ209-22A"]
["MZ209-22B"]
["8-94112-625BGF"]
["MB012098BGF"]
["MB012098"]
["MD712383BGF"]
["MD712383"]
["UB93-41-400"]
["UB93-41-400-353"]
["UB39-41-920"]
["WL81-15-150A"]
["8-97129738"]
["WL51-12-420"]
["TH-2043C LH"]
["TH-2043C RH"]
["MB285-30E"]
["MB285-30F"]
["ST-1639"]
["9-37300-031"]
["9-37300-601"]
["S1Y8-26-38Z"]
["RD22022"]
["PT151"]
["MR296271-S"]
["MR277924"]
["MR241029"]
["MR133061"]
["MB581845"]
["MG01-12013"]
["MG01-12017"]
["MG01-12002LHD"]
[27935]
["MD374223"]
["MD110165"]
["MD324967"]
["MD324966"]
["MD050212"]
["MB7681"]
["MB500813"]
["MB422203"]
["MB422204"]
["MB407061"]
["MB407030"]
["MB333-30A"]
["MB333-30B"]
["MB286-30M"]
["MB286-30N"]
["MB285-25A"]
["MB285-25B"]
["MB252-32A"]
["IZ090-32C"]
["IZ151-31A"]
["IZ151-31B"]
["IZ091-36F"]
["IZ091-29A"]
["8-97365743"]
["8-97377149"]
["8-97319-300"]
["8-97255-313"]
["8-97089-652"]
["8-96457-472"]
["8-97035085"]
["8-94438-300"]
["8-94434-996"]
["8-94434-995"]
["8-94328-109"]
["8-94328-108"]
["8-94376858"]
["897105012-0"]
["8-94232-282"]
["62246A"]
["5FP-A0083"]
["5FP-A0108"]
["5CK-A0006"]
["5-37211-001"]
["8-94171-858-B"]
["MG06-01002"]
["TF37"]
["TF70"]
["TF71"]
["TF82"]
["TF83"]
["TF89"]
["TF121"]
["B012"]
["B019"]
["B022"]
["B058"]
["B088"]
["B091"]
["B100"]
["B101"]
["F010"]
["F012"]
["F013"]
["F014"]
["F015"]
["F016"]
["F025"]
["F037"]
["I072"]
["8-94155315"]
["8-94155314"]
["9-4468001-1"]
["I086"]
["I089"]
["8-94472118"]
["I115"]
["I118"]
["894124868-2"]
["I165"]
["I183"]
["I184"]
["M001"]
["M035"]
["M041"]
["M042"]
["M045"]
["M048"]
["M049"]
["M053"]
["M062"]
["M063"]
["M064"]
["M084"]
["MI11"]
["JAK4225100"]
["M116","FOURCHETTE EMB MIT"]
["R004"]
["R005"]
["R012"]
["R013"]
["T051"]
["T053"]
["T067"]
["MR534949"]
["897028-970-2"]
["I093"]
[894241767]
["96-97248860-0"]
["8-94440608"]
["I130"]
["I136"]
[894328800]
["I162"]
["8-94334158"]
["8-94334159"]
["I138"]
["I189"]
["M005-N"]
["M007-N"]
["M010-N"]
["MI16"]
["MI20"]
["R007"]
["R008"]
["ST01"]
["ST02"]
["TF63"]
["I138"]
["B071"]
["B072"]
["F020"]
["F021"]
["F024"]
["F030"]
["FD002"]
["UM46-39-040"]
["FO011"]
["I004"]
["I006","CAL SUSP IWSU PM"]
["I010"]
["I011"]
["I012"]
["I013"]
["I019"]
["I021"]
["I027"]
["I032"]
["I035"]
["I039"]
["I042"]
["I043"]
["I048"]
["I056"]
["I066"]
["I071"]
["I073"]
["B001"]
["B002"]
["B003"]
["B004"]
["B005"]
["B006"]
["B008"]
["B009"]
["B013"]
["B014"]
["B016"]
["B018"]
["B020"]
["B023"]
["B026"]
["B027"]
["B038"]
["B039"]
["B041"]
["B042"]
["B047"]
["B048"]
["B049"]
["B055"]
["B057"]
["B067"]
["B068"]
["B070"]
["B073"]
["B074"]
["B075"]
["B076"]
["B080"]
["B081"]
["B082"]
["B084"]
["B085"]
["B086"]
["B087"]
["B089"]
["B092"]
["B093"]
["B094"]
["B097"]
["B099"]
["B112"]
["B130"]
["B132"]
["T001"]
["TEN001"]
["B142"]
["B138"]
["B140"]
["B143"]
["B141"]
["B144"]
["B116"]
["B109"]
["B111"]
["B115"]
["B107"]
["B110"]
["B104"]
["B117"]
["B118"]
["B120"]
["B121"]
["B122"]
["B105"]
["B137"]
["B139"]
["B123"]
["B124"]
["B136"]
["B125"]
["B145"]
["B147"]
["B126"]
["B106"]
["B128"]
["B129"]
["B114"]
["B146"]
["B108"]
["I001"]
["I002"]
["I003-N"]
["I005-N"]
["I007"]
["I008"]
["I009"]
["I020"]
["I022"]
["I023"]
["FO004"]
["FO005"]
["FO006"]
["FO007"]
["FO009"]
["FO010"]
["FO011"]
["FO013"]
["FO014"]
["M002"]
["M003"]
["M004"]
["M006-N"]
["M012"]
["M011-N"]
["M013"]
["M014"]
["M015"]
["M016"]
["M017"]
["M019"]
["M023"]
["M024"]
["M025"]
["M026"]
["M027"]
["M030"]
["M031"]
["M033"]
["M034"]
["M036"]
["M037"]
["M038"]
["M039"]
["M040"]
["M043"]
["M046"]
["M050"]
["M052"]
["M054"]
["M055"]
["M056"]
["M057"]
["M058"]
["M059"]
["M060"]
["M061"]
["M076"]
["M077"]
["M079"]
["F001"]
["F002"]
["F004"]
["F005"]
["F006"]
["F007"]
["F008"]
["F009"]
["F011"]
["F017"]
["F018"]
["F019"]
["F027"]
["F028"]
["F029"]
["F032"]
["F033"]
["FO34"]
["F036"]
["R002"]
["R003"]
["R007"]
["R008"]
["R009"]
["R010"]
["R011"]
["R014"]
["D001"]
["D002"]
["D003"]
["TEN002"]
["TEN003"]
["TEN004"]
["TF03"]
["TF04"]
["TF05"]
["TF06"]
["TF07"]
["TF08"]
["TF10"]
["TF11"]
["TF13"]
["TF41"]
["TF40"]
["TF92"]
["TF39"]
["TF14"]
["TF15"]
["TF18"]
["TF20"]
["TF21"]
["TF22"]
["TF75"]
["TF23"]
["TF24"]
["TF25"]
["TF26"]
["TF27"]
["TF28"]
["TF29"]
["TF30"]
["TF31"]
["TF32"]
["TF33"]
["TF34"]
["TF35"]
["TF36"]
["TF126"]
["TF137"]
["TF69"]
["TF115"]
["TF116"]
["TH6702-82J"]
["B077"]
["8-94172-018-0"]
["MI15"]
[207094112625]
["ISU328L"]
["ISU328L"]
["ISU221L"]
["ISU221R"]
["5SR-A0205"]
["AK1230"]
["224018760R"]
[7700500168]
[182509]
["271918G"]
[8942313080]
["MB831040"]
["MI26"]
["MI25"]
["MI24"]
["MI23"]
["MI21"]
["MI19"]
["MI18"]
["MI17"]
["MI13"]
["MI10"]
["MI08"]
["MI05"]
["MI03"]
["MI01-N"]
["MI02"]
["FD003-N"]
["8-94155314"]
["IZ028820B"]
[110806]
["PIMA717PHD"]
["ISU285L"]
["ISU285R"]
["IBD-1373"]
["AX192766"]
["A379RU30MM"]
["A390R030MM"]
[821350]
["ARCEBMIM140-0,00"]
["ARCEBMIM140-0,50"]
["8-97381456"]
[153010]
["879117254-1"]
[894311222]
["8-94325768"]
["PA-137AF"]
["FT1506006R"]
[2058281146]
[20587810294]
["MA880183"]
["MA870169"]
["5-87831-081-0"]
["VC-500"]
[109]
["8-94463-830"]
["UJ06-66-122"]
["MD050312"]
["U187"]
["RD01104"]
[3556]
[3557]
["I044"]
["ISC572086U"]
["UHY1-33-29Z"]
["UMY1-33-29"]
["IZ20011BS"]
[2069]
[139541]
["MB334-22J"]
["MB334-22I"]
["8-94434-977"]
["8-94434-978"]
[154148]
["HD15-5005"]
["215-19D4-AERH"]
["2201A01"]
[470180]
[190910]
[4604444]
[4604443]
["8-97039190-3"]
["8-94467328"]
["13011-54100"]
["TF62"]
["I164"]
["2010TH2042-1G"]
["27TH-2042CG"]
[20897921857]
["I114"]
["MG02-02044"]
["2040VS6409"]
["PI45 9V"]
["148688G"]
["O-MD303972"]
["IZ07067GA7"]
["1ATAK"]
[2162]
["8-94435-140"]
["ISC506115U"]
["ISK2047"]
[6253029000]
["HD19-1001"]
["HD19-1001-353 R"]
["ISU282L"]
["ISU282R"]
["ISU283L"]
["ISU283R"]
["Z102"]
["UH71-33-061B"]
["UH71-26-630A"]
["UH71-26-640A"]
["WL02-16-520A"]
["MD972001"]

{"sheet":"Feuil1","index":6,"n_rows":999,"n_cols":1,"rows_kept":999,"cut":false,"hidden":false,"merged":[]}
["IZ028802C"]
["IZ028802D"]
["IZ029702A"]
["IZ029702B"]
["IZ020202AR"]
["IZ020602AL"]
["IZ020202AL"]
["IZ020602AR"]
[" IZ020602EL"]
["IZ020602ER"]
["IZ020214A"]
["IZ020614A"]
["IZ028114B"]
["897367044-0296"]
[8972358672]
["IZ028812C"]
["IZ028812D"]
["IZ028812A"]
["IZ028812B"]
["IZ020212AL"]
["IZ020212AR"]
[20897387346]
["278-97308868"]
[27894226829]
[8971103140]
[8970438802]
["IZ029906A"]
["IZ029906B"]
["IZ028806A"]
["IZ028806B"]
["20IZ400238"]
["IZ029709A"]
["IZ029709B"]
["IZ028809A"]
["IZ028809B"]
["IZ41007AL"]
["IZ41007AR"]
["IZ028102A"]
["IZ028102B"]
["RD01090"]
["RD01095"]
["RD01097"]
["RD01101"]
["RD01146"]
["RD02069"]
["RD05007"]
["RD05008"]
["RD12057"]
["RD02127R"]
["27RD01069D"]
[1594171]
["20TH2088D"]
["20YT-7216DC"]
[2039405]
["2080PG405"]
[20587810146]
["208094318910"]
["MG04-01131"]
["MG04-01174"]
["MG04-01191"]
["MG04-01271"]
["MG05-01001"]
["MG05-01025"]
["MG05-01032"]
["MG05-01087"]
["MG05-01095"]
["MG06-01002-353"]
["MG06-01013"]
["MG06-01014"]
["MG06-01036"]
["MG06-01037"]
["MG06-01039"]
["MG06-01054"]
["RD01077"]
["RD01086"]
["MG02-05027"]
["MG02-05028"]
["MG02-09050"]
["MG02-11009"]
["MG02-08045"]
["MG02-13010"]
["MG02-13016"]
["MG03-08009"]
["MG03-08010"]
["MG04-01002"]
["MG04-01012"]
["MG04-01013"]
["MG04-01015"]
["MG04-01025"]
["MG04-01028"]
["MG04-01063"]
["MG04-01064"]
["MG04-01082"]
["MG01-01001"]
["MG01-01003"]
["MG01-05002"]
["MG02-01010"]
["MG02-01013"]
["MG02-01014"]
["MG02-01027"]
["MG02-01035"]
["MG02-01041"]
["MG02-01042"]
["MG02-01051"]
["MG02-01062"]
["MG02-02038"]
["MG02-02039"]
["MG02-02043"]
["MG02-02048"]
["MG02-03008"]
["MG02-04006"]
[10470]
[10310]
[10480]
["10405P"]
[10435]
[10465]
[10550]
[20170]
[20130]
[2712600]
["MD719469"]
[27894101243]
["27MD368858"]
["27MR148321"]
[7988060000]
[7988070000]
[7986610000]
[7980260000]
[798017000]
[7980300000]
[7997140000]
[7997180000]
["DD-588"]
["DD-587"]
["DD-505"]
["DD-506"]
["DD-219"]
["BE-202"]
["BE-203"]
["BE-236"]
["BE-253"]
["BE-500"]
["BE-501"]
["BE-532"]
["GI-337"]
["GI-338"]
["TI-512"]
["TI-517"]
["BJ-505"]
["BJ-508"]
["BJ-913"]
["BJ-906"]
["BJ-914"]
["BJ-915"]
["FA-523S"]
["FA-383S"]
["FO-912S"]
["FA-2010S"]
["FA-345S"]
["PA-582AF"]
["PA-323AF"]
["PA-373AF"]
["PA-247AF"]
["PA-256AF"]
["PA-269AF"]
["PA-115AF"]
["PA-123AF"]
["PA-143AF"]
["PA-800AF"]
["PA-504AF"]
["CS-593"]
["CY-599"]
["BJ-513"]
["BJ-514"]
["BJ-509"]
["CE-K00"]
["JO-502"]
["KK-15006"]
["KK-15005"]
["KK-13028"]
["KK-13010"]
["KK-22008"]
["KK-21008"]
["KK-23035"]
["72-6183"]
["72-6184"]
["2089447403012D"]
["8-94474031-3"]
["20002131609D"]
["20002131609G"]
["213-1609 LH"]
["213-1609 RH"]
[27894244409]
["MG02-13002"]
["DQ124"]
[245010]
[27587410308]
["TN703"]
["0001"]
["0031"]
["RVN010/012"]
["0003-TUB"]
["BGA-SILIC"]
["0037"]
["27148IS"]
["0012"]
["0057"]
["0030"]
["A1319004"]
["IM3067"]
["IM3136"]
["MYH407"]
["IM3079Y"]
["S/3013"]
[150814]
[139610]
[137077]
[137076]
["HHR604"]
["HI10004-1ZT"]
["ZZ2009-09"]
[133749]
[137075]
[510200]
[510000]
[520300]
[520400]
[520600]
[521400]
[521600]
["NOA-2215"]
["DEPQ5"]
["A1319002"]
["A1319001"]
[182501]
[182502]
[182503]
[182504]
[182505]
[182506]
[182507]
[182508]
[182510]
[182511]
[182512]
[182513]
[182514]
[182515]
[182516]
[182517]
[182518]
[182519]
[182520]
[182521]
["A0120109"]
["A0120102"]
["A0120108"]
["A0120100NM"]
["A0120101N"]
["A0120110"]
["A0120112"]
["ISZ-09/10"]
["SO150304-003"]
["0-124"]
["05-3421"]
["TW1622A-025"]
["SH-1622A-STD"]
["CB1070GP050"]
["CB1070A-025"]
["MS1622A-STD"]
["MS1622GP025"]
["CB1131A-075"]
["CB1131A-STD"]
["CB1131A-025"]
["MS1131A-025"]
["MS1131A-050"]
["MS1131A-STD"]
["CB2016A-STD"]
["SH1605BSTD"]
["MS1138GPSTD"]
["MS1138GP025"]
["MS1138GP075"]
["MS1138GP050"]
["PB1622J-STD"]
["PB-1802-JSF"]
["PB1605J-STD"]
["WL11-10-100E"]
["MD348983"]
["AHI2006"]
["M002T87271ZT"]
[20894133275]
[20894247875]
["LPR4172"]
["MD050196"]
["8-94165177"]
["8-94113-583-0"]
[73012]
[73010]
["2201A01"]
["2202A01"]
["JD-2001"]
["3AL922000961"]
["3AM922000971"]
[43246]
[920382]
[300333]
[300428]
["114-001"]
[3748]
[3778]
["8-94317667"]
["8-94317668"]
["N9YC"]
["C9YC"]
["S9YC"]
["L87YC"]
["RC10DMC"]
["RC10YCC"]
["4565-16"]
["U050"]
["U728/4"]
["U183"]
["U100"]
["U126"]
["U960"]
["U941"]
["ITE/3-12"]
["ITJS/3-12"]
["ITE/3-24"]
["RLP/5-12"]
["RLP/5-24"]
["MD050456"]
["MD303981"]
["405-16"]
["27149FD"]
[2755]
[75801]
["TS-118"]
["M8360"]
["MG02-16004"]
["D4267"]
["D4210"]
["D4209"]
["D4805"]
["D3062C"]
["D1041C"]
["D1202C"]
["D3116"]
["D1224C"]
["12649/10"]
["48548/10"]
["BT19Z-2"]
["48TKB3204R"]
["32008XJ"]
["32009XJ-A"]
[30208]
["30208A"]
[30208]
["BD25-9T12"]
["TM206C3^^UR"]
["6904ZZ"]
["6203VVC4"]
["B20-122C3^^UR7"]
["63/32/NC3"]
["30306J"]
["HR32307CN^0A"]
["6360-18"]
["27RD01161"]
["27HU2028"]
["LS-065"]
["AN301"]
["AN310"]
["2924-AN"]
["HS111002"]
["HS274001"]
["8-97139-142-0"]
["8-94128143"]
["8-94128141"]
["8-97179-357-0"]
["8-97179-358-0"]
["8-97179-359-0"]
["8-97179-360-0"]
["8-97167406"]
["8-97167406-353"]
["8-97062294"]
["ISU045L"]
["ISU045R"]
["8-94316-196-0"]
["IZ153-04G"]
["IZ153-04H"]
["IZ153-18E"]
["ZNP18346"]
["9-97107-348"]
["8-97033-864-0"]
["8-97219-509-2"]
["IZ151-33B"]
["AK4101"]
["AK4100"]
["AK6012"]
["MG04-01077"]
["5-11721-016-0"]
["8-94136-672"]
["5-47519-053"]
["8-94231-459"]
["TY319-31A"]
["TY319-31B"]
["TY319-31G"]
["47550-30100"]
["MD343565"]
["MD343566"]
["MB092437"]
["MB837719"]
["MD099211"]
["TY180-31A"]
["TY180-31B"]
["8-94161-141"]
["WLA2-16-460F"]
["WL0110155"]
["UG52-43-400"]
["MB285-31A"]
["MB285-31B"]
["MB285-31C"]
["MB285-31D"]
["9A0812A14"]
["5TB-A0320"]
["MB176309"]
["MB286-32B"]
["MB555192"]
["5ELS-A110-S"]
["DS144-22A"]
["DS144-22B"]
["DS144-32D"]
["MR992374"]
["8-94217784"]
["8-94217785"]
["8-94222-974"]
["8-94434-974-1"]
["8-94434-973-1"]
["IS-1132-BM-LH"]
["IS-1132-BM-RH"]
["IS11-1001-2-353 L"]
["IS11-1001-2-353 R"]
["ISU223L"]
["ISU223R"]
["IS10-1002-353 L"]
["IS10-1002-353 R"]
["ISU301L"]
["ISU301R"]
["8-94335625"]
["HD08-61002-1"]
["IS-5903"]
["CLE-16MM"]
["CLE-21MM"]
["04495-0K120"]
["04495-35180"]
["16210-54180"]
["16210-54210"]
["4600A106"]
["FT06-0106A"]
["FT06-0106B"]
["MG06-01021"]
["IZ009001-A"]
["IZ009001-B"]
["RD23008"]
[27210]
["8-94237-366-1"]
["8-97368-263"]
["TY315-31A"]
["TY315-31B"]
["TY315-31C"]
["TY315-32A"]
["TY313-33A"]
["TY313-33B"]
["TY074-20C"]
["TY074-20D"]
[90431363]
[90431364]
["897942-296"]
["HD03-7001-B-LH"]
["HD03-7001-B-RH"]
["MZ180-20C"]
["MZ180-20D"]
["MZ180-25C"]
["MZ180-25D"]
["MZ180-30C"]
["MZ180-30D"]
["MZ180-30E"]
["MZ180-30F"]
["MZ430-20C"]
["MZ430-20D"]
["MZ430-25C"]
["MZ430-25D"]
["UH71-32-320"]
["MZ180-30A"]
["MZ209-22A"]
["MZ209-22B"]
["8-94112-625BGF"]
["MB012098BGF"]
["MB012098"]
["MD712383BGF"]
["MD712383"]
["UB93-41-400"]
["UB93-41-400-353"]
["UB39-41-920"]
["WL81-15-150A"]
["8-97129738"]
["WL51-12-420"]
["TH-2043C LH"]
["TH-2043C RH"]
["MB285-30E"]
["MB285-30F"]
["ST-1639"]
["9-37300-031"]
["9-37300-601"]
["S1Y8-26-38Z"]
["RD22022"]
["PT151"]
["MR296271-S"]
["MR277924"]
["MR241029"]
["MR133061"]
["MB581845"]
["MG01-12013"]
["MG01-12017"]
["MG01-12002LHD"]
[27935]
["MD374223"]
["MD110165"]
["MD324967"]
["MD324966"]
["MD050212"]
["MB7681"]
["MB500813"]
["MB422203"]
["MB422204"]
["MB407061"]
["MB407030"]
["MB333-30A"]
["MB333-30B"]
["MB286-30M"]
["MB286-30N"]
["MB285-25A"]
["MB285-25B"]
["MB252-32A"]
["IZ090-32C"]
["IZ151-31A"]
["IZ151-31B"]
["IZ091-36F"]
["IZ091-29A"]
["8-97365743"]
["8-97377149"]
["8-97319-300"]
["8-97255-313"]
["8-97089-652"]
["8-96457-472"]
["8-97035085"]
["8-94438-300"]
["8-94434-996"]
["8-94434-995"]
["8-94328-109"]
["8-94328-108"]
["8-94376858"]
["897105012-0"]
["8-94232-282"]
["62246A"]
["5FP-A0083"]
["5FP-A0108"]
["5CK-A0006"]
["5-37211-001"]
["8-94171-858-B"]
["MG06-01002"]
["TF37"]
["TF70"]
["TF71"]
["TF82"]
["TF83"]
["TF89"]
["TF121"]
["B012"]
["B019"]
["B022"]
["B058"]
["B088"]
["B091"]
["B100"]
["B101"]
["F010"]
["F012"]
["F013"]
["F014"]
["F015"]
["F016"]
["F025"]
["F037"]
["I072"]
["8-94155315"]
["8-94155314"]
["9-4468001-1"]
["I086"]
["I089"]
["8-94472118"]
["I115"]
["I118"]
["894124868-2"]
["I165"]
["I183"]
["I184"]
["M001"]
["M035"]
["M041"]
["M042"]
["M045"]
["M048"]
["M049"]
["M053"]
["M062"]
["M063"]
["M064"]
["M084"]
["MI11"]
["JAK4225100"]
["M116"]
["R004"]
["R005"]
["R012"]
["R013"]
["T051"]
["T053"]
["T067"]
["MR534949"]
["897028-970-2"]
["I093"]
[894241767]
["96-97248860-0"]
["8-94440608"]
["I130"]
["I136"]
[894328800]
["I162"]
["8-94334158"]
["8-94334159"]
["I138"]
["I189"]
["M005-N"]
["M007-N"]
["M010-N"]
["MI16"]
["MI20"]
["R007"]
["R008"]
["ST01"]
["ST02"]
["TF63"]
["I138"]
["B071"]
["B072"]
["F020"]
["F021"]
["F024"]
["F030"]
["FD002"]
["UM46-39-040"]
["FO011"]
["I004"]
["I006"]
["I010"]
["I011"]
["I012"]
["I013"]
["I019"]
["I021"]
["I027"]
["I032"]
["I035"]
["I039"]
["I042"]
["I043"]
["I048"]
["I056"]
["I066"]
["I071"]
["I073"]
["B001"]
["B002"]
["B003"]
["B004"]
["B005"]
["B006"]
["B008"]
["B009"]
["B013"]
["B014"]
["B016"]
["B018"]
["B020"]
["B023"]
["B026"]
["B027"]
["B038"]
["B039"]
["B041"]
["B042"]
["B047"]
["B048"]
["B049"]
["B055"]
["B057"]
["B067"]
["B068"]
["B070"]
["B073"]
["B074"]
["B075"]
["B076"]
["B080"]
["B081"]
["B082"]
["B084"]
["B085"]
["B086"]
["B087"]
["B089"]
["B092"]
["B093"]
["B094"]
["B097"]
["B099"]
["B112"]
["B130"]
["B132"]
["T001"]
["TEN001"]
["B142"]
["B138"]
["B140"]
["B143"]
["B141"]
["B144"]
["B116"]
["B109"]
["B111"]
["B115"]
["B107"]
["B110"]
["B104"]
["B117"]
["B118"]
["B120"]
["B121"]
["B122"]
["B105"]
["B137"]
["B139"]
["B123"]
["B124"]
["B136"]
["B125"]
["B145"]
["B147"]
["B126"]
["B106"]
["B128"]
["B129"]
["B114"]
["B146"]
["B108"]
["I001"]
["I002"]
["I003-N"]
["I005-N"]
["I007"]
["I008"]
["I009"]
["I020"]
["I022"]
["I023"]
["FO004"]
["FO005"]
["FO006"]
["FO007"]
["FO009"]
["FO010"]
["FO011"]
["FO013"]
["FO014"]
["M002"]
["M003"]
["M004"]
["M006-N"]
["M012"]
["M011-N"]
["M013"]
["M014"]
["M015"]
["M016"]
["M017"]
["M019"]
["M023"]
["M024"]
["M025"]
["M026"]
["M027"]
["M030"]
["M031"]
["M033"]
["M034"]
["M036"]
["M037"]
["M038"]
["M039"]
["M040"]
["M043"]
["M046"]
["M050"]
["M052"]
["M054"]
["M055"]
["M056"]
["M057"]
["M058"]
["M059"]
["M060"]
["M061"]
["M076"]
["M077"]
["M079"]
["F001"]
["F002"]
["F004"]
["F005"]
["F006"]
["F007"]
["F008"]
["F009"]
["F011"]
["F017"]
["F018"]
["F019"]
["F027"]
["F028"]
["F029"]
["F032"]
["F033"]
["FO34"]
["F036"]
["R002"]
["R003"]
["R007"]
["R008"]
["R009"]
["R010"]
["R011"]
["R014"]
["D001"]
["D002"]
["D003"]
["TEN002"]
["TEN003"]
["TEN004"]
["TF03"]
["TF04"]
["TF05"]
["TF06"]
["TF07"]
["TF08"]
["TF10"]
["TF11"]
["TF13"]
["TF41"]
["TF40"]
["TF92"]
["TF39"]
["TF14"]
["TF15"]
["TF18"]
["TF20"]
["TF21"]
["TF22"]
["TF75"]
["TF23"]
["TF24"]
["TF25"]
["TF26"]
["TF27"]
["TF28"]
["TF29"]
["TF30"]
["TF31"]
["TF32"]
["TF33"]
["TF34"]
["TF35"]
["TF36"]
["TF126"]
["TF137"]
["TF69"]
["TF115"]
["TF116"]
["TH6702-82J"]
["B077"]
["8-94172-018-0"]
["MI15"]
[207094112625]
["ISU328L"]
["ISU328L"]
["ISU221L"]
["ISU221R"]
["5SR-A0205"]
["AK1230"]
["224018760R"]
[7700500168]
[182509]
["271918G"]
[8942313080]
["MB831040"]
["MI26"]
["MI25"]
["MI24"]
["MI23"]
["MI21"]
["MI19"]
["MI18"]
["MI17"]
["MI13"]
["MI10"]
["MI08"]
["MI05"]
["MI03"]
["MI01-N"]
["MI02"]
["FD003-N"]
["8-94155314"]
["IZ028820B"]
[110806]
["PIMA717PHD"]
["ISU285L"]
["ISU285R"]
["IBD-1373"]
["AX192766"]
["A379RU30MM"]
["A390R030MM"]
[821350]
["ARCEBMIM140-0,00"]
["ARCEBMIM140-0,50"]
["8-97381456"]
[153010]
["879117254-1"]
[894311222]
["8-94325768"]
["PA-137AF"]
["FT1506006R"]
[2058281146]
[20587810294]
["MA880183"]
["MA870169"]
["5-87831-081-0"]
["VC-500"]
[109]
["8-94463-830"]
["UJ06-66-122"]
["MD050312"]
["U187"]
["RD01104"]
[3556]
[3557]
["I044"]
["ISC572086U"]
["UHY1-33-29Z"]
["UMY1-33-29"]
["IZ20011BS"]
[2069]
[139541]
["MB334-22J"]
["MB334-22I"]
["8-94434-977"]
["8-94434-978"]
[154148]
["HD15-5005"]
["215-19D4-AERH"]
["2201A01"]
[470180]
[190910]
[4604444]
[4604443]
["8-97039190-3"]
["8-94467328"]
["13011-54100"]
["TF62"]
["I164"]
["2010TH2042-1G"]
["27TH-2042CG"]
[20897921857]
["I114"]
["MG02-02044"]
["2040VS6409"]
["PI45 9V"]
["148688G"]
["O-MD303972"]

{"sheet":"CdC","index":7,"n_rows":18,"n_cols":6,"rows_kept":18,"cut":false,"hidden":false,"merged":[]}
[]
[]
[]
[null,null,null,null,null,"Gérer un stock avec Excel"]
[]
[null,null,null,null,null,"safach - 8 déc. 2016 à 14:05 - Dernière réponse le 8 déc. 2016 à 14:18 safach "]
[null,null,null,null,null,"Ne plus suivre"]
[null,null,null,null,null,"Bonjour"]
[null,null,null,null,null,"Je me permets de demander de l’aide car j’en ai très besoin"]
[null,null,null,null,null,"J’ai un outil de gestion de stock que j’utilise pour faire les entrées stock et les sorties"]
[null,null,null,null,null,"Mais j’aimerai bien chercher les articles par l’intermédiaire de leurs désignations au lieu de leurs références (ou bien les deux si c’est possible)"]
[null,null,null,null,null,"Alors s’il y a quelqu’un qui peut m’aider à ajouter le critère de désignation aux formulaires des entrées et sorties ça sera très gentil de sa part"]
[null,null,null,null,null,"En addition, le formulaire « consultation » me permet de consulter un seul article alors est-il possible d’afficher les désignations similaires et leurs quantités en cherchant un article même par formules dans une autre feuille du classeur"]
[null,null,null,null,null,"S’il vous plait j’ai besoin de votre aide"]
[null,null,null,null,null,"Lien du classeur"]
[null,null,null,null,null,"https://mon-partage.fr/f/KFg9SdwG/"]
[null,null,null,null,null,"Merci d’avance"]
[null,null,null,null,null,"Cordialement"]