{"text_format":"1","workbook":"xlsx","n_sheets":12,"sheets":["SEM","Modèle","1","2","3","4","5","6","7","8","9","10"],"not_rendered":{"charts":0,"images":0,"macros":1,"external_links":0,"defined_names":1,"comments":0,"pivot_tables":0},"unopened":[],"bounds":{"document_bytes":16777216,"sheet_cells":100000,"rows_first":2000,"rows_last":500,"rows_between":2000,"halvings":0,"cell_chars":16384,"cell_head_chars":4096},"cells_cut":0,"cells_raw":0,"read":"whole","date_system":"1900"}

{"sheet":"SEM","index":0,"n_rows":39,"n_cols":40,"rows_kept":39,"cut":false,"hidden":false,"merged":[[1,30,1,31],[2,30,3,31],[1,37,1,38],[2,37,3,38],[1,9,1,10],[2,9,3,10],[1,16,1,17],[2,16,3,17],[1,23,1,24],[2,23,3,24],[5,39,8,39],[5,0,8,1],[5,4,5,38],[6,4,7,10],[6,11,7,17],[6,18,7,24],[6,25,7,31],[6,32,7,38],[5,2,8,2],[5,3,8,3]]}
["XXXX"]
["XXX",null,null,null,"Heure","Début","Fin","Repas",null,"Horaires",null,"Heure","Début","Fin","Repas",null,"Horaires",null,"Heure","Début","Fin","Repas",null,"Horaires",null,"Heure","Début","Fin","Repas",null,"Horaires",null,"Heure","Début","Fin","Repas",null,"Horaires"]
[null,null,null,null,"Prévue",null,null,null,null,"10h00 - 19h00",null,"Prévue",null,null,null,null,"10h00 - 19h00",null,"Prévue",null,null,null,null,"10h00 - 19h00",null,"Prévue",null,null,null,null,"10h00 - 19h00",null,"Prévue",null,null,null,null,"10h00 - 19h00"]
[null,null,null,null,"Réelle","10:00:00","19:00:00","01:00:00",null,null,null,"Réelle","10:00:00","19:00:00","01:00:00",null,null,null,"Réelle","10:00:00","19:00:00","01:00:00",null,null,null,"Réelle","10:00:00","19:00:00","01:00:00",null,null,null,"Réelle","10:00:00","19:00:00","01:00:00"]
[]
["SEMAINE DU 01/01/2000 AU 05/01/2000",null,1,"Remballe\nREF","SEMAINE 1",null,null,null,null,null,null,null,null,null,null,null,null,null,null,null,null,null,null,null,null,null,null,null,null,null,null,null,null,null,null,null,null,null,null,"CUMUL HEURES SEMAINE"]
[null,null,null,null,"Lundi 01/01",null,null,null,null,null,null,"Mardi 02/01",null,null,null,null,null,null,"Mercredi 03/01",null,null,null,null,null,null,"Jeudi 04/01",null,null,null,null,null,null,"Vendredi 05/01"]
[]
[null,null,null,null,"Prépa"," H Début","H Fin","Repas","Temps tour","Remballe","Total jour","Prépa"," H Début","H Fin","Repas","Temps tour","Remballe","Total jour","Prépa"," H Début","H Fin","Repas","Temps tour","Remballe","Total jour","Prépa"," H Début","H Fin","Repas","Temps tour","Remballe","Total jour","Prépa"," H Début","H Fin","Repas","Temps tour","Remballe","Total jour"]
["INTITULÉ DU POSTE"]
["RÉEL",1,"01:00:00","00:30:00",{"$f":"$C11","v":"01:00:00"},{"$f":"F$3","v":"00:00:00"},{"$f":"G$3","v":"00:00:00"},{"$f":"$H$3","v":"00:00:00"},{"$f":"MOD(G11-F11-H11,1)","v":"00:00:00"},{"$f":"$D11","v":"00:30:00"},{"$f":"E11+I11+J11","v":"01:30:00"},{"$f":"$C11","v":"01:00:00"},{"$f":"M$3","v":"00:00:00"},{"$f":"N$3","v":"00:00:00"},{"$f":"$O$3","v":"00:00:00"},{"$f":"MOD(N11-M11-O11,1)","v":"00:00:00"},{"$f":"$D11","v":"00:30:00"},{"$f":"L11+P11+Q11","v":"01:30:00"},{"$f":"$C11","v":"01:00:00"},{"$f":"T$3","v":"00:00:00"},{"$f":"U$3","v":"00:00:00"},{"$f":"$V$3","v":"00:00:00"},{"$f":"MOD(U11-T11-V11,1)","v":"00:00:00"},{"$f":"$D11","v":"00:30:00"},{"$f":"S11+W11+X11","v":"01:30:00"},{"$f":"$C11","v":"01:00:00"},{"$f":"AA$3","v":"00:00:00"},{"$f":"AB$3","v":"00:00:00"},{"$f":"$AC$3","v":"00:00:00"},{"$f":"MOD(AB11-AA11-AC11,1)","v":"00:00:00"},{"$f":"$D11","v":"00:30:00"},{"$f":"Z11+AD11+AE11","v":"01:30:00"},{"$f":"$C11","v":"01:00:00"},{"$f":"AH$3","v":"00:00:00"},{"$f":"AI$3","v":"00:00:00"},{"$f":"$AJ$3","v":"00:00:00"},{"$f":"MOD(AI11-AH11-AJ11,1)","v":"00:00:00"},{"$f":"$D11","v":"00:30:00"},{"$f":"AG11+AK11+AL11","v":"01:30:00"},{"$f":"K11+R11+Y11+AF11+AM11","v":0.3125}]
["MODIFIÉ",null,"01:00:00","00:30:00",{"$f":"$C12","v":"01:00:00"},{"$f":"F$4","v":"10:00:00"},{"$f":"$G$4","v":"19:00:00"},{"$f":"$H$4","v":"01:00:00"},{"$f":"MOD(G12-F12-H12,1)","v":"08:00:00"},{"$f":"$D12","v":"00:30:00"},{"$f":"E12+I12+J12","v":"09:30:00"},{"$f":"$C12","v":"01:00:00"},{"$f":"M$4","v":"10:00:00"},{"$f":"N$4","v":"19:00:00"},{"$f":"$O$4","v":"01:00:00"},{"$f":"MOD(N12-M12-O12,1)","v":"08:00:00"},{"$f":"$D12","v":"00:30:00"},{"$f":"L12+P12+Q12","v":"09:30:00"},{"$f":"C12","v":"01:00:00"},{"$f":"T$4","v":"10:00:00"},{"$f":"U$4","v":"19:00:00"},{"$f":"$V$4","v":"01:00:00"},{"$f":"MOD(U12-T12-V12,1)","v":"08:00:00"},{"$f":"$D12","v":"00:30:00"},{"$f":"S12+W12+X12","v":"09:30:00"},{"$f":"C12","v":"01:00:00"},{"$f":"AA$4","v":"10:00:00"},{"$f":"AB$4","v":"19:00:00"},{"$f":"$AC$4","v":"01:00:00"},{"$f":"MOD(AB12-AA12-AC12,1)","v":"08:00:00"},{"$f":"$D12","v":"00:30:00"},{"$f":"Z12+AD12+AE12","v":"09:30:00"},{"$f":"$C12","v":"01:00:00"},{"$f":"AH$4","v":"10:00:00"},{"$f":"AI$4","v":"19:00:00"},{"$f":"$AJ$4","v":"01:00:00"},{"$f":"MOD(AI12-AH12-AJ12,1)","v":"08:00:00"},{"$f":"$D12","v":"00:30:00"},{"$f":"AG12+AK12+AL12","v":"09:30:00"},{"$f":"AM12+AF12+Y12+R12+K12","v":1.9791666666666663}]
["INTITULÉ DU POSTE"]
["RÉEL",2,"01:00:00","00:00:00",{"$f":"$C14","v":"01:00:00"},{"$f":"F$3","v":"00:00:00"},{"$f":"G$3","v":"00:00:00"},{"$f":"$H$3","v":"00:00:00"},{"$f":"MOD(G14-F14-H14,1)","v":"00:00:00"},{"$f":"$D14","v":"00:00:00"},{"$f":"E14+I14+J14","v":"01:00:00"},{"$f":"$C14","v":"01:00:00"},{"$f":"M$3","v":"00:00:00"},{"$f":"N$3","v":"00:00:00"},{"$f":"$O$3","v":"00:00:00"},{"$f":"MOD(N14-M14-O14,1)","v":"00:00:00"},{"$f":"$D14","v":"00:00:00"},{"$f":"L14+P14+Q14","v":"01:00:00"},{"$f":"$C14","v":"01:00:00"},{"$f":"T$3","v":"00:00:00"},{"$f":"U$3","v":"00:00:00"},{"$f":"$V$3","v":"00:00:00"},{"$f":"MOD(U14-T14-V14,1)","v":"00:00:00"},{"$f":"$D14","v":"00:00:00"},{"$f":"S14+W14+X14","v":"01:00:00"},{"$f":"$C14","v":"01:00:00"},{"$f":"AA$3","v":"00:00:00"},{"$f":"AB$3","v":"00:00:00"},{"$f":"$AC$3","v":"00:00:00"},{"$f":"MOD(AB14-AA14-AC14,1)","v":"00:00:00"},{"$f":"$D14","v":"00:00:00"},{"$f":"Z14+AD14+AE14","v":"01:00:00"},{"$f":"$C14","v":"01:00:00"},{"$f":"AH$3","v":"00:00:00"},{"$f":"AI$3","v":"00:00:00"},{"$f":"$AJ$3","v":"00:00:00"},{"$f":"MOD(AI14-AH14-AJ14,1)","v":"00:00:00"},{"$f":"$D14","v":"00:00:00"},{"$f":"AG14+AK14+AL14","v":"01:00:00"},{"$f":"AM14+AF14+Y14+R14+K14","v":0.20833333333333348}]
["MODIFIÉ",null,"01:00:00","00:30:00",{"$f":"$C15","v":"01:00:00"},{"$f":"F$4","v":"10:00:00"},{"$f":"$G$4","v":"19:00:00"},{"$f":"$H$4","v":"01:00:00"},{"$f":"MOD(G15-F15-H15,1)","v":"08:00:00"},{"$f":"$D15","v":"00:30:00"},{"$f":"E15+I15+J15","v":"09:30:00"},{"$f":"$C15","v":"01:00:00"},{"$f":"M$4","v":"10:00:00"},{"$f":"N$4","v":"19:00:00"},{"$f":"$O$4","v":"01:00:00"},{"$f":"MOD(N15-M15-O15,1)","v":"08:00:00"},{"$f":"$D15","v":"00:30:00"},{"$f":"L15+P15+Q15","v":"09:30:00"},{"$f":"C15","v":"01:00:00"},{"$f":"T$4","v":"10:00:00"},{"$f":"U$4","v":"19:00:00"},{"$f":"$V$4","v":"01:00:00"},{"$f":"MOD(U15-T15-V15,1)","v":"08:00:00"},{"$f":"$D15","v":"00:30:00"},{"$f":"S15+W15+X15","v":"09:30:00"},{"$f":"C15","v":"01:00:00"},{"$f":"AA$4","v":"10:00:00"},{"$f":"AB$4","v":"19:00:00"},{"$f":"$AC$4","v":"01:00:00"},{"$f":"MOD(AB15-AA15-AC15,1)","v":"08:00:00"},{"$f":"$D15","v":"00:30:00"},{"$f":"Z15+AD15+AE15","v":"09:30:00"},{"$f":"$C15","v":"01:00:00"},{"$f":"AH$4","v":"10:00:00"},{"$f":"AI$4","v":"19:00:00"},{"$f":"$AJ$4","v":"01:00:00"},{"$f":"MOD(AI15-AH15-AJ15,1)","v":"08:00:00"},{"$f":"$D15","v":"00:30:00"},{"$f":"AG15+AK15+AL15","v":"09:30:00"},{"$f":"AM15+AF15+Y15+R15+K15","v":1.9791666666666663}]
["INTITULÉ DU POSTE"]
["RÉEL",3,"00:00:00","00:00:00",{"$f":"$C17","v":"00:00:00"},{"$f":"F$3","v":"00:00:00"},{"$f":"G$3","v":"00:00:00"},{"$f":"$H$3","v":"00:00:00"},{"$f":"MOD(G17-F17-H17,1)","v":"00:00:00"},{"$f":"$D17","v":"00:00:00"},{"$f":"E17+I17+J17","v":"00:00:00"},{"$f":"$C17","v":"00:00:00"},{"$f":"M$3","v":"00:00:00"},{"$f":"N$3","v":"00:00:00"},{"$f":"$O$3","v":"00:00:00"},{"$f":"MOD(N17-M17-O17,1)","v":"00:00:00"},{"$f":"$D17","v":"00:00:00"},{"$f":"L17+P17+Q17","v":"00:00:00"},{"$f":"$C17","v":"00:00:00"},{"$f":"T$3","v":"00:00:00"},{"$f":"U$3","v":"00:00:00"},{"$f":"$V$3","v":"00:00:00"},{"$f":"MOD(U17-T17-V17,1)","v":"00:00:00"},{"$f":"$D17","v":"00:00:00"},{"$f":"S17+W17+X17","v":"00:00:00"},{"$f":"$C17","v":"00:00:00"},{"$f":"AA$3","v":"00:00:00"},{"$f":"AB$3","v":"00:00:00"},{"$f":"$AC$3","v":"00:00:00"},{"$f":"MOD(AB17-AA17-AC17,1)","v":"00:00:00"},{"$f":"$D17","v":"00:00:00"},{"$f":"Z17+AD17+AE17","v":"00:00:00"},{"$f":"$C17","v":"00:00:00"},{"$f":"AH$3","v":"00:00:00"},{"$f":"AI$3","v":"00:00:00"},{"$f":"$AJ$3","v":"00:00:00"},{"$f":"MOD(AI17-AH17-AJ17,1)","v":"00:00:00"},{"$f":"$D17","v":"00:00:00"},{"$f":"AG17+AK17+AL17","v":"00:00:00"},{"$f":"AM17+AF17+Y17+R17+K17","v":0}]
["MODIFIÉ",null,"00:00:00","00:00:00",{"$f":"$C18","v":"00:00:00"},{"$f":"F$4","v":"10:00:00"},{"$f":"$G$4","v":"19:00:00"},{"$f":"$H$4","v":"01:00:00"},{"$f":"MOD(G18-F18-H18,1)","v":"08:00:00"},{"$f":"$D18","v":"00:00:00"},{"$f":"E18+I18+J18","v":"08:00:00"},{"$f":"$C18","v":"00:00:00"},{"$f":"M$4","v":"10:00:00"},{"$f":"N$4","v":"19:00:00"},{"$f":"$O$4","v":"01:00:00"},{"$f":"MOD(N18-M18-O18,1)","v":"08:00:00"},{"$f":"$D18","v":"00:00:00"},{"$f":"L18+P18+Q18","v":"08:00:00"},{"$f":"C18","v":"00:00:00"},{"$f":"T$4","v":"10:00:00"},{"$f":"U$4","v":"19:00:00"},{"$f":"$V$4","v":"01:00:00"},{"$f":"MOD(U18-T18-V18,1)","v":"08:00:00"},{"$f":"$D18","v":"00:00:00"},{"$f":"S18+W18+X18","v":"08:00:00"},{"$f":"C18","v":"00:00:00"},{"$f":"AA$4","v":"10:00:00"},{"$f":"AB$4","v":"19:00:00"},{"$f":"$AC$4","v":"01:00:00"},{"$f":"MOD(AB18-AA18-AC18,1)","v":"08:00:00"},{"$f":"$D18","v":"00:00:00"},{"$f":"Z18+AD18+AE18","v":"08:00:00"},{"$f":"$C18","v":"00:00:00"},{"$f":"AH$4","v":"10:00:00"},{"$f":"AI$4","v":"19:00:00"},{"$f":"$AJ$4","v":"01:00:00"},{"$f":"MOD(AI18-AH18-AJ18,1)","v":"08:00:00"},{"$f":"$D18","v":"00:00:00"},{"$f":"AG18+AK18+AL18","v":"08:00:00"},{"$f":"AM18+AF18+Y18+R18+K18","v":1.6666666666666663}]
["INTITULÉ DU POSTE"]
["RÉEL",4,"01:00:00","00:00:00",{"$f":"$C20","v":"01:00:00"},{"$f":"F$3","v":"00:00:00"},{"$f":"G$3","v":"00:00:00"},{"$f":"$H$3","v":"00:00:00"},{"$f":"MOD(G20-F20-H20,1)","v":"00:00:00"},{"$f":"$D20","v":"00:00:00"},{"$f":"E20+I20+J20","v":"01:00:00"},{"$f":"$C20","v":"01:00:00"},{"$f":"M$3","v":"00:00:00"},{"$f":"N$3","v":"00:00:00"},{"$f":"$O$3","v":"00:00:00"},{"$f":"MOD(N20-M20-O20,1)","v":"00:00:00"},{"$f":"$D20","v":"00:00:00"},{"$f":"L20+P20+Q20","v":"01:00:00"},{"$f":"$C20","v":"01:00:00"},{"$f":"T$3","v":"00:00:00"},{"$f":"U$3","v":"00:00:00"},{"$f":"$V$3","v":"00:00:00"},{"$f":"MOD(U20-T20-V20,1)","v":"00:00:00"},{"$f":"$D20","v":"00:00:00"},{"$f":"S20+W20+X20","v":"01:00:00"},{"$f":"$C20","v":"01:00:00"},{"$f":"AA$3","v":"00:00:00"},{"$f":"AB$3","v":"00:00:00"},{"$f":"$AC$3","v":"00:00:00"},{"$f":"MOD(AB20-AA20-AC20,1)","v":"00:00:00"},{"$f":"$D20","v":"00:00:00"},{"$f":"Z20+AD20+AE20","v":"01:00:00"},{"$f":"$C20","v":"01:00:00"},{"$f":"AH$3","v":"00:00:00"},{"$f":"AI$3","v":"00:00:00"},{"$f":"$AJ$3","v":"00:00:00"},{"$f":"MOD(AI20-AH20-AJ20,1)","v":"00:00:00"},{"$f":"$D20","v":"00:00:00"},{"$f":"AG20+AK20+AL20","v":"01:00:00"},{"$f":"AM20+AF20+Y20+R20+K20","v":0.20833333333333348}]
{"$rows_left_out":20}
{"sheet":"Modèle","index":1,"n_rows":28,"n_cols":9,"rows_kept":28,"cut":false,"hidden":false,"merged":[[27,4,28,8],[29,4,34,8],[10,0,10,8],[1,0,1,1],[18,3,18,6],[18,8,19,8],[18,7,19,7],[18,1,19,1],[14,0,14,8],[4,0,4,1],[18,2,19,2],[27,0,28,3],[29,0,34,3]]}
[]
["PRODUCTION : ",null,{"$f":"SEM!A1","v":"XXXX"}]
[]
["FILM :",null,{"$f":"SEM!A2","v":"XXX"}]
[]
["NOM :",null,2,null,null,"LIGNE",{"$f":"9+(MATCH(C6,SEM!B10:B39,0))","v":14}]
["EMPLOI :",null,{"$f":"INDIRECT(\"SEM!A\" & (G6-1))","v":"INTITULÉ DU POSTE"}]
[]
[]
[]
[{"$f":"SEM!E6","v":"SEMAINE 1"}]
[]
[]
[]
[{"$f":"SEM!A6","v":"SEMAINE DU 01/01/2000 AU 05/01/2000"}]
[]
[]
[]
[null,"Horaires de tournage","Heures de préparation","Horaires effectifs de tournage",null,null,null,"Heures de rangement ","Total heures effectuées"]
[null,null,null,"Début","Repas","Fin","Temps de tournage"]
{"$rows_left_out":9}
{"sheet":"1","index":2,"n_rows":28,"n_cols":9,"rows_kept":28,"cut":false,"hidden":false,"merged":[[27,0,28,3],[27,4,28,8],[29,0,34,3],[29,4,34,8],[1,0,1,1],[4,0,4,1],[10,0,10,8],[14,0,14,8],[18,1,19,1],[18,2,19,2],[18,3,18,6],[18,7,19,7],[18,8,19,8]]}
[]
["PRODUCTION : ",null,{"$f":"SEM!A1","v":"XXXX"}]
[]
["FILM :",null,{"$f":"SEM!A2","v":"XXX"}]
[]
["NOM :",null,1,null,null,"LIGNE",{"$f":"9+(MATCH(C6,SEM!B10:B39,0))","v":11}]
["EMPLOI :",null,{"$f":"INDIRECT(\"SEM!A\" & (G6-1))","v":"INTITULÉ DU POSTE"}]
[]
[]
[]
[{"$f":"SEM!E6","v":"SEMAINE 1"}]
[]
[]
[]
[{"$f":"SEM!A6","v":"SEMAINE DU 01/01/2000 AU 05/01/2000"}]
[]
[]
[]
[null,"Horaires de tournage","Heures de préparation","Horaires effectifs de tournage",null,null,null,"Heures de rangement ","Total heures effectuées"]
[null,null,null,"Début","Repas","Fin","Temps de tournage"]
{"$rows_left_out":9}
{"sheet":"2","index":3,"n_rows":28,"n_cols":9,"rows_kept":28,"cut":false,"hidden":false,"merged":[[27,0,28,3],[27,4,28,8],[29,0,34,3],[29,4,34,8],[1,0,1,1],[4,0,4,1],[10,0,10,8],[14,0,14,8],[18,1,19,1],[18,2,19,2],[18,3,18,6],[18,7,19,7],[18,8,19,8]]}
[]
["PRODUCTION : ",null,{"$f":"SEM!A1","v":"XXXX"}]
[]
["FILM :",null,{"$f":"SEM!A2","v":"XXX"}]
[]
["NOM :",null,2,null,null,"LIGNE",{"$f":"9+(MATCH(C6,SEM!B10:B39,0))","v":14}]
["EMPLOI :",null,{"$f":"INDIRECT(\"SEM!A\" & (G6-1))","v":"INTITULÉ DU POSTE"}]
[]
[]
[]
[{"$f":"SEM!E6","v":"SEMAINE 1"}]
[]
[]
[]
[{"$f":"SEM!A6","v":"SEMAINE DU 01/01/2000 AU 05/01/2000"}]
[]
[]
[]
[null,"Horaires de tournage","Heures de préparation","Horaires effectifs de tournage",null,null,null,"Heures de rangement ","Total heures effectuées"]
[null,null,null,"Début","Repas","Fin","Temps de tournage"]
{"$rows_left_out":9}
{"sheet":"3","index":4,"n_rows":28,"n_cols":9,"rows_kept":28,"cut":false,"hidden":false,"merged":[[27,0,28,3],[27,4,28,8],[29,0,34,3],[29,4,34,8],[1,0,1,1],[4,0,4,1],[10,0,10,8],[14,0,14,8],[18,1,19,1],[18,2,19,2],[18,3,18,6],[18,7,19,7],[18,8,19,8]]}
[]
["PRODUCTION : ",null,{"$f":"SEM!A1","v":"XXXX"}]
[]
["FILM :",null,{"$f":"SEM!A2","v":"XXX"}]
[]
["NOM :",null,3,null,null,"LIGNE",{"$f":"9+(MATCH(C6,SEM!B10:B39,0))","v":17}]
["EMPLOI :",null,{"$f":"INDIRECT(\"SEM!A\" & (G6-1))","v":"INTITULÉ DU POSTE"}]
[]
[]
[]
[{"$f":"SEM!E6","v":"SEMAINE 1"}]
[]
[]
[]
[{"$f":"SEM!A6","v":"SEMAINE DU 01/01/2000 AU 05/01/2000"}]
[]
[]
[]
[null,"Horaires de tournage","Heures de préparation","Horaires effectifs de tournage",null,null,null,"Heures de rangement ","Total heures effectuées"]
[null,null,null,"Début","Repas","Fin","Temps de tournage"]
{"$rows_left_out":9}
{"sheet":"4","index":5,"n_rows":28,"n_cols":9,"rows_kept":28,"cut":false,"hidden":false,"merged":[[27,0,28,3],[27,4,28,8],[29,0,34,3],[29,4,34,8],[1,0,1,1],[4,0,4,1],[10,0,10,8],[14,0,14,8],[18,1,19,1],[18,2,19,2],[18,3,18,6],[18,7,19,7],[18,8,19,8]]}
[]
["PRODUCTION : ",null,{"$f":"SEM!A1","v":"XXXX"}]
[]
["FILM :",null,{"$f":"SEM!A2","v":"XXX"}]
[]
["NOM :",null,4,null,null,"LIGNE",{"$f":"9+(MATCH(C6,SEM!B10:B39,0))","v":20}]
["EMPLOI :",null,{"$f":"INDIRECT(\"SEM!A\" & (G6-1))","v":"INTITULÉ DU POSTE"}]
[]
[]
[]
[{"$f":"SEM!E6","v":"SEMAINE 1"}]
[]
[]
[]
[{"$f":"SEM!A6","v":"SEMAINE DU 01/01/2000 AU 05/01/2000"}]
[]
[]
[]
[null,"Horaires de tournage","Heures de préparation","Horaires effectifs de tournage",null,null,null,"Heures de rangement ","Total heures effectuées"]
[null,null,null,"Début","Repas","Fin","Temps de tournage"]
{"$rows_left_out":9}
{"sheet":"5","index":6,"n_rows":28,"n_cols":9,"rows_kept":28,"cut":false,"hidden":false,"merged":[[27,0,28,3],[27,4,28,8],[29,0,34,3],[29,4,34,8],[1,0,1,1],[4,0,4,1],[10,0,10,8],[14,0,14,8],[18,1,19,1],[18,2,19,2],[18,3,18,6],[18,7,19,7],[18,8,19,8]]}
[]
["PRODUCTION : ",null,{"$f":"SEM!A1","v":"XXXX"}]
[]
["FILM :",null,{"$f":"SEM!A2","v":"XXX"}]
[]
["NOM :",null,5,null,null,"LIGNE",{"$f":"9+(MATCH(C6,SEM!B10:B39,0))","v":23}]
["EMPLOI :",null,{"$f":"INDIRECT(\"SEM!A\" & (G6-1))","v":"INTITULÉ DU POSTE"}]
[]
[]
[]
[{"$f":"SEM!E6","v":"SEMAINE 1"}]
[]
[]
[]
[{"$f":"SEM!A6","v":"SEMAINE DU 01/01/2000 AU 05/01/2000"}]
[]
[]
[]
[null,"Horaires de tournage","Heures de préparation","Horaires effectifs de tournage",null,null,null,"Heures de rangement ","Total heures effectuées"]
[null,null,null,"Début","Repas","Fin","Temps de tournage"]
{"$rows_left_out":9}
{"sheet":"6","index":7,"n_rows":28,"n_cols":9,"rows_kept":28,"cut":false,"hidden":false,"merged":[[27,0,28,3],[27,4,28,8],[29,0,34,3],[29,4,34,8],[1,0,1,1],[4,0,4,1],[10,0,10,8],[14,0,14,8],[18,1,19,1],[18,2,19,2],[18,3,18,6],[18,7,19,7],[18,8,19,8]]}
[]
["PRODUCTION : ",null,{"$f":"SEM!A1","v":"XXXX"}]
[]
["FILM :",null,{"$f":"SEM!A2","v":"XXX"}]
[]
["NOM :",null,6,null,null,"LIGNE",{"$f":"9+(MATCH(C6,SEM!B10:B39,0))","v":26}]
["EMPLOI :",null,{"$f":"INDIRECT(\"SEM!A\" & (G6-1))","v":"INTITULÉ DU POSTE"}]
[]
[]
[]
[{"$f":"SEM!E6","v":"SEMAINE 1"}]
[]
[]
[]
[{"$f":"SEM!A6","v":"SEMAINE DU 01/01/2000 AU 05/01/2000"}]
[]
[]
[]
[null,"Horaires de tournage","Heures de préparation","Horaires effectifs de tournage",null,null,null,"Heures de rangement ","Total heures effectuées"]
[null,null,null,"Début","Repas","Fin","Temps de tournage"]
{"$rows_left_out":9}
{"sheet":"7","index":8,"n_rows":28,"n_cols":9,"rows_kept":28,"cut":false,"hidden":false,"merged":[[27,0,28,3],[27,4,28,8],[29,0,34,3],[29,4,34,8],[1,0,1,1],[4,0,4,1],[10,0,10,8],[14,0,14,8],[18,1,19,1],[18,2,19,2],[18,3,18,6],[18,7,19,7],[18,8,19,8]]}
[]
["PRODUCTION : ",null,{"$f":"SEM!A1","v":"XXXX"}]
[]
["FILM :",null,{"$f":"SEM!A2","v":"XXX"}]
[]
["NOM :",null,7,null,null,"LIGNE",{"$f":"9+(MATCH(C6,SEM!B10:B39,0))","v":29}]
["EMPLOI :",null,{"$f":"INDIRECT(\"SEM!A\" & (G6-1))","v":"INTITULÉ DU POSTE"}]
[]
[]
[]
[{"$f":"SEM!E6","v":"SEMAINE 1"}]
[]
[]
[]
[{"$f":"SEM!A6","v":"SEMAINE DU 01/01/2000 AU 05/01/2000"}]
[]
[]
[]
[null,"Horaires de tournage","Heures de préparation","Horaires effectifs de tournage",null,null,null,"Heures de rangement ","Total heures effectuées"]
[null,null,null,"Début","Repas","Fin","Temps de tournage"]
{"$rows_left_out":9}
{"sheet":"8","index":9,"n_rows":28,"n_cols":9,"rows_kept":28,"cut":false,"hidden":false,"merged":[[27,0,28,3],[27,4,28,8],[29,0,34,3],[29,4,34,8],[1,0,1,1],[4,0,4,1],[10,0,10,8],[14,0,14,8],[18,1,19,1],[18,2,19,2],[18,3,18,6],[18,7,19,7],[18,8,19,8]]}
[]
["PRODUCTION : ",null,{"$f":"SEM!A1","v":"XXXX"}]
[]
["FILM :",null,{"$f":"SEM!A2","v":"XXX"}]
[]
["NOM :",null,8,null,null,"LIGNE",{"$f":"9+(MATCH(C6,SEM!B10:B39,0))","v":32}]
["EMPLOI :",null,{"$f":"INDIRECT(\"SEM!A\" & (G6-1))","v":"INTITULÉ DU POSTE"}]
[]
[]
[]
[{"$f":"SEM!E6","v":"SEMAINE 1"}]
[]
[]
[]
[{"$f":"SEM!A6","v":"SEMAINE DU 01/01/2000 AU 05/01/2000"}]
[]
[]
[]
[null,"Horaires de tournage","Heures de préparation","Horaires effectifs de tournage",null,null,null,"Heures de rangement ","Total heures effectuées"]
[null,null,null,"Début","Repas","Fin","Temps de tournage"]
{"$rows_left_out":9}
{"sheet":"9","index":10,"n_rows":28,"n_cols":9,"rows_kept":28,"cut":false,"hidden":false,"merged":[[27,0,28,3],[27,4,28,8],[29,0,34,3],[29,4,34,8],[1,0,1,1],[4,0,4,1],[10,0,10,8],[14,0,14,8],[18,1,19,1],[18,2,19,2],[18,3,18,6],[18,7,19,7],[18,8,19,8]]}
[]
["PRODUCTION : ",null,{"$f":"SEM!A1","v":"XXXX"}]
[]
["FILM :",null,{"$f":"SEM!A2","v":"XXX"}]
[]
["NOM :",null,9,null,null,"LIGNE",{"$f":"9+(MATCH(C6,SEM!B10:B39,0))","v":35}]
["EMPLOI :",null,{"$f":"INDIRECT(\"SEM!A\" & (G6-1))","v":"INTITULÉ DU POSTE"}]
[]
[]
[]
[{"$f":"SEM!E6","v":"SEMAINE 1"}]
[]
[]
[]
[{"$f":"SEM!A6","v":"SEMAINE DU 01/01/2000 AU 05/01/2000"}]
[]
[]
[]
[null,"Horaires de tournage","Heures de préparation","Horaires effectifs de tournage",null,null,null,"Heures de rangement ","Total heures effectuées"]
[null,null,null,"Début","Repas","Fin","Temps de tournage"]
{"$rows_left_out":9}
{"sheet":"10","index":11,"n_rows":28,"n_cols":9,"rows_kept":28,"cut":false,"hidden":false,"merged":[[27,0,28,3],[27,4,28,8],[29,0,34,3],[29,4,34,8],[1,0,1,1],[4,0,4,1],[10,0,10,8],[14,0,14,8],[18,1,19,1],[18,2,19,2],[18,3,18,6],[18,7,19,7],[18,8,19,8]]}
[]
["PRODUCTION : ",null,{"$f":"SEM!A1","v":"XXXX"}]
[]
["FILM :",null,{"$f":"SEM!A2","v":"XXX"}]
[]
["NOM :",null,10,null,null,"LIGNE",{"$f":"9+(MATCH(C6,SEM!B10:B39,0))","v":38}]
["EMPLOI :",null,{"$f":"INDIRECT(\"SEM!A\" & (G6-1))","v":"INTITULÉ DU POSTE"}]
[]
[]
[]
[{"$f":"SEM!E6","v":"SEMAINE 1"}]
[]
[]
[]
[{"$f":"SEM!A6","v":"SEMAINE DU 01/01/2000 AU 05/01/2000"}]
[]
[]
[]
[null,"Horaires de tournage","Heures de préparation","Horaires effectifs de tournage",null,null,null,"Heures de rangement ","Total heures effectuées"]
[null,null,null,"Début","Repas","Fin","Temps de tournage"]
{"$rows_left_out":8}