{"text_format":"1","workbook":"xlsx","n_sheets":4,"sheets":["PLANNING","10-2017","605-1685","Feuil1"],"not_rendered":{"charts":0,"images":2,"macros":0,"external_links":2,"defined_names":12,"comments":2,"pivot_tables":0},"unopened":[],"bounds":{"document_bytes":16777216,"sheet_cells":100000,"rows_first":2000,"rows_last":500,"rows_between":2000,"halvings":0,"cell_chars":16384,"cell_head_chars":4096},"cells_cut":0,"cells_raw":0,"read":"whole","date_system":"1900"}

{"sheet":"PLANNING","index":0,"n_rows":23,"n_cols":7,"rows_kept":23,"cut":false,"hidden":false,"merged":[[14,2,14,5],[0,5,1,5],[0,0,1,0],[0,1,1,1],[0,2,1,2],[0,3,1,3],[0,4,1,4]]}
["NOM ONGLET","Moule n°","Désignation","Matière"]
[]
[{"$f":"IF(INT(ROW(A4)/4)+1<=COUNTA(Feuil1!A:A),INDEX(Feuil1!A:A,INT(ROW(A4)/4)+1),\"\")","v":"Feuil1"},{"$f":"IF(OR($A3=\"\",INDIRECT(\"'\"&$A3&\"'!D14\")=\"\"),\"\",IFERROR(INDIRECT(\"'\"&$A3&\"'!D14\"),\"\"))","v":""},{"$f":"+VLOOKUP($A3,'[2]2016'!$1:$1048576,4,0)","v":{"$error":"#N/A"}},{"$f":"+VLOOKUP($A3,'[2]2016'!$1:$1048576,11,0)","v":{"$error":"#N/A"}},{"$f":"+VLOOKUP($A3,'[2]2016'!$1:$1048576,13,0)","v":{"$error":"#N/A"}},{"$f":"+VLOOKUP($A3,'[2]2016'!$1:$1048576,3,0)","v":{"$error":"#N/A"}},{"$f":"INT(ROW(A4)/4+1)","v":2}]
[null,"Matière",{"$f":"+VLOOKUP($A3,'[2]2016'!$1:$1048576,12,0)","v":{"$error":"#N/A"}},"Essai Demandé",null,{"$f":"+VLOOKUP($A3,'[2]2016'!$1:$1048576,6,0)","v":{"$error":"#N/A"}}]
[null,"Presse",null,"Essai Planifié",null,"2016-12-05"]
[null,"Robot",null,"Essai réalisé",null,{"$f":"+VLOOKUP($A3,'[2]2016'!$1:$1048576,8,0)","v":{"$error":"#N/A"}}]
[{"$f":"IF(INT(ROW(A8)/4)+1<=COUNTA(Feuil1!A:A),INDEX(Feuil1!A:A,INT(ROW(A8)/4)+1),\"\")","v":"Feuil2"},{"$f":"IF(OR($A7=\"\",INDIRECT(\"'\"&$A7&\"'!D14\")=\"\"),\"\",IFERROR(INDIRECT(\"'\"&$A7&\"'!D14\"),\"\"))","v":{"$error":"#REF!"}},{"$f":"+VLOOKUP($A7,'[2]2016'!$1:$1048576,4,0)","v":{"$error":"#N/A"}},{"$f":"+VLOOKUP($A7,'[2]2016'!$1:$1048576,11,0)","v":{"$error":"#N/A"}},{"$f":"+VLOOKUP($A7,'[2]2016'!$1:$1048576,13,0)","v":{"$error":"#N/A"}},{"$f":"+VLOOKUP($A7,'[2]2016'!$1:$1048576,3,0)","v":{"$error":"#N/A"}},{"$f":"INT(ROW(A8)/4+1)","v":3}]
[null,"Matière",{"$f":"VLOOKUP($A7,'[2]2016'!$1:$1048576,12,0)","v":{"$error":"#N/A"}},"Essai Demandé",null,{"$f":"+VLOOKUP($A7,'[2]2016'!$1:$1048576,6,0)","v":{"$error":"#N/A"}}]
[null,"Presse",null,"Essai Planifié",null,"2016-12-05"]
[null,"Robot",null,"Essai réalisé",null,{"$f":"+VLOOKUP($A7,'[2]2016'!$1:$1048576,8,0)","v":{"$error":"#N/A"}}]
[{"$f":"IF(INT(ROW(A12)/4)+1<=COUNTA(Feuil1!A:A),INDEX(Feuil1!A:A,INT(ROW(A12)/4)+1),\"\")","v":"Feuil3"},{"$f":"IF(OR($A11=\"\",INDIRECT(\"'\"&$A11&\"'!D14\")=\"\"),\"\",IFERROR(INDIRECT(\"'\"&$A11&\"'!D14\"),\"\"))","v":{"$error":"#REF!"}},{"$f":"+VLOOKUP($A11,'[2]2016'!$1:$1048576,4,0)","v":{"$error":"#N/A"}},{"$f":"+VLOOKUP($A11,'[2]2016'!$1:$1048576,11,0)","v":{"$error":"#N/A"}},{"$f":"+VLOOKUP($A11,'[2]2016'!$1:$1048576,13,0)","v":{"$error":"#N/A"}},{"$f":"+VLOOKUP($A11,'[2]2016'!$1:$1048576,3,0)","v":{"$error":"#N/A"}},{"$f":"INT(ROW(A12)/4+1)","v":4}]
[null,"Matière",{"$f":"+VLOOKUP($A11,'[2]2016'!$1:$1048576,12,0)","v":{"$error":"#N/A"}},"Essai Demandé",null,{"$f":"+VLOOKUP($A11,'[2]2016'!$1:$1048576,6,0)","v":{"$error":"#N/A"}}]
[null,"Presse",null,"Essai Planifié",null,"2016-12-05"]
[null,"Robot",null,"Essai réalisé",null,{"$f":"+VLOOKUP($A11,'[2]2016'!$1:$1048576,8,0)","v":{"$error":"#N/A"}}]
[{"$f":"IF(INT(ROW(A16)/4)+1<=COUNTA(Feuil1!A:A),INDEX(Feuil1!A:A,INT(ROW(A16)/4)+1),\"\")","v":"Feuil4"},null,null,null,null,null,{"$f":"INT(ROW(A16)/4+1)","v":5}]
[]
[]
[]
[{"$f":"IF(INT(ROW(A20)/4)+1<=COUNTA(Feuil1!A:A),INDEX(Feuil1!A:A,INT(ROW(A20)/4)+1),\"\")","v":"Feuil5"},null,null,null,null,null,{"$f":"INT(ROW(A20)/4+1)","v":6}]
[]
[]
[]
[{"$f":"IF(INT(ROW(A24)/4)+1<=COUNTA(Feuil1!A:A),INDEX(Feuil1!A:A,INT(ROW(A24)/4)+1),\"\")","v":"Feuil6"},null,null,null,null,null,{"$f":"INT(ROW(A24)/4+1)","v":7}]

{"sheet":"10-2017","index":1,"n_rows":115,"n_cols":30,"rows_kept":115,"cut":false,"hidden":false,"merged":[[112,2,112,7],[112,15,112,20],[114,1,114,24],[115,1,115,24],[110,2,110,10],[110,15,110,23],[111,2,111,7],[111,8,111,9],[111,15,111,20],[111,21,111,22],[107,2,107,4],[107,6,107,8],[107,10,107,23],[108,2,108,4],[108,6,108,8],[108,10,108,23],[105,2,105,4],[105,6,105,8],[105,10,105,23],[106,2,106,4],[106,6,106,8],[106,10,106,23],[103,2,103,4],[103,6,103,8],[103,10,103,23],[104,2,104,4],[104,6,104,8],[104,10,104,23],[101,2,101,4],[101,6,101,8],[101,10,101,23],[102,2,102,4],[102,6,102,8],[102,10,102,23],[97,2,97,4],[97,6,97,8],[97,10,97,23],[100,2,100,5],[100,6,100,9],[100,10,100,23],[95,2,95,4],[95,6,95,8],[95,10,95,23],[96,2,96,4],[96,6,96,8],[96,10,96,23],[93,2,93,4],[93,6,93,8],[93,10,93,23],[94,2,94,4],[94,6,94,8],[94,10,94,23],[91,2,91,4],[91,6,91,8],[91,10,91,23],[92,2,92,4],[92,6,92,8],[92,10,92,23],[86,1,86,24],[89,2,89,5],[89,6,89,9],[89,10,89,23],[90,2,90,4],[90,6,90,8],[90,10,90,23],[82,1,82,6],[82,11,82,24],[83,1,83,6],[83,11,83,24],[84,1,84,24],[85,1,85,24],[79,1,79,6],[79,11,79,24],[80,1,80,6],[80,11,80,24],[81,1,81,6],[81,11,81,24],[76,1,76,6],[76,11,76,24],[77,1,77,6],[77,11,77,24],[78,1,78,6],[78,11,78,24],[72,1,72,24],[73,1,73,10],[73,11,73,24],[74,1,74,6],[74,11,74,24],[75,1,75,6],[75,11,75,24],[69,1,69,4],[69,9,69,12],[69,17,69,20],[70,1,70,4],[70,9,70,12],[71,1,71,4],[67,1,67,8],[67,9,67,16],[67,17,67,24],[68,1,68,4],[68,5,68,8],[68,9,68,12],[68,13,68,16],[68,17,68,20],[68,21,68,24],[65,1,65,4],[65,5,65,8],[65,9,65,11],[65,13,65,16],[65,17,65,20],[65,21,65,24],[62,1,62,5],[62,6,62,7],[62,9,62,12],[62,13,62,15],[62,17,62,20],[62,21,62,23],[46,1,46,4],[46,9,46,12],[46,17,46,20],[47,1,47,4],[47,13,47,16],[47,17,53,24],[48,1,48,16],[42,21,42,24],[44,1,44,4],[44,9,44,12],[44,17,44,20],[45,1,45,4],[45,9,45,12],[45,17,45,20],[42,1,42,3],[42,4,42,5],[42,6,42,8],[42,9,42,11],[42,12,42,13],[42,16,42,20],[39,1,39,4],[39,5,39,8],[39,9,39,12],[39,13,39,15],[39,16,39,20],[39,21,39,24],[36,1,36,4],[36,5,36,8],[36,9,36,12],[36,13,36,15],[36,16,36,20],[36,21,36,24],[30,1,30,24],[32,1,32,24],[33,2,33,8],[33,10,33,16],[33,18,33,24],[34,2,34,3],[34,4,34,8],[34,10,34,16],[34,18,34,24],[22,1,22,4],[24,1,24,24],[26,11,28,15],[27,1,27,4],[27,5,27,8],[27,16,27,17],[27,20,27,24],[18,1,18,3],[18,4,18,9],[18,13,18,15],[18,16,18,21],[18,23,19,23],[18,24,19,24],[19,1,19,3],[19,4,19,9],[19,13,19,15],[19,16,19,21],[15,1,15,2],[15,3,15,6],[15,7,15,10],[15,11,15,13],[15,17,15,21],[15,22,15,24],[9,18,9,24],[10,8,10,15],[10,18,10,24],[13,1,13,2],[13,3,13,6],[13,7,13,10],[13,17,13,21],[13,22,13,24],[7,1,10,2],[7,3,10,5],[7,6,10,7],[7,8,7,15],[7,16,10,17],[7,18,7,24],[8,8,8,15],[8,18,8,24],[9,8,9,15],[1,1,2,5],[1,6,2,13],[1,14,2,19],[1,20,1,24],[2,20,2,24],[4,1,4,3],[4,4,4,7],[4,9,4,10],[4,11,4,14],[4,17,4,19],[4,20,4,23]]}
[]
[null,null,null,null,null,null,"FICHE ESSAI N°",null,null,null,null,null,null,null,{"$f":"MID(CELL(\"nomfichier\",A1),FIND(\"]\",CELL(\"nomfichier\",A1))+1,50)","v":"10-2017"},null,null,null,null,null,"F1007-00"]
[null,null,null,null,null,null,null,null,null,null,null,null,null,null,null,null,null,null,null,null,"Date : 13/07/2016"]
[]
[null,"Demandée le :",null,null,"2016-12-01",null,null,null,null,"Par :",null,"MP",null,null,null,null,null,"Délai :",null,null,null,null,null,null,null,null,null,null,"NOTA","changer le nom de l'onglet pour changer le n° d'essai "]
[]
[]
[null,"Client :",null,null,null,null,"Pièce(s) :",null,null,null,null,null,null,null,null,null,"Réf(s) : "]
[]
[]
[]
[]
[]
[null,"Moule n° :",null,654,null,null,null,"Dim. moule (cm) :",null,null,null,"H :",null,"L :",null,"Ep :",null,"Surface projetée (cm²) :"]
[]
[null,"Mouliste :",null,null,null,null,null,"Nombre empreinte :",null,null,null,null,null,null,null,null,null,"Volume (cm3) :"]
[]
[]
[null,"Matière :",null,null,"ERGMJHN",null,null,null,null,null,null,null,null,"Colorant :",null,null,null,null,null,null,null,null,null,null,"%"]
[null,"Référence :",null,null,null,null,null,null,null,null,null,null,null,"Référence :"]
[]
[]
[null,"MOTIF DE L'ESSAI :",null,null,null,null,"Moule neuf",null,null,"Modification",null,null,"Réparation",null,null,"Transfert",null,null,"MAP n° :",null,null,null,"Autre"]
[]
[]
[]
[null,null,null,null,null,null,null,null,null,null,null,"Quantité de pièce à faire :\nAprès stabilisation du réglage"]
[null,"Lieu de l'essai :",null,null,null,null,null,null,null,null,null,null,null,null,null,null,null,null,"+",5,"Moulées\n(3 pour DEV + 2 pour QUAL)"]
[]
[null,"Consignes particulières liées au conditionnement :"]
[]
[null,"Détail cinématique si Moule à risque :"]
[]
[null,null,"Courbe de poids",null,null,null,null,null,null,null,"2 moulées incomplètes à 50%",null,null,null,null,null,null,null,"2 moulées temps de refroidissement x1,5"]
[null,null,"Autre :",null,null,null,null,null,null,null,"2 moulées incomplètes à 75%",null,null,null,null,null,null,null,"2 moulées temps de refroidissement x2"]
[]
[null,"Tonnage vendu :",null,null,null,null,null,null,null,"Cycle vendu : ",null,null,null,null,null,null,"Stock matière avant essai : "]
[]
[]
[null,"Tonnage prévu : ",null,null,null,null,null,null,null,"Presse retenue : ",null,null,null,null,null,null,"N° Lot matière :"]
[]
[]
[null,"T°C Etuvage :",null,null,null,null,"Temps Etuvage :",null,null,null,null,null,"Réf. Étuve :",null,null,null,"Stock matière après essai : "]
[]
[null,"Circuit d'eau étanche :",null,null,null,null,"oui",null,"non","Localisation fuite matière :",null,null,null,null,"oui",null,"non","Ep. Moule suffisante :",null,null,null,null,"oui",null,"non"]
[null,"Circuit d'eau passant :",null,null,null,null,"oui",null,"non","Arrache carotte suffisant :",null,null,null,null,"oui",null,"non","Bridage suffisant :",null,null,null,null,"oui",null,"non"]
[null,"Empreintes équilibrées :",null,null,null,null,"oui",null,"non","Anomalie outillage :",null,null,null,null,"oui",null,"non","Sécurité suffisante :",null,null,null,null,"oui",null,"non"]
[null,"Localisation fuite régul. :",null,null,null,null,"oui",null,"non","Précisez localisation :",null,null,null,null,null,null,null,"\nPhoto"]
[null,"OBSERVATIONS OUTILLAGE ET PIECES :"]
[]
[]
[]
[]
[]
[]
[]
[]
[]
[]
[]
[]
[]
[null,"Temps de cycle retenu :",null,null,null,null,null,null,{"$f":"IF(G63=\"\",\"sec\",\"\")","v":"sec"},"Poids \"grappe\" BRUT :",null,null,null,null,null,null,{"$f":"IF(N63=\"\",\"gr\",\"\")","v":"gr"},"Poids \"pièce\" NET :",null,null,null,null,null,null,{"$f":"IF(V63=\"\",\"gr\",\"\")","v":"gr"}]
[]
[]
[null,"Essai réalisé par :",null,null,null,null,null,null,null,"Joindre une fiche de réglages",null,null,"Le :",null,null,null,null,"Visa Resp. Production:"]
[]
[null,"VALIDATION PIECE",null,null,null,null,null,null,null,"VALIDATION OUTILLAGE",null,null,null,null,null,null,null,"VALIDATION COMMERCIALE"]
[null,"Visa Référent Qualité :",null,null,null,null,null,null,null,"Visa Demandeur essai :",null,null,null,null,null,null,null,"Visa :"]
[null,"Mise à jour Docs Qualité :",null,null,null,null,"oui",null,"non","Retour mouliste :",null,null,null,null,"oui",null,"non","Mise à jour gamme :",null,null,null,null,"oui",null,"non"]
[null,"Homologation interne :",null,null,null,null,"oui",null,"non","Fiche scannée :",null,null,null,null,"oui",null,"non"]
[null,"Homologation externe :",null,null,null,null,"oui",null,"non"]
[null,"OBSERVATIONS OUTILLAGE ET PIECES"]
[null,"Défauts",null,null,null,null,null,null,null,null,null,"Causes / Remèdes / Solutions"]
[null,"Bavure",null,null,null,null,null,null,"oui",null,"non"]
[null,"Brûlure / marbrure",null,null,null,null,null,null,"oui",null,"non"]
[null,"Givrage",null,null,null,null,null,null,"oui",null,"non"]
[null,"Jet libre",null,null,null,null,null,null,"oui",null,"non"]
[null,"Ligne de soudure",null,null,null,null,null,null,"oui",null,"non"]
[null,"Peau d'orange",null,null,null,null,null,null,"oui",null,"non"]
[null,"Retassure",null,null,null,null,null,null,"oui",null,"non"]
[null,"Déformation / voilage",null,null,null,null,null,null,"oui",null,"non"]
[null,"Bulle",null,null,null,null,null,null,"oui",null,"non"]
[null,"Autres : _____________________   ",null,null,null,null,null,null,"oui",null,"non"]
[null,"TRAITEMENT DES ANOMALIES"]
[]
[null,"COURBES DE POIDS"]
[]
[null,null,"TEMPS DE MAINTIEN :"]
[null,null,"Pression",null,null,null,"Poids",null,null,null,"Défauts constatés"]
[null,null,null,null,null,"bars",null,null,null,"gr"]
[null,null,null,null,null,"bars",null,null,null,"gr"]
[null,null,null,null,null,"bars",null,null,null,"gr"]
[null,null,null,null,null,"bars",null,null,null,"gr"]
[null,null,null,null,null,"bars",null,null,null,"gr"]
[null,null,null,null,null,"bars",null,null,null,"gr"]
[null,null,null,null,null,"bars",null,null,null,"gr"]
[null,null,null,null,null,"bars",null,null,null,"gr"]
[]
[null,null,"PRESSION DE MAINTIEN :"]
[null,null,"Temps",null,null,null,"Poids",null,null,null,"Défauts constatés"]
[null,null,null,null,null,"sec",null,null,null,"gr"]
[null,null,null,null,null,"sec",null,null,null,"gr"]
[null,null,null,null,null,"sec",null,null,null,"gr"]
[null,null,null,null,null,"sec",null,null,null,"gr"]
[null,null,null,null,null,"sec",null,null,null,"gr"]
[null,null,null,null,null,"sec",null,null,null,"gr"]
[null,null,null,null,null,"sec",null,null,null,"gr"]
[null,null,null,null,null,"sec",null,null,null,"gr"]
[]
[null,null,"Conclusion",null,null,null,null,null,null,null,null,null,null,null,null,"Avis RQ"]
[null,null,"Temps de maintien à appliquer :",null,null,null,null,null,null,null,"sec",null,null,null,null,"Poids mini retenu :",null,null,null,null,null,null,null,"gr"]
[null,null,"Pression de maintien à appliquer :",null,null,null,null,null,null,null,"bars",null,null,null,null,"Poids maxi retenu :",null,null,null,null,null,null,null,"gr"]
[]
[null,"INFLUENCES DES PARAMETRES DE REGLAGES :          Ex. T° moule, Vitesse d'injection, Temps et pression de maintien, T° matière, Pression de verrouillage, ..."]

{"sheet":"605-1685","index":2,"n_rows":115,"n_cols":30,"rows_kept":115,"cut":false,"hidden":false,"merged":[[112,2,112,7],[112,15,112,20],[114,1,114,24],[115,1,115,24],[110,2,110,10],[110,15,110,23],[111,2,111,7],[111,8,111,9],[111,15,111,20],[111,21,111,22],[107,2,107,4],[107,6,107,8],[107,10,107,23],[108,2,108,4],[108,6,108,8],[108,10,108,23],[105,2,105,4],[105,6,105,8],[105,10,105,23],[106,2,106,4],[106,6,106,8],[106,10,106,23],[103,2,103,4],[103,6,103,8],[103,10,103,23],[104,2,104,4],[104,6,104,8],[104,10,104,23],[101,2,101,4],[101,6,101,8],[101,10,101,23],[102,2,102,4],[102,6,102,8],[102,10,102,23],[97,2,97,4],[97,6,97,8],[97,10,97,23],[100,2,100,5],[100,6,100,9],[100,10,100,23],[95,2,95,4],[95,6,95,8],[95,10,95,23],[96,2,96,4],[96,6,96,8],[96,10,96,23],[93,2,93,4],[93,6,93,8],[93,10,93,23],[94,2,94,4],[94,6,94,8],[94,10,94,23],[91,2,91,4],[91,6,91,8],[91,10,91,23],[92,2,92,4],[92,6,92,8],[92,10,92,23],[86,1,86,24],[89,2,89,5],[89,6,89,9],[89,10,89,23],[90,2,90,4],[90,6,90,8],[90,10,90,23],[82,1,82,6],[82,11,82,24],[83,1,83,6],[83,11,83,24],[84,1,84,24],[85,1,85,24],[79,1,79,6],[79,11,79,24],[80,1,80,6],[80,11,80,24],[81,1,81,6],[81,11,81,24],[76,1,76,6],[76,11,76,24],[77,1,77,6],[77,11,77,24],[78,1,78,6],[78,11,78,24],[72,1,72,24],[73,1,73,10],[73,11,73,24],[74,1,74,6],[74,11,74,24],[75,1,75,6],[75,11,75,24],[69,1,69,4],[69,9,69,12],[69,17,69,20],[70,1,70,4],[70,9,70,12],[71,1,71,4],[67,1,67,8],[67,9,67,16],[67,17,67,24],[68,1,68,4],[68,5,68,8],[68,9,68,12],[68,13,68,16],[68,17,68,20],[68,21,68,24],[65,1,65,4],[65,5,65,8],[65,9,65,11],[65,13,65,16],[65,17,65,20],[65,21,65,24],[62,1,62,5],[62,6,62,7],[62,9,62,12],[62,13,62,15],[62,17,62,20],[62,21,62,23],[46,1,46,4],[46,9,46,12],[46,17,46,20],[47,1,47,4],[47,13,47,16],[47,17,53,24],[48,1,48,16],[42,21,42,24],[44,1,44,4],[44,9,44,12],[44,17,44,20],[45,1,45,4],[45,9,45,12],[45,17,45,20],[42,1,42,3],[42,4,42,5],[42,6,42,8],[42,9,42,11],[42,12,42,13],[42,16,42,20],[39,1,39,4],[39,5,39,8],[39,9,39,12],[39,13,39,15],[39,16,39,20],[39,21,39,24],[36,1,36,4],[36,5,36,8],[36,9,36,12],[36,13,36,15],[36,16,36,20],[36,21,36,24],[30,1,30,24],[32,1,32,24],[33,2,33,8],[33,10,33,16],[33,18,33,24],[34,2,34,3],[34,4,34,8],[34,10,34,16],[34,18,34,24],[22,1,22,4],[24,1,24,24],[26,11,28,15],[27,1,27,4],[27,5,27,8],[27,16,27,17],[27,20,27,24],[18,1,18,3],[18,4,18,9],[18,13,18,15],[18,16,18,21],[18,23,19,23],[18,24,19,24],[19,1,19,3],[19,4,19,9],[19,13,19,15],[19,16,19,21],[15,1,15,2],[15,3,15,6],[15,7,15,10],[15,11,15,13],[15,17,15,21],[15,22,15,24],[9,18,9,24],[10,8,10,15],[10,18,10,24],[13,1,13,2],[13,3,13,6],[13,7,13,10],[13,17,13,21],[13,22,13,24],[7,1,10,2],[7,3,10,5],[7,6,10,7],[7,8,7,15],[7,16,10,17],[7,18,7,24],[8,8,8,15],[8,18,8,24],[9,8,9,15],[1,1,2,5],[1,6,2,13],[1,14,2,19],[1,20,1,24],[2,20,2,24],[4,1,4,3],[4,4,4,7],[4,9,4,10],[4,11,4,14],[4,17,4,19],[4,20,4,23]]}
[]
[null,null,null,null,null,null,"FICHE ESSAI N°",null,null,null,null,null,null,null,{"$f":"MID(CELL(\"nomfichier\",A1),FIND(\"]\",CELL(\"nomfichier\",A1))+1,50)","v":"605-1685"},null,null,null,null,null,"F1007-00"]
[null,null,null,null,null,null,null,null,null,null,null,null,null,null,null,null,null,null,null,null,"Date : 13/07/2016"]
[]
[null,"Demandée le :",null,null,null,null,null,null,null,"Par :",null,null,null,null,null,null,null,"Délai :",null,null,null,null,null,null,null,null,null,null,"NOTA","changer le nom de l'onglet pour changer le n° d'essai "]
[]
[]
[null,"Client :",null,null,null,null,"Pièce(s) :",null,null,null,null,null,null,null,null,null,"Réf(s) : "]
[]
[]
[]
[]
[]
[null,"Moule n° :",null,53,null,null,null,"Dim. moule (cm) :",null,null,null,"H :",null,"L :",null,"Ep :",null,"Surface projetée (cm²) :"]
[]
[null,"Mouliste :",null,null,null,null,null,"Nombre empreinte :",null,null,null,null,null,null,null,null,null,"Volume (cm3) :"]
[]
[]
[null,"Matière :",null,null,null,null,null,null,null,null,null,null,null,"Colorant :",null,null,null,null,null,null,null,null,null,null,"%"]
[null,"Référence :",null,null,null,null,null,null,null,null,null,null,null,"Référence :"]
[]
[]
[null,"MOTIF DE L'ESSAI :",null,null,null,null,"Moule neuf",null,null,"Modification",null,null,"Réparation",null,null,"Transfert",null,null,"MAP n° :",null,null,null,"Autre"]
[]
[]
[]
[null,null,null,null,null,null,null,null,null,null,null,"Quantité de pièce à faire :\nAprès stabilisation du réglage"]
[null,"Lieu de l'essai :",null,null,null,null,null,null,null,null,null,null,null,null,null,null,null,null,"+",5,"Moulées\n(3 pour DEV + 2 pour QUAL)"]
[]
[null,"Consignes particulières liées au conditionnement :"]
[]
[null,"Détail cinématique si Moule à risque :"]
[]
[null,null,"Courbe de poids",null,null,null,null,null,null,null,"2 moulées incomplètes à 50%",null,null,null,null,null,null,null,"2 moulées temps de refroidissement x1,5"]
[null,null,"Autre :",null,null,null,null,null,null,null,"2 moulées incomplètes à 75%",null,null,null,null,null,null,null,"2 moulées temps de refroidissement x2"]
[]
[null,"Tonnage vendu :",null,null,null,null,null,null,null,"Cycle vendu : ",null,null,null,null,null,null,"Stock matière avant essai : "]
[]
[]
[null,"Tonnage prévu : ",null,null,null,null,null,null,null,"Presse retenue : ",null,null,null,null,null,null,"N° Lot matière :"]
[]
[]
[null,"T°C Etuvage :",null,null,null,null,"Temps Etuvage :",null,null,null,null,null,"Réf. Étuve :",null,null,null,"Stock matière après essai : "]
[]
[null,"Circuit d'eau étanche :",null,null,null,null,"oui",null,"non","Localisation fuite matière :",null,null,null,null,"oui",null,"non","Ep. Moule suffisante :",null,null,null,null,"oui",null,"non"]
[null,"Circuit d'eau passant :",null,null,null,null,"oui",null,"non","Arrache carotte suffisant :",null,null,null,null,"oui",null,"non","Bridage suffisant :",null,null,null,null,"oui",null,"non"]
[null,"Empreintes équilibrées :",null,null,null,null,"oui",null,"non","Anomalie outillage :",null,null,null,null,"oui",null,"non","Sécurité suffisante :",null,null,null,null,"oui",null,"non"]
[null,"Localisation fuite régul. :",null,null,null,null,"oui",null,"non","Précisez localisation :",null,null,null,null,null,null,null,"\nPhoto"]
[null,"OBSERVATIONS OUTILLAGE ET PIECES :"]
[]
[]
[]
[]
[]
[]
[]
[]
[]
[]
[]
[]
[]
[null,"Temps de cycle retenu :",null,null,null,null,null,null,{"$f":"IF(G63=\"\",\"sec\",\"\")","v":"sec"},"Poids \"grappe\" BRUT :",null,null,null,null,null,null,{"$f":"IF(N63=\"\",\"gr\",\"\")","v":"gr"},"Poids \"pièce\" NET :",null,null,null,null,null,null,{"$f":"IF(V63=\"\",\"gr\",\"\")","v":"gr"}]
[]
[]
[null,"Essai réalisé par :",null,null,null,null,null,null,null,"Joindre une fiche de réglages",null,null,"Le :",null,null,null,null,"Visa Resp. Production:"]
[]
[null,"VALIDATION PIECE",null,null,null,null,null,null,null,"VALIDATION OUTILLAGE",null,null,null,null,null,null,null,"VALIDATION COMMERCIALE"]
[null,"Visa Référent Qualité :",null,null,null,null,null,null,null,"Visa Demandeur essai :",null,null,null,null,null,null,null,"Visa :"]
[null,"Mise à jour Docs Qualité :",null,null,null,null,"oui",null,"non","Retour mouliste :",null,null,null,null,"oui",null,"non","Mise à jour gamme :",null,null,null,null,"oui",null,"non"]
[null,"Homologation interne :",null,null,null,null,"oui",null,"non","Fiche scannée :",null,null,null,null,"oui",null,"non"]
[null,"Homologation externe :",null,null,null,null,"oui",null,"non"]
[null,"OBSERVATIONS OUTILLAGE ET PIECES"]
[null,"Défauts",null,null,null,null,null,null,null,null,null,"Causes / Remèdes / Solutions"]
[null,"Bavure",null,null,null,null,null,null,"oui",null,"non"]
[null,"Brûlure / marbrure",null,null,null,null,null,null,"oui",null,"non"]
[null,"Givrage",null,null,null,null,null,null,"oui",null,"non"]
[null,"Jet libre",null,null,null,null,null,null,"oui",null,"non"]
[null,"Ligne de soudure",null,null,null,null,null,null,"oui",null,"non"]
[null,"Peau d'orange",null,null,null,null,null,null,"oui",null,"non"]
[null,"Retassure",null,null,null,null,null,null,"oui",null,"non"]
[null,"Déformation / voilage",null,null,null,null,null,null,"oui",null,"non"]
[null,"Bulle",null,null,null,null,null,null,"oui",null,"non"]
[null,"Autres : _____________________   ",null,null,null,null,null,null,"oui",null,"non"]
[null,"TRAITEMENT DES ANOMALIES"]
[]
[null,"COURBES DE POIDS"]
[]
[null,null,"TEMPS DE MAINTIEN :"]
[null,null,"Pression",null,null,null,"Poids",null,null,null,"Défauts constatés"]
[null,null,null,null,null,"bars",null,null,null,"gr"]
[null,null,null,null,null,"bars",null,null,null,"gr"]
[null,null,null,null,null,"bars",null,null,null,"gr"]
[null,null,null,null,null,"bars",null,null,null,"gr"]
[null,null,null,null,null,"bars",null,null,null,"gr"]
[null,null,null,null,null,"bars",null,null,null,"gr"]
[null,null,null,null,null,"bars",null,null,null,"gr"]
[null,null,null,null,null,"bars",null,null,null,"gr"]
[]
[null,null,"PRESSION DE MAINTIEN :"]
[null,null,"Temps",null,null,null,"Poids",null,null,null,"Défauts constatés"]
[null,null,null,null,null,"sec",null,null,null,"gr"]
[null,null,null,null,null,"sec",null,null,null,"gr"]
[null,null,null,null,null,"sec",null,null,null,"gr"]
[null,null,null,null,null,"sec",null,null,null,"gr"]
[null,null,null,null,null,"sec",null,null,null,"gr"]
[null,null,null,null,null,"sec",null,null,null,"gr"]
[null,null,null,null,null,"sec",null,null,null,"gr"]
[null,null,null,null,null,"sec",null,null,null,"gr"]
[]
[null,null,"Conclusion",null,null,null,null,null,null,null,null,null,null,null,null,"Avis RQ"]
[null,null,"Temps de maintien à appliquer :",null,null,null,null,null,null,null,"sec",null,null,null,null,"Poids mini retenu :",null,null,null,null,null,null,null,"gr"]
[null,null,"Pression de maintien à appliquer :",null,null,null,null,null,null,null,"bars",null,null,null,null,"Poids maxi retenu :",null,null,null,null,null,null,null,"gr"]
[]
[null,"INFLUENCES DES PARAMETRES DE REGLAGES :          Ex. T° moule, Vitesse d'injection, Temps et pression de maintien, T° matière, Pression de verrouillage, ..."]

{"sheet":"Feuil1","index":3,"n_rows":7,"n_cols":4,"rows_kept":7,"cut":false,"hidden":false,"merged":[]}
["nom feuille",null,null,{"$f":"COUNTA(A:A)","v":7}]
["Feuil1"]
["Feuil2"]
["Feuil3"]
["Feuil4"]
["Feuil5"]
["Feuil6"]