{"text_format":"1","workbook":"xlsx","n_sheets":2,"sheets":["Données","Marco"],"not_rendered":{"charts":0,"images":0,"macros":1,"external_links":0,"defined_names":2,"comments":0,"pivot_tables":0},"unopened":[],"bounds":{"document_bytes":16777216,"sheet_cells":100000,"rows_first":2000,"rows_last":500,"rows_between":2000,"halvings":0,"cell_chars":16384,"cell_head_chars":4096},"cells_cut":0,"cells_raw":0,"read":"whole","date_system":"1900"}

{"sheet":"Données","index":0,"n_rows":185,"n_cols":11,"rows_kept":185,"cut":false,"hidden":false,"merged":[]}
["Planning","N°cde","Tps de fab","HT","clients","Nbs cellule","Concatener",1,"heures",4,"cellules"]
["020000","Maintenance",1,null," machine",{"$f":"ROUNDDOWN(H2,0)","v":4},{"$f":"CONCATENATE(B2, E2)","v":"Maintenance machine"},{"$f":"SUM(C2*$J$1/$H$1)","v":4}]
["020101",1611670,1.1599999999999999,null," A",{"$f":"ROUNDDOWN(H3,0)","v":4},"1611670 A",{"$f":"SUM(C3*$J$1/$H$1)","v":4.6399999999999997}]
["020102",1612613,3,null," D",12,"1612613 D",12]
["020103",1612612,3.27,null," E",13,"1612612 E",13.08]
["020104",1612614,1.55,null," S",6,"1612614 S",6.2]
["020105",1612528,6.04,null," P",24,"1612528 P",24.16]
["020106",1612529,3.09,null," A",12,"1612529 A",12.36]
["020107",1612516,1.62,null," Z",6,"1612516 Z",6.48]
["020108",1612577,3.78,null," P",15,"1612577 P",15.12]
["020109",1612469,5.38,null," L",21,"1612469 L",21.52]
["020110",1612479,18.38,null," B",73,"1612479 B",73.52]
["020111",1612462,0.25,null," C",1,"1612462 C",1]
["020112",1612445,15.63,null," F",62,"1612445 F",62.52]
["020113",1612429,10,null," G",40,"1612429 G",40]
["020114",1612412,16.25,null," H",65,"1612412 H",65]
["020115",1612395,3.27,null," I",13,"1612395 I",13.08]
["020116",1612378,5,null," J",20,"1612378 J",20]
["020117",1612361,7,null," K",28,"1612361 K",28]
["020118",1612344,8.5399999999999991,null," L",34,"1612344 L",34.159999999999997]
["020119",1612327,0.25,null," M",1,"1612327 M",1]
["020120",1612310,8,null," N",32,"1612310 N",32]
["020121",1612293,7.53,null," O",30,"1612293 O",30.12]
["020122",1612277,6.02,null," Q",24,"1612277 Q",24.08]
["020123",1612259,5.2033333333333296,null," R",20,"1612259 R",20.813333333333318]
["020124",1612242,4.2133333333333303,null," S",16,"1612242 S",16.853333333333321]
["020125",1612225,3.2233333333333301,null," T",12,"1612225 T",12.89333333333332]
["020126",1612208,2.2333333333333298,null," U",8,"1612208 U",8.9333333333333194]
["020127",1612191,1.2433333333333301,null," V",4,"1612191 V",4.9733333333333203]
["020128",1612174,0.25333333333333402,null," W",1,"1612174 W",1.0133333333333361]
[null,null,null,null,null,null,null,{"$f":"IFERROR(IF(INDEX(F:F,MATCH(H30,G:G,0))>COUNTIF($H$16:H30,H30),H30,INDEX(G:G,MATCH(H30,G:G,0)+1)),\"\")","v":""}]
[null,null,null,null,null,null,null,{"$f":"IFERROR(IF(INDEX(F:F,MATCH(H31,G:G,0))>COUNTIF($H$16:H31,H31),H31,INDEX(G:G,MATCH(H31,G:G,0)+1)),\"\")","v":""}]
[null,null,null,null,null,null,null,{"$f":"IFERROR(IF(INDEX(F:F,MATCH(H32,G:G,0))>COUNTIF($H$16:H32,H32),H32,INDEX(G:G,MATCH(H32,G:G,0)+1)),\"\")","v":""}]
[null,null,null,null,null,null,null,{"$f":"IFERROR(IF(INDEX(F:F,MATCH(H33,G:G,0))>COUNTIF($H$16:H33,H33),H33,INDEX(G:G,MATCH(H33,G:G,0)+1)),\"\")","v":""}]
[null,null,null,null,null,null,null,{"$f":"IFERROR(IF(INDEX(F:F,MATCH(H34,G:G,0))>COUNTIF($H$16:H34,H34),H34,INDEX(G:G,MATCH(H34,G:G,0)+1)),\"\")","v":""}]
[null,null,null,null,null,null,null,{"$f":"IFERROR(IF(INDEX(F:F,MATCH(H35,G:G,0))>COUNTIF($H$16:H35,H35),H35,INDEX(G:G,MATCH(H35,G:G,0)+1)),\"\")","v":""}]
[null,null,null,null,null,null,null,{"$f":"IFERROR(IF(INDEX(F:F,MATCH(H36,G:G,0))>COUNTIF($H$16:H36,H36),H36,INDEX(G:G,MATCH(H36,G:G,0)+1)),\"\")","v":""}]
[null,null,null,null,null,null,null,{"$f":"IFERROR(IF(INDEX(F:F,MATCH(H37,G:G,0))>COUNTIF($H$16:H37,H37),H37,INDEX(G:G,MATCH(H37,G:G,0)+1)),\"\")","v":""}]
[null,null,null,null,null,null,null,{"$f":"IFERROR(IF(INDEX(F:F,MATCH(H38,G:G,0))>COUNTIF($H$16:H38,H38),H38,INDEX(G:G,MATCH(H38,G:G,0)+1)),\"\")","v":""}]
[null,null,null,null,null,null,null,{"$f":"IFERROR(IF(INDEX(F:F,MATCH(H39,G:G,0))>COUNTIF($H$16:H39,H39),H39,INDEX(G:G,MATCH(H39,G:G,0)+1)),\"\")","v":""}]
[null,null,null,null,null,null,null,{"$f":"IFERROR(IF(INDEX(F:F,MATCH(H40,G:G,0))>COUNTIF($H$16:H40,H40),H40,INDEX(G:G,MATCH(H40,G:G,0)+1)),\"\")","v":""}]
[null,null,null,null,null,null,null,{"$f":"IFERROR(IF(INDEX(F:F,MATCH(H41,G:G,0))>COUNTIF($H$16:H41,H41),H41,INDEX(G:G,MATCH(H41,G:G,0)+1)),\"\")","v":""}]
[null,null,null,null,null,null,null,{"$f":"IFERROR(IF(INDEX(F:F,MATCH(H42,G:G,0))>COUNTIF($H$16:H42,H42),H42,INDEX(G:G,MATCH(H42,G:G,0)+1)),\"\")","v":""}]
[null,null,null,null,null,null,null,{"$f":"IFERROR(IF(INDEX(F:F,MATCH(H43,G:G,0))>COUNTIF($H$16:H43,H43),H43,INDEX(G:G,MATCH(H43,G:G,0)+1)),\"\")","v":""}]
[null,null,null,null,null,null,null,{"$f":"IFERROR(IF(INDEX(F:F,MATCH(H44,G:G,0))>COUNTIF($H$16:H44,H44),H44,INDEX(G:G,MATCH(H44,G:G,0)+1)),\"\")","v":""}]
[null,null,null,null,null,null,null,{"$f":"IFERROR(IF(INDEX(F:F,MATCH(H45,G:G,0))>COUNTIF($H$16:H45,H45),H45,INDEX(G:G,MATCH(H45,G:G,0)+1)),\"\")","v":""}]
[null,null,null,null,null,null,null,{"$f":"IFERROR(IF(INDEX(F:F,MATCH(H46,G:G,0))>COUNTIF($H$16:H46,H46),H46,INDEX(G:G,MATCH(H46,G:G,0)+1)),\"\")","v":""}]
[null,null,null,null,null,null,null,{"$f":"IFERROR(IF(INDEX(F:F,MATCH(H47,G:G,0))>COUNTIF($H$16:H47,H47),H47,INDEX(G:G,MATCH(H47,G:G,0)+1)),\"\")","v":""}]
[null,null,null,null,null,null,null,{"$f":"IFERROR(IF(INDEX(F:F,MATCH(H48,G:G,0))>COUNTIF($H$16:H48,H48),H48,INDEX(G:G,MATCH(H48,G:G,0)+1)),\"\")","v":""}]
[null,null,null,null,null,null,null,{"$f":"IFERROR(IF(INDEX(F:F,MATCH(H49,G:G,0))>COUNTIF($H$16:H49,H49),H49,INDEX(G:G,MATCH(H49,G:G,0)+1)),\"\")","v":""}]
[null,null,null,null,null,null,null,{"$f":"IFERROR(IF(INDEX(F:F,MATCH(H50,G:G,0))>COUNTIF($H$16:H50,H50),H50,INDEX(G:G,MATCH(H50,G:G,0)+1)),\"\")","v":""}]
[null,null,null,null,null,null,null,{"$f":"IFERROR(IF(INDEX(F:F,MATCH(H51,G:G,0))>COUNTIF($H$16:H51,H51),H51,INDEX(G:G,MATCH(H51,G:G,0)+1)),\"\")","v":""}]
[null,null,null,null,null,null,null,{"$f":"IFERROR(IF(INDEX(F:F,MATCH(H52,G:G,0))>COUNTIF($H$16:H52,H52),H52,INDEX(G:G,MATCH(H52,G:G,0)+1)),\"\")","v":""}]
[null,null,null,null,null,null,null,{"$f":"IFERROR(IF(INDEX(F:F,MATCH(H53,G:G,0))>COUNTIF($H$16:H53,H53),H53,INDEX(G:G,MATCH(H53,G:G,0)+1)),\"\")","v":""}]
[null,null,null,null,null,null,null,{"$f":"IFERROR(IF(INDEX(F:F,MATCH(H54,G:G,0))>COUNTIF($H$16:H54,H54),H54,INDEX(G:G,MATCH(H54,G:G,0)+1)),\"\")","v":""}]
[null,null,null,null,null,null,null,{"$f":"IFERROR(IF(INDEX(F:F,MATCH(H55,G:G,0))>COUNTIF($H$16:H55,H55),H55,INDEX(G:G,MATCH(H55,G:G,0)+1)),\"\")","v":""}]
[null,null,null,null,null,null,null,{"$f":"IFERROR(IF(INDEX(F:F,MATCH(H56,G:G,0))>COUNTIF($H$16:H56,H56),H56,INDEX(G:G,MATCH(H56,G:G,0)+1)),\"\")","v":""}]
[null,null,null,null,null,null,null,{"$f":"IFERROR(IF(INDEX(F:F,MATCH(H57,G:G,0))>COUNTIF($H$16:H57,H57),H57,INDEX(G:G,MATCH(H57,G:G,0)+1)),\"\")","v":""}]
[null,null,null,null,null,null,null,{"$f":"IFERROR(IF(INDEX(F:F,MATCH(H58,G:G,0))>COUNTIF($H$16:H58,H58),H58,INDEX(G:G,MATCH(H58,G:G,0)+1)),\"\")","v":""}]
[null,null,null,null,null,null,null,{"$f":"IFERROR(IF(INDEX(F:F,MATCH(H59,G:G,0))>COUNTIF($H$16:H59,H59),H59,INDEX(G:G,MATCH(H59,G:G,0)+1)),\"\")","v":""}]
[null,null,null,null,null,null,null,{"$f":"IFERROR(IF(INDEX(F:F,MATCH(H60,G:G,0))>COUNTIF($H$16:H60,H60),H60,INDEX(G:G,MATCH(H60,G:G,0)+1)),\"\")","v":""}]
[null,null,null,null,null,null,null,{"$f":"IFERROR(IF(INDEX(F:F,MATCH(H61,G:G,0))>COUNTIF($H$16:H61,H61),H61,INDEX(G:G,MATCH(H61,G:G,0)+1)),\"\")","v":""}]
[null,null,null,null,null,null,null,{"$f":"IFERROR(IF(INDEX(F:F,MATCH(H62,G:G,0))>COUNTIF($H$16:H62,H62),H62,INDEX(G:G,MATCH(H62,G:G,0)+1)),\"\")","v":""}]
[null,null,null,null,null,null,null,{"$f":"IFERROR(IF(INDEX(F:F,MATCH(H63,G:G,0))>COUNTIF($H$16:H63,H63),H63,INDEX(G:G,MATCH(H63,G:G,0)+1)),\"\")","v":""}]
[null,null,null,null,null,null,null,{"$f":"IFERROR(IF(INDEX(F:F,MATCH(H64,G:G,0))>COUNTIF($H$16:H64,H64),H64,INDEX(G:G,MATCH(H64,G:G,0)+1)),\"\")","v":""}]
[null,null,null,null,null,null,null,{"$f":"IFERROR(IF(INDEX(F:F,MATCH(H65,G:G,0))>COUNTIF($H$16:H65,H65),H65,INDEX(G:G,MATCH(H65,G:G,0)+1)),\"\")","v":""}]
[null,null,null,null,null,null,null,{"$f":"IFERROR(IF(INDEX(F:F,MATCH(H66,G:G,0))>COUNTIF($H$16:H66,H66),H66,INDEX(G:G,MATCH(H66,G:G,0)+1)),\"\")","v":""}]
[null,null,null,null,null,null,null,{"$f":"IFERROR(IF(INDEX(F:F,MATCH(H67,G:G,0))>COUNTIF($H$16:H67,H67),H67,INDEX(G:G,MATCH(H67,G:G,0)+1)),\"\")","v":""}]
[null,null,null,null,null,null,null,{"$f":"IFERROR(IF(INDEX(F:F,MATCH(H68,G:G,0))>COUNTIF($H$16:H68,H68),H68,INDEX(G:G,MATCH(H68,G:G,0)+1)),\"\")","v":""}]
[null,null,null,null,null,null,null,{"$f":"IFERROR(IF(INDEX(F:F,MATCH(H69,G:G,0))>COUNTIF($H$16:H69,H69),H69,INDEX(G:G,MATCH(H69,G:G,0)+1)),\"\")","v":""}]
[null,null,null,null,null,null,null,{"$f":"IFERROR(IF(INDEX(F:F,MATCH(H70,G:G,0))>COUNTIF($H$16:H70,H70),H70,INDEX(G:G,MATCH(H70,G:G,0)+1)),\"\")","v":""}]
[null,null,null,null,null,null,null,{"$f":"IFERROR(IF(INDEX(F:F,MATCH(H71,G:G,0))>COUNTIF($H$16:H71,H71),H71,INDEX(G:G,MATCH(H71,G:G,0)+1)),\"\")","v":""}]
[null,null,null,null,null,null,null,{"$f":"IFERROR(IF(INDEX(F:F,MATCH(H72,G:G,0))>COUNTIF($H$16:H72,H72),H72,INDEX(G:G,MATCH(H72,G:G,0)+1)),\"\")","v":""}]
[null,null,null,null,null,null,null,{"$f":"IFERROR(IF(INDEX(F:F,MATCH(H73,G:G,0))>COUNTIF($H$16:H73,H73),H73,INDEX(G:G,MATCH(H73,G:G,0)+1)),\"\")","v":""}]
[null,null,null,null,null,null,null,{"$f":"IFERROR(IF(INDEX(F:F,MATCH(H74,G:G,0))>COUNTIF($H$16:H74,H74),H74,INDEX(G:G,MATCH(H74,G:G,0)+1)),\"\")","v":""}]
[null,null,null,null,null,null,null,{"$f":"IFERROR(IF(INDEX(F:F,MATCH(H75,G:G,0))>COUNTIF($H$16:H75,H75),H75,INDEX(G:G,MATCH(H75,G:G,0)+1)),\"\")","v":""}]
[null,null,null,null,null,null,null,{"$f":"IFERROR(IF(INDEX(F:F,MATCH(H76,G:G,0))>COUNTIF($H$16:H76,H76),H76,INDEX(G:G,MATCH(H76,G:G,0)+1)),\"\")","v":""}]
[null,null,null,null,null,null,null,{"$f":"IFERROR(IF(INDEX(F:F,MATCH(H77,G:G,0))>COUNTIF($H$16:H77,H77),H77,INDEX(G:G,MATCH(H77,G:G,0)+1)),\"\")","v":""}]
[null,null,null,null,null,null,null,{"$f":"IFERROR(IF(INDEX(F:F,MATCH(H78,G:G,0))>COUNTIF($H$16:H78,H78),H78,INDEX(G:G,MATCH(H78,G:G,0)+1)),\"\")","v":""}]
[null,null,null,null,null,null,null,{"$f":"IFERROR(IF(INDEX(F:F,MATCH(H79,G:G,0))>COUNTIF($H$16:H79,H79),H79,INDEX(G:G,MATCH(H79,G:G,0)+1)),\"\")","v":""}]
[null,null,null,null,null,null,null,{"$f":"IFERROR(IF(INDEX(F:F,MATCH(H80,G:G,0))>COUNTIF($H$16:H80,H80),H80,INDEX(G:G,MATCH(H80,G:G,0)+1)),\"\")","v":""}]
[null,null,null,null,null,null,null,{"$f":"IFERROR(IF(INDEX(F:F,MATCH(H81,G:G,0))>COUNTIF($H$16:H81,H81),H81,INDEX(G:G,MATCH(H81,G:G,0)+1)),\"\")","v":""}]
[null,null,null,null,null,null,null,{"$f":"IFERROR(IF(INDEX(F:F,MATCH(H82,G:G,0))>COUNTIF($H$16:H82,H82),H82,INDEX(G:G,MATCH(H82,G:G,0)+1)),\"\")","v":""}]
[null,null,null,null,null,null,null,{"$f":"IFERROR(IF(INDEX(F:F,MATCH(H83,G:G,0))>COUNTIF($H$16:H83,H83),H83,INDEX(G:G,MATCH(H83,G:G,0)+1)),\"\")","v":""}]
[null,null,null,null,null,null,null,{"$f":"IFERROR(IF(INDEX(F:F,MATCH(H84,G:G,0))>COUNTIF($H$16:H84,H84),H84,INDEX(G:G,MATCH(H84,G:G,0)+1)),\"\")","v":""}]
[null,null,null,null,null,null,null,{"$f":"IFERROR(IF(INDEX(F:F,MATCH(H85,G:G,0))>COUNTIF($H$16:H85,H85),H85,INDEX(G:G,MATCH(H85,G:G,0)+1)),\"\")","v":""}]
[null,null,null,null,null,null,null,{"$f":"IFERROR(IF(INDEX(F:F,MATCH(H86,G:G,0))>COUNTIF($H$16:H86,H86),H86,INDEX(G:G,MATCH(H86,G:G,0)+1)),\"\")","v":""}]
[null,null,null,null,null,null,null,{"$f":"IFERROR(IF(INDEX(F:F,MATCH(H87,G:G,0))>COUNTIF($H$16:H87,H87),H87,INDEX(G:G,MATCH(H87,G:G,0)+1)),\"\")","v":""}]
[null,null,null,null,null,null,null,{"$f":"IFERROR(IF(INDEX(F:F,MATCH(H88,G:G,0))>COUNTIF($H$16:H88,H88),H88,INDEX(G:G,MATCH(H88,G:G,0)+1)),\"\")","v":""}]
[null,null,null,null,null,null,null,{"$f":"IFERROR(IF(INDEX(F:F,MATCH(H89,G:G,0))>COUNTIF($H$16:H89,H89),H89,INDEX(G:G,MATCH(H89,G:G,0)+1)),\"\")","v":""}]
[null,null,null,null,null,null,null,{"$f":"IFERROR(IF(INDEX(F:F,MATCH(H90,G:G,0))>COUNTIF($H$16:H90,H90),H90,INDEX(G:G,MATCH(H90,G:G,0)+1)),\"\")","v":""}]
[null,null,null,null,null,null,null,{"$f":"IFERROR(IF(INDEX(F:F,MATCH(H91,G:G,0))>COUNTIF($H$16:H91,H91),H91,INDEX(G:G,MATCH(H91,G:G,0)+1)),\"\")","v":""}]
[null,null,null,null,null,null,null,{"$f":"IFERROR(IF(INDEX(F:F,MATCH(H92,G:G,0))>COUNTIF($H$16:H92,H92),H92,INDEX(G:G,MATCH(H92,G:G,0)+1)),\"\")","v":""}]
[null,null,null,null,null,null,null,{"$f":"IFERROR(IF(INDEX(F:F,MATCH(H93,G:G,0))>COUNTIF($H$16:H93,H93),H93,INDEX(G:G,MATCH(H93,G:G,0)+1)),\"\")","v":""}]
[null,null,null,null,null,null,null,{"$f":"IFERROR(IF(INDEX(F:F,MATCH(H94,G:G,0))>COUNTIF($H$16:H94,H94),H94,INDEX(G:G,MATCH(H94,G:G,0)+1)),\"\")","v":""}]
[null,null,null,null,null,null,null,{"$f":"IFERROR(IF(INDEX(F:F,MATCH(H95,G:G,0))>COUNTIF($H$16:H95,H95),H95,INDEX(G:G,MATCH(H95,G:G,0)+1)),\"\")","v":""}]
[null,null,null,null,null,null,null,{"$f":"IFERROR(IF(INDEX(F:F,MATCH(H96,G:G,0))>COUNTIF($H$16:H96,H96),H96,INDEX(G:G,MATCH(H96,G:G,0)+1)),\"\")","v":""}]
[null,null,null,null,null,null,null,{"$f":"IFERROR(IF(INDEX(F:F,MATCH(H97,G:G,0))>COUNTIF($H$16:H97,H97),H97,INDEX(G:G,MATCH(H97,G:G,0)+1)),\"\")","v":""}]
[null,null,null,null,null,null,null,{"$f":"IFERROR(IF(INDEX(F:F,MATCH(H98,G:G,0))>COUNTIF($H$16:H98,H98),H98,INDEX(G:G,MATCH(H98,G:G,0)+1)),\"\")","v":""}]
[null,null,null,null,null,null,null,{"$f":"IFERROR(IF(INDEX(F:F,MATCH(H99,G:G,0))>COUNTIF($H$16:H99,H99),H99,INDEX(G:G,MATCH(H99,G:G,0)+1)),\"\")","v":""}]
[null,null,null,null,null,null,null,{"$f":"IFERROR(IF(INDEX(F:F,MATCH(H100,G:G,0))>COUNTIF($H$16:H100,H100),H100,INDEX(G:G,MATCH(H100,G:G,0)+1)),\"\")","v":""}]
[null,null,null,null,null,null,null,{"$f":"IFERROR(IF(INDEX(F:F,MATCH(H101,G:G,0))>COUNTIF($H$16:H101,H101),H101,INDEX(G:G,MATCH(H101,G:G,0)+1)),\"\")","v":""}]
[null,null,null,null,null,null,null,{"$f":"IFERROR(IF(INDEX(F:F,MATCH(H102,G:G,0))>COUNTIF($H$16:H102,H102),H102,INDEX(G:G,MATCH(H102,G:G,0)+1)),\"\")","v":""}]
[null,null,null,null,null,null,null,{"$f":"IFERROR(IF(INDEX(F:F,MATCH(H103,G:G,0))>COUNTIF($H$16:H103,H103),H103,INDEX(G:G,MATCH(H103,G:G,0)+1)),\"\")","v":""}]
[null,null,null,null,null,null,null,{"$f":"IFERROR(IF(INDEX(F:F,MATCH(H104,G:G,0))>COUNTIF($H$16:H104,H104),H104,INDEX(G:G,MATCH(H104,G:G,0)+1)),\"\")","v":""}]
[null,null,null,null,null,null,null,{"$f":"IFERROR(IF(INDEX(F:F,MATCH(H105,G:G,0))>COUNTIF($H$16:H105,H105),H105,INDEX(G:G,MATCH(H105,G:G,0)+1)),\"\")","v":""}]
[null,null,null,null,null,null,null,{"$f":"IFERROR(IF(INDEX(F:F,MATCH(H106,G:G,0))>COUNTIF($H$16:H106,H106),H106,INDEX(G:G,MATCH(H106,G:G,0)+1)),\"\")","v":""}]
[null,null,null,null,null,null,null,{"$f":"IFERROR(IF(INDEX(F:F,MATCH(H107,G:G,0))>COUNTIF($H$16:H107,H107),H107,INDEX(G:G,MATCH(H107,G:G,0)+1)),\"\")","v":""}]
[null,null,null,null,null,null,null,{"$f":"IFERROR(IF(INDEX(F:F,MATCH(H108,G:G,0))>COUNTIF($H$16:H108,H108),H108,INDEX(G:G,MATCH(H108,G:G,0)+1)),\"\")","v":""}]
[null,null,null,null,null,null,null,{"$f":"IFERROR(IF(INDEX(F:F,MATCH(H109,G:G,0))>COUNTIF($H$16:H109,H109),H109,INDEX(G:G,MATCH(H109,G:G,0)+1)),\"\")","v":""}]
[null,null,null,null,null,null,null,{"$f":"IFERROR(IF(INDEX(F:F,MATCH(H110,G:G,0))>COUNTIF($H$16:H110,H110),H110,INDEX(G:G,MATCH(H110,G:G,0)+1)),\"\")","v":""}]
[null,null,null,null,null,null,null,{"$f":"IFERROR(IF(INDEX(F:F,MATCH(H111,G:G,0))>COUNTIF($H$16:H111,H111),H111,INDEX(G:G,MATCH(H111,G:G,0)+1)),\"\")","v":""}]
[null,null,null,null,null,null,null,{"$f":"IFERROR(IF(INDEX(F:F,MATCH(H112,G:G,0))>COUNTIF($H$16:H112,H112),H112,INDEX(G:G,MATCH(H112,G:G,0)+1)),\"\")","v":""}]
[null,null,null,null,null,null,null,{"$f":"IFERROR(IF(INDEX(F:F,MATCH(H113,G:G,0))>COUNTIF($H$16:H113,H113),H113,INDEX(G:G,MATCH(H113,G:G,0)+1)),\"\")","v":""}]
[null,null,null,null,null,null,null,{"$f":"IFERROR(IF(INDEX(F:F,MATCH(H114,G:G,0))>COUNTIF($H$16:H114,H114),H114,INDEX(G:G,MATCH(H114,G:G,0)+1)),\"\")","v":""}]
[null,null,null,null,null,null,null,{"$f":"IFERROR(IF(INDEX(F:F,MATCH(H115,G:G,0))>COUNTIF($H$16:H115,H115),H115,INDEX(G:G,MATCH(H115,G:G,0)+1)),\"\")","v":""}]
[null,null,null,null,null,null,null,{"$f":"IFERROR(IF(INDEX(F:F,MATCH(H116,G:G,0))>COUNTIF($H$16:H116,H116),H116,INDEX(G:G,MATCH(H116,G:G,0)+1)),\"\")","v":""}]
[null,null,null,null,null,null,null,{"$f":"IFERROR(IF(INDEX(F:F,MATCH(H117,G:G,0))>COUNTIF($H$16:H117,H117),H117,INDEX(G:G,MATCH(H117,G:G,0)+1)),\"\")","v":""}]
[null,null,null,null,null,null,null,{"$f":"IFERROR(IF(INDEX(F:F,MATCH(H118,G:G,0))>COUNTIF($H$16:H118,H118),H118,INDEX(G:G,MATCH(H118,G:G,0)+1)),\"\")","v":""}]
[null,null,null,null,null,null,null,{"$f":"IFERROR(IF(INDEX(F:F,MATCH(H119,G:G,0))>COUNTIF($H$16:H119,H119),H119,INDEX(G:G,MATCH(H119,G:G,0)+1)),\"\")","v":""}]
{"$rows_left_out":66}
{"sheet":"Marco","index":1,"n_rows":903,"n_cols":8,"rows_kept":903,"cut":false,"hidden":false,"merged":[[94,0,97,0],[66,0,69,0],[70,0,73,0],[74,0,77,0],[78,0,81,0],[82,0,85,0],[86,0,89,0],[90,0,93,0],[62,0,65,0],[22,0,25,0],[26,0,29,0],[30,0,33,0],[34,0,37,0],[38,0,41,0],[42,0,45,0],[46,0,49,0],[50,0,53,0],[54,0,57,0],[58,0,61,0],[18,0,21,0],[0,0,1,0],[2,0,5,0],[6,0,9,0],[10,0,13,0],[14,0,17,0]]}
["S 01","Lundi","Mardi","Mercredi","Jeudi","Vendredi","Samedi","Dimanche"]
[]
[1,{"$f":"Données!G2","v":"Maintenance machine"},"1612469 L","1612445 F","1612429 G","1612378 J","1612310 N","1612225 T"]
[null,{"$f":"IFERROR(IF(INDEX(Données!F:F,MATCH(B3,Données!G:G,0))>COUNTIF($B$3:B3,B3),B3,INDEX(Données!G:G,MATCH(B3,Données!G:G,0)+1)),\"\")","v":"Maintenance machine"},"1612469 L","1612445 F","1612429 G","1612378 J","1612310 N","1612225 T"]
[null,"Maintenance machine","1612469 L","1612445 F","1612429 G","1612378 J","1612310 N","1612225 T"]
[null,"Maintenance machine","1612469 L","1612445 F","1612429 G","1612378 J","1612310 N","1612225 T"]
[2,"1611670 A","1612469 L","1612445 F","1612429 G","1612378 J","1612310 N","1612225 T"]
[null,"1611670 A","1612469 L","1612445 F","1612412 H","1612378 J","1612310 N","1612225 T"]
[null,"1611670 A","1612469 L","1612445 F","1612412 H","1612378 J","1612293 O","1612225 T"]
[null,"1611670 A","1612469 L","1612445 F","1612412 H","1612361 K","1612293 O","1612225 T"]
[3,"1612613 D","1612469 L","1612445 F","1612412 H","1612361 K","1612293 O","1612225 T"]
[null,"1612613 D","1612469 L","1612445 F","1612412 H","1612361 K","1612293 O","1612225 T"]
[null,"1612613 D","1612469 L","1612445 F","1612412 H","1612361 K","1612293 O","1612225 T"]
[null,"1612613 D","1612469 L","1612445 F","1612412 H","1612361 K","1612293 O","1612225 T"]
[4,"1612613 D","1612469 L","1612445 F","1612412 H","1612361 K","1612293 O","1612208 U"]
[null,"1612613 D","1612469 L","1612445 F","1612412 H","1612361 K","1612293 O","1612208 U"]
[null,"1612613 D","1612469 L","1612445 F","1612412 H","1612361 K","1612293 O","1612208 U"]
[null,"1612613 D","1612469 L","1612445 F","1612412 H","1612361 K","1612293 O","1612208 U"]
[5,"1612613 D","1612469 L","1612445 F","1612412 H","1612361 K","1612293 O","1612208 U"]
[null,"1612613 D","1612469 L","1612445 F","1612412 H","1612361 K","1612293 O","1612208 U"]
[null,"1612613 D","1612469 L","1612445 F","1612412 H","1612361 K","1612293 O","1612208 U"]
[null,"1612613 D","1612469 L","1612445 F","1612412 H","1612361 K","1612293 O","1612208 U"]
[6,"1612612 E","1612469 L","1612445 F","1612412 H","1612361 K","1612293 O","1612191 V"]
[null,"1612612 E","1612479 B","1612445 F","1612412 H","1612361 K","1612293 O","1612191 V"]
[null,"1612612 E","1612479 B","1612445 F","1612412 H","1612361 K","1612293 O","1612191 V"]
[null,"1612612 E","1612479 B","1612445 F","1612412 H","1612361 K","1612293 O","1612191 V"]
[7,"1612612 E","1612479 B","1612445 F","1612412 H","1612361 K","1612293 O","1612174 W"]
[null,"1612612 E","1612479 B","1612445 F","1612412 H","1612361 K","1612293 O",0]
[null,"1612612 E","1612479 B","1612445 F","1612412 H","1612361 K","1612293 O",""]
[null,"1612612 E","1612479 B","1612445 F","1612412 H","1612361 K","1612293 O",""]
[8,"1612612 E","1612479 B","1612445 F","1612412 H","1612361 K","1612293 O",""]
[null,"1612612 E","1612479 B","1612445 F","1612412 H","1612361 K","1612293 O",""]
[null,"1612612 E","1612479 B","1612445 F","1612412 H","1612361 K","1612293 O",""]
[null,"1612612 E","1612479 B","1612445 F","1612412 H","1612361 K","1612293 O",""]
[9,"1612612 E","1612479 B","1612445 F","1612412 H","1612361 K","1612293 O",""]
[null,"1612614 S","1612479 B","1612445 F","1612412 H","1612361 K","1612293 O",""]
[null,"1612614 S","1612479 B","1612445 F","1612412 H","1612361 K","1612293 O",""]
[null,"1612614 S","1612479 B","1612445 F","1612412 H","1612344 L","1612293 O",""]
[10,"1612614 S","1612479 B","1612445 F","1612412 H","1612344 L","1612277 Q",""]
[null,"1612614 S","1612479 B","1612445 F","1612412 H","1612344 L","1612277 Q",""]
[null,"1612614 S","1612479 B","1612445 F","1612412 H","1612344 L","1612277 Q",""]
[null,"1612528 P","1612479 B","1612445 F","1612412 H","1612344 L","1612277 Q",""]
[11,"1612528 P","1612479 B","1612445 F","1612412 H","1612344 L","1612277 Q",""]
[null,"1612528 P","1612479 B","1612445 F","1612412 H","1612344 L","1612277 Q",""]
[null,"1612528 P","1612479 B","1612445 F","1612412 H","1612344 L","1612277 Q",""]
[null,"1612528 P","1612479 B","1612445 F","1612412 H","1612344 L","1612277 Q",""]
[12,"1612528 P","1612479 B","1612445 F","1612412 H","1612344 L","1612277 Q",""]
[null,"1612528 P","1612479 B","1612445 F","1612412 H","1612344 L","1612277 Q",""]
[null,"1612528 P","1612479 B","1612445 F","1612412 H","1612344 L","1612277 Q",""]
[null,"1612528 P","1612479 B","1612445 F","1612412 H","1612344 L","1612277 Q",""]
[13,"1612528 P","1612479 B","1612445 F","1612412 H","1612344 L","1612277 Q",""]
[null,"1612528 P","1612479 B","1612445 F","1612412 H","1612344 L","1612277 Q",""]
[null,"1612528 P","1612479 B","1612445 F","1612412 H","1612344 L","1612277 Q",""]
[null,"1612528 P","1612479 B","1612445 F","1612412 H","1612344 L","1612277 Q",""]
[14,"1612528 P","1612479 B","1612445 F","1612412 H","1612344 L","1612277 Q",""]
[null,"1612528 P","1612479 B","1612445 F","1612412 H","1612344 L","1612277 Q",""]
[null,"1612528 P","1612479 B","1612445 F","1612412 H","1612344 L","1612277 Q",""]
[null,"1612528 P","1612479 B","1612445 F","1612412 H","1612344 L","1612277 Q",""]
[15,"1612528 P","1612479 B","1612445 F","1612412 H","1612344 L","1612277 Q",""]
[null,"1612528 P","1612479 B","1612445 F","1612412 H","1612344 L","1612277 Q",""]
[null,"1612528 P","1612479 B","1612445 F","1612412 H","1612344 L","1612277 Q",""]
[null,"1612528 P","1612479 B","1612445 F","1612412 H","1612344 L","1612277 Q",""]
[16,"1612528 P","1612479 B","1612445 F","1612412 H","1612344 L","1612259 R",""]
[null,"1612528 P","1612479 B","1612429 G","1612412 H","1612344 L","1612259 R",""]
[null,"1612528 P","1612479 B","1612429 G","1612412 H","1612344 L","1612259 R",""]
[null,"1612529 A","1612479 B","1612429 G","1612412 H","1612344 L","1612259 R",""]
[17,"1612529 A","1612479 B","1612429 G","1612412 H","1612344 L","1612259 R",""]
[null,"1612529 A","1612479 B","1612429 G","1612412 H","1612344 L","1612259 R",""]
[null,"1612529 A","1612479 B","1612429 G","1612412 H","1612344 L","1612259 R",""]
[null,"1612529 A","1612479 B","1612429 G","1612412 H","1612344 L","1612259 R",""]
[18,"1612529 A","1612479 B","1612429 G","1612412 H","1612344 L","1612259 R",""]
[null,"1612529 A","1612479 B","1612429 G","1612412 H","1612327 M","1612259 R",""]
[null,"1612529 A","1612479 B","1612429 G","1612395 I","1612310 N","1612259 R",""]
[null,"1612529 A","1612479 B","1612429 G","1612395 I","1612310 N","1612259 R",""]
[19,"1612529 A","1612479 B","1612429 G","1612395 I","1612310 N","1612259 R",""]
[null,"1612529 A","1612479 B","1612429 G","1612395 I","1612310 N","1612259 R",""]
[null,"1612529 A","1612479 B","1612429 G","1612395 I","1612310 N","1612259 R",""]
[null,"1612516 Z","1612479 B","1612429 G","1612395 I","1612310 N","1612259 R",""]
[20,"1612516 Z","1612479 B","1612429 G","1612395 I","1612310 N","1612259 R",""]
[null,"1612516 Z","1612479 B","1612429 G","1612395 I","1612310 N","1612259 R",""]
[null,"1612516 Z","1612479 B","1612429 G","1612395 I","1612310 N","1612259 R",""]
[null,"1612516 Z","1612479 B","1612429 G","1612395 I","1612310 N","1612259 R",""]
[21,"1612516 Z","1612479 B","1612429 G","1612395 I","1612310 N","1612242 S",""]
[null,"1612577 P","1612479 B","1612429 G","1612395 I","1612310 N","1612242 S",""]
[null,"1612577 P","1612479 B","1612429 G","1612395 I","1612310 N","1612242 S",""]
[null,"1612577 P","1612479 B","1612429 G","1612378 J","1612310 N","1612242 S",""]
[22,"1612577 P","1612479 B","1612429 G","1612378 J","1612310 N","1612242 S",""]
[null,"1612577 P","1612479 B","1612429 G","1612378 J","1612310 N","1612242 S",""]
[null,"1612577 P","1612479 B","1612429 G","1612378 J","1612310 N","1612242 S",""]
[null,"1612577 P","1612479 B","1612429 G","1612378 J","1612310 N","1612242 S",""]
[23,"1612577 P","1612479 B","1612429 G","1612378 J","1612310 N","1612242 S",""]
[null,"1612577 P","1612479 B","1612429 G","1612378 J","1612310 N","1612242 S",""]
[null,"1612577 P","1612479 B","1612429 G","1612378 J","1612310 N","1612242 S",""]
[null,"1612577 P","1612479 B","1612429 G","1612378 J","1612310 N","1612242 S",""]
[24,"1612577 P","1612479 B","1612429 G","1612378 J","1612310 N","1612242 S",""]
[null,"1612577 P","1612479 B","1612429 G","1612378 J","1612310 N","1612242 S",""]
[null,"1612577 P","1612462 C","1612429 G","1612378 J","1612310 N","1612242 S",""]
[null,"1612577 P","1612445 F","1612429 G","1612378 J","1612310 N","1612242 S"]
[]
[]
[]
[]
[]
[]
[]
[]
[]
[]
[]
[]
[]
[]
[]
[]
[]
[]
[]
[]
[]
[]
{"$rows_left_out":783}