{"text_format":"1","workbook":"xlsx","n_sheets":4,"sheets":["Convertisseur","tableau","test","Listes"],"not_rendered":{"charts":0,"images":2,"macros":1,"external_links":0,"defined_names":2,"comments":0,"pivot_tables":0},"unopened":[],"bounds":{"document_bytes":16777216,"sheet_cells":100000,"rows_first":2000,"rows_last":500,"rows_between":2000,"halvings":0,"cell_chars":16384,"cell_head_chars":4096},"cells_cut":0,"cells_raw":0,"read":"whole","date_system":"1900"}

{"sheet":"Convertisseur","index":0,"n_rows":13,"n_cols":16,"rows_kept":13,"cut":false,"hidden":false,"merged":[]}
[null,"Longueur",null,null,null,null,null,null,null,"km","hm","dam","m","dm","cm","mm"]
[null,null,null,null,null,null,null,null,null,9,10,11,12,13,14,15]
[null,1257,"dm","=",{"$f":"B3*INDEX(tableau!$B:$B,MATCH(C3,tableau!$A:$A,0))/INDEX(tableau!$B:$B,MATCH(F3,tableau!$A:$A,0))","v":12.57},"dam",null,"623 cm",null,null,null,null,6,2,3]
[null,null,null,null,null,null,null,"6,23 m",null,null,null,null,6,2,3]
[]
[null,null,null,null,null,null,null,"1257 dm",null,null,1,2,5,7]
[null,null,null,null,null,null,null,"12,57 dam",null,null,1,2,5,7]
[]
[null,null,null,null,null,null,null,"21,5 km"]
[null,623,"cm","=",{"$f":"B10*INDEX(tableau!$B:$B,MATCH(C10,tableau!$A:$A,0))/INDEX(tableau!$B:$B,MATCH(F10,tableau!$A:$A,0))","v":6.23},"m",null,"2150 m"]
[null,21.5,"hm","=",{"$f":"B11*INDEX(tableau!$B:$B,MATCH(C11,tableau!$A:$A,0))/INDEX(tableau!$B:$B,MATCH(F11,tableau!$A:$A,0))","v":2150},"m"]
[null,9.5,"dm","=",{"$f":"B12*INDEX(tableau!$B:$B,MATCH(C12,tableau!$A:$A,0))/INDEX(tableau!$B:$B,MATCH(F12,tableau!$A:$A,0))","v":9.5000000000000001E-2},"dam"]
[null,0.02,"km","=",{"$f":"B13*INDEX(tableau!$B:$B,MATCH(C13,tableau!$A:$A,0))/INDEX(tableau!$B:$B,MATCH(F13,tableau!$A:$A,0))","v":200},"dm"]

{"sheet":"tableau","index":1,"n_rows":14,"n_cols":8,"rows_kept":14,"cut":false,"hidden":false,"merged":[]}
["CONV","m",null,null,null,"unités métriques de longueur"]
["km",1000,"kilomètre ",null,null,"Gm",100000,"gigamètre "]
["hm",100,"hectomètre ",null,null,"Mm",10000,"megamètre "]
["dam",10,"décamètre ",null,null,"km",1000,"kilomètre "]
["m",1,"mètre ",null,null,"hm",100,"hectomètre "]
["dm",0.1,"décimètre ",null,null,"dam",10,"décamètre "]
["cm",0.01,"centimètre ",null,null,"m",1,"mètre "]
["mm",1E-3,"millimètre ",null,null,"dm",0.1,"décimètre "]
[null,null,null,null,null,"cm",0.01,"centimètre "]
[null,null,null,null,null,"mm",1E-3,"millimètre "]
[null,null,null,null,null,"µm",1E-4,"micromètre "]
[null,null,null,null,null,"nm",1.0000000000000001E-5,"nanomètre "]
[null,null,null,null,null,"pm",9.9999999999999995E-7,"picomètre "]
[null,null,null,null,null,"fm",9.9999999999999995E-8,"femtomètre "]

{"sheet":"test","index":2,"n_rows":6,"n_cols":15,"rows_kept":6,"cut":false,"hidden":true,"merged":[]}
[null,null,null,null,null,null,null,null,"km","hm","dam","m","dm","cm","mm"]
[]
[623,"cm","=",{"$f":"A3*INDEX(tableau!B:B,MATCH(B3,tableau!A:A,0))/INDEX(tableau!B:B,MATCH(E3,tableau!A:A,0))","v":6.23},"m"]
[21.5,"hm","=",{"$f":"A4*INDEX(tableau!B:B,MATCH(B4,tableau!A:A,0))/INDEX(tableau!B:B,MATCH(E4,tableau!A:A,0))","v":2150},"m"]
[9.5,"dm","=",{"$f":"A5*INDEX(tableau!B:B,MATCH(B5,tableau!A:A,0))/INDEX(tableau!B:B,MATCH(E5,tableau!A:A,0))","v":9.5000000000000001E-2},"dam"]
[0.02,"km","=",{"$f":"A6*INDEX(tableau!B:B,MATCH(B6,tableau!A:A,0))/INDEX(tableau!B:B,MATCH(E6,tableau!A:A,0))","v":200},"dm"]

{"sheet":"Listes","index":3,"n_rows":8,"n_cols":4,"rows_kept":8,"cut":false,"hidden":false,"merged":[]}
["Longueur","Masse","Capacité"]
["km","kg","kl",1]
["hm","hg","hl",10]
["dam","dag","dal",100]
["m","g","l",1000]
["dm","dg","dl",10000]
["cm","cg","cl",100000]
["mm","mg","ml",1000000]