{"text_format":"1","workbook":"xlsx","n_sheets":4,"sheets":["Liste PL","Source","Historique des indices","Résultat escompté"],"not_rendered":{"charts":0,"images":0,"macros":1,"external_links":0,"defined_names":3,"comments":0,"pivot_tables":0},"unopened":[],"bounds":{"document_bytes":16777216,"sheet_cells":100000,"rows_first":2000,"rows_last":500,"rows_between":2000,"halvings":0,"cell_chars":16384,"cell_head_chars":4096},"cells_cut":0,"cells_raw":0,"read":"whole","date_system":"1900"}

{"sheet":"Liste PL","index":0,"n_rows":24,"n_cols":21,"rows_kept":24,"cut":false,"hidden":false,"merged":[[0,7,0,11],[0,2,0,6],[3,0,3,11],[4,0,4,1],[1,2,1,6],[2,2,2,6],[1,7,1,11],[2,7,2,11]]}
[null,null,"XX",null,null,null,null,"XX",null,null,null,null,null,null,null,null,null,null,null,null,{"$f":"H1","v":"XX"}]
[null,null,"XX",null,null,null,null,"XX",null,null,null,null,null,null,null,null,null,null,null,null,{"$f":"H2","v":"XX"}]
[null,null,"XX",null,null,null,null,"XX",null,null,null,null,null,null,null,null,null,null,null,null,{"$f":"H3","v":"XX"}]
["Liste"]
["N°"]
[]
[]
["Descr","Art","Ent","Doc","N°","Ind","N°","Date","étape 1","étape 2","étape 3","Nom"]
["Exemple 1",null,"ASE","ZZ","01",0,{"$f":"IF(F9=\"\",\"\",(C9&\"_\"&D9&\"_\"&E9))","v":"ASE_ZZ_01"},"2016-08-05",null,null,null,{"$f":"IF(F9=\"\",\"\",(C9&\"_\"&D9&\"_\"&E9&\"_\"&F9&\" - \"&A9))","v":"ASE_ZZ_01_0 - Exemple 1"}]
["Exemple 2",null,"ZER","ZZ","01",0,{"$f":"IF(F10=\"\",\"\",(C10&\"_\"&D10&\"_\"&E10))","v":"ZER_ZZ_01"},"2016-11-07",null,null,null,{"$f":"IF(F10=\"\",\"\",(C10&\"_\"&D10&\"_\"&E10&\"_\"&F10&\" - \"&A10))","v":"ZER_ZZ_01_0 - Exemple 2"}]
["Exemple 3",null,"ZER","ZZ","02","A",{"$f":"IF(F11=\"\",\"\",(C11&\"_\"&D11&\"_\"&E11))","v":"ZER_ZZ_02"},"2016-11-21",null,null,null,{"$f":"IF(F11=\"\",\"\",(C11&\"_\"&D11&\"_\"&E11&\"_\"&F11&\" - \"&A11))","v":"ZER_ZZ_02_A - Exemple 3"}]
[null,null,null,null,null,null,"",null,null,null,null,""]
[null,null,null,null,null,null,"",null,null,null,null,""]
[null,null,null,null,null,null,"",null,null,null,null,""]
[null,null,null,null,null,null,"",null,null,null,null,""]
[null,null,null,null,null,null,"",null,null,null,null,""]
[null,null,null,null,null,null,"",null,null,null,null,""]
[null,null,null,null,null,null,"",null,null,null,null,""]
[null,null,null,null,null,null,"",null,null,null,null,""]
[null,null,null,null,null,null,"",null,null,null,null,""]
[null,null,null,null,null,null,"",null,null,null,null,""]
[null,null,null,null,null,null,"",null,null,null,null,""]
[null,null,null,null,null,null,"",null,null,null,null,""]
[null,null,null,null,null,null,"",null,null,null,null,""]

{"sheet":"Source","index":1,"n_rows":16,"n_cols":3,"rows_kept":16,"cut":false,"hidden":false,"merged":[]}
["Ent","Doc","Ind"]
["ASE","ZZ",0]
["ZER","CC","A"]
["DOI","VV","B"]
["RTT","BB","C"]
["SCX",null,"D"]
["STT",null,"E"]
[null,null,"F"]
[null,null,"G"]
[null,null,"H"]
[null,null,"I"]
[null,null,"J"]
[null,null,"K"]
[null,null,"L"]
[null,null,"M"]
[null,null,"N"]

{"sheet":"Historique des indices","index":2,"n_rows":24,"n_cols":18,"rows_kept":24,"cut":false,"hidden":false,"merged":[[0,2,0,5],[0,8,0,17],[4,0,4,1],[3,0,3,17],[6,2,6,16],[1,8,1,17],[1,2,1,7],[2,2,2,6],[2,8,2,17]]}
[null,null,"XX",null,null,null,null,null,{"$f":"'Liste PL'!U1","v":"XX"}]
[null,null,"XX",null,null,null,null,null,{"$f":"'Liste PL'!U2","v":"XX"}]
[null,null,"XX",null,null,null,null,null,{"$f":"'Liste PL'!U3","v":"XX"}]
["LISTE"]
["N°"]
[]
[]
["Descr","N°",0,"A","B","C","D","E","F","G","H","I","J","K","L","M","N","Nom"]
[{"$f":"'Liste PL'!A9","v":"Exemple 1"},{"$f":"'Liste PL'!G9","v":"ASE_ZZ_01"},null,null,null,null,null,null,null,null,null,null,null,null,null,null,null,{"$f":"'Liste PL'!L9","v":"ASE_ZZ_01_0 - Exemple 1"}]
[{"$f":"'Liste PL'!A10","v":"Exemple 2"},{"$f":"'Liste PL'!G10","v":"ZER_ZZ_01"},null,null,null,null,null,null,null,null,null,null,null,null,null,null,null,{"$f":"'Liste PL'!L10","v":"ZER_ZZ_01_0 - Exemple 2"}]
[{"$f":"'Liste PL'!A11","v":"Exemple 3"},{"$f":"'Liste PL'!G11","v":"ZER_ZZ_02"},null,null,null,null,null,null,null,null,null,null,null,null,null,null,null,{"$f":"'Liste PL'!L11","v":"ZER_ZZ_02_A - Exemple 3"}]
[{"$f":"'Liste PL'!A12","v":0},{"$f":"'Liste PL'!G12","v":""},null,null,null,null,null,null,null,null,null,null,null,null,null,null,null,{"$f":"'Liste PL'!L12","v":""}]
[{"$f":"'Liste PL'!A13","v":0},{"$f":"'Liste PL'!G13","v":""},null,null,null,null,null,null,null,null,null,null,null,null,null,null,null,{"$f":"'Liste PL'!L13","v":""}]
[{"$f":"'Liste PL'!A14","v":0},{"$f":"'Liste PL'!G14","v":""},null,null,null,null,null,null,null,null,null,null,null,null,null,null,null,{"$f":"'Liste PL'!L14","v":""}]
[{"$f":"'Liste PL'!A15","v":0},{"$f":"'Liste PL'!G15","v":""},null,null,null,null,null,null,null,null,null,null,null,null,null,null,null,{"$f":"'Liste PL'!L15","v":""}]
[{"$f":"'Liste PL'!A16","v":0},{"$f":"'Liste PL'!G16","v":""},null,null,null,null,null,null,null,null,null,null,null,null,null,null,null,{"$f":"'Liste PL'!L16","v":""}]
[{"$f":"'Liste PL'!A17","v":0},{"$f":"'Liste PL'!G17","v":""},null,null,null,null,null,null,null,null,null,null,null,null,null,null,null,{"$f":"'Liste PL'!L17","v":""}]
[{"$f":"'Liste PL'!A18","v":0},{"$f":"'Liste PL'!G18","v":""},null,null,null,null,null,null,null,null,null,null,null,null,null,null,null,{"$f":"'Liste PL'!L18","v":""}]
[{"$f":"'Liste PL'!A19","v":0},{"$f":"'Liste PL'!G19","v":""},null,null,null,null,null,null,null,null,null,null,null,null,null,null,null,{"$f":"'Liste PL'!L19","v":""}]
[{"$f":"'Liste PL'!A20","v":0},{"$f":"'Liste PL'!G20","v":""},null,null,null,null,null,null,null,null,null,null,null,null,null,null,null,{"$f":"'Liste PL'!L20","v":""}]
[{"$f":"'Liste PL'!A21","v":0},{"$f":"'Liste PL'!G21","v":""},null,null,null,null,null,null,null,null,null,null,null,null,null,null,null,{"$f":"'Liste PL'!L21","v":""}]
[{"$f":"'Liste PL'!A22","v":0},{"$f":"'Liste PL'!G22","v":""},null,null,null,null,null,null,null,null,null,null,null,null,null,null,null,{"$f":"'Liste PL'!L22","v":""}]
[{"$f":"'Liste PL'!A23","v":0},{"$f":"'Liste PL'!G23","v":""},null,null,null,null,null,null,null,null,null,null,null,null,null,null,null,{"$f":"'Liste PL'!L23","v":""}]
[{"$f":"'Liste PL'!A24","v":0},{"$f":"'Liste PL'!G24","v":""},null,null,null,null,null,null,null,null,null,null,null,null,null,null,null,{"$f":"'Liste PL'!L24","v":""}]

{"sheet":"Résultat escompté","index":3,"n_rows":24,"n_cols":18,"rows_kept":24,"cut":false,"hidden":false,"merged":[[3,0,3,17],[4,0,4,1],[6,2,6,16],[0,2,0,5],[0,8,0,17],[1,2,1,7],[1,8,1,17],[2,2,2,6],[2,8,2,17]]}
[null,null,"XX",null,null,null,null,null,{"$f":"'Liste PL'!U1","v":"XX"}]
[null,null,"XX",null,null,null,null,null,{"$f":"'Liste PL'!U2","v":"XX"}]
[null,null,"XX",null,null,null,null,null,{"$f":"'Liste PL'!U3","v":"XX"}]
["LISTE"]
["N°"]
[]
[]
["Descr","N°",0,"A","B","C","D","E","F","G","H","I","J","K","L","M","N","Nom"]
[{"$f":"'Liste PL'!A9","v":"Exemple 1"},{"$f":"'Liste PL'!G9","v":"ASE_ZZ_01"},{"$f":"_xlfn.IFNA(INDEX('Liste PL'!$H$9:$H$24,MATCH(1,('Liste PL'!$G$9:$G$24=$B9)*('Liste PL'!$F$9:$F$24=C$8),0)),\"\")","v":"2016-08-05"},{"$f":"_xlfn.IFNA(INDEX('Liste PL'!$H$9:$H$24,MATCH(1,('Liste PL'!$G$9:$G$24=$B9)*('Liste PL'!$F$9:$F$24=D$8),0)),\"\")","v":""},{"$f":"_xlfn.IFNA(INDEX('Liste PL'!$H$9:$H$24,MATCH(1,('Liste PL'!$G$9:$G$24=$B9)*('Liste PL'!$F$9:$F$24=E$8),0)),\"\")","v":""},{"$f":"_xlfn.IFNA(INDEX('Liste PL'!$H$9:$H$24,MATCH(1,('Liste PL'!$G$9:$G$24=$B9)*('Liste PL'!$F$9:$F$24=F$8),0)),\"\")","v":""},{"$f":"_xlfn.IFNA(INDEX('Liste PL'!$H$9:$H$24,MATCH(1,('Liste PL'!$G$9:$G$24=$B9)*('Liste PL'!$F$9:$F$24=G$8),0)),\"\")","v":""},{"$f":"_xlfn.IFNA(INDEX('Liste PL'!$H$9:$H$24,MATCH(1,('Liste PL'!$G$9:$G$24=$B9)*('Liste PL'!$F$9:$F$24=H$8),0)),\"\")","v":""},{"$f":"_xlfn.IFNA(INDEX('Liste PL'!$H$9:$H$24,MATCH(1,('Liste PL'!$G$9:$G$24=$B9)*('Liste PL'!$F$9:$F$24=I$8),0)),\"\")","v":""},{"$f":"_xlfn.IFNA(INDEX('Liste PL'!$H$9:$H$24,MATCH(1,('Liste PL'!$G$9:$G$24=$B9)*('Liste PL'!$F$9:$F$24=J$8),0)),\"\")","v":""},{"$f":"_xlfn.IFNA(INDEX('Liste PL'!$H$9:$H$24,MATCH(1,('Liste PL'!$G$9:$G$24=$B9)*('Liste PL'!$F$9:$F$24=K$8),0)),\"\")","v":""},{"$f":"_xlfn.IFNA(INDEX('Liste PL'!$H$9:$H$24,MATCH(1,('Liste PL'!$G$9:$G$24=$B9)*('Liste PL'!$F$9:$F$24=L$8),0)),\"\")","v":""},{"$f":"_xlfn.IFNA(INDEX('Liste PL'!$H$9:$H$24,MATCH(1,('Liste PL'!$G$9:$G$24=$B9)*('Liste PL'!$F$9:$F$24=M$8),0)),\"\")","v":""},{"$f":"_xlfn.IFNA(INDEX('Liste PL'!$H$9:$H$24,MATCH(1,('Liste PL'!$G$9:$G$24=$B9)*('Liste PL'!$F$9:$F$24=N$8),0)),\"\")","v":""},{"$f":"_xlfn.IFNA(INDEX('Liste PL'!$H$9:$H$24,MATCH(1,('Liste PL'!$G$9:$G$24=$B9)*('Liste PL'!$F$9:$F$24=O$8),0)),\"\")","v":""},{"$f":"_xlfn.IFNA(INDEX('Liste PL'!$H$9:$H$24,MATCH(1,('Liste PL'!$G$9:$G$24=$B9)*('Liste PL'!$F$9:$F$24=P$8),0)),\"\")","v":""},{"$f":"_xlfn.IFNA(INDEX('Liste PL'!$H$9:$H$24,MATCH(1,('Liste PL'!$G$9:$G$24=$B9)*('Liste PL'!$F$9:$F$24=Q$8),0)),\"\")","v":""},{"$f":"'Liste PL'!L9","v":"ASE_ZZ_01_0 - Exemple 1"}]
[{"$f":"'Liste PL'!A10","v":"Exemple 2"},{"$f":"'Liste PL'!G10","v":"ZER_ZZ_01"},{"$f":"_xlfn.IFNA(INDEX('Liste PL'!$H$9:$H$24,MATCH(1,('Liste PL'!$G$9:$G$24=$B10)*('Liste PL'!$F$9:$F$24=C$8),0)),\"\")","v":"2016-11-07"},{"$f":"_xlfn.IFNA(INDEX('Liste PL'!$H$9:$H$24,MATCH(1,('Liste PL'!$G$9:$G$24=$B10)*('Liste PL'!$F$9:$F$24=D$8),0)),\"\")","v":""},{"$f":"_xlfn.IFNA(INDEX('Liste PL'!$H$9:$H$24,MATCH(1,('Liste PL'!$G$9:$G$24=$B10)*('Liste PL'!$F$9:$F$24=E$8),0)),\"\")","v":""},{"$f":"_xlfn.IFNA(INDEX('Liste PL'!$H$9:$H$24,MATCH(1,('Liste PL'!$G$9:$G$24=$B10)*('Liste PL'!$F$9:$F$24=F$8),0)),\"\")","v":""},{"$f":"_xlfn.IFNA(INDEX('Liste PL'!$H$9:$H$24,MATCH(1,('Liste PL'!$G$9:$G$24=$B10)*('Liste PL'!$F$9:$F$24=G$8),0)),\"\")","v":""},{"$f":"_xlfn.IFNA(INDEX('Liste PL'!$H$9:$H$24,MATCH(1,('Liste PL'!$G$9:$G$24=$B10)*('Liste PL'!$F$9:$F$24=H$8),0)),\"\")","v":""},{"$f":"_xlfn.IFNA(INDEX('Liste PL'!$H$9:$H$24,MATCH(1,('Liste PL'!$G$9:$G$24=$B10)*('Liste PL'!$F$9:$F$24=I$8),0)),\"\")","v":""},{"$f":"_xlfn.IFNA(INDEX('Liste PL'!$H$9:$H$24,MATCH(1,('Liste PL'!$G$9:$G$24=$B10)*('Liste PL'!$F$9:$F$24=J$8),0)),\"\")","v":""},{"$f":"_xlfn.IFNA(INDEX('Liste PL'!$H$9:$H$24,MATCH(1,('Liste PL'!$G$9:$G$24=$B10)*('Liste PL'!$F$9:$F$24=K$8),0)),\"\")","v":""},{"$f":"_xlfn.IFNA(INDEX('Liste PL'!$H$9:$H$24,MATCH(1,('Liste PL'!$G$9:$G$24=$B10)*('Liste PL'!$F$9:$F$24=L$8),0)),\"\")","v":""},{"$f":"_xlfn.IFNA(INDEX('Liste PL'!$H$9:$H$24,MATCH(1,('Liste PL'!$G$9:$G$24=$B10)*('Liste PL'!$F$9:$F$24=M$8),0)),\"\")","v":""},{"$f":"_xlfn.IFNA(INDEX('Liste PL'!$H$9:$H$24,MATCH(1,('Liste PL'!$G$9:$G$24=$B10)*('Liste PL'!$F$9:$F$24=N$8),0)),\"\")","v":""},{"$f":"_xlfn.IFNA(INDEX('Liste PL'!$H$9:$H$24,MATCH(1,('Liste PL'!$G$9:$G$24=$B10)*('Liste PL'!$F$9:$F$24=O$8),0)),\"\")","v":""},{"$f":"_xlfn.IFNA(INDEX('Liste PL'!$H$9:$H$24,MATCH(1,('Liste PL'!$G$9:$G$24=$B10)*('Liste PL'!$F$9:$F$24=P$8),0)),\"\")","v":""},{"$f":"_xlfn.IFNA(INDEX('Liste PL'!$H$9:$H$24,MATCH(1,('Liste PL'!$G$9:$G$24=$B10)*('Liste PL'!$F$9:$F$24=Q$8),0)),\"\")","v":""},{"$f":"'Liste PL'!L10","v":"ZER_ZZ_01_0 - Exemple 2"}]
[{"$f":"'Liste PL'!A11","v":"Exemple 3"},{"$f":"'Liste PL'!G11","v":"ZER_ZZ_02"},{"$f":"_xlfn.IFNA(INDEX('Liste PL'!$H$9:$H$24,MATCH(1,('Liste PL'!$G$9:$G$24=$B11)*('Liste PL'!$F$9:$F$24=C$8),0)),\"\")","v":""},{"$f":"_xlfn.IFNA(INDEX('Liste PL'!$H$9:$H$24,MATCH(1,('Liste PL'!$G$9:$G$24=$B11)*('Liste PL'!$F$9:$F$24=D$8),0)),\"\")","v":"2016-11-21"},{"$f":"_xlfn.IFNA(INDEX('Liste PL'!$H$9:$H$24,MATCH(1,('Liste PL'!$G$9:$G$24=$B11)*('Liste PL'!$F$9:$F$24=E$8),0)),\"\")","v":""},{"$f":"_xlfn.IFNA(INDEX('Liste PL'!$H$9:$H$24,MATCH(1,('Liste PL'!$G$9:$G$24=$B11)*('Liste PL'!$F$9:$F$24=F$8),0)),\"\")","v":""},{"$f":"_xlfn.IFNA(INDEX('Liste PL'!$H$9:$H$24,MATCH(1,('Liste PL'!$G$9:$G$24=$B11)*('Liste PL'!$F$9:$F$24=G$8),0)),\"\")","v":""},{"$f":"_xlfn.IFNA(INDEX('Liste PL'!$H$9:$H$24,MATCH(1,('Liste PL'!$G$9:$G$24=$B11)*('Liste PL'!$F$9:$F$24=H$8),0)),\"\")","v":""},{"$f":"_xlfn.IFNA(INDEX('Liste PL'!$H$9:$H$24,MATCH(1,('Liste PL'!$G$9:$G$24=$B11)*('Liste PL'!$F$9:$F$24=I$8),0)),\"\")","v":""},{"$f":"_xlfn.IFNA(INDEX('Liste PL'!$H$9:$H$24,MATCH(1,('Liste PL'!$G$9:$G$24=$B11)*('Liste PL'!$F$9:$F$24=J$8),0)),\"\")","v":""},{"$f":"_xlfn.IFNA(INDEX('Liste PL'!$H$9:$H$24,MATCH(1,('Liste PL'!$G$9:$G$24=$B11)*('Liste PL'!$F$9:$F$24=K$8),0)),\"\")","v":""},{"$f":"_xlfn.IFNA(INDEX('Liste PL'!$H$9:$H$24,MATCH(1,('Liste PL'!$G$9:$G$24=$B11)*('Liste PL'!$F$9:$F$24=L$8),0)),\"\")","v":""},{"$f":"_xlfn.IFNA(INDEX('Liste PL'!$H$9:$H$24,MATCH(1,('Liste PL'!$G$9:$G$24=$B11)*('Liste PL'!$F$9:$F$24=M$8),0)),\"\")","v":""},{"$f":"_xlfn.IFNA(INDEX('Liste PL'!$H$9:$H$24,MATCH(1,('Liste PL'!$G$9:$G$24=$B11)*('Liste PL'!$F$9:$F$24=N$8),0)),\"\")","v":""},{"$f":"_xlfn.IFNA(INDEX('Liste PL'!$H$9:$H$24,MATCH(1,('Liste PL'!$G$9:$G$24=$B11)*('Liste PL'!$F$9:$F$24=O$8),0)),\"\")","v":""},{"$f":"_xlfn.IFNA(INDEX('Liste PL'!$H$9:$H$24,MATCH(1,('Liste PL'!$G$9:$G$24=$B11)*('Liste PL'!$F$9:$F$24=P$8),0)),\"\")","v":""},{"$f":"_xlfn.IFNA(INDEX('Liste PL'!$H$9:$H$24,MATCH(1,('Liste PL'!$G$9:$G$24=$B11)*('Liste PL'!$F$9:$F$24=Q$8),0)),\"\")","v":""},{"$f":"'Liste PL'!L11","v":"ZER_ZZ_02_A - Exemple 3"}]
[{"$f":"'Liste PL'!A12","v":0},{"$f":"'Liste PL'!G12","v":""},null,null,null,null,null,null,null,null,null,null,null,null,null,null,null,{"$f":"'Liste PL'!L12","v":""}]
[{"$f":"'Liste PL'!A13","v":0},{"$f":"'Liste PL'!G13","v":""},null,null,null,null,null,null,null,null,null,null,null,null,null,null,null,{"$f":"'Liste PL'!L13","v":""}]
[{"$f":"'Liste PL'!A14","v":0},{"$f":"'Liste PL'!G14","v":""},null,null,null,null,null,null,null,null,null,null,null,null,null,null,null,{"$f":"'Liste PL'!L14","v":""}]
[{"$f":"'Liste PL'!A15","v":0},{"$f":"'Liste PL'!G15","v":""},null,null,null,null,null,null,null,null,null,null,null,null,null,null,null,{"$f":"'Liste PL'!L15","v":""}]
[{"$f":"'Liste PL'!A16","v":0},{"$f":"'Liste PL'!G16","v":""},null,null,null,null,null,null,null,null,null,null,null,null,null,null,null,{"$f":"'Liste PL'!L16","v":""}]
[{"$f":"'Liste PL'!A17","v":0},{"$f":"'Liste PL'!G17","v":""},null,null,null,null,null,null,null,null,null,null,null,null,null,null,null,{"$f":"'Liste PL'!L17","v":""}]
[{"$f":"'Liste PL'!A18","v":0},{"$f":"'Liste PL'!G18","v":""},null,null,null,null,null,null,null,null,null,null,null,null,null,null,null,{"$f":"'Liste PL'!L18","v":""}]
[{"$f":"'Liste PL'!A19","v":0},{"$f":"'Liste PL'!G19","v":""},null,null,null,null,null,null,null,null,null,null,null,null,null,null,null,{"$f":"'Liste PL'!L19","v":""}]
[{"$f":"'Liste PL'!A20","v":0},{"$f":"'Liste PL'!G20","v":""},null,null,null,null,null,null,null,null,null,null,null,null,null,null,null,{"$f":"'Liste PL'!L20","v":""}]
[{"$f":"'Liste PL'!A21","v":0},{"$f":"'Liste PL'!G21","v":""},null,null,null,null,null,null,null,null,null,null,null,null,null,null,null,{"$f":"'Liste PL'!L21","v":""}]
[{"$f":"'Liste PL'!A22","v":0},{"$f":"'Liste PL'!G22","v":""},null,null,null,null,null,null,null,null,null,null,null,null,null,null,null,{"$f":"'Liste PL'!L22","v":""}]
[{"$f":"'Liste PL'!A23","v":0},{"$f":"'Liste PL'!G23","v":""},null,null,null,null,null,null,null,null,null,null,null,null,null,null,null,{"$f":"'Liste PL'!L23","v":""}]
[{"$f":"'Liste PL'!A24","v":0},{"$f":"'Liste PL'!G24","v":""},null,null,null,null,null,null,null,null,null,null,null,null,null,null,null,{"$f":"'Liste PL'!L24","v":""}]