{"text_format":"1","workbook":"xlsx","n_sheets":4,"sheets":["Confort","Tableaux Menuiseries, VR, BSO","Tarifs","FEUILLE DE PRIX VERANDA"],"not_rendered":{"charts":0,"images":11,"macros":0,"external_links":0,"defined_names":9,"comments":0,"pivot_tables":0},"unopened":[],"bounds":{"document_bytes":16777216,"sheet_cells":100000,"rows_first":2000,"rows_last":500,"rows_between":2000,"halvings":0,"cell_chars":16384,"cell_head_chars":4096},"cells_cut":0,"cells_raw":0,"read":"whole","date_system":"1900"}

{"sheet":"Confort","index":0,"n_rows":174,"n_cols":50,"rows_kept":174,"cut":false,"hidden":false,"merged":[[0,7,0,18],[22,3,24,20],[95,23,95,24],[94,23,94,24],[71,16,72,20],[98,2,98,12],[97,2,97,12],[70,3,70,4],[69,3,69,4],[67,2,68,2],[126,2,126,12],[119,1,119,12],[109,10,109,12],[110,10,110,12],[111,10,111,12],[105,2,105,12],[118,16,118,20],[126,16,126,20],[99,16,99,20],[106,16,106,20],[107,16,107,20],[109,16,109,18],[111,19,111,20],[76,16,76,20],[75,2,75,12],[99,2,99,12],[95,16,95,20],[97,16,97,20],[105,16,105,20],[110,16,110,18],[108,16,108,18],[108,19,108,20],[98,16,98,20],[130,16,130,20],[148,16,148,20],[123,16,123,20],[127,16,127,20],[134,16,134,20],[135,16,135,20],[117,16,117,20],[125,16,125,20],[122,16,122,20],[121,16,121,20],[75,16,75,20],[97,1,104,1],[110,1,115,1],[114,10,114,12],[127,1,127,2],[127,3,127,4],[101,7,102,12],[107,2,107,12],[106,2,106,12],[112,16,112,18],[115,16,115,18],[119,16,119,20],[124,16,124,20],[94,16,94,20],[109,19,109,20],[110,19,110,20],[108,13,108,15],[111,16,111,18],[101,16,101,20],[80,16,80,20],[81,16,81,20],[77,16,77,20],[78,16,78,20],[79,16,79,20],[104,2,104,12],[103,2,103,12],[100,2,100,12],[94,2,94,12],[96,2,96,12],[95,2,95,12],[108,10,108,12],[108,1,108,8],[91,1,94,1],[95,1,96,1],[160,24,160,25],[157,24,157,25],[156,24,156,25],[160,22,160,23],[147,16,147,20],[157,16,157,20],[140,16,140,20],[141,16,141,20],[143,16,143,20],[144,16,144,20],[145,16,145,20],[156,16,156,20],[154,16,155,20],[152,16,152,20],[142,16,142,20],[160,16,160,20],[150,16,150,20],[151,16,151,20],[146,16,146,20],[154,0,155,0],[96,16,96,20],[81,2,81,13],[127,5,127,6],[127,9,127,10],[87,16,87,20],[88,16,88,20],[102,16,102,20],[87,2,87,12],[103,16,103,20],[104,16,104,20],[91,2,91,12],[91,16,91,20],[92,16,92,20],[121,1,126,1],[100,16,100,20],[153,16,153,20],[128,1,130,1],[117,1,118,1],[138,16,138,20],[118,2,118,12],[117,2,117,12],[136,16,136,20],[120,16,120,20],[124,2,124,12],[125,2,125,12],[116,2,116,12],[115,10,115,12],[112,10,112,12],[113,10,113,12],[71,0,72,0],[74,16,74,20],[112,19,112,20],[113,16,113,18],[114,16,114,18],[116,16,116,20],[115,2,115,9],[114,2,114,9],[113,19,113,20],[114,19,114,20],[115,19,115,20],[112,2,112,9],[120,2,120,11],[121,2,121,12],[122,2,122,12],[123,2,123,12],[110,2,110,9],[109,2,109,9],[111,2,111,9],[25,2,26,2],[25,3,26,3],[25,4,26,4],[48,2,48,3],[25,11,26,11],[25,12,26,12],[77,2,77,12],[71,1,72,12],[69,7,70,9],[73,2,73,12],[76,2,76,12],[74,2,74,12],[57,1,70,1],[57,2,57,12],[68,5,68,12],[65,5,65,11],[65,3,65,4],[58,2,58,12],[59,2,59,12],[60,2,60,10],[73,1,80,1],[52,1,53,12],[25,6,26,6],[25,7,26,7],[25,5,26,5],[25,16,26,16],[25,17,26,17],[25,10,26,10],[132,2,132,7],[137,16,137,20],[135,2,135,12],[130,2,130,12],[129,2,129,12],[128,2,128,12],[131,16,131,20],[132,16,132,20],[149,16,149,20],[139,16,139,20],[133,16,133,20],[131,2,131,12],[173,1,173,15],[173,16,173,20],[172,4,172,15],[171,4,171,15],[163,16,163,20],[164,16,164,20],[170,16,170,20],[162,1,162,15],[161,16,161,20],[168,4,168,15],[167,4,167,15],[166,4,166,15],[170,4,170,15],[169,4,169,15],[167,2,167,3],[166,2,166,3],[165,2,165,3],[164,2,164,3],[163,2,163,3],[165,4,165,15],[161,1,161,14],[162,16,162,20],[167,16,167,20],[168,16,168,20],[172,16,172,20],[171,16,171,20],[163,1,172,1],[172,2,172,3],[171,2,171,3],[170,2,170,3],[169,16,169,20],[169,2,169,3],[163,4,163,15],[164,4,164,15],[168,2,168,3],[165,16,165,20],[166,16,166,20],[160,14,160,15],[140,1,149,1],[154,15,155,15],[156,4,156,5],[156,6,156,7],[142,2,142,12],[145,2,145,12],[144,2,144,12],[143,2,143,12],[141,2,141,12],[140,2,140,12],[151,2,151,5],[151,6,151,12],[150,6,150,12],[150,2,150,5],[150,1,151,1],[157,1,157,15],[156,2,156,3],[154,1,155,1],[154,14,155,14],[152,2,152,12],[153,1,153,12],[156,8,156,9],[156,10,156,12],[82,2,82,12],[89,16,89,20],[159,14,159,15],[159,16,159,20],[159,2,159,6],[158,13,158,15],[158,16,158,20],[131,1,135,1],[132,8,133,12],[136,1,139,1],[156,13,156,15],[154,13,155,13],[149,2,149,12],[148,2,148,12],[147,2,147,12],[146,2,146,12],[128,16,128,20],[129,16,129,20],[139,2,139,12],[138,2,138,12],[137,2,137,12],[136,2,136,12],[134,2,134,12],[133,2,133,7],[71,14,72,14],[71,15,72,15],[82,1,84,1],[93,23,93,24],[92,23,92,24],[82,13,82,15],[93,2,93,12],[92,2,92,12],[85,2,85,12],[86,16,86,20],[86,2,86,12],[85,16,85,20],[88,2,88,12],[82,16,82,20],[83,16,83,20],[83,2,83,12],[91,23,91,24],[90,23,90,24],[84,2,84,12],[84,16,84,20],[90,16,90,20],[93,16,93,20],[87,1,88,1],[85,1,86,1],[68,16,68,20],[69,16,69,20],[70,16,70,20],[56,16,56,20],[57,16,57,20],[58,13,59,13],[69,10,70,12],[80,2,80,12],[78,2,78,12],[79,2,79,12],[67,16,67,20],[67,3,68,4],[64,5,64,11],[64,3,64,4],[63,5,63,11],[63,3,63,4],[73,16,73,20],[62,16,62,18],[64,19,64,20],[65,19,65,20],[66,19,66,20],[63,16,63,18],[65,16,65,18],[71,13,72,13],[56,1,56,12],[54,3,54,4],[67,5,67,12],[60,16,60,18],[60,19,60,20],[54,5,54,7],[55,16,55,20],[54,1,54,2],[61,3,61,11],[61,19,61,20],[61,16,61,18],[62,3,62,11],[64,16,64,18],[66,5,66,11],[66,3,66,4],[1,32,2,32],[1,33,2,33],[2,14,3,16],[3,22,4,24],[3,25,4,25],[3,28,4,33],[4,14,4,16],[21,2,21,20],[66,16,66,18],[62,19,62,20],[63,19,63,20],[30,26,31,26],[30,27,31,27],[52,15,53,15],[48,12,48,13],[23,23,23,25],[30,23,30,24],[22,1,24,2],[25,18,26,18],[14,27,14,29],[15,19,15,22],[15,27,15,29],[58,21,59,21],[15,11,15,14],[54,16,54,20],[52,21,53,21],[58,14,59,14],[46,17,46,20],[50,17,50,19],[49,17,49,19],[48,17,48,19],[47,17,47,19],[25,8,26,8],[25,9,26,9],[48,7,48,8],[25,15,26,15],[25,13,26,13],[25,14,26,14],[52,16,53,20],[55,1,55,12],[52,13,53,14],[54,8,54,10],[54,11,54,12],[58,15,59,15],[58,16,59,20],[1,27,4,27],[1,28,2,31],[4,7,4,11],[3,7,3,11],[9,11,9,14],[9,19,9,22],[9,27,9,29],[10,11,10,14],[10,19,10,22],[10,27,10,29],[2,7,2,11],[1,7,1,11],[4,12,4,13],[3,12,3,13],[2,12,2,13],[1,12,1,13],[4,17,4,18],[3,17,3,18],[2,17,2,18],[1,17,1,18],[1,14,1,16],[14,11,14,14],[14,16,14,17],[14,19,14,22],[12,19,12,22],[12,27,12,29],[13,11,13,14],[13,19,13,22],[13,27,13,30],[6,11,6,17],[6,19,6,25],[6,27,6,33],[7,11,7,14],[7,19,7,22],[7,27,7,30],[8,11,8,14],[8,19,8,22],[8,27,8,29],[11,11,11,14],[11,19,11,22],[11,27,11,29],[12,11,12,14],[13,31,13,33]]}
[null,null,null,null,null,null,null,"dimensions à remplir pour base du calcul"]
[null,null,null,null,null,null,null," LONGUEUR EN MM",null,null,null,null,null,null,"SURFACE  M²",null,null,{"$f":"SUM(N2)*M3/1000000","v":0},null,null,null,null,null,null,null,null,null,null,null,null,null,null,null,null,null,null,null,null,null,null,null,130]
[null,null,null,null,null,null,null,"LARGEUR EN MM",null,null,null,null,null,null,"CHENEAU CLASSIC 130                                                                        CHENEAU VRI 145",null,null,"CHOIX",null,null,null,null,null,null,null,null,null,null,null,null,null,null,null,null,null,null,null,null,null,null,null,145]
[null,null,null,null,null,null,null,"HAUTEUR MAXI EN MM",null,null,null,null,null,null,null,null,null,130]
[null,null,null,null,null,null,null," SOUS CHENEAU EN MM",null,null,null,null,null,null,"PENTE EN %",null,null,{"$f":"IF(M4=0,\"\",AX10)","v":""}]
[]
[null,null,null,null,null,null,null,null,null,null,null,null,null,null,null,null,null,null,null,null,null,null,null,null,null,null,null,null,null,null,null,null,null,null,null,null,null,null,null,null,null,null,"SOUS CHENEAU",{"$f":"M5","v":0},null,{"$f":"SUM(AR8-(AR7+BA19-20))","v":-130}]
[null,null,null,null,null,null,null,null,null,null,null,null,null,null,null,null,null,null,null,null,null,null,null,null,null,null,null,null,null,null,null,null,null,null,null,null,"EXTERIEURE CADRE",{"$f":"M3","v":0},null,null,null,null,"SOUS SOLIN",{"$f":"M4-(150)","v":-150},null,{"$f":"(AT7)/(AL8-78)","v":1.6666666666666667},"%",null,null,{"$f":"AL9-(AL10+R4)","v":-171.66666666666666}]
[null,null,null,null,null,null,null,null,null,null,null,null,null,null,null,null,null,null,null,null,null,null,null,null,null,null,null,null,null,null,null,null,null,null,null,null,"HAUTEUR PROJETE AU MUR",{"$f":"SUM(AR8)+AT9","v":-41.666666666666657},null,null,null,null,null,null,null,{"$f":"SUM(AT8)*53+20","v":108.33333333333334},"mm",null,null,{"$f":"SUM(AL8)-(AL11-AL12)-40","v":-40}]
[null,null,null,null,null,null,null,null,null,null,null,null,null,null,null,null,null,null,null,null,null,null,null,null,null,null,null,null,null,null,null,null,null,null,null,null,"HAUTEUR SOUS CHENEAU",{"$f":"SUM(AR7)","v":0},null,null,null,null,null,null,null,null,null,null,"PENTE%",{"$f":"SUM((AX8)/AX9)*100","v":429.16666666666663}]
{"$rows_left_out":165}
{"sheet":"Tableaux Menuiseries, VR, BSO","index":1,"n_rows":54,"n_cols":14,"rows_kept":54,"cut":false,"hidden":false,"merged":[[43,3,43,4],[43,5,43,6],[43,7,43,8],[40,3,40,4],[40,5,40,6],[40,7,40,8],[42,7,42,8],[42,3,42,4],[42,5,42,6],[31,0,32,8],[39,3,39,4],[39,5,39,6],[39,7,39,8],[33,5,33,6],[33,3,33,4],[33,7,33,8],[36,3,36,4],[36,5,36,6],[36,7,36,8],[34,7,34,8],[35,7,35,8],[34,3,34,4],[34,5,34,6],[35,3,35,4],[35,5,35,6],[45,7,45,8],[49,7,49,8],[46,3,46,4],[46,5,46,6],[46,7,46,8],[47,3,47,4],[47,5,47,6],[47,7,47,8],[48,3,48,4],[48,5,48,6],[48,7,48,8],[49,3,49,4],[49,5,49,6],[45,3,45,4],[45,5,45,6],[44,3,44,4],[44,5,44,6],[44,7,44,8],[0,0,0,7],[0,13,1,13],[2,0,14,0],[15,0,27,0],[41,3,41,4],[41,5,41,6],[41,7,41,8],[37,3,37,4],[37,5,37,6],[37,7,37,8],[38,3,38,4],[38,5,38,6],[38,7,38,8],[52,7,52,8],[52,3,52,4],[52,5,52,6],[50,3,50,4],[50,5,50,6],[50,7,50,8],[51,3,51,4],[51,5,51,6],[51,7,51,8]]}
["fiche descriptive option levage",null,null,null,null,null,null,null,null,null,null,"HAUTEUR","HAUTEUR","COEFFICIENT"]
[null,"face","NBRE","type","largeur","hauteur","coef","valeur dv","valeur tv",null,null,"F-FT-C2-C3-C4-P-P2","O - DO - IT"]
["BASE",null,null,null,null,null,{"$f":"IF(OR(D3=\"f\",D3=\"ft\",D3=\"c2\",D3=\"c3\",D3=\"c4\",D3=\"p\",D3=\"p2\",D3=\"f tra\",D3=\"f ri\",D3=\"ft tra\",D3=\"ft ri\"),(VLOOKUP(F3,$L$3:$N$30,3,FALSE)),(IF(OR(D3=\"o\",D3=\"do\",D3=\"cob\",D3=\"fob\"),(VLOOKUP(F3,$M$3:$N$30,2,FALSE)),\"\")))","v":""},{"$f":"IF(C3=\"\",\"\",IF(D3=\"C2\",(HLOOKUP(E3,Tarifs!$C$13:$AG$15,2,FALSE)*G3),IF(D3=\"C3\",(HLOOKUP(E3,Tarifs!$C$37:$AI$39,2,FALSE)*G3),IF(D3=\"f\",(HLOOKUP(E3,Tarifs!$C$56:$Z$59,2,FALSE)*G3),IF(D3=\"ft\",(HLOOKUP(E3,Tarifs!$C$69:$Z$72,2,FALSE)*G3),IF(D3=\"c4\",(HLOOKUP(E3,Tarifs!$C$82:$AV$85,2,FALSE)*G3),IF(D3=\"p\",(HLOOKUP(E3,Tarifs!$C$107:$H$109,2,FALSE)*G3),IF(D3=\"p2\",(HLOOKUP(E3,Tarifs!$C$115:$N$117,2,FALSE)*G3),IF(D3=\"f tra\",((HLOOKUP(E3,Tarifs!$C$56:$Z$59,2,FALSE)*G3)*1.2),IF(D3=\"ft RI\",((HLOOKUP(E3,Tarifs!$C$69:$Z$72,2,FALSE)*G3)*1.4),IF(D3=\"f RI\",((HLOOKUP(E3,Tarifs!$C$56:$Z$59,2,FALSE)*G3)*1.4),IF(D3=\"ft TRA\",((HLOOKUP(E3,Tarifs!$C$69:$Z$72,2,FALSE)*G3)*1.2),IF(D3=\"o\",(HLOOKUP(E3,Tarifs!$C$133:$N$135,2,FALSE)*G3),IF(D3=\"cob\",((HLOOKUP(E3,Tarifs!$C$133:$N$135,2,FALSE)*G3)+1.25),IF(D3=\"do\",(HLOOKUP(E3,Tarifs!$C$139:$K$141,2,FALSE)*G3),IF(D3=\"fob\",((HLOOKUP(E3,Tarifs!C139:K141,2,FALSE)*G3)+1.25))))))))))))))))*C3)","v":""},null,null,null,3,null,1.27]
[null,null,null,null,null,null,"",{"$f":"IF(C4=\"\",\"\",IF(D4=\"C2\",(HLOOKUP(E4,Tarifs!$C$13:$AG$15,2,FALSE)*G4),IF(D4=\"C3\",(HLOOKUP(E4,Tarifs!$C$37:$AI$39,2,FALSE)*G4),IF(D4=\"f\",(HLOOKUP(E4,Tarifs!$C$56:$Z$59,2,FALSE)*G4),IF(D4=\"ft\",(HLOOKUP(E4,Tarifs!$C$69:$Z$72,2,FALSE)*G4),IF(D4=\"c4\",(HLOOKUP(E4,Tarifs!$C$82:$AV$85,2,FALSE)*G4),IF(D4=\"p\",(HLOOKUP(E4,Tarifs!$C$107:$H$109,2,FALSE)*G4),IF(D4=\"p2\",(HLOOKUP(E4,Tarifs!$C$115:$N$117,2,FALSE)*G4),IF(D4=\"f tra\",((HLOOKUP(E4,Tarifs!$C$56:$Z$59,2,FALSE)*G4)*1.2),IF(D4=\"ft RI\",((HLOOKUP(E4,Tarifs!$C$69:$Z$72,2,FALSE)*G4)*1.4),IF(D4=\"f RI\",((HLOOKUP(E4,Tarifs!$C$56:$Z$59,2,FALSE)*G4)*1.4),IF(D4=\"ft TRA\",((HLOOKUP(E4,Tarifs!$C$69:$Z$72,2,FALSE)*G4)*1.2),IF(D4=\"o\",(HLOOKUP(E4,Tarifs!$C$133:$N$135,2,FALSE)*G4),IF(D4=\"cob\",((HLOOKUP(E4,Tarifs!$C$133:$N$135,2,FALSE)*G4)+1.25),IF(D4=\"do\",(HLOOKUP(E4,Tarifs!$C$139:$K$141,2,FALSE)*G4),IF(D4=\"fob\",((HLOOKUP(E4,Tarifs!C140:K142,2,FALSE)*G4)+1.25))))))))))))))))*C4)","v":""},null,null,null,2.9,null,1.24]
[null,null,null,null,null,null,"",{"$f":"IF(C5=\"\",\"\",IF(D5=\"C2\",(HLOOKUP(E5,Tarifs!$C$13:$AG$15,2,FALSE)*G5),IF(D5=\"C3\",(HLOOKUP(E5,Tarifs!$C$37:$AI$39,2,FALSE)*G5),IF(D5=\"f\",(HLOOKUP(E5,Tarifs!$C$56:$Z$59,2,FALSE)*G5),IF(D5=\"ft\",(HLOOKUP(E5,Tarifs!$C$69:$Z$72,2,FALSE)*G5),IF(D5=\"c4\",(HLOOKUP(E5,Tarifs!$C$82:$AV$85,2,FALSE)*G5),IF(D5=\"p\",(HLOOKUP(E5,Tarifs!$C$107:$H$109,2,FALSE)*G5),IF(D5=\"p2\",(HLOOKUP(E5,Tarifs!$C$115:$N$117,2,FALSE)*G5),IF(D5=\"f tra\",((HLOOKUP(E5,Tarifs!$C$56:$Z$59,2,FALSE)*G5)*1.2),IF(D5=\"ft RI\",((HLOOKUP(E5,Tarifs!$C$69:$Z$72,2,FALSE)*G5)*1.4),IF(D5=\"f RI\",((HLOOKUP(E5,Tarifs!$C$56:$Z$59,2,FALSE)*G5)*1.4),IF(D5=\"ft TRA\",((HLOOKUP(E5,Tarifs!$C$69:$Z$72,2,FALSE)*G5)*1.2),IF(D5=\"o\",(HLOOKUP(E5,Tarifs!$C$133:$N$135,2,FALSE)*G5),IF(D5=\"cob\",((HLOOKUP(E5,Tarifs!$C$133:$N$135,2,FALSE)*G5)+1.25),IF(D5=\"do\",(HLOOKUP(E5,Tarifs!$C$139:$K$141,2,FALSE)*G5),IF(D5=\"fob\",((HLOOKUP(E5,Tarifs!C141:K143,2,FALSE)*G5)+1.25))))))))))))))))*C5)","v":""},null,null,null,2.8,null,1.21]
[null,null,null,null,null,null,"",{"$f":"IF(C6=\"\",\"\",IF(D6=\"C2\",(HLOOKUP(E6,Tarifs!$C$13:$AG$15,2,FALSE)*G6),IF(D6=\"C3\",(HLOOKUP(E6,Tarifs!$C$37:$AI$39,2,FALSE)*G6),IF(D6=\"f\",(HLOOKUP(E6,Tarifs!$C$56:$Z$59,2,FALSE)*G6),IF(D6=\"ft\",(HLOOKUP(E6,Tarifs!$C$69:$Z$72,2,FALSE)*G6),IF(D6=\"c4\",(HLOOKUP(E6,Tarifs!$C$82:$AV$85,2,FALSE)*G6),IF(D6=\"p\",(HLOOKUP(E6,Tarifs!$C$107:$H$109,2,FALSE)*G6),IF(D6=\"p2\",(HLOOKUP(E6,Tarifs!$C$115:$N$117,2,FALSE)*G6),IF(D6=\"f tra\",((HLOOKUP(E6,Tarifs!$C$56:$Z$59,2,FALSE)*G6)*1.2),IF(D6=\"ft RI\",((HLOOKUP(E6,Tarifs!$C$69:$Z$72,2,FALSE)*G6)*1.4),IF(D6=\"f RI\",((HLOOKUP(E6,Tarifs!$C$56:$Z$59,2,FALSE)*G6)*1.4),IF(D6=\"ft TRA\",((HLOOKUP(E6,Tarifs!$C$69:$Z$72,2,FALSE)*G6)*1.2),IF(D6=\"o\",(HLOOKUP(E6,Tarifs!$C$133:$N$135,2,FALSE)*G6),IF(D6=\"cob\",((HLOOKUP(E6,Tarifs!$C$133:$N$135,2,FALSE)*G6)+1.25),IF(D6=\"do\",(HLOOKUP(E6,Tarifs!$C$139:$K$141,2,FALSE)*G6),IF(D6=\"fob\",((HLOOKUP(E6,Tarifs!C142:K144,2,FALSE)*G6)+1.25))))))))))))))))*C6)","v":""},null,null,null,2.7,null,1.18]
[null,null,null,null,null,null,"",{"$f":"IF(C7=\"\",\"\",IF(D7=\"C2\",(HLOOKUP(E7,Tarifs!$C$13:$AG$15,2,FALSE)*G7),IF(D7=\"C3\",(HLOOKUP(E7,Tarifs!$C$37:$AI$39,2,FALSE)*G7),IF(D7=\"f\",(HLOOKUP(E7,Tarifs!$C$56:$Z$59,2,FALSE)*G7),IF(D7=\"ft\",(HLOOKUP(E7,Tarifs!$C$69:$Z$72,2,FALSE)*G7),IF(D7=\"c4\",(HLOOKUP(E7,Tarifs!$C$82:$AV$85,2,FALSE)*G7),IF(D7=\"p\",(HLOOKUP(E7,Tarifs!$C$107:$H$109,2,FALSE)*G7),IF(D7=\"p2\",(HLOOKUP(E7,Tarifs!$C$115:$N$117,2,FALSE)*G7),IF(D7=\"f tra\",((HLOOKUP(E7,Tarifs!$C$56:$Z$59,2,FALSE)*G7)*1.2),IF(D7=\"ft RI\",((HLOOKUP(E7,Tarifs!$C$69:$Z$72,2,FALSE)*G7)*1.4),IF(D7=\"f RI\",((HLOOKUP(E7,Tarifs!$C$56:$Z$59,2,FALSE)*G7)*1.4),IF(D7=\"ft TRA\",((HLOOKUP(E7,Tarifs!$C$69:$Z$72,2,FALSE)*G7)*1.2),IF(D7=\"o\",(HLOOKUP(E7,Tarifs!$C$133:$N$135,2,FALSE)*G7),IF(D7=\"cob\",((HLOOKUP(E7,Tarifs!$C$133:$N$135,2,FALSE)*G7)+1.25),IF(D7=\"do\",(HLOOKUP(E7,Tarifs!$C$139:$K$141,2,FALSE)*G7),IF(D7=\"fob\",((HLOOKUP(E7,Tarifs!C143:K145,2,FALSE)*G7)+1.25))))))))))))))))*C7)","v":""},null,null,null,2.6,null,1.1499999999999999]
[null,null,null,null,null,null,"",{"$f":"IF(C8=\"\",\"\",IF(D8=\"C2\",(HLOOKUP(E8,Tarifs!$C$13:$AG$15,2,FALSE)*G8),IF(D8=\"C3\",(HLOOKUP(E8,Tarifs!$C$37:$AI$39,2,FALSE)*G8),IF(D8=\"f\",(HLOOKUP(E8,Tarifs!$C$56:$Z$59,2,FALSE)*G8),IF(D8=\"ft\",(HLOOKUP(E8,Tarifs!$C$69:$Z$72,2,FALSE)*G8),IF(D8=\"c4\",(HLOOKUP(E8,Tarifs!$C$82:$AV$85,2,FALSE)*G8),IF(D8=\"p\",(HLOOKUP(E8,Tarifs!$C$107:$H$109,2,FALSE)*G8),IF(D8=\"p2\",(HLOOKUP(E8,Tarifs!$C$115:$N$117,2,FALSE)*G8),IF(D8=\"f tra\",((HLOOKUP(E8,Tarifs!$C$56:$Z$59,2,FALSE)*G8)*1.2),IF(D8=\"ft RI\",((HLOOKUP(E8,Tarifs!$C$69:$Z$72,2,FALSE)*G8)*1.4),IF(D8=\"f RI\",((HLOOKUP(E8,Tarifs!$C$56:$Z$59,2,FALSE)*G8)*1.4),IF(D8=\"ft TRA\",((HLOOKUP(E8,Tarifs!$C$69:$Z$72,2,FALSE)*G8)*1.2),IF(D8=\"o\",(HLOOKUP(E8,Tarifs!$C$133:$N$135,2,FALSE)*G8),IF(D8=\"cob\",((HLOOKUP(E8,Tarifs!$C$133:$N$135,2,FALSE)*G8)+1.25),IF(D8=\"do\",(HLOOKUP(E8,Tarifs!$C$139:$K$141,2,FALSE)*G8),IF(D8=\"fob\",((HLOOKUP(E8,Tarifs!C144:K146,2,FALSE)*G8)+1.25))))))))))))))))*C8)","v":""},null,null,null,2.5,1.7,1.1200000000000001]
[null,null,null,null,null,null,"",{"$f":"IF(C9=\"\",\"\",IF(D9=\"C2\",(HLOOKUP(E9,Tarifs!$C$13:$AG$15,2,FALSE)*G9),IF(D9=\"C3\",(HLOOKUP(E9,Tarifs!$C$37:$AI$39,2,FALSE)*G9),IF(D9=\"f\",(HLOOKUP(E9,Tarifs!$C$56:$Z$59,2,FALSE)*G9),IF(D9=\"ft\",(HLOOKUP(E9,Tarifs!$C$69:$Z$72,2,FALSE)*G9),IF(D9=\"c4\",(HLOOKUP(E9,Tarifs!$C$82:$AV$85,2,FALSE)*G9),IF(D9=\"p\",(HLOOKUP(E9,Tarifs!$C$107:$H$109,2,FALSE)*G9),IF(D9=\"p2\",(HLOOKUP(E9,Tarifs!$C$115:$N$117,2,FALSE)*G9),IF(D9=\"f tra\",((HLOOKUP(E9,Tarifs!$C$56:$Z$59,2,FALSE)*G9)*1.2),IF(D9=\"ft RI\",((HLOOKUP(E9,Tarifs!$C$69:$Z$72,2,FALSE)*G9)*1.4),IF(D9=\"f RI\",((HLOOKUP(E9,Tarifs!$C$56:$Z$59,2,FALSE)*G9)*1.4),IF(D9=\"ft TRA\",((HLOOKUP(E9,Tarifs!$C$69:$Z$72,2,FALSE)*G9)*1.2),IF(D9=\"o\",(HLOOKUP(E9,Tarifs!$C$133:$N$135,2,FALSE)*G9),IF(D9=\"cob\",((HLOOKUP(E9,Tarifs!$C$133:$N$135,2,FALSE)*G9)+1.25),IF(D9=\"do\",(HLOOKUP(E9,Tarifs!$C$139:$K$141,2,FALSE)*G9),IF(D9=\"fob\",((HLOOKUP(E9,Tarifs!C145:K147,2,FALSE)*G9)+1.25))))))))))))))))*C9)","v":""},null,null,null,2.4,1.6,1.0900000000000001]
[null,null,null,null,null,null,"",{"$f":"IF(C10=\"\",\"\",IF(D10=\"C2\",(HLOOKUP(E10,Tarifs!$C$13:$AG$15,2,FALSE)*G10),IF(D10=\"C3\",(HLOOKUP(E10,Tarifs!$C$37:$AI$39,2,FALSE)*G10),IF(D10=\"f\",(HLOOKUP(E10,Tarifs!$C$56:$Z$59,2,FALSE)*G10),IF(D10=\"ft\",(HLOOKUP(E10,Tarifs!$C$69:$Z$72,2,FALSE)*G10),IF(D10=\"c4\",(HLOOKUP(E10,Tarifs!$C$82:$AV$85,2,FALSE)*G10),IF(D10=\"p\",(HLOOKUP(E10,Tarifs!$C$107:$H$109,2,FALSE)*G10),IF(D10=\"p2\",(HLOOKUP(E10,Tarifs!$C$115:$N$117,2,FALSE)*G10),IF(D10=\"f tra\",((HLOOKUP(E10,Tarifs!$C$56:$Z$59,2,FALSE)*G10)*1.2),IF(D10=\"ft RI\",((HLOOKUP(E10,Tarifs!$C$69:$Z$72,2,FALSE)*G10)*1.4),IF(D10=\"f RI\",((HLOOKUP(E10,Tarifs!$C$56:$Z$59,2,FALSE)*G10)*1.4),IF(D10=\"ft TRA\",((HLOOKUP(E10,Tarifs!$C$69:$Z$72,2,FALSE)*G10)*1.2),IF(D10=\"o\",(HLOOKUP(E10,Tarifs!$C$133:$N$135,2,FALSE)*G10),IF(D10=\"cob\",((HLOOKUP(E10,Tarifs!$C$133:$N$135,2,FALSE)*G10)+1.25),IF(D10=\"do\",(HLOOKUP(E10,Tarifs!$C$139:$K$141,2,FALSE)*G10),IF(D10=\"fob\",((HLOOKUP(E10,Tarifs!C146:K148,2,FALSE)*G10)+1.25))))))))))))))))*C10)","v":""},null,null,null,2.2999999999999998,1.5,1.06]
{"$rows_left_out":45}
{"sheet":"Tarifs","index":2,"n_rows":171,"n_cols":115,"rows_kept":171,"cut":false,"hidden":false,"merged":[[43,10,44,10],[51,1,51,3],[51,4,51,6],[51,7,51,9],[64,1,64,3],[64,4,64,6],[64,7,64,9],[19,12,24,12],[22,10,24,11],[42,3,42,5],[25,12,27,12],[30,1,30,3],[30,4,30,6],[30,7,30,9],[0,1,0,3],[0,4,0,6],[0,7,0,9],[19,10,21,11],[25,10,27,11],[131,1,131,13],[181,0,186,7],[224,0,224,7],[77,1,77,3],[77,4,77,6],[77,7,77,9],[102,1,102,3],[102,4,102,6],[102,7,102,9],[125,1,125,2],[127,0,127,2],[127,3,127,5],[127,6,127,8],[128,0,128,8],[262,0,265,5],[323,0,326,4],[364,0,367,5],[323,5,326,7],[137,1,137,10],[146,0,146,7]]}
[]
[]
[]
[]
[]
[]
[]
[]
[]
[]
{"$rows_left_out":162}
{"sheet":"FEUILLE DE PRIX VERANDA","index":3,"n_rows":110,"n_cols":17,"rows_kept":110,"cut":false,"hidden":false,"merged":[[0,0,52,8],[110,0,110,1],[87,7,87,8],[86,7,86,8],[94,7,94,8],[93,7,93,8],[92,7,92,8],[91,7,91,8],[100,7,100,8],[99,7,99,8],[98,7,98,8],[96,7,96,8],[95,7,95,8],[104,7,104,8],[103,7,103,8],[102,7,102,8],[110,7,110,8],[109,0,109,1],[109,7,109,8],[100,0,100,1],[99,0,99,1],[98,0,98,1],[97,0,97,1],[106,0,106,1],[108,7,108,8],[109,10,109,14],[109,15,109,17],[108,0,108,1],[107,0,107,1],[90,7,90,8],[89,7,89,8],[88,7,88,8],[79,10,79,15],[101,7,101,8],[101,0,101,1],[79,16,79,17],[94,10,94,17],[96,10,96,13],[96,14,96,17],[95,14,95,17],[95,10,95,13],[84,10,89,17],[100,10,100,13],[99,10,99,13],[98,10,98,13],[97,10,97,13],[100,14,100,17],[99,14,99,17],[98,14,98,17],[106,7,106,8],[105,7,105,8],[81,10,81,15],[82,0,83,1],[82,7,83,8],[84,0,85,1],[84,7,85,8],[96,0,96,1],[97,14,97,17],[105,0,105,1],[104,0,104,1],[103,0,103,1],[102,0,102,1],[86,0,86,1],[91,0,91,1],[90,0,90,1],[89,0,89,1],[88,0,88,1],[87,0,87,1],[95,0,95,1],[94,0,94,1],[93,0,93,1],[92,0,92,1],[97,7,97,8],[56,0,56,8],[57,0,57,8],[80,0,81,8],[83,10,83,11],[77,1,78,8],[75,1,76,8],[68,10,68,17],[73,1,74,8],[69,10,69,15],[69,16,69,17],[70,16,70,17],[71,16,71,17],[72,16,72,17],[73,16,73,17],[70,12,70,15],[81,16,81,17],[79,0,79,8],[71,10,71,15],[72,10,72,15],[73,10,73,15],[75,16,75,17],[76,16,76,17],[45,14,45,15],[44,14,44,15],[43,14,43,15],[91,10,91,13],[91,15,91,17],[80,10,80,12],[58,10,65,17],[102,10,106,17],[66,10,66,17],[67,10,67,17],[92,10,93,17],[80,16,80,17],[77,16,77,17],[78,16,78,17],[74,10,78,10],[74,16,74,17],[75,11,75,15],[76,11,76,15],[77,11,77,15],[78,11,78,15],[74,11,74,15],[56,10,56,17],[57,10,57,17]]}
["1ere feuille A3 word idéalement masqué pour confidentialité; dessous le verso qui idéalement se remplirai en partie automatiquement"]
[]
[]
[]
[]
[]
[]
[]
[]
[]
{"$rows_left_out":100}