{"text_format":"1","workbook":"xlsx","n_sheets":5,"sheets":["Outils","Chantier","Réparation-Calibration","Jetés","Menu déroulant"],"not_rendered":{"charts":0,"images":8,"macros":1,"external_links":0,"defined_names":0,"comments":0,"pivot_tables":0},"unopened":[],"bounds":{"document_bytes":16777216,"sheet_cells":100000,"rows_first":2000,"rows_last":500,"rows_between":2000,"halvings":0,"cell_chars":16384,"cell_head_chars":4096},"cells_cut":0,"cells_raw":0,"read":"whole","date_system":"1900"}

{"sheet":"Outils","index":0,"n_rows":102,"n_cols":7,"rows_kept":102,"cut":false,"hidden":false,"merged":[[0,0,0,1],[0,3,0,4],[0,5,0,6]]}
[]
[]
["Département","Identifiant Unique","Description Outil","# Série","État","Calibration Due Date","#Projet du lieu de l'item"]
["Mécanique","T-386","Fixturlaser Shafthog",13784,"A la Shop","2016-12-14"]
["Mécanique","T-422","Fixturlaser Shafthog",13178,"A la Shop","2016-12-14"]
["Mécanique","T-025","Fixturlaser Gopro","56628-66632","A la Shop","2016-12-17"]
["Mécanique","T-006","Fixturlaser Gopro","56343-66342","A la Shop","2017-02-08"]
["Mécanique","T-024","Fixturlaser Gopro","56620-66620","Au Chantier","2016-12-16","1516-1000"]
["Mécanique","T-131","Fixturlaser Gopro","56941-66944","A la Shop","2016-12-15"]
["Mécanique","T-130","Fixturlaser Gopro","66922-56922","A la Shop","2017-02-08"]
["Mécanique","T-503","Fixturlaser Gopro","57770-67761","A la Shop","2017-02-08"]
["Mécanique","T-515","Fixturlaser Gopro","57795-67786","A la Shop","2017-02-05"]
["Mécanique","T-514","Fixturlaser Gopro","57796-67787","A la Shop","2017-01-16"]
["Mécanique","T-513","Fixturlaser Gopro","57898-67890","A la Shop","2017-02-09"]
["Mécanique","T-556","Fixturlaser Gopro","57932-67904","Au Chantier","2016-12-14","1516-1000"]
[null,"T-"]
[null,"T-"]
[null,"T-"]
[null,"T-"]
[null,"T-"]
[null,"T-"]
[null,"T-"]
[null,"T-"]
[null,"T-"]
[null,"T-"]
[null,"T-"]
[null,"T-"]
[null,"T-"]
[null,"T-"]
[null,"T-"]
[null,"T-"]
[null,"T-"]
[null,"T-"]
[null,"T-"]
[null,"T-"]
[null,"T-"]
[null,"T-"]
[null,"T-"]
[null,"T-"]
[null,"T-"]
[null,"T-"]
[null,"T-"]
[null,"T-"]
[null,"T-"]
[null,"T-"]
[null,"T-"]
[null,"T-"]
[null,"T-"]
[null,"T-"]
[null,"T-"]
[null,"T-"]
[null,"T-"]
[null,"T-"]
[null,"T-"]
[null,"T-"]
[null,"T-"]
[null,"T-"]
[null,"T-"]
[null,"T-"]
[null,"T-"]
[null,"T-"]
[null,"T-"]
[null,"T-"]
[null,"T-"]
[null,"T-"]
[null,"T-"]
[null,"T-"]
[null,"T-"]
[null,"T-"]
[null,"T-"]
[null,"T-"]
[null,"T-"]
[null,"T-"]
[null,"T-"]
[null,"T-"]
[null,"T-"]
[null,"T-"]
[null,"T-"]
[null,"T-"]
[null,"T-"]
[null,"T-"]
[null,"T-"]
[null,"T-"]
[null,"T-"]
[null,"T-"]
[null,"T-"]
[null,"T-"]
[null,"T-"]
[null,"T-"]
[null,"T-"]
[null,"T-"]
[null,"T-"]
[null,"T-"]
[null,"T-"]
[null,"T-"]
[null,"T-"]
[null,"T-"]
[null,"T-"]
[null,"T-"]
[null,"T-"]
[null,"T-"]
[null,"T-"]

{"sheet":"Chantier","index":1,"n_rows":100,"n_cols":7,"rows_kept":100,"cut":false,"hidden":false,"merged":[]}
["Département","Identifiant Unique","Description Outil","# Série","État","Calibration Due Date","#Projet du lieu de l'item"]
[{"$f":"IF(Outils!E4=\"Au Chantier\",Outils!A4,\"\")","v":""},{"$f":"IF(Outils!E4=\"Au Chantier\",Outils!B4,\"\")","v":""},{"$f":"IF(Outils!E4=\"Au Chantier\",Outils!C4,\"\")","v":""},{"$f":"IF(Outils!E4=\"Au Chantier\",Outils!D4,\"\")","v":""},{"$f":"IF(Outils!E4=\"Au Chantier\",Outils!E4,\"\")","v":""},{"$f":"IF(Outils!E4=\"Au Chantier\",Outils!F4,\"\")","v":""},{"$f":"IF(Outils!E4=\"Au Chantier\",Outils!G4,\"\")","v":""}]
[{"$f":"IF(Outils!E5=\"Au Chantier\",Outils!A5,\"\")","v":""},{"$f":"IF(Outils!E5=\"Au Chantier\",Outils!B5,\"\")","v":""},{"$f":"IF(Outils!E5=\"Au Chantier\",Outils!C5,\"\")","v":""},{"$f":"IF(Outils!E5=\"Au Chantier\",Outils!D5,\"\")","v":""},{"$f":"IF(Outils!E5=\"Au Chantier\",Outils!E5,\"\")","v":""},{"$f":"IF(Outils!E5=\"Au Chantier\",Outils!F5,\"\")","v":""},{"$f":"IF(Outils!E5=\"Au Chantier\",Outils!G5,\"\")","v":""}]
[{"$f":"IF(Outils!E6=\"Au Chantier\",Outils!A6,\"\")","v":""},{"$f":"IF(Outils!E6=\"Au Chantier\",Outils!B6,\"\")","v":""},{"$f":"IF(Outils!E6=\"Au Chantier\",Outils!C6,\"\")","v":""},{"$f":"IF(Outils!E6=\"Au Chantier\",Outils!D6,\"\")","v":""},{"$f":"IF(Outils!E6=\"Au Chantier\",Outils!E6,\"\")","v":""},{"$f":"IF(Outils!E6=\"Au Chantier\",Outils!F6,\"\")","v":""},{"$f":"IF(Outils!E6=\"Au Chantier\",Outils!G6,\"\")","v":""}]
[{"$f":"IF(Outils!E7=\"Au Chantier\",Outils!A7,\"\")","v":""},{"$f":"IF(Outils!E7=\"Au Chantier\",Outils!B7,\"\")","v":""},{"$f":"IF(Outils!E7=\"Au Chantier\",Outils!C7,\"\")","v":""},{"$f":"IF(Outils!E7=\"Au Chantier\",Outils!D7,\"\")","v":""},{"$f":"IF(Outils!E7=\"Au Chantier\",Outils!E7,\"\")","v":""},{"$f":"IF(Outils!E7=\"Au Chantier\",Outils!F7,\"\")","v":""},{"$f":"IF(Outils!E7=\"Au Chantier\",Outils!G7,\"\")","v":""}]
[{"$f":"IF(Outils!E8=\"Au Chantier\",Outils!A8,\"\")","v":"Mécanique"},{"$f":"IF(Outils!E8=\"Au Chantier\",Outils!B8,\"\")","v":"T-024"},{"$f":"IF(Outils!E8=\"Au Chantier\",Outils!C8,\"\")","v":"Fixturlaser Gopro"},{"$f":"IF(Outils!E8=\"Au Chantier\",Outils!D8,\"\")","v":"56620-66620"},{"$f":"IF(Outils!E8=\"Au Chantier\",Outils!E8,\"\")","v":"Au Chantier"},{"$f":"IF(Outils!E8=\"Au Chantier\",Outils!F8,\"\")","v":"2016-12-16"},{"$f":"IF(Outils!E8=\"Au Chantier\",Outils!G8,\"\")","v":"1516-1000"}]
[{"$f":"IF(Outils!E9=\"Au Chantier\",Outils!A9,\"\")","v":""},{"$f":"IF(Outils!E9=\"Au Chantier\",Outils!B9,\"\")","v":""},{"$f":"IF(Outils!E9=\"Au Chantier\",Outils!C9,\"\")","v":""},{"$f":"IF(Outils!E9=\"Au Chantier\",Outils!D9,\"\")","v":""},{"$f":"IF(Outils!E9=\"Au Chantier\",Outils!E9,\"\")","v":""},{"$f":"IF(Outils!E9=\"Au Chantier\",Outils!F9,\"\")","v":""},{"$f":"IF(Outils!E9=\"Au Chantier\",Outils!G9,\"\")","v":""}]
[{"$f":"IF(Outils!E10=\"Au Chantier\",Outils!A10,\"\")","v":""},{"$f":"IF(Outils!E10=\"Au Chantier\",Outils!B10,\"\")","v":""},{"$f":"IF(Outils!E10=\"Au Chantier\",Outils!C10,\"\")","v":""},{"$f":"IF(Outils!E10=\"Au Chantier\",Outils!D10,\"\")","v":""},{"$f":"IF(Outils!E10=\"Au Chantier\",Outils!E10,\"\")","v":""},{"$f":"IF(Outils!E10=\"Au Chantier\",Outils!F10,\"\")","v":""},{"$f":"IF(Outils!E10=\"Au Chantier\",Outils!G10,\"\")","v":""}]
[{"$f":"IF(Outils!E11=\"Au Chantier\",Outils!A11,\"\")","v":""},{"$f":"IF(Outils!E11=\"Au Chantier\",Outils!B11,\"\")","v":""},{"$f":"IF(Outils!E11=\"Au Chantier\",Outils!C11,\"\")","v":""},{"$f":"IF(Outils!E11=\"Au Chantier\",Outils!D11,\"\")","v":""},{"$f":"IF(Outils!E11=\"Au Chantier\",Outils!E11,\"\")","v":""},{"$f":"IF(Outils!E11=\"Au Chantier\",Outils!F11,\"\")","v":""},{"$f":"IF(Outils!E11=\"Au Chantier\",Outils!G11,\"\")","v":""}]
[{"$f":"IF(Outils!E12=\"Au Chantier\",Outils!A12,\"\")","v":""},{"$f":"IF(Outils!E12=\"Au Chantier\",Outils!B12,\"\")","v":""},{"$f":"IF(Outils!E12=\"Au Chantier\",Outils!C12,\"\")","v":""},{"$f":"IF(Outils!E12=\"Au Chantier\",Outils!D12,\"\")","v":""},{"$f":"IF(Outils!E12=\"Au Chantier\",Outils!E12,\"\")","v":""},{"$f":"IF(Outils!E12=\"Au Chantier\",Outils!F12,\"\")","v":""},{"$f":"IF(Outils!E12=\"Au Chantier\",Outils!G12,\"\")","v":""}]
[{"$f":"IF(Outils!E13=\"Au Chantier\",Outils!A13,\"\")","v":""},{"$f":"IF(Outils!E13=\"Au Chantier\",Outils!B13,\"\")","v":""},{"$f":"IF(Outils!E13=\"Au Chantier\",Outils!C13,\"\")","v":""},{"$f":"IF(Outils!E13=\"Au Chantier\",Outils!D13,\"\")","v":""},{"$f":"IF(Outils!E13=\"Au Chantier\",Outils!E13,\"\")","v":""},{"$f":"IF(Outils!E13=\"Au Chantier\",Outils!F13,\"\")","v":""},{"$f":"IF(Outils!E13=\"Au Chantier\",Outils!G13,\"\")","v":""}]
[{"$f":"IF(Outils!E14=\"Au Chantier\",Outils!A14,\"\")","v":""},{"$f":"IF(Outils!E14=\"Au Chantier\",Outils!B14,\"\")","v":""},{"$f":"IF(Outils!E14=\"Au Chantier\",Outils!C14,\"\")","v":""},{"$f":"IF(Outils!E14=\"Au Chantier\",Outils!D14,\"\")","v":""},{"$f":"IF(Outils!E14=\"Au Chantier\",Outils!E14,\"\")","v":""},{"$f":"IF(Outils!E14=\"Au Chantier\",Outils!F14,\"\")","v":""},{"$f":"IF(Outils!E14=\"Au Chantier\",Outils!G14,\"\")","v":""}]
[{"$f":"IF(Outils!E15=\"Au Chantier\",Outils!A15,\"\")","v":"Mécanique"},{"$f":"IF(Outils!E15=\"Au Chantier\",Outils!B15,\"\")","v":"T-556"},{"$f":"IF(Outils!E15=\"Au Chantier\",Outils!C15,\"\")","v":"Fixturlaser Gopro"},{"$f":"IF(Outils!E15=\"Au Chantier\",Outils!D15,\"\")","v":"57932-67904"},{"$f":"IF(Outils!E15=\"Au Chantier\",Outils!E15,\"\")","v":"Au Chantier"},{"$f":"IF(Outils!E15=\"Au Chantier\",Outils!F15,\"\")","v":"2016-12-14"},{"$f":"IF(Outils!E15=\"Au Chantier\",Outils!G15,\"\")","v":"1516-1000"}]
[{"$f":"IF(Outils!E16=\"Au Chantier\",Outils!A16,\"\")","v":""},{"$f":"IF(Outils!E16=\"Au Chantier\",Outils!B16,\"\")","v":""},{"$f":"IF(Outils!E16=\"Au Chantier\",Outils!C16,\"\")","v":""},{"$f":"IF(Outils!E16=\"Au Chantier\",Outils!D16,\"\")","v":""},{"$f":"IF(Outils!E16=\"Au Chantier\",Outils!E16,\"\")","v":""},{"$f":"IF(Outils!E16=\"Au Chantier\",Outils!F16,\"\")","v":""},{"$f":"IF(Outils!E16=\"Au Chantier\",Outils!G16,\"\")","v":""}]
[{"$f":"IF(Outils!E17=\"Au Chantier\",Outils!A17,\"\")","v":""},{"$f":"IF(Outils!E17=\"Au Chantier\",Outils!B17,\"\")","v":""},{"$f":"IF(Outils!E17=\"Au Chantier\",Outils!C17,\"\")","v":""},{"$f":"IF(Outils!E17=\"Au Chantier\",Outils!D17,\"\")","v":""},{"$f":"IF(Outils!E17=\"Au Chantier\",Outils!E17,\"\")","v":""},{"$f":"IF(Outils!E17=\"Au Chantier\",Outils!F17,\"\")","v":""},{"$f":"IF(Outils!E17=\"Au Chantier\",Outils!G17,\"\")","v":""}]
[{"$f":"IF(Outils!E18=\"Au Chantier\",Outils!A18,\"\")","v":""},{"$f":"IF(Outils!E18=\"Au Chantier\",Outils!B18,\"\")","v":""},{"$f":"IF(Outils!E18=\"Au Chantier\",Outils!C18,\"\")","v":""},{"$f":"IF(Outils!E18=\"Au Chantier\",Outils!D18,\"\")","v":""},{"$f":"IF(Outils!E18=\"Au Chantier\",Outils!E18,\"\")","v":""},{"$f":"IF(Outils!E18=\"Au Chantier\",Outils!F18,\"\")","v":""},{"$f":"IF(Outils!E18=\"Au Chantier\",Outils!G18,\"\")","v":""}]
[{"$f":"IF(Outils!E19=\"Au Chantier\",Outils!A19,\"\")","v":""},{"$f":"IF(Outils!E19=\"Au Chantier\",Outils!B19,\"\")","v":""},{"$f":"IF(Outils!E19=\"Au Chantier\",Outils!C19,\"\")","v":""},{"$f":"IF(Outils!E19=\"Au Chantier\",Outils!D19,\"\")","v":""},{"$f":"IF(Outils!E19=\"Au Chantier\",Outils!E19,\"\")","v":""},{"$f":"IF(Outils!E19=\"Au Chantier\",Outils!F19,\"\")","v":""},{"$f":"IF(Outils!E19=\"Au Chantier\",Outils!G19,\"\")","v":""}]
[{"$f":"IF(Outils!E20=\"Au Chantier\",Outils!A20,\"\")","v":""},{"$f":"IF(Outils!E20=\"Au Chantier\",Outils!B20,\"\")","v":""},{"$f":"IF(Outils!E20=\"Au Chantier\",Outils!C20,\"\")","v":""},{"$f":"IF(Outils!E20=\"Au Chantier\",Outils!D20,\"\")","v":""},{"$f":"IF(Outils!E20=\"Au Chantier\",Outils!E20,\"\")","v":""},{"$f":"IF(Outils!E20=\"Au Chantier\",Outils!F20,\"\")","v":""},{"$f":"IF(Outils!E20=\"Au Chantier\",Outils!G20,\"\")","v":""}]
[{"$f":"IF(Outils!E21=\"Au Chantier\",Outils!A21,\"\")","v":""},{"$f":"IF(Outils!E21=\"Au Chantier\",Outils!B21,\"\")","v":""},{"$f":"IF(Outils!E21=\"Au Chantier\",Outils!C21,\"\")","v":""},{"$f":"IF(Outils!E21=\"Au Chantier\",Outils!D21,\"\")","v":""},{"$f":"IF(Outils!E21=\"Au Chantier\",Outils!E21,\"\")","v":""},{"$f":"IF(Outils!E21=\"Au Chantier\",Outils!F21,\"\")","v":""},{"$f":"IF(Outils!E21=\"Au Chantier\",Outils!G21,\"\")","v":""}]
[{"$f":"IF(Outils!E22=\"Au Chantier\",Outils!A22,\"\")","v":""},{"$f":"IF(Outils!E22=\"Au Chantier\",Outils!B22,\"\")","v":""},{"$f":"IF(Outils!E22=\"Au Chantier\",Outils!C22,\"\")","v":""},{"$f":"IF(Outils!E22=\"Au Chantier\",Outils!D22,\"\")","v":""},{"$f":"IF(Outils!E22=\"Au Chantier\",Outils!E22,\"\")","v":""},{"$f":"IF(Outils!E22=\"Au Chantier\",Outils!F22,\"\")","v":""},{"$f":"IF(Outils!E22=\"Au Chantier\",Outils!G22,\"\")","v":""}]
[{"$f":"IF(Outils!E23=\"Au Chantier\",Outils!A23,\"\")","v":""},{"$f":"IF(Outils!E23=\"Au Chantier\",Outils!B23,\"\")","v":""},{"$f":"IF(Outils!E23=\"Au Chantier\",Outils!C23,\"\")","v":""},{"$f":"IF(Outils!E23=\"Au Chantier\",Outils!D23,\"\")","v":""},{"$f":"IF(Outils!E23=\"Au Chantier\",Outils!E23,\"\")","v":""},{"$f":"IF(Outils!E23=\"Au Chantier\",Outils!F23,\"\")","v":""},{"$f":"IF(Outils!E23=\"Au Chantier\",Outils!G23,\"\")","v":""}]
[{"$f":"IF(Outils!E24=\"Au Chantier\",Outils!A24,\"\")","v":""},{"$f":"IF(Outils!E24=\"Au Chantier\",Outils!B24,\"\")","v":""},{"$f":"IF(Outils!E24=\"Au Chantier\",Outils!C24,\"\")","v":""},{"$f":"IF(Outils!E24=\"Au Chantier\",Outils!D24,\"\")","v":""},{"$f":"IF(Outils!E24=\"Au Chantier\",Outils!E24,\"\")","v":""},{"$f":"IF(Outils!E24=\"Au Chantier\",Outils!F24,\"\")","v":""},{"$f":"IF(Outils!E24=\"Au Chantier\",Outils!G24,\"\")","v":""}]
[{"$f":"IF(Outils!E25=\"Au Chantier\",Outils!A25,\"\")","v":""},{"$f":"IF(Outils!E25=\"Au Chantier\",Outils!B25,\"\")","v":""},{"$f":"IF(Outils!E25=\"Au Chantier\",Outils!C25,\"\")","v":""},{"$f":"IF(Outils!E25=\"Au Chantier\",Outils!D25,\"\")","v":""},{"$f":"IF(Outils!E25=\"Au Chantier\",Outils!E25,\"\")","v":""},{"$f":"IF(Outils!E25=\"Au Chantier\",Outils!F25,\"\")","v":""},{"$f":"IF(Outils!E25=\"Au Chantier\",Outils!G25,\"\")","v":""}]
[{"$f":"IF(Outils!E26=\"Au Chantier\",Outils!A26,\"\")","v":""},{"$f":"IF(Outils!E26=\"Au Chantier\",Outils!B26,\"\")","v":""},{"$f":"IF(Outils!E26=\"Au Chantier\",Outils!C26,\"\")","v":""},{"$f":"IF(Outils!E26=\"Au Chantier\",Outils!D26,\"\")","v":""},{"$f":"IF(Outils!E26=\"Au Chantier\",Outils!E26,\"\")","v":""},{"$f":"IF(Outils!E26=\"Au Chantier\",Outils!F26,\"\")","v":""},{"$f":"IF(Outils!E26=\"Au Chantier\",Outils!G26,\"\")","v":""}]
[{"$f":"IF(Outils!E27=\"Au Chantier\",Outils!A27,\"\")","v":""},{"$f":"IF(Outils!E27=\"Au Chantier\",Outils!B27,\"\")","v":""},{"$f":"IF(Outils!E27=\"Au Chantier\",Outils!C27,\"\")","v":""},{"$f":"IF(Outils!E27=\"Au Chantier\",Outils!D27,\"\")","v":""},{"$f":"IF(Outils!E27=\"Au Chantier\",Outils!E27,\"\")","v":""},{"$f":"IF(Outils!E27=\"Au Chantier\",Outils!F27,\"\")","v":""},{"$f":"IF(Outils!E27=\"Au Chantier\",Outils!G27,\"\")","v":""}]
[{"$f":"IF(Outils!E28=\"Au Chantier\",Outils!A28,\"\")","v":""},{"$f":"IF(Outils!E28=\"Au Chantier\",Outils!B28,\"\")","v":""},{"$f":"IF(Outils!E28=\"Au Chantier\",Outils!C28,\"\")","v":""},{"$f":"IF(Outils!E28=\"Au Chantier\",Outils!D28,\"\")","v":""},{"$f":"IF(Outils!E28=\"Au Chantier\",Outils!E28,\"\")","v":""},{"$f":"IF(Outils!E28=\"Au Chantier\",Outils!F28,\"\")","v":""},{"$f":"IF(Outils!E28=\"Au Chantier\",Outils!G28,\"\")","v":""}]
[{"$f":"IF(Outils!E29=\"Au Chantier\",Outils!A29,\"\")","v":""},{"$f":"IF(Outils!E29=\"Au Chantier\",Outils!B29,\"\")","v":""},{"$f":"IF(Outils!E29=\"Au Chantier\",Outils!C29,\"\")","v":""},{"$f":"IF(Outils!E29=\"Au Chantier\",Outils!D29,\"\")","v":""},{"$f":"IF(Outils!E29=\"Au Chantier\",Outils!E29,\"\")","v":""},{"$f":"IF(Outils!E29=\"Au Chantier\",Outils!F29,\"\")","v":""},{"$f":"IF(Outils!E29=\"Au Chantier\",Outils!G29,\"\")","v":""}]
[{"$f":"IF(Outils!E30=\"Au Chantier\",Outils!A30,\"\")","v":""},{"$f":"IF(Outils!E30=\"Au Chantier\",Outils!B30,\"\")","v":""},{"$f":"IF(Outils!E30=\"Au Chantier\",Outils!C30,\"\")","v":""},{"$f":"IF(Outils!E30=\"Au Chantier\",Outils!D30,\"\")","v":""},{"$f":"IF(Outils!E30=\"Au Chantier\",Outils!E30,\"\")","v":""},{"$f":"IF(Outils!E30=\"Au Chantier\",Outils!F30,\"\")","v":""},{"$f":"IF(Outils!E30=\"Au Chantier\",Outils!G30,\"\")","v":""}]
[{"$f":"IF(Outils!E31=\"Au Chantier\",Outils!A31,\"\")","v":""},{"$f":"IF(Outils!E31=\"Au Chantier\",Outils!B31,\"\")","v":""},{"$f":"IF(Outils!E31=\"Au Chantier\",Outils!C31,\"\")","v":""},{"$f":"IF(Outils!E31=\"Au Chantier\",Outils!D31,\"\")","v":""},{"$f":"IF(Outils!E31=\"Au Chantier\",Outils!E31,\"\")","v":""},{"$f":"IF(Outils!E31=\"Au Chantier\",Outils!F31,\"\")","v":""},{"$f":"IF(Outils!E31=\"Au Chantier\",Outils!G31,\"\")","v":""}]
[{"$f":"IF(Outils!E32=\"Au Chantier\",Outils!A32,\"\")","v":""},{"$f":"IF(Outils!E32=\"Au Chantier\",Outils!B32,\"\")","v":""},{"$f":"IF(Outils!E32=\"Au Chantier\",Outils!C32,\"\")","v":""},{"$f":"IF(Outils!E32=\"Au Chantier\",Outils!D32,\"\")","v":""},{"$f":"IF(Outils!E32=\"Au Chantier\",Outils!E32,\"\")","v":""},{"$f":"IF(Outils!E32=\"Au Chantier\",Outils!F32,\"\")","v":""},{"$f":"IF(Outils!E32=\"Au Chantier\",Outils!G32,\"\")","v":""}]
[{"$f":"IF(Outils!E33=\"Au Chantier\",Outils!A33,\"\")","v":""},{"$f":"IF(Outils!E33=\"Au Chantier\",Outils!B33,\"\")","v":""},{"$f":"IF(Outils!E33=\"Au Chantier\",Outils!C33,\"\")","v":""},{"$f":"IF(Outils!E33=\"Au Chantier\",Outils!D33,\"\")","v":""},{"$f":"IF(Outils!E33=\"Au Chantier\",Outils!E33,\"\")","v":""},{"$f":"IF(Outils!E33=\"Au Chantier\",Outils!F33,\"\")","v":""},{"$f":"IF(Outils!E33=\"Au Chantier\",Outils!G33,\"\")","v":""}]
[{"$f":"IF(Outils!E34=\"Au Chantier\",Outils!A34,\"\")","v":""},{"$f":"IF(Outils!E34=\"Au Chantier\",Outils!B34,\"\")","v":""},{"$f":"IF(Outils!E34=\"Au Chantier\",Outils!C34,\"\")","v":""},{"$f":"IF(Outils!E34=\"Au Chantier\",Outils!D34,\"\")","v":""},{"$f":"IF(Outils!E34=\"Au Chantier\",Outils!E34,\"\")","v":""},{"$f":"IF(Outils!E34=\"Au Chantier\",Outils!F34,\"\")","v":""},{"$f":"IF(Outils!E34=\"Au Chantier\",Outils!G34,\"\")","v":""}]
[{"$f":"IF(Outils!E35=\"Au Chantier\",Outils!A35,\"\")","v":""},{"$f":"IF(Outils!E35=\"Au Chantier\",Outils!B35,\"\")","v":""},{"$f":"IF(Outils!E35=\"Au Chantier\",Outils!C35,\"\")","v":""},{"$f":"IF(Outils!E35=\"Au Chantier\",Outils!D35,\"\")","v":""},{"$f":"IF(Outils!E35=\"Au Chantier\",Outils!E35,\"\")","v":""},{"$f":"IF(Outils!E35=\"Au Chantier\",Outils!F35,\"\")","v":""},{"$f":"IF(Outils!E35=\"Au Chantier\",Outils!G35,\"\")","v":""}]
[{"$f":"IF(Outils!E36=\"Au Chantier\",Outils!A36,\"\")","v":""},{"$f":"IF(Outils!E36=\"Au Chantier\",Outils!B36,\"\")","v":""},{"$f":"IF(Outils!E36=\"Au Chantier\",Outils!C36,\"\")","v":""},{"$f":"IF(Outils!E36=\"Au Chantier\",Outils!D36,\"\")","v":""},{"$f":"IF(Outils!E36=\"Au Chantier\",Outils!E36,\"\")","v":""},{"$f":"IF(Outils!E36=\"Au Chantier\",Outils!F36,\"\")","v":""},{"$f":"IF(Outils!E36=\"Au Chantier\",Outils!G36,\"\")","v":""}]
[{"$f":"IF(Outils!E37=\"Au Chantier\",Outils!A37,\"\")","v":""},{"$f":"IF(Outils!E37=\"Au Chantier\",Outils!B37,\"\")","v":""},{"$f":"IF(Outils!E37=\"Au Chantier\",Outils!C37,\"\")","v":""},{"$f":"IF(Outils!E37=\"Au Chantier\",Outils!D37,\"\")","v":""},{"$f":"IF(Outils!E37=\"Au Chantier\",Outils!E37,\"\")","v":""},{"$f":"IF(Outils!E37=\"Au Chantier\",Outils!F37,\"\")","v":""},{"$f":"IF(Outils!E37=\"Au Chantier\",Outils!G37,\"\")","v":""}]
[{"$f":"IF(Outils!E38=\"Au Chantier\",Outils!A38,\"\")","v":""},{"$f":"IF(Outils!E38=\"Au Chantier\",Outils!B38,\"\")","v":""},{"$f":"IF(Outils!E38=\"Au Chantier\",Outils!C38,\"\")","v":""},{"$f":"IF(Outils!E38=\"Au Chantier\",Outils!D38,\"\")","v":""},{"$f":"IF(Outils!E38=\"Au Chantier\",Outils!E38,\"\")","v":""},{"$f":"IF(Outils!E38=\"Au Chantier\",Outils!F38,\"\")","v":""},{"$f":"IF(Outils!E38=\"Au Chantier\",Outils!G38,\"\")","v":""}]
[{"$f":"IF(Outils!E39=\"Au Chantier\",Outils!A39,\"\")","v":""},{"$f":"IF(Outils!E39=\"Au Chantier\",Outils!B39,\"\")","v":""},{"$f":"IF(Outils!E39=\"Au Chantier\",Outils!C39,\"\")","v":""},{"$f":"IF(Outils!E39=\"Au Chantier\",Outils!D39,\"\")","v":""},{"$f":"IF(Outils!E39=\"Au Chantier\",Outils!E39,\"\")","v":""},{"$f":"IF(Outils!E39=\"Au Chantier\",Outils!F39,\"\")","v":""},{"$f":"IF(Outils!E39=\"Au Chantier\",Outils!G39,\"\")","v":""}]
[{"$f":"IF(Outils!E40=\"Au Chantier\",Outils!A40,\"\")","v":""},{"$f":"IF(Outils!E40=\"Au Chantier\",Outils!B40,\"\")","v":""},{"$f":"IF(Outils!E40=\"Au Chantier\",Outils!C40,\"\")","v":""},{"$f":"IF(Outils!E40=\"Au Chantier\",Outils!D40,\"\")","v":""},{"$f":"IF(Outils!E40=\"Au Chantier\",Outils!E40,\"\")","v":""},{"$f":"IF(Outils!E40=\"Au Chantier\",Outils!F40,\"\")","v":""},{"$f":"IF(Outils!E40=\"Au Chantier\",Outils!G40,\"\")","v":""}]
[{"$f":"IF(Outils!E41=\"Au Chantier\",Outils!A41,\"\")","v":""},{"$f":"IF(Outils!E41=\"Au Chantier\",Outils!B41,\"\")","v":""},{"$f":"IF(Outils!E41=\"Au Chantier\",Outils!C41,\"\")","v":""},{"$f":"IF(Outils!E41=\"Au Chantier\",Outils!D41,\"\")","v":""},{"$f":"IF(Outils!E41=\"Au Chantier\",Outils!E41,\"\")","v":""},{"$f":"IF(Outils!E41=\"Au Chantier\",Outils!F41,\"\")","v":""},{"$f":"IF(Outils!E41=\"Au Chantier\",Outils!G41,\"\")","v":""}]
[{"$f":"IF(Outils!E42=\"Au Chantier\",Outils!A42,\"\")","v":""},{"$f":"IF(Outils!E42=\"Au Chantier\",Outils!B42,\"\")","v":""},{"$f":"IF(Outils!E42=\"Au Chantier\",Outils!C42,\"\")","v":""},{"$f":"IF(Outils!E42=\"Au Chantier\",Outils!D42,\"\")","v":""},{"$f":"IF(Outils!E42=\"Au Chantier\",Outils!E42,\"\")","v":""},{"$f":"IF(Outils!E42=\"Au Chantier\",Outils!F42,\"\")","v":""},{"$f":"IF(Outils!E42=\"Au Chantier\",Outils!G42,\"\")","v":""}]
[{"$f":"IF(Outils!E43=\"Au Chantier\",Outils!A43,\"\")","v":""},{"$f":"IF(Outils!E43=\"Au Chantier\",Outils!B43,\"\")","v":""},{"$f":"IF(Outils!E43=\"Au Chantier\",Outils!C43,\"\")","v":""},{"$f":"IF(Outils!E43=\"Au Chantier\",Outils!D43,\"\")","v":""},{"$f":"IF(Outils!E43=\"Au Chantier\",Outils!E43,\"\")","v":""},{"$f":"IF(Outils!E43=\"Au Chantier\",Outils!F43,\"\")","v":""},{"$f":"IF(Outils!E43=\"Au Chantier\",Outils!G43,\"\")","v":""}]
[{"$f":"IF(Outils!E44=\"Au Chantier\",Outils!A44,\"\")","v":""},{"$f":"IF(Outils!E44=\"Au Chantier\",Outils!B44,\"\")","v":""},{"$f":"IF(Outils!E44=\"Au Chantier\",Outils!C44,\"\")","v":""},{"$f":"IF(Outils!E44=\"Au Chantier\",Outils!D44,\"\")","v":""},{"$f":"IF(Outils!E44=\"Au Chantier\",Outils!E44,\"\")","v":""},{"$f":"IF(Outils!E44=\"Au Chantier\",Outils!F44,\"\")","v":""},{"$f":"IF(Outils!E44=\"Au Chantier\",Outils!G44,\"\")","v":""}]
[{"$f":"IF(Outils!E45=\"Au Chantier\",Outils!A45,\"\")","v":""},{"$f":"IF(Outils!E45=\"Au Chantier\",Outils!B45,\"\")","v":""},{"$f":"IF(Outils!E45=\"Au Chantier\",Outils!C45,\"\")","v":""},{"$f":"IF(Outils!E45=\"Au Chantier\",Outils!D45,\"\")","v":""},{"$f":"IF(Outils!E45=\"Au Chantier\",Outils!E45,\"\")","v":""},{"$f":"IF(Outils!E45=\"Au Chantier\",Outils!F45,\"\")","v":""},{"$f":"IF(Outils!E45=\"Au Chantier\",Outils!G45,\"\")","v":""}]
[{"$f":"IF(Outils!E46=\"Au Chantier\",Outils!A46,\"\")","v":""},{"$f":"IF(Outils!E46=\"Au Chantier\",Outils!B46,\"\")","v":""},{"$f":"IF(Outils!E46=\"Au Chantier\",Outils!C46,\"\")","v":""},{"$f":"IF(Outils!E46=\"Au Chantier\",Outils!D46,\"\")","v":""},{"$f":"IF(Outils!E46=\"Au Chantier\",Outils!E46,\"\")","v":""},{"$f":"IF(Outils!E46=\"Au Chantier\",Outils!F46,\"\")","v":""},{"$f":"IF(Outils!E46=\"Au Chantier\",Outils!G46,\"\")","v":""}]
[{"$f":"IF(Outils!E47=\"Au Chantier\",Outils!A47,\"\")","v":""},{"$f":"IF(Outils!E47=\"Au Chantier\",Outils!B47,\"\")","v":""},{"$f":"IF(Outils!E47=\"Au Chantier\",Outils!C47,\"\")","v":""},{"$f":"IF(Outils!E47=\"Au Chantier\",Outils!D47,\"\")","v":""},{"$f":"IF(Outils!E47=\"Au Chantier\",Outils!E47,\"\")","v":""},{"$f":"IF(Outils!E47=\"Au Chantier\",Outils!F47,\"\")","v":""},{"$f":"IF(Outils!E47=\"Au Chantier\",Outils!G47,\"\")","v":""}]
[{"$f":"IF(Outils!E48=\"Au Chantier\",Outils!A48,\"\")","v":""},{"$f":"IF(Outils!E48=\"Au Chantier\",Outils!B48,\"\")","v":""},{"$f":"IF(Outils!E48=\"Au Chantier\",Outils!C48,\"\")","v":""},{"$f":"IF(Outils!E48=\"Au Chantier\",Outils!D48,\"\")","v":""},{"$f":"IF(Outils!E48=\"Au Chantier\",Outils!E48,\"\")","v":""},{"$f":"IF(Outils!E48=\"Au Chantier\",Outils!F48,\"\")","v":""},{"$f":"IF(Outils!E48=\"Au Chantier\",Outils!G48,\"\")","v":""}]
[{"$f":"IF(Outils!E49=\"Au Chantier\",Outils!A49,\"\")","v":""},{"$f":"IF(Outils!E49=\"Au Chantier\",Outils!B49,\"\")","v":""},{"$f":"IF(Outils!E49=\"Au Chantier\",Outils!C49,\"\")","v":""},{"$f":"IF(Outils!E49=\"Au Chantier\",Outils!D49,\"\")","v":""},{"$f":"IF(Outils!E49=\"Au Chantier\",Outils!E49,\"\")","v":""},{"$f":"IF(Outils!E49=\"Au Chantier\",Outils!F49,\"\")","v":""},{"$f":"IF(Outils!E49=\"Au Chantier\",Outils!G49,\"\")","v":""}]
[{"$f":"IF(Outils!E50=\"Au Chantier\",Outils!A50,\"\")","v":""},{"$f":"IF(Outils!E50=\"Au Chantier\",Outils!B50,\"\")","v":""},{"$f":"IF(Outils!E50=\"Au Chantier\",Outils!C50,\"\")","v":""},{"$f":"IF(Outils!E50=\"Au Chantier\",Outils!D50,\"\")","v":""},{"$f":"IF(Outils!E50=\"Au Chantier\",Outils!E50,\"\")","v":""},{"$f":"IF(Outils!E50=\"Au Chantier\",Outils!F50,\"\")","v":""},{"$f":"IF(Outils!E50=\"Au Chantier\",Outils!G50,\"\")","v":""}]
[{"$f":"IF(Outils!E51=\"Au Chantier\",Outils!A51,\"\")","v":""},{"$f":"IF(Outils!E51=\"Au Chantier\",Outils!B51,\"\")","v":""},{"$f":"IF(Outils!E51=\"Au Chantier\",Outils!C51,\"\")","v":""},{"$f":"IF(Outils!E51=\"Au Chantier\",Outils!D51,\"\")","v":""},{"$f":"IF(Outils!E51=\"Au Chantier\",Outils!E51,\"\")","v":""},{"$f":"IF(Outils!E51=\"Au Chantier\",Outils!F51,\"\")","v":""},{"$f":"IF(Outils!E51=\"Au Chantier\",Outils!G51,\"\")","v":""}]
[{"$f":"IF(Outils!E52=\"Au Chantier\",Outils!A52,\"\")","v":""},{"$f":"IF(Outils!E52=\"Au Chantier\",Outils!B52,\"\")","v":""},{"$f":"IF(Outils!E52=\"Au Chantier\",Outils!C52,\"\")","v":""},{"$f":"IF(Outils!E52=\"Au Chantier\",Outils!D52,\"\")","v":""},{"$f":"IF(Outils!E52=\"Au Chantier\",Outils!E52,\"\")","v":""},{"$f":"IF(Outils!E52=\"Au Chantier\",Outils!F52,\"\")","v":""},{"$f":"IF(Outils!E52=\"Au Chantier\",Outils!G52,\"\")","v":""}]
[{"$f":"IF(Outils!E53=\"Au Chantier\",Outils!A53,\"\")","v":""},{"$f":"IF(Outils!E53=\"Au Chantier\",Outils!B53,\"\")","v":""},{"$f":"IF(Outils!E53=\"Au Chantier\",Outils!C53,\"\")","v":""},{"$f":"IF(Outils!E53=\"Au Chantier\",Outils!D53,\"\")","v":""},{"$f":"IF(Outils!E53=\"Au Chantier\",Outils!E53,\"\")","v":""},{"$f":"IF(Outils!E53=\"Au Chantier\",Outils!F53,\"\")","v":""},{"$f":"IF(Outils!E53=\"Au Chantier\",Outils!G53,\"\")","v":""}]
[{"$f":"IF(Outils!E54=\"Au Chantier\",Outils!A54,\"\")","v":""},{"$f":"IF(Outils!E54=\"Au Chantier\",Outils!B54,\"\")","v":""},{"$f":"IF(Outils!E54=\"Au Chantier\",Outils!C54,\"\")","v":""},{"$f":"IF(Outils!E54=\"Au Chantier\",Outils!D54,\"\")","v":""},{"$f":"IF(Outils!E54=\"Au Chantier\",Outils!E54,\"\")","v":""},{"$f":"IF(Outils!E54=\"Au Chantier\",Outils!F54,\"\")","v":""},{"$f":"IF(Outils!E54=\"Au Chantier\",Outils!G54,\"\")","v":""}]
[{"$f":"IF(Outils!E55=\"Au Chantier\",Outils!A55,\"\")","v":""},{"$f":"IF(Outils!E55=\"Au Chantier\",Outils!B55,\"\")","v":""},{"$f":"IF(Outils!E55=\"Au Chantier\",Outils!C55,\"\")","v":""},{"$f":"IF(Outils!E55=\"Au Chantier\",Outils!D55,\"\")","v":""},{"$f":"IF(Outils!E55=\"Au Chantier\",Outils!E55,\"\")","v":""},{"$f":"IF(Outils!E55=\"Au Chantier\",Outils!F55,\"\")","v":""},{"$f":"IF(Outils!E55=\"Au Chantier\",Outils!G55,\"\")","v":""}]
[{"$f":"IF(Outils!E56=\"Au Chantier\",Outils!A56,\"\")","v":""},{"$f":"IF(Outils!E56=\"Au Chantier\",Outils!B56,\"\")","v":""},{"$f":"IF(Outils!E56=\"Au Chantier\",Outils!C56,\"\")","v":""},{"$f":"IF(Outils!E56=\"Au Chantier\",Outils!D56,\"\")","v":""},{"$f":"IF(Outils!E56=\"Au Chantier\",Outils!E56,\"\")","v":""},{"$f":"IF(Outils!E56=\"Au Chantier\",Outils!F56,\"\")","v":""},{"$f":"IF(Outils!E56=\"Au Chantier\",Outils!G56,\"\")","v":""}]
[{"$f":"IF(Outils!E57=\"Au Chantier\",Outils!A57,\"\")","v":""},{"$f":"IF(Outils!E57=\"Au Chantier\",Outils!B57,\"\")","v":""},{"$f":"IF(Outils!E57=\"Au Chantier\",Outils!C57,\"\")","v":""},{"$f":"IF(Outils!E57=\"Au Chantier\",Outils!D57,\"\")","v":""},{"$f":"IF(Outils!E57=\"Au Chantier\",Outils!E57,\"\")","v":""},{"$f":"IF(Outils!E57=\"Au Chantier\",Outils!F57,\"\")","v":""},{"$f":"IF(Outils!E57=\"Au Chantier\",Outils!G57,\"\")","v":""}]
[{"$f":"IF(Outils!E58=\"Au Chantier\",Outils!A58,\"\")","v":""},{"$f":"IF(Outils!E58=\"Au Chantier\",Outils!B58,\"\")","v":""},{"$f":"IF(Outils!E58=\"Au Chantier\",Outils!C58,\"\")","v":""},{"$f":"IF(Outils!E58=\"Au Chantier\",Outils!D58,\"\")","v":""},{"$f":"IF(Outils!E58=\"Au Chantier\",Outils!E58,\"\")","v":""},{"$f":"IF(Outils!E58=\"Au Chantier\",Outils!F58,\"\")","v":""},{"$f":"IF(Outils!E58=\"Au Chantier\",Outils!G58,\"\")","v":""}]
[{"$f":"IF(Outils!E59=\"Au Chantier\",Outils!A59,\"\")","v":""},{"$f":"IF(Outils!E59=\"Au Chantier\",Outils!B59,\"\")","v":""},{"$f":"IF(Outils!E59=\"Au Chantier\",Outils!C59,\"\")","v":""},{"$f":"IF(Outils!E59=\"Au Chantier\",Outils!D59,\"\")","v":""},{"$f":"IF(Outils!E59=\"Au Chantier\",Outils!E59,\"\")","v":""},{"$f":"IF(Outils!E59=\"Au Chantier\",Outils!F59,\"\")","v":""},{"$f":"IF(Outils!E59=\"Au Chantier\",Outils!G59,\"\")","v":""}]
[{"$f":"IF(Outils!E60=\"Au Chantier\",Outils!A60,\"\")","v":""},{"$f":"IF(Outils!E60=\"Au Chantier\",Outils!B60,\"\")","v":""},{"$f":"IF(Outils!E60=\"Au Chantier\",Outils!C60,\"\")","v":""},{"$f":"IF(Outils!E60=\"Au Chantier\",Outils!D60,\"\")","v":""},{"$f":"IF(Outils!E60=\"Au Chantier\",Outils!E60,\"\")","v":""},{"$f":"IF(Outils!E60=\"Au Chantier\",Outils!F60,\"\")","v":""},{"$f":"IF(Outils!E60=\"Au Chantier\",Outils!G60,\"\")","v":""}]
[{"$f":"IF(Outils!E61=\"Au Chantier\",Outils!A61,\"\")","v":""},{"$f":"IF(Outils!E61=\"Au Chantier\",Outils!B61,\"\")","v":""},{"$f":"IF(Outils!E61=\"Au Chantier\",Outils!C61,\"\")","v":""},{"$f":"IF(Outils!E61=\"Au Chantier\",Outils!D61,\"\")","v":""},{"$f":"IF(Outils!E61=\"Au Chantier\",Outils!E61,\"\")","v":""},{"$f":"IF(Outils!E61=\"Au Chantier\",Outils!F61,\"\")","v":""},{"$f":"IF(Outils!E61=\"Au Chantier\",Outils!G61,\"\")","v":""}]
[{"$f":"IF(Outils!E62=\"Au Chantier\",Outils!A62,\"\")","v":""},{"$f":"IF(Outils!E62=\"Au Chantier\",Outils!B62,\"\")","v":""},{"$f":"IF(Outils!E62=\"Au Chantier\",Outils!C62,\"\")","v":""},{"$f":"IF(Outils!E62=\"Au Chantier\",Outils!D62,\"\")","v":""},{"$f":"IF(Outils!E62=\"Au Chantier\",Outils!E62,\"\")","v":""},{"$f":"IF(Outils!E62=\"Au Chantier\",Outils!F62,\"\")","v":""},{"$f":"IF(Outils!E62=\"Au Chantier\",Outils!G62,\"\")","v":""}]
[{"$f":"IF(Outils!E63=\"Au Chantier\",Outils!A63,\"\")","v":""},{"$f":"IF(Outils!E63=\"Au Chantier\",Outils!B63,\"\")","v":""},{"$f":"IF(Outils!E63=\"Au Chantier\",Outils!C63,\"\")","v":""},{"$f":"IF(Outils!E63=\"Au Chantier\",Outils!D63,\"\")","v":""},{"$f":"IF(Outils!E63=\"Au Chantier\",Outils!E63,\"\")","v":""},{"$f":"IF(Outils!E63=\"Au Chantier\",Outils!F63,\"\")","v":""},{"$f":"IF(Outils!E63=\"Au Chantier\",Outils!G63,\"\")","v":""}]
[{"$f":"IF(Outils!E64=\"Au Chantier\",Outils!A64,\"\")","v":""},{"$f":"IF(Outils!E64=\"Au Chantier\",Outils!B64,\"\")","v":""},{"$f":"IF(Outils!E64=\"Au Chantier\",Outils!C64,\"\")","v":""},{"$f":"IF(Outils!E64=\"Au Chantier\",Outils!D64,\"\")","v":""},{"$f":"IF(Outils!E64=\"Au Chantier\",Outils!E64,\"\")","v":""},{"$f":"IF(Outils!E64=\"Au Chantier\",Outils!F64,\"\")","v":""},{"$f":"IF(Outils!E64=\"Au Chantier\",Outils!G64,\"\")","v":""}]
[{"$f":"IF(Outils!E65=\"Au Chantier\",Outils!A65,\"\")","v":""},{"$f":"IF(Outils!E65=\"Au Chantier\",Outils!B65,\"\")","v":""},{"$f":"IF(Outils!E65=\"Au Chantier\",Outils!C65,\"\")","v":""},{"$f":"IF(Outils!E65=\"Au Chantier\",Outils!D65,\"\")","v":""},{"$f":"IF(Outils!E65=\"Au Chantier\",Outils!E65,\"\")","v":""},{"$f":"IF(Outils!E65=\"Au Chantier\",Outils!F65,\"\")","v":""},{"$f":"IF(Outils!E65=\"Au Chantier\",Outils!G65,\"\")","v":""}]
[{"$f":"IF(Outils!E66=\"Au Chantier\",Outils!A66,\"\")","v":""},{"$f":"IF(Outils!E66=\"Au Chantier\",Outils!B66,\"\")","v":""},{"$f":"IF(Outils!E66=\"Au Chantier\",Outils!C66,\"\")","v":""},{"$f":"IF(Outils!E66=\"Au Chantier\",Outils!D66,\"\")","v":""},{"$f":"IF(Outils!E66=\"Au Chantier\",Outils!E66,\"\")","v":""},{"$f":"IF(Outils!E66=\"Au Chantier\",Outils!F66,\"\")","v":""},{"$f":"IF(Outils!E66=\"Au Chantier\",Outils!G66,\"\")","v":""}]
[{"$f":"IF(Outils!E67=\"Au Chantier\",Outils!A67,\"\")","v":""},{"$f":"IF(Outils!E67=\"Au Chantier\",Outils!B67,\"\")","v":""},{"$f":"IF(Outils!E67=\"Au Chantier\",Outils!C67,\"\")","v":""},{"$f":"IF(Outils!E67=\"Au Chantier\",Outils!D67,\"\")","v":""},{"$f":"IF(Outils!E67=\"Au Chantier\",Outils!E67,\"\")","v":""},{"$f":"IF(Outils!E67=\"Au Chantier\",Outils!F67,\"\")","v":""},{"$f":"IF(Outils!E67=\"Au Chantier\",Outils!G67,\"\")","v":""}]
[{"$f":"IF(Outils!E68=\"Au Chantier\",Outils!A68,\"\")","v":""},{"$f":"IF(Outils!E68=\"Au Chantier\",Outils!B68,\"\")","v":""},{"$f":"IF(Outils!E68=\"Au Chantier\",Outils!C68,\"\")","v":""},{"$f":"IF(Outils!E68=\"Au Chantier\",Outils!D68,\"\")","v":""},{"$f":"IF(Outils!E68=\"Au Chantier\",Outils!E68,\"\")","v":""},{"$f":"IF(Outils!E68=\"Au Chantier\",Outils!F68,\"\")","v":""},{"$f":"IF(Outils!E68=\"Au Chantier\",Outils!G68,\"\")","v":""}]
[{"$f":"IF(Outils!E69=\"Au Chantier\",Outils!A69,\"\")","v":""},{"$f":"IF(Outils!E69=\"Au Chantier\",Outils!B69,\"\")","v":""},{"$f":"IF(Outils!E69=\"Au Chantier\",Outils!C69,\"\")","v":""},{"$f":"IF(Outils!E69=\"Au Chantier\",Outils!D69,\"\")","v":""},{"$f":"IF(Outils!E69=\"Au Chantier\",Outils!E69,\"\")","v":""},{"$f":"IF(Outils!E69=\"Au Chantier\",Outils!F69,\"\")","v":""},{"$f":"IF(Outils!E69=\"Au Chantier\",Outils!G69,\"\")","v":""}]
[{"$f":"IF(Outils!E70=\"Au Chantier\",Outils!A70,\"\")","v":""},{"$f":"IF(Outils!E70=\"Au Chantier\",Outils!B70,\"\")","v":""},{"$f":"IF(Outils!E70=\"Au Chantier\",Outils!C70,\"\")","v":""},{"$f":"IF(Outils!E70=\"Au Chantier\",Outils!D70,\"\")","v":""},{"$f":"IF(Outils!E70=\"Au Chantier\",Outils!E70,\"\")","v":""},{"$f":"IF(Outils!E70=\"Au Chantier\",Outils!F70,\"\")","v":""},{"$f":"IF(Outils!E70=\"Au Chantier\",Outils!G70,\"\")","v":""}]
[{"$f":"IF(Outils!E71=\"Au Chantier\",Outils!A71,\"\")","v":""},{"$f":"IF(Outils!E71=\"Au Chantier\",Outils!B71,\"\")","v":""},{"$f":"IF(Outils!E71=\"Au Chantier\",Outils!C71,\"\")","v":""},{"$f":"IF(Outils!E71=\"Au Chantier\",Outils!D71,\"\")","v":""},{"$f":"IF(Outils!E71=\"Au Chantier\",Outils!E71,\"\")","v":""},{"$f":"IF(Outils!E71=\"Au Chantier\",Outils!F71,\"\")","v":""},{"$f":"IF(Outils!E71=\"Au Chantier\",Outils!G71,\"\")","v":""}]
[{"$f":"IF(Outils!E72=\"Au Chantier\",Outils!A72,\"\")","v":""},{"$f":"IF(Outils!E72=\"Au Chantier\",Outils!B72,\"\")","v":""},{"$f":"IF(Outils!E72=\"Au Chantier\",Outils!C72,\"\")","v":""},{"$f":"IF(Outils!E72=\"Au Chantier\",Outils!D72,\"\")","v":""},{"$f":"IF(Outils!E72=\"Au Chantier\",Outils!E72,\"\")","v":""},{"$f":"IF(Outils!E72=\"Au Chantier\",Outils!F72,\"\")","v":""},{"$f":"IF(Outils!E72=\"Au Chantier\",Outils!G72,\"\")","v":""}]
[{"$f":"IF(Outils!E73=\"Au Chantier\",Outils!A73,\"\")","v":""},{"$f":"IF(Outils!E73=\"Au Chantier\",Outils!B73,\"\")","v":""},{"$f":"IF(Outils!E73=\"Au Chantier\",Outils!C73,\"\")","v":""},{"$f":"IF(Outils!E73=\"Au Chantier\",Outils!D73,\"\")","v":""},{"$f":"IF(Outils!E73=\"Au Chantier\",Outils!E73,\"\")","v":""},{"$f":"IF(Outils!E73=\"Au Chantier\",Outils!F73,\"\")","v":""},{"$f":"IF(Outils!E73=\"Au Chantier\",Outils!G73,\"\")","v":""}]
[{"$f":"IF(Outils!E74=\"Au Chantier\",Outils!A74,\"\")","v":""},{"$f":"IF(Outils!E74=\"Au Chantier\",Outils!B74,\"\")","v":""},{"$f":"IF(Outils!E74=\"Au Chantier\",Outils!C74,\"\")","v":""},{"$f":"IF(Outils!E74=\"Au Chantier\",Outils!D74,\"\")","v":""},{"$f":"IF(Outils!E74=\"Au Chantier\",Outils!E74,\"\")","v":""},{"$f":"IF(Outils!E74=\"Au Chantier\",Outils!F74,\"\")","v":""},{"$f":"IF(Outils!E74=\"Au Chantier\",Outils!G74,\"\")","v":""}]
[{"$f":"IF(Outils!E75=\"Au Chantier\",Outils!A75,\"\")","v":""},{"$f":"IF(Outils!E75=\"Au Chantier\",Outils!B75,\"\")","v":""},{"$f":"IF(Outils!E75=\"Au Chantier\",Outils!C75,\"\")","v":""},{"$f":"IF(Outils!E75=\"Au Chantier\",Outils!D75,\"\")","v":""},{"$f":"IF(Outils!E75=\"Au Chantier\",Outils!E75,\"\")","v":""},{"$f":"IF(Outils!E75=\"Au Chantier\",Outils!F75,\"\")","v":""},{"$f":"IF(Outils!E75=\"Au Chantier\",Outils!G75,\"\")","v":""}]
[{"$f":"IF(Outils!E76=\"Au Chantier\",Outils!A76,\"\")","v":""},{"$f":"IF(Outils!E76=\"Au Chantier\",Outils!B76,\"\")","v":""},{"$f":"IF(Outils!E76=\"Au Chantier\",Outils!C76,\"\")","v":""},{"$f":"IF(Outils!E76=\"Au Chantier\",Outils!D76,\"\")","v":""},{"$f":"IF(Outils!E76=\"Au Chantier\",Outils!E76,\"\")","v":""},{"$f":"IF(Outils!E76=\"Au Chantier\",Outils!F76,\"\")","v":""},{"$f":"IF(Outils!E76=\"Au Chantier\",Outils!G76,\"\")","v":""}]
[{"$f":"IF(Outils!E77=\"Au Chantier\",Outils!A77,\"\")","v":""},{"$f":"IF(Outils!E77=\"Au Chantier\",Outils!B77,\"\")","v":""},{"$f":"IF(Outils!E77=\"Au Chantier\",Outils!C77,\"\")","v":""},{"$f":"IF(Outils!E77=\"Au Chantier\",Outils!D77,\"\")","v":""},{"$f":"IF(Outils!E77=\"Au Chantier\",Outils!E77,\"\")","v":""},{"$f":"IF(Outils!E77=\"Au Chantier\",Outils!F77,\"\")","v":""},{"$f":"IF(Outils!E77=\"Au Chantier\",Outils!G77,\"\")","v":""}]
[{"$f":"IF(Outils!E78=\"Au Chantier\",Outils!A78,\"\")","v":""},{"$f":"IF(Outils!E78=\"Au Chantier\",Outils!B78,\"\")","v":""},{"$f":"IF(Outils!E78=\"Au Chantier\",Outils!C78,\"\")","v":""},{"$f":"IF(Outils!E78=\"Au Chantier\",Outils!D78,\"\")","v":""},{"$f":"IF(Outils!E78=\"Au Chantier\",Outils!E78,\"\")","v":""},{"$f":"IF(Outils!E78=\"Au Chantier\",Outils!F78,\"\")","v":""},{"$f":"IF(Outils!E78=\"Au Chantier\",Outils!G78,\"\")","v":""}]
[{"$f":"IF(Outils!E79=\"Au Chantier\",Outils!A79,\"\")","v":""},{"$f":"IF(Outils!E79=\"Au Chantier\",Outils!B79,\"\")","v":""},{"$f":"IF(Outils!E79=\"Au Chantier\",Outils!C79,\"\")","v":""},{"$f":"IF(Outils!E79=\"Au Chantier\",Outils!D79,\"\")","v":""},{"$f":"IF(Outils!E79=\"Au Chantier\",Outils!E79,\"\")","v":""},{"$f":"IF(Outils!E79=\"Au Chantier\",Outils!F79,\"\")","v":""},{"$f":"IF(Outils!E79=\"Au Chantier\",Outils!G79,\"\")","v":""}]
[{"$f":"IF(Outils!E80=\"Au Chantier\",Outils!A80,\"\")","v":""},{"$f":"IF(Outils!E80=\"Au Chantier\",Outils!B80,\"\")","v":""},{"$f":"IF(Outils!E80=\"Au Chantier\",Outils!C80,\"\")","v":""},{"$f":"IF(Outils!E80=\"Au Chantier\",Outils!D80,\"\")","v":""},{"$f":"IF(Outils!E80=\"Au Chantier\",Outils!E80,\"\")","v":""},{"$f":"IF(Outils!E80=\"Au Chantier\",Outils!F80,\"\")","v":""},{"$f":"IF(Outils!E80=\"Au Chantier\",Outils!G80,\"\")","v":""}]
[{"$f":"IF(Outils!E81=\"Au Chantier\",Outils!A81,\"\")","v":""},{"$f":"IF(Outils!E81=\"Au Chantier\",Outils!B81,\"\")","v":""},{"$f":"IF(Outils!E81=\"Au Chantier\",Outils!C81,\"\")","v":""},{"$f":"IF(Outils!E81=\"Au Chantier\",Outils!D81,\"\")","v":""},{"$f":"IF(Outils!E81=\"Au Chantier\",Outils!E81,\"\")","v":""},{"$f":"IF(Outils!E81=\"Au Chantier\",Outils!F81,\"\")","v":""},{"$f":"IF(Outils!E81=\"Au Chantier\",Outils!G81,\"\")","v":""}]
[{"$f":"IF(Outils!E82=\"Au Chantier\",Outils!A82,\"\")","v":""},{"$f":"IF(Outils!E82=\"Au Chantier\",Outils!B82,\"\")","v":""},{"$f":"IF(Outils!E82=\"Au Chantier\",Outils!C82,\"\")","v":""},{"$f":"IF(Outils!E82=\"Au Chantier\",Outils!D82,\"\")","v":""},{"$f":"IF(Outils!E82=\"Au Chantier\",Outils!E82,\"\")","v":""},{"$f":"IF(Outils!E82=\"Au Chantier\",Outils!F82,\"\")","v":""},{"$f":"IF(Outils!E82=\"Au Chantier\",Outils!G82,\"\")","v":""}]
[{"$f":"IF(Outils!E83=\"Au Chantier\",Outils!A83,\"\")","v":""},{"$f":"IF(Outils!E83=\"Au Chantier\",Outils!B83,\"\")","v":""},{"$f":"IF(Outils!E83=\"Au Chantier\",Outils!C83,\"\")","v":""},{"$f":"IF(Outils!E83=\"Au Chantier\",Outils!D83,\"\")","v":""},{"$f":"IF(Outils!E83=\"Au Chantier\",Outils!E83,\"\")","v":""},{"$f":"IF(Outils!E83=\"Au Chantier\",Outils!F83,\"\")","v":""},{"$f":"IF(Outils!E83=\"Au Chantier\",Outils!G83,\"\")","v":""}]
[{"$f":"IF(Outils!E84=\"Au Chantier\",Outils!A84,\"\")","v":""},{"$f":"IF(Outils!E84=\"Au Chantier\",Outils!B84,\"\")","v":""},{"$f":"IF(Outils!E84=\"Au Chantier\",Outils!C84,\"\")","v":""},{"$f":"IF(Outils!E84=\"Au Chantier\",Outils!D84,\"\")","v":""},{"$f":"IF(Outils!E84=\"Au Chantier\",Outils!E84,\"\")","v":""},{"$f":"IF(Outils!E84=\"Au Chantier\",Outils!F84,\"\")","v":""},{"$f":"IF(Outils!E84=\"Au Chantier\",Outils!G84,\"\")","v":""}]
[{"$f":"IF(Outils!E85=\"Au Chantier\",Outils!A85,\"\")","v":""},{"$f":"IF(Outils!E85=\"Au Chantier\",Outils!B85,\"\")","v":""},{"$f":"IF(Outils!E85=\"Au Chantier\",Outils!C85,\"\")","v":""},{"$f":"IF(Outils!E85=\"Au Chantier\",Outils!D85,\"\")","v":""},{"$f":"IF(Outils!E85=\"Au Chantier\",Outils!E85,\"\")","v":""},{"$f":"IF(Outils!E85=\"Au Chantier\",Outils!F85,\"\")","v":""},{"$f":"IF(Outils!E85=\"Au Chantier\",Outils!G85,\"\")","v":""}]
[{"$f":"IF(Outils!E86=\"Au Chantier\",Outils!A86,\"\")","v":""},{"$f":"IF(Outils!E86=\"Au Chantier\",Outils!B86,\"\")","v":""},{"$f":"IF(Outils!E86=\"Au Chantier\",Outils!C86,\"\")","v":""},{"$f":"IF(Outils!E86=\"Au Chantier\",Outils!D86,\"\")","v":""},{"$f":"IF(Outils!E86=\"Au Chantier\",Outils!E86,\"\")","v":""},{"$f":"IF(Outils!E86=\"Au Chantier\",Outils!F86,\"\")","v":""},{"$f":"IF(Outils!E86=\"Au Chantier\",Outils!G86,\"\")","v":""}]
[{"$f":"IF(Outils!E87=\"Au Chantier\",Outils!A87,\"\")","v":""},{"$f":"IF(Outils!E87=\"Au Chantier\",Outils!B87,\"\")","v":""},{"$f":"IF(Outils!E87=\"Au Chantier\",Outils!C87,\"\")","v":""},{"$f":"IF(Outils!E87=\"Au Chantier\",Outils!D87,\"\")","v":""},{"$f":"IF(Outils!E87=\"Au Chantier\",Outils!E87,\"\")","v":""},{"$f":"IF(Outils!E87=\"Au Chantier\",Outils!F87,\"\")","v":""},{"$f":"IF(Outils!E87=\"Au Chantier\",Outils!G87,\"\")","v":""}]
[{"$f":"IF(Outils!E88=\"Au Chantier\",Outils!A88,\"\")","v":""},{"$f":"IF(Outils!E88=\"Au Chantier\",Outils!B88,\"\")","v":""},{"$f":"IF(Outils!E88=\"Au Chantier\",Outils!C88,\"\")","v":""},{"$f":"IF(Outils!E88=\"Au Chantier\",Outils!D88,\"\")","v":""},{"$f":"IF(Outils!E88=\"Au Chantier\",Outils!E88,\"\")","v":""},{"$f":"IF(Outils!E88=\"Au Chantier\",Outils!F88,\"\")","v":""},{"$f":"IF(Outils!E88=\"Au Chantier\",Outils!G88,\"\")","v":""}]
[{"$f":"IF(Outils!E89=\"Au Chantier\",Outils!A89,\"\")","v":""},{"$f":"IF(Outils!E89=\"Au Chantier\",Outils!B89,\"\")","v":""},{"$f":"IF(Outils!E89=\"Au Chantier\",Outils!C89,\"\")","v":""},{"$f":"IF(Outils!E89=\"Au Chantier\",Outils!D89,\"\")","v":""},{"$f":"IF(Outils!E89=\"Au Chantier\",Outils!E89,\"\")","v":""},{"$f":"IF(Outils!E89=\"Au Chantier\",Outils!F89,\"\")","v":""},{"$f":"IF(Outils!E89=\"Au Chantier\",Outils!G89,\"\")","v":""}]
[{"$f":"IF(Outils!E90=\"Au Chantier\",Outils!A90,\"\")","v":""},{"$f":"IF(Outils!E90=\"Au Chantier\",Outils!B90,\"\")","v":""},{"$f":"IF(Outils!E90=\"Au Chantier\",Outils!C90,\"\")","v":""},{"$f":"IF(Outils!E90=\"Au Chantier\",Outils!D90,\"\")","v":""},{"$f":"IF(Outils!E90=\"Au Chantier\",Outils!E90,\"\")","v":""},{"$f":"IF(Outils!E90=\"Au Chantier\",Outils!F90,\"\")","v":""},{"$f":"IF(Outils!E90=\"Au Chantier\",Outils!G90,\"\")","v":""}]
[{"$f":"IF(Outils!E91=\"Au Chantier\",Outils!A91,\"\")","v":""},{"$f":"IF(Outils!E91=\"Au Chantier\",Outils!B91,\"\")","v":""},{"$f":"IF(Outils!E91=\"Au Chantier\",Outils!C91,\"\")","v":""},{"$f":"IF(Outils!E91=\"Au Chantier\",Outils!D91,\"\")","v":""},{"$f":"IF(Outils!E91=\"Au Chantier\",Outils!E91,\"\")","v":""},{"$f":"IF(Outils!E91=\"Au Chantier\",Outils!F91,\"\")","v":""},{"$f":"IF(Outils!E91=\"Au Chantier\",Outils!G91,\"\")","v":""}]
[{"$f":"IF(Outils!E92=\"Au Chantier\",Outils!A92,\"\")","v":""},{"$f":"IF(Outils!E92=\"Au Chantier\",Outils!B92,\"\")","v":""},{"$f":"IF(Outils!E92=\"Au Chantier\",Outils!C92,\"\")","v":""},{"$f":"IF(Outils!E92=\"Au Chantier\",Outils!D92,\"\")","v":""},{"$f":"IF(Outils!E92=\"Au Chantier\",Outils!E92,\"\")","v":""},{"$f":"IF(Outils!E92=\"Au Chantier\",Outils!F92,\"\")","v":""},{"$f":"IF(Outils!E92=\"Au Chantier\",Outils!G92,\"\")","v":""}]
[{"$f":"IF(Outils!E93=\"Au Chantier\",Outils!A93,\"\")","v":""},{"$f":"IF(Outils!E93=\"Au Chantier\",Outils!B93,\"\")","v":""},{"$f":"IF(Outils!E93=\"Au Chantier\",Outils!C93,\"\")","v":""},{"$f":"IF(Outils!E93=\"Au Chantier\",Outils!D93,\"\")","v":""},{"$f":"IF(Outils!E93=\"Au Chantier\",Outils!E93,\"\")","v":""},{"$f":"IF(Outils!E93=\"Au Chantier\",Outils!F93,\"\")","v":""},{"$f":"IF(Outils!E93=\"Au Chantier\",Outils!G93,\"\")","v":""}]
[{"$f":"IF(Outils!E94=\"Au Chantier\",Outils!A94,\"\")","v":""},{"$f":"IF(Outils!E94=\"Au Chantier\",Outils!B94,\"\")","v":""},{"$f":"IF(Outils!E94=\"Au Chantier\",Outils!C94,\"\")","v":""},{"$f":"IF(Outils!E94=\"Au Chantier\",Outils!D94,\"\")","v":""},{"$f":"IF(Outils!E94=\"Au Chantier\",Outils!E94,\"\")","v":""},{"$f":"IF(Outils!E94=\"Au Chantier\",Outils!F94,\"\")","v":""},{"$f":"IF(Outils!E94=\"Au Chantier\",Outils!G94,\"\")","v":""}]
[{"$f":"IF(Outils!E95=\"Au Chantier\",Outils!A95,\"\")","v":""},{"$f":"IF(Outils!E95=\"Au Chantier\",Outils!B95,\"\")","v":""},{"$f":"IF(Outils!E95=\"Au Chantier\",Outils!C95,\"\")","v":""},{"$f":"IF(Outils!E95=\"Au Chantier\",Outils!D95,\"\")","v":""},{"$f":"IF(Outils!E95=\"Au Chantier\",Outils!E95,\"\")","v":""},{"$f":"IF(Outils!E95=\"Au Chantier\",Outils!F95,\"\")","v":""},{"$f":"IF(Outils!E95=\"Au Chantier\",Outils!G95,\"\")","v":""}]
[{"$f":"IF(Outils!E96=\"Au Chantier\",Outils!A96,\"\")","v":""},{"$f":"IF(Outils!E96=\"Au Chantier\",Outils!B96,\"\")","v":""},{"$f":"IF(Outils!E96=\"Au Chantier\",Outils!C96,\"\")","v":""},{"$f":"IF(Outils!E96=\"Au Chantier\",Outils!D96,\"\")","v":""},{"$f":"IF(Outils!E96=\"Au Chantier\",Outils!E96,\"\")","v":""},{"$f":"IF(Outils!E96=\"Au Chantier\",Outils!F96,\"\")","v":""},{"$f":"IF(Outils!E96=\"Au Chantier\",Outils!G96,\"\")","v":""}]
[{"$f":"IF(Outils!E97=\"Au Chantier\",Outils!A97,\"\")","v":""},{"$f":"IF(Outils!E97=\"Au Chantier\",Outils!B97,\"\")","v":""},{"$f":"IF(Outils!E97=\"Au Chantier\",Outils!C97,\"\")","v":""},{"$f":"IF(Outils!E97=\"Au Chantier\",Outils!D97,\"\")","v":""},{"$f":"IF(Outils!E97=\"Au Chantier\",Outils!E97,\"\")","v":""},{"$f":"IF(Outils!E97=\"Au Chantier\",Outils!F97,\"\")","v":""},{"$f":"IF(Outils!E97=\"Au Chantier\",Outils!G97,\"\")","v":""}]
[{"$f":"IF(Outils!E98=\"Au Chantier\",Outils!A98,\"\")","v":""},{"$f":"IF(Outils!E98=\"Au Chantier\",Outils!B98,\"\")","v":""},{"$f":"IF(Outils!E98=\"Au Chantier\",Outils!C98,\"\")","v":""},{"$f":"IF(Outils!E98=\"Au Chantier\",Outils!D98,\"\")","v":""},{"$f":"IF(Outils!E98=\"Au Chantier\",Outils!E98,\"\")","v":""},{"$f":"IF(Outils!E98=\"Au Chantier\",Outils!F98,\"\")","v":""},{"$f":"IF(Outils!E98=\"Au Chantier\",Outils!G98,\"\")","v":""}]
[{"$f":"IF(Outils!E99=\"Au Chantier\",Outils!A99,\"\")","v":""},{"$f":"IF(Outils!E99=\"Au Chantier\",Outils!B99,\"\")","v":""},{"$f":"IF(Outils!E99=\"Au Chantier\",Outils!C99,\"\")","v":""},{"$f":"IF(Outils!E99=\"Au Chantier\",Outils!D99,\"\")","v":""},{"$f":"IF(Outils!E99=\"Au Chantier\",Outils!E99,\"\")","v":""},{"$f":"IF(Outils!E99=\"Au Chantier\",Outils!F99,\"\")","v":""},{"$f":"IF(Outils!E99=\"Au Chantier\",Outils!G99,\"\")","v":""}]
[{"$f":"IF(Outils!E100=\"Au Chantier\",Outils!A100,\"\")","v":""},{"$f":"IF(Outils!E100=\"Au Chantier\",Outils!B100,\"\")","v":""},{"$f":"IF(Outils!E100=\"Au Chantier\",Outils!C100,\"\")","v":""},{"$f":"IF(Outils!E100=\"Au Chantier\",Outils!D100,\"\")","v":""},{"$f":"IF(Outils!E100=\"Au Chantier\",Outils!E100,\"\")","v":""},{"$f":"IF(Outils!E100=\"Au Chantier\",Outils!F100,\"\")","v":""},{"$f":"IF(Outils!E100=\"Au Chantier\",Outils!G100,\"\")","v":""}]
[{"$f":"IF(Outils!E101=\"Au Chantier\",Outils!A101,\"\")","v":""},{"$f":"IF(Outils!E101=\"Au Chantier\",Outils!B101,\"\")","v":""},{"$f":"IF(Outils!E101=\"Au Chantier\",Outils!C101,\"\")","v":""},{"$f":"IF(Outils!E101=\"Au Chantier\",Outils!D101,\"\")","v":""},{"$f":"IF(Outils!E101=\"Au Chantier\",Outils!E101,\"\")","v":""},{"$f":"IF(Outils!E101=\"Au Chantier\",Outils!F101,\"\")","v":""},{"$f":"IF(Outils!E101=\"Au Chantier\",Outils!G101,\"\")","v":""}]
[{"$f":"IF(Outils!E102=\"Au Chantier\",Outils!A102,\"\")","v":""},{"$f":"IF(Outils!E102=\"Au Chantier\",Outils!B102,\"\")","v":""},{"$f":"IF(Outils!E102=\"Au Chantier\",Outils!C102,\"\")","v":""},{"$f":"IF(Outils!E102=\"Au Chantier\",Outils!D102,\"\")","v":""},{"$f":"IF(Outils!E102=\"Au Chantier\",Outils!E102,\"\")","v":""},{"$f":"IF(Outils!E102=\"Au Chantier\",Outils!F102,\"\")","v":""},{"$f":"IF(Outils!E102=\"Au Chantier\",Outils!G102,\"\")","v":""}]

{"sheet":"Réparation-Calibration","index":2,"n_rows":100,"n_cols":7,"rows_kept":100,"cut":false,"hidden":false,"merged":[]}
["Département","Identifiant Unique","Description Outil","# Série","État","Calibration Due Date","#Projet du lieu de l'item"]
[{"$f":"IF(Outils!E4=\"En Réparation/Calibration\",Outils!A4,\"\")","v":""},{"$f":"IF(Outils!E4=\"En Réparation/Calibration\",Outils!B4,\"\")","v":""},{"$f":"IF(Outils!E4=\"En Réparation/Calibration\",Outils!C4,\"\")","v":""},{"$f":"IF(Outils!E4=\"En Réparation/Calibration\",Outils!D4,\"\")","v":""},{"$f":"IF(Outils!E4=\"En Réparation/Calibration\",Outils!E4,\"\")","v":""},{"$f":"IF(Outils!E4=\"En Réparation/Calibration\",Outils!F4,\"\")","v":""},{"$f":"IF(Outils!E4=\"En Réparation/Calibration\",Outils!G4,\"\")","v":""}]
[{"$f":"IF(Outils!E5=\"En Réparation/Calibration\",Outils!A5,\"\")","v":""},{"$f":"IF(Outils!E5=\"En Réparation/Calibration\",Outils!B5,\"\")","v":""},{"$f":"IF(Outils!E5=\"En Réparation/Calibration\",Outils!C5,\"\")","v":""},{"$f":"IF(Outils!E5=\"En Réparation/Calibration\",Outils!D5,\"\")","v":""},{"$f":"IF(Outils!E5=\"En Réparation/Calibration\",Outils!E5,\"\")","v":""},{"$f":"IF(Outils!E5=\"En Réparation/Calibration\",Outils!F5,\"\")","v":""},{"$f":"IF(Outils!E5=\"En Réparation/Calibration\",Outils!G5,\"\")","v":""}]
[{"$f":"IF(Outils!E6=\"En Réparation/Calibration\",Outils!A6,\"\")","v":""},{"$f":"IF(Outils!E6=\"En Réparation/Calibration\",Outils!B6,\"\")","v":""},{"$f":"IF(Outils!E6=\"En Réparation/Calibration\",Outils!C6,\"\")","v":""},{"$f":"IF(Outils!E6=\"En Réparation/Calibration\",Outils!D6,\"\")","v":""},{"$f":"IF(Outils!E6=\"En Réparation/Calibration\",Outils!E6,\"\")","v":""},{"$f":"IF(Outils!E6=\"En Réparation/Calibration\",Outils!F6,\"\")","v":""},{"$f":"IF(Outils!E6=\"En Réparation/Calibration\",Outils!G6,\"\")","v":""}]
[{"$f":"IF(Outils!E7=\"En Réparation/Calibration\",Outils!A7,\"\")","v":""},{"$f":"IF(Outils!E7=\"En Réparation/Calibration\",Outils!B7,\"\")","v":""},{"$f":"IF(Outils!E7=\"En Réparation/Calibration\",Outils!C7,\"\")","v":""},{"$f":"IF(Outils!E7=\"En Réparation/Calibration\",Outils!D7,\"\")","v":""},{"$f":"IF(Outils!E7=\"En Réparation/Calibration\",Outils!E7,\"\")","v":""},{"$f":"IF(Outils!E7=\"En Réparation/Calibration\",Outils!F7,\"\")","v":""},{"$f":"IF(Outils!E7=\"En Réparation/Calibration\",Outils!G7,\"\")","v":""}]
[{"$f":"IF(Outils!E8=\"En Réparation/Calibration\",Outils!A8,\"\")","v":""},{"$f":"IF(Outils!E8=\"En Réparation/Calibration\",Outils!B8,\"\")","v":""},{"$f":"IF(Outils!E8=\"En Réparation/Calibration\",Outils!C8,\"\")","v":""},{"$f":"IF(Outils!E8=\"En Réparation/Calibration\",Outils!D8,\"\")","v":""},{"$f":"IF(Outils!E8=\"En Réparation/Calibration\",Outils!E8,\"\")","v":""},{"$f":"IF(Outils!E8=\"En Réparation/Calibration\",Outils!F8,\"\")","v":""},{"$f":"IF(Outils!E8=\"En Réparation/Calibration\",Outils!G8,\"\")","v":""}]
[{"$f":"IF(Outils!E9=\"En Réparation/Calibration\",Outils!A9,\"\")","v":""},{"$f":"IF(Outils!E9=\"En Réparation/Calibration\",Outils!B9,\"\")","v":""},{"$f":"IF(Outils!E9=\"En Réparation/Calibration\",Outils!C9,\"\")","v":""},{"$f":"IF(Outils!E9=\"En Réparation/Calibration\",Outils!D9,\"\")","v":""},{"$f":"IF(Outils!E9=\"En Réparation/Calibration\",Outils!E9,\"\")","v":""},{"$f":"IF(Outils!E9=\"En Réparation/Calibration\",Outils!F9,\"\")","v":""},{"$f":"IF(Outils!E9=\"En Réparation/Calibration\",Outils!G9,\"\")","v":""}]
[{"$f":"IF(Outils!E10=\"En Réparation/Calibration\",Outils!A10,\"\")","v":""},{"$f":"IF(Outils!E10=\"En Réparation/Calibration\",Outils!B10,\"\")","v":""},{"$f":"IF(Outils!E10=\"En Réparation/Calibration\",Outils!C10,\"\")","v":""},{"$f":"IF(Outils!E10=\"En Réparation/Calibration\",Outils!D10,\"\")","v":""},{"$f":"IF(Outils!E10=\"En Réparation/Calibration\",Outils!E10,\"\")","v":""},{"$f":"IF(Outils!E10=\"En Réparation/Calibration\",Outils!F10,\"\")","v":""},{"$f":"IF(Outils!E10=\"En Réparation/Calibration\",Outils!G10,\"\")","v":""}]
[{"$f":"IF(Outils!E11=\"En Réparation/Calibration\",Outils!A11,\"\")","v":""},{"$f":"IF(Outils!E11=\"En Réparation/Calibration\",Outils!B11,\"\")","v":""},{"$f":"IF(Outils!E11=\"En Réparation/Calibration\",Outils!C11,\"\")","v":""},{"$f":"IF(Outils!E11=\"En Réparation/Calibration\",Outils!D11,\"\")","v":""},{"$f":"IF(Outils!E11=\"En Réparation/Calibration\",Outils!E11,\"\")","v":""},{"$f":"IF(Outils!E11=\"En Réparation/Calibration\",Outils!F11,\"\")","v":""},{"$f":"IF(Outils!E11=\"En Réparation/Calibration\",Outils!G11,\"\")","v":""}]
[{"$f":"IF(Outils!E12=\"En Réparation/Calibration\",Outils!A12,\"\")","v":""},{"$f":"IF(Outils!E12=\"En Réparation/Calibration\",Outils!B12,\"\")","v":""},{"$f":"IF(Outils!E12=\"En Réparation/Calibration\",Outils!C12,\"\")","v":""},{"$f":"IF(Outils!E12=\"En Réparation/Calibration\",Outils!D12,\"\")","v":""},{"$f":"IF(Outils!E12=\"En Réparation/Calibration\",Outils!E12,\"\")","v":""},{"$f":"IF(Outils!E12=\"En Réparation/Calibration\",Outils!F12,\"\")","v":""},{"$f":"IF(Outils!E12=\"En Réparation/Calibration\",Outils!G12,\"\")","v":""}]
[{"$f":"IF(Outils!E13=\"En Réparation/Calibration\",Outils!A13,\"\")","v":""},{"$f":"IF(Outils!E13=\"En Réparation/Calibration\",Outils!B13,\"\")","v":""},{"$f":"IF(Outils!E13=\"En Réparation/Calibration\",Outils!C13,\"\")","v":""},{"$f":"IF(Outils!E13=\"En Réparation/Calibration\",Outils!D13,\"\")","v":""},{"$f":"IF(Outils!E13=\"En Réparation/Calibration\",Outils!E13,\"\")","v":""},{"$f":"IF(Outils!E13=\"En Réparation/Calibration\",Outils!F13,\"\")","v":""},{"$f":"IF(Outils!E13=\"En Réparation/Calibration\",Outils!G13,\"\")","v":""}]
[{"$f":"IF(Outils!E14=\"En Réparation/Calibration\",Outils!A14,\"\")","v":""},{"$f":"IF(Outils!E14=\"En Réparation/Calibration\",Outils!B14,\"\")","v":""},{"$f":"IF(Outils!E14=\"En Réparation/Calibration\",Outils!C14,\"\")","v":""},{"$f":"IF(Outils!E14=\"En Réparation/Calibration\",Outils!D14,\"\")","v":""},{"$f":"IF(Outils!E14=\"En Réparation/Calibration\",Outils!E14,\"\")","v":""},{"$f":"IF(Outils!E14=\"En Réparation/Calibration\",Outils!F14,\"\")","v":""},{"$f":"IF(Outils!E14=\"En Réparation/Calibration\",Outils!G14,\"\")","v":""}]
[{"$f":"IF(Outils!E15=\"En Réparation/Calibration\",Outils!A15,\"\")","v":""},{"$f":"IF(Outils!E15=\"En Réparation/Calibration\",Outils!B15,\"\")","v":""},{"$f":"IF(Outils!E15=\"En Réparation/Calibration\",Outils!C15,\"\")","v":""},{"$f":"IF(Outils!E15=\"En Réparation/Calibration\",Outils!D15,\"\")","v":""},{"$f":"IF(Outils!E15=\"En Réparation/Calibration\",Outils!E15,\"\")","v":""},{"$f":"IF(Outils!E15=\"En Réparation/Calibration\",Outils!F15,\"\")","v":""},{"$f":"IF(Outils!E15=\"En Réparation/Calibration\",Outils!G15,\"\")","v":""}]
[{"$f":"IF(Outils!E16=\"En Réparation/Calibration\",Outils!A16,\"\")","v":""},{"$f":"IF(Outils!E16=\"En Réparation/Calibration\",Outils!B16,\"\")","v":""},{"$f":"IF(Outils!E16=\"En Réparation/Calibration\",Outils!C16,\"\")","v":""},{"$f":"IF(Outils!E16=\"En Réparation/Calibration\",Outils!D16,\"\")","v":""},{"$f":"IF(Outils!E16=\"En Réparation/Calibration\",Outils!E16,\"\")","v":""},{"$f":"IF(Outils!E16=\"En Réparation/Calibration\",Outils!F16,\"\")","v":""},{"$f":"IF(Outils!E16=\"En Réparation/Calibration\",Outils!G16,\"\")","v":""}]
[{"$f":"IF(Outils!E17=\"En Réparation/Calibration\",Outils!A17,\"\")","v":""},{"$f":"IF(Outils!E17=\"En Réparation/Calibration\",Outils!B17,\"\")","v":""},{"$f":"IF(Outils!E17=\"En Réparation/Calibration\",Outils!C17,\"\")","v":""},{"$f":"IF(Outils!E17=\"En Réparation/Calibration\",Outils!D17,\"\")","v":""},{"$f":"IF(Outils!E17=\"En Réparation/Calibration\",Outils!E17,\"\")","v":""},{"$f":"IF(Outils!E17=\"En Réparation/Calibration\",Outils!F17,\"\")","v":""},{"$f":"IF(Outils!E17=\"En Réparation/Calibration\",Outils!G17,\"\")","v":""}]
[{"$f":"IF(Outils!E18=\"En Réparation/Calibration\",Outils!A18,\"\")","v":""},{"$f":"IF(Outils!E18=\"En Réparation/Calibration\",Outils!B18,\"\")","v":""},{"$f":"IF(Outils!E18=\"En Réparation/Calibration\",Outils!C18,\"\")","v":""},{"$f":"IF(Outils!E18=\"En Réparation/Calibration\",Outils!D18,\"\")","v":""},{"$f":"IF(Outils!E18=\"En Réparation/Calibration\",Outils!E18,\"\")","v":""},{"$f":"IF(Outils!E18=\"En Réparation/Calibration\",Outils!F18,\"\")","v":""},{"$f":"IF(Outils!E18=\"En Réparation/Calibration\",Outils!G18,\"\")","v":""}]
[{"$f":"IF(Outils!E19=\"En Réparation/Calibration\",Outils!A19,\"\")","v":""},{"$f":"IF(Outils!E19=\"En Réparation/Calibration\",Outils!B19,\"\")","v":""},{"$f":"IF(Outils!E19=\"En Réparation/Calibration\",Outils!C19,\"\")","v":""},{"$f":"IF(Outils!E19=\"En Réparation/Calibration\",Outils!D19,\"\")","v":""},{"$f":"IF(Outils!E19=\"En Réparation/Calibration\",Outils!E19,\"\")","v":""},{"$f":"IF(Outils!E19=\"En Réparation/Calibration\",Outils!F19,\"\")","v":""},{"$f":"IF(Outils!E19=\"En Réparation/Calibration\",Outils!G19,\"\")","v":""}]
[{"$f":"IF(Outils!E20=\"En Réparation/Calibration\",Outils!A20,\"\")","v":""},{"$f":"IF(Outils!E20=\"En Réparation/Calibration\",Outils!B20,\"\")","v":""},{"$f":"IF(Outils!E20=\"En Réparation/Calibration\",Outils!C20,\"\")","v":""},{"$f":"IF(Outils!E20=\"En Réparation/Calibration\",Outils!D20,\"\")","v":""},{"$f":"IF(Outils!E20=\"En Réparation/Calibration\",Outils!E20,\"\")","v":""},{"$f":"IF(Outils!E20=\"En Réparation/Calibration\",Outils!F20,\"\")","v":""},{"$f":"IF(Outils!E20=\"En Réparation/Calibration\",Outils!G20,\"\")","v":""}]
[{"$f":"IF(Outils!E21=\"En Réparation/Calibration\",Outils!A21,\"\")","v":""},{"$f":"IF(Outils!E21=\"En Réparation/Calibration\",Outils!B21,\"\")","v":""},{"$f":"IF(Outils!E21=\"En Réparation/Calibration\",Outils!C21,\"\")","v":""},{"$f":"IF(Outils!E21=\"En Réparation/Calibration\",Outils!D21,\"\")","v":""},{"$f":"IF(Outils!E21=\"En Réparation/Calibration\",Outils!E21,\"\")","v":""},{"$f":"IF(Outils!E21=\"En Réparation/Calibration\",Outils!F21,\"\")","v":""},{"$f":"IF(Outils!E21=\"En Réparation/Calibration\",Outils!G21,\"\")","v":""}]
[{"$f":"IF(Outils!E22=\"En Réparation/Calibration\",Outils!A22,\"\")","v":""},{"$f":"IF(Outils!E22=\"En Réparation/Calibration\",Outils!B22,\"\")","v":""},{"$f":"IF(Outils!E22=\"En Réparation/Calibration\",Outils!C22,\"\")","v":""},{"$f":"IF(Outils!E22=\"En Réparation/Calibration\",Outils!D22,\"\")","v":""},{"$f":"IF(Outils!E22=\"En Réparation/Calibration\",Outils!E22,\"\")","v":""},{"$f":"IF(Outils!E22=\"En Réparation/Calibration\",Outils!F22,\"\")","v":""},{"$f":"IF(Outils!E22=\"En Réparation/Calibration\",Outils!G22,\"\")","v":""}]
[{"$f":"IF(Outils!E23=\"En Réparation/Calibration\",Outils!A23,\"\")","v":""},{"$f":"IF(Outils!E23=\"En Réparation/Calibration\",Outils!B23,\"\")","v":""},{"$f":"IF(Outils!E23=\"En Réparation/Calibration\",Outils!C23,\"\")","v":""},{"$f":"IF(Outils!E23=\"En Réparation/Calibration\",Outils!D23,\"\")","v":""},{"$f":"IF(Outils!E23=\"En Réparation/Calibration\",Outils!E23,\"\")","v":""},{"$f":"IF(Outils!E23=\"En Réparation/Calibration\",Outils!F23,\"\")","v":""},{"$f":"IF(Outils!E23=\"En Réparation/Calibration\",Outils!G23,\"\")","v":""}]
[{"$f":"IF(Outils!E24=\"En Réparation/Calibration\",Outils!A24,\"\")","v":""},{"$f":"IF(Outils!E24=\"En Réparation/Calibration\",Outils!B24,\"\")","v":""},{"$f":"IF(Outils!E24=\"En Réparation/Calibration\",Outils!C24,\"\")","v":""},{"$f":"IF(Outils!E24=\"En Réparation/Calibration\",Outils!D24,\"\")","v":""},{"$f":"IF(Outils!E24=\"En Réparation/Calibration\",Outils!E24,\"\")","v":""},{"$f":"IF(Outils!E24=\"En Réparation/Calibration\",Outils!F24,\"\")","v":""},{"$f":"IF(Outils!E24=\"En Réparation/Calibration\",Outils!G24,\"\")","v":""}]
[{"$f":"IF(Outils!E25=\"En Réparation/Calibration\",Outils!A25,\"\")","v":""},{"$f":"IF(Outils!E25=\"En Réparation/Calibration\",Outils!B25,\"\")","v":""},{"$f":"IF(Outils!E25=\"En Réparation/Calibration\",Outils!C25,\"\")","v":""},{"$f":"IF(Outils!E25=\"En Réparation/Calibration\",Outils!D25,\"\")","v":""},{"$f":"IF(Outils!E25=\"En Réparation/Calibration\",Outils!E25,\"\")","v":""},{"$f":"IF(Outils!E25=\"En Réparation/Calibration\",Outils!F25,\"\")","v":""},{"$f":"IF(Outils!E25=\"En Réparation/Calibration\",Outils!G25,\"\")","v":""}]
[{"$f":"IF(Outils!E26=\"En Réparation/Calibration\",Outils!A26,\"\")","v":""},{"$f":"IF(Outils!E26=\"En Réparation/Calibration\",Outils!B26,\"\")","v":""},{"$f":"IF(Outils!E26=\"En Réparation/Calibration\",Outils!C26,\"\")","v":""},{"$f":"IF(Outils!E26=\"En Réparation/Calibration\",Outils!D26,\"\")","v":""},{"$f":"IF(Outils!E26=\"En Réparation/Calibration\",Outils!E26,\"\")","v":""},{"$f":"IF(Outils!E26=\"En Réparation/Calibration\",Outils!F26,\"\")","v":""},{"$f":"IF(Outils!E26=\"En Réparation/Calibration\",Outils!G26,\"\")","v":""}]
[{"$f":"IF(Outils!E27=\"En Réparation/Calibration\",Outils!A27,\"\")","v":""},{"$f":"IF(Outils!E27=\"En Réparation/Calibration\",Outils!B27,\"\")","v":""},{"$f":"IF(Outils!E27=\"En Réparation/Calibration\",Outils!C27,\"\")","v":""},{"$f":"IF(Outils!E27=\"En Réparation/Calibration\",Outils!D27,\"\")","v":""},{"$f":"IF(Outils!E27=\"En Réparation/Calibration\",Outils!E27,\"\")","v":""},{"$f":"IF(Outils!E27=\"En Réparation/Calibration\",Outils!F27,\"\")","v":""},{"$f":"IF(Outils!E27=\"En Réparation/Calibration\",Outils!G27,\"\")","v":""}]
[{"$f":"IF(Outils!E28=\"En Réparation/Calibration\",Outils!A28,\"\")","v":""},{"$f":"IF(Outils!E28=\"En Réparation/Calibration\",Outils!B28,\"\")","v":""},{"$f":"IF(Outils!E28=\"En Réparation/Calibration\",Outils!C28,\"\")","v":""},{"$f":"IF(Outils!E28=\"En Réparation/Calibration\",Outils!D28,\"\")","v":""},{"$f":"IF(Outils!E28=\"En Réparation/Calibration\",Outils!E28,\"\")","v":""},{"$f":"IF(Outils!E28=\"En Réparation/Calibration\",Outils!F28,\"\")","v":""},{"$f":"IF(Outils!E28=\"En Réparation/Calibration\",Outils!G28,\"\")","v":""}]
[{"$f":"IF(Outils!E29=\"En Réparation/Calibration\",Outils!A29,\"\")","v":""},{"$f":"IF(Outils!E29=\"En Réparation/Calibration\",Outils!B29,\"\")","v":""},{"$f":"IF(Outils!E29=\"En Réparation/Calibration\",Outils!C29,\"\")","v":""},{"$f":"IF(Outils!E29=\"En Réparation/Calibration\",Outils!D29,\"\")","v":""},{"$f":"IF(Outils!E29=\"En Réparation/Calibration\",Outils!E29,\"\")","v":""},{"$f":"IF(Outils!E29=\"En Réparation/Calibration\",Outils!F29,\"\")","v":""},{"$f":"IF(Outils!E29=\"En Réparation/Calibration\",Outils!G29,\"\")","v":""}]
[{"$f":"IF(Outils!E30=\"En Réparation/Calibration\",Outils!A30,\"\")","v":""},{"$f":"IF(Outils!E30=\"En Réparation/Calibration\",Outils!B30,\"\")","v":""},{"$f":"IF(Outils!E30=\"En Réparation/Calibration\",Outils!C30,\"\")","v":""},{"$f":"IF(Outils!E30=\"En Réparation/Calibration\",Outils!D30,\"\")","v":""},{"$f":"IF(Outils!E30=\"En Réparation/Calibration\",Outils!E30,\"\")","v":""},{"$f":"IF(Outils!E30=\"En Réparation/Calibration\",Outils!F30,\"\")","v":""},{"$f":"IF(Outils!E30=\"En Réparation/Calibration\",Outils!G30,\"\")","v":""}]
[{"$f":"IF(Outils!E31=\"En Réparation/Calibration\",Outils!A31,\"\")","v":""},{"$f":"IF(Outils!E31=\"En Réparation/Calibration\",Outils!B31,\"\")","v":""},{"$f":"IF(Outils!E31=\"En Réparation/Calibration\",Outils!C31,\"\")","v":""},{"$f":"IF(Outils!E31=\"En Réparation/Calibration\",Outils!D31,\"\")","v":""},{"$f":"IF(Outils!E31=\"En Réparation/Calibration\",Outils!E31,\"\")","v":""},{"$f":"IF(Outils!E31=\"En Réparation/Calibration\",Outils!F31,\"\")","v":""},{"$f":"IF(Outils!E31=\"En Réparation/Calibration\",Outils!G31,\"\")","v":""}]
[{"$f":"IF(Outils!E32=\"En Réparation/Calibration\",Outils!A32,\"\")","v":""},{"$f":"IF(Outils!E32=\"En Réparation/Calibration\",Outils!B32,\"\")","v":""},{"$f":"IF(Outils!E32=\"En Réparation/Calibration\",Outils!C32,\"\")","v":""},{"$f":"IF(Outils!E32=\"En Réparation/Calibration\",Outils!D32,\"\")","v":""},{"$f":"IF(Outils!E32=\"En Réparation/Calibration\",Outils!E32,\"\")","v":""},{"$f":"IF(Outils!E32=\"En Réparation/Calibration\",Outils!F32,\"\")","v":""},{"$f":"IF(Outils!E32=\"En Réparation/Calibration\",Outils!G32,\"\")","v":""}]
[{"$f":"IF(Outils!E33=\"En Réparation/Calibration\",Outils!A33,\"\")","v":""},{"$f":"IF(Outils!E33=\"En Réparation/Calibration\",Outils!B33,\"\")","v":""},{"$f":"IF(Outils!E33=\"En Réparation/Calibration\",Outils!C33,\"\")","v":""},{"$f":"IF(Outils!E33=\"En Réparation/Calibration\",Outils!D33,\"\")","v":""},{"$f":"IF(Outils!E33=\"En Réparation/Calibration\",Outils!E33,\"\")","v":""},{"$f":"IF(Outils!E33=\"En Réparation/Calibration\",Outils!F33,\"\")","v":""},{"$f":"IF(Outils!E33=\"En Réparation/Calibration\",Outils!G33,\"\")","v":""}]
[{"$f":"IF(Outils!E34=\"En Réparation/Calibration\",Outils!A34,\"\")","v":""},{"$f":"IF(Outils!E34=\"En Réparation/Calibration\",Outils!B34,\"\")","v":""},{"$f":"IF(Outils!E34=\"En Réparation/Calibration\",Outils!C34,\"\")","v":""},{"$f":"IF(Outils!E34=\"En Réparation/Calibration\",Outils!D34,\"\")","v":""},{"$f":"IF(Outils!E34=\"En Réparation/Calibration\",Outils!E34,\"\")","v":""},{"$f":"IF(Outils!E34=\"En Réparation/Calibration\",Outils!F34,\"\")","v":""},{"$f":"IF(Outils!E34=\"En Réparation/Calibration\",Outils!G34,\"\")","v":""}]
[{"$f":"IF(Outils!E35=\"En Réparation/Calibration\",Outils!A35,\"\")","v":""},{"$f":"IF(Outils!E35=\"En Réparation/Calibration\",Outils!B35,\"\")","v":""},{"$f":"IF(Outils!E35=\"En Réparation/Calibration\",Outils!C35,\"\")","v":""},{"$f":"IF(Outils!E35=\"En Réparation/Calibration\",Outils!D35,\"\")","v":""},{"$f":"IF(Outils!E35=\"En Réparation/Calibration\",Outils!E35,\"\")","v":""},{"$f":"IF(Outils!E35=\"En Réparation/Calibration\",Outils!F35,\"\")","v":""},{"$f":"IF(Outils!E35=\"En Réparation/Calibration\",Outils!G35,\"\")","v":""}]
[{"$f":"IF(Outils!E36=\"En Réparation/Calibration\",Outils!A36,\"\")","v":""},{"$f":"IF(Outils!E36=\"En Réparation/Calibration\",Outils!B36,\"\")","v":""},{"$f":"IF(Outils!E36=\"En Réparation/Calibration\",Outils!C36,\"\")","v":""},{"$f":"IF(Outils!E36=\"En Réparation/Calibration\",Outils!D36,\"\")","v":""},{"$f":"IF(Outils!E36=\"En Réparation/Calibration\",Outils!E36,\"\")","v":""},{"$f":"IF(Outils!E36=\"En Réparation/Calibration\",Outils!F36,\"\")","v":""},{"$f":"IF(Outils!E36=\"En Réparation/Calibration\",Outils!G36,\"\")","v":""}]
[{"$f":"IF(Outils!E37=\"En Réparation/Calibration\",Outils!A37,\"\")","v":""},{"$f":"IF(Outils!E37=\"En Réparation/Calibration\",Outils!B37,\"\")","v":""},{"$f":"IF(Outils!E37=\"En Réparation/Calibration\",Outils!C37,\"\")","v":""},{"$f":"IF(Outils!E37=\"En Réparation/Calibration\",Outils!D37,\"\")","v":""},{"$f":"IF(Outils!E37=\"En Réparation/Calibration\",Outils!E37,\"\")","v":""},{"$f":"IF(Outils!E37=\"En Réparation/Calibration\",Outils!F37,\"\")","v":""},{"$f":"IF(Outils!E37=\"En Réparation/Calibration\",Outils!G37,\"\")","v":""}]
[{"$f":"IF(Outils!E38=\"En Réparation/Calibration\",Outils!A38,\"\")","v":""},{"$f":"IF(Outils!E38=\"En Réparation/Calibration\",Outils!B38,\"\")","v":""},{"$f":"IF(Outils!E38=\"En Réparation/Calibration\",Outils!C38,\"\")","v":""},{"$f":"IF(Outils!E38=\"En Réparation/Calibration\",Outils!D38,\"\")","v":""},{"$f":"IF(Outils!E38=\"En Réparation/Calibration\",Outils!E38,\"\")","v":""},{"$f":"IF(Outils!E38=\"En Réparation/Calibration\",Outils!F38,\"\")","v":""},{"$f":"IF(Outils!E38=\"En Réparation/Calibration\",Outils!G38,\"\")","v":""}]
[{"$f":"IF(Outils!E39=\"En Réparation/Calibration\",Outils!A39,\"\")","v":""},{"$f":"IF(Outils!E39=\"En Réparation/Calibration\",Outils!B39,\"\")","v":""},{"$f":"IF(Outils!E39=\"En Réparation/Calibration\",Outils!C39,\"\")","v":""},{"$f":"IF(Outils!E39=\"En Réparation/Calibration\",Outils!D39,\"\")","v":""},{"$f":"IF(Outils!E39=\"En Réparation/Calibration\",Outils!E39,\"\")","v":""},{"$f":"IF(Outils!E39=\"En Réparation/Calibration\",Outils!F39,\"\")","v":""},{"$f":"IF(Outils!E39=\"En Réparation/Calibration\",Outils!G39,\"\")","v":""}]
[{"$f":"IF(Outils!E40=\"En Réparation/Calibration\",Outils!A40,\"\")","v":""},{"$f":"IF(Outils!E40=\"En Réparation/Calibration\",Outils!B40,\"\")","v":""},{"$f":"IF(Outils!E40=\"En Réparation/Calibration\",Outils!C40,\"\")","v":""},{"$f":"IF(Outils!E40=\"En Réparation/Calibration\",Outils!D40,\"\")","v":""},{"$f":"IF(Outils!E40=\"En Réparation/Calibration\",Outils!E40,\"\")","v":""},{"$f":"IF(Outils!E40=\"En Réparation/Calibration\",Outils!F40,\"\")","v":""},{"$f":"IF(Outils!E40=\"En Réparation/Calibration\",Outils!G40,\"\")","v":""}]
[{"$f":"IF(Outils!E41=\"En Réparation/Calibration\",Outils!A41,\"\")","v":""},{"$f":"IF(Outils!E41=\"En Réparation/Calibration\",Outils!B41,\"\")","v":""},{"$f":"IF(Outils!E41=\"En Réparation/Calibration\",Outils!C41,\"\")","v":""},{"$f":"IF(Outils!E41=\"En Réparation/Calibration\",Outils!D41,\"\")","v":""},{"$f":"IF(Outils!E41=\"En Réparation/Calibration\",Outils!E41,\"\")","v":""},{"$f":"IF(Outils!E41=\"En Réparation/Calibration\",Outils!F41,\"\")","v":""},{"$f":"IF(Outils!E41=\"En Réparation/Calibration\",Outils!G41,\"\")","v":""}]
[{"$f":"IF(Outils!E42=\"En Réparation/Calibration\",Outils!A42,\"\")","v":""},{"$f":"IF(Outils!E42=\"En Réparation/Calibration\",Outils!B42,\"\")","v":""},{"$f":"IF(Outils!E42=\"En Réparation/Calibration\",Outils!C42,\"\")","v":""},{"$f":"IF(Outils!E42=\"En Réparation/Calibration\",Outils!D42,\"\")","v":""},{"$f":"IF(Outils!E42=\"En Réparation/Calibration\",Outils!E42,\"\")","v":""},{"$f":"IF(Outils!E42=\"En Réparation/Calibration\",Outils!F42,\"\")","v":""},{"$f":"IF(Outils!E42=\"En Réparation/Calibration\",Outils!G42,\"\")","v":""}]
[{"$f":"IF(Outils!E43=\"En Réparation/Calibration\",Outils!A43,\"\")","v":""},{"$f":"IF(Outils!E43=\"En Réparation/Calibration\",Outils!B43,\"\")","v":""},{"$f":"IF(Outils!E43=\"En Réparation/Calibration\",Outils!C43,\"\")","v":""},{"$f":"IF(Outils!E43=\"En Réparation/Calibration\",Outils!D43,\"\")","v":""},{"$f":"IF(Outils!E43=\"En Réparation/Calibration\",Outils!E43,\"\")","v":""},{"$f":"IF(Outils!E43=\"En Réparation/Calibration\",Outils!F43,\"\")","v":""},{"$f":"IF(Outils!E43=\"En Réparation/Calibration\",Outils!G43,\"\")","v":""}]
[{"$f":"IF(Outils!E44=\"En Réparation/Calibration\",Outils!A44,\"\")","v":""},{"$f":"IF(Outils!E44=\"En Réparation/Calibration\",Outils!B44,\"\")","v":""},{"$f":"IF(Outils!E44=\"En Réparation/Calibration\",Outils!C44,\"\")","v":""},{"$f":"IF(Outils!E44=\"En Réparation/Calibration\",Outils!D44,\"\")","v":""},{"$f":"IF(Outils!E44=\"En Réparation/Calibration\",Outils!E44,\"\")","v":""},{"$f":"IF(Outils!E44=\"En Réparation/Calibration\",Outils!F44,\"\")","v":""},{"$f":"IF(Outils!E44=\"En Réparation/Calibration\",Outils!G44,\"\")","v":""}]
[{"$f":"IF(Outils!E45=\"En Réparation/Calibration\",Outils!A45,\"\")","v":""},{"$f":"IF(Outils!E45=\"En Réparation/Calibration\",Outils!B45,\"\")","v":""},{"$f":"IF(Outils!E45=\"En Réparation/Calibration\",Outils!C45,\"\")","v":""},{"$f":"IF(Outils!E45=\"En Réparation/Calibration\",Outils!D45,\"\")","v":""},{"$f":"IF(Outils!E45=\"En Réparation/Calibration\",Outils!E45,\"\")","v":""},{"$f":"IF(Outils!E45=\"En Réparation/Calibration\",Outils!F45,\"\")","v":""},{"$f":"IF(Outils!E45=\"En Réparation/Calibration\",Outils!G45,\"\")","v":""}]
[{"$f":"IF(Outils!E46=\"En Réparation/Calibration\",Outils!A46,\"\")","v":""},{"$f":"IF(Outils!E46=\"En Réparation/Calibration\",Outils!B46,\"\")","v":""},{"$f":"IF(Outils!E46=\"En Réparation/Calibration\",Outils!C46,\"\")","v":""},{"$f":"IF(Outils!E46=\"En Réparation/Calibration\",Outils!D46,\"\")","v":""},{"$f":"IF(Outils!E46=\"En Réparation/Calibration\",Outils!E46,\"\")","v":""},{"$f":"IF(Outils!E46=\"En Réparation/Calibration\",Outils!F46,\"\")","v":""},{"$f":"IF(Outils!E46=\"En Réparation/Calibration\",Outils!G46,\"\")","v":""}]
[{"$f":"IF(Outils!E47=\"En Réparation/Calibration\",Outils!A47,\"\")","v":""},{"$f":"IF(Outils!E47=\"En Réparation/Calibration\",Outils!B47,\"\")","v":""},{"$f":"IF(Outils!E47=\"En Réparation/Calibration\",Outils!C47,\"\")","v":""},{"$f":"IF(Outils!E47=\"En Réparation/Calibration\",Outils!D47,\"\")","v":""},{"$f":"IF(Outils!E47=\"En Réparation/Calibration\",Outils!E47,\"\")","v":""},{"$f":"IF(Outils!E47=\"En Réparation/Calibration\",Outils!F47,\"\")","v":""},{"$f":"IF(Outils!E47=\"En Réparation/Calibration\",Outils!G47,\"\")","v":""}]
[{"$f":"IF(Outils!E48=\"En Réparation/Calibration\",Outils!A48,\"\")","v":""},{"$f":"IF(Outils!E48=\"En Réparation/Calibration\",Outils!B48,\"\")","v":""},{"$f":"IF(Outils!E48=\"En Réparation/Calibration\",Outils!C48,\"\")","v":""},{"$f":"IF(Outils!E48=\"En Réparation/Calibration\",Outils!D48,\"\")","v":""},{"$f":"IF(Outils!E48=\"En Réparation/Calibration\",Outils!E48,\"\")","v":""},{"$f":"IF(Outils!E48=\"En Réparation/Calibration\",Outils!F48,\"\")","v":""},{"$f":"IF(Outils!E48=\"En Réparation/Calibration\",Outils!G48,\"\")","v":""}]
[{"$f":"IF(Outils!E49=\"En Réparation/Calibration\",Outils!A49,\"\")","v":""},{"$f":"IF(Outils!E49=\"En Réparation/Calibration\",Outils!B49,\"\")","v":""},{"$f":"IF(Outils!E49=\"En Réparation/Calibration\",Outils!C49,\"\")","v":""},{"$f":"IF(Outils!E49=\"En Réparation/Calibration\",Outils!D49,\"\")","v":""},{"$f":"IF(Outils!E49=\"En Réparation/Calibration\",Outils!E49,\"\")","v":""},{"$f":"IF(Outils!E49=\"En Réparation/Calibration\",Outils!F49,\"\")","v":""},{"$f":"IF(Outils!E49=\"En Réparation/Calibration\",Outils!G49,\"\")","v":""}]
[{"$f":"IF(Outils!E50=\"En Réparation/Calibration\",Outils!A50,\"\")","v":""},{"$f":"IF(Outils!E50=\"En Réparation/Calibration\",Outils!B50,\"\")","v":""},{"$f":"IF(Outils!E50=\"En Réparation/Calibration\",Outils!C50,\"\")","v":""},{"$f":"IF(Outils!E50=\"En Réparation/Calibration\",Outils!D50,\"\")","v":""},{"$f":"IF(Outils!E50=\"En Réparation/Calibration\",Outils!E50,\"\")","v":""},{"$f":"IF(Outils!E50=\"En Réparation/Calibration\",Outils!F50,\"\")","v":""},{"$f":"IF(Outils!E50=\"En Réparation/Calibration\",Outils!G50,\"\")","v":""}]
[{"$f":"IF(Outils!E51=\"En Réparation/Calibration\",Outils!A51,\"\")","v":""},{"$f":"IF(Outils!E51=\"En Réparation/Calibration\",Outils!B51,\"\")","v":""},{"$f":"IF(Outils!E51=\"En Réparation/Calibration\",Outils!C51,\"\")","v":""},{"$f":"IF(Outils!E51=\"En Réparation/Calibration\",Outils!D51,\"\")","v":""},{"$f":"IF(Outils!E51=\"En Réparation/Calibration\",Outils!E51,\"\")","v":""},{"$f":"IF(Outils!E51=\"En Réparation/Calibration\",Outils!F51,\"\")","v":""},{"$f":"IF(Outils!E51=\"En Réparation/Calibration\",Outils!G51,\"\")","v":""}]
[{"$f":"IF(Outils!E52=\"En Réparation/Calibration\",Outils!A52,\"\")","v":""},{"$f":"IF(Outils!E52=\"En Réparation/Calibration\",Outils!B52,\"\")","v":""},{"$f":"IF(Outils!E52=\"En Réparation/Calibration\",Outils!C52,\"\")","v":""},{"$f":"IF(Outils!E52=\"En Réparation/Calibration\",Outils!D52,\"\")","v":""},{"$f":"IF(Outils!E52=\"En Réparation/Calibration\",Outils!E52,\"\")","v":""},{"$f":"IF(Outils!E52=\"En Réparation/Calibration\",Outils!F52,\"\")","v":""},{"$f":"IF(Outils!E52=\"En Réparation/Calibration\",Outils!G52,\"\")","v":""}]
[{"$f":"IF(Outils!E53=\"En Réparation/Calibration\",Outils!A53,\"\")","v":""},{"$f":"IF(Outils!E53=\"En Réparation/Calibration\",Outils!B53,\"\")","v":""},{"$f":"IF(Outils!E53=\"En Réparation/Calibration\",Outils!C53,\"\")","v":""},{"$f":"IF(Outils!E53=\"En Réparation/Calibration\",Outils!D53,\"\")","v":""},{"$f":"IF(Outils!E53=\"En Réparation/Calibration\",Outils!E53,\"\")","v":""},{"$f":"IF(Outils!E53=\"En Réparation/Calibration\",Outils!F53,\"\")","v":""},{"$f":"IF(Outils!E53=\"En Réparation/Calibration\",Outils!G53,\"\")","v":""}]
[{"$f":"IF(Outils!E54=\"En Réparation/Calibration\",Outils!A54,\"\")","v":""},{"$f":"IF(Outils!E54=\"En Réparation/Calibration\",Outils!B54,\"\")","v":""},{"$f":"IF(Outils!E54=\"En Réparation/Calibration\",Outils!C54,\"\")","v":""},{"$f":"IF(Outils!E54=\"En Réparation/Calibration\",Outils!D54,\"\")","v":""},{"$f":"IF(Outils!E54=\"En Réparation/Calibration\",Outils!E54,\"\")","v":""},{"$f":"IF(Outils!E54=\"En Réparation/Calibration\",Outils!F54,\"\")","v":""},{"$f":"IF(Outils!E54=\"En Réparation/Calibration\",Outils!G54,\"\")","v":""}]
[{"$f":"IF(Outils!E55=\"En Réparation/Calibration\",Outils!A55,\"\")","v":""},{"$f":"IF(Outils!E55=\"En Réparation/Calibration\",Outils!B55,\"\")","v":""},{"$f":"IF(Outils!E55=\"En Réparation/Calibration\",Outils!C55,\"\")","v":""},{"$f":"IF(Outils!E55=\"En Réparation/Calibration\",Outils!D55,\"\")","v":""},{"$f":"IF(Outils!E55=\"En Réparation/Calibration\",Outils!E55,\"\")","v":""},{"$f":"IF(Outils!E55=\"En Réparation/Calibration\",Outils!F55,\"\")","v":""},{"$f":"IF(Outils!E55=\"En Réparation/Calibration\",Outils!G55,\"\")","v":""}]
[{"$f":"IF(Outils!E56=\"En Réparation/Calibration\",Outils!A56,\"\")","v":""},{"$f":"IF(Outils!E56=\"En Réparation/Calibration\",Outils!B56,\"\")","v":""},{"$f":"IF(Outils!E56=\"En Réparation/Calibration\",Outils!C56,\"\")","v":""},{"$f":"IF(Outils!E56=\"En Réparation/Calibration\",Outils!D56,\"\")","v":""},{"$f":"IF(Outils!E56=\"En Réparation/Calibration\",Outils!E56,\"\")","v":""},{"$f":"IF(Outils!E56=\"En Réparation/Calibration\",Outils!F56,\"\")","v":""},{"$f":"IF(Outils!E56=\"En Réparation/Calibration\",Outils!G56,\"\")","v":""}]
[{"$f":"IF(Outils!E57=\"En Réparation/Calibration\",Outils!A57,\"\")","v":""},{"$f":"IF(Outils!E57=\"En Réparation/Calibration\",Outils!B57,\"\")","v":""},{"$f":"IF(Outils!E57=\"En Réparation/Calibration\",Outils!C57,\"\")","v":""},{"$f":"IF(Outils!E57=\"En Réparation/Calibration\",Outils!D57,\"\")","v":""},{"$f":"IF(Outils!E57=\"En Réparation/Calibration\",Outils!E57,\"\")","v":""},{"$f":"IF(Outils!E57=\"En Réparation/Calibration\",Outils!F57,\"\")","v":""},{"$f":"IF(Outils!E57=\"En Réparation/Calibration\",Outils!G57,\"\")","v":""}]
[{"$f":"IF(Outils!E58=\"En Réparation/Calibration\",Outils!A58,\"\")","v":""},{"$f":"IF(Outils!E58=\"En Réparation/Calibration\",Outils!B58,\"\")","v":""},{"$f":"IF(Outils!E58=\"En Réparation/Calibration\",Outils!C58,\"\")","v":""},{"$f":"IF(Outils!E58=\"En Réparation/Calibration\",Outils!D58,\"\")","v":""},{"$f":"IF(Outils!E58=\"En Réparation/Calibration\",Outils!E58,\"\")","v":""},{"$f":"IF(Outils!E58=\"En Réparation/Calibration\",Outils!F58,\"\")","v":""},{"$f":"IF(Outils!E58=\"En Réparation/Calibration\",Outils!G58,\"\")","v":""}]
[{"$f":"IF(Outils!E59=\"En Réparation/Calibration\",Outils!A59,\"\")","v":""},{"$f":"IF(Outils!E59=\"En Réparation/Calibration\",Outils!B59,\"\")","v":""},{"$f":"IF(Outils!E59=\"En Réparation/Calibration\",Outils!C59,\"\")","v":""},{"$f":"IF(Outils!E59=\"En Réparation/Calibration\",Outils!D59,\"\")","v":""},{"$f":"IF(Outils!E59=\"En Réparation/Calibration\",Outils!E59,\"\")","v":""},{"$f":"IF(Outils!E59=\"En Réparation/Calibration\",Outils!F59,\"\")","v":""},{"$f":"IF(Outils!E59=\"En Réparation/Calibration\",Outils!G59,\"\")","v":""}]
[{"$f":"IF(Outils!E60=\"En Réparation/Calibration\",Outils!A60,\"\")","v":""},{"$f":"IF(Outils!E60=\"En Réparation/Calibration\",Outils!B60,\"\")","v":""},{"$f":"IF(Outils!E60=\"En Réparation/Calibration\",Outils!C60,\"\")","v":""},{"$f":"IF(Outils!E60=\"En Réparation/Calibration\",Outils!D60,\"\")","v":""},{"$f":"IF(Outils!E60=\"En Réparation/Calibration\",Outils!E60,\"\")","v":""},{"$f":"IF(Outils!E60=\"En Réparation/Calibration\",Outils!F60,\"\")","v":""},{"$f":"IF(Outils!E60=\"En Réparation/Calibration\",Outils!G60,\"\")","v":""}]
[{"$f":"IF(Outils!E61=\"En Réparation/Calibration\",Outils!A61,\"\")","v":""},{"$f":"IF(Outils!E61=\"En Réparation/Calibration\",Outils!B61,\"\")","v":""},{"$f":"IF(Outils!E61=\"En Réparation/Calibration\",Outils!C61,\"\")","v":""},{"$f":"IF(Outils!E61=\"En Réparation/Calibration\",Outils!D61,\"\")","v":""},{"$f":"IF(Outils!E61=\"En Réparation/Calibration\",Outils!E61,\"\")","v":""},{"$f":"IF(Outils!E61=\"En Réparation/Calibration\",Outils!F61,\"\")","v":""},{"$f":"IF(Outils!E61=\"En Réparation/Calibration\",Outils!G61,\"\")","v":""}]
[{"$f":"IF(Outils!E62=\"En Réparation/Calibration\",Outils!A62,\"\")","v":""},{"$f":"IF(Outils!E62=\"En Réparation/Calibration\",Outils!B62,\"\")","v":""},{"$f":"IF(Outils!E62=\"En Réparation/Calibration\",Outils!C62,\"\")","v":""},{"$f":"IF(Outils!E62=\"En Réparation/Calibration\",Outils!D62,\"\")","v":""},{"$f":"IF(Outils!E62=\"En Réparation/Calibration\",Outils!E62,\"\")","v":""},{"$f":"IF(Outils!E62=\"En Réparation/Calibration\",Outils!F62,\"\")","v":""},{"$f":"IF(Outils!E62=\"En Réparation/Calibration\",Outils!G62,\"\")","v":""}]
[{"$f":"IF(Outils!E63=\"En Réparation/Calibration\",Outils!A63,\"\")","v":""},{"$f":"IF(Outils!E63=\"En Réparation/Calibration\",Outils!B63,\"\")","v":""},{"$f":"IF(Outils!E63=\"En Réparation/Calibration\",Outils!C63,\"\")","v":""},{"$f":"IF(Outils!E63=\"En Réparation/Calibration\",Outils!D63,\"\")","v":""},{"$f":"IF(Outils!E63=\"En Réparation/Calibration\",Outils!E63,\"\")","v":""},{"$f":"IF(Outils!E63=\"En Réparation/Calibration\",Outils!F63,\"\")","v":""},{"$f":"IF(Outils!E63=\"En Réparation/Calibration\",Outils!G63,\"\")","v":""}]
[{"$f":"IF(Outils!E64=\"En Réparation/Calibration\",Outils!A64,\"\")","v":""},{"$f":"IF(Outils!E64=\"En Réparation/Calibration\",Outils!B64,\"\")","v":""},{"$f":"IF(Outils!E64=\"En Réparation/Calibration\",Outils!C64,\"\")","v":""},{"$f":"IF(Outils!E64=\"En Réparation/Calibration\",Outils!D64,\"\")","v":""},{"$f":"IF(Outils!E64=\"En Réparation/Calibration\",Outils!E64,\"\")","v":""},{"$f":"IF(Outils!E64=\"En Réparation/Calibration\",Outils!F64,\"\")","v":""},{"$f":"IF(Outils!E64=\"En Réparation/Calibration\",Outils!G64,\"\")","v":""}]
[{"$f":"IF(Outils!E65=\"En Réparation/Calibration\",Outils!A65,\"\")","v":""},{"$f":"IF(Outils!E65=\"En Réparation/Calibration\",Outils!B65,\"\")","v":""},{"$f":"IF(Outils!E65=\"En Réparation/Calibration\",Outils!C65,\"\")","v":""},{"$f":"IF(Outils!E65=\"En Réparation/Calibration\",Outils!D65,\"\")","v":""},{"$f":"IF(Outils!E65=\"En Réparation/Calibration\",Outils!E65,\"\")","v":""},{"$f":"IF(Outils!E65=\"En Réparation/Calibration\",Outils!F65,\"\")","v":""},{"$f":"IF(Outils!E65=\"En Réparation/Calibration\",Outils!G65,\"\")","v":""}]
[{"$f":"IF(Outils!E66=\"En Réparation/Calibration\",Outils!A66,\"\")","v":""},{"$f":"IF(Outils!E66=\"En Réparation/Calibration\",Outils!B66,\"\")","v":""},{"$f":"IF(Outils!E66=\"En Réparation/Calibration\",Outils!C66,\"\")","v":""},{"$f":"IF(Outils!E66=\"En Réparation/Calibration\",Outils!D66,\"\")","v":""},{"$f":"IF(Outils!E66=\"En Réparation/Calibration\",Outils!E66,\"\")","v":""},{"$f":"IF(Outils!E66=\"En Réparation/Calibration\",Outils!F66,\"\")","v":""},{"$f":"IF(Outils!E66=\"En Réparation/Calibration\",Outils!G66,\"\")","v":""}]
[{"$f":"IF(Outils!E67=\"En Réparation/Calibration\",Outils!A67,\"\")","v":""},{"$f":"IF(Outils!E67=\"En Réparation/Calibration\",Outils!B67,\"\")","v":""},{"$f":"IF(Outils!E67=\"En Réparation/Calibration\",Outils!C67,\"\")","v":""},{"$f":"IF(Outils!E67=\"En Réparation/Calibration\",Outils!D67,\"\")","v":""},{"$f":"IF(Outils!E67=\"En Réparation/Calibration\",Outils!E67,\"\")","v":""},{"$f":"IF(Outils!E67=\"En Réparation/Calibration\",Outils!F67,\"\")","v":""},{"$f":"IF(Outils!E67=\"En Réparation/Calibration\",Outils!G67,\"\")","v":""}]
[{"$f":"IF(Outils!E68=\"En Réparation/Calibration\",Outils!A68,\"\")","v":""},{"$f":"IF(Outils!E68=\"En Réparation/Calibration\",Outils!B68,\"\")","v":""},{"$f":"IF(Outils!E68=\"En Réparation/Calibration\",Outils!C68,\"\")","v":""},{"$f":"IF(Outils!E68=\"En Réparation/Calibration\",Outils!D68,\"\")","v":""},{"$f":"IF(Outils!E68=\"En Réparation/Calibration\",Outils!E68,\"\")","v":""},{"$f":"IF(Outils!E68=\"En Réparation/Calibration\",Outils!F68,\"\")","v":""},{"$f":"IF(Outils!E68=\"En Réparation/Calibration\",Outils!G68,\"\")","v":""}]
[{"$f":"IF(Outils!E69=\"En Réparation/Calibration\",Outils!A69,\"\")","v":""},{"$f":"IF(Outils!E69=\"En Réparation/Calibration\",Outils!B69,\"\")","v":""},{"$f":"IF(Outils!E69=\"En Réparation/Calibration\",Outils!C69,\"\")","v":""},{"$f":"IF(Outils!E69=\"En Réparation/Calibration\",Outils!D69,\"\")","v":""},{"$f":"IF(Outils!E69=\"En Réparation/Calibration\",Outils!E69,\"\")","v":""},{"$f":"IF(Outils!E69=\"En Réparation/Calibration\",Outils!F69,\"\")","v":""},{"$f":"IF(Outils!E69=\"En Réparation/Calibration\",Outils!G69,\"\")","v":""}]
[{"$f":"IF(Outils!E70=\"En Réparation/Calibration\",Outils!A70,\"\")","v":""},{"$f":"IF(Outils!E70=\"En Réparation/Calibration\",Outils!B70,\"\")","v":""},{"$f":"IF(Outils!E70=\"En Réparation/Calibration\",Outils!C70,\"\")","v":""},{"$f":"IF(Outils!E70=\"En Réparation/Calibration\",Outils!D70,\"\")","v":""},{"$f":"IF(Outils!E70=\"En Réparation/Calibration\",Outils!E70,\"\")","v":""},{"$f":"IF(Outils!E70=\"En Réparation/Calibration\",Outils!F70,\"\")","v":""},{"$f":"IF(Outils!E70=\"En Réparation/Calibration\",Outils!G70,\"\")","v":""}]
[{"$f":"IF(Outils!E71=\"En Réparation/Calibration\",Outils!A71,\"\")","v":""},{"$f":"IF(Outils!E71=\"En Réparation/Calibration\",Outils!B71,\"\")","v":""},{"$f":"IF(Outils!E71=\"En Réparation/Calibration\",Outils!C71,\"\")","v":""},{"$f":"IF(Outils!E71=\"En Réparation/Calibration\",Outils!D71,\"\")","v":""},{"$f":"IF(Outils!E71=\"En Réparation/Calibration\",Outils!E71,\"\")","v":""},{"$f":"IF(Outils!E71=\"En Réparation/Calibration\",Outils!F71,\"\")","v":""},{"$f":"IF(Outils!E71=\"En Réparation/Calibration\",Outils!G71,\"\")","v":""}]
[{"$f":"IF(Outils!E72=\"En Réparation/Calibration\",Outils!A72,\"\")","v":""},{"$f":"IF(Outils!E72=\"En Réparation/Calibration\",Outils!B72,\"\")","v":""},{"$f":"IF(Outils!E72=\"En Réparation/Calibration\",Outils!C72,\"\")","v":""},{"$f":"IF(Outils!E72=\"En Réparation/Calibration\",Outils!D72,\"\")","v":""},{"$f":"IF(Outils!E72=\"En Réparation/Calibration\",Outils!E72,\"\")","v":""},{"$f":"IF(Outils!E72=\"En Réparation/Calibration\",Outils!F72,\"\")","v":""},{"$f":"IF(Outils!E72=\"En Réparation/Calibration\",Outils!G72,\"\")","v":""}]
[{"$f":"IF(Outils!E73=\"En Réparation/Calibration\",Outils!A73,\"\")","v":""},{"$f":"IF(Outils!E73=\"En Réparation/Calibration\",Outils!B73,\"\")","v":""},{"$f":"IF(Outils!E73=\"En Réparation/Calibration\",Outils!C73,\"\")","v":""},{"$f":"IF(Outils!E73=\"En Réparation/Calibration\",Outils!D73,\"\")","v":""},{"$f":"IF(Outils!E73=\"En Réparation/Calibration\",Outils!E73,\"\")","v":""},{"$f":"IF(Outils!E73=\"En Réparation/Calibration\",Outils!F73,\"\")","v":""},{"$f":"IF(Outils!E73=\"En Réparation/Calibration\",Outils!G73,\"\")","v":""}]
[{"$f":"IF(Outils!E74=\"En Réparation/Calibration\",Outils!A74,\"\")","v":""},{"$f":"IF(Outils!E74=\"En Réparation/Calibration\",Outils!B74,\"\")","v":""},{"$f":"IF(Outils!E74=\"En Réparation/Calibration\",Outils!C74,\"\")","v":""},{"$f":"IF(Outils!E74=\"En Réparation/Calibration\",Outils!D74,\"\")","v":""},{"$f":"IF(Outils!E74=\"En Réparation/Calibration\",Outils!E74,\"\")","v":""},{"$f":"IF(Outils!E74=\"En Réparation/Calibration\",Outils!F74,\"\")","v":""},{"$f":"IF(Outils!E74=\"En Réparation/Calibration\",Outils!G74,\"\")","v":""}]
[{"$f":"IF(Outils!E75=\"En Réparation/Calibration\",Outils!A75,\"\")","v":""},{"$f":"IF(Outils!E75=\"En Réparation/Calibration\",Outils!B75,\"\")","v":""},{"$f":"IF(Outils!E75=\"En Réparation/Calibration\",Outils!C75,\"\")","v":""},{"$f":"IF(Outils!E75=\"En Réparation/Calibration\",Outils!D75,\"\")","v":""},{"$f":"IF(Outils!E75=\"En Réparation/Calibration\",Outils!E75,\"\")","v":""},{"$f":"IF(Outils!E75=\"En Réparation/Calibration\",Outils!F75,\"\")","v":""},{"$f":"IF(Outils!E75=\"En Réparation/Calibration\",Outils!G75,\"\")","v":""}]
[{"$f":"IF(Outils!E76=\"En Réparation/Calibration\",Outils!A76,\"\")","v":""},{"$f":"IF(Outils!E76=\"En Réparation/Calibration\",Outils!B76,\"\")","v":""},{"$f":"IF(Outils!E76=\"En Réparation/Calibration\",Outils!C76,\"\")","v":""},{"$f":"IF(Outils!E76=\"En Réparation/Calibration\",Outils!D76,\"\")","v":""},{"$f":"IF(Outils!E76=\"En Réparation/Calibration\",Outils!E76,\"\")","v":""},{"$f":"IF(Outils!E76=\"En Réparation/Calibration\",Outils!F76,\"\")","v":""},{"$f":"IF(Outils!E76=\"En Réparation/Calibration\",Outils!G76,\"\")","v":""}]
[{"$f":"IF(Outils!E77=\"En Réparation/Calibration\",Outils!A77,\"\")","v":""},{"$f":"IF(Outils!E77=\"En Réparation/Calibration\",Outils!B77,\"\")","v":""},{"$f":"IF(Outils!E77=\"En Réparation/Calibration\",Outils!C77,\"\")","v":""},{"$f":"IF(Outils!E77=\"En Réparation/Calibration\",Outils!D77,\"\")","v":""},{"$f":"IF(Outils!E77=\"En Réparation/Calibration\",Outils!E77,\"\")","v":""},{"$f":"IF(Outils!E77=\"En Réparation/Calibration\",Outils!F77,\"\")","v":""},{"$f":"IF(Outils!E77=\"En Réparation/Calibration\",Outils!G77,\"\")","v":""}]
[{"$f":"IF(Outils!E78=\"En Réparation/Calibration\",Outils!A78,\"\")","v":""},{"$f":"IF(Outils!E78=\"En Réparation/Calibration\",Outils!B78,\"\")","v":""},{"$f":"IF(Outils!E78=\"En Réparation/Calibration\",Outils!C78,\"\")","v":""},{"$f":"IF(Outils!E78=\"En Réparation/Calibration\",Outils!D78,\"\")","v":""},{"$f":"IF(Outils!E78=\"En Réparation/Calibration\",Outils!E78,\"\")","v":""},{"$f":"IF(Outils!E78=\"En Réparation/Calibration\",Outils!F78,\"\")","v":""},{"$f":"IF(Outils!E78=\"En Réparation/Calibration\",Outils!G78,\"\")","v":""}]
[{"$f":"IF(Outils!E79=\"En Réparation/Calibration\",Outils!A79,\"\")","v":""},{"$f":"IF(Outils!E79=\"En Réparation/Calibration\",Outils!B79,\"\")","v":""},{"$f":"IF(Outils!E79=\"En Réparation/Calibration\",Outils!C79,\"\")","v":""},{"$f":"IF(Outils!E79=\"En Réparation/Calibration\",Outils!D79,\"\")","v":""},{"$f":"IF(Outils!E79=\"En Réparation/Calibration\",Outils!E79,\"\")","v":""},{"$f":"IF(Outils!E79=\"En Réparation/Calibration\",Outils!F79,\"\")","v":""},{"$f":"IF(Outils!E79=\"En Réparation/Calibration\",Outils!G79,\"\")","v":""}]
[{"$f":"IF(Outils!E80=\"En Réparation/Calibration\",Outils!A80,\"\")","v":""},{"$f":"IF(Outils!E80=\"En Réparation/Calibration\",Outils!B80,\"\")","v":""},{"$f":"IF(Outils!E80=\"En Réparation/Calibration\",Outils!C80,\"\")","v":""},{"$f":"IF(Outils!E80=\"En Réparation/Calibration\",Outils!D80,\"\")","v":""},{"$f":"IF(Outils!E80=\"En Réparation/Calibration\",Outils!E80,\"\")","v":""},{"$f":"IF(Outils!E80=\"En Réparation/Calibration\",Outils!F80,\"\")","v":""},{"$f":"IF(Outils!E80=\"En Réparation/Calibration\",Outils!G80,\"\")","v":""}]
[{"$f":"IF(Outils!E81=\"En Réparation/Calibration\",Outils!A81,\"\")","v":""},{"$f":"IF(Outils!E81=\"En Réparation/Calibration\",Outils!B81,\"\")","v":""},{"$f":"IF(Outils!E81=\"En Réparation/Calibration\",Outils!C81,\"\")","v":""},{"$f":"IF(Outils!E81=\"En Réparation/Calibration\",Outils!D81,\"\")","v":""},{"$f":"IF(Outils!E81=\"En Réparation/Calibration\",Outils!E81,\"\")","v":""},{"$f":"IF(Outils!E81=\"En Réparation/Calibration\",Outils!F81,\"\")","v":""},{"$f":"IF(Outils!E81=\"En Réparation/Calibration\",Outils!G81,\"\")","v":""}]
[{"$f":"IF(Outils!E82=\"En Réparation/Calibration\",Outils!A82,\"\")","v":""},{"$f":"IF(Outils!E82=\"En Réparation/Calibration\",Outils!B82,\"\")","v":""},{"$f":"IF(Outils!E82=\"En Réparation/Calibration\",Outils!C82,\"\")","v":""},{"$f":"IF(Outils!E82=\"En Réparation/Calibration\",Outils!D82,\"\")","v":""},{"$f":"IF(Outils!E82=\"En Réparation/Calibration\",Outils!E82,\"\")","v":""},{"$f":"IF(Outils!E82=\"En Réparation/Calibration\",Outils!F82,\"\")","v":""},{"$f":"IF(Outils!E82=\"En Réparation/Calibration\",Outils!G82,\"\")","v":""}]
[{"$f":"IF(Outils!E83=\"En Réparation/Calibration\",Outils!A83,\"\")","v":""},{"$f":"IF(Outils!E83=\"En Réparation/Calibration\",Outils!B83,\"\")","v":""},{"$f":"IF(Outils!E83=\"En Réparation/Calibration\",Outils!C83,\"\")","v":""},{"$f":"IF(Outils!E83=\"En Réparation/Calibration\",Outils!D83,\"\")","v":""},{"$f":"IF(Outils!E83=\"En Réparation/Calibration\",Outils!E83,\"\")","v":""},{"$f":"IF(Outils!E83=\"En Réparation/Calibration\",Outils!F83,\"\")","v":""},{"$f":"IF(Outils!E83=\"En Réparation/Calibration\",Outils!G83,\"\")","v":""}]
[{"$f":"IF(Outils!E84=\"En Réparation/Calibration\",Outils!A84,\"\")","v":""},{"$f":"IF(Outils!E84=\"En Réparation/Calibration\",Outils!B84,\"\")","v":""},{"$f":"IF(Outils!E84=\"En Réparation/Calibration\",Outils!C84,\"\")","v":""},{"$f":"IF(Outils!E84=\"En Réparation/Calibration\",Outils!D84,\"\")","v":""},{"$f":"IF(Outils!E84=\"En Réparation/Calibration\",Outils!E84,\"\")","v":""},{"$f":"IF(Outils!E84=\"En Réparation/Calibration\",Outils!F84,\"\")","v":""},{"$f":"IF(Outils!E84=\"En Réparation/Calibration\",Outils!G84,\"\")","v":""}]
[{"$f":"IF(Outils!E85=\"En Réparation/Calibration\",Outils!A85,\"\")","v":""},{"$f":"IF(Outils!E85=\"En Réparation/Calibration\",Outils!B85,\"\")","v":""},{"$f":"IF(Outils!E85=\"En Réparation/Calibration\",Outils!C85,\"\")","v":""},{"$f":"IF(Outils!E85=\"En Réparation/Calibration\",Outils!D85,\"\")","v":""},{"$f":"IF(Outils!E85=\"En Réparation/Calibration\",Outils!E85,\"\")","v":""},{"$f":"IF(Outils!E85=\"En Réparation/Calibration\",Outils!F85,\"\")","v":""},{"$f":"IF(Outils!E85=\"En Réparation/Calibration\",Outils!G85,\"\")","v":""}]
[{"$f":"IF(Outils!E86=\"En Réparation/Calibration\",Outils!A86,\"\")","v":""},{"$f":"IF(Outils!E86=\"En Réparation/Calibration\",Outils!B86,\"\")","v":""},{"$f":"IF(Outils!E86=\"En Réparation/Calibration\",Outils!C86,\"\")","v":""},{"$f":"IF(Outils!E86=\"En Réparation/Calibration\",Outils!D86,\"\")","v":""},{"$f":"IF(Outils!E86=\"En Réparation/Calibration\",Outils!E86,\"\")","v":""},{"$f":"IF(Outils!E86=\"En Réparation/Calibration\",Outils!F86,\"\")","v":""},{"$f":"IF(Outils!E86=\"En Réparation/Calibration\",Outils!G86,\"\")","v":""}]
[{"$f":"IF(Outils!E87=\"En Réparation/Calibration\",Outils!A87,\"\")","v":""},{"$f":"IF(Outils!E87=\"En Réparation/Calibration\",Outils!B87,\"\")","v":""},{"$f":"IF(Outils!E87=\"En Réparation/Calibration\",Outils!C87,\"\")","v":""},{"$f":"IF(Outils!E87=\"En Réparation/Calibration\",Outils!D87,\"\")","v":""},{"$f":"IF(Outils!E87=\"En Réparation/Calibration\",Outils!E87,\"\")","v":""},{"$f":"IF(Outils!E87=\"En Réparation/Calibration\",Outils!F87,\"\")","v":""},{"$f":"IF(Outils!E87=\"En Réparation/Calibration\",Outils!G87,\"\")","v":""}]
[{"$f":"IF(Outils!E88=\"En Réparation/Calibration\",Outils!A88,\"\")","v":""},{"$f":"IF(Outils!E88=\"En Réparation/Calibration\",Outils!B88,\"\")","v":""},{"$f":"IF(Outils!E88=\"En Réparation/Calibration\",Outils!C88,\"\")","v":""},{"$f":"IF(Outils!E88=\"En Réparation/Calibration\",Outils!D88,\"\")","v":""},{"$f":"IF(Outils!E88=\"En Réparation/Calibration\",Outils!E88,\"\")","v":""},{"$f":"IF(Outils!E88=\"En Réparation/Calibration\",Outils!F88,\"\")","v":""},{"$f":"IF(Outils!E88=\"En Réparation/Calibration\",Outils!G88,\"\")","v":""}]
[{"$f":"IF(Outils!E89=\"En Réparation/Calibration\",Outils!A89,\"\")","v":""},{"$f":"IF(Outils!E89=\"En Réparation/Calibration\",Outils!B89,\"\")","v":""},{"$f":"IF(Outils!E89=\"En Réparation/Calibration\",Outils!C89,\"\")","v":""},{"$f":"IF(Outils!E89=\"En Réparation/Calibration\",Outils!D89,\"\")","v":""},{"$f":"IF(Outils!E89=\"En Réparation/Calibration\",Outils!E89,\"\")","v":""},{"$f":"IF(Outils!E89=\"En Réparation/Calibration\",Outils!F89,\"\")","v":""},{"$f":"IF(Outils!E89=\"En Réparation/Calibration\",Outils!G89,\"\")","v":""}]
[{"$f":"IF(Outils!E90=\"En Réparation/Calibration\",Outils!A90,\"\")","v":""},{"$f":"IF(Outils!E90=\"En Réparation/Calibration\",Outils!B90,\"\")","v":""},{"$f":"IF(Outils!E90=\"En Réparation/Calibration\",Outils!C90,\"\")","v":""},{"$f":"IF(Outils!E90=\"En Réparation/Calibration\",Outils!D90,\"\")","v":""},{"$f":"IF(Outils!E90=\"En Réparation/Calibration\",Outils!E90,\"\")","v":""},{"$f":"IF(Outils!E90=\"En Réparation/Calibration\",Outils!F90,\"\")","v":""},{"$f":"IF(Outils!E90=\"En Réparation/Calibration\",Outils!G90,\"\")","v":""}]
[{"$f":"IF(Outils!E91=\"En Réparation/Calibration\",Outils!A91,\"\")","v":""},{"$f":"IF(Outils!E91=\"En Réparation/Calibration\",Outils!B91,\"\")","v":""},{"$f":"IF(Outils!E91=\"En Réparation/Calibration\",Outils!C91,\"\")","v":""},{"$f":"IF(Outils!E91=\"En Réparation/Calibration\",Outils!D91,\"\")","v":""},{"$f":"IF(Outils!E91=\"En Réparation/Calibration\",Outils!E91,\"\")","v":""},{"$f":"IF(Outils!E91=\"En Réparation/Calibration\",Outils!F91,\"\")","v":""},{"$f":"IF(Outils!E91=\"En Réparation/Calibration\",Outils!G91,\"\")","v":""}]
[{"$f":"IF(Outils!E92=\"En Réparation/Calibration\",Outils!A92,\"\")","v":""},{"$f":"IF(Outils!E92=\"En Réparation/Calibration\",Outils!B92,\"\")","v":""},{"$f":"IF(Outils!E92=\"En Réparation/Calibration\",Outils!C92,\"\")","v":""},{"$f":"IF(Outils!E92=\"En Réparation/Calibration\",Outils!D92,\"\")","v":""},{"$f":"IF(Outils!E92=\"En Réparation/Calibration\",Outils!E92,\"\")","v":""},{"$f":"IF(Outils!E92=\"En Réparation/Calibration\",Outils!F92,\"\")","v":""},{"$f":"IF(Outils!E92=\"En Réparation/Calibration\",Outils!G92,\"\")","v":""}]
[{"$f":"IF(Outils!E93=\"En Réparation/Calibration\",Outils!A93,\"\")","v":""},{"$f":"IF(Outils!E93=\"En Réparation/Calibration\",Outils!B93,\"\")","v":""},{"$f":"IF(Outils!E93=\"En Réparation/Calibration\",Outils!C93,\"\")","v":""},{"$f":"IF(Outils!E93=\"En Réparation/Calibration\",Outils!D93,\"\")","v":""},{"$f":"IF(Outils!E93=\"En Réparation/Calibration\",Outils!E93,\"\")","v":""},{"$f":"IF(Outils!E93=\"En Réparation/Calibration\",Outils!F93,\"\")","v":""},{"$f":"IF(Outils!E93=\"En Réparation/Calibration\",Outils!G93,\"\")","v":""}]
[{"$f":"IF(Outils!E94=\"En Réparation/Calibration\",Outils!A94,\"\")","v":""},{"$f":"IF(Outils!E94=\"En Réparation/Calibration\",Outils!B94,\"\")","v":""},{"$f":"IF(Outils!E94=\"En Réparation/Calibration\",Outils!C94,\"\")","v":""},{"$f":"IF(Outils!E94=\"En Réparation/Calibration\",Outils!D94,\"\")","v":""},{"$f":"IF(Outils!E94=\"En Réparation/Calibration\",Outils!E94,\"\")","v":""},{"$f":"IF(Outils!E94=\"En Réparation/Calibration\",Outils!F94,\"\")","v":""},{"$f":"IF(Outils!E94=\"En Réparation/Calibration\",Outils!G94,\"\")","v":""}]
[{"$f":"IF(Outils!E95=\"En Réparation/Calibration\",Outils!A95,\"\")","v":""},{"$f":"IF(Outils!E95=\"En Réparation/Calibration\",Outils!B95,\"\")","v":""},{"$f":"IF(Outils!E95=\"En Réparation/Calibration\",Outils!C95,\"\")","v":""},{"$f":"IF(Outils!E95=\"En Réparation/Calibration\",Outils!D95,\"\")","v":""},{"$f":"IF(Outils!E95=\"En Réparation/Calibration\",Outils!E95,\"\")","v":""},{"$f":"IF(Outils!E95=\"En Réparation/Calibration\",Outils!F95,\"\")","v":""},{"$f":"IF(Outils!E95=\"En Réparation/Calibration\",Outils!G95,\"\")","v":""}]
[{"$f":"IF(Outils!E96=\"En Réparation/Calibration\",Outils!A96,\"\")","v":""},{"$f":"IF(Outils!E96=\"En Réparation/Calibration\",Outils!B96,\"\")","v":""},{"$f":"IF(Outils!E96=\"En Réparation/Calibration\",Outils!C96,\"\")","v":""},{"$f":"IF(Outils!E96=\"En Réparation/Calibration\",Outils!D96,\"\")","v":""},{"$f":"IF(Outils!E96=\"En Réparation/Calibration\",Outils!E96,\"\")","v":""},{"$f":"IF(Outils!E96=\"En Réparation/Calibration\",Outils!F96,\"\")","v":""},{"$f":"IF(Outils!E96=\"En Réparation/Calibration\",Outils!G96,\"\")","v":""}]
[{"$f":"IF(Outils!E97=\"En Réparation/Calibration\",Outils!A97,\"\")","v":""},{"$f":"IF(Outils!E97=\"En Réparation/Calibration\",Outils!B97,\"\")","v":""},{"$f":"IF(Outils!E97=\"En Réparation/Calibration\",Outils!C97,\"\")","v":""},{"$f":"IF(Outils!E97=\"En Réparation/Calibration\",Outils!D97,\"\")","v":""},{"$f":"IF(Outils!E97=\"En Réparation/Calibration\",Outils!E97,\"\")","v":""},{"$f":"IF(Outils!E97=\"En Réparation/Calibration\",Outils!F97,\"\")","v":""},{"$f":"IF(Outils!E97=\"En Réparation/Calibration\",Outils!G97,\"\")","v":""}]
[{"$f":"IF(Outils!E98=\"En Réparation/Calibration\",Outils!A98,\"\")","v":""},{"$f":"IF(Outils!E98=\"En Réparation/Calibration\",Outils!B98,\"\")","v":""},{"$f":"IF(Outils!E98=\"En Réparation/Calibration\",Outils!C98,\"\")","v":""},{"$f":"IF(Outils!E98=\"En Réparation/Calibration\",Outils!D98,\"\")","v":""},{"$f":"IF(Outils!E98=\"En Réparation/Calibration\",Outils!E98,\"\")","v":""},{"$f":"IF(Outils!E98=\"En Réparation/Calibration\",Outils!F98,\"\")","v":""},{"$f":"IF(Outils!E98=\"En Réparation/Calibration\",Outils!G98,\"\")","v":""}]
[{"$f":"IF(Outils!E99=\"En Réparation/Calibration\",Outils!A99,\"\")","v":""},{"$f":"IF(Outils!E99=\"En Réparation/Calibration\",Outils!B99,\"\")","v":""},{"$f":"IF(Outils!E99=\"En Réparation/Calibration\",Outils!C99,\"\")","v":""},{"$f":"IF(Outils!E99=\"En Réparation/Calibration\",Outils!D99,\"\")","v":""},{"$f":"IF(Outils!E99=\"En Réparation/Calibration\",Outils!E99,\"\")","v":""},{"$f":"IF(Outils!E99=\"En Réparation/Calibration\",Outils!F99,\"\")","v":""},{"$f":"IF(Outils!E99=\"En Réparation/Calibration\",Outils!G99,\"\")","v":""}]
[{"$f":"IF(Outils!E100=\"En Réparation/Calibration\",Outils!A100,\"\")","v":""},{"$f":"IF(Outils!E100=\"En Réparation/Calibration\",Outils!B100,\"\")","v":""},{"$f":"IF(Outils!E100=\"En Réparation/Calibration\",Outils!C100,\"\")","v":""},{"$f":"IF(Outils!E100=\"En Réparation/Calibration\",Outils!D100,\"\")","v":""},{"$f":"IF(Outils!E100=\"En Réparation/Calibration\",Outils!E100,\"\")","v":""},{"$f":"IF(Outils!E100=\"En Réparation/Calibration\",Outils!F100,\"\")","v":""},{"$f":"IF(Outils!E100=\"En Réparation/Calibration\",Outils!G100,\"\")","v":""}]
[{"$f":"IF(Outils!E101=\"En Réparation/Calibration\",Outils!A101,\"\")","v":""},{"$f":"IF(Outils!E101=\"En Réparation/Calibration\",Outils!B101,\"\")","v":""},{"$f":"IF(Outils!E101=\"En Réparation/Calibration\",Outils!C101,\"\")","v":""},{"$f":"IF(Outils!E101=\"En Réparation/Calibration\",Outils!D101,\"\")","v":""},{"$f":"IF(Outils!E101=\"En Réparation/Calibration\",Outils!E101,\"\")","v":""},{"$f":"IF(Outils!E101=\"En Réparation/Calibration\",Outils!F101,\"\")","v":""},{"$f":"IF(Outils!E101=\"En Réparation/Calibration\",Outils!G101,\"\")","v":""}]
[{"$f":"IF(Outils!E102=\"En Réparation/Calibration\",Outils!A102,\"\")","v":""},{"$f":"IF(Outils!E102=\"En Réparation/Calibration\",Outils!B102,\"\")","v":""},{"$f":"IF(Outils!E102=\"En Réparation/Calibration\",Outils!C102,\"\")","v":""},{"$f":"IF(Outils!E102=\"En Réparation/Calibration\",Outils!D102,\"\")","v":""},{"$f":"IF(Outils!E102=\"En Réparation/Calibration\",Outils!E102,\"\")","v":""},{"$f":"IF(Outils!E102=\"En Réparation/Calibration\",Outils!F102,\"\")","v":""},{"$f":"IF(Outils!E102=\"En Réparation/Calibration\",Outils!G102,\"\")","v":""}]

{"sheet":"Jetés","index":3,"n_rows":100,"n_cols":7,"rows_kept":100,"cut":false,"hidden":false,"merged":[]}
["Département","Identifiant Unique","Description Outil","# Série","État","Calibration Due Date","#Projet du lieu de l'item"]
[{"$f":"IF(Outils!E4=\"Jetés\",Outils!A4,\"\")","v":""},{"$f":"IF(Outils!E4=\"Jetés\",Outils!B4,\"\")","v":""},{"$f":"IF(Outils!E4=\"Jetés\",Outils!C4,\"\")","v":""},{"$f":"IF(Outils!E4=\"Jetés\",Outils!D4,\"\")","v":""},{"$f":"IF(Outils!E4=\"Jetés\",Outils!E4,\"\")","v":""},{"$f":"IF(Outils!E4=\"Jetés\",Outils!F4,\"\")","v":""},{"$f":"IF(Outils!E4=\"Jetés\",Outils!G4,\"\")","v":""}]
[{"$f":"IF(Outils!E5=\"Jetés\",Outils!A5,\"\")","v":""},{"$f":"IF(Outils!E5=\"Jetés\",Outils!B5,\"\")","v":""},{"$f":"IF(Outils!E5=\"Jetés\",Outils!C5,\"\")","v":""},{"$f":"IF(Outils!E5=\"Jetés\",Outils!D5,\"\")","v":""},{"$f":"IF(Outils!E5=\"Jetés\",Outils!E5,\"\")","v":""},{"$f":"IF(Outils!E5=\"Jetés\",Outils!F5,\"\")","v":""},{"$f":"IF(Outils!E5=\"Jetés\",Outils!G5,\"\")","v":""}]
[{"$f":"IF(Outils!E6=\"Jetés\",Outils!A6,\"\")","v":""},{"$f":"IF(Outils!E6=\"Jetés\",Outils!B6,\"\")","v":""},{"$f":"IF(Outils!E6=\"Jetés\",Outils!C6,\"\")","v":""},{"$f":"IF(Outils!E6=\"Jetés\",Outils!D6,\"\")","v":""},{"$f":"IF(Outils!E6=\"Jetés\",Outils!E6,\"\")","v":""},{"$f":"IF(Outils!E6=\"Jetés\",Outils!F6,\"\")","v":""},{"$f":"IF(Outils!E6=\"Jetés\",Outils!G6,\"\")","v":""}]
[{"$f":"IF(Outils!E7=\"Jetés\",Outils!A7,\"\")","v":""},{"$f":"IF(Outils!E7=\"Jetés\",Outils!B7,\"\")","v":""},{"$f":"IF(Outils!E7=\"Jetés\",Outils!C7,\"\")","v":""},{"$f":"IF(Outils!E7=\"Jetés\",Outils!D7,\"\")","v":""},{"$f":"IF(Outils!E7=\"Jetés\",Outils!E7,\"\")","v":""},{"$f":"IF(Outils!E7=\"Jetés\",Outils!F7,\"\")","v":""},{"$f":"IF(Outils!E7=\"Jetés\",Outils!G7,\"\")","v":""}]
[{"$f":"IF(Outils!E8=\"Jetés\",Outils!A8,\"\")","v":""},{"$f":"IF(Outils!E8=\"Jetés\",Outils!B8,\"\")","v":""},{"$f":"IF(Outils!E8=\"Jetés\",Outils!C8,\"\")","v":""},{"$f":"IF(Outils!E8=\"Jetés\",Outils!D8,\"\")","v":""},{"$f":"IF(Outils!E8=\"Jetés\",Outils!E8,\"\")","v":""},{"$f":"IF(Outils!E8=\"Jetés\",Outils!F8,\"\")","v":""},{"$f":"IF(Outils!E8=\"Jetés\",Outils!G8,\"\")","v":""}]
[{"$f":"IF(Outils!E9=\"Jetés\",Outils!A9,\"\")","v":""},{"$f":"IF(Outils!E9=\"Jetés\",Outils!B9,\"\")","v":""},{"$f":"IF(Outils!E9=\"Jetés\",Outils!C9,\"\")","v":""},{"$f":"IF(Outils!E9=\"Jetés\",Outils!D9,\"\")","v":""},{"$f":"IF(Outils!E9=\"Jetés\",Outils!E9,\"\")","v":""},{"$f":"IF(Outils!E9=\"Jetés\",Outils!F9,\"\")","v":""},{"$f":"IF(Outils!E9=\"Jetés\",Outils!G9,\"\")","v":""}]
[{"$f":"IF(Outils!E10=\"Jetés\",Outils!A10,\"\")","v":""},{"$f":"IF(Outils!E10=\"Jetés\",Outils!B10,\"\")","v":""},{"$f":"IF(Outils!E10=\"Jetés\",Outils!C10,\"\")","v":""},{"$f":"IF(Outils!E10=\"Jetés\",Outils!D10,\"\")","v":""},{"$f":"IF(Outils!E10=\"Jetés\",Outils!E10,\"\")","v":""},{"$f":"IF(Outils!E10=\"Jetés\",Outils!F10,\"\")","v":""},{"$f":"IF(Outils!E10=\"Jetés\",Outils!G10,\"\")","v":""}]
[{"$f":"IF(Outils!E11=\"Jetés\",Outils!A11,\"\")","v":""},{"$f":"IF(Outils!E11=\"Jetés\",Outils!B11,\"\")","v":""},{"$f":"IF(Outils!E11=\"Jetés\",Outils!C11,\"\")","v":""},{"$f":"IF(Outils!E11=\"Jetés\",Outils!D11,\"\")","v":""},{"$f":"IF(Outils!E11=\"Jetés\",Outils!E11,\"\")","v":""},{"$f":"IF(Outils!E11=\"Jetés\",Outils!F11,\"\")","v":""},{"$f":"IF(Outils!E11=\"Jetés\",Outils!G11,\"\")","v":""}]
[{"$f":"IF(Outils!E12=\"Jetés\",Outils!A12,\"\")","v":""},{"$f":"IF(Outils!E12=\"Jetés\",Outils!B12,\"\")","v":""},{"$f":"IF(Outils!E12=\"Jetés\",Outils!C12,\"\")","v":""},{"$f":"IF(Outils!E12=\"Jetés\",Outils!D12,\"\")","v":""},{"$f":"IF(Outils!E12=\"Jetés\",Outils!E12,\"\")","v":""},{"$f":"IF(Outils!E12=\"Jetés\",Outils!F12,\"\")","v":""},{"$f":"IF(Outils!E12=\"Jetés\",Outils!G12,\"\")","v":""}]
[{"$f":"IF(Outils!E13=\"Jetés\",Outils!A13,\"\")","v":""},{"$f":"IF(Outils!E13=\"Jetés\",Outils!B13,\"\")","v":""},{"$f":"IF(Outils!E13=\"Jetés\",Outils!C13,\"\")","v":""},{"$f":"IF(Outils!E13=\"Jetés\",Outils!D13,\"\")","v":""},{"$f":"IF(Outils!E13=\"Jetés\",Outils!E13,\"\")","v":""},{"$f":"IF(Outils!E13=\"Jetés\",Outils!F13,\"\")","v":""},{"$f":"IF(Outils!E13=\"Jetés\",Outils!G13,\"\")","v":""}]
[{"$f":"IF(Outils!E14=\"Jetés\",Outils!A14,\"\")","v":""},{"$f":"IF(Outils!E14=\"Jetés\",Outils!B14,\"\")","v":""},{"$f":"IF(Outils!E14=\"Jetés\",Outils!C14,\"\")","v":""},{"$f":"IF(Outils!E14=\"Jetés\",Outils!D14,\"\")","v":""},{"$f":"IF(Outils!E14=\"Jetés\",Outils!E14,\"\")","v":""},{"$f":"IF(Outils!E14=\"Jetés\",Outils!F14,\"\")","v":""},{"$f":"IF(Outils!E14=\"Jetés\",Outils!G14,\"\")","v":""}]
[{"$f":"IF(Outils!E15=\"Jetés\",Outils!A15,\"\")","v":""},{"$f":"IF(Outils!E15=\"Jetés\",Outils!B15,\"\")","v":""},{"$f":"IF(Outils!E15=\"Jetés\",Outils!C15,\"\")","v":""},{"$f":"IF(Outils!E15=\"Jetés\",Outils!D15,\"\")","v":""},{"$f":"IF(Outils!E15=\"Jetés\",Outils!E15,\"\")","v":""},{"$f":"IF(Outils!E15=\"Jetés\",Outils!F15,\"\")","v":""},{"$f":"IF(Outils!E15=\"Jetés\",Outils!G15,\"\")","v":""}]
[{"$f":"IF(Outils!E16=\"Jetés\",Outils!A16,\"\")","v":""},{"$f":"IF(Outils!E16=\"Jetés\",Outils!B16,\"\")","v":""},{"$f":"IF(Outils!E16=\"Jetés\",Outils!C16,\"\")","v":""},{"$f":"IF(Outils!E16=\"Jetés\",Outils!D16,\"\")","v":""},{"$f":"IF(Outils!E16=\"Jetés\",Outils!E16,\"\")","v":""},{"$f":"IF(Outils!E16=\"Jetés\",Outils!F16,\"\")","v":""},{"$f":"IF(Outils!E16=\"Jetés\",Outils!G16,\"\")","v":""}]
[{"$f":"IF(Outils!E17=\"Jetés\",Outils!A17,\"\")","v":""},{"$f":"IF(Outils!E17=\"Jetés\",Outils!B17,\"\")","v":""},{"$f":"IF(Outils!E17=\"Jetés\",Outils!C17,\"\")","v":""},{"$f":"IF(Outils!E17=\"Jetés\",Outils!D17,\"\")","v":""},{"$f":"IF(Outils!E17=\"Jetés\",Outils!E17,\"\")","v":""},{"$f":"IF(Outils!E17=\"Jetés\",Outils!F17,\"\")","v":""},{"$f":"IF(Outils!E17=\"Jetés\",Outils!G17,\"\")","v":""}]
[{"$f":"IF(Outils!E18=\"Jetés\",Outils!A18,\"\")","v":""},{"$f":"IF(Outils!E18=\"Jetés\",Outils!B18,\"\")","v":""},{"$f":"IF(Outils!E18=\"Jetés\",Outils!C18,\"\")","v":""},{"$f":"IF(Outils!E18=\"Jetés\",Outils!D18,\"\")","v":""},{"$f":"IF(Outils!E18=\"Jetés\",Outils!E18,\"\")","v":""},{"$f":"IF(Outils!E18=\"Jetés\",Outils!F18,\"\")","v":""},{"$f":"IF(Outils!E18=\"Jetés\",Outils!G18,\"\")","v":""}]
[{"$f":"IF(Outils!E19=\"Jetés\",Outils!A19,\"\")","v":""},{"$f":"IF(Outils!E19=\"Jetés\",Outils!B19,\"\")","v":""},{"$f":"IF(Outils!E19=\"Jetés\",Outils!C19,\"\")","v":""},{"$f":"IF(Outils!E19=\"Jetés\",Outils!D19,\"\")","v":""},{"$f":"IF(Outils!E19=\"Jetés\",Outils!E19,\"\")","v":""},{"$f":"IF(Outils!E19=\"Jetés\",Outils!F19,\"\")","v":""},{"$f":"IF(Outils!E19=\"Jetés\",Outils!G19,\"\")","v":""}]
[{"$f":"IF(Outils!E20=\"Jetés\",Outils!A20,\"\")","v":""},{"$f":"IF(Outils!E20=\"Jetés\",Outils!B20,\"\")","v":""},{"$f":"IF(Outils!E20=\"Jetés\",Outils!C20,\"\")","v":""},{"$f":"IF(Outils!E20=\"Jetés\",Outils!D20,\"\")","v":""},{"$f":"IF(Outils!E20=\"Jetés\",Outils!E20,\"\")","v":""},{"$f":"IF(Outils!E20=\"Jetés\",Outils!F20,\"\")","v":""},{"$f":"IF(Outils!E20=\"Jetés\",Outils!G20,\"\")","v":""}]
[{"$f":"IF(Outils!E21=\"Jetés\",Outils!A21,\"\")","v":""},{"$f":"IF(Outils!E21=\"Jetés\",Outils!B21,\"\")","v":""},{"$f":"IF(Outils!E21=\"Jetés\",Outils!C21,\"\")","v":""},{"$f":"IF(Outils!E21=\"Jetés\",Outils!D21,\"\")","v":""},{"$f":"IF(Outils!E21=\"Jetés\",Outils!E21,\"\")","v":""},{"$f":"IF(Outils!E21=\"Jetés\",Outils!F21,\"\")","v":""},{"$f":"IF(Outils!E21=\"Jetés\",Outils!G21,\"\")","v":""}]
[{"$f":"IF(Outils!E22=\"Jetés\",Outils!A22,\"\")","v":""},{"$f":"IF(Outils!E22=\"Jetés\",Outils!B22,\"\")","v":""},{"$f":"IF(Outils!E22=\"Jetés\",Outils!C22,\"\")","v":""},{"$f":"IF(Outils!E22=\"Jetés\",Outils!D22,\"\")","v":""},{"$f":"IF(Outils!E22=\"Jetés\",Outils!E22,\"\")","v":""},{"$f":"IF(Outils!E22=\"Jetés\",Outils!F22,\"\")","v":""},{"$f":"IF(Outils!E22=\"Jetés\",Outils!G22,\"\")","v":""}]
[{"$f":"IF(Outils!E23=\"Jetés\",Outils!A23,\"\")","v":""},{"$f":"IF(Outils!E23=\"Jetés\",Outils!B23,\"\")","v":""},{"$f":"IF(Outils!E23=\"Jetés\",Outils!C23,\"\")","v":""},{"$f":"IF(Outils!E23=\"Jetés\",Outils!D23,\"\")","v":""},{"$f":"IF(Outils!E23=\"Jetés\",Outils!E23,\"\")","v":""},{"$f":"IF(Outils!E23=\"Jetés\",Outils!F23,\"\")","v":""},{"$f":"IF(Outils!E23=\"Jetés\",Outils!G23,\"\")","v":""}]
[{"$f":"IF(Outils!E24=\"Jetés\",Outils!A24,\"\")","v":""},{"$f":"IF(Outils!E24=\"Jetés\",Outils!B24,\"\")","v":""},{"$f":"IF(Outils!E24=\"Jetés\",Outils!C24,\"\")","v":""},{"$f":"IF(Outils!E24=\"Jetés\",Outils!D24,\"\")","v":""},{"$f":"IF(Outils!E24=\"Jetés\",Outils!E24,\"\")","v":""},{"$f":"IF(Outils!E24=\"Jetés\",Outils!F24,\"\")","v":""},{"$f":"IF(Outils!E24=\"Jetés\",Outils!G24,\"\")","v":""}]
[{"$f":"IF(Outils!E25=\"Jetés\",Outils!A25,\"\")","v":""},{"$f":"IF(Outils!E25=\"Jetés\",Outils!B25,\"\")","v":""},{"$f":"IF(Outils!E25=\"Jetés\",Outils!C25,\"\")","v":""},{"$f":"IF(Outils!E25=\"Jetés\",Outils!D25,\"\")","v":""},{"$f":"IF(Outils!E25=\"Jetés\",Outils!E25,\"\")","v":""},{"$f":"IF(Outils!E25=\"Jetés\",Outils!F25,\"\")","v":""},{"$f":"IF(Outils!E25=\"Jetés\",Outils!G25,\"\")","v":""}]
[{"$f":"IF(Outils!E26=\"Jetés\",Outils!A26,\"\")","v":""},{"$f":"IF(Outils!E26=\"Jetés\",Outils!B26,\"\")","v":""},{"$f":"IF(Outils!E26=\"Jetés\",Outils!C26,\"\")","v":""},{"$f":"IF(Outils!E26=\"Jetés\",Outils!D26,\"\")","v":""},{"$f":"IF(Outils!E26=\"Jetés\",Outils!E26,\"\")","v":""},{"$f":"IF(Outils!E26=\"Jetés\",Outils!F26,\"\")","v":""},{"$f":"IF(Outils!E26=\"Jetés\",Outils!G26,\"\")","v":""}]
[{"$f":"IF(Outils!E27=\"Jetés\",Outils!A27,\"\")","v":""},{"$f":"IF(Outils!E27=\"Jetés\",Outils!B27,\"\")","v":""},{"$f":"IF(Outils!E27=\"Jetés\",Outils!C27,\"\")","v":""},{"$f":"IF(Outils!E27=\"Jetés\",Outils!D27,\"\")","v":""},{"$f":"IF(Outils!E27=\"Jetés\",Outils!E27,\"\")","v":""},{"$f":"IF(Outils!E27=\"Jetés\",Outils!F27,\"\")","v":""},{"$f":"IF(Outils!E27=\"Jetés\",Outils!G27,\"\")","v":""}]
[{"$f":"IF(Outils!E28=\"Jetés\",Outils!A28,\"\")","v":""},{"$f":"IF(Outils!E28=\"Jetés\",Outils!B28,\"\")","v":""},{"$f":"IF(Outils!E28=\"Jetés\",Outils!C28,\"\")","v":""},{"$f":"IF(Outils!E28=\"Jetés\",Outils!D28,\"\")","v":""},{"$f":"IF(Outils!E28=\"Jetés\",Outils!E28,\"\")","v":""},{"$f":"IF(Outils!E28=\"Jetés\",Outils!F28,\"\")","v":""},{"$f":"IF(Outils!E28=\"Jetés\",Outils!G28,\"\")","v":""}]
[{"$f":"IF(Outils!E29=\"Jetés\",Outils!A29,\"\")","v":""},{"$f":"IF(Outils!E29=\"Jetés\",Outils!B29,\"\")","v":""},{"$f":"IF(Outils!E29=\"Jetés\",Outils!C29,\"\")","v":""},{"$f":"IF(Outils!E29=\"Jetés\",Outils!D29,\"\")","v":""},{"$f":"IF(Outils!E29=\"Jetés\",Outils!E29,\"\")","v":""},{"$f":"IF(Outils!E29=\"Jetés\",Outils!F29,\"\")","v":""},{"$f":"IF(Outils!E29=\"Jetés\",Outils!G29,\"\")","v":""}]
[{"$f":"IF(Outils!E30=\"Jetés\",Outils!A30,\"\")","v":""},{"$f":"IF(Outils!E30=\"Jetés\",Outils!B30,\"\")","v":""},{"$f":"IF(Outils!E30=\"Jetés\",Outils!C30,\"\")","v":""},{"$f":"IF(Outils!E30=\"Jetés\",Outils!D30,\"\")","v":""},{"$f":"IF(Outils!E30=\"Jetés\",Outils!E30,\"\")","v":""},{"$f":"IF(Outils!E30=\"Jetés\",Outils!F30,\"\")","v":""},{"$f":"IF(Outils!E30=\"Jetés\",Outils!G30,\"\")","v":""}]
[{"$f":"IF(Outils!E31=\"Jetés\",Outils!A31,\"\")","v":""},{"$f":"IF(Outils!E31=\"Jetés\",Outils!B31,\"\")","v":""},{"$f":"IF(Outils!E31=\"Jetés\",Outils!C31,\"\")","v":""},{"$f":"IF(Outils!E31=\"Jetés\",Outils!D31,\"\")","v":""},{"$f":"IF(Outils!E31=\"Jetés\",Outils!E31,\"\")","v":""},{"$f":"IF(Outils!E31=\"Jetés\",Outils!F31,\"\")","v":""},{"$f":"IF(Outils!E31=\"Jetés\",Outils!G31,\"\")","v":""}]
[{"$f":"IF(Outils!E32=\"Jetés\",Outils!A32,\"\")","v":""},{"$f":"IF(Outils!E32=\"Jetés\",Outils!B32,\"\")","v":""},{"$f":"IF(Outils!E32=\"Jetés\",Outils!C32,\"\")","v":""},{"$f":"IF(Outils!E32=\"Jetés\",Outils!D32,\"\")","v":""},{"$f":"IF(Outils!E32=\"Jetés\",Outils!E32,\"\")","v":""},{"$f":"IF(Outils!E32=\"Jetés\",Outils!F32,\"\")","v":""},{"$f":"IF(Outils!E32=\"Jetés\",Outils!G32,\"\")","v":""}]
[{"$f":"IF(Outils!E33=\"Jetés\",Outils!A33,\"\")","v":""},{"$f":"IF(Outils!E33=\"Jetés\",Outils!B33,\"\")","v":""},{"$f":"IF(Outils!E33=\"Jetés\",Outils!C33,\"\")","v":""},{"$f":"IF(Outils!E33=\"Jetés\",Outils!D33,\"\")","v":""},{"$f":"IF(Outils!E33=\"Jetés\",Outils!E33,\"\")","v":""},{"$f":"IF(Outils!E33=\"Jetés\",Outils!F33,\"\")","v":""},{"$f":"IF(Outils!E33=\"Jetés\",Outils!G33,\"\")","v":""}]
[{"$f":"IF(Outils!E34=\"Jetés\",Outils!A34,\"\")","v":""},{"$f":"IF(Outils!E34=\"Jetés\",Outils!B34,\"\")","v":""},{"$f":"IF(Outils!E34=\"Jetés\",Outils!C34,\"\")","v":""},{"$f":"IF(Outils!E34=\"Jetés\",Outils!D34,\"\")","v":""},{"$f":"IF(Outils!E34=\"Jetés\",Outils!E34,\"\")","v":""},{"$f":"IF(Outils!E34=\"Jetés\",Outils!F34,\"\")","v":""},{"$f":"IF(Outils!E34=\"Jetés\",Outils!G34,\"\")","v":""}]
[{"$f":"IF(Outils!E35=\"Jetés\",Outils!A35,\"\")","v":""},{"$f":"IF(Outils!E35=\"Jetés\",Outils!B35,\"\")","v":""},{"$f":"IF(Outils!E35=\"Jetés\",Outils!C35,\"\")","v":""},{"$f":"IF(Outils!E35=\"Jetés\",Outils!D35,\"\")","v":""},{"$f":"IF(Outils!E35=\"Jetés\",Outils!E35,\"\")","v":""},{"$f":"IF(Outils!E35=\"Jetés\",Outils!F35,\"\")","v":""},{"$f":"IF(Outils!E35=\"Jetés\",Outils!G35,\"\")","v":""}]
[{"$f":"IF(Outils!E36=\"Jetés\",Outils!A36,\"\")","v":""},{"$f":"IF(Outils!E36=\"Jetés\",Outils!B36,\"\")","v":""},{"$f":"IF(Outils!E36=\"Jetés\",Outils!C36,\"\")","v":""},{"$f":"IF(Outils!E36=\"Jetés\",Outils!D36,\"\")","v":""},{"$f":"IF(Outils!E36=\"Jetés\",Outils!E36,\"\")","v":""},{"$f":"IF(Outils!E36=\"Jetés\",Outils!F36,\"\")","v":""},{"$f":"IF(Outils!E36=\"Jetés\",Outils!G36,\"\")","v":""}]
[{"$f":"IF(Outils!E37=\"Jetés\",Outils!A37,\"\")","v":""},{"$f":"IF(Outils!E37=\"Jetés\",Outils!B37,\"\")","v":""},{"$f":"IF(Outils!E37=\"Jetés\",Outils!C37,\"\")","v":""},{"$f":"IF(Outils!E37=\"Jetés\",Outils!D37,\"\")","v":""},{"$f":"IF(Outils!E37=\"Jetés\",Outils!E37,\"\")","v":""},{"$f":"IF(Outils!E37=\"Jetés\",Outils!F37,\"\")","v":""},{"$f":"IF(Outils!E37=\"Jetés\",Outils!G37,\"\")","v":""}]
[{"$f":"IF(Outils!E38=\"Jetés\",Outils!A38,\"\")","v":""},{"$f":"IF(Outils!E38=\"Jetés\",Outils!B38,\"\")","v":""},{"$f":"IF(Outils!E38=\"Jetés\",Outils!C38,\"\")","v":""},{"$f":"IF(Outils!E38=\"Jetés\",Outils!D38,\"\")","v":""},{"$f":"IF(Outils!E38=\"Jetés\",Outils!E38,\"\")","v":""},{"$f":"IF(Outils!E38=\"Jetés\",Outils!F38,\"\")","v":""},{"$f":"IF(Outils!E38=\"Jetés\",Outils!G38,\"\")","v":""}]
[{"$f":"IF(Outils!E39=\"Jetés\",Outils!A39,\"\")","v":""},{"$f":"IF(Outils!E39=\"Jetés\",Outils!B39,\"\")","v":""},{"$f":"IF(Outils!E39=\"Jetés\",Outils!C39,\"\")","v":""},{"$f":"IF(Outils!E39=\"Jetés\",Outils!D39,\"\")","v":""},{"$f":"IF(Outils!E39=\"Jetés\",Outils!E39,\"\")","v":""},{"$f":"IF(Outils!E39=\"Jetés\",Outils!F39,\"\")","v":""},{"$f":"IF(Outils!E39=\"Jetés\",Outils!G39,\"\")","v":""}]
[{"$f":"IF(Outils!E40=\"Jetés\",Outils!A40,\"\")","v":""},{"$f":"IF(Outils!E40=\"Jetés\",Outils!B40,\"\")","v":""},{"$f":"IF(Outils!E40=\"Jetés\",Outils!C40,\"\")","v":""},{"$f":"IF(Outils!E40=\"Jetés\",Outils!D40,\"\")","v":""},{"$f":"IF(Outils!E40=\"Jetés\",Outils!E40,\"\")","v":""},{"$f":"IF(Outils!E40=\"Jetés\",Outils!F40,\"\")","v":""},{"$f":"IF(Outils!E40=\"Jetés\",Outils!G40,\"\")","v":""}]
[{"$f":"IF(Outils!E41=\"Jetés\",Outils!A41,\"\")","v":""},{"$f":"IF(Outils!E41=\"Jetés\",Outils!B41,\"\")","v":""},{"$f":"IF(Outils!E41=\"Jetés\",Outils!C41,\"\")","v":""},{"$f":"IF(Outils!E41=\"Jetés\",Outils!D41,\"\")","v":""},{"$f":"IF(Outils!E41=\"Jetés\",Outils!E41,\"\")","v":""},{"$f":"IF(Outils!E41=\"Jetés\",Outils!F41,\"\")","v":""},{"$f":"IF(Outils!E41=\"Jetés\",Outils!G41,\"\")","v":""}]
[{"$f":"IF(Outils!E42=\"Jetés\",Outils!A42,\"\")","v":""},{"$f":"IF(Outils!E42=\"Jetés\",Outils!B42,\"\")","v":""},{"$f":"IF(Outils!E42=\"Jetés\",Outils!C42,\"\")","v":""},{"$f":"IF(Outils!E42=\"Jetés\",Outils!D42,\"\")","v":""},{"$f":"IF(Outils!E42=\"Jetés\",Outils!E42,\"\")","v":""},{"$f":"IF(Outils!E42=\"Jetés\",Outils!F42,\"\")","v":""},{"$f":"IF(Outils!E42=\"Jetés\",Outils!G42,\"\")","v":""}]
[{"$f":"IF(Outils!E43=\"Jetés\",Outils!A43,\"\")","v":""},{"$f":"IF(Outils!E43=\"Jetés\",Outils!B43,\"\")","v":""},{"$f":"IF(Outils!E43=\"Jetés\",Outils!C43,\"\")","v":""},{"$f":"IF(Outils!E43=\"Jetés\",Outils!D43,\"\")","v":""},{"$f":"IF(Outils!E43=\"Jetés\",Outils!E43,\"\")","v":""},{"$f":"IF(Outils!E43=\"Jetés\",Outils!F43,\"\")","v":""},{"$f":"IF(Outils!E43=\"Jetés\",Outils!G43,\"\")","v":""}]
[{"$f":"IF(Outils!E44=\"Jetés\",Outils!A44,\"\")","v":""},{"$f":"IF(Outils!E44=\"Jetés\",Outils!B44,\"\")","v":""},{"$f":"IF(Outils!E44=\"Jetés\",Outils!C44,\"\")","v":""},{"$f":"IF(Outils!E44=\"Jetés\",Outils!D44,\"\")","v":""},{"$f":"IF(Outils!E44=\"Jetés\",Outils!E44,\"\")","v":""},{"$f":"IF(Outils!E44=\"Jetés\",Outils!F44,\"\")","v":""},{"$f":"IF(Outils!E44=\"Jetés\",Outils!G44,\"\")","v":""}]
[{"$f":"IF(Outils!E45=\"Jetés\",Outils!A45,\"\")","v":""},{"$f":"IF(Outils!E45=\"Jetés\",Outils!B45,\"\")","v":""},{"$f":"IF(Outils!E45=\"Jetés\",Outils!C45,\"\")","v":""},{"$f":"IF(Outils!E45=\"Jetés\",Outils!D45,\"\")","v":""},{"$f":"IF(Outils!E45=\"Jetés\",Outils!E45,\"\")","v":""},{"$f":"IF(Outils!E45=\"Jetés\",Outils!F45,\"\")","v":""},{"$f":"IF(Outils!E45=\"Jetés\",Outils!G45,\"\")","v":""}]
[{"$f":"IF(Outils!E46=\"Jetés\",Outils!A46,\"\")","v":""},{"$f":"IF(Outils!E46=\"Jetés\",Outils!B46,\"\")","v":""},{"$f":"IF(Outils!E46=\"Jetés\",Outils!C46,\"\")","v":""},{"$f":"IF(Outils!E46=\"Jetés\",Outils!D46,\"\")","v":""},{"$f":"IF(Outils!E46=\"Jetés\",Outils!E46,\"\")","v":""},{"$f":"IF(Outils!E46=\"Jetés\",Outils!F46,\"\")","v":""},{"$f":"IF(Outils!E46=\"Jetés\",Outils!G46,\"\")","v":""}]
[{"$f":"IF(Outils!E47=\"Jetés\",Outils!A47,\"\")","v":""},{"$f":"IF(Outils!E47=\"Jetés\",Outils!B47,\"\")","v":""},{"$f":"IF(Outils!E47=\"Jetés\",Outils!C47,\"\")","v":""},{"$f":"IF(Outils!E47=\"Jetés\",Outils!D47,\"\")","v":""},{"$f":"IF(Outils!E47=\"Jetés\",Outils!E47,\"\")","v":""},{"$f":"IF(Outils!E47=\"Jetés\",Outils!F47,\"\")","v":""},{"$f":"IF(Outils!E47=\"Jetés\",Outils!G47,\"\")","v":""}]
[{"$f":"IF(Outils!E48=\"Jetés\",Outils!A48,\"\")","v":""},{"$f":"IF(Outils!E48=\"Jetés\",Outils!B48,\"\")","v":""},{"$f":"IF(Outils!E48=\"Jetés\",Outils!C48,\"\")","v":""},{"$f":"IF(Outils!E48=\"Jetés\",Outils!D48,\"\")","v":""},{"$f":"IF(Outils!E48=\"Jetés\",Outils!E48,\"\")","v":""},{"$f":"IF(Outils!E48=\"Jetés\",Outils!F48,\"\")","v":""},{"$f":"IF(Outils!E48=\"Jetés\",Outils!G48,\"\")","v":""}]
[{"$f":"IF(Outils!E49=\"Jetés\",Outils!A49,\"\")","v":""},{"$f":"IF(Outils!E49=\"Jetés\",Outils!B49,\"\")","v":""},{"$f":"IF(Outils!E49=\"Jetés\",Outils!C49,\"\")","v":""},{"$f":"IF(Outils!E49=\"Jetés\",Outils!D49,\"\")","v":""},{"$f":"IF(Outils!E49=\"Jetés\",Outils!E49,\"\")","v":""},{"$f":"IF(Outils!E49=\"Jetés\",Outils!F49,\"\")","v":""},{"$f":"IF(Outils!E49=\"Jetés\",Outils!G49,\"\")","v":""}]
[{"$f":"IF(Outils!E50=\"Jetés\",Outils!A50,\"\")","v":""},{"$f":"IF(Outils!E50=\"Jetés\",Outils!B50,\"\")","v":""},{"$f":"IF(Outils!E50=\"Jetés\",Outils!C50,\"\")","v":""},{"$f":"IF(Outils!E50=\"Jetés\",Outils!D50,\"\")","v":""},{"$f":"IF(Outils!E50=\"Jetés\",Outils!E50,\"\")","v":""},{"$f":"IF(Outils!E50=\"Jetés\",Outils!F50,\"\")","v":""},{"$f":"IF(Outils!E50=\"Jetés\",Outils!G50,\"\")","v":""}]
[{"$f":"IF(Outils!E51=\"Jetés\",Outils!A51,\"\")","v":""},{"$f":"IF(Outils!E51=\"Jetés\",Outils!B51,\"\")","v":""},{"$f":"IF(Outils!E51=\"Jetés\",Outils!C51,\"\")","v":""},{"$f":"IF(Outils!E51=\"Jetés\",Outils!D51,\"\")","v":""},{"$f":"IF(Outils!E51=\"Jetés\",Outils!E51,\"\")","v":""},{"$f":"IF(Outils!E51=\"Jetés\",Outils!F51,\"\")","v":""},{"$f":"IF(Outils!E51=\"Jetés\",Outils!G51,\"\")","v":""}]
[{"$f":"IF(Outils!E52=\"Jetés\",Outils!A52,\"\")","v":""},{"$f":"IF(Outils!E52=\"Jetés\",Outils!B52,\"\")","v":""},{"$f":"IF(Outils!E52=\"Jetés\",Outils!C52,\"\")","v":""},{"$f":"IF(Outils!E52=\"Jetés\",Outils!D52,\"\")","v":""},{"$f":"IF(Outils!E52=\"Jetés\",Outils!E52,\"\")","v":""},{"$f":"IF(Outils!E52=\"Jetés\",Outils!F52,\"\")","v":""},{"$f":"IF(Outils!E52=\"Jetés\",Outils!G52,\"\")","v":""}]
[{"$f":"IF(Outils!E53=\"Jetés\",Outils!A53,\"\")","v":""},{"$f":"IF(Outils!E53=\"Jetés\",Outils!B53,\"\")","v":""},{"$f":"IF(Outils!E53=\"Jetés\",Outils!C53,\"\")","v":""},{"$f":"IF(Outils!E53=\"Jetés\",Outils!D53,\"\")","v":""},{"$f":"IF(Outils!E53=\"Jetés\",Outils!E53,\"\")","v":""},{"$f":"IF(Outils!E53=\"Jetés\",Outils!F53,\"\")","v":""},{"$f":"IF(Outils!E53=\"Jetés\",Outils!G53,\"\")","v":""}]
[{"$f":"IF(Outils!E54=\"Jetés\",Outils!A54,\"\")","v":""},{"$f":"IF(Outils!E54=\"Jetés\",Outils!B54,\"\")","v":""},{"$f":"IF(Outils!E54=\"Jetés\",Outils!C54,\"\")","v":""},{"$f":"IF(Outils!E54=\"Jetés\",Outils!D54,\"\")","v":""},{"$f":"IF(Outils!E54=\"Jetés\",Outils!E54,\"\")","v":""},{"$f":"IF(Outils!E54=\"Jetés\",Outils!F54,\"\")","v":""},{"$f":"IF(Outils!E54=\"Jetés\",Outils!G54,\"\")","v":""}]
[{"$f":"IF(Outils!E55=\"Jetés\",Outils!A55,\"\")","v":""},{"$f":"IF(Outils!E55=\"Jetés\",Outils!B55,\"\")","v":""},{"$f":"IF(Outils!E55=\"Jetés\",Outils!C55,\"\")","v":""},{"$f":"IF(Outils!E55=\"Jetés\",Outils!D55,\"\")","v":""},{"$f":"IF(Outils!E55=\"Jetés\",Outils!E55,\"\")","v":""},{"$f":"IF(Outils!E55=\"Jetés\",Outils!F55,\"\")","v":""},{"$f":"IF(Outils!E55=\"Jetés\",Outils!G55,\"\")","v":""}]
[{"$f":"IF(Outils!E56=\"Jetés\",Outils!A56,\"\")","v":""},{"$f":"IF(Outils!E56=\"Jetés\",Outils!B56,\"\")","v":""},{"$f":"IF(Outils!E56=\"Jetés\",Outils!C56,\"\")","v":""},{"$f":"IF(Outils!E56=\"Jetés\",Outils!D56,\"\")","v":""},{"$f":"IF(Outils!E56=\"Jetés\",Outils!E56,\"\")","v":""},{"$f":"IF(Outils!E56=\"Jetés\",Outils!F56,\"\")","v":""},{"$f":"IF(Outils!E56=\"Jetés\",Outils!G56,\"\")","v":""}]
[{"$f":"IF(Outils!E57=\"Jetés\",Outils!A57,\"\")","v":""},{"$f":"IF(Outils!E57=\"Jetés\",Outils!B57,\"\")","v":""},{"$f":"IF(Outils!E57=\"Jetés\",Outils!C57,\"\")","v":""},{"$f":"IF(Outils!E57=\"Jetés\",Outils!D57,\"\")","v":""},{"$f":"IF(Outils!E57=\"Jetés\",Outils!E57,\"\")","v":""},{"$f":"IF(Outils!E57=\"Jetés\",Outils!F57,\"\")","v":""},{"$f":"IF(Outils!E57=\"Jetés\",Outils!G57,\"\")","v":""}]
[{"$f":"IF(Outils!E58=\"Jetés\",Outils!A58,\"\")","v":""},{"$f":"IF(Outils!E58=\"Jetés\",Outils!B58,\"\")","v":""},{"$f":"IF(Outils!E58=\"Jetés\",Outils!C58,\"\")","v":""},{"$f":"IF(Outils!E58=\"Jetés\",Outils!D58,\"\")","v":""},{"$f":"IF(Outils!E58=\"Jetés\",Outils!E58,\"\")","v":""},{"$f":"IF(Outils!E58=\"Jetés\",Outils!F58,\"\")","v":""},{"$f":"IF(Outils!E58=\"Jetés\",Outils!G58,\"\")","v":""}]
[{"$f":"IF(Outils!E59=\"Jetés\",Outils!A59,\"\")","v":""},{"$f":"IF(Outils!E59=\"Jetés\",Outils!B59,\"\")","v":""},{"$f":"IF(Outils!E59=\"Jetés\",Outils!C59,\"\")","v":""},{"$f":"IF(Outils!E59=\"Jetés\",Outils!D59,\"\")","v":""},{"$f":"IF(Outils!E59=\"Jetés\",Outils!E59,\"\")","v":""},{"$f":"IF(Outils!E59=\"Jetés\",Outils!F59,\"\")","v":""},{"$f":"IF(Outils!E59=\"Jetés\",Outils!G59,\"\")","v":""}]
[{"$f":"IF(Outils!E60=\"Jetés\",Outils!A60,\"\")","v":""},{"$f":"IF(Outils!E60=\"Jetés\",Outils!B60,\"\")","v":""},{"$f":"IF(Outils!E60=\"Jetés\",Outils!C60,\"\")","v":""},{"$f":"IF(Outils!E60=\"Jetés\",Outils!D60,\"\")","v":""},{"$f":"IF(Outils!E60=\"Jetés\",Outils!E60,\"\")","v":""},{"$f":"IF(Outils!E60=\"Jetés\",Outils!F60,\"\")","v":""},{"$f":"IF(Outils!E60=\"Jetés\",Outils!G60,\"\")","v":""}]
[{"$f":"IF(Outils!E61=\"Jetés\",Outils!A61,\"\")","v":""},{"$f":"IF(Outils!E61=\"Jetés\",Outils!B61,\"\")","v":""},{"$f":"IF(Outils!E61=\"Jetés\",Outils!C61,\"\")","v":""},{"$f":"IF(Outils!E61=\"Jetés\",Outils!D61,\"\")","v":""},{"$f":"IF(Outils!E61=\"Jetés\",Outils!E61,\"\")","v":""},{"$f":"IF(Outils!E61=\"Jetés\",Outils!F61,\"\")","v":""},{"$f":"IF(Outils!E61=\"Jetés\",Outils!G61,\"\")","v":""}]
[{"$f":"IF(Outils!E62=\"Jetés\",Outils!A62,\"\")","v":""},{"$f":"IF(Outils!E62=\"Jetés\",Outils!B62,\"\")","v":""},{"$f":"IF(Outils!E62=\"Jetés\",Outils!C62,\"\")","v":""},{"$f":"IF(Outils!E62=\"Jetés\",Outils!D62,\"\")","v":""},{"$f":"IF(Outils!E62=\"Jetés\",Outils!E62,\"\")","v":""},{"$f":"IF(Outils!E62=\"Jetés\",Outils!F62,\"\")","v":""},{"$f":"IF(Outils!E62=\"Jetés\",Outils!G62,\"\")","v":""}]
[{"$f":"IF(Outils!E63=\"Jetés\",Outils!A63,\"\")","v":""},{"$f":"IF(Outils!E63=\"Jetés\",Outils!B63,\"\")","v":""},{"$f":"IF(Outils!E63=\"Jetés\",Outils!C63,\"\")","v":""},{"$f":"IF(Outils!E63=\"Jetés\",Outils!D63,\"\")","v":""},{"$f":"IF(Outils!E63=\"Jetés\",Outils!E63,\"\")","v":""},{"$f":"IF(Outils!E63=\"Jetés\",Outils!F63,\"\")","v":""},{"$f":"IF(Outils!E63=\"Jetés\",Outils!G63,\"\")","v":""}]
[{"$f":"IF(Outils!E64=\"Jetés\",Outils!A64,\"\")","v":""},{"$f":"IF(Outils!E64=\"Jetés\",Outils!B64,\"\")","v":""},{"$f":"IF(Outils!E64=\"Jetés\",Outils!C64,\"\")","v":""},{"$f":"IF(Outils!E64=\"Jetés\",Outils!D64,\"\")","v":""},{"$f":"IF(Outils!E64=\"Jetés\",Outils!E64,\"\")","v":""},{"$f":"IF(Outils!E64=\"Jetés\",Outils!F64,\"\")","v":""},{"$f":"IF(Outils!E64=\"Jetés\",Outils!G64,\"\")","v":""}]
[{"$f":"IF(Outils!E65=\"Jetés\",Outils!A65,\"\")","v":""},{"$f":"IF(Outils!E65=\"Jetés\",Outils!B65,\"\")","v":""},{"$f":"IF(Outils!E65=\"Jetés\",Outils!C65,\"\")","v":""},{"$f":"IF(Outils!E65=\"Jetés\",Outils!D65,\"\")","v":""},{"$f":"IF(Outils!E65=\"Jetés\",Outils!E65,\"\")","v":""},{"$f":"IF(Outils!E65=\"Jetés\",Outils!F65,\"\")","v":""},{"$f":"IF(Outils!E65=\"Jetés\",Outils!G65,\"\")","v":""}]
[{"$f":"IF(Outils!E66=\"Jetés\",Outils!A66,\"\")","v":""},{"$f":"IF(Outils!E66=\"Jetés\",Outils!B66,\"\")","v":""},{"$f":"IF(Outils!E66=\"Jetés\",Outils!C66,\"\")","v":""},{"$f":"IF(Outils!E66=\"Jetés\",Outils!D66,\"\")","v":""},{"$f":"IF(Outils!E66=\"Jetés\",Outils!E66,\"\")","v":""},{"$f":"IF(Outils!E66=\"Jetés\",Outils!F66,\"\")","v":""},{"$f":"IF(Outils!E66=\"Jetés\",Outils!G66,\"\")","v":""}]
[{"$f":"IF(Outils!E67=\"Jetés\",Outils!A67,\"\")","v":""},{"$f":"IF(Outils!E67=\"Jetés\",Outils!B67,\"\")","v":""},{"$f":"IF(Outils!E67=\"Jetés\",Outils!C67,\"\")","v":""},{"$f":"IF(Outils!E67=\"Jetés\",Outils!D67,\"\")","v":""},{"$f":"IF(Outils!E67=\"Jetés\",Outils!E67,\"\")","v":""},{"$f":"IF(Outils!E67=\"Jetés\",Outils!F67,\"\")","v":""},{"$f":"IF(Outils!E67=\"Jetés\",Outils!G67,\"\")","v":""}]
[{"$f":"IF(Outils!E68=\"Jetés\",Outils!A68,\"\")","v":""},{"$f":"IF(Outils!E68=\"Jetés\",Outils!B68,\"\")","v":""},{"$f":"IF(Outils!E68=\"Jetés\",Outils!C68,\"\")","v":""},{"$f":"IF(Outils!E68=\"Jetés\",Outils!D68,\"\")","v":""},{"$f":"IF(Outils!E68=\"Jetés\",Outils!E68,\"\")","v":""},{"$f":"IF(Outils!E68=\"Jetés\",Outils!F68,\"\")","v":""},{"$f":"IF(Outils!E68=\"Jetés\",Outils!G68,\"\")","v":""}]
[{"$f":"IF(Outils!E69=\"Jetés\",Outils!A69,\"\")","v":""},{"$f":"IF(Outils!E69=\"Jetés\",Outils!B69,\"\")","v":""},{"$f":"IF(Outils!E69=\"Jetés\",Outils!C69,\"\")","v":""},{"$f":"IF(Outils!E69=\"Jetés\",Outils!D69,\"\")","v":""},{"$f":"IF(Outils!E69=\"Jetés\",Outils!E69,\"\")","v":""},{"$f":"IF(Outils!E69=\"Jetés\",Outils!F69,\"\")","v":""},{"$f":"IF(Outils!E69=\"Jetés\",Outils!G69,\"\")","v":""}]
[{"$f":"IF(Outils!E70=\"Jetés\",Outils!A70,\"\")","v":""},{"$f":"IF(Outils!E70=\"Jetés\",Outils!B70,\"\")","v":""},{"$f":"IF(Outils!E70=\"Jetés\",Outils!C70,\"\")","v":""},{"$f":"IF(Outils!E70=\"Jetés\",Outils!D70,\"\")","v":""},{"$f":"IF(Outils!E70=\"Jetés\",Outils!E70,\"\")","v":""},{"$f":"IF(Outils!E70=\"Jetés\",Outils!F70,\"\")","v":""},{"$f":"IF(Outils!E70=\"Jetés\",Outils!G70,\"\")","v":""}]
[{"$f":"IF(Outils!E71=\"Jetés\",Outils!A71,\"\")","v":""},{"$f":"IF(Outils!E71=\"Jetés\",Outils!B71,\"\")","v":""},{"$f":"IF(Outils!E71=\"Jetés\",Outils!C71,\"\")","v":""},{"$f":"IF(Outils!E71=\"Jetés\",Outils!D71,\"\")","v":""},{"$f":"IF(Outils!E71=\"Jetés\",Outils!E71,\"\")","v":""},{"$f":"IF(Outils!E71=\"Jetés\",Outils!F71,\"\")","v":""},{"$f":"IF(Outils!E71=\"Jetés\",Outils!G71,\"\")","v":""}]
[{"$f":"IF(Outils!E72=\"Jetés\",Outils!A72,\"\")","v":""},{"$f":"IF(Outils!E72=\"Jetés\",Outils!B72,\"\")","v":""},{"$f":"IF(Outils!E72=\"Jetés\",Outils!C72,\"\")","v":""},{"$f":"IF(Outils!E72=\"Jetés\",Outils!D72,\"\")","v":""},{"$f":"IF(Outils!E72=\"Jetés\",Outils!E72,\"\")","v":""},{"$f":"IF(Outils!E72=\"Jetés\",Outils!F72,\"\")","v":""},{"$f":"IF(Outils!E72=\"Jetés\",Outils!G72,\"\")","v":""}]
[{"$f":"IF(Outils!E73=\"Jetés\",Outils!A73,\"\")","v":""},{"$f":"IF(Outils!E73=\"Jetés\",Outils!B73,\"\")","v":""},{"$f":"IF(Outils!E73=\"Jetés\",Outils!C73,\"\")","v":""},{"$f":"IF(Outils!E73=\"Jetés\",Outils!D73,\"\")","v":""},{"$f":"IF(Outils!E73=\"Jetés\",Outils!E73,\"\")","v":""},{"$f":"IF(Outils!E73=\"Jetés\",Outils!F73,\"\")","v":""},{"$f":"IF(Outils!E73=\"Jetés\",Outils!G73,\"\")","v":""}]
[{"$f":"IF(Outils!E74=\"Jetés\",Outils!A74,\"\")","v":""},{"$f":"IF(Outils!E74=\"Jetés\",Outils!B74,\"\")","v":""},{"$f":"IF(Outils!E74=\"Jetés\",Outils!C74,\"\")","v":""},{"$f":"IF(Outils!E74=\"Jetés\",Outils!D74,\"\")","v":""},{"$f":"IF(Outils!E74=\"Jetés\",Outils!E74,\"\")","v":""},{"$f":"IF(Outils!E74=\"Jetés\",Outils!F74,\"\")","v":""},{"$f":"IF(Outils!E74=\"Jetés\",Outils!G74,\"\")","v":""}]
[{"$f":"IF(Outils!E75=\"Jetés\",Outils!A75,\"\")","v":""},{"$f":"IF(Outils!E75=\"Jetés\",Outils!B75,\"\")","v":""},{"$f":"IF(Outils!E75=\"Jetés\",Outils!C75,\"\")","v":""},{"$f":"IF(Outils!E75=\"Jetés\",Outils!D75,\"\")","v":""},{"$f":"IF(Outils!E75=\"Jetés\",Outils!E75,\"\")","v":""},{"$f":"IF(Outils!E75=\"Jetés\",Outils!F75,\"\")","v":""},{"$f":"IF(Outils!E75=\"Jetés\",Outils!G75,\"\")","v":""}]
[{"$f":"IF(Outils!E76=\"Jetés\",Outils!A76,\"\")","v":""},{"$f":"IF(Outils!E76=\"Jetés\",Outils!B76,\"\")","v":""},{"$f":"IF(Outils!E76=\"Jetés\",Outils!C76,\"\")","v":""},{"$f":"IF(Outils!E76=\"Jetés\",Outils!D76,\"\")","v":""},{"$f":"IF(Outils!E76=\"Jetés\",Outils!E76,\"\")","v":""},{"$f":"IF(Outils!E76=\"Jetés\",Outils!F76,\"\")","v":""},{"$f":"IF(Outils!E76=\"Jetés\",Outils!G76,\"\")","v":""}]
[{"$f":"IF(Outils!E77=\"Jetés\",Outils!A77,\"\")","v":""},{"$f":"IF(Outils!E77=\"Jetés\",Outils!B77,\"\")","v":""},{"$f":"IF(Outils!E77=\"Jetés\",Outils!C77,\"\")","v":""},{"$f":"IF(Outils!E77=\"Jetés\",Outils!D77,\"\")","v":""},{"$f":"IF(Outils!E77=\"Jetés\",Outils!E77,\"\")","v":""},{"$f":"IF(Outils!E77=\"Jetés\",Outils!F77,\"\")","v":""},{"$f":"IF(Outils!E77=\"Jetés\",Outils!G77,\"\")","v":""}]
[{"$f":"IF(Outils!E78=\"Jetés\",Outils!A78,\"\")","v":""},{"$f":"IF(Outils!E78=\"Jetés\",Outils!B78,\"\")","v":""},{"$f":"IF(Outils!E78=\"Jetés\",Outils!C78,\"\")","v":""},{"$f":"IF(Outils!E78=\"Jetés\",Outils!D78,\"\")","v":""},{"$f":"IF(Outils!E78=\"Jetés\",Outils!E78,\"\")","v":""},{"$f":"IF(Outils!E78=\"Jetés\",Outils!F78,\"\")","v":""},{"$f":"IF(Outils!E78=\"Jetés\",Outils!G78,\"\")","v":""}]
[{"$f":"IF(Outils!E79=\"Jetés\",Outils!A79,\"\")","v":""},{"$f":"IF(Outils!E79=\"Jetés\",Outils!B79,\"\")","v":""},{"$f":"IF(Outils!E79=\"Jetés\",Outils!C79,\"\")","v":""},{"$f":"IF(Outils!E79=\"Jetés\",Outils!D79,\"\")","v":""},{"$f":"IF(Outils!E79=\"Jetés\",Outils!E79,\"\")","v":""},{"$f":"IF(Outils!E79=\"Jetés\",Outils!F79,\"\")","v":""},{"$f":"IF(Outils!E79=\"Jetés\",Outils!G79,\"\")","v":""}]
[{"$f":"IF(Outils!E80=\"Jetés\",Outils!A80,\"\")","v":""},{"$f":"IF(Outils!E80=\"Jetés\",Outils!B80,\"\")","v":""},{"$f":"IF(Outils!E80=\"Jetés\",Outils!C80,\"\")","v":""},{"$f":"IF(Outils!E80=\"Jetés\",Outils!D80,\"\")","v":""},{"$f":"IF(Outils!E80=\"Jetés\",Outils!E80,\"\")","v":""},{"$f":"IF(Outils!E80=\"Jetés\",Outils!F80,\"\")","v":""},{"$f":"IF(Outils!E80=\"Jetés\",Outils!G80,\"\")","v":""}]
[{"$f":"IF(Outils!E81=\"Jetés\",Outils!A81,\"\")","v":""},{"$f":"IF(Outils!E81=\"Jetés\",Outils!B81,\"\")","v":""},{"$f":"IF(Outils!E81=\"Jetés\",Outils!C81,\"\")","v":""},{"$f":"IF(Outils!E81=\"Jetés\",Outils!D81,\"\")","v":""},{"$f":"IF(Outils!E81=\"Jetés\",Outils!E81,\"\")","v":""},{"$f":"IF(Outils!E81=\"Jetés\",Outils!F81,\"\")","v":""},{"$f":"IF(Outils!E81=\"Jetés\",Outils!G81,\"\")","v":""}]
[{"$f":"IF(Outils!E82=\"Jetés\",Outils!A82,\"\")","v":""},{"$f":"IF(Outils!E82=\"Jetés\",Outils!B82,\"\")","v":""},{"$f":"IF(Outils!E82=\"Jetés\",Outils!C82,\"\")","v":""},{"$f":"IF(Outils!E82=\"Jetés\",Outils!D82,\"\")","v":""},{"$f":"IF(Outils!E82=\"Jetés\",Outils!E82,\"\")","v":""},{"$f":"IF(Outils!E82=\"Jetés\",Outils!F82,\"\")","v":""},{"$f":"IF(Outils!E82=\"Jetés\",Outils!G82,\"\")","v":""}]
[{"$f":"IF(Outils!E83=\"Jetés\",Outils!A83,\"\")","v":""},{"$f":"IF(Outils!E83=\"Jetés\",Outils!B83,\"\")","v":""},{"$f":"IF(Outils!E83=\"Jetés\",Outils!C83,\"\")","v":""},{"$f":"IF(Outils!E83=\"Jetés\",Outils!D83,\"\")","v":""},{"$f":"IF(Outils!E83=\"Jetés\",Outils!E83,\"\")","v":""},{"$f":"IF(Outils!E83=\"Jetés\",Outils!F83,\"\")","v":""},{"$f":"IF(Outils!E83=\"Jetés\",Outils!G83,\"\")","v":""}]
[{"$f":"IF(Outils!E84=\"Jetés\",Outils!A84,\"\")","v":""},{"$f":"IF(Outils!E84=\"Jetés\",Outils!B84,\"\")","v":""},{"$f":"IF(Outils!E84=\"Jetés\",Outils!C84,\"\")","v":""},{"$f":"IF(Outils!E84=\"Jetés\",Outils!D84,\"\")","v":""},{"$f":"IF(Outils!E84=\"Jetés\",Outils!E84,\"\")","v":""},{"$f":"IF(Outils!E84=\"Jetés\",Outils!F84,\"\")","v":""},{"$f":"IF(Outils!E84=\"Jetés\",Outils!G84,\"\")","v":""}]
[{"$f":"IF(Outils!E85=\"Jetés\",Outils!A85,\"\")","v":""},{"$f":"IF(Outils!E85=\"Jetés\",Outils!B85,\"\")","v":""},{"$f":"IF(Outils!E85=\"Jetés\",Outils!C85,\"\")","v":""},{"$f":"IF(Outils!E85=\"Jetés\",Outils!D85,\"\")","v":""},{"$f":"IF(Outils!E85=\"Jetés\",Outils!E85,\"\")","v":""},{"$f":"IF(Outils!E85=\"Jetés\",Outils!F85,\"\")","v":""},{"$f":"IF(Outils!E85=\"Jetés\",Outils!G85,\"\")","v":""}]
[{"$f":"IF(Outils!E86=\"Jetés\",Outils!A86,\"\")","v":""},{"$f":"IF(Outils!E86=\"Jetés\",Outils!B86,\"\")","v":""},{"$f":"IF(Outils!E86=\"Jetés\",Outils!C86,\"\")","v":""},{"$f":"IF(Outils!E86=\"Jetés\",Outils!D86,\"\")","v":""},{"$f":"IF(Outils!E86=\"Jetés\",Outils!E86,\"\")","v":""},{"$f":"IF(Outils!E86=\"Jetés\",Outils!F86,\"\")","v":""},{"$f":"IF(Outils!E86=\"Jetés\",Outils!G86,\"\")","v":""}]
[{"$f":"IF(Outils!E87=\"Jetés\",Outils!A87,\"\")","v":""},{"$f":"IF(Outils!E87=\"Jetés\",Outils!B87,\"\")","v":""},{"$f":"IF(Outils!E87=\"Jetés\",Outils!C87,\"\")","v":""},{"$f":"IF(Outils!E87=\"Jetés\",Outils!D87,\"\")","v":""},{"$f":"IF(Outils!E87=\"Jetés\",Outils!E87,\"\")","v":""},{"$f":"IF(Outils!E87=\"Jetés\",Outils!F87,\"\")","v":""},{"$f":"IF(Outils!E87=\"Jetés\",Outils!G87,\"\")","v":""}]
[{"$f":"IF(Outils!E88=\"Jetés\",Outils!A88,\"\")","v":""},{"$f":"IF(Outils!E88=\"Jetés\",Outils!B88,\"\")","v":""},{"$f":"IF(Outils!E88=\"Jetés\",Outils!C88,\"\")","v":""},{"$f":"IF(Outils!E88=\"Jetés\",Outils!D88,\"\")","v":""},{"$f":"IF(Outils!E88=\"Jetés\",Outils!E88,\"\")","v":""},{"$f":"IF(Outils!E88=\"Jetés\",Outils!F88,\"\")","v":""},{"$f":"IF(Outils!E88=\"Jetés\",Outils!G88,\"\")","v":""}]
[{"$f":"IF(Outils!E89=\"Jetés\",Outils!A89,\"\")","v":""},{"$f":"IF(Outils!E89=\"Jetés\",Outils!B89,\"\")","v":""},{"$f":"IF(Outils!E89=\"Jetés\",Outils!C89,\"\")","v":""},{"$f":"IF(Outils!E89=\"Jetés\",Outils!D89,\"\")","v":""},{"$f":"IF(Outils!E89=\"Jetés\",Outils!E89,\"\")","v":""},{"$f":"IF(Outils!E89=\"Jetés\",Outils!F89,\"\")","v":""},{"$f":"IF(Outils!E89=\"Jetés\",Outils!G89,\"\")","v":""}]
[{"$f":"IF(Outils!E90=\"Jetés\",Outils!A90,\"\")","v":""},{"$f":"IF(Outils!E90=\"Jetés\",Outils!B90,\"\")","v":""},{"$f":"IF(Outils!E90=\"Jetés\",Outils!C90,\"\")","v":""},{"$f":"IF(Outils!E90=\"Jetés\",Outils!D90,\"\")","v":""},{"$f":"IF(Outils!E90=\"Jetés\",Outils!E90,\"\")","v":""},{"$f":"IF(Outils!E90=\"Jetés\",Outils!F90,\"\")","v":""},{"$f":"IF(Outils!E90=\"Jetés\",Outils!G90,\"\")","v":""}]
[{"$f":"IF(Outils!E91=\"Jetés\",Outils!A91,\"\")","v":""},{"$f":"IF(Outils!E91=\"Jetés\",Outils!B91,\"\")","v":""},{"$f":"IF(Outils!E91=\"Jetés\",Outils!C91,\"\")","v":""},{"$f":"IF(Outils!E91=\"Jetés\",Outils!D91,\"\")","v":""},{"$f":"IF(Outils!E91=\"Jetés\",Outils!E91,\"\")","v":""},{"$f":"IF(Outils!E91=\"Jetés\",Outils!F91,\"\")","v":""},{"$f":"IF(Outils!E91=\"Jetés\",Outils!G91,\"\")","v":""}]
[{"$f":"IF(Outils!E92=\"Jetés\",Outils!A92,\"\")","v":""},{"$f":"IF(Outils!E92=\"Jetés\",Outils!B92,\"\")","v":""},{"$f":"IF(Outils!E92=\"Jetés\",Outils!C92,\"\")","v":""},{"$f":"IF(Outils!E92=\"Jetés\",Outils!D92,\"\")","v":""},{"$f":"IF(Outils!E92=\"Jetés\",Outils!E92,\"\")","v":""},{"$f":"IF(Outils!E92=\"Jetés\",Outils!F92,\"\")","v":""},{"$f":"IF(Outils!E92=\"Jetés\",Outils!G92,\"\")","v":""}]
[{"$f":"IF(Outils!E93=\"Jetés\",Outils!A93,\"\")","v":""},{"$f":"IF(Outils!E93=\"Jetés\",Outils!B93,\"\")","v":""},{"$f":"IF(Outils!E93=\"Jetés\",Outils!C93,\"\")","v":""},{"$f":"IF(Outils!E93=\"Jetés\",Outils!D93,\"\")","v":""},{"$f":"IF(Outils!E93=\"Jetés\",Outils!E93,\"\")","v":""},{"$f":"IF(Outils!E93=\"Jetés\",Outils!F93,\"\")","v":""},{"$f":"IF(Outils!E93=\"Jetés\",Outils!G93,\"\")","v":""}]
[{"$f":"IF(Outils!E94=\"Jetés\",Outils!A94,\"\")","v":""},{"$f":"IF(Outils!E94=\"Jetés\",Outils!B94,\"\")","v":""},{"$f":"IF(Outils!E94=\"Jetés\",Outils!C94,\"\")","v":""},{"$f":"IF(Outils!E94=\"Jetés\",Outils!D94,\"\")","v":""},{"$f":"IF(Outils!E94=\"Jetés\",Outils!E94,\"\")","v":""},{"$f":"IF(Outils!E94=\"Jetés\",Outils!F94,\"\")","v":""},{"$f":"IF(Outils!E94=\"Jetés\",Outils!G94,\"\")","v":""}]
[{"$f":"IF(Outils!E95=\"Jetés\",Outils!A95,\"\")","v":""},{"$f":"IF(Outils!E95=\"Jetés\",Outils!B95,\"\")","v":""},{"$f":"IF(Outils!E95=\"Jetés\",Outils!C95,\"\")","v":""},{"$f":"IF(Outils!E95=\"Jetés\",Outils!D95,\"\")","v":""},{"$f":"IF(Outils!E95=\"Jetés\",Outils!E95,\"\")","v":""},{"$f":"IF(Outils!E95=\"Jetés\",Outils!F95,\"\")","v":""},{"$f":"IF(Outils!E95=\"Jetés\",Outils!G95,\"\")","v":""}]
[{"$f":"IF(Outils!E96=\"Jetés\",Outils!A96,\"\")","v":""},{"$f":"IF(Outils!E96=\"Jetés\",Outils!B96,\"\")","v":""},{"$f":"IF(Outils!E96=\"Jetés\",Outils!C96,\"\")","v":""},{"$f":"IF(Outils!E96=\"Jetés\",Outils!D96,\"\")","v":""},{"$f":"IF(Outils!E96=\"Jetés\",Outils!E96,\"\")","v":""},{"$f":"IF(Outils!E96=\"Jetés\",Outils!F96,\"\")","v":""},{"$f":"IF(Outils!E96=\"Jetés\",Outils!G96,\"\")","v":""}]
[{"$f":"IF(Outils!E97=\"Jetés\",Outils!A97,\"\")","v":""},{"$f":"IF(Outils!E97=\"Jetés\",Outils!B97,\"\")","v":""},{"$f":"IF(Outils!E97=\"Jetés\",Outils!C97,\"\")","v":""},{"$f":"IF(Outils!E97=\"Jetés\",Outils!D97,\"\")","v":""},{"$f":"IF(Outils!E97=\"Jetés\",Outils!E97,\"\")","v":""},{"$f":"IF(Outils!E97=\"Jetés\",Outils!F97,\"\")","v":""},{"$f":"IF(Outils!E97=\"Jetés\",Outils!G97,\"\")","v":""}]
[{"$f":"IF(Outils!E98=\"Jetés\",Outils!A98,\"\")","v":""},{"$f":"IF(Outils!E98=\"Jetés\",Outils!B98,\"\")","v":""},{"$f":"IF(Outils!E98=\"Jetés\",Outils!C98,\"\")","v":""},{"$f":"IF(Outils!E98=\"Jetés\",Outils!D98,\"\")","v":""},{"$f":"IF(Outils!E98=\"Jetés\",Outils!E98,\"\")","v":""},{"$f":"IF(Outils!E98=\"Jetés\",Outils!F98,\"\")","v":""},{"$f":"IF(Outils!E98=\"Jetés\",Outils!G98,\"\")","v":""}]
[{"$f":"IF(Outils!E99=\"Jetés\",Outils!A99,\"\")","v":""},{"$f":"IF(Outils!E99=\"Jetés\",Outils!B99,\"\")","v":""},{"$f":"IF(Outils!E99=\"Jetés\",Outils!C99,\"\")","v":""},{"$f":"IF(Outils!E99=\"Jetés\",Outils!D99,\"\")","v":""},{"$f":"IF(Outils!E99=\"Jetés\",Outils!E99,\"\")","v":""},{"$f":"IF(Outils!E99=\"Jetés\",Outils!F99,\"\")","v":""},{"$f":"IF(Outils!E99=\"Jetés\",Outils!G99,\"\")","v":""}]
[{"$f":"IF(Outils!E100=\"Jetés\",Outils!A100,\"\")","v":""},{"$f":"IF(Outils!E100=\"Jetés\",Outils!B100,\"\")","v":""},{"$f":"IF(Outils!E100=\"Jetés\",Outils!C100,\"\")","v":""},{"$f":"IF(Outils!E100=\"Jetés\",Outils!D100,\"\")","v":""},{"$f":"IF(Outils!E100=\"Jetés\",Outils!E100,\"\")","v":""},{"$f":"IF(Outils!E100=\"Jetés\",Outils!F100,\"\")","v":""},{"$f":"IF(Outils!E100=\"Jetés\",Outils!G100,\"\")","v":""}]
[{"$f":"IF(Outils!E101=\"Jetés\",Outils!A101,\"\")","v":""},{"$f":"IF(Outils!E101=\"Jetés\",Outils!B101,\"\")","v":""},{"$f":"IF(Outils!E101=\"Jetés\",Outils!C101,\"\")","v":""},{"$f":"IF(Outils!E101=\"Jetés\",Outils!D101,\"\")","v":""},{"$f":"IF(Outils!E101=\"Jetés\",Outils!E101,\"\")","v":""},{"$f":"IF(Outils!E101=\"Jetés\",Outils!F101,\"\")","v":""},{"$f":"IF(Outils!E101=\"Jetés\",Outils!G101,\"\")","v":""}]
[{"$f":"IF(Outils!E102=\"Jetés\",Outils!A102,\"\")","v":""},{"$f":"IF(Outils!E102=\"Jetés\",Outils!B102,\"\")","v":""},{"$f":"IF(Outils!E102=\"Jetés\",Outils!C102,\"\")","v":""},{"$f":"IF(Outils!E102=\"Jetés\",Outils!D102,\"\")","v":""},{"$f":"IF(Outils!E102=\"Jetés\",Outils!E102,\"\")","v":""},{"$f":"IF(Outils!E102=\"Jetés\",Outils!F102,\"\")","v":""},{"$f":"IF(Outils!E102=\"Jetés\",Outils!G102,\"\")","v":""}]

{"sheet":"Menu déroulant","index":4,"n_rows":6,"n_cols":2,"rows_kept":6,"cut":false,"hidden":false,"merged":[]}
["Département","État"]
[]
["Mécanique","En Réparation/Calibration"]
["Composite","Jetés"]
[null,"Au Chantier"]
[null,"A la Shop"]