{"text_format":"1","workbook":"xlsx","n_sheets":7,"sheets":["Base","Jaugeage","BDDG","M.M.I.A 104","Evolution ds le tps","BDD 104","Météo"],"not_rendered":{"charts":2,"images":0,"macros":1,"external_links":1,"defined_names":25,"comments":0,"pivot_tables":1},"unopened":[],"bounds":{"document_bytes":16777216,"sheet_cells":100000,"rows_first":2000,"rows_last":500,"rows_between":2000,"halvings":0,"cell_chars":16384,"cell_head_chars":4096},"cells_cut":0,"cells_raw":0,"read":"whole","date_system":"1900"}

{"sheet":"Base","index":0,"n_rows":87,"n_cols":13,"rows_kept":87,"cut":false,"hidden":false,"merged":[]}
[1,2,3,4,5,6,7,8,9,10,11,12,13]
["Code","Vol 1","Temps 1","Total1","Vol 2","Temps 2","Total2","Vol 3","Temps 3","Total3","Vol 4","Temps 4","Total4"]
[801,null,null,null,null,null,null,"xxxxxxxxxx","xxxxxxxxxx","xxxxxxxxxx","xxxxxxxxxx","xxxxxxxxxx","xxxxxxxxxx"]
[804,null,null,null,"xxxxxxxxxx","xxxxxxxxxx","xxxxxxxxxx","xxxxxxxxxx","xxxxxxxxxx","xxxxxxxxxx","xxxxxxxxxx","xxxxxxxxxx","xxxxxxxxxx"]
[805,null,null,null,"xxxxxxxxxx","xxxxxxxxxx","xxxxxxxxxx","xxxxxxxxxx","xxxxxxxxxx","xxxxxxxxxx","xxxxxxxxxx","xxxxxxxxxx","xxxxxxxxxx"]
[806,null,null,null,"xxxxxxxxxx","xxxxxxxxxx","xxxxxxxxxx","xxxxxxxxxx","xxxxxxxxxx","xxxxxxxxxx","xxxxxxxxxx","xxxxxxxxxx","xxxxxxxxxx"]
[5000,null,null,null,null,null,null,"xxxxxxxxxx","xxxxxxxxxx","xxxxxxxxxx","xxxxxxxxxx","xxxxxxxxxx","xxxxxxxxxx"]
[807,null,null,null,"xxxxxxxxxx","xxxxxxxxxx","xxxxxxxxxx","xxxxxxxxxx","xxxxxxxxxx","xxxxxxxxxx","xxxxxxxxxx","xxxxxxxxxx","xxxxxxxxxx"]
[808,null,null,null,"xxxxxxxxxx","xxxxxxxxxx","xxxxxxxxxx","xxxxxxxxxx","xxxxxxxxxx","xxxxxxxxxx","xxxxxxxxxx","xxxxxxxxxx","xxxxxxxxxx"]
[6000,null,null,null,null,null,null,"xxxxxxxxxx","xxxxxxxxxx","xxxxxxxxxx","xxxxxxxxxx","xxxxxxxxxx","xxxxxxxxxx"]
[809,"xxxxxxxxxx","xxxxxxxxxx","xxxxxxxxxx",null,null,null,"xxxxxxxxxx","xxxxxxxxxx","xxxxxxxxxx","xxxxxxxxxx","xxxxxxxxxx","xxxxxxxxxx"]
[810,"xxxxxxxxxx","xxxxxxxxxx","xxxxxxxxxx",null,null,null,"xxxxxxxxxx","xxxxxxxxxx","xxxxxxxxxx","xxxxxxxxxx","xxxxxxxxxx","xxxxxxxxxx"]
[4000,null,null,null,null,null,null,"xxxxxxxxxx","xxxxxxxxxx","xxxxxxxxxx","xxxxxxxxxx","xxxxxxxxxx","xxxxxxxxxx"]
[811,null,null,"xxxxxxxxxx","xxxxxxxxxx","xxxxxxxxxx","xxxxxxxxxx","xxxxxxxxxx","xxxxxxxxxx","xxxxxxxxxx","xxxxxxxxxx","xxxxxxxxxx","xxxxxxxxxx"]
[812,null,null,"xxxxxxxxxx","xxxxxxxxxx","xxxxxxxxxx","xxxxxxxxxx","xxxxxxxxxx","xxxxxxxxxx","xxxxxxxxxx","xxxxxxxxxx","xxxxxxxxxx","xxxxxxxxxx"]
[813,null,null,"xxxxxxxxxx","xxxxxxxxxx","xxxxxxxxxx","xxxxxxxxxx","xxxxxxxxxx","xxxxxxxxxx","xxxxxxxxxx","xxxxxxxxxx","xxxxxxxxxx","xxxxxxxxxx"]
[814,"xxxxxxxxxx","xxxxxxxxxx","xxxxxxxxxx","xxxxxxxxxx","xxxxxxxxxx","xxxxxxxxxx","xxxxxxxxxx","xxxxxxxxxx","xxxxxxxxxx","xxxxxxxxxx","xxxxxxxxxx","xxxxxxxxxx"]
[816,null,null,null,null,null,null,null,null,null,"xxxxxxxxxx","xxxxxxxxxx","xxxxxxxxxx"]
[817,"xxxxxxxxxx","xxxxxxxxxx","xxxxxxxxxx",null,null,null,"xxxxxxxxxx","xxxxxxxxxx","xxxxxxxxxx","xxxxxxxxxx","xxxxxxxxxx","xxxxxxxxxx"]
[1000,null,null,null,null,null,null,"xxxxxxxxxx","xxxxxxxxxx","xxxxxxxxxx","xxxxxxxxxx","xxxxxxxxxx","xxxxxxxxxx"]
[818,null,null,null,"xxxxxxxxxx","xxxxxxxxxx","xxxxxxxxxx","xxxxxxxxxx","xxxxxxxxxx","xxxxxxxxxx","xxxxxxxxxx","xxxxxxxxxx","xxxxxxxxxx"]
[819,"xxxxxxxxxx","xxxxxxxxxx","xxxxxxxxxx","xxxxxxxxxx","xxxxxxxxxx","xxxxxxxxxx","xxxxxxxxxx","xxxxxxxxxx","xxxxxxxxxx","xxxxxxxxxx","xxxxxxxxxx","xxxxxxxxxx"]
[820,null,null,null,"xxxxxxxxxx","xxxxxxxxxx","xxxxxxxxxx","xxxxxxxxxx","xxxxxxxxxx","xxxxxxxxxx","xxxxxxxxxx","xxxxxxxxxx","xxxxxxxxxx"]
[821,null,null,null,null,null,null,"xxxxxxxxxx","xxxxxxxxxx","xxxxxxxxxx","xxxxxxxxxx","xxxxxxxxxx","xxxxxxxxxx"]
[881,null,null,null,"xxxxxxxxxx","xxxxxxxxxx","xxxxxxxxxx","xxxxxxxxxx","xxxxxxxxxx","xxxxxxxxxx","xxxxxxxxxx","xxxxxxxxxx","xxxxxxxxxx"]
[823,null,null,null,"xxxxxxxxxx","xxxxxxxxxx","xxxxxxxxxx","xxxxxxxxxx","xxxxxxxxxx","xxxxxxxxxx","xxxxxxxxxx","xxxxxxxxxx","xxxxxxxxxx"]
[824,null,null,null,"xxxxxxxxxx","xxxxxxxxxx","xxxxxxxxxx","xxxxxxxxxx","xxxxxxxxxx","xxxxxxxxxx","xxxxxxxxxx","xxxxxxxxxx","xxxxxxxxxx"]
[825,null,null,null,null,null,null,"xxxxxxxxxx","xxxxxxxxxx","xxxxxxxxxx","xxxxxxxxxx","xxxxxxxxxx","xxxxxxxxxx"]
[826,null,null,null,"xxxxxxxxxx","xxxxxxxxxx","xxxxxxxxxx","xxxxxxxxxx","xxxxxxxxxx","xxxxxxxxxx","xxxxxxxxxx","xxxxxxxxxx","xxxxxxxxxx"]
[828,null,null,null,"xxxxxxxxxx","xxxxxxxxxx","xxxxxxxxxx","xxxxxxxxxx","xxxxxxxxxx","xxxxxxxxxx","xxxxxxxxxx","xxxxxxxxxx","xxxxxxxxxx"]
[829,null,null,null,"xxxxxxxxxx","xxxxxxxxxx","xxxxxxxxxx","xxxxxxxxxx","xxxxxxxxxx","xxxxxxxxxx","xxxxxxxxxx","xxxxxxxxxx","xxxxxxxxxx"]
[831,null,null,null,"xxxxxxxxxx","xxxxxxxxxx","xxxxxxxxxx","xxxxxxxxxx","xxxxxxxxxx","xxxxxxxxxx","xxxxxxxxxx","xxxxxxxxxx","xxxxxxxxxx"]
[832,null,null,null,"xxxxxxxxxx","xxxxxxxxxx","xxxxxxxxxx","xxxxxxxxxx","xxxxxxxxxx","xxxxxxxxxx","xxxxxxxxxx","xxxxxxxxxx","xxxxxxxxxx"]
[833,null,null,null,"xxxxxxxxxx","xxxxxxxxxx","xxxxxxxxxx","xxxxxxxxxx","xxxxxxxxxx","xxxxxxxxxx","xxxxxxxxxx","xxxxxxxxxx","xxxxxxxxxx"]
[834,null,null,null,"xxxxxxxxxx","xxxxxxxxxx","xxxxxxxxxx","xxxxxxxxxx","xxxxxxxxxx","xxxxxxxxxx","xxxxxxxxxx","xxxxxxxxxx","xxxxxxxxxx"]
[2000,null,null,null,null,null,null,null,null,null,"xxxxxxxxxx","xxxxxxxxxx","xxxxxxxxxx"]
[835,null,null,null,"xxxxxxxxxx","xxxxxxxxxx","xxxxxxxxxx","xxxxxxxxxx","xxxxxxxxxx","xxxxxxxxxx","xxxxxxxxxx","xxxxxxxxxx","xxxxxxxxxx"]
[836,null,null,null,"xxxxxxxxxx","xxxxxxxxxx","xxxxxxxxxx","xxxxxxxxxx","xxxxxxxxxx","xxxxxxxxxx","xxxxxxxxxx","xxxxxxxxxx","xxxxxxxxxx"]
[837,null,null,null,"xxxxxxxxxx","xxxxxxxxxx","xxxxxxxxxx","xxxxxxxxxx","xxxxxxxxxx","xxxxxxxxxx","xxxxxxxxxx","xxxxxxxxxx","xxxxxxxxxx"]
[838,null,null,null,"xxxxxxxxxx","xxxxxxxxxx","xxxxxxxxxx","xxxxxxxxxx","xxxxxxxxxx","xxxxxxxxxx","xxxxxxxxxx","xxxxxxxxxx","xxxxxxxxxx"]
[840,"xxxxxxxxxx","xxxxxxxxxx","xxxxxxxxxx","xxxxxxxxxx","xxxxxxxxxx","xxxxxxxxxx","xxxxxxxxxx","xxxxxxxxxx","xxxxxxxxxx","xxxxxxxxxx","xxxxxxxxxx","xxxxxxxxxx"]
[839,null,null,null,null,null,null,"xxxxxxxxxx","xxxxxxxxxx","xxxxxxxxxx","xxxxxxxxxx","xxxxxxxxxx","xxxxxxxxxx"]
[841,"xxxxxxxxxx","xxxxxxxxxx","xxxxxxxxxx",null,null,null,"xxxxxxxxxx","xxxxxxxxxx","xxxxxxxxxx","xxxxxxxxxx","xxxxxxxxxx","xxxxxxxxxx"]
[822,null,null,null,"xxxxxxxxxx","xxxxxxxxxx","xxxxxxxxxx","xxxxxxxxxx","xxxxxxxxxx","xxxxxxxxxx","xxxxxxxxxx","xxxxxxxxxx","xxxxxxxxxx"]
[9000,null,null,null,null,null,null,"xxxxxxxxxx","xxxxxxxxxx","xxxxxxxxxx","xxxxxxxxxx","xxxxxxxxxx","xxxxxxxxxx"]
[842,null,null,null,"xxxxxxxxxx","xxxxxxxxxx","xxxxxxxxxx","xxxxxxxxxx","xxxxxxxxxx","xxxxxxxxxx","xxxxxxxxxx","xxxxxxxxxx","xxxxxxxxxx"]
[844,"xxxxxxxxxx","xxxxxxxxxx","xxxxxxxxxx",null,null,null,"xxxxxxxxxx","xxxxxxxxxx","xxxxxxxxxx","xxxxxxxxxx","xxxxxxxxxx","xxxxxxxxxx"]
[845,null,null,null,"xxxxxxxxxx","xxxxxxxxxx","xxxxxxxxxx","xxxxxxxxxx","xxxxxxxxxx","xxxxxxxxxx","xxxxxxxxxx","xxxxxxxxxx","xxxxxxxxxx"]
[846,null,null,null,"xxxxxxxxxx","xxxxxxxxxx","xxxxxxxxxx","xxxxxxxxxx","xxxxxxxxxx","xxxxxxxxxx","xxxxxxxxxx","xxxxxxxxxx","xxxxxxxxxx"]
[847,null,null,null,null,null,null,"xxxxxxxxxx","xxxxxxxxxx","xxxxxxxxxx","xxxxxxxxxx","xxxxxxxxxx","xxxxxxxxxx"]
[848,null,null,null,null,null,null,"xxxxxxxxxx","xxxxxxxxxx","xxxxxxxxxx","xxxxxxxxxx","xxxxxxxxxx","xxxxxxxxxx"]
[849,null,null,null,null,null,null,"xxxxxxxxxx","xxxxxxxxxx","xxxxxxxxxx","xxxxxxxxxx","xxxxxxxxxx","xxxxxxxxxx"]
[850,null,null,null,"xxxxxxxxxx","xxxxxxxxxx","xxxxxxxxxx","xxxxxxxxxx","xxxxxxxxxx","xxxxxxxxxx","xxxxxxxxxx","xxxxxxxxxx","xxxxxxxxxx"]
[851,null,null,null,null,null,null,"xxxxxxxxxx","xxxxxxxxxx","xxxxxxxxxx","xxxxxxxxxx","xxxxxxxxxx","xxxxxxxxxx"]
[852,null,null,null,"xxxxxxxxxx","xxxxxxxxxx","xxxxxxxxxx","xxxxxxxxxx","xxxxxxxxxx","xxxxxxxxxx","xxxxxxxxxx","xxxxxxxxxx","xxxxxxxxxx"]
[853,null,null,null,null,null,null,"xxxxxxxxxx","xxxxxxxxxx","xxxxxxxxxx","xxxxxxxxxx","xxxxxxxxxx","xxxxxxxxxx"]
[855,null,null,null,null,null,null,"xxxxxxxxxx","xxxxxxxxxx","xxxxxxxxxx","xxxxxxxxxx","xxxxxxxxxx","xxxxxxxxxx"]
[854,null,null,null,"xxxxxxxxxx","xxxxxxxxxx","xxxxxxxxxx","xxxxxxxxxx","xxxxxxxxxx","xxxxxxxxxx","xxxxxxxxxx","xxxxxxxxxx","xxxxxxxxxx"]
[856,null,null,null,null,null,null,"xxxxxxxxxx","xxxxxxxxxx","xxxxxxxxxx","xxxxxxxxxx","xxxxxxxxxx","xxxxxxxxxx"]
[7000,null,null,null,null,null,null,"xxxxxxxxxx","xxxxxxxxxx","xxxxxxxxxx","xxxxxxxxxx","xxxxxxxxxx","xxxxxxxxxx"]
[857,"xxxxxxxxxx","xxxxxxxxxx","xxxxxxxxxx","xxxxxxxxxx","xxxxxxxxxx","xxxxxxxxxx","xxxxxxxxxx","xxxxxxxxxx","xxxxxxxxxx","xxxxxxxxxx","xxxxxxxxxx","xxxxxxxxxx"]
[858,"xxxxxxxxxx","xxxxxxxxxx","xxxxxxxxxx","xxxxxxxxxx","xxxxxxxxxx","xxxxxxxxxx","xxxxxxxxxx","xxxxxxxxxx","xxxxxxxxxx","xxxxxxxxxx","xxxxxxxxxx","xxxxxxxxxx"]
[859,null,null,null,"xxxxxxxxxx","xxxxxxxxxx","xxxxxxxxxx","xxxxxxxxxx","xxxxxxxxxx","xxxxxxxxxx","xxxxxxxxxx","xxxxxxxxxx","xxxxxxxxxx"]
[815,null,null,null,null,null,null,"xxxxxxxxxx","xxxxxxxxxx","xxxxxxxxxx","xxxxxxxxxx","xxxxxxxxxx","xxxxxxxxxx"]
[860,null,null,null,null,null,null,"xxxxxxxxxx","xxxxxxxxxx","xxxxxxxxxx","xxxxxxxxxx","xxxxxxxxxx","xxxxxxxxxx"]
[861,"xxxxxxxxxx","xxxxxxxxxx","xxxxxxxxxx",null,null,null,"xxxxxxxxxx","xxxxxxxxxx","xxxxxxxxxx","xxxxxxxxxx","xxxxxxxxxx","xxxxxxxxxx"]
[3000,null,null,null,null,null,null,"xxxxxxxxxx","xxxxxxxxxx","xxxxxxxxxx","xxxxxxxxxx","xxxxxxxxxx","xxxxxxxxxx"]
[862,null,null,null,"xxxxxxxxxx","xxxxxxxxxx","xxxxxxxxxx","xxxxxxxxxx","xxxxxxxxxx","xxxxxxxxxx","xxxxxxxxxx","xxxxxxxxxx","xxxxxxxxxx"]
[863,null,null,null,"xxxxxxxxxx","xxxxxxxxxx","xxxxxxxxxx","xxxxxxxxxx","xxxxxxxxxx","xxxxxxxxxx","xxxxxxxxxx","xxxxxxxxxx","xxxxxxxxxx"]
[864,null,null,null,"xxxxxxxxxx","xxxxxxxxxx","xxxxxxxxxx","xxxxxxxxxx","xxxxxxxxxx","xxxxxxxxxx","xxxxxxxxxx","xxxxxxxxxx","xxxxxxxxxx"]
[865,null,null,null,"xxxxxxxxxx","xxxxxxxxxx","xxxxxxxxxx","xxxxxxxxxx","xxxxxxxxxx","xxxxxxxxxx","xxxxxxxxxx","xxxxxxxxxx","xxxxxxxxxx"]
[868,null,null,null,null,null,null,"xxxxxxxxxx","xxxxxxxxxx","xxxxxxxxxx","xxxxxxxxxx","xxxxxxxxxx","xxxxxxxxxx"]
[869,"xxxxxxxxxx","xxxxxxxxxx","xxxxxxxxxx","xxxxxxxxxx","xxxxxxxxxx","xxxxxxxxxx","xxxxxxxxxx","xxxxxxxxxx","xxxxxxxxxx","xxxxxxxxxx","xxxxxxxxxx","xxxxxxxxxx"]
[870,null,null,null,null,null,null,"xxxxxxxxxx","xxxxxxxxxx","xxxxxxxxxx","xxxxxxxxxx","xxxxxxxxxx","xxxxxxxxxx"]
[866,null,null,null,"xxxxxxxxxx","xxxxxxxxxx","xxxxxxxxxx","xxxxxxxxxx","xxxxxxxxxx","xxxxxxxxxx","xxxxxxxxxx","xxxxxxxxxx","xxxxxxxxxx"]
[867,null,null,null,"xxxxxxxxxx","xxxxxxxxxx","xxxxxxxxxx","xxxxxxxxxx","xxxxxxxxxx","xxxxxxxxxx","xxxxxxxxxx","xxxxxxxxxx","xxxxxxxxxx"]
[871,null,null,null,"xxxxxxxxxx","xxxxxxxxxx","xxxxxxxxxx","xxxxxxxxxx","xxxxxxxxxx","xxxxxxxxxx","xxxxxxxxxx","xxxxxxxxxx","xxxxxxxxxx"]
[872,null,null,null,null,null,null,null,null,null,"xxxxxxxxxx","xxxxxxxxxx","xxxxxxxxxx"]
[873,null,null,null,"xxxxxxxxxx","xxxxxxxxxx","xxxxxxxxxx","xxxxxxxxxx","xxxxxxxxxx","xxxxxxxxxx","xxxxxxxxxx","xxxxxxxxxx","xxxxxxxxxx"]
[874,null,null,null,"xxxxxxxxxx","xxxxxxxxxx","xxxxxxxxxx","xxxxxxxxxx","xxxxxxxxxx","xxxxxxxxxx","xxxxxxxxxx","xxxxxxxxxx","xxxxxxxxxx"]
[875,null,null,null,"xxxxxxxxxx","xxxxxxxxxx","xxxxxxxxxx","xxxxxxxxxx","xxxxxxxxxx","xxxxxxxxxx","xxxxxxxxxx","xxxxxxxxxx","xxxxxxxxxx"]
[876,null,null,null,null,null,null,"xxxxxxxxxx","xxxxxxxxxx","xxxxxxxxxx","xxxxxxxxxx","xxxxxxxxxx","xxxxxxxxxx"]
[877,null,null,null,null,null,null,"xxxxxxxxxx","xxxxxxxxxx","xxxxxxxxxx","xxxxxxxxxx","xxxxxxxxxx","xxxxxxxxxx"]
[882,null,null,null,"xxxxxxxxxx","xxxxxxxxxx","xxxxxxxxxx","xxxxxxxxxx","xxxxxxxxxx","xxxxxxxxxx","xxxxxxxxxx","xxxxxxxxxx","xxxxxxxxxx"]
[878,null,null,null,"xxxxxxxxxx","xxxxxxxxxx","xxxxxxxxxx","xxxxxxxxxx","xxxxxxxxxx","xxxxxxxxxx","xxxxxxxxxx","xxxxxxxxxx","xxxxxxxxxx"]
[879]
[880,null,null,null,null,null,null,"xxxxxxxxxx","xxxxxxxxxx","xxxxxxxxxx","xxxxxxxxxx","xxxxxxxxxx","xxxxxxxxxx"]

{"sheet":"Jaugeage","index":1,"n_rows":5962,"n_cols":32,"rows_kept":5962,"cut":false,"hidden":false,"merged":[]}
["Date","Météo","Code","Pierre","Paul","Jules","André","Michel","Arrivée Nbrs","Nom ou N° Ciel 1 (DROITE)","Vol 1","Temps 1","M3 /J 1","Nom ou N° Ciel  2 (GAUCHE)","Vol 2","Temps 2","M3 /J 2","Nom ou N° Ciel  3 (MILIEU)","Vol 3","Temps 3","M3 /J 3","Nom ou N° Ciel  4 (mazoire)","Vol 4","Temps 4","M3 /J 4","Seuil alerte","Total général M3 /jrs","Mois","Année","Différence en M3/J entre 2 saisies ","Observations","0,1 Sec"]
["2016-09-16","Couvert",804,{"$f":"IF(ISNA(VLOOKUP(C2,BDDG!$A$2:$F$52,2,FALSE)),\"\",VLOOKUP(C2,BDDG!$A$2:$F$52,2,FALSE))","v":0},{"$f":"IF(ISNA(VLOOKUP(C2,BDDG!$A$3:$N$54,3,FALSE)),\"\",VLOOKUP(C2,BDDG!$A$3:$N$54,3,FALSE))","v":"Pomme"},{"$f":"IF(ISNA(VLOOKUP(C2,BDDG!$A$3:$N$54,4,FALSE)),\"\",VLOOKUP(C2,BDDG!$A$3:$N$54,4,FALSE))","v":104},{"$f":"IF(ISNA(VLOOKUP(C2,BDDG!$A$2:$F$52,5,FALSE)),\"\",VLOOKUP(C2,BDDG!$A$2:$F$52,5,FALSE))","v":"Navet"},{"$f":"IF(ISNA(VLOOKUP(C2,BDDG!$A$2:$F$52,6,FALSE)),\"\",VLOOKUP(C2,BDDG!$A$2:$F$52,6,FALSE))","v":"A"},{"$f":"IF(ISERROR(VLOOKUP(C2,BDDG!$A$2:$G$52,7,FALSE)),\"\",VLOOKUP(C2,BDDG!$A$2:$G$52,7,FALSE))","v":1},{"$f":"IF(ISERROR(VLOOKUP(C2,BDDG!$A$2:$U$11,8,FALSE)),\"\",VLOOKUP(C2,BDDG!$A$2:$U$11,8,FALSE))","v":"AA"},5,18.809999999999999,{"$f":" IF(ISERROR(K2/L2*86.4),\"xxxxxxxxxx\",K2/L2*86.4)","v":22.966507177033495},null,null,null,null,null,null,null,null,null,null,null,null,{"$f":"IF(ISERROR(VLOOKUP(C2,BDDG!$A$2:$U$11,20,FALSE)),\"\",VLOOKUP(C2,BDDG!$A$2:$U$11,20,FALSE))","v":0},{"$f":"IF(ISERROR(SUM(M2,Q2,U2,Y2)),\"\",SUM(M2,Q2,U2,Y2))","v":22.966507177033495},{"$f":"MONTH(A:A)","v":9},{"$f":"YEAR(A:A)","v":2016},{"$f":"IFERROR((INDEX($AA$2:AA2,MATCH(H2&MAX(IF($H$1:H1=H2,$A$1:A1)),$H$2:H2&$A$2:A2,0))-AA2)*-1,\"\")","v":""}]
["2016-09-16","Couvert",809,{"$f":"IF(ISNA(VLOOKUP(C3,BDDG!$A$2:$F$52,2,FALSE)),\"\",VLOOKUP(C3,BDDG!$A$2:$F$52,2,FALSE))","v":0},{"$f":"IF(ISNA(VLOOKUP(C3,BDDG!$A$3:$N$54,3,FALSE)),\"\",VLOOKUP(C3,BDDG!$A$3:$N$54,3,FALSE))","v":"Pomme"},{"$f":"IF(ISNA(VLOOKUP(C3,BDDG!$A$3:$N$54,4,FALSE)),\"\",VLOOKUP(C3,BDDG!$A$3:$N$54,4,FALSE))","v":104},{"$f":"IF(ISNA(VLOOKUP(C3,BDDG!$A$2:$F$52,5,FALSE)),\"\",VLOOKUP(C3,BDDG!$A$2:$F$52,5,FALSE))","v":"Carde"},{"$f":"IF(ISNA(VLOOKUP(C3,BDDG!$A$2:$F$52,6,FALSE)),\"\",VLOOKUP(C3,BDDG!$A$2:$F$52,6,FALSE))","v":"B"},{"$f":"IF(ISERROR(VLOOKUP(C3,BDDG!$A$2:$G$52,7,FALSE)),\"\",VLOOKUP(C3,BDDG!$A$2:$G$52,7,FALSE))","v":2},{"$f":"IF(ISERROR(VLOOKUP(C3,BDDG!$A$2:$U$11,8,FALSE)),\"\",VLOOKUP(C3,BDDG!$A$2:$U$11,8,FALSE))","v":"droite HS HS HS HS HS HS HS HS HS HS "},null,null,null,{"$f":"IF(ISERROR(VLOOKUP(C3,BDDG!$A$2:$U$11,11,FALSE)),\"\",VLOOKUP(C3,BDDG!$A$2:$U$11,11,FALSE))","v":"BBB (gauche)"},2,18,{"$f":" IF(ISERROR(O3/P3*86.4),\"xxxxxxxxxx\",O3/P3*86.4)","v":9.6},null,null,null,null,null,null,null,null,{"$f":"IF(ISERROR(VLOOKUP(C3,BDDG!$A$2:$U$11,20,FALSE)),\"\",VLOOKUP(C3,BDDG!$A$2:$U$11,20,FALSE))","v":0},9.6,{"$f":"MONTH(A:A)","v":9},{"$f":"YEAR(A:A)","v":2016},{"$f":"IFERROR((INDEX($AA$2:AA3,MATCH(H3&MAX(IF($H$1:H2=H3,$A$1:A2)),$H$2:H3&$A$2:A3,0))-AA3)*-1,\"\")","v":""}]
["2016-09-16","Couvert",811,{"$f":"IF(ISNA(VLOOKUP(C4,BDDG!$A$2:$F$52,2,FALSE)),\"\",VLOOKUP(C4,BDDG!$A$2:$F$52,2,FALSE))","v":0},{"$f":"IF(ISNA(VLOOKUP(C4,BDDG!$A$3:$N$54,3,FALSE)),\"\",VLOOKUP(C4,BDDG!$A$3:$N$54,3,FALSE))","v":"Poire"},{"$f":"IF(ISNA(VLOOKUP(C4,BDDG!$A$3:$N$54,4,FALSE)),\"\",VLOOKUP(C4,BDDG!$A$3:$N$54,4,FALSE))","v":104},{"$f":"IF(ISNA(VLOOKUP(C4,BDDG!$A$2:$F$52,5,FALSE)),\"\",VLOOKUP(C4,BDDG!$A$2:$F$52,5,FALSE))","v":"Poireaux"},{"$f":"IF(ISNA(VLOOKUP(C4,BDDG!$A$2:$F$52,6,FALSE)),\"\",VLOOKUP(C4,BDDG!$A$2:$F$52,6,FALSE))","v":"C"},{"$f":"IF(ISERROR(VLOOKUP(C4,BDDG!$A$2:$G$52,7,FALSE)),\"\",VLOOKUP(C4,BDDG!$A$2:$G$52,7,FALSE))","v":1},{"$f":"IF(ISERROR(VLOOKUP(C4,BDDG!$A$2:$U$11,8,FALSE)),\"\",VLOOKUP(C4,BDDG!$A$2:$U$11,8,FALSE))","v":"CC"},5,50.43,8.5663295657346819,null,null,null,null,null,null,null,null,null,null,null,null,{"$f":"IF(ISERROR(VLOOKUP(C4,BDDG!$A$2:$U$11,20,FALSE)),\"\",VLOOKUP(C4,BDDG!$A$2:$U$11,20,FALSE))","v":0},{"$f":"IF(ISERROR(SUM(M4,Q4,U4,Y4)),\"\",SUM(M4,Q4,U4,Y4))","v":8.5663295657346819},{"$f":"MONTH(A:A)","v":9},{"$f":"YEAR(A:A)","v":2016},{"$f":"IFERROR((INDEX($AA$2:AA4,MATCH(H4&MAX(IF($H$1:H3=H4,$A$1:A3)),$H$2:H4&$A$2:A4,0))-AA4)*-1,\"\")","v":""}]
["2016-09-16","Couvert",816,{"$f":"IF(ISNA(VLOOKUP(C5,BDDG!$A$2:$F$52,2,FALSE)),\"\",VLOOKUP(C5,BDDG!$A$2:$F$52,2,FALSE))","v":0},{"$f":"IF(ISNA(VLOOKUP(C5,BDDG!$A$3:$N$54,3,FALSE)),\"\",VLOOKUP(C5,BDDG!$A$3:$N$54,3,FALSE))","v":"Pomme"},{"$f":"IF(ISNA(VLOOKUP(C5,BDDG!$A$3:$N$54,4,FALSE)),\"\",VLOOKUP(C5,BDDG!$A$3:$N$54,4,FALSE))","v":104},{"$f":"IF(ISNA(VLOOKUP(C5,BDDG!$A$2:$F$52,5,FALSE)),\"\",VLOOKUP(C5,BDDG!$A$2:$F$52,5,FALSE))","v":"Courgette"},{"$f":"IF(ISNA(VLOOKUP(C5,BDDG!$A$2:$F$52,6,FALSE)),\"\",VLOOKUP(C5,BDDG!$A$2:$F$52,6,FALSE))","v":"D"},{"$f":"IF(ISERROR(VLOOKUP(C5,BDDG!$A$2:$G$52,7,FALSE)),\"\",VLOOKUP(C5,BDDG!$A$2:$G$52,7,FALSE))","v":3},{"$f":"IF(ISERROR(VLOOKUP(C5,BDDG!$A$2:$U$11,8,FALSE)),\"\",VLOOKUP(C5,BDDG!$A$2:$U$11,8,FALSE))","v":"DD (droite)"},5,11.27,38.331854480922807,{"$f":"IF(ISERROR(VLOOKUP(C5,BDDG!$A$2:$U$11,11,FALSE)),\"\",VLOOKUP(C5,BDDG!$A$2:$U$11,11,FALSE))","v":"DDD( Gauche)"},1,11.27,7.6663708961845609,{"$f":"IF(ISERROR(VLOOKUP(C5,BDDG!$A$2:$U$11,14,FALSE)),\"\",VLOOKUP(C5,BDDG!$A$2:$U$11,14,FALSE))","v":"DDDD (Milieu)"},1,18,{"$f":" IF(ISERROR(S5/T5*86.4),\"xxxxxxxxxx\",S5/T5*86.4)","v":4.8},null,null,null,null,{"$f":"IF(ISERROR(VLOOKUP(C5,BDDG!$A$2:$U$11,20,FALSE)),\"\",VLOOKUP(C5,BDDG!$A$2:$U$11,20,FALSE))","v":0},50.798225377107364,{"$f":"MONTH(A:A)","v":9},{"$f":"YEAR(A:A)","v":2016},{"$f":"IFERROR((INDEX($AA$2:AA5,MATCH(H5&MAX(IF($H$1:H4=H5,$A$1:A4)),$H$2:H5&$A$2:A5,0))-AA5)*-1,\"\")","v":""}]
[]
[]
[]
[]
[]
[]
[]
[]
[]
[]
[]
[]
[]
[]
[]
[]
[]
[]
[]
[]
[]
[]
[]
[]
[]
[]
[]
[]
[]
[]
[]
[]
[]
[]
[]
[]
[]
[]
[]
[]
[]
[]
[]
[]
[]
[]
[]
[]
[]
[]
[]
[]
[]
[]
[]
[]
[]
[]
[]
[]
[]
[]
[]
[]
[]
[]
[]
[]
[]
[]
[]
[]
[]
[]
[]
[]
[]
[]
[]
[]
[]
[]
[]
[]
[]
[]
[]
[]
[]
[]
[]
[]
[]
[]
[]
[]
[]
[]
[]
[]
[]
[]
[]
[]
[]
[]
[]
[]
[]
[]
[]
[]
[]
[]
[]
[]
[]
[]
[]
[]
[]
[]
[]
[]
[]
[]
[]
[]
[]
[]
[]
[]
[]
[]
[]
[]
[]
[]
[]
[]
[]
[]
[]
[]
[]
[]
[]
[]
[]
[]
[]
[]
[]
[]
[]
[]
[]
[]
[]
[]
[]
[]
[]
[]
[]
[]
[]
[]
[]
[]
[]
[]
[]
[]
[]
[]
[]
[]
[]
[]
[]
[]
[]
[]
[]
[]
[]
[]
[]
[]
[]
[]
[]
[]
[]
[]
[]
[]
[]
[]
[]
[]
[]
[]
[]
[]
[]
[]
[]
[]
[]
[]
[]
[]
[]
[]
[]
[]
[]
[]
[]
[]
[]
[]
[]
[]
[]
[]
[]
[]
[]
[]
[]
[]
[]
[]
[]
[]
[]
[]
[]
[]
[]
[]
[]
[]
[]
[]
[]
[]
[]
[]
[]
[]
[]
[]
[]
[]
[]
[]
[]
[]
[]
[]
[]
[]
[]
[]
[]
[]
[]
[]
[]
[]
[]
[]
[]
[]
[]
[]
[]
[]
[]
[]
[]
[]
[]
[]
[]
[]
[]
[]
[]
[]
[]
[]
[]
[]
[]
[]
[]
[]
[]
[]
[]
[]
[]
[]
[]
[]
[]
[]
[]
[]
[]
[]
[]
[]
[]
[]
[]
[]
[]
[]
[]
[]
[]
[]
[]
[]
[]
[]
[]
[]
[]
[]
[]
[]
[]
[]
[]
[]
[]
[]
[]
[]
[]
[]
[]
[]
[]
[]
[]
[]
[]
[]
[]
[]
[]
[]
[]
[]
[]
[]
[]
[]
[]
[]
[]
[]
[]
[]
[]
[]
[]
[]
[]
[]
[]
[]
[]
[]
[]
[]
[]
[]
[]
[]
[]
[]
[]
[]
[]
[]
[]
[]
[]
[]
[]
[]
[]
[]
[]
[]
[]
[]
[]
[]
[]
[]
[]
[]
[]
[]
[]
[]
[]
[]
[]
[]
[]
[]
[]
[]
[]
[]
[]
[]
[]
[]
[]
[]
[]
[]
[]
[]
[]
[]
[]
[]
[]
[]
[]
[]
[]
[]
[]
[]
[]
[]
[]
[]
[]
[]
[]
[]
[]
[]
[]
[]
[]
[]
[]
[]
[]
[]
[]
[]
[]
[]
[]
[]
[]
[]
[]
[]
[]
[]
[]
[]
[]
[]
[]
[]
[]
[]
[]
[]
[]
[]
[]
[]
[]
[]
[]
[]
[]
[]
[]
[]
[]
[]
[]
[]
[]
[]
[]
[]
[]
[]
[]
[]
[]
[]
[]
[]
[]
[]
[]
[]
[]
[]
[]
[]
[]
[]
[]
[]
[]
[]
[]
[]
[]
[]
[]
[]
[]
[]
[]
[]
[]
[]
[]
[]
[]
[]
[]
[]
[]
[]
[]
[]
[]
[]
[]
[]
[]
[]
[]
[]
[]
[]
[]
[]
[]
[]
[]
[]
[]
[]
[]
[]
[]
[]
[]
[]
[]
[]
[]
[]
[]
[]
[]
[]
[]
[]
[]
[]
[]
[]
[]
[]
[]
[]
[]
[]
[]
[]
[]
[]
[]
[]
[]
[]
[]
[]
[]
[]
[]
[]
[]
[]
[]
[]
[]
[]
[]
[]
[]
[]
[]
[]
[]
[]
[]
[]
[]
[]
[]
[]
[]
[]
[]
[]
[]
[]
[]
[]
[]
[]
[]
[]
[]
[]
[]
[]
[]
[]
[]
[]
[]
[]
[]
[]
[]
[]
[]
[]
[]
[]
[]
[]
[]
[]
[]
[]
[]
[]
[]
[]
[]
[]
[]
[]
[]
[]
[]
[]
[]
[]
[]
[]
[]
[]
[]
[]
[]
[]
[]
[]
[]
[]
[]
[]
[]
[]
[]
[]
[]
[]
[]
[]
[]
[]
[]
[]
[]
[]
[]
[]
[]
[]
[]
[]
[]
[]
[]
[]
[]
[]
[]
[]
[]
[]
[]
[]
[]
[]
[]
[]
[]
[]
[]
[]
[]
[]
[]
[]
[]
[]
[]
[]
[]
[]
[]
[]
[]
[]
[]
[]
[]
[]
[]
[]
[]
[]
[]
[]
[]
[]
[]
[]
[]
[]
[]
[]
[]
[]
[]
[]
[]
[]
[]
[]
[]
[]
[]
[]
[]
[]
[]
[]
[]
[]
[]
[]
[]
[]
[]
[]
[]
[]
[]
[]
[]
[]
[]
[]
[]
[]
[]
[]
[]
[]
[]
[]
[]
[]
[]
[]
[]
[]
[]
[]
[]
[]
[]
[]
[]
[]
[]
[]
[]
[]
[]
[]
[]
[]
[]
[]
[]
[]
[]
[]
[]
[]
[]
[]
[]
[]
[]
[]
[]
[]
[]
[]
[]
[]
[]
[]
[]
[]
[]
[]
[]
[]
[]
[]
[]
[]
[]
[]
[]
[]
[]
[]
[]
[]
[]
[]
[]
[]
[]
[]
[]
[]
[]
[]
[]
[]
[]
[]
[]
[]
[]
[]
[]
[]
[]
[]
[]
[]
[]
[]
[]
[]
[]
[]
[]
[]
[]
[]
[]
[]
[]
[]
[]
[]
[]
[]
[]
[]
[]
[]
[]
[]
[]
[]
[]
[]
[]
[]
[]
[]
[]
[]
[]
[]
[]
[]
[]
[]
[]
[]
[]
[]
[]
[]
[]
[]
[]
[]
[]
[]
[]
[]
[]
[]
[]
[]
[]
[]
[]
[]
[]
[]
[]
[]
[]
[]
[]
[]
[]
[]
[]
[]
[]
[]
[]
[]
[]
[]
[]
[]
[]
[]
[]
[]
[]
[]
[]
[]
[]
[]
[]
[]
[]
[]
[]
[]
[]
[]
[]
[]
[]
[]
[]
[]
[]
[]
[]
[]
[]
[]
[]
[]
[]
[]
[]
[]
[]
[]
[]
[]
[]
[]
[]
[]
[]
[]
[]
[]
[]
[]
[]
[]
[]
[]
[]
[]
[]
[]
[]
[]
[]
[]
[]
[]
[]
[]
[]
[]
[]
[]
[]
[]
[]
[]
[]
[]
[]
[]
[]
[]
[]
[]
[]
[]
[]
[]
[]
[]
[]
[]
[]
[]
[]
[]
[]
[]
[]
[]
[]
[]
[]
[]
[]
[]
[]
[]
[]
[]
[]
[]
[]
[]
[]
[]
[]
[]
[]
[]
[]
[]
[]
[]
[]
[]
[]
[]
[]
[]
[]
[]
[]
[]
[]
[]
[]
[]
[]
[]
[]
[]
[]
[]
[]
[]
[]
[]
[]
[]
[]
[]
[]
[]
[]
[]
[]
[]
[]
[]
[]
[]
[]
[]
[]
[]
[]
[]
[]
[]
[]
[]
[]
[]
[]
[]
[]
[]
[]
[]
[]
[]
[]
[]
[]
[]
[]
[]
[]
[]
[]
[]
[]
[]
[]
[]
[]
[]
[]
[]
[]
[]
[]
[]
[]
[]
[]
[]
[]
[]
[]
[]
[]
[]
[]
[]
[]
[]
[]
[]
[]
[]
[]
[]
[]
[]
[]
[]
[]
[]
[]
[]
[]
[]
[]
[]
[]
[]
[]
[]
[]
[]
[]
[]
[]
[]
[]
[]
[]
[]
[]
[]
[]
[]
[]
[]
[]
[]
[]
[]
[]
[]
[]
[]
[]
[]
[]
[]
[]
[]
[]
[]
[]
[]
[]
[]
[]
[]
[]
[]
[]
[]
[]
[]
[]
[]
[]
[]
[]
[]
[]
[]
[]
[]
[]
[]
[]
[]
[]
[]
[]
[]
[]
[]
[]
[]
[]
[]
[]
[]
[]
[]
[]
[]
[]
[]
[]
[]
[]
[]
[]
[]
[]
[]
[]
[]
[]
[]
[]
[]
[]
[]
[]
[]
[]
[]
[]
[]
[]
[]
[]
[]
[]
[]
[]
[]
[]
[]
[]
[]
[]
[]
[]
[]
[]
[]
[]
[]
[]
[]
[]
[]
[]
[]
[]
[]
[]
[]
[]
[]
[]
[]
[]
[]
[]
[]
[]
[]
[]
[]
[]
[]
[]
[]
[]
[]
[]
[]
[]
[]
[]
[]
[]
[]
[]
[]
[]
[]
[]
[]
[]
[]
[]
[]
[]
[]
[]
[]
[]
[]
[]
[]
[]
[]
[]
[]
[]
[]
[]
[]
[]
[]
[]
[]
[]
[]
[]
[]
[]
[]
[]
[]
[]
[]
[]
[]
[]
[]
[]
[]
[]
[]
[]
[]
[]
[]
[]
[]
[]
[]
[]
[]
[]
[]
[]
[]
[]
[]
[]
[]
[]
[]
[]
[]
[]
[]
[]
[]
[]
[]
[]
[]
[]
[]
[]
[]
[]
[]
[]
[]
[]
[]
[]
[]
[]
[]
[]
[]
[]
[]
[]
[]
[]
[]
[]
[]
[]
[]
[]
[]
[]
[]
[]
[]
[]
[]
[]
[]
[]
[]
[]
[]
[]
[]
[]
[]
[]
[]
[]
[]
[]
[]
[]
[]
[]
[]
[]
[]
[]
[]
[]
[]
[]
[]
[]
[]
[]
[]
[]
[]
[]
[]
[]
[]
[]
[]
[]
[]
[]
[]
[]
[]
[]
[]
[]
[]
[]
[]
[]
[]
[]
[]
[]
[]
[]
[]
[]
[]
[]
[]
[]
[]
[]
[]
[]
[]
[]
[]
[]
[]
[]
[]
[]
[]
[]
[]
[]
[]
[]
[]
[]
[]
[]
[]
[]
[]
[]
[]
[]
[]
[]
[]
[]
[]
[]
[]
[]
[]
[]
[]
[]
[]
[]
[]
[]
[]
[]
[]
[]
[]
[]
[]
[]
[]
[]
[]
[]
[]
[]
[]
[]
[]
[]
[]
[]
[]
[]
[]
[]
[]
[]
[]
[]
[]
[]
[]
[]
[]
[]
[]
[]
[]
[]
[]
[]
[]
[]
[]
[]
[]
[]
[]
[]
[]
[]
[]
[]
[]
[]
[]
[]
[]
[]
[]
[]
[]
[]
[]
[]
[]
[]
[]
[]
[]
[]
[]
[]
[]
[]
[]
[]
[]
[]
[]
[]
[]
[]
[]
[]
[]
[]
[]
[]
[]
[]
[]
[]
[]
[]
[]
[]
[]
[]
[]
[]
[]
[]
[]
[]
[]
[]
[]
[]
[]
[]
[]
[]
[]
[]
[]
[]
[]
[]
[]
[]
[]
[]
[]
[]
[]
[]
[]
[]
[]
[]
[]
[]
[]
[]
[]
[]
[]
[]
[]
[]
[]
[]
[]
[]
[]
[]
[]
[]
[]
[]
[]
[]
[]
[]
[]
[]
[]
[]
[]
[]
[]
[]
[]
[]
[]
[]
[]
[]
[]
[]
[]
[]
[]
[]
[]
[]
[]
[]
[]
[]
[]
[]
[]
[]
[]
[]
[]
[]
[]
[]
[]
[]
[]
[]
[]
[]
[]
[]
[]
[]
[]
[]
[]
[]
[]
[]
[]
[]
[]
[]
[]
[]
[]
[]
[]
[]
[]
[]
[]
[]
[]
[]
[]
[]
[]
[]
[]
[]
[]
[]
[]
[]
[]
[]
[]
[]
[]
[]
[]
[]
[]
[]
[]
[]
[]
[]
[]
[]
[]
[]
[]
[]
[]
[]
[]
[]
[]
[]
[]
[]
[]
[]
[]
[]
[]
[]
[]
[]
[]
[]
[]
[]
[]
[]
[]
[]
[]
[]
[]
[]
[]
[]
[]
[]
[]
[]
[]
[]
[]
[]
[]
[]
[]
[]
[]
[]
[]
[]
[]
[]
[]
[]
[]
[]
[]
[]
[]
[]
[]
[]
[]
[]
[]
[]
[]
[]
[]
[]
[]
[]
[]
[]
[]
[]
[]
[]
[]
[]
[]
[]
[]
[]
[]
[]
[]
[]
[]
[]
[]
[]
[]
[]
[]
[]
[]
[]
[]
[]
[]
[]
[]
[]
[]
[]
[]
[]
[]
[]
[]
[]
[]
[]
[]
[]
[]
[]
[]
[]
[]
[]
[]
[]
[]
[]
[]
[]
[]
[]
[]
[]
[]
[]
[]
[]
[]
[]
[]
[]
[]
[]
[]
[]
[]
[]
[]
[]
[]
[]
[]
[]
[]
[]
[]
[]
[]
[]
[]
[]
[]
[]
[]
[]
[]
[]
[]
[]
[]
[]
[]
[]
[]
[]
[]
[]
[]
[]
[]
[]
[]
[]
[]
[]
[]
[]
[]
[]
[]
[]
[]
[]
[]
[]
[]
[]
[]
[]
[]
[]
[]
[]
[]
[]
[]
[]
[]
[]
[]
[]
[]
[]
[]
[]
[]
[]
[]
[]
[]
[]
[]
[]
[]
[]
[]
[]
[]
[]
[]
[]
[]
[]
[]
[]
[]
[]
[]
[]
[]
[]
[]
[]
[]
[]
[]
[]
[]
[]
[]
[]
[]
[]
[]
[]
[]
[]
[]
[]
[]
[]
[]
[]
[]
[]
[]
[]
[]
[]
[]
[]
[]
[]
[]
[]
[]
[]
[]
[]
[]
[]
[]
[]
[]
[]
[]
[]
[]
[]
[]
[]
[]
[]
[]
[]
[]
[]
[]
[]
[]
[]
[]
[]
[]
[]
[]
[]
[]
[]
[]
[]
[]
[]
[]
[]
[]
[]
[]
[]
[]
[]
[]
[]
[]
[]
[]
[]
[]
[]
[]
[]
[]
[]
[]
[]
[]
[]
[]
[]
[]
[]
[]
[]
[]
[]
[]
[]
[]
[]
[]
[]
[]
[]
[]
[]
[]
[]
[]
[]
[]
[]
[]
[]
[]
[]
[]
[]
[]
[]
[]
[]
[]
[]
[]
[]
[]
[]
[]
[]
[]
[]
[]
[]
[]
[]
[]
[]
[]
[]
[]
[]
[]
[]
[]
[]
[]
[]
[]
[]
[]
[]
[]
[]
[]
[]
[]
[]
[]
[]
[]
[]
[]
[]
[]
[]
[]
[]
[]
[]
[]
[]
[]
[]
[]
[]
[]
[]
[]
[]
[]
[]
[]
[]
[]
[]
[]
[]
[]
[]
[]
[]
[]
[]
[]
[]
[]
[]
[]
[]
[]
[]
[]
[]
[]
[]
[]
[]
[]
[]
[]
[]
[]
[]
[]
[]
[]
[]
[]
[]
[]
[]
[]
[]
[]
[]
[]
[]
[]
[]
[]
[]
[]
[]
[]
[]
[]
[]
[]
[]
[]
[]
[]
[]
[]
[]
[]
[]
[]
[]
[]
[]
[]
[]
[]
[]
[]
[]
[]
[]
[]
[]
[]
[]
[]
[]
[]
[]
[]
[]
[]
[]
[]
[]
[]
[]
[]
[]
[]
[]
[]
[]
[]
[]
[]
[]
[]
[]
[]
[]
[]
[]
[]
[]
[]
[]
[]
[]
[]
[]
[]
[]
[]
[]
[]
[]
[]
[]
[]
[]
[]
[]
[]
[]
[]
[]
[]
[]
[]
[]
[]
[]
[]
[]
[]
[]
[]
[]
[]
[]
[]
[]
[]
[]
[]
[]
[]
[]
[]
[]
[]
[]
[]
[]
[]
[]
[]
[]
[]
[]
[]
[]
[]
[]
[]
[]
[]
[]
[]
[]
[]
[]
[]
[]
[]
[]
[]
[]
[]
[]
[]
[]
[]
[]
[]
[]
[]
[]
[]
[]
[]
[]
[]
[]
[]
[]
[]
[]
[]
[]
[]
[]
[]
[]
[]
[]
[]
[]
[]
[]
[]
[]
[]
[]
[]
[]
[]
[]
[]
[]
[]
[]
[]
[]
[]
[]
[]
[]
[]
[]
[]
[]
[]
[]
[]
[]
[]
[]
[]
[]
[]
[]
[]
[]
[]
[]
[]
[]
[]
[]
[]
[]
[]
[]
[]
[]
[]
[]
[]
[]
[]
[]
[]
[]
[]
[]
[]
[]
[]
[]
[]
[]
[]
[]
[]
[]
[]
[]
[]
[]
[]
[]
[]
[]
[]
[]
[]
[]
[]
[]
[]
[]
[]
[]
[]
[]
[]
[]
[]
[]
[]
[]
[]
[]
[]
[]
[]
[]
[]
[]
[]
[]
[]
[]
[]
[]
[]
[]
[]
[]
[]
[]
[]
[]
[]
[]
[]
[]
[]
[]
[]
[]
[]
[]
[]
[]
[]
[]
[]
[]
[]
[]
[]
[]
[]
[]
[]
[]
[]
[]
[]
[]
[]
[]
[]
[]
[]
[]
[]
[]
[]
[]
[]
[]
[]
[]
[]
[]
[]
[]
[]
[]
[]
[]
[]
[]
[]
[]
[]
[]
[]
[]
[]
[]
[]
[]
[]
[]
[]
[]
[]
[]
[]
[]
[]
[]
[]
[]
[]
[]
[]
[]
[]
[]
[]
[]
[]
[]
[]
[]
[]
[]
[]
[]
[]
[]
[]
[]
[]
[]
[]
[]
[]
[]
[]
[]
[]
[]
[]
[]
[]
[]
[]
[]
[]
[]
[]
[]
[]
[]
[]
[]
[]
[]
[]
[]
[]
[]
[]
[]
[]
[]
[]
[]
[]
[]
[]
[]
[]
[]
[]
[]
[]
[]
[]
[]
[]
[]
[]
[]
[]
[]
[]
[]
[]
[]
[]
[]
[]
[]
[]
[]
[]
[]
[]
[]
[]
[]
[]
[]
[]
[]
[]
[]
[]
[]
[]
[]
[]
[]
[]
[]
[]
[]
[]
[]
[]
[]
[]
[]
[]
[]
[]
[]
[]
[]
[]
[]
[]
[]
[]
[]
[]
[]
[]
[]
[]
[]
[]
[]
[]
[]
[]
[]
[]
[]
[]
[]
[]
[]
[]
[]
[]
[]
[]
[]
[]
[]
[]
[]
[]
[]
[]
[]
[]
[]
[]
[]
[]
[]
[]
[]
[]
[]
[]
[]
[]
[]
[]
[]
[]
[]
[]
[]
[]
[]
[]
[]
[]
[]
[]
[]
[]
[]
[]
[]
[]
[]
[]
[]
[]
[]
[]
[]
[]
[]
[]
[]
[]
[]
[]
[]
[]
[]
[]
[]
[]
[]
[]
[]
[]
[]
[]
[]
[]
[]
[]
[]
[]
[]
[]
[]
[]
[]
[]
[]
[]
[]
[]
[]
[]
[]
[]
[]
[]
[]
[]
[]
[]
[]
[]
[]
[]
[]
[]
[]
[]
[]
[]
[]
[]
[]
[]
[]
[]
[]
[]
[]
[]
[]
[]
[]
[]
[]
[]
[]
[]
[]
[]
[]
[]
[]
[]
[]
[]
[]
[]
[]
[]
[]
[]
[]
[]
[]
[]
[]
[]
[]
[]
[]
[]
[]
[]
[]
[]
[]
[]
[]
[]
[]
[]
[]
[]
[]
[]
[]
[]
[]
[]
[]
[]
[]
[]
[]
[]
[]
[]
[]
[]
[]
[]
[]
[]
[]
[]
[]
[]
[]
[]
[]
[]
[]
[]
[]
[]
[]
[]
[]
[]
[]
[]
[]
[]
[]
[]
[]
[]
[]
[]
[]
[]
[]
[]
[]
[]
[]
[]
[]
[]
[]
[]
[]
[]
[]
[]
[]
[]
[]
[]
[]
[]
[]
[]
[]
[]
[]
[]
[]
[]
[]
[]
[]
[]
[]
[]
[]
[]
[]
[]
[]
[]
[]
[]
[]
[]
[]
[]
[]
[]
[]
[]
[]
[]
[]
[]
[]
[]
[]
[]
[]
[]
[]
[]
[]
[]
[]
[]
[]
[]
[]
[]
[]
[]
[]
[]
[]
[]
[]
[]
[]
[]
[]
[]
[]
[]
[]
[]
[]
[]
[]
[]
[]
[]
[]
[]
[]
[]
[]
[]
[]
[]
[]
[]
[]
[]
[]
[]
[]
[]
[]
[]
[]
[]
[]
[]
[]
[]
[]
[]
[]
[]
[]
[]
[]
[]
[]
[]
[]
[]
[]
[]
[]
[]
[]
[]
[]
[]
[]
[]
[]
[]
[]
[]
[]
[]
[]
[]
[]
[]
[]
[]
[]
[]
[]
[]
[]
[]
[]
[]
[]
[]
[]
[]
[]
[]
[]
[]
[]
[]
[]
[]
[]
[]
[]
[]
[]
[]
[]
[]
[]
[]
[]
[]
[]
[]
[]
[]
[]
[]
[]
[]
[]
[]
[]
[]
[]
[]
[]
[]
[]
[]
[]
[]
[]
[]
[]
[]
[]
[]
[]
[]
[]
[]
[]
[]
[]
[]
[]
[]
[]
[]
[]
[]
[]
[]
[]
[]
[]
[]
[]
[]
[]
[]
[]
[]
[]
[]
[]
[]
[]
[]
[]
[]
[]
[]
[]
[]
[]
[]
[]
[]
[]
[]
[]
[]
[]
[]
[]
[]
[]
[]
[]
[]
[]
[]
[]
[]
[]
[]
[]
[]
[]
[]
[]
[]
[]
[]
[]
[]
[]
[]
[]
[]
[]
[]
[]
[]
[]
[]
[]
[]
[]
[]
[]
[]
[]
[]
[]
[]
[]
[]
[]
[]
[]
[]
[]
[]
[]
[]
[]
[]
[]
[]
[]
[]
[]
[]
[]
[]
[]
[]
[]
[]
[]
[]
[]
[]
[]
[]
[]
[]
[]
[]
[]
[]
[]
[]
[]
[]
[]
[]
[]
[]
[]
[]
[]
[]
[]
[]
[]
[]
[]
[]
[]
[]
[]
[]
[]
[]
[]
[]
[]
[]
[]
[]
[]
[]
[]
[]
[]
[]
[]
[]
[]
[]
[]
[]
[]
[]
[]
[]
[]
[]
[]
[]
[]
[]
[]
[]
[]
[]
[]
[]
[]
[]
[]
[]
[]
[]
[]
[]
[]
[]
[]
[]
[]
[]
[]
[]
[]
[]
[]
[]
[]
[]
[]
[]
[]
[]
[]
[]
[]
[]
[]
[]
[]
[]
[]
[]
[]
[]
[]
[]
[]
[]
[]
[]
[]
[]
[]
[]
[]
[]
[]
[]
[]
[]
[]
[]
[]
[]
[]
[]
[]
[]
[]
[]
[]
[]
[]
[]
[]
[]
[]
[]
[]
[]
[]
[]
[]
[]
[]
[]
[]
[]
[]
[]
[]
[]
[]
[]
[]
[]
[]
[]
[]
[]
[]
[]
[]
[]
[]
[]
[]
[]
[]
[]
[]
[]
[]
[]
[]
[]
[]
[]
[]
[]
[]
[]
[]
[]
[]
[]
[]
[]
[]
[]
[]
[]
[]
[]
[]
[]
[]
[]
[]
[]
[]
[]
[]
[]
[]
[]
[]
[]
[]
[]
[]
[]
[]
[]
[]
[]
[]
[]
[]
[]
[]
[]
[]
[]
[]
[]
[]
[]
[]
[]
[]
[]
[]
[]
[]
[]
[]
[]
[]
[]
[]
[]
[]
[]
[]
[]
[]
[]
[]
[]
[]
[]
[]
[]
[]
[]
[]
[]
[]
[]
[]
[]
[]
[]
[]
[]
[]
[]
[]
[]
[]
[]
[]
[]
[]
[]
[]
[]
[]
[]
[]
[]
[]
[]
[]
[]
[]
[]
[]
[]
[]
[]
[]
[]
[]
[]
[]
[]
[]
[]
[]
[]
[]
[]
[]
[]
[]
[]
[]
[]
[]
[]
[]
[]
[]
[]
[]
[]
[]
[]
[]
[]
[]
[]
[]
[]
[]
[]
[]
[]
[]
[]
[]
[]
[]
[]
[]
[]
[]
[]
[]
[]
[]
[]
[]
[]
[]
[]
[]
[]
[]
[]
[]
[]
[]
[]
[]
[]
[]
[]
[]
[]
[]
[]
[]
[]
[]
[]
[]
[]
[]
[]
[]
[]
[]
[]
[]
[]
[]
[]
[]
[]
[]
[]
[]
[]
[]
[]
[]
[]
[]
[]
[]
[]
[]
[]
[]
[]
[]
[]
[]
[]
[]
[]
[]
[]
[]
[]
[]
[]
[]
[]
[]
[]
[]
[]
[]
[]
[]
[]
[]
[]
[]
[]
[]
[]
[]
[]
[]
[]
[]
[]
[]
[]
[]
[]
[]
[]
[]
[]
[]
[]
[]
[]
[]
[]
[]
[]
[]
[]
[]
[]
[]
[]
[]
[]
[]
[]
[]
[]
[]
[]
[]
[]
[]
[]
[]
[]
[]
[]
[]
[]
[]
[]
[]
[]
[]
[]
[]
[]
[]
[]
[]
[]
[]
[]
[]
[]
[]
[]
[]
[]
[]
[]
[]
[]
[]
[]
[]
[]
[]
[]
[]
[]
[]
[]
[]
[]
[]
[]
[]
[]
[]
[]
[]
[]
[]
[]
[]
[]
[]
[]
[]
[]
[]
[]
[]
[]
[]
[]
[]
[]
[]
[]
[]
[]
[]
[]
[]
[]
[]
[]
[]
[]
[]
[]
[]
[]
[]
[]
[]
[]
[]
[]
[]
[]
[]
[]
[]
[]
[]
[]
[]
[]
[]
[]
[]
[]
[]
[]
[]
[]
[]
[]
[]
[]
[]
[]
[]
[]
[]
[]
[]
[]
[]
[]
[]
[]
[]
[]
[]
[]
[]
[]
[]
[]
[]
[]
[]
[]
[]
[]
[]
[]
[]
[]
[]
[]
[]
[]
[]
[]
[]
[]
[]
[]
[]
[]
[]
[]
[]
[]
[]
[]
[]
[]
[]
[]
[]
[]
[]
[]
[]
[]
[]
[]
[]
[]
[]
[]
[]
[]
[]
[]
[]
[]
[]
[]
[]
[]
[]
[]
[]
[]
[]
[]
[]
[]
[]
[]
[]
[]
[]
[]
[]
[]
[]
[]
[]
[]
[]
[]
[]
[]
[]
[]
[]
[]
[]
[]
[]
[]
[]
[]
[]
[]
[]
[]
[]
[]
[]
[]
[]
[]
[]
[]
[]
[]
[]
[]
[]
[]
[]
[]
[]
[]
[]
[]
[]
[]
[]
[]
[]
[]
[]
[]
[]
[]
[]
[]
[]
[]
[]
[]
[]
[]
[]
[]
[]
[]
[]
[]
[]
[]
[]
[]
[]
[]
[]
[]
[]
[]
[]
[]
[]
[]
[]
[]
[]
[]
[]
[]
[]
[]
[]
[]
[]
[]
[]
[]
[]
[]
[]
[]
[]
[]
[]
[]
[]
[]
[]
[]
[]
[]
[]
[]
[]
[]
[]
[]
[]
[]
[]
[]
[]
[]
[]
[]
[]
[]
[]
[]
[]
[]
[]
[]
[]
[]
[]
[]
[]
[]
[]
[]
[]
[]
[]
[]
[]
[]
[]
[]
[]
[]
[]
[]
[]
[]
[]
[]
[]
[]
[]
[]
[]
[]
[]
[]
[]
[]
[]
[]
[]
[]
[]
[]
[]
[]
[]
[]
[]
[]
[]
[]
[]
[]
[]
[]
[]
[]
[]
[]
[]
[]
[]
[]
[]
[]
[]
[]
[]
[]
[]
[]
[]
[]
[]
[]
[]
[]
[]
[]
[]
[]
[]
[]
[]
[]
[]
[]
[]
[]
[]
[]
[]
[]
[]
[]
[]
[]
[]
[]
[]
[]
[]
[]
[]
[]
[]
[]
[]
[]
[]
[]
[]
[]
[]
[]
[]
[]
[]
[]
[]
[]
[]
[]
[]
[]
[]
[]
[]
[]
[]
[]
[]
[]
[]
[]
[]
[]
[]
[]
[]
[]
[]
[]
[]
[]
[]
[]
[]
[]
[]
[]
[]
[]
[]
[]
[]
[]
[]
[]
[]
[]
[]
[]
[]
[]
[]
[]
[]
[]
[]
[]
[]
[]
[]
[]
[]
[]
[]
[]
[]
[]
[]
[]
[]
[]
[]
[]
[]
[]
[]
[]
[]
[]
[]
[]
[]
[]
[]
[]
[]
[]
[]
[]
[]
[]
[]
[]
[]
[]
[]
[]
[]
[]
[]
[]
[]
[]
[]
[]
[]
[]
[]
[]
[]
[]
[]
[]
[]
[]
[]
[]
[]
[]
[]
[]
[]
[]
[]
[]
[]
[]
[]
[]
[]
[]
[]
[]
[]
[]
[]
[]
[]
[]
[]
[]
[]
[]
[]
[]
[]
[]
[]
[]
[]
[]
[]
[]
[]
[]
[]
[]
[]
[]
[]
[]
[]
[]
[]
[]
[]
[]
[]
[]
[]
[]
[]
[]
[]
[]
[]
[]
[]
[]
[]
[]
[]
[]
[]
[]
[]
[]
[]
[]
[]
[]
[]
[]
[]
[]
[]
[]
[]
[]
[]
[]
[]
[]
[]
[]
[]
[]
[]
[]
[]
[]
[]
[]
[]
[]
[]
[]
[]
[]
[]
[]
[]
[]
[]
[]
[]
[]
[]
[]
[]
[]
[]
[]
[]
[]
[]
[]
[]
[]
[]
[]
[]
[]
[]
[]
[]
[]
[]
[]
[]
[]
[]
[]
[]
[]
[]
[]
[]
[]
[]
[]
[]
[]
[]
[]
[]
[]
[]
[]
[]
[]
[]
[]
[]
[]
[]
[]
[]
[]
[]
[]
[]
[]
[]
[]
[]
[]
[]
[]
[]
[]
[]
[]
[]
[]
[]
[]
[]
[]
[]
[]
[]
[]
[]
[]
[]
[]
[]
[]
[]
[]
[]
[]
[]
[]
[]
[]
[]
[]
[]
[]
[]
[]
[]
[]
[]
[]
[]
[]
[]
[]
[]
[]
[]
[]
[]
[]
[]
[]
[]
[]
[]
[]
[]
[]
[]
[]
[]
[]
[]
[]
[]
[]
[]
[]
[]
[]
[]
[]
[]
[]
[]
[]
[]
[]
[]
[]
[]
[]
[]
[]
[]
[]
[]
[]
[]
[]
[]
[]
[]
[]
[]
[]
[]
[]
[]
[]
[]
[]
[]
[]
[]
[]
[]
[]
[]
[]
[]
[]
[]
[]
[]
[]
[]
[]
[]
[]
[]
[]
[]
[]
[]
[]
[]
[]
[]
[]
[]
[]
[]
[]
[]
[]
[]
[]
[]
[]
[]
[]
[]
[]
[]
[]
[]
[]
[]
[]
[]
[]
[]
[]
[]
[]
[]
[]
[]
[]
[]
[]
[]
[]
[]
[]
[]
[]
[]
[]
[]
[]
[]
[]
[]
[]
[]
[]
[]
[]
[]
[]
[]
[]
[]
[]
[]
[]
[]
[]
[]
[]
[]
[]
[]
[]
[]
[]
[]
[]
[]
[]
[]
[]
[]
[]
[]
[]
[]
[]
[]
[]
[]
[]
[]
[]
[]
[]
[]
[]
[]
[]
[]
[]
[]
[]
[]
[]
[]
[]
[]
[]
[]
[]
[]
[]
[]
[]
[]
[]
[]
[]
[]
[]
[]
[]
[]
[]
[]
[]
[]
[]
[]
[]
[]
[]
[]
[]
[]
[]
[]
[]
[]
[]
[]
[]
[]
[]
[]
[]
[]
[]
[]
[]
[]
[]
[]
[]
[]
[]
[]
[]
[]
[]
[]
[]
[]
[]
[]
[]
[]
[]
[]
[]
[]
[]
[]
[]
[]
[]
[]
[]
[]
[]
[]
[]
[]
[]
[]
[]
[]
[]
[]
[]
[]
[]
[]
[]
[]
[]
[]
[]
[]
[]
[]
[]
[]
[]
[]
[]
[]
[]
[]
[]
[]
[]
[]
[]
[]
[]
[]
[]
[]
[]
[]
[]
[]
[]
[]
[]
[]
[]
[]
[]
[]
[]
[]
[]
[]
[]
[]
[]
[]
[]
[]
[]
[]
[]
[]
[]
[]
[]
[]
[]
[]
[]
[]
[]
[]
[]
[]
[]
[]
[]
[]
[]
[]
[]
[]
[]
[]
[]
[]
[]
[]
[]
[]
[]
[]
[]
[]
[]
[]
[]
[]
[]
[]
[]
[]
[]
[]
[]
[]
[]
[]
[]
[]
[]
[]
[]
[]
[]
[]
[]
[]
[]
[]
[]
[]
[]
[]
[]
[]
[]
[]
[]
[]
[]
[]
[]
[]
[]
[]
[]
[]
[]
[]
[]
[]
[]
[]
[]
[]
[]
[]
[]
[]
[]
[]
[]
[]
[]
[]
[]
[]
[]
[]
[]
[]
[]
[]
[]
[]
[]
[]
[]
[]
[]
[]
[]
[]
[]
[]
[]
[]
[]
[]
[]
[]
[]
[]
[]
[]
[]
[]
[]
[]
[]
[]
[]
[]
[]
[]
[]
[]
[]
[]
[]
[]
[]
[]
[]
[]
[]
[]
[]
[]
[]
[]
[]
[]
[]
[]
[]
[]
[]
[]
[]
[]
[]
[]
[]
[]
[]
[]
[]
[]
[]
[]
[]
[]
[]
[]
[]
[]
[]
[]
[]
[]
[]
[]
[]
[]
[]
[]
[]
[]
[]
[]
[]
[]
[]
[]
[]
[]
[]
[]
[]
[]
[]
[]
[]
[]
[]
[]
[]
[]
[]
[]
[]
[]
[]
[]
[]
[]
[]
[]
[]
[]
[]
[]
[]
[]
[]
[]
[]
[]
[]
[]
[]
[]
[]
[]
[]
[]
[]
[]
[]
[]
[]
[]
[]
[]
[]
[]
[]
[]
[]
[]
[]
[]
[]
[]
[]
[]
[]
[]
[]
[]
[]
[]
[]
[]
[]
[]
[]
[]
[]
[]
[]
[]
[]
[]
[]
[]
[]
[]
[]
[]
[]
[]
[]
[]
[]
[]
[]
[]
[]
[]
[]
[]
[]
[]
[]
[]
[]
[]
[]
[]
[]
[]
[]
[]
[]
[]
[]
[]
[]
[]
[]
[]
[]
[]
[]
[]
[]
[]
[]
[]
[]
[]
[]
[]
[]
[]
[]
[]
[]
[]
[]
[]
[]
[]
[]
[]
[]
[]
[]
[]
[]
[]
[]
[]
[]
[]
[]
[]
[]
[]
[]
[]
[]
[]
[]
[]
[]
[]
[]
[]
[]
[]
[]
[]
[]
[]
[]
[]
[]
[]
[]
[]
[]
[]
[]
[]
[]
[]
[]
[]
[]
[]
[]
[]
[]
[]
[]
[]
[]
[]
[]
[]
[]
[]
[]
[]
[]
[]
[]
[]
[]
[]
[]
[]
[]
[]
[]
[]
[]
[]
[]
[]
[]
[]
[]
[]
[]
[]
[]
[]
[]
[]
[]
[]
[]
[]
[]
[]
[]
[]
[]
[]
[]
[]
[]
[]
[]
[]
[]
[]
[]
[]
[]
[]
[]
[]
[]
[]
[]
[]
[]
[]
[]
[]
[]
[]
[]
[]
[]
[]
[]
[]
[]
[]
[]
[]
[]
[]
[]
[]
[]
[]
[]
[]
[]
[]
[]
[]
[]
[]
[]
[]
[]
[]
[]
[]
[]
[]
[]
[]
[]
[]
[]
[]
[]
[]
[]
[]
[]
[]
[]
[]
[]
[]
[]
[]
[]
[]
[]
[]
[]
[]
[]
[]
[]
[]
[]
[]
[]
[]
[]
[]
[]
[]
[]
[]
[]
[]
[]
[]
[]
[]
[]
[]
[]
[]
[]
[]
[]
[]
[]
[]
[]
[]
[]
[]
[]
[]
[]
[]
[]
[]
[]
[]
[]
[]
[]
[]
[]
[]
[]
[]
[]
[]
[]
[]
[]
[]
[]
[]
[]
[]
[]
[]
[]
[]
[]
[]
[]
[]
[]
[]
[]
[]
[]
[]
[]
[]
[]
[]
[]
[]
[]
[]
[]
[]
[]
[]
[]
[]
[]
[]
[]
[]
[]
[]
[]
[]
[]
[]
[]
[]
[]
[]
[]
[]
[]
[]
[]
[]
[]
[]
[]
[]
[]
[]
[]
[]
[]
[]
[]
[]
[]
[]
[]
[]
[]
[]
[]
[]
[]
[]
[]
[]
[]
[]
[]
[]
[]
[]
[]
[]
[]
[]
[]
[]
[]
[]
[]
[]
[]
[]
[]
[]
[]
[]
[]
[]
[]
[]
[]
[]
[]
[]
[]
[]
[]
[]
[]
[]
[]
[]
[]
[]
[]
[]
[]
[]
[]
[]
[]
[]
[]
[]
[]
[]
[]
[]
[]
[]
[]
[]
[]
[]
[]
[]
[]
[]
[]
[]
[]
[]
[]
[]
[]
[]
[]
[]
[]
[]
[]
[]
[]
[]
[]
[]
[]
[]
[]
[]
[]
[]
[]
[]
[]
[]
[]
[]
[]
[]
[]
[]
[]
[]
[]
[]
[]
[]
[]
[]
[]
[]
[]
[]
[]
[]
[]
[]
[]
[]
[]
[]
[]
[]
[]
[]
[]
[]
[]
[]
[]
[]
[]
[]
[]
[]
[]
[]
[]
[]
[]
[]
[]
[]
[]
[]
[]
[]
[]
[]
[]
[]
[]
[]
[]
[]
[]
[]
[]
[]
[]
[]
[]
[]
[]
[]
[]
[]
[]
[]
[]
[]
[]
[]
[]
[]
[]
[]
[]
[]
[]
[]
[]
[]
[]
[]
[]
[]
[]
[]
[]
[]
[]
[]
[]
[]
[]
[]
[]
[]
[]
[]
[]
[]
[]
[]
[]
[]
[]
[]
[]
[]
[]
[]
[]
[]
[]
[]
[]
[]
[]
[]
[]
[]
[]
[]
[]
[]
[]
[]
[]
[]
[]
[]
[]
[]
[]
[]
[]
[]
[]
[]
[]
[]
[]
[]
[]
[]
[]
[]
[]
[]
[]
[]
[]
[]
[]
[]
[]
[]
[]
[]
[]
[]
[]
[]
[]
[]
[]
[]
[]
[]
[]
[]
[]
[]
[]
[]
[]
[]
[]
[]
[]
[]
[]
[]
[]
[]
[]
[]
[]
[]
[]
[]
[]
[]
[]
[]
[]
[]
[]
[]
[]
[]
[]
[]
[]
[]
[]
[]
[]
[]
[]
[]
[]
[]
[]
[]
[]
[]
[]
[]
[]
[]
[]
[]
[]
[]
[]
[]
[]
[]
[]
[]
[]
[]
[]
[]
[]
[]
[]
[]
[]
[]
[]
[]
[]
[]
[]
[]
[]
[]
[]
[]
[]
[]
[]
[]
[]
[]
[]
[]
[]
[]
[]
[]
[]
[]
[]
[]
[]
[]
[]
[]
[]
[]
[]
[]
[]
[]
[]
[]
[]
[]
[]
[]
[]
[]
[]
[]
[]
[]
[]
[]
[]
[]
[]
[]
[]
[]
[]
[]
[]
[null,null,null,null,null,null,null,null,null,null,null,"                                                                                                                                                                                                                                                                                                                                                                                                                                                                                                                                                                                                                                                                                                                                                                                                                                                                                    "]

{"sheet":"BDDG","index":2,"n_rows":1616,"n_cols":22,"rows_kept":1616,"cut":false,"hidden":false,"merged":[]}
[1,2,3,4,5,6,7,8,9,10,11,12,13,14,15,16,17,18,19,20,21]
["Code","Pierre","Paul","Jules","André","Michel","Nbrs de sources  ","Nom ou N° Ciel  1 (DROITE)","Vol 1","Temps 1","Nom ou N° Ciel  2 (GAUCHE)","Vol 2","Temps 2","Nom ou N° Ciel  3 (MILIEU)","Vol 3","Temps 3","Nom ou N° Ciel  4 ( mazoire)","Vol 4","Temps 4","Seuil alerte","Observation(s) "]
[804,null,"Pomme",104,"Navet","A",1,"AA"]
[809,null,"Pomme",104,"Carde","B",2,"droite HS HS HS HS HS HS HS HS HS HS ","xxxxx","xxxxxxx","BBB (gauche)"]
[811,null,"Poire",104,"Poireaux","C",1,"CC"]
[816,null,"Pomme",104,"Courgette","D",3,"DD (droite)",null,null,"DDD( Gauche)",null,null,"DDDD (Milieu)"]
[881,null,"Pomme",104,"Radis","E",1,"EE",null,null,null,null,null,null,null,null,null,null,null,1]
[828,null,"Poire",104,"Tomate","F",1,"FF",null,null,null,null,null,null,null,null,null,null,null,16]
[]
[]
[]
[]
[]
[]
[]
[]
[]
[]
[]
[]
[]
[]
[]
[]
[]
[]
[]
[]
[]
[]
[]
[]
[]
[]
[]
[]
[]
[]
[]
[]
[]
[]
[]
[]
[]
[]
[]
[]
[]
[]
[]
[]
[]
[]
[]
[]
[]
[]
[]
[]
[]
[]
[]
[]
[]
[]
[]
[]
[]
[]
[]
[]
[]
[]
[]
[]
[]
[]
[]
[]
[]
[]
[]
[]
[]
[]
[]
[]
[]
[]
[]
[]
[]
[]
[]
[]
[]
[]
[]
[]
[]
[]
[]
[]
[]
[]
[]
[]
[]
[]
[]
[]
[]
[]
[]
[]
[]
[]
[]
[]
[]
[]
[]
[]
[]
[]
[]
[]
[]
[]
[]
[]
[]
[]
[]
[]
[]
[]
[]
[]
[]
[]
[]
[]
[]
[]
[]
[]
[]
[]
[]
[]
[]
[]
[]
[]
[]
[]
[]
[]
[]
[]
[]
[]
[]
[]
[]
[]
[]
[]
[]
[]
[]
[]
[]
[]
[]
[]
[]
[]
[]
[]
[]
[]
[]
[]
[]
[]
[]
[]
[]
[]
[]
[]
[]
[]
[]
[]
[]
[]
[]
[]
[]
[]
[]
[]
[]
[]
[]
[]
[]
[]
[]
[]
[]
[]
[]
[]
[]
[]
[]
[]
[]
[]
[]
[]
[]
[]
[]
[]
[]
[]
[]
[]
[]
[]
[]
[]
[]
[]
[]
[]
[]
[]
[]
[]
[]
[]
[]
[]
[]
[]
[]
[]
[]
[]
[]
[]
[]
[]
[]
[]
[]
[]
[]
[]
[]
[]
[]
[]
[]
[]
[]
[]
[]
[]
[]
[]
[]
[]
[]
[]
[]
[]
[]
[]
[]
[]
[]
[]
[]
[]
[]
[]
[]
[]
[]
[]
[]
[]
[]
[]
[]
[]
[]
[]
[]
[]
[]
[]
[]
[]
[]
[]
[]
[]
[]
[]
[]
[]
[]
[]
[]
[]
[]
[]
[]
[]
[]
[]
[]
[]
[]
[]
[]
[]
[]
[]
[]
[]
[]
[]
[]
[]
[]
[]
[]
[]
[]
[]
[]
[]
[]
[]
[]
[]
[]
[]
[]
[]
[]
[]
[]
[]
[]
[]
[]
[]
[]
[]
[]
[]
[]
[]
[]
[]
[]
[]
[]
[]
[]
[]
[]
[]
[]
[]
[]
[]
[]
[]
[]
[]
[]
[]
[]
[]
[]
[]
[]
[]
[]
[]
[]
[]
[]
[]
[]
[]
[]
[]
[]
[]
[]
[]
[]
[]
[]
[]
[]
[]
[]
[]
[]
[]
[]
[]
[]
[]
[]
[]
[]
[]
[]
[]
[]
[]
[]
[]
[]
[]
[]
[]
[]
[]
[]
[]
[]
[]
[]
[]
[]
[]
[]
[]
[]
[]
[]
[]
[]
[]
[]
[]
[]
[]
[]
[]
[]
[]
[]
[]
[]
[]
[]
[]
[]
[]
[]
[]
[]
[]
[]
[]
[]
[]
[]
[]
[]
[]
[]
[]
[]
[]
[]
[]
[]
[]
[]
[]
[]
[]
[]
[]
[]
[]
[]
[]
[]
[]
[]
[]
[]
[]
[]
[]
[]
[]
[]
[]
[]
[]
[]
[]
[]
[]
[]
[]
[]
[]
[]
[]
[]
[]
[]
[]
[]
[]
[]
[]
[]
[]
[]
[]
[]
[]
[]
[]
[]
[]
[]
[]
[]
[]
[]
[]
[]
[]
[]
[]
[]
[]
[]
[]
[]
[]
[]
[]
[]
[]
[]
[]
[]
[]
[]
[]
[]
[]
[]
[]
[]
[]
[]
[]
[]
[]
[]
[]
[]
[]
[]
[]
[]
[]
[]
[]
[]
[]
[]
[]
[]
[]
[]
[]
[]
[]
[]
[]
[]
[]
[]
[]
[]
[]
[]
[]
[]
[]
[]
[]
[]
[]
[]
[]
[]
[]
[]
[]
[]
[]
[]
[]
[]
[]
[]
[]
[]
[]
[]
[]
[]
[]
[]
[]
[]
[]
[]
[]
[]
[]
[]
[]
[]
[]
[]
[]
[]
[]
[]
[]
[]
[]
[]
[]
[]
[]
[]
[]
[]
[]
[]
[]
[]
[]
[]
[]
[]
[]
[]
[]
[]
[]
[]
[]
[]
[]
[]
[]
[]
[]
[]
[]
[]
[]
[]
[]
[]
[]
[]
[]
[]
[]
[]
[]
[]
[]
[]
[]
[]
[]
[]
[]
[]
[]
[]
[]
[]
[]
[]
[]
[]
[]
[]
[]
[]
[]
[]
[]
[]
[]
[]
[]
[]
[]
[]
[]
[]
[]
[]
[]
[]
[]
[]
[]
[]
[]
[]
[]
[]
[]
[]
[]
[]
[]
[]
[]
[]
[]
[]
[]
[]
[]
[]
[]
[]
[]
[]
[]
[]
[]
[]
[]
[]
[]
[]
[]
[]
[]
[]
[]
[]
[]
[]
[]
[]
[]
[]
[]
[]
[]
[]
[]
[]
[]
[]
[]
[]
[]
[]
[]
[]
[]
[]
[]
[]
[]
[]
[]
[]
[]
[]
[]
[]
[]
[]
[]
[]
[]
[]
[]
[]
[]
[]
[]
[]
[]
[]
[]
[]
[]
[]
[]
[]
[]
[]
[]
[]
[]
[]
[]
[]
[]
[]
[]
[]
[]
[]
[]
[]
[]
[]
[]
[]
[]
[]
[]
[]
[]
[]
[]
[]
[]
[]
[]
[]
[]
[]
[]
[]
[]
[]
[]
[]
[]
[]
[]
[]
[]
[]
[]
[]
[]
[]
[]
[]
[]
[]
[]
[]
[]
[]
[]
[]
[]
[]
[]
[]
[]
[]
[]
[]
[]
[]
[]
[]
[]
[]
[]
[]
[]
[]
[]
[]
[]
[]
[]
[]
[]
[]
[]
[]
[]
[]
[]
[]
[]
[]
[]
[]
[]
[]
[]
[]
[]
[]
[]
[]
[]
[]
[]
[]
[]
[]
[]
[]
[]
[]
[]
[]
[]
[]
[]
[]
[]
[]
[]
[]
[]
[]
[]
[]
[]
[]
[]
[]
[]
[]
[]
[]
[]
[]
[]
[]
[]
[]
[]
[]
[]
[]
[]
[]
[]
[]
[]
[]
[]
[]
[]
[]
[]
[]
[]
[]
[]
[]
[]
[]
[]
[]
[]
[]
[]
[]
[]
[]
[]
[]
[]
[]
[]
[]
[]
[]
[]
[]
[]
[]
[]
[]
[]
[]
[]
[]
[]
[]
[]
[]
[]
[]
[]
[]
[]
[]
[]
[]
[]
[]
[]
[]
[]
[]
[]
[]
[]
[]
[]
[]
[]
[]
[]
[]
[]
[]
[]
[]
[]
[]
[]
[]
[]
[]
[]
[]
[]
[]
[]
[]
[]
[]
[]
[]
[]
[]
[]
[]
[]
[]
[]
[]
[]
[]
[]
[]
[]
[]
[]
[]
[]
[]
[]
[]
[]
[]
[]
[]
[]
[]
[]
[]
[]
[]
[]
[]
[]
[]
[]
[]
[]
[]
[]
[]
[]
[]
[]
[]
[]
[]
[]
[]
[]
[]
[]
[]
[]
[]
[]
[]
[]
[]
[]
[]
[]
[]
[]
[]
[]
[]
[]
[]
[]
[]
[]
[]
[]
[]
[]
[]
[]
[]
[]
[]
[]
[]
[]
[]
[]
[]
[]
[]
[]
[]
[]
[]
[]
[]
[]
[]
[]
[]
[]
[]
[]
[]
[]
[]
[]
[]
[]
[]
[]
[]
[]
[]
[]
[]
[]
[]
[]
[]
[]
[]
[]
[]
[]
[]
[]
[]
[]
[]
[]
[]
[]
[]
[]
[]
[]
[]
[]
[]
[]
[]
[]
[]
[]
[]
[]
[]
[]
[]
[]
[]
[]
[]
[]
[]
[]
[]
[]
[]
[]
[]
[]
[]
[]
[]
[]
[]
[]
[]
[]
[]
[]
[]
[]
[]
[]
[]
[]
[]
[]
[]
[]
[]
[]
[]
[]
[]
[]
[]
[]
[]
[]
[]
[]
[]
[]
[]
[]
[]
[]
[]
[]
[]
[]
[]
[]
[]
[]
[]
[]
[]
[]
[]
[]
[]
[]
[]
[]
[]
[]
[]
[]
[]
[]
[]
[]
[]
[]
[]
[]
[]
[]
[]
[]
[]
[]
[]
[]
[]
[]
[]
[]
[]
[]
[]
[]
[]
[]
[]
[]
[]
[]
[]
[]
[]
[]
[]
[]
[]
[]
[]
[]
[]
[]
[]
[]
[]
[]
[]
[]
[]
[]
[]
[]
[]
[]
[]
[]
[]
[]
[]
[]
[]
[]
[]
[]
[]
[]
[]
[]
[]
[]
[]
[]
[]
[]
[]
[]
[]
[]
[]
[]
[]
[]
[]
[]
[]
[]
[]
[]
[]
[]
[]
[]
[]
[]
[]
[]
[]
[]
[]
[]
[]
[]
[]
[]
[]
[]
[]
[]
[]
[]
[]
[]
[]
[]
[]
[]
[]
[]
[]
[]
[]
[]
[]
[]
[]
[]
[]
[]
[]
[]
[]
[]
[]
[]
[]
[]
[]
[]
[]
[]
[]
[]
[]
[]
[]
[]
[]
[]
[]
[]
[]
[]
[]
[]
[]
[]
[]
[]
[]
[]
[]
[]
[]
[]
[]
[]
[]
[]
[]
[]
[]
[]
[]
[]
[]
[]
[]
[]
[]
[]
[]
[]
[]
[]
[]
[]
[]
[]
[]
[]
[]
[]
[]
[]
[]
[]
[]
[]
[]
[]
[]
[]
[]
[]
[]
[]
[]
[]
[]
[]
[]
[]
[]
[]
[]
[]
[]
[]
[]
[]
[]
[]
[]
[]
[]
[]
[]
[]
[]
[]
[]
[]
[]
[]
[]
[]
[]
[]
[]
[]
[]
[]
[]
[]
[]
[]
[]
[]
[]
[]
[]
[]
[]
[]
[]
[]
[]
[]
[]
[]
[]
[]
[]
[]
[]
[]
[]
[]
[]
[]
[]
[]
[]
[]
[]
[]
[]
[]
[]
[]
[]
[]
[]
[]
[]
[]
[]
[]
[]
[]
[]
[]
[]
[]
[]
[]
[]
[]
[]
[]
[]
[]
[]
[]
[]
[]
[]
[]
[]
[]
[]
[]
[]
[]
[]
[]
[]
[]
[]
[]
[]
[]
[]
[]
[]
["2015-12-31","Couvert",823,null,null,null,null,null,null,null,null,null,null,null,null,null,null,null,null,null,11,70.400000000000006]

{"sheet":"M.M.I.A 104","index":3,"n_rows":24,"n_cols":43,"rows_kept":24,"cut":false,"hidden":false,"merged":[[20,26,20,28],[20,22,20,24],[20,30,20,35],[23,24,23,32]]}
[null,1990,1991,1992,1993,1994,1995,1996,1997,1998,1999,2000,2001,2002,2003,2004,2005,2006,2007,2008,2009,2010,2011,2012,2013,2014,2015,2016,2017,2018,2019,2020,2021,2022,2023,2024,2025,2026,2027,2028,2029,2030,"M.M.I.A"]
["Janvier",{"$f":"IFERROR(SUMIFS(Jaugeage!$AA:$AA,Jaugeage!$AB:$AB,MATCH($A2,$A$2:$A$13,0),Jaugeage!$AC:$AC,B$1,Jaugeage!$H:$H,$AE$21),\"\")","v":0},{"$f":"IFERROR(SUMIFS(Jaugeage!$AA:$AA,Jaugeage!$AB:$AB,MATCH($A2,$A$2:$A$13,0),Jaugeage!$AC:$AC,C$1,Jaugeage!$H:$H,$AE$21),\"\")","v":0},{"$f":"IFERROR(SUMIFS(Jaugeage!$AA:$AA,Jaugeage!$AB:$AB,MATCH($A2,$A$2:$A$13,0),Jaugeage!$AC:$AC,D$1,Jaugeage!$H:$H,$AE$21),\"\")","v":0},{"$f":"IFERROR(SUMIFS(Jaugeage!$AA:$AA,Jaugeage!$AB:$AB,MATCH($A2,$A$2:$A$13,0),Jaugeage!$AC:$AC,E$1,Jaugeage!$H:$H,$AE$21),\"\")","v":0},{"$f":"IFERROR(SUMIFS(Jaugeage!$AA:$AA,Jaugeage!$AB:$AB,MATCH($A2,$A$2:$A$13,0),Jaugeage!$AC:$AC,F$1,Jaugeage!$H:$H,$AE$21),\"\")","v":0},{"$f":"IFERROR(SUMIFS(Jaugeage!$AA:$AA,Jaugeage!$AB:$AB,MATCH($A2,$A$2:$A$13,0),Jaugeage!$AC:$AC,G$1,Jaugeage!$H:$H,$AE$21),\"\")","v":0},{"$f":"IFERROR(SUMIFS(Jaugeage!$AA:$AA,Jaugeage!$AB:$AB,MATCH($A2,$A$2:$A$13,0),Jaugeage!$AC:$AC,H$1,Jaugeage!$H:$H,$AE$21),\"\")","v":0},{"$f":"IFERROR(SUMIFS(Jaugeage!$AA:$AA,Jaugeage!$AB:$AB,MATCH($A2,$A$2:$A$13,0),Jaugeage!$AC:$AC,I$1,Jaugeage!$H:$H,$AE$21),\"\")","v":0},{"$f":"IFERROR(SUMIFS(Jaugeage!$AA:$AA,Jaugeage!$AB:$AB,MATCH($A2,$A$2:$A$13,0),Jaugeage!$AC:$AC,J$1,Jaugeage!$H:$H,$AE$21),\"\")","v":0},{"$f":"IFERROR(SUMIFS(Jaugeage!$AA:$AA,Jaugeage!$AB:$AB,MATCH($A2,$A$2:$A$13,0),Jaugeage!$AC:$AC,K$1,Jaugeage!$H:$H,$AE$21),\"\")","v":0},{"$f":"IFERROR(SUMIFS(Jaugeage!$AA:$AA,Jaugeage!$AB:$AB,MATCH($A2,$A$2:$A$13,0),Jaugeage!$AC:$AC,L$1,Jaugeage!$H:$H,$AE$21),\"\")","v":0},{"$f":"IFERROR(SUMIFS(Jaugeage!$AA:$AA,Jaugeage!$AB:$AB,MATCH($A2,$A$2:$A$13,0),Jaugeage!$AC:$AC,M$1,Jaugeage!$H:$H,$AE$21),\"\")","v":0},{"$f":"IFERROR(SUMIFS(Jaugeage!$AA:$AA,Jaugeage!$AB:$AB,MATCH($A2,$A$2:$A$13,0),Jaugeage!$AC:$AC,N$1,Jaugeage!$H:$H,$AE$21),\"\")","v":0},{"$f":"IFERROR(SUMIFS(Jaugeage!$AA:$AA,Jaugeage!$AB:$AB,MATCH($A2,$A$2:$A$13,0),Jaugeage!$AC:$AC,O$1,Jaugeage!$H:$H,$AE$21),\"\")","v":0},{"$f":"IFERROR(SUMIFS(Jaugeage!$AA:$AA,Jaugeage!$AB:$AB,MATCH($A2,$A$2:$A$13,0),Jaugeage!$AC:$AC,P$1,Jaugeage!$H:$H,$AE$21),\"\")","v":0},{"$f":"IFERROR(SUMIFS(Jaugeage!$AA:$AA,Jaugeage!$AB:$AB,MATCH($A2,$A$2:$A$13,0),Jaugeage!$AC:$AC,Q$1,Jaugeage!$H:$H,$AE$21),\"\")","v":0},{"$f":"IFERROR(SUMIFS(Jaugeage!$AA:$AA,Jaugeage!$AB:$AB,MATCH($A2,$A$2:$A$13,0),Jaugeage!$AC:$AC,R$1,Jaugeage!$H:$H,$AE$21),\"\")","v":0},{"$f":"IFERROR(SUMIFS(Jaugeage!$AA:$AA,Jaugeage!$AB:$AB,MATCH($A2,$A$2:$A$13,0),Jaugeage!$AC:$AC,S$1,Jaugeage!$H:$H,$AE$21),\"\")","v":0},{"$f":"IFERROR(SUMIFS(Jaugeage!$AA:$AA,Jaugeage!$AB:$AB,MATCH($A2,$A$2:$A$13,0),Jaugeage!$AC:$AC,T$1,Jaugeage!$H:$H,$AE$21),\"\")","v":0},{"$f":"IFERROR(SUMIFS(Jaugeage!$AA:$AA,Jaugeage!$AB:$AB,MATCH($A2,$A$2:$A$13,0),Jaugeage!$AC:$AC,U$1,Jaugeage!$H:$H,$AE$21),\"\")","v":0},{"$f":"IFERROR(SUMIFS(Jaugeage!$AA:$AA,Jaugeage!$AB:$AB,MATCH($A2,$A$2:$A$13,0),Jaugeage!$AC:$AC,V$1,Jaugeage!$H:$H,$AE$21),\"\")","v":0},{"$f":"IFERROR(SUMIFS(Jaugeage!$AA:$AA,Jaugeage!$AB:$AB,MATCH($A2,$A$2:$A$13,0),Jaugeage!$AC:$AC,W$1,Jaugeage!$H:$H,$AE$21),\"\")","v":0},{"$f":"IFERROR(SUMIFS(Jaugeage!$AA:$AA,Jaugeage!$AB:$AB,MATCH($A2,$A$2:$A$13,0),Jaugeage!$AC:$AC,X$1,Jaugeage!$H:$H,$AE$21),\"\")","v":0},{"$f":"IFERROR(SUMIFS(Jaugeage!$AA:$AA,Jaugeage!$AB:$AB,MATCH($A2,$A$2:$A$13,0),Jaugeage!$AC:$AC,Y$1,Jaugeage!$H:$H,$AE$21),\"\")","v":0},{"$f":"IFERROR(SUMIFS(Jaugeage!$AA:$AA,Jaugeage!$AB:$AB,MATCH($A2,$A$2:$A$13,0),Jaugeage!$AC:$AC,Z$1,Jaugeage!$H:$H,$AE$21),\"\")","v":0},{"$f":"IFERROR(SUMIFS(Jaugeage!$AA:$AA,Jaugeage!$AB:$AB,MATCH($A2,$A$2:$A$13,0),Jaugeage!$AC:$AC,AA$1,Jaugeage!$H:$H,$AE$21),\"\")","v":0},{"$f":"IFERROR(SUMIFS(Jaugeage!$AA:$AA,Jaugeage!$AB:$AB,MATCH($A2,$A$2:$A$13,0),Jaugeage!$AC:$AC,AB$1,Jaugeage!$H:$H,$AE$21),\"\")","v":0},{"$f":"IFERROR(SUMIFS(Jaugeage!$AA:$AA,Jaugeage!$AB:$AB,MATCH($A2,$A$2:$A$13,0),Jaugeage!$AC:$AC,AC$1,Jaugeage!$H:$H,$AE$21),\"\")","v":0},{"$f":"IFERROR(SUMIFS(Jaugeage!$AA:$AA,Jaugeage!$AB:$AB,MATCH($A2,$A$2:$A$13,0),Jaugeage!$AC:$AC,AD$1,Jaugeage!$H:$H,$AE$21),\"\")","v":0},{"$f":"IFERROR(SUMIFS(Jaugeage!$AA:$AA,Jaugeage!$AB:$AB,MATCH($A2,$A$2:$A$13,0),Jaugeage!$AC:$AC,AE$1,Jaugeage!$H:$H,$AE$21),\"\")","v":0},{"$f":"IFERROR(SUMIFS(Jaugeage!$AA:$AA,Jaugeage!$AB:$AB,MATCH($A2,$A$2:$A$13,0),Jaugeage!$AC:$AC,AF$1,Jaugeage!$H:$H,$AE$21),\"\")","v":0},{"$f":"IFERROR(SUMIFS(Jaugeage!$AA:$AA,Jaugeage!$AB:$AB,MATCH($A2,$A$2:$A$13,0),Jaugeage!$AC:$AC,AG$1,Jaugeage!$H:$H,$AE$21),\"\")","v":0},{"$f":"IFERROR(SUMIFS(Jaugeage!$AA:$AA,Jaugeage!$AB:$AB,MATCH($A2,$A$2:$A$13,0),Jaugeage!$AC:$AC,AH$1,Jaugeage!$H:$H,$AE$21),\"\")","v":0},{"$f":"IFERROR(SUMIFS(Jaugeage!$AA:$AA,Jaugeage!$AB:$AB,MATCH($A2,$A$2:$A$13,0),Jaugeage!$AC:$AC,AI$1,Jaugeage!$H:$H,$AE$21),\"\")","v":0},{"$f":"IFERROR(SUMIFS(Jaugeage!$AA:$AA,Jaugeage!$AB:$AB,MATCH($A2,$A$2:$A$13,0),Jaugeage!$AC:$AC,AJ$1,Jaugeage!$H:$H,$AE$21),\"\")","v":0},{"$f":"IFERROR(AVERAGEIFS(Jaugeage!$AA:$AA,Jaugeage!$AB:$AB,MATCH($A2,$A$2:$A$13,0),Jaugeage!$AC:$AC,AK$1,Jaugeage!$H:$H,$AE$21),\"\")","v":""},{"$f":"IFERROR(AVERAGEIFS(Jaugeage!$AA:$AA,Jaugeage!$AB:$AB,MATCH($A2,$A$2:$A$13,0),Jaugeage!$AC:$AC,AL$1,Jaugeage!$H:$H,$AE$21),\"\")","v":""},{"$f":"IFERROR(AVERAGEIFS(Jaugeage!$AA:$AA,Jaugeage!$AB:$AB,MATCH($A2,$A$2:$A$13,0),Jaugeage!$AC:$AC,AM$1,Jaugeage!$H:$H,$AE$21),\"\")","v":""},{"$f":"IFERROR(AVERAGEIFS(Jaugeage!$AA:$AA,Jaugeage!$AB:$AB,MATCH($A2,$A$2:$A$13,0),Jaugeage!$AC:$AC,AN$1,Jaugeage!$H:$H,$AE$21),\"\")","v":""},{"$f":"IFERROR(AVERAGEIFS(Jaugeage!$AA:$AA,Jaugeage!$AB:$AB,MATCH($A2,$A$2:$A$13,0),Jaugeage!$AC:$AC,AO$1,Jaugeage!$H:$H,$AE$21),\"\")","v":""},{"$f":"IFERROR(AVERAGEIFS(Jaugeage!$AA:$AA,Jaugeage!$AB:$AB,MATCH($A2,$A$2:$A$13,0),Jaugeage!$AC:$AC,AP$1,Jaugeage!$H:$H,$AE$21),\"\")","v":""},{"$f":"AVERAGEIF(B2:AJ2,\"<>0\")","v":{"$error":"#DIV/0!"}}]
["Février",{"$f":"IFERROR(SUMIFS(Jaugeage!$AA:$AA,Jaugeage!$AB:$AB,MATCH($A3,$A$2:$A$13,0),Jaugeage!$AC:$AC,B$1,Jaugeage!$H:$H,$AE$21),\"\")","v":0},{"$f":"IFERROR(SUMIFS(Jaugeage!$AA:$AA,Jaugeage!$AB:$AB,MATCH($A3,$A$2:$A$13,0),Jaugeage!$AC:$AC,C$1,Jaugeage!$H:$H,$AE$21),\"\")","v":0},{"$f":"IFERROR(SUMIFS(Jaugeage!$AA:$AA,Jaugeage!$AB:$AB,MATCH($A3,$A$2:$A$13,0),Jaugeage!$AC:$AC,D$1,Jaugeage!$H:$H,$AE$21),\"\")","v":0},{"$f":"IFERROR(SUMIFS(Jaugeage!$AA:$AA,Jaugeage!$AB:$AB,MATCH($A3,$A$2:$A$13,0),Jaugeage!$AC:$AC,E$1,Jaugeage!$H:$H,$AE$21),\"\")","v":0},{"$f":"IFERROR(SUMIFS(Jaugeage!$AA:$AA,Jaugeage!$AB:$AB,MATCH($A3,$A$2:$A$13,0),Jaugeage!$AC:$AC,F$1,Jaugeage!$H:$H,$AE$21),\"\")","v":0},{"$f":"IFERROR(SUMIFS(Jaugeage!$AA:$AA,Jaugeage!$AB:$AB,MATCH($A3,$A$2:$A$13,0),Jaugeage!$AC:$AC,G$1,Jaugeage!$H:$H,$AE$21),\"\")","v":0},{"$f":"IFERROR(SUMIFS(Jaugeage!$AA:$AA,Jaugeage!$AB:$AB,MATCH($A3,$A$2:$A$13,0),Jaugeage!$AC:$AC,H$1,Jaugeage!$H:$H,$AE$21),\"\")","v":0},{"$f":"IFERROR(SUMIFS(Jaugeage!$AA:$AA,Jaugeage!$AB:$AB,MATCH($A3,$A$2:$A$13,0),Jaugeage!$AC:$AC,I$1,Jaugeage!$H:$H,$AE$21),\"\")","v":0},{"$f":"IFERROR(SUMIFS(Jaugeage!$AA:$AA,Jaugeage!$AB:$AB,MATCH($A3,$A$2:$A$13,0),Jaugeage!$AC:$AC,J$1,Jaugeage!$H:$H,$AE$21),\"\")","v":0},{"$f":"IFERROR(SUMIFS(Jaugeage!$AA:$AA,Jaugeage!$AB:$AB,MATCH($A3,$A$2:$A$13,0),Jaugeage!$AC:$AC,K$1,Jaugeage!$H:$H,$AE$21),\"\")","v":0},{"$f":"IFERROR(SUMIFS(Jaugeage!$AA:$AA,Jaugeage!$AB:$AB,MATCH($A3,$A$2:$A$13,0),Jaugeage!$AC:$AC,L$1,Jaugeage!$H:$H,$AE$21),\"\")","v":0},{"$f":"IFERROR(SUMIFS(Jaugeage!$AA:$AA,Jaugeage!$AB:$AB,MATCH($A3,$A$2:$A$13,0),Jaugeage!$AC:$AC,M$1,Jaugeage!$H:$H,$AE$21),\"\")","v":0},{"$f":"IFERROR(SUMIFS(Jaugeage!$AA:$AA,Jaugeage!$AB:$AB,MATCH($A3,$A$2:$A$13,0),Jaugeage!$AC:$AC,N$1,Jaugeage!$H:$H,$AE$21),\"\")","v":0},{"$f":"IFERROR(SUMIFS(Jaugeage!$AA:$AA,Jaugeage!$AB:$AB,MATCH($A3,$A$2:$A$13,0),Jaugeage!$AC:$AC,O$1,Jaugeage!$H:$H,$AE$21),\"\")","v":0},{"$f":"IFERROR(SUMIFS(Jaugeage!$AA:$AA,Jaugeage!$AB:$AB,MATCH($A3,$A$2:$A$13,0),Jaugeage!$AC:$AC,P$1,Jaugeage!$H:$H,$AE$21),\"\")","v":0},{"$f":"IFERROR(SUMIFS(Jaugeage!$AA:$AA,Jaugeage!$AB:$AB,MATCH($A3,$A$2:$A$13,0),Jaugeage!$AC:$AC,Q$1,Jaugeage!$H:$H,$AE$21),\"\")","v":0},{"$f":"IFERROR(SUMIFS(Jaugeage!$AA:$AA,Jaugeage!$AB:$AB,MATCH($A3,$A$2:$A$13,0),Jaugeage!$AC:$AC,R$1,Jaugeage!$H:$H,$AE$21),\"\")","v":0},{"$f":"IFERROR(SUMIFS(Jaugeage!$AA:$AA,Jaugeage!$AB:$AB,MATCH($A3,$A$2:$A$13,0),Jaugeage!$AC:$AC,S$1,Jaugeage!$H:$H,$AE$21),\"\")","v":0},{"$f":"IFERROR(SUMIFS(Jaugeage!$AA:$AA,Jaugeage!$AB:$AB,MATCH($A3,$A$2:$A$13,0),Jaugeage!$AC:$AC,T$1,Jaugeage!$H:$H,$AE$21),\"\")","v":0},{"$f":"IFERROR(SUMIFS(Jaugeage!$AA:$AA,Jaugeage!$AB:$AB,MATCH($A3,$A$2:$A$13,0),Jaugeage!$AC:$AC,U$1,Jaugeage!$H:$H,$AE$21),\"\")","v":0},{"$f":"IFERROR(SUMIFS(Jaugeage!$AA:$AA,Jaugeage!$AB:$AB,MATCH($A3,$A$2:$A$13,0),Jaugeage!$AC:$AC,V$1,Jaugeage!$H:$H,$AE$21),\"\")","v":0},{"$f":"IFERROR(SUMIFS(Jaugeage!$AA:$AA,Jaugeage!$AB:$AB,MATCH($A3,$A$2:$A$13,0),Jaugeage!$AC:$AC,W$1,Jaugeage!$H:$H,$AE$21),\"\")","v":0},{"$f":"IFERROR(SUMIFS(Jaugeage!$AA:$AA,Jaugeage!$AB:$AB,MATCH($A3,$A$2:$A$13,0),Jaugeage!$AC:$AC,X$1,Jaugeage!$H:$H,$AE$21),\"\")","v":0},{"$f":"IFERROR(SUMIFS(Jaugeage!$AA:$AA,Jaugeage!$AB:$AB,MATCH($A3,$A$2:$A$13,0),Jaugeage!$AC:$AC,Y$1,Jaugeage!$H:$H,$AE$21),\"\")","v":0},{"$f":"IFERROR(SUMIFS(Jaugeage!$AA:$AA,Jaugeage!$AB:$AB,MATCH($A3,$A$2:$A$13,0),Jaugeage!$AC:$AC,Z$1,Jaugeage!$H:$H,$AE$21),\"\")","v":0},{"$f":"IFERROR(SUMIFS(Jaugeage!$AA:$AA,Jaugeage!$AB:$AB,MATCH($A3,$A$2:$A$13,0),Jaugeage!$AC:$AC,AA$1,Jaugeage!$H:$H,$AE$21),\"\")","v":0},{"$f":"IFERROR(SUMIFS(Jaugeage!$AA:$AA,Jaugeage!$AB:$AB,MATCH($A3,$A$2:$A$13,0),Jaugeage!$AC:$AC,AB$1,Jaugeage!$H:$H,$AE$21),\"\")","v":0},{"$f":"IFERROR(SUMIFS(Jaugeage!$AA:$AA,Jaugeage!$AB:$AB,MATCH($A3,$A$2:$A$13,0),Jaugeage!$AC:$AC,AC$1,Jaugeage!$H:$H,$AE$21),\"\")","v":0},{"$f":"IFERROR(SUMIFS(Jaugeage!$AA:$AA,Jaugeage!$AB:$AB,MATCH($A3,$A$2:$A$13,0),Jaugeage!$AC:$AC,AD$1,Jaugeage!$H:$H,$AE$21),\"\")","v":0},{"$f":"IFERROR(SUMIFS(Jaugeage!$AA:$AA,Jaugeage!$AB:$AB,MATCH($A3,$A$2:$A$13,0),Jaugeage!$AC:$AC,AE$1,Jaugeage!$H:$H,$AE$21),\"\")","v":0},{"$f":"IFERROR(SUMIFS(Jaugeage!$AA:$AA,Jaugeage!$AB:$AB,MATCH($A3,$A$2:$A$13,0),Jaugeage!$AC:$AC,AF$1,Jaugeage!$H:$H,$AE$21),\"\")","v":0},{"$f":"IFERROR(SUMIFS(Jaugeage!$AA:$AA,Jaugeage!$AB:$AB,MATCH($A3,$A$2:$A$13,0),Jaugeage!$AC:$AC,AG$1,Jaugeage!$H:$H,$AE$21),\"\")","v":0},{"$f":"IFERROR(SUMIFS(Jaugeage!$AA:$AA,Jaugeage!$AB:$AB,MATCH($A3,$A$2:$A$13,0),Jaugeage!$AC:$AC,AH$1,Jaugeage!$H:$H,$AE$21),\"\")","v":0},{"$f":"IFERROR(SUMIFS(Jaugeage!$AA:$AA,Jaugeage!$AB:$AB,MATCH($A3,$A$2:$A$13,0),Jaugeage!$AC:$AC,AI$1,Jaugeage!$H:$H,$AE$21),\"\")","v":0},{"$f":"IFERROR(SUMIFS(Jaugeage!$AA:$AA,Jaugeage!$AB:$AB,MATCH($A3,$A$2:$A$13,0),Jaugeage!$AC:$AC,AJ$1,Jaugeage!$H:$H,$AE$21),\"\")","v":0},{"$f":"IFERROR(AVERAGEIFS(Jaugeage!$AA:$AA,Jaugeage!$AB:$AB,MATCH($A3,$A$2:$A$13,0),Jaugeage!$AC:$AC,AK$1,Jaugeage!$H:$H,$AE$21),\"\")","v":""},{"$f":"IFERROR(AVERAGEIFS(Jaugeage!$AA:$AA,Jaugeage!$AB:$AB,MATCH($A3,$A$2:$A$13,0),Jaugeage!$AC:$AC,AL$1,Jaugeage!$H:$H,$AE$21),\"\")","v":""},{"$f":"IFERROR(AVERAGEIFS(Jaugeage!$AA:$AA,Jaugeage!$AB:$AB,MATCH($A3,$A$2:$A$13,0),Jaugeage!$AC:$AC,AM$1,Jaugeage!$H:$H,$AE$21),\"\")","v":""},{"$f":"IFERROR(AVERAGEIFS(Jaugeage!$AA:$AA,Jaugeage!$AB:$AB,MATCH($A3,$A$2:$A$13,0),Jaugeage!$AC:$AC,AN$1,Jaugeage!$H:$H,$AE$21),\"\")","v":""},{"$f":"IFERROR(AVERAGEIFS(Jaugeage!$AA:$AA,Jaugeage!$AB:$AB,MATCH($A3,$A$2:$A$13,0),Jaugeage!$AC:$AC,AO$1,Jaugeage!$H:$H,$AE$21),\"\")","v":""},{"$f":"IFERROR(AVERAGEIFS(Jaugeage!$AA:$AA,Jaugeage!$AB:$AB,MATCH($A3,$A$2:$A$13,0),Jaugeage!$AC:$AC,AP$1,Jaugeage!$H:$H,$AE$21),\"\")","v":""},{"$f":"AVERAGEIF(B3:AJ3,\"<>0\")","v":{"$error":"#DIV/0!"}}]
["Mars",{"$f":"IFERROR(SUMIFS(Jaugeage!$AA:$AA,Jaugeage!$AB:$AB,MATCH($A4,$A$2:$A$13,0),Jaugeage!$AC:$AC,B$1,Jaugeage!$H:$H,$AE$21),\"\")","v":0},{"$f":"IFERROR(SUMIFS(Jaugeage!$AA:$AA,Jaugeage!$AB:$AB,MATCH($A4,$A$2:$A$13,0),Jaugeage!$AC:$AC,C$1,Jaugeage!$H:$H,$AE$21),\"\")","v":0},{"$f":"IFERROR(SUMIFS(Jaugeage!$AA:$AA,Jaugeage!$AB:$AB,MATCH($A4,$A$2:$A$13,0),Jaugeage!$AC:$AC,D$1,Jaugeage!$H:$H,$AE$21),\"\")","v":0},{"$f":"IFERROR(SUMIFS(Jaugeage!$AA:$AA,Jaugeage!$AB:$AB,MATCH($A4,$A$2:$A$13,0),Jaugeage!$AC:$AC,E$1,Jaugeage!$H:$H,$AE$21),\"\")","v":0},{"$f":"IFERROR(SUMIFS(Jaugeage!$AA:$AA,Jaugeage!$AB:$AB,MATCH($A4,$A$2:$A$13,0),Jaugeage!$AC:$AC,F$1,Jaugeage!$H:$H,$AE$21),\"\")","v":0},{"$f":"IFERROR(SUMIFS(Jaugeage!$AA:$AA,Jaugeage!$AB:$AB,MATCH($A4,$A$2:$A$13,0),Jaugeage!$AC:$AC,G$1,Jaugeage!$H:$H,$AE$21),\"\")","v":0},{"$f":"IFERROR(SUMIFS(Jaugeage!$AA:$AA,Jaugeage!$AB:$AB,MATCH($A4,$A$2:$A$13,0),Jaugeage!$AC:$AC,H$1,Jaugeage!$H:$H,$AE$21),\"\")","v":0},{"$f":"IFERROR(SUMIFS(Jaugeage!$AA:$AA,Jaugeage!$AB:$AB,MATCH($A4,$A$2:$A$13,0),Jaugeage!$AC:$AC,I$1,Jaugeage!$H:$H,$AE$21),\"\")","v":0},{"$f":"IFERROR(SUMIFS(Jaugeage!$AA:$AA,Jaugeage!$AB:$AB,MATCH($A4,$A$2:$A$13,0),Jaugeage!$AC:$AC,J$1,Jaugeage!$H:$H,$AE$21),\"\")","v":0},{"$f":"IFERROR(SUMIFS(Jaugeage!$AA:$AA,Jaugeage!$AB:$AB,MATCH($A4,$A$2:$A$13,0),Jaugeage!$AC:$AC,K$1,Jaugeage!$H:$H,$AE$21),\"\")","v":0},{"$f":"IFERROR(SUMIFS(Jaugeage!$AA:$AA,Jaugeage!$AB:$AB,MATCH($A4,$A$2:$A$13,0),Jaugeage!$AC:$AC,L$1,Jaugeage!$H:$H,$AE$21),\"\")","v":0},{"$f":"IFERROR(SUMIFS(Jaugeage!$AA:$AA,Jaugeage!$AB:$AB,MATCH($A4,$A$2:$A$13,0),Jaugeage!$AC:$AC,M$1,Jaugeage!$H:$H,$AE$21),\"\")","v":0},{"$f":"IFERROR(SUMIFS(Jaugeage!$AA:$AA,Jaugeage!$AB:$AB,MATCH($A4,$A$2:$A$13,0),Jaugeage!$AC:$AC,N$1,Jaugeage!$H:$H,$AE$21),\"\")","v":0},{"$f":"IFERROR(SUMIFS(Jaugeage!$AA:$AA,Jaugeage!$AB:$AB,MATCH($A4,$A$2:$A$13,0),Jaugeage!$AC:$AC,O$1,Jaugeage!$H:$H,$AE$21),\"\")","v":0},{"$f":"IFERROR(SUMIFS(Jaugeage!$AA:$AA,Jaugeage!$AB:$AB,MATCH($A4,$A$2:$A$13,0),Jaugeage!$AC:$AC,P$1,Jaugeage!$H:$H,$AE$21),\"\")","v":0},{"$f":"IFERROR(SUMIFS(Jaugeage!$AA:$AA,Jaugeage!$AB:$AB,MATCH($A4,$A$2:$A$13,0),Jaugeage!$AC:$AC,Q$1,Jaugeage!$H:$H,$AE$21),\"\")","v":0},{"$f":"IFERROR(SUMIFS(Jaugeage!$AA:$AA,Jaugeage!$AB:$AB,MATCH($A4,$A$2:$A$13,0),Jaugeage!$AC:$AC,R$1,Jaugeage!$H:$H,$AE$21),\"\")","v":0},{"$f":"IFERROR(SUMIFS(Jaugeage!$AA:$AA,Jaugeage!$AB:$AB,MATCH($A4,$A$2:$A$13,0),Jaugeage!$AC:$AC,S$1,Jaugeage!$H:$H,$AE$21),\"\")","v":0},{"$f":"IFERROR(SUMIFS(Jaugeage!$AA:$AA,Jaugeage!$AB:$AB,MATCH($A4,$A$2:$A$13,0),Jaugeage!$AC:$AC,T$1,Jaugeage!$H:$H,$AE$21),\"\")","v":0},{"$f":"IFERROR(SUMIFS(Jaugeage!$AA:$AA,Jaugeage!$AB:$AB,MATCH($A4,$A$2:$A$13,0),Jaugeage!$AC:$AC,U$1,Jaugeage!$H:$H,$AE$21),\"\")","v":0},{"$f":"IFERROR(SUMIFS(Jaugeage!$AA:$AA,Jaugeage!$AB:$AB,MATCH($A4,$A$2:$A$13,0),Jaugeage!$AC:$AC,V$1,Jaugeage!$H:$H,$AE$21),\"\")","v":0},{"$f":"IFERROR(SUMIFS(Jaugeage!$AA:$AA,Jaugeage!$AB:$AB,MATCH($A4,$A$2:$A$13,0),Jaugeage!$AC:$AC,W$1,Jaugeage!$H:$H,$AE$21),\"\")","v":0},{"$f":"IFERROR(SUMIFS(Jaugeage!$AA:$AA,Jaugeage!$AB:$AB,MATCH($A4,$A$2:$A$13,0),Jaugeage!$AC:$AC,X$1,Jaugeage!$H:$H,$AE$21),\"\")","v":0},{"$f":"IFERROR(SUMIFS(Jaugeage!$AA:$AA,Jaugeage!$AB:$AB,MATCH($A4,$A$2:$A$13,0),Jaugeage!$AC:$AC,Y$1,Jaugeage!$H:$H,$AE$21),\"\")","v":0},{"$f":"IFERROR(SUMIFS(Jaugeage!$AA:$AA,Jaugeage!$AB:$AB,MATCH($A4,$A$2:$A$13,0),Jaugeage!$AC:$AC,Z$1,Jaugeage!$H:$H,$AE$21),\"\")","v":0},{"$f":"IFERROR(SUMIFS(Jaugeage!$AA:$AA,Jaugeage!$AB:$AB,MATCH($A4,$A$2:$A$13,0),Jaugeage!$AC:$AC,AA$1,Jaugeage!$H:$H,$AE$21),\"\")","v":0},{"$f":"IFERROR(SUMIFS(Jaugeage!$AA:$AA,Jaugeage!$AB:$AB,MATCH($A4,$A$2:$A$13,0),Jaugeage!$AC:$AC,AB$1,Jaugeage!$H:$H,$AE$21),\"\")","v":0},{"$f":"IFERROR(SUMIFS(Jaugeage!$AA:$AA,Jaugeage!$AB:$AB,MATCH($A4,$A$2:$A$13,0),Jaugeage!$AC:$AC,AC$1,Jaugeage!$H:$H,$AE$21),\"\")","v":0},{"$f":"IFERROR(SUMIFS(Jaugeage!$AA:$AA,Jaugeage!$AB:$AB,MATCH($A4,$A$2:$A$13,0),Jaugeage!$AC:$AC,AD$1,Jaugeage!$H:$H,$AE$21),\"\")","v":0},{"$f":"IFERROR(SUMIFS(Jaugeage!$AA:$AA,Jaugeage!$AB:$AB,MATCH($A4,$A$2:$A$13,0),Jaugeage!$AC:$AC,AE$1,Jaugeage!$H:$H,$AE$21),\"\")","v":0},{"$f":"IFERROR(SUMIFS(Jaugeage!$AA:$AA,Jaugeage!$AB:$AB,MATCH($A4,$A$2:$A$13,0),Jaugeage!$AC:$AC,AF$1,Jaugeage!$H:$H,$AE$21),\"\")","v":0},{"$f":"IFERROR(SUMIFS(Jaugeage!$AA:$AA,Jaugeage!$AB:$AB,MATCH($A4,$A$2:$A$13,0),Jaugeage!$AC:$AC,AG$1,Jaugeage!$H:$H,$AE$21),\"\")","v":0},{"$f":"IFERROR(SUMIFS(Jaugeage!$AA:$AA,Jaugeage!$AB:$AB,MATCH($A4,$A$2:$A$13,0),Jaugeage!$AC:$AC,AH$1,Jaugeage!$H:$H,$AE$21),\"\")","v":0},{"$f":"IFERROR(SUMIFS(Jaugeage!$AA:$AA,Jaugeage!$AB:$AB,MATCH($A4,$A$2:$A$13,0),Jaugeage!$AC:$AC,AI$1,Jaugeage!$H:$H,$AE$21),\"\")","v":0},{"$f":"IFERROR(SUMIFS(Jaugeage!$AA:$AA,Jaugeage!$AB:$AB,MATCH($A4,$A$2:$A$13,0),Jaugeage!$AC:$AC,AJ$1,Jaugeage!$H:$H,$AE$21),\"\")","v":0},{"$f":"IFERROR(AVERAGEIFS(Jaugeage!$AA:$AA,Jaugeage!$AB:$AB,MATCH($A4,$A$2:$A$13,0),Jaugeage!$AC:$AC,AK$1,Jaugeage!$H:$H,$AE$21),\"\")","v":""},{"$f":"IFERROR(AVERAGEIFS(Jaugeage!$AA:$AA,Jaugeage!$AB:$AB,MATCH($A4,$A$2:$A$13,0),Jaugeage!$AC:$AC,AL$1,Jaugeage!$H:$H,$AE$21),\"\")","v":""},{"$f":"IFERROR(AVERAGEIFS(Jaugeage!$AA:$AA,Jaugeage!$AB:$AB,MATCH($A4,$A$2:$A$13,0),Jaugeage!$AC:$AC,AM$1,Jaugeage!$H:$H,$AE$21),\"\")","v":""},{"$f":"IFERROR(AVERAGEIFS(Jaugeage!$AA:$AA,Jaugeage!$AB:$AB,MATCH($A4,$A$2:$A$13,0),Jaugeage!$AC:$AC,AN$1,Jaugeage!$H:$H,$AE$21),\"\")","v":""},{"$f":"IFERROR(AVERAGEIFS(Jaugeage!$AA:$AA,Jaugeage!$AB:$AB,MATCH($A4,$A$2:$A$13,0),Jaugeage!$AC:$AC,AO$1,Jaugeage!$H:$H,$AE$21),\"\")","v":""},{"$f":"IFERROR(AVERAGEIFS(Jaugeage!$AA:$AA,Jaugeage!$AB:$AB,MATCH($A4,$A$2:$A$13,0),Jaugeage!$AC:$AC,AP$1,Jaugeage!$H:$H,$AE$21),\"\")","v":""},{"$error":"#DIV/0!"}]
["Avril",{"$f":"IFERROR(SUMIFS(Jaugeage!$AA:$AA,Jaugeage!$AB:$AB,MATCH($A5,$A$2:$A$13,0),Jaugeage!$AC:$AC,B$1,Jaugeage!$H:$H,$AE$21),\"\")","v":0},{"$f":"IFERROR(SUMIFS(Jaugeage!$AA:$AA,Jaugeage!$AB:$AB,MATCH($A5,$A$2:$A$13,0),Jaugeage!$AC:$AC,C$1,Jaugeage!$H:$H,$AE$21),\"\")","v":0},{"$f":"IFERROR(SUMIFS(Jaugeage!$AA:$AA,Jaugeage!$AB:$AB,MATCH($A5,$A$2:$A$13,0),Jaugeage!$AC:$AC,D$1,Jaugeage!$H:$H,$AE$21),\"\")","v":0},{"$f":"IFERROR(SUMIFS(Jaugeage!$AA:$AA,Jaugeage!$AB:$AB,MATCH($A5,$A$2:$A$13,0),Jaugeage!$AC:$AC,E$1,Jaugeage!$H:$H,$AE$21),\"\")","v":0},{"$f":"IFERROR(SUMIFS(Jaugeage!$AA:$AA,Jaugeage!$AB:$AB,MATCH($A5,$A$2:$A$13,0),Jaugeage!$AC:$AC,F$1,Jaugeage!$H:$H,$AE$21),\"\")","v":0},{"$f":"IFERROR(SUMIFS(Jaugeage!$AA:$AA,Jaugeage!$AB:$AB,MATCH($A5,$A$2:$A$13,0),Jaugeage!$AC:$AC,G$1,Jaugeage!$H:$H,$AE$21),\"\")","v":0},{"$f":"IFERROR(SUMIFS(Jaugeage!$AA:$AA,Jaugeage!$AB:$AB,MATCH($A5,$A$2:$A$13,0),Jaugeage!$AC:$AC,H$1,Jaugeage!$H:$H,$AE$21),\"\")","v":0},{"$f":"IFERROR(SUMIFS(Jaugeage!$AA:$AA,Jaugeage!$AB:$AB,MATCH($A5,$A$2:$A$13,0),Jaugeage!$AC:$AC,I$1,Jaugeage!$H:$H,$AE$21),\"\")","v":0},{"$f":"IFERROR(SUMIFS(Jaugeage!$AA:$AA,Jaugeage!$AB:$AB,MATCH($A5,$A$2:$A$13,0),Jaugeage!$AC:$AC,J$1,Jaugeage!$H:$H,$AE$21),\"\")","v":0},{"$f":"IFERROR(SUMIFS(Jaugeage!$AA:$AA,Jaugeage!$AB:$AB,MATCH($A5,$A$2:$A$13,0),Jaugeage!$AC:$AC,K$1,Jaugeage!$H:$H,$AE$21),\"\")","v":0},{"$f":"IFERROR(SUMIFS(Jaugeage!$AA:$AA,Jaugeage!$AB:$AB,MATCH($A5,$A$2:$A$13,0),Jaugeage!$AC:$AC,L$1,Jaugeage!$H:$H,$AE$21),\"\")","v":0},{"$f":"IFERROR(SUMIFS(Jaugeage!$AA:$AA,Jaugeage!$AB:$AB,MATCH($A5,$A$2:$A$13,0),Jaugeage!$AC:$AC,M$1,Jaugeage!$H:$H,$AE$21),\"\")","v":0},{"$f":"IFERROR(SUMIFS(Jaugeage!$AA:$AA,Jaugeage!$AB:$AB,MATCH($A5,$A$2:$A$13,0),Jaugeage!$AC:$AC,N$1,Jaugeage!$H:$H,$AE$21),\"\")","v":0},{"$f":"IFERROR(SUMIFS(Jaugeage!$AA:$AA,Jaugeage!$AB:$AB,MATCH($A5,$A$2:$A$13,0),Jaugeage!$AC:$AC,O$1,Jaugeage!$H:$H,$AE$21),\"\")","v":0},{"$f":"IFERROR(SUMIFS(Jaugeage!$AA:$AA,Jaugeage!$AB:$AB,MATCH($A5,$A$2:$A$13,0),Jaugeage!$AC:$AC,P$1,Jaugeage!$H:$H,$AE$21),\"\")","v":0},{"$f":"IFERROR(SUMIFS(Jaugeage!$AA:$AA,Jaugeage!$AB:$AB,MATCH($A5,$A$2:$A$13,0),Jaugeage!$AC:$AC,Q$1,Jaugeage!$H:$H,$AE$21),\"\")","v":0},{"$f":"IFERROR(SUMIFS(Jaugeage!$AA:$AA,Jaugeage!$AB:$AB,MATCH($A5,$A$2:$A$13,0),Jaugeage!$AC:$AC,R$1,Jaugeage!$H:$H,$AE$21),\"\")","v":0},{"$f":"IFERROR(SUMIFS(Jaugeage!$AA:$AA,Jaugeage!$AB:$AB,MATCH($A5,$A$2:$A$13,0),Jaugeage!$AC:$AC,S$1,Jaugeage!$H:$H,$AE$21),\"\")","v":0},{"$f":"IFERROR(SUMIFS(Jaugeage!$AA:$AA,Jaugeage!$AB:$AB,MATCH($A5,$A$2:$A$13,0),Jaugeage!$AC:$AC,T$1,Jaugeage!$H:$H,$AE$21),\"\")","v":0},{"$f":"IFERROR(SUMIFS(Jaugeage!$AA:$AA,Jaugeage!$AB:$AB,MATCH($A5,$A$2:$A$13,0),Jaugeage!$AC:$AC,U$1,Jaugeage!$H:$H,$AE$21),\"\")","v":0},{"$f":"IFERROR(SUMIFS(Jaugeage!$AA:$AA,Jaugeage!$AB:$AB,MATCH($A5,$A$2:$A$13,0),Jaugeage!$AC:$AC,V$1,Jaugeage!$H:$H,$AE$21),\"\")","v":0},{"$f":"IFERROR(SUMIFS(Jaugeage!$AA:$AA,Jaugeage!$AB:$AB,MATCH($A5,$A$2:$A$13,0),Jaugeage!$AC:$AC,W$1,Jaugeage!$H:$H,$AE$21),\"\")","v":0},{"$f":"IFERROR(SUMIFS(Jaugeage!$AA:$AA,Jaugeage!$AB:$AB,MATCH($A5,$A$2:$A$13,0),Jaugeage!$AC:$AC,X$1,Jaugeage!$H:$H,$AE$21),\"\")","v":0},{"$f":"IFERROR(SUMIFS(Jaugeage!$AA:$AA,Jaugeage!$AB:$AB,MATCH($A5,$A$2:$A$13,0),Jaugeage!$AC:$AC,Y$1,Jaugeage!$H:$H,$AE$21),\"\")","v":0},{"$f":"IFERROR(SUMIFS(Jaugeage!$AA:$AA,Jaugeage!$AB:$AB,MATCH($A5,$A$2:$A$13,0),Jaugeage!$AC:$AC,Z$1,Jaugeage!$H:$H,$AE$21),\"\")","v":0},{"$f":"IFERROR(SUMIFS(Jaugeage!$AA:$AA,Jaugeage!$AB:$AB,MATCH($A5,$A$2:$A$13,0),Jaugeage!$AC:$AC,AA$1,Jaugeage!$H:$H,$AE$21),\"\")","v":0},{"$f":"IFERROR(SUMIFS(Jaugeage!$AA:$AA,Jaugeage!$AB:$AB,MATCH($A5,$A$2:$A$13,0),Jaugeage!$AC:$AC,AB$1,Jaugeage!$H:$H,$AE$21),\"\")","v":0},{"$f":"IFERROR(SUMIFS(Jaugeage!$AA:$AA,Jaugeage!$AB:$AB,MATCH($A5,$A$2:$A$13,0),Jaugeage!$AC:$AC,AC$1,Jaugeage!$H:$H,$AE$21),\"\")","v":0},{"$f":"IFERROR(SUMIFS(Jaugeage!$AA:$AA,Jaugeage!$AB:$AB,MATCH($A5,$A$2:$A$13,0),Jaugeage!$AC:$AC,AD$1,Jaugeage!$H:$H,$AE$21),\"\")","v":0},{"$f":"IFERROR(SUMIFS(Jaugeage!$AA:$AA,Jaugeage!$AB:$AB,MATCH($A5,$A$2:$A$13,0),Jaugeage!$AC:$AC,AE$1,Jaugeage!$H:$H,$AE$21),\"\")","v":0},{"$f":"IFERROR(SUMIFS(Jaugeage!$AA:$AA,Jaugeage!$AB:$AB,MATCH($A5,$A$2:$A$13,0),Jaugeage!$AC:$AC,AF$1,Jaugeage!$H:$H,$AE$21),\"\")","v":0},{"$f":"IFERROR(SUMIFS(Jaugeage!$AA:$AA,Jaugeage!$AB:$AB,MATCH($A5,$A$2:$A$13,0),Jaugeage!$AC:$AC,AG$1,Jaugeage!$H:$H,$AE$21),\"\")","v":0},{"$f":"IFERROR(SUMIFS(Jaugeage!$AA:$AA,Jaugeage!$AB:$AB,MATCH($A5,$A$2:$A$13,0),Jaugeage!$AC:$AC,AH$1,Jaugeage!$H:$H,$AE$21),\"\")","v":0},{"$f":"IFERROR(SUMIFS(Jaugeage!$AA:$AA,Jaugeage!$AB:$AB,MATCH($A5,$A$2:$A$13,0),Jaugeage!$AC:$AC,AI$1,Jaugeage!$H:$H,$AE$21),\"\")","v":0},{"$f":"IFERROR(SUMIFS(Jaugeage!$AA:$AA,Jaugeage!$AB:$AB,MATCH($A5,$A$2:$A$13,0),Jaugeage!$AC:$AC,AJ$1,Jaugeage!$H:$H,$AE$21),\"\")","v":0},{"$f":"IFERROR(AVERAGEIFS(Jaugeage!$AA:$AA,Jaugeage!$AB:$AB,MATCH($A5,$A$2:$A$13,0),Jaugeage!$AC:$AC,AK$1,Jaugeage!$H:$H,$AE$21),\"\")","v":""},{"$f":"IFERROR(AVERAGEIFS(Jaugeage!$AA:$AA,Jaugeage!$AB:$AB,MATCH($A5,$A$2:$A$13,0),Jaugeage!$AC:$AC,AL$1,Jaugeage!$H:$H,$AE$21),\"\")","v":""},{"$f":"IFERROR(AVERAGEIFS(Jaugeage!$AA:$AA,Jaugeage!$AB:$AB,MATCH($A5,$A$2:$A$13,0),Jaugeage!$AC:$AC,AM$1,Jaugeage!$H:$H,$AE$21),\"\")","v":""},{"$f":"IFERROR(AVERAGEIFS(Jaugeage!$AA:$AA,Jaugeage!$AB:$AB,MATCH($A5,$A$2:$A$13,0),Jaugeage!$AC:$AC,AN$1,Jaugeage!$H:$H,$AE$21),\"\")","v":""},{"$f":"IFERROR(AVERAGEIFS(Jaugeage!$AA:$AA,Jaugeage!$AB:$AB,MATCH($A5,$A$2:$A$13,0),Jaugeage!$AC:$AC,AO$1,Jaugeage!$H:$H,$AE$21),\"\")","v":""},{"$f":"IFERROR(AVERAGEIFS(Jaugeage!$AA:$AA,Jaugeage!$AB:$AB,MATCH($A5,$A$2:$A$13,0),Jaugeage!$AC:$AC,AP$1,Jaugeage!$H:$H,$AE$21),\"\")","v":""},{"$error":"#DIV/0!"}]
["Mai",{"$f":"IFERROR(SUMIFS(Jaugeage!$AA:$AA,Jaugeage!$AB:$AB,MATCH($A6,$A$2:$A$13,0),Jaugeage!$AC:$AC,B$1,Jaugeage!$H:$H,$AE$21),\"\")","v":0},{"$f":"IFERROR(SUMIFS(Jaugeage!$AA:$AA,Jaugeage!$AB:$AB,MATCH($A6,$A$2:$A$13,0),Jaugeage!$AC:$AC,C$1,Jaugeage!$H:$H,$AE$21),\"\")","v":0},{"$f":"IFERROR(SUMIFS(Jaugeage!$AA:$AA,Jaugeage!$AB:$AB,MATCH($A6,$A$2:$A$13,0),Jaugeage!$AC:$AC,D$1,Jaugeage!$H:$H,$AE$21),\"\")","v":0},{"$f":"IFERROR(SUMIFS(Jaugeage!$AA:$AA,Jaugeage!$AB:$AB,MATCH($A6,$A$2:$A$13,0),Jaugeage!$AC:$AC,E$1,Jaugeage!$H:$H,$AE$21),\"\")","v":0},{"$f":"IFERROR(SUMIFS(Jaugeage!$AA:$AA,Jaugeage!$AB:$AB,MATCH($A6,$A$2:$A$13,0),Jaugeage!$AC:$AC,F$1,Jaugeage!$H:$H,$AE$21),\"\")","v":0},{"$f":"IFERROR(SUMIFS(Jaugeage!$AA:$AA,Jaugeage!$AB:$AB,MATCH($A6,$A$2:$A$13,0),Jaugeage!$AC:$AC,G$1,Jaugeage!$H:$H,$AE$21),\"\")","v":0},{"$f":"IFERROR(SUMIFS(Jaugeage!$AA:$AA,Jaugeage!$AB:$AB,MATCH($A6,$A$2:$A$13,0),Jaugeage!$AC:$AC,H$1,Jaugeage!$H:$H,$AE$21),\"\")","v":0},{"$f":"IFERROR(SUMIFS(Jaugeage!$AA:$AA,Jaugeage!$AB:$AB,MATCH($A6,$A$2:$A$13,0),Jaugeage!$AC:$AC,I$1,Jaugeage!$H:$H,$AE$21),\"\")","v":0},{"$f":"IFERROR(SUMIFS(Jaugeage!$AA:$AA,Jaugeage!$AB:$AB,MATCH($A6,$A$2:$A$13,0),Jaugeage!$AC:$AC,J$1,Jaugeage!$H:$H,$AE$21),\"\")","v":0},{"$f":"IFERROR(SUMIFS(Jaugeage!$AA:$AA,Jaugeage!$AB:$AB,MATCH($A6,$A$2:$A$13,0),Jaugeage!$AC:$AC,K$1,Jaugeage!$H:$H,$AE$21),\"\")","v":0},{"$f":"IFERROR(SUMIFS(Jaugeage!$AA:$AA,Jaugeage!$AB:$AB,MATCH($A6,$A$2:$A$13,0),Jaugeage!$AC:$AC,L$1,Jaugeage!$H:$H,$AE$21),\"\")","v":0},{"$f":"IFERROR(SUMIFS(Jaugeage!$AA:$AA,Jaugeage!$AB:$AB,MATCH($A6,$A$2:$A$13,0),Jaugeage!$AC:$AC,M$1,Jaugeage!$H:$H,$AE$21),\"\")","v":0},{"$f":"IFERROR(SUMIFS(Jaugeage!$AA:$AA,Jaugeage!$AB:$AB,MATCH($A6,$A$2:$A$13,0),Jaugeage!$AC:$AC,N$1,Jaugeage!$H:$H,$AE$21),\"\")","v":0},{"$f":"IFERROR(SUMIFS(Jaugeage!$AA:$AA,Jaugeage!$AB:$AB,MATCH($A6,$A$2:$A$13,0),Jaugeage!$AC:$AC,O$1,Jaugeage!$H:$H,$AE$21),\"\")","v":0},{"$f":"IFERROR(SUMIFS(Jaugeage!$AA:$AA,Jaugeage!$AB:$AB,MATCH($A6,$A$2:$A$13,0),Jaugeage!$AC:$AC,P$1,Jaugeage!$H:$H,$AE$21),\"\")","v":0},{"$f":"IFERROR(SUMIFS(Jaugeage!$AA:$AA,Jaugeage!$AB:$AB,MATCH($A6,$A$2:$A$13,0),Jaugeage!$AC:$AC,Q$1,Jaugeage!$H:$H,$AE$21),\"\")","v":0},{"$f":"IFERROR(SUMIFS(Jaugeage!$AA:$AA,Jaugeage!$AB:$AB,MATCH($A6,$A$2:$A$13,0),Jaugeage!$AC:$AC,R$1,Jaugeage!$H:$H,$AE$21),\"\")","v":0},{"$f":"IFERROR(SUMIFS(Jaugeage!$AA:$AA,Jaugeage!$AB:$AB,MATCH($A6,$A$2:$A$13,0),Jaugeage!$AC:$AC,S$1,Jaugeage!$H:$H,$AE$21),\"\")","v":0},{"$f":"IFERROR(SUMIFS(Jaugeage!$AA:$AA,Jaugeage!$AB:$AB,MATCH($A6,$A$2:$A$13,0),Jaugeage!$AC:$AC,T$1,Jaugeage!$H:$H,$AE$21),\"\")","v":0},{"$f":"IFERROR(SUMIFS(Jaugeage!$AA:$AA,Jaugeage!$AB:$AB,MATCH($A6,$A$2:$A$13,0),Jaugeage!$AC:$AC,U$1,Jaugeage!$H:$H,$AE$21),\"\")","v":0},{"$f":"IFERROR(SUMIFS(Jaugeage!$AA:$AA,Jaugeage!$AB:$AB,MATCH($A6,$A$2:$A$13,0),Jaugeage!$AC:$AC,V$1,Jaugeage!$H:$H,$AE$21),\"\")","v":0},{"$f":"IFERROR(SUMIFS(Jaugeage!$AA:$AA,Jaugeage!$AB:$AB,MATCH($A6,$A$2:$A$13,0),Jaugeage!$AC:$AC,W$1,Jaugeage!$H:$H,$AE$21),\"\")","v":0},{"$f":"IFERROR(SUMIFS(Jaugeage!$AA:$AA,Jaugeage!$AB:$AB,MATCH($A6,$A$2:$A$13,0),Jaugeage!$AC:$AC,X$1,Jaugeage!$H:$H,$AE$21),\"\")","v":0},{"$f":"IFERROR(SUMIFS(Jaugeage!$AA:$AA,Jaugeage!$AB:$AB,MATCH($A6,$A$2:$A$13,0),Jaugeage!$AC:$AC,Y$1,Jaugeage!$H:$H,$AE$21),\"\")","v":0},{"$f":"IFERROR(SUMIFS(Jaugeage!$AA:$AA,Jaugeage!$AB:$AB,MATCH($A6,$A$2:$A$13,0),Jaugeage!$AC:$AC,Z$1,Jaugeage!$H:$H,$AE$21),\"\")","v":0},{"$f":"IFERROR(SUMIFS(Jaugeage!$AA:$AA,Jaugeage!$AB:$AB,MATCH($A6,$A$2:$A$13,0),Jaugeage!$AC:$AC,AA$1,Jaugeage!$H:$H,$AE$21),\"\")","v":0},{"$f":"IFERROR(SUMIFS(Jaugeage!$AA:$AA,Jaugeage!$AB:$AB,MATCH($A6,$A$2:$A$13,0),Jaugeage!$AC:$AC,AB$1,Jaugeage!$H:$H,$AE$21),\"\")","v":0},{"$f":"IFERROR(SUMIFS(Jaugeage!$AA:$AA,Jaugeage!$AB:$AB,MATCH($A6,$A$2:$A$13,0),Jaugeage!$AC:$AC,AC$1,Jaugeage!$H:$H,$AE$21),\"\")","v":0},{"$f":"IFERROR(SUMIFS(Jaugeage!$AA:$AA,Jaugeage!$AB:$AB,MATCH($A6,$A$2:$A$13,0),Jaugeage!$AC:$AC,AD$1,Jaugeage!$H:$H,$AE$21),\"\")","v":0},{"$f":"IFERROR(SUMIFS(Jaugeage!$AA:$AA,Jaugeage!$AB:$AB,MATCH($A6,$A$2:$A$13,0),Jaugeage!$AC:$AC,AE$1,Jaugeage!$H:$H,$AE$21),\"\")","v":0},{"$f":"IFERROR(SUMIFS(Jaugeage!$AA:$AA,Jaugeage!$AB:$AB,MATCH($A6,$A$2:$A$13,0),Jaugeage!$AC:$AC,AF$1,Jaugeage!$H:$H,$AE$21),\"\")","v":0},{"$f":"IFERROR(SUMIFS(Jaugeage!$AA:$AA,Jaugeage!$AB:$AB,MATCH($A6,$A$2:$A$13,0),Jaugeage!$AC:$AC,AG$1,Jaugeage!$H:$H,$AE$21),\"\")","v":0},{"$f":"IFERROR(SUMIFS(Jaugeage!$AA:$AA,Jaugeage!$AB:$AB,MATCH($A6,$A$2:$A$13,0),Jaugeage!$AC:$AC,AH$1,Jaugeage!$H:$H,$AE$21),\"\")","v":0},{"$f":"IFERROR(SUMIFS(Jaugeage!$AA:$AA,Jaugeage!$AB:$AB,MATCH($A6,$A$2:$A$13,0),Jaugeage!$AC:$AC,AI$1,Jaugeage!$H:$H,$AE$21),\"\")","v":0},{"$f":"IFERROR(SUMIFS(Jaugeage!$AA:$AA,Jaugeage!$AB:$AB,MATCH($A6,$A$2:$A$13,0),Jaugeage!$AC:$AC,AJ$1,Jaugeage!$H:$H,$AE$21),\"\")","v":0},{"$f":"IFERROR(AVERAGEIFS(Jaugeage!$AA:$AA,Jaugeage!$AB:$AB,MATCH($A6,$A$2:$A$13,0),Jaugeage!$AC:$AC,AK$1,Jaugeage!$H:$H,$AE$21),\"\")","v":""},{"$f":"IFERROR(AVERAGEIFS(Jaugeage!$AA:$AA,Jaugeage!$AB:$AB,MATCH($A6,$A$2:$A$13,0),Jaugeage!$AC:$AC,AL$1,Jaugeage!$H:$H,$AE$21),\"\")","v":""},{"$f":"IFERROR(AVERAGEIFS(Jaugeage!$AA:$AA,Jaugeage!$AB:$AB,MATCH($A6,$A$2:$A$13,0),Jaugeage!$AC:$AC,AM$1,Jaugeage!$H:$H,$AE$21),\"\")","v":""},{"$f":"IFERROR(AVERAGEIFS(Jaugeage!$AA:$AA,Jaugeage!$AB:$AB,MATCH($A6,$A$2:$A$13,0),Jaugeage!$AC:$AC,AN$1,Jaugeage!$H:$H,$AE$21),\"\")","v":""},{"$f":"IFERROR(AVERAGEIFS(Jaugeage!$AA:$AA,Jaugeage!$AB:$AB,MATCH($A6,$A$2:$A$13,0),Jaugeage!$AC:$AC,AO$1,Jaugeage!$H:$H,$AE$21),\"\")","v":""},{"$f":"IFERROR(AVERAGEIFS(Jaugeage!$AA:$AA,Jaugeage!$AB:$AB,MATCH($A6,$A$2:$A$13,0),Jaugeage!$AC:$AC,AP$1,Jaugeage!$H:$H,$AE$21),\"\")","v":""},{"$error":"#DIV/0!"}]
["Juin",{"$f":"IFERROR(SUMIFS(Jaugeage!$AA:$AA,Jaugeage!$AB:$AB,MATCH($A7,$A$2:$A$13,0),Jaugeage!$AC:$AC,B$1,Jaugeage!$H:$H,$AE$21),\"\")","v":0},{"$f":"IFERROR(SUMIFS(Jaugeage!$AA:$AA,Jaugeage!$AB:$AB,MATCH($A7,$A$2:$A$13,0),Jaugeage!$AC:$AC,C$1,Jaugeage!$H:$H,$AE$21),\"\")","v":0},{"$f":"IFERROR(SUMIFS(Jaugeage!$AA:$AA,Jaugeage!$AB:$AB,MATCH($A7,$A$2:$A$13,0),Jaugeage!$AC:$AC,D$1,Jaugeage!$H:$H,$AE$21),\"\")","v":0},{"$f":"IFERROR(SUMIFS(Jaugeage!$AA:$AA,Jaugeage!$AB:$AB,MATCH($A7,$A$2:$A$13,0),Jaugeage!$AC:$AC,E$1,Jaugeage!$H:$H,$AE$21),\"\")","v":0},{"$f":"IFERROR(SUMIFS(Jaugeage!$AA:$AA,Jaugeage!$AB:$AB,MATCH($A7,$A$2:$A$13,0),Jaugeage!$AC:$AC,F$1,Jaugeage!$H:$H,$AE$21),\"\")","v":0},{"$f":"IFERROR(SUMIFS(Jaugeage!$AA:$AA,Jaugeage!$AB:$AB,MATCH($A7,$A$2:$A$13,0),Jaugeage!$AC:$AC,G$1,Jaugeage!$H:$H,$AE$21),\"\")","v":0},{"$f":"IFERROR(SUMIFS(Jaugeage!$AA:$AA,Jaugeage!$AB:$AB,MATCH($A7,$A$2:$A$13,0),Jaugeage!$AC:$AC,H$1,Jaugeage!$H:$H,$AE$21),\"\")","v":0},{"$f":"IFERROR(SUMIFS(Jaugeage!$AA:$AA,Jaugeage!$AB:$AB,MATCH($A7,$A$2:$A$13,0),Jaugeage!$AC:$AC,I$1,Jaugeage!$H:$H,$AE$21),\"\")","v":0},{"$f":"IFERROR(SUMIFS(Jaugeage!$AA:$AA,Jaugeage!$AB:$AB,MATCH($A7,$A$2:$A$13,0),Jaugeage!$AC:$AC,J$1,Jaugeage!$H:$H,$AE$21),\"\")","v":0},{"$f":"IFERROR(SUMIFS(Jaugeage!$AA:$AA,Jaugeage!$AB:$AB,MATCH($A7,$A$2:$A$13,0),Jaugeage!$AC:$AC,K$1,Jaugeage!$H:$H,$AE$21),\"\")","v":0},{"$f":"IFERROR(SUMIFS(Jaugeage!$AA:$AA,Jaugeage!$AB:$AB,MATCH($A7,$A$2:$A$13,0),Jaugeage!$AC:$AC,L$1,Jaugeage!$H:$H,$AE$21),\"\")","v":0},{"$f":"IFERROR(SUMIFS(Jaugeage!$AA:$AA,Jaugeage!$AB:$AB,MATCH($A7,$A$2:$A$13,0),Jaugeage!$AC:$AC,M$1,Jaugeage!$H:$H,$AE$21),\"\")","v":0},{"$f":"IFERROR(SUMIFS(Jaugeage!$AA:$AA,Jaugeage!$AB:$AB,MATCH($A7,$A$2:$A$13,0),Jaugeage!$AC:$AC,N$1,Jaugeage!$H:$H,$AE$21),\"\")","v":0},{"$f":"IFERROR(SUMIFS(Jaugeage!$AA:$AA,Jaugeage!$AB:$AB,MATCH($A7,$A$2:$A$13,0),Jaugeage!$AC:$AC,O$1,Jaugeage!$H:$H,$AE$21),\"\")","v":0},{"$f":"IFERROR(SUMIFS(Jaugeage!$AA:$AA,Jaugeage!$AB:$AB,MATCH($A7,$A$2:$A$13,0),Jaugeage!$AC:$AC,P$1,Jaugeage!$H:$H,$AE$21),\"\")","v":0},{"$f":"IFERROR(SUMIFS(Jaugeage!$AA:$AA,Jaugeage!$AB:$AB,MATCH($A7,$A$2:$A$13,0),Jaugeage!$AC:$AC,Q$1,Jaugeage!$H:$H,$AE$21),\"\")","v":0},{"$f":"IFERROR(SUMIFS(Jaugeage!$AA:$AA,Jaugeage!$AB:$AB,MATCH($A7,$A$2:$A$13,0),Jaugeage!$AC:$AC,R$1,Jaugeage!$H:$H,$AE$21),\"\")","v":0},{"$f":"IFERROR(SUMIFS(Jaugeage!$AA:$AA,Jaugeage!$AB:$AB,MATCH($A7,$A$2:$A$13,0),Jaugeage!$AC:$AC,S$1,Jaugeage!$H:$H,$AE$21),\"\")","v":0},{"$f":"IFERROR(SUMIFS(Jaugeage!$AA:$AA,Jaugeage!$AB:$AB,MATCH($A7,$A$2:$A$13,0),Jaugeage!$AC:$AC,T$1,Jaugeage!$H:$H,$AE$21),\"\")","v":0},{"$f":"IFERROR(SUMIFS(Jaugeage!$AA:$AA,Jaugeage!$AB:$AB,MATCH($A7,$A$2:$A$13,0),Jaugeage!$AC:$AC,U$1,Jaugeage!$H:$H,$AE$21),\"\")","v":0},{"$f":"IFERROR(SUMIFS(Jaugeage!$AA:$AA,Jaugeage!$AB:$AB,MATCH($A7,$A$2:$A$13,0),Jaugeage!$AC:$AC,V$1,Jaugeage!$H:$H,$AE$21),\"\")","v":0},{"$f":"IFERROR(SUMIFS(Jaugeage!$AA:$AA,Jaugeage!$AB:$AB,MATCH($A7,$A$2:$A$13,0),Jaugeage!$AC:$AC,W$1,Jaugeage!$H:$H,$AE$21),\"\")","v":0},{"$f":"IFERROR(SUMIFS(Jaugeage!$AA:$AA,Jaugeage!$AB:$AB,MATCH($A7,$A$2:$A$13,0),Jaugeage!$AC:$AC,X$1,Jaugeage!$H:$H,$AE$21),\"\")","v":0},{"$f":"IFERROR(SUMIFS(Jaugeage!$AA:$AA,Jaugeage!$AB:$AB,MATCH($A7,$A$2:$A$13,0),Jaugeage!$AC:$AC,Y$1,Jaugeage!$H:$H,$AE$21),\"\")","v":0},{"$f":"IFERROR(SUMIFS(Jaugeage!$AA:$AA,Jaugeage!$AB:$AB,MATCH($A7,$A$2:$A$13,0),Jaugeage!$AC:$AC,Z$1,Jaugeage!$H:$H,$AE$21),\"\")","v":0},{"$f":"IFERROR(SUMIFS(Jaugeage!$AA:$AA,Jaugeage!$AB:$AB,MATCH($A7,$A$2:$A$13,0),Jaugeage!$AC:$AC,AA$1,Jaugeage!$H:$H,$AE$21),\"\")","v":0},{"$f":"IFERROR(SUMIFS(Jaugeage!$AA:$AA,Jaugeage!$AB:$AB,MATCH($A7,$A$2:$A$13,0),Jaugeage!$AC:$AC,AB$1,Jaugeage!$H:$H,$AE$21),\"\")","v":0},{"$f":"IFERROR(SUMIFS(Jaugeage!$AA:$AA,Jaugeage!$AB:$AB,MATCH($A7,$A$2:$A$13,0),Jaugeage!$AC:$AC,AC$1,Jaugeage!$H:$H,$AE$21),\"\")","v":0},{"$f":"IFERROR(SUMIFS(Jaugeage!$AA:$AA,Jaugeage!$AB:$AB,MATCH($A7,$A$2:$A$13,0),Jaugeage!$AC:$AC,AD$1,Jaugeage!$H:$H,$AE$21),\"\")","v":0},{"$f":"IFERROR(SUMIFS(Jaugeage!$AA:$AA,Jaugeage!$AB:$AB,MATCH($A7,$A$2:$A$13,0),Jaugeage!$AC:$AC,AE$1,Jaugeage!$H:$H,$AE$21),\"\")","v":0},{"$f":"IFERROR(SUMIFS(Jaugeage!$AA:$AA,Jaugeage!$AB:$AB,MATCH($A7,$A$2:$A$13,0),Jaugeage!$AC:$AC,AF$1,Jaugeage!$H:$H,$AE$21),\"\")","v":0},{"$f":"IFERROR(SUMIFS(Jaugeage!$AA:$AA,Jaugeage!$AB:$AB,MATCH($A7,$A$2:$A$13,0),Jaugeage!$AC:$AC,AG$1,Jaugeage!$H:$H,$AE$21),\"\")","v":0},{"$f":"IFERROR(SUMIFS(Jaugeage!$AA:$AA,Jaugeage!$AB:$AB,MATCH($A7,$A$2:$A$13,0),Jaugeage!$AC:$AC,AH$1,Jaugeage!$H:$H,$AE$21),\"\")","v":0},{"$f":"IFERROR(SUMIFS(Jaugeage!$AA:$AA,Jaugeage!$AB:$AB,MATCH($A7,$A$2:$A$13,0),Jaugeage!$AC:$AC,AI$1,Jaugeage!$H:$H,$AE$21),\"\")","v":0},{"$f":"IFERROR(SUMIFS(Jaugeage!$AA:$AA,Jaugeage!$AB:$AB,MATCH($A7,$A$2:$A$13,0),Jaugeage!$AC:$AC,AJ$1,Jaugeage!$H:$H,$AE$21),\"\")","v":0},{"$f":"IFERROR(AVERAGEIFS(Jaugeage!$AA:$AA,Jaugeage!$AB:$AB,MATCH($A7,$A$2:$A$13,0),Jaugeage!$AC:$AC,AK$1,Jaugeage!$H:$H,$AE$21),\"\")","v":""},{"$f":"IFERROR(AVERAGEIFS(Jaugeage!$AA:$AA,Jaugeage!$AB:$AB,MATCH($A7,$A$2:$A$13,0),Jaugeage!$AC:$AC,AL$1,Jaugeage!$H:$H,$AE$21),\"\")","v":""},{"$f":"IFERROR(AVERAGEIFS(Jaugeage!$AA:$AA,Jaugeage!$AB:$AB,MATCH($A7,$A$2:$A$13,0),Jaugeage!$AC:$AC,AM$1,Jaugeage!$H:$H,$AE$21),\"\")","v":""},{"$f":"IFERROR(AVERAGEIFS(Jaugeage!$AA:$AA,Jaugeage!$AB:$AB,MATCH($A7,$A$2:$A$13,0),Jaugeage!$AC:$AC,AN$1,Jaugeage!$H:$H,$AE$21),\"\")","v":""},{"$f":"IFERROR(AVERAGEIFS(Jaugeage!$AA:$AA,Jaugeage!$AB:$AB,MATCH($A7,$A$2:$A$13,0),Jaugeage!$AC:$AC,AO$1,Jaugeage!$H:$H,$AE$21),\"\")","v":""},{"$f":"IFERROR(AVERAGEIFS(Jaugeage!$AA:$AA,Jaugeage!$AB:$AB,MATCH($A7,$A$2:$A$13,0),Jaugeage!$AC:$AC,AP$1,Jaugeage!$H:$H,$AE$21),\"\")","v":""},{"$error":"#DIV/0!"}]
["Juillet",{"$f":"IFERROR(SUMIFS(Jaugeage!$AA:$AA,Jaugeage!$AB:$AB,MATCH($A8,$A$2:$A$13,0),Jaugeage!$AC:$AC,B$1,Jaugeage!$H:$H,$AE$21),\"\")","v":0},{"$f":"IFERROR(SUMIFS(Jaugeage!$AA:$AA,Jaugeage!$AB:$AB,MATCH($A8,$A$2:$A$13,0),Jaugeage!$AC:$AC,C$1,Jaugeage!$H:$H,$AE$21),\"\")","v":0},{"$f":"IFERROR(SUMIFS(Jaugeage!$AA:$AA,Jaugeage!$AB:$AB,MATCH($A8,$A$2:$A$13,0),Jaugeage!$AC:$AC,D$1,Jaugeage!$H:$H,$AE$21),\"\")","v":0},{"$f":"IFERROR(SUMIFS(Jaugeage!$AA:$AA,Jaugeage!$AB:$AB,MATCH($A8,$A$2:$A$13,0),Jaugeage!$AC:$AC,E$1,Jaugeage!$H:$H,$AE$21),\"\")","v":0},{"$f":"IFERROR(SUMIFS(Jaugeage!$AA:$AA,Jaugeage!$AB:$AB,MATCH($A8,$A$2:$A$13,0),Jaugeage!$AC:$AC,F$1,Jaugeage!$H:$H,$AE$21),\"\")","v":0},{"$f":"IFERROR(SUMIFS(Jaugeage!$AA:$AA,Jaugeage!$AB:$AB,MATCH($A8,$A$2:$A$13,0),Jaugeage!$AC:$AC,G$1,Jaugeage!$H:$H,$AE$21),\"\")","v":0},{"$f":"IFERROR(SUMIFS(Jaugeage!$AA:$AA,Jaugeage!$AB:$AB,MATCH($A8,$A$2:$A$13,0),Jaugeage!$AC:$AC,H$1,Jaugeage!$H:$H,$AE$21),\"\")","v":0},{"$f":"IFERROR(SUMIFS(Jaugeage!$AA:$AA,Jaugeage!$AB:$AB,MATCH($A8,$A$2:$A$13,0),Jaugeage!$AC:$AC,I$1,Jaugeage!$H:$H,$AE$21),\"\")","v":0},{"$f":"IFERROR(SUMIFS(Jaugeage!$AA:$AA,Jaugeage!$AB:$AB,MATCH($A8,$A$2:$A$13,0),Jaugeage!$AC:$AC,J$1,Jaugeage!$H:$H,$AE$21),\"\")","v":0},{"$f":"IFERROR(SUMIFS(Jaugeage!$AA:$AA,Jaugeage!$AB:$AB,MATCH($A8,$A$2:$A$13,0),Jaugeage!$AC:$AC,K$1,Jaugeage!$H:$H,$AE$21),\"\")","v":0},{"$f":"IFERROR(SUMIFS(Jaugeage!$AA:$AA,Jaugeage!$AB:$AB,MATCH($A8,$A$2:$A$13,0),Jaugeage!$AC:$AC,L$1,Jaugeage!$H:$H,$AE$21),\"\")","v":0},{"$f":"IFERROR(SUMIFS(Jaugeage!$AA:$AA,Jaugeage!$AB:$AB,MATCH($A8,$A$2:$A$13,0),Jaugeage!$AC:$AC,M$1,Jaugeage!$H:$H,$AE$21),\"\")","v":0},{"$f":"IFERROR(SUMIFS(Jaugeage!$AA:$AA,Jaugeage!$AB:$AB,MATCH($A8,$A$2:$A$13,0),Jaugeage!$AC:$AC,N$1,Jaugeage!$H:$H,$AE$21),\"\")","v":0},{"$f":"IFERROR(SUMIFS(Jaugeage!$AA:$AA,Jaugeage!$AB:$AB,MATCH($A8,$A$2:$A$13,0),Jaugeage!$AC:$AC,O$1,Jaugeage!$H:$H,$AE$21),\"\")","v":0},{"$f":"IFERROR(SUMIFS(Jaugeage!$AA:$AA,Jaugeage!$AB:$AB,MATCH($A8,$A$2:$A$13,0),Jaugeage!$AC:$AC,P$1,Jaugeage!$H:$H,$AE$21),\"\")","v":0},{"$f":"IFERROR(SUMIFS(Jaugeage!$AA:$AA,Jaugeage!$AB:$AB,MATCH($A8,$A$2:$A$13,0),Jaugeage!$AC:$AC,Q$1,Jaugeage!$H:$H,$AE$21),\"\")","v":0},{"$f":"IFERROR(SUMIFS(Jaugeage!$AA:$AA,Jaugeage!$AB:$AB,MATCH($A8,$A$2:$A$13,0),Jaugeage!$AC:$AC,R$1,Jaugeage!$H:$H,$AE$21),\"\")","v":0},{"$f":"IFERROR(SUMIFS(Jaugeage!$AA:$AA,Jaugeage!$AB:$AB,MATCH($A8,$A$2:$A$13,0),Jaugeage!$AC:$AC,S$1,Jaugeage!$H:$H,$AE$21),\"\")","v":0},{"$f":"IFERROR(SUMIFS(Jaugeage!$AA:$AA,Jaugeage!$AB:$AB,MATCH($A8,$A$2:$A$13,0),Jaugeage!$AC:$AC,T$1,Jaugeage!$H:$H,$AE$21),\"\")","v":0},{"$f":"IFERROR(SUMIFS(Jaugeage!$AA:$AA,Jaugeage!$AB:$AB,MATCH($A8,$A$2:$A$13,0),Jaugeage!$AC:$AC,U$1,Jaugeage!$H:$H,$AE$21),\"\")","v":0},{"$f":"IFERROR(SUMIFS(Jaugeage!$AA:$AA,Jaugeage!$AB:$AB,MATCH($A8,$A$2:$A$13,0),Jaugeage!$AC:$AC,V$1,Jaugeage!$H:$H,$AE$21),\"\")","v":0},{"$f":"IFERROR(SUMIFS(Jaugeage!$AA:$AA,Jaugeage!$AB:$AB,MATCH($A8,$A$2:$A$13,0),Jaugeage!$AC:$AC,W$1,Jaugeage!$H:$H,$AE$21),\"\")","v":0},{"$f":"IFERROR(SUMIFS(Jaugeage!$AA:$AA,Jaugeage!$AB:$AB,MATCH($A8,$A$2:$A$13,0),Jaugeage!$AC:$AC,X$1,Jaugeage!$H:$H,$AE$21),\"\")","v":0},{"$f":"IFERROR(SUMIFS(Jaugeage!$AA:$AA,Jaugeage!$AB:$AB,MATCH($A8,$A$2:$A$13,0),Jaugeage!$AC:$AC,Y$1,Jaugeage!$H:$H,$AE$21),\"\")","v":0},{"$f":"IFERROR(SUMIFS(Jaugeage!$AA:$AA,Jaugeage!$AB:$AB,MATCH($A8,$A$2:$A$13,0),Jaugeage!$AC:$AC,Z$1,Jaugeage!$H:$H,$AE$21),\"\")","v":0},{"$f":"IFERROR(SUMIFS(Jaugeage!$AA:$AA,Jaugeage!$AB:$AB,MATCH($A8,$A$2:$A$13,0),Jaugeage!$AC:$AC,AA$1,Jaugeage!$H:$H,$AE$21),\"\")","v":0},{"$f":"IFERROR(SUMIFS(Jaugeage!$AA:$AA,Jaugeage!$AB:$AB,MATCH($A8,$A$2:$A$13,0),Jaugeage!$AC:$AC,AB$1,Jaugeage!$H:$H,$AE$21),\"\")","v":0},{"$f":"IFERROR(SUMIFS(Jaugeage!$AA:$AA,Jaugeage!$AB:$AB,MATCH($A8,$A$2:$A$13,0),Jaugeage!$AC:$AC,AC$1,Jaugeage!$H:$H,$AE$21),\"\")","v":0},{"$f":"IFERROR(SUMIFS(Jaugeage!$AA:$AA,Jaugeage!$AB:$AB,MATCH($A8,$A$2:$A$13,0),Jaugeage!$AC:$AC,AD$1,Jaugeage!$H:$H,$AE$21),\"\")","v":0},{"$f":"IFERROR(SUMIFS(Jaugeage!$AA:$AA,Jaugeage!$AB:$AB,MATCH($A8,$A$2:$A$13,0),Jaugeage!$AC:$AC,AE$1,Jaugeage!$H:$H,$AE$21),\"\")","v":0},{"$f":"IFERROR(SUMIFS(Jaugeage!$AA:$AA,Jaugeage!$AB:$AB,MATCH($A8,$A$2:$A$13,0),Jaugeage!$AC:$AC,AF$1,Jaugeage!$H:$H,$AE$21),\"\")","v":0},{"$f":"IFERROR(SUMIFS(Jaugeage!$AA:$AA,Jaugeage!$AB:$AB,MATCH($A8,$A$2:$A$13,0),Jaugeage!$AC:$AC,AG$1,Jaugeage!$H:$H,$AE$21),\"\")","v":0},{"$f":"IFERROR(SUMIFS(Jaugeage!$AA:$AA,Jaugeage!$AB:$AB,MATCH($A8,$A$2:$A$13,0),Jaugeage!$AC:$AC,AH$1,Jaugeage!$H:$H,$AE$21),\"\")","v":0},{"$f":"IFERROR(SUMIFS(Jaugeage!$AA:$AA,Jaugeage!$AB:$AB,MATCH($A8,$A$2:$A$13,0),Jaugeage!$AC:$AC,AI$1,Jaugeage!$H:$H,$AE$21),\"\")","v":0},{"$f":"IFERROR(SUMIFS(Jaugeage!$AA:$AA,Jaugeage!$AB:$AB,MATCH($A8,$A$2:$A$13,0),Jaugeage!$AC:$AC,AJ$1,Jaugeage!$H:$H,$AE$21),\"\")","v":0},{"$f":"IFERROR(AVERAGEIFS(Jaugeage!$AA:$AA,Jaugeage!$AB:$AB,MATCH($A8,$A$2:$A$13,0),Jaugeage!$AC:$AC,AK$1,Jaugeage!$H:$H,$AE$21),\"\")","v":""},{"$f":"IFERROR(AVERAGEIFS(Jaugeage!$AA:$AA,Jaugeage!$AB:$AB,MATCH($A8,$A$2:$A$13,0),Jaugeage!$AC:$AC,AL$1,Jaugeage!$H:$H,$AE$21),\"\")","v":""},{"$f":"IFERROR(AVERAGEIFS(Jaugeage!$AA:$AA,Jaugeage!$AB:$AB,MATCH($A8,$A$2:$A$13,0),Jaugeage!$AC:$AC,AM$1,Jaugeage!$H:$H,$AE$21),\"\")","v":""},{"$f":"IFERROR(AVERAGEIFS(Jaugeage!$AA:$AA,Jaugeage!$AB:$AB,MATCH($A8,$A$2:$A$13,0),Jaugeage!$AC:$AC,AN$1,Jaugeage!$H:$H,$AE$21),\"\")","v":""},{"$f":"IFERROR(AVERAGEIFS(Jaugeage!$AA:$AA,Jaugeage!$AB:$AB,MATCH($A8,$A$2:$A$13,0),Jaugeage!$AC:$AC,AO$1,Jaugeage!$H:$H,$AE$21),\"\")","v":""},{"$f":"IFERROR(AVERAGEIFS(Jaugeage!$AA:$AA,Jaugeage!$AB:$AB,MATCH($A8,$A$2:$A$13,0),Jaugeage!$AC:$AC,AP$1,Jaugeage!$H:$H,$AE$21),\"\")","v":""},{"$error":"#DIV/0!"}]
["Août",{"$f":"IFERROR(SUMIFS(Jaugeage!$AA:$AA,Jaugeage!$AB:$AB,MATCH($A9,$A$2:$A$13,0),Jaugeage!$AC:$AC,B$1,Jaugeage!$H:$H,$AE$21),\"\")","v":0},{"$f":"IFERROR(SUMIFS(Jaugeage!$AA:$AA,Jaugeage!$AB:$AB,MATCH($A9,$A$2:$A$13,0),Jaugeage!$AC:$AC,C$1,Jaugeage!$H:$H,$AE$21),\"\")","v":0},{"$f":"IFERROR(SUMIFS(Jaugeage!$AA:$AA,Jaugeage!$AB:$AB,MATCH($A9,$A$2:$A$13,0),Jaugeage!$AC:$AC,D$1,Jaugeage!$H:$H,$AE$21),\"\")","v":0},{"$f":"IFERROR(SUMIFS(Jaugeage!$AA:$AA,Jaugeage!$AB:$AB,MATCH($A9,$A$2:$A$13,0),Jaugeage!$AC:$AC,E$1,Jaugeage!$H:$H,$AE$21),\"\")","v":0},{"$f":"IFERROR(SUMIFS(Jaugeage!$AA:$AA,Jaugeage!$AB:$AB,MATCH($A9,$A$2:$A$13,0),Jaugeage!$AC:$AC,F$1,Jaugeage!$H:$H,$AE$21),\"\")","v":0},{"$f":"IFERROR(SUMIFS(Jaugeage!$AA:$AA,Jaugeage!$AB:$AB,MATCH($A9,$A$2:$A$13,0),Jaugeage!$AC:$AC,G$1,Jaugeage!$H:$H,$AE$21),\"\")","v":0},{"$f":"IFERROR(SUMIFS(Jaugeage!$AA:$AA,Jaugeage!$AB:$AB,MATCH($A9,$A$2:$A$13,0),Jaugeage!$AC:$AC,H$1,Jaugeage!$H:$H,$AE$21),\"\")","v":0},{"$f":"IFERROR(SUMIFS(Jaugeage!$AA:$AA,Jaugeage!$AB:$AB,MATCH($A9,$A$2:$A$13,0),Jaugeage!$AC:$AC,I$1,Jaugeage!$H:$H,$AE$21),\"\")","v":0},{"$f":"IFERROR(SUMIFS(Jaugeage!$AA:$AA,Jaugeage!$AB:$AB,MATCH($A9,$A$2:$A$13,0),Jaugeage!$AC:$AC,J$1,Jaugeage!$H:$H,$AE$21),\"\")","v":0},{"$f":"IFERROR(SUMIFS(Jaugeage!$AA:$AA,Jaugeage!$AB:$AB,MATCH($A9,$A$2:$A$13,0),Jaugeage!$AC:$AC,K$1,Jaugeage!$H:$H,$AE$21),\"\")","v":0},{"$f":"IFERROR(SUMIFS(Jaugeage!$AA:$AA,Jaugeage!$AB:$AB,MATCH($A9,$A$2:$A$13,0),Jaugeage!$AC:$AC,L$1,Jaugeage!$H:$H,$AE$21),\"\")","v":0},{"$f":"IFERROR(SUMIFS(Jaugeage!$AA:$AA,Jaugeage!$AB:$AB,MATCH($A9,$A$2:$A$13,0),Jaugeage!$AC:$AC,M$1,Jaugeage!$H:$H,$AE$21),\"\")","v":0},{"$f":"IFERROR(SUMIFS(Jaugeage!$AA:$AA,Jaugeage!$AB:$AB,MATCH($A9,$A$2:$A$13,0),Jaugeage!$AC:$AC,N$1,Jaugeage!$H:$H,$AE$21),\"\")","v":0},{"$f":"IFERROR(SUMIFS(Jaugeage!$AA:$AA,Jaugeage!$AB:$AB,MATCH($A9,$A$2:$A$13,0),Jaugeage!$AC:$AC,O$1,Jaugeage!$H:$H,$AE$21),\"\")","v":0},{"$f":"IFERROR(SUMIFS(Jaugeage!$AA:$AA,Jaugeage!$AB:$AB,MATCH($A9,$A$2:$A$13,0),Jaugeage!$AC:$AC,P$1,Jaugeage!$H:$H,$AE$21),\"\")","v":0},{"$f":"IFERROR(SUMIFS(Jaugeage!$AA:$AA,Jaugeage!$AB:$AB,MATCH($A9,$A$2:$A$13,0),Jaugeage!$AC:$AC,Q$1,Jaugeage!$H:$H,$AE$21),\"\")","v":0},{"$f":"IFERROR(SUMIFS(Jaugeage!$AA:$AA,Jaugeage!$AB:$AB,MATCH($A9,$A$2:$A$13,0),Jaugeage!$AC:$AC,R$1,Jaugeage!$H:$H,$AE$21),\"\")","v":0},{"$f":"IFERROR(SUMIFS(Jaugeage!$AA:$AA,Jaugeage!$AB:$AB,MATCH($A9,$A$2:$A$13,0),Jaugeage!$AC:$AC,S$1,Jaugeage!$H:$H,$AE$21),\"\")","v":0},{"$f":"IFERROR(SUMIFS(Jaugeage!$AA:$AA,Jaugeage!$AB:$AB,MATCH($A9,$A$2:$A$13,0),Jaugeage!$AC:$AC,T$1,Jaugeage!$H:$H,$AE$21),\"\")","v":0},{"$f":"IFERROR(SUMIFS(Jaugeage!$AA:$AA,Jaugeage!$AB:$AB,MATCH($A9,$A$2:$A$13,0),Jaugeage!$AC:$AC,U$1,Jaugeage!$H:$H,$AE$21),\"\")","v":0},{"$f":"IFERROR(SUMIFS(Jaugeage!$AA:$AA,Jaugeage!$AB:$AB,MATCH($A9,$A$2:$A$13,0),Jaugeage!$AC:$AC,V$1,Jaugeage!$H:$H,$AE$21),\"\")","v":0},{"$f":"IFERROR(SUMIFS(Jaugeage!$AA:$AA,Jaugeage!$AB:$AB,MATCH($A9,$A$2:$A$13,0),Jaugeage!$AC:$AC,W$1,Jaugeage!$H:$H,$AE$21),\"\")","v":0},{"$f":"IFERROR(SUMIFS(Jaugeage!$AA:$AA,Jaugeage!$AB:$AB,MATCH($A9,$A$2:$A$13,0),Jaugeage!$AC:$AC,X$1,Jaugeage!$H:$H,$AE$21),\"\")","v":0},{"$f":"IFERROR(SUMIFS(Jaugeage!$AA:$AA,Jaugeage!$AB:$AB,MATCH($A9,$A$2:$A$13,0),Jaugeage!$AC:$AC,Y$1,Jaugeage!$H:$H,$AE$21),\"\")","v":0},{"$f":"IFERROR(SUMIFS(Jaugeage!$AA:$AA,Jaugeage!$AB:$AB,MATCH($A9,$A$2:$A$13,0),Jaugeage!$AC:$AC,Z$1,Jaugeage!$H:$H,$AE$21),\"\")","v":0},{"$f":"IFERROR(SUMIFS(Jaugeage!$AA:$AA,Jaugeage!$AB:$AB,MATCH($A9,$A$2:$A$13,0),Jaugeage!$AC:$AC,AA$1,Jaugeage!$H:$H,$AE$21),\"\")","v":0},{"$f":"IFERROR(SUMIFS(Jaugeage!$AA:$AA,Jaugeage!$AB:$AB,MATCH($A9,$A$2:$A$13,0),Jaugeage!$AC:$AC,AB$1,Jaugeage!$H:$H,$AE$21),\"\")","v":0},{"$f":"IFERROR(SUMIFS(Jaugeage!$AA:$AA,Jaugeage!$AB:$AB,MATCH($A9,$A$2:$A$13,0),Jaugeage!$AC:$AC,AC$1,Jaugeage!$H:$H,$AE$21),\"\")","v":0},{"$f":"IFERROR(SUMIFS(Jaugeage!$AA:$AA,Jaugeage!$AB:$AB,MATCH($A9,$A$2:$A$13,0),Jaugeage!$AC:$AC,AD$1,Jaugeage!$H:$H,$AE$21),\"\")","v":0},{"$f":"IFERROR(SUMIFS(Jaugeage!$AA:$AA,Jaugeage!$AB:$AB,MATCH($A9,$A$2:$A$13,0),Jaugeage!$AC:$AC,AE$1,Jaugeage!$H:$H,$AE$21),\"\")","v":0},{"$f":"IFERROR(SUMIFS(Jaugeage!$AA:$AA,Jaugeage!$AB:$AB,MATCH($A9,$A$2:$A$13,0),Jaugeage!$AC:$AC,AF$1,Jaugeage!$H:$H,$AE$21),\"\")","v":0},{"$f":"IFERROR(SUMIFS(Jaugeage!$AA:$AA,Jaugeage!$AB:$AB,MATCH($A9,$A$2:$A$13,0),Jaugeage!$AC:$AC,AG$1,Jaugeage!$H:$H,$AE$21),\"\")","v":0},{"$f":"IFERROR(SUMIFS(Jaugeage!$AA:$AA,Jaugeage!$AB:$AB,MATCH($A9,$A$2:$A$13,0),Jaugeage!$AC:$AC,AH$1,Jaugeage!$H:$H,$AE$21),\"\")","v":0},{"$f":"IFERROR(SUMIFS(Jaugeage!$AA:$AA,Jaugeage!$AB:$AB,MATCH($A9,$A$2:$A$13,0),Jaugeage!$AC:$AC,AI$1,Jaugeage!$H:$H,$AE$21),\"\")","v":0},{"$f":"IFERROR(SUMIFS(Jaugeage!$AA:$AA,Jaugeage!$AB:$AB,MATCH($A9,$A$2:$A$13,0),Jaugeage!$AC:$AC,AJ$1,Jaugeage!$H:$H,$AE$21),\"\")","v":0},{"$f":"IFERROR(AVERAGEIFS(Jaugeage!$AA:$AA,Jaugeage!$AB:$AB,MATCH($A9,$A$2:$A$13,0),Jaugeage!$AC:$AC,AK$1,Jaugeage!$H:$H,$AE$21),\"\")","v":""},{"$f":"IFERROR(AVERAGEIFS(Jaugeage!$AA:$AA,Jaugeage!$AB:$AB,MATCH($A9,$A$2:$A$13,0),Jaugeage!$AC:$AC,AL$1,Jaugeage!$H:$H,$AE$21),\"\")","v":""},{"$f":"IFERROR(AVERAGEIFS(Jaugeage!$AA:$AA,Jaugeage!$AB:$AB,MATCH($A9,$A$2:$A$13,0),Jaugeage!$AC:$AC,AM$1,Jaugeage!$H:$H,$AE$21),\"\")","v":""},{"$f":"IFERROR(AVERAGEIFS(Jaugeage!$AA:$AA,Jaugeage!$AB:$AB,MATCH($A9,$A$2:$A$13,0),Jaugeage!$AC:$AC,AN$1,Jaugeage!$H:$H,$AE$21),\"\")","v":""},{"$f":"IFERROR(AVERAGEIFS(Jaugeage!$AA:$AA,Jaugeage!$AB:$AB,MATCH($A9,$A$2:$A$13,0),Jaugeage!$AC:$AC,AO$1,Jaugeage!$H:$H,$AE$21),\"\")","v":""},{"$f":"IFERROR(AVERAGEIFS(Jaugeage!$AA:$AA,Jaugeage!$AB:$AB,MATCH($A9,$A$2:$A$13,0),Jaugeage!$AC:$AC,AP$1,Jaugeage!$H:$H,$AE$21),\"\")","v":""},{"$error":"#DIV/0!"}]
["Septembre",{"$f":"IFERROR(SUMIFS(Jaugeage!$AA:$AA,Jaugeage!$AB:$AB,MATCH($A10,$A$2:$A$13,0),Jaugeage!$AC:$AC,B$1,Jaugeage!$H:$H,$AE$21),\"\")","v":0},{"$f":"IFERROR(SUMIFS(Jaugeage!$AA:$AA,Jaugeage!$AB:$AB,MATCH($A10,$A$2:$A$13,0),Jaugeage!$AC:$AC,C$1,Jaugeage!$H:$H,$AE$21),\"\")","v":0},{"$f":"IFERROR(SUMIFS(Jaugeage!$AA:$AA,Jaugeage!$AB:$AB,MATCH($A10,$A$2:$A$13,0),Jaugeage!$AC:$AC,D$1,Jaugeage!$H:$H,$AE$21),\"\")","v":0},{"$f":"IFERROR(SUMIFS(Jaugeage!$AA:$AA,Jaugeage!$AB:$AB,MATCH($A10,$A$2:$A$13,0),Jaugeage!$AC:$AC,E$1,Jaugeage!$H:$H,$AE$21),\"\")","v":0},{"$f":"IFERROR(SUMIFS(Jaugeage!$AA:$AA,Jaugeage!$AB:$AB,MATCH($A10,$A$2:$A$13,0),Jaugeage!$AC:$AC,F$1,Jaugeage!$H:$H,$AE$21),\"\")","v":0},{"$f":"IFERROR(SUMIFS(Jaugeage!$AA:$AA,Jaugeage!$AB:$AB,MATCH($A10,$A$2:$A$13,0),Jaugeage!$AC:$AC,G$1,Jaugeage!$H:$H,$AE$21),\"\")","v":0},{"$f":"IFERROR(SUMIFS(Jaugeage!$AA:$AA,Jaugeage!$AB:$AB,MATCH($A10,$A$2:$A$13,0),Jaugeage!$AC:$AC,H$1,Jaugeage!$H:$H,$AE$21),\"\")","v":0},{"$f":"IFERROR(SUMIFS(Jaugeage!$AA:$AA,Jaugeage!$AB:$AB,MATCH($A10,$A$2:$A$13,0),Jaugeage!$AC:$AC,I$1,Jaugeage!$H:$H,$AE$21),\"\")","v":0},{"$f":"IFERROR(SUMIFS(Jaugeage!$AA:$AA,Jaugeage!$AB:$AB,MATCH($A10,$A$2:$A$13,0),Jaugeage!$AC:$AC,J$1,Jaugeage!$H:$H,$AE$21),\"\")","v":0},{"$f":"IFERROR(SUMIFS(Jaugeage!$AA:$AA,Jaugeage!$AB:$AB,MATCH($A10,$A$2:$A$13,0),Jaugeage!$AC:$AC,K$1,Jaugeage!$H:$H,$AE$21),\"\")","v":0},{"$f":"IFERROR(SUMIFS(Jaugeage!$AA:$AA,Jaugeage!$AB:$AB,MATCH($A10,$A$2:$A$13,0),Jaugeage!$AC:$AC,L$1,Jaugeage!$H:$H,$AE$21),\"\")","v":0},{"$f":"IFERROR(SUMIFS(Jaugeage!$AA:$AA,Jaugeage!$AB:$AB,MATCH($A10,$A$2:$A$13,0),Jaugeage!$AC:$AC,M$1,Jaugeage!$H:$H,$AE$21),\"\")","v":0},{"$f":"IFERROR(SUMIFS(Jaugeage!$AA:$AA,Jaugeage!$AB:$AB,MATCH($A10,$A$2:$A$13,0),Jaugeage!$AC:$AC,N$1,Jaugeage!$H:$H,$AE$21),\"\")","v":0},{"$f":"IFERROR(SUMIFS(Jaugeage!$AA:$AA,Jaugeage!$AB:$AB,MATCH($A10,$A$2:$A$13,0),Jaugeage!$AC:$AC,O$1,Jaugeage!$H:$H,$AE$21),\"\")","v":0},{"$f":"IFERROR(SUMIFS(Jaugeage!$AA:$AA,Jaugeage!$AB:$AB,MATCH($A10,$A$2:$A$13,0),Jaugeage!$AC:$AC,P$1,Jaugeage!$H:$H,$AE$21),\"\")","v":0},{"$f":"IFERROR(SUMIFS(Jaugeage!$AA:$AA,Jaugeage!$AB:$AB,MATCH($A10,$A$2:$A$13,0),Jaugeage!$AC:$AC,Q$1,Jaugeage!$H:$H,$AE$21),\"\")","v":0},{"$f":"IFERROR(SUMIFS(Jaugeage!$AA:$AA,Jaugeage!$AB:$AB,MATCH($A10,$A$2:$A$13,0),Jaugeage!$AC:$AC,R$1,Jaugeage!$H:$H,$AE$21),\"\")","v":0},{"$f":"IFERROR(SUMIFS(Jaugeage!$AA:$AA,Jaugeage!$AB:$AB,MATCH($A10,$A$2:$A$13,0),Jaugeage!$AC:$AC,S$1,Jaugeage!$H:$H,$AE$21),\"\")","v":0},{"$f":"IFERROR(SUMIFS(Jaugeage!$AA:$AA,Jaugeage!$AB:$AB,MATCH($A10,$A$2:$A$13,0),Jaugeage!$AC:$AC,T$1,Jaugeage!$H:$H,$AE$21),\"\")","v":0},{"$f":"IFERROR(SUMIFS(Jaugeage!$AA:$AA,Jaugeage!$AB:$AB,MATCH($A10,$A$2:$A$13,0),Jaugeage!$AC:$AC,U$1,Jaugeage!$H:$H,$AE$21),\"\")","v":0},{"$f":"IFERROR(SUMIFS(Jaugeage!$AA:$AA,Jaugeage!$AB:$AB,MATCH($A10,$A$2:$A$13,0),Jaugeage!$AC:$AC,V$1,Jaugeage!$H:$H,$AE$21),\"\")","v":0},{"$f":"IFERROR(SUMIFS(Jaugeage!$AA:$AA,Jaugeage!$AB:$AB,MATCH($A10,$A$2:$A$13,0),Jaugeage!$AC:$AC,W$1,Jaugeage!$H:$H,$AE$21),\"\")","v":0},{"$f":"IFERROR(SUMIFS(Jaugeage!$AA:$AA,Jaugeage!$AB:$AB,MATCH($A10,$A$2:$A$13,0),Jaugeage!$AC:$AC,X$1,Jaugeage!$H:$H,$AE$21),\"\")","v":0},{"$f":"IFERROR(SUMIFS(Jaugeage!$AA:$AA,Jaugeage!$AB:$AB,MATCH($A10,$A$2:$A$13,0),Jaugeage!$AC:$AC,Y$1,Jaugeage!$H:$H,$AE$21),\"\")","v":0},{"$f":"IFERROR(SUMIFS(Jaugeage!$AA:$AA,Jaugeage!$AB:$AB,MATCH($A10,$A$2:$A$13,0),Jaugeage!$AC:$AC,Z$1,Jaugeage!$H:$H,$AE$21),\"\")","v":0},{"$f":"IFERROR(SUMIFS(Jaugeage!$AA:$AA,Jaugeage!$AB:$AB,MATCH($A10,$A$2:$A$13,0),Jaugeage!$AC:$AC,AA$1,Jaugeage!$H:$H,$AE$21),\"\")","v":0},{"$f":"IFERROR(SUMIFS(Jaugeage!$AA:$AA,Jaugeage!$AB:$AB,MATCH($A10,$A$2:$A$13,0),Jaugeage!$AC:$AC,AB$1,Jaugeage!$H:$H,$AE$21),\"\")","v":8.5663295657346819},{"$f":"IFERROR(SUMIFS(Jaugeage!$AA:$AA,Jaugeage!$AB:$AB,MATCH($A10,$A$2:$A$13,0),Jaugeage!$AC:$AC,AC$1,Jaugeage!$H:$H,$AE$21),\"\")","v":0},{"$f":"IFERROR(SUMIFS(Jaugeage!$AA:$AA,Jaugeage!$AB:$AB,MATCH($A10,$A$2:$A$13,0),Jaugeage!$AC:$AC,AD$1,Jaugeage!$H:$H,$AE$21),\"\")","v":0},{"$f":"IFERROR(SUMIFS(Jaugeage!$AA:$AA,Jaugeage!$AB:$AB,MATCH($A10,$A$2:$A$13,0),Jaugeage!$AC:$AC,AE$1,Jaugeage!$H:$H,$AE$21),\"\")","v":0},{"$f":"IFERROR(SUMIFS(Jaugeage!$AA:$AA,Jaugeage!$AB:$AB,MATCH($A10,$A$2:$A$13,0),Jaugeage!$AC:$AC,AF$1,Jaugeage!$H:$H,$AE$21),\"\")","v":0},{"$f":"IFERROR(SUMIFS(Jaugeage!$AA:$AA,Jaugeage!$AB:$AB,MATCH($A10,$A$2:$A$13,0),Jaugeage!$AC:$AC,AG$1,Jaugeage!$H:$H,$AE$21),\"\")","v":0},{"$f":"IFERROR(SUMIFS(Jaugeage!$AA:$AA,Jaugeage!$AB:$AB,MATCH($A10,$A$2:$A$13,0),Jaugeage!$AC:$AC,AH$1,Jaugeage!$H:$H,$AE$21),\"\")","v":0},{"$f":"IFERROR(SUMIFS(Jaugeage!$AA:$AA,Jaugeage!$AB:$AB,MATCH($A10,$A$2:$A$13,0),Jaugeage!$AC:$AC,AI$1,Jaugeage!$H:$H,$AE$21),\"\")","v":0},{"$f":"IFERROR(SUMIFS(Jaugeage!$AA:$AA,Jaugeage!$AB:$AB,MATCH($A10,$A$2:$A$13,0),Jaugeage!$AC:$AC,AJ$1,Jaugeage!$H:$H,$AE$21),\"\")","v":0},{"$f":"IFERROR(AVERAGEIFS(Jaugeage!$AA:$AA,Jaugeage!$AB:$AB,MATCH($A10,$A$2:$A$13,0),Jaugeage!$AC:$AC,AK$1,Jaugeage!$H:$H,$AE$21),\"\")","v":""},{"$f":"IFERROR(AVERAGEIFS(Jaugeage!$AA:$AA,Jaugeage!$AB:$AB,MATCH($A10,$A$2:$A$13,0),Jaugeage!$AC:$AC,AL$1,Jaugeage!$H:$H,$AE$21),\"\")","v":""},{"$f":"IFERROR(AVERAGEIFS(Jaugeage!$AA:$AA,Jaugeage!$AB:$AB,MATCH($A10,$A$2:$A$13,0),Jaugeage!$AC:$AC,AM$1,Jaugeage!$H:$H,$AE$21),\"\")","v":""},{"$f":"IFERROR(AVERAGEIFS(Jaugeage!$AA:$AA,Jaugeage!$AB:$AB,MATCH($A10,$A$2:$A$13,0),Jaugeage!$AC:$AC,AN$1,Jaugeage!$H:$H,$AE$21),\"\")","v":""},{"$f":"IFERROR(AVERAGEIFS(Jaugeage!$AA:$AA,Jaugeage!$AB:$AB,MATCH($A10,$A$2:$A$13,0),Jaugeage!$AC:$AC,AO$1,Jaugeage!$H:$H,$AE$21),\"\")","v":""},{"$f":"IFERROR(AVERAGEIFS(Jaugeage!$AA:$AA,Jaugeage!$AB:$AB,MATCH($A10,$A$2:$A$13,0),Jaugeage!$AC:$AC,AP$1,Jaugeage!$H:$H,$AE$21),\"\")","v":""},8.5663295657346819]
["Octobre",{"$f":"IFERROR(SUMIFS(Jaugeage!$AA:$AA,Jaugeage!$AB:$AB,MATCH($A11,$A$2:$A$13,0),Jaugeage!$AC:$AC,B$1,Jaugeage!$H:$H,$AE$21),\"\")","v":0},{"$f":"IFERROR(SUMIFS(Jaugeage!$AA:$AA,Jaugeage!$AB:$AB,MATCH($A11,$A$2:$A$13,0),Jaugeage!$AC:$AC,C$1,Jaugeage!$H:$H,$AE$21),\"\")","v":0},{"$f":"IFERROR(SUMIFS(Jaugeage!$AA:$AA,Jaugeage!$AB:$AB,MATCH($A11,$A$2:$A$13,0),Jaugeage!$AC:$AC,D$1,Jaugeage!$H:$H,$AE$21),\"\")","v":0},{"$f":"IFERROR(SUMIFS(Jaugeage!$AA:$AA,Jaugeage!$AB:$AB,MATCH($A11,$A$2:$A$13,0),Jaugeage!$AC:$AC,E$1,Jaugeage!$H:$H,$AE$21),\"\")","v":0},{"$f":"IFERROR(SUMIFS(Jaugeage!$AA:$AA,Jaugeage!$AB:$AB,MATCH($A11,$A$2:$A$13,0),Jaugeage!$AC:$AC,F$1,Jaugeage!$H:$H,$AE$21),\"\")","v":0},{"$f":"IFERROR(SUMIFS(Jaugeage!$AA:$AA,Jaugeage!$AB:$AB,MATCH($A11,$A$2:$A$13,0),Jaugeage!$AC:$AC,G$1,Jaugeage!$H:$H,$AE$21),\"\")","v":0},{"$f":"IFERROR(SUMIFS(Jaugeage!$AA:$AA,Jaugeage!$AB:$AB,MATCH($A11,$A$2:$A$13,0),Jaugeage!$AC:$AC,H$1,Jaugeage!$H:$H,$AE$21),\"\")","v":0},{"$f":"IFERROR(SUMIFS(Jaugeage!$AA:$AA,Jaugeage!$AB:$AB,MATCH($A11,$A$2:$A$13,0),Jaugeage!$AC:$AC,I$1,Jaugeage!$H:$H,$AE$21),\"\")","v":0},{"$f":"IFERROR(SUMIFS(Jaugeage!$AA:$AA,Jaugeage!$AB:$AB,MATCH($A11,$A$2:$A$13,0),Jaugeage!$AC:$AC,J$1,Jaugeage!$H:$H,$AE$21),\"\")","v":0},{"$f":"IFERROR(SUMIFS(Jaugeage!$AA:$AA,Jaugeage!$AB:$AB,MATCH($A11,$A$2:$A$13,0),Jaugeage!$AC:$AC,K$1,Jaugeage!$H:$H,$AE$21),\"\")","v":0},{"$f":"IFERROR(SUMIFS(Jaugeage!$AA:$AA,Jaugeage!$AB:$AB,MATCH($A11,$A$2:$A$13,0),Jaugeage!$AC:$AC,L$1,Jaugeage!$H:$H,$AE$21),\"\")","v":0},{"$f":"IFERROR(SUMIFS(Jaugeage!$AA:$AA,Jaugeage!$AB:$AB,MATCH($A11,$A$2:$A$13,0),Jaugeage!$AC:$AC,M$1,Jaugeage!$H:$H,$AE$21),\"\")","v":0},{"$f":"IFERROR(SUMIFS(Jaugeage!$AA:$AA,Jaugeage!$AB:$AB,MATCH($A11,$A$2:$A$13,0),Jaugeage!$AC:$AC,N$1,Jaugeage!$H:$H,$AE$21),\"\")","v":0},{"$f":"IFERROR(SUMIFS(Jaugeage!$AA:$AA,Jaugeage!$AB:$AB,MATCH($A11,$A$2:$A$13,0),Jaugeage!$AC:$AC,O$1,Jaugeage!$H:$H,$AE$21),\"\")","v":0},{"$f":"IFERROR(SUMIFS(Jaugeage!$AA:$AA,Jaugeage!$AB:$AB,MATCH($A11,$A$2:$A$13,0),Jaugeage!$AC:$AC,P$1,Jaugeage!$H:$H,$AE$21),\"\")","v":0},{"$f":"IFERROR(SUMIFS(Jaugeage!$AA:$AA,Jaugeage!$AB:$AB,MATCH($A11,$A$2:$A$13,0),Jaugeage!$AC:$AC,Q$1,Jaugeage!$H:$H,$AE$21),\"\")","v":0},{"$f":"IFERROR(SUMIFS(Jaugeage!$AA:$AA,Jaugeage!$AB:$AB,MATCH($A11,$A$2:$A$13,0),Jaugeage!$AC:$AC,R$1,Jaugeage!$H:$H,$AE$21),\"\")","v":0},{"$f":"IFERROR(SUMIFS(Jaugeage!$AA:$AA,Jaugeage!$AB:$AB,MATCH($A11,$A$2:$A$13,0),Jaugeage!$AC:$AC,S$1,Jaugeage!$H:$H,$AE$21),\"\")","v":0},{"$f":"IFERROR(SUMIFS(Jaugeage!$AA:$AA,Jaugeage!$AB:$AB,MATCH($A11,$A$2:$A$13,0),Jaugeage!$AC:$AC,T$1,Jaugeage!$H:$H,$AE$21),\"\")","v":0},{"$f":"IFERROR(SUMIFS(Jaugeage!$AA:$AA,Jaugeage!$AB:$AB,MATCH($A11,$A$2:$A$13,0),Jaugeage!$AC:$AC,U$1,Jaugeage!$H:$H,$AE$21),\"\")","v":0},{"$f":"IFERROR(SUMIFS(Jaugeage!$AA:$AA,Jaugeage!$AB:$AB,MATCH($A11,$A$2:$A$13,0),Jaugeage!$AC:$AC,V$1,Jaugeage!$H:$H,$AE$21),\"\")","v":0},{"$f":"IFERROR(SUMIFS(Jaugeage!$AA:$AA,Jaugeage!$AB:$AB,MATCH($A11,$A$2:$A$13,0),Jaugeage!$AC:$AC,W$1,Jaugeage!$H:$H,$AE$21),\"\")","v":0},{"$f":"IFERROR(SUMIFS(Jaugeage!$AA:$AA,Jaugeage!$AB:$AB,MATCH($A11,$A$2:$A$13,0),Jaugeage!$AC:$AC,X$1,Jaugeage!$H:$H,$AE$21),\"\")","v":0},{"$f":"IFERROR(SUMIFS(Jaugeage!$AA:$AA,Jaugeage!$AB:$AB,MATCH($A11,$A$2:$A$13,0),Jaugeage!$AC:$AC,Y$1,Jaugeage!$H:$H,$AE$21),\"\")","v":0},{"$f":"IFERROR(SUMIFS(Jaugeage!$AA:$AA,Jaugeage!$AB:$AB,MATCH($A11,$A$2:$A$13,0),Jaugeage!$AC:$AC,Z$1,Jaugeage!$H:$H,$AE$21),\"\")","v":0},{"$f":"IFERROR(SUMIFS(Jaugeage!$AA:$AA,Jaugeage!$AB:$AB,MATCH($A11,$A$2:$A$13,0),Jaugeage!$AC:$AC,AA$1,Jaugeage!$H:$H,$AE$21),\"\")","v":0},{"$f":"IFERROR(SUMIFS(Jaugeage!$AA:$AA,Jaugeage!$AB:$AB,MATCH($A11,$A$2:$A$13,0),Jaugeage!$AC:$AC,AB$1,Jaugeage!$H:$H,$AE$21),\"\")","v":0},{"$f":"IFERROR(SUMIFS(Jaugeage!$AA:$AA,Jaugeage!$AB:$AB,MATCH($A11,$A$2:$A$13,0),Jaugeage!$AC:$AC,AC$1,Jaugeage!$H:$H,$AE$21),\"\")","v":0},{"$f":"IFERROR(SUMIFS(Jaugeage!$AA:$AA,Jaugeage!$AB:$AB,MATCH($A11,$A$2:$A$13,0),Jaugeage!$AC:$AC,AD$1,Jaugeage!$H:$H,$AE$21),\"\")","v":0},{"$f":"IFERROR(SUMIFS(Jaugeage!$AA:$AA,Jaugeage!$AB:$AB,MATCH($A11,$A$2:$A$13,0),Jaugeage!$AC:$AC,AE$1,Jaugeage!$H:$H,$AE$21),\"\")","v":0},{"$f":"IFERROR(SUMIFS(Jaugeage!$AA:$AA,Jaugeage!$AB:$AB,MATCH($A11,$A$2:$A$13,0),Jaugeage!$AC:$AC,AF$1,Jaugeage!$H:$H,$AE$21),\"\")","v":0},{"$f":"IFERROR(SUMIFS(Jaugeage!$AA:$AA,Jaugeage!$AB:$AB,MATCH($A11,$A$2:$A$13,0),Jaugeage!$AC:$AC,AG$1,Jaugeage!$H:$H,$AE$21),\"\")","v":0},{"$f":"IFERROR(SUMIFS(Jaugeage!$AA:$AA,Jaugeage!$AB:$AB,MATCH($A11,$A$2:$A$13,0),Jaugeage!$AC:$AC,AH$1,Jaugeage!$H:$H,$AE$21),\"\")","v":0},{"$f":"IFERROR(SUMIFS(Jaugeage!$AA:$AA,Jaugeage!$AB:$AB,MATCH($A11,$A$2:$A$13,0),Jaugeage!$AC:$AC,AI$1,Jaugeage!$H:$H,$AE$21),\"\")","v":0},{"$f":"IFERROR(SUMIFS(Jaugeage!$AA:$AA,Jaugeage!$AB:$AB,MATCH($A11,$A$2:$A$13,0),Jaugeage!$AC:$AC,AJ$1,Jaugeage!$H:$H,$AE$21),\"\")","v":0},{"$f":"IFERROR(AVERAGEIFS(Jaugeage!$AA:$AA,Jaugeage!$AB:$AB,MATCH($A11,$A$2:$A$13,0),Jaugeage!$AC:$AC,AK$1,Jaugeage!$H:$H,$AE$21),\"\")","v":""},{"$f":"IFERROR(AVERAGEIFS(Jaugeage!$AA:$AA,Jaugeage!$AB:$AB,MATCH($A11,$A$2:$A$13,0),Jaugeage!$AC:$AC,AL$1,Jaugeage!$H:$H,$AE$21),\"\")","v":""},{"$f":"IFERROR(AVERAGEIFS(Jaugeage!$AA:$AA,Jaugeage!$AB:$AB,MATCH($A11,$A$2:$A$13,0),Jaugeage!$AC:$AC,AM$1,Jaugeage!$H:$H,$AE$21),\"\")","v":""},{"$f":"IFERROR(AVERAGEIFS(Jaugeage!$AA:$AA,Jaugeage!$AB:$AB,MATCH($A11,$A$2:$A$13,0),Jaugeage!$AC:$AC,AN$1,Jaugeage!$H:$H,$AE$21),\"\")","v":""},{"$f":"IFERROR(AVERAGEIFS(Jaugeage!$AA:$AA,Jaugeage!$AB:$AB,MATCH($A11,$A$2:$A$13,0),Jaugeage!$AC:$AC,AO$1,Jaugeage!$H:$H,$AE$21),\"\")","v":""},{"$f":"IFERROR(AVERAGEIFS(Jaugeage!$AA:$AA,Jaugeage!$AB:$AB,MATCH($A11,$A$2:$A$13,0),Jaugeage!$AC:$AC,AP$1,Jaugeage!$H:$H,$AE$21),\"\")","v":""},{"$error":"#DIV/0!"}]
["Novembre",{"$f":"IFERROR(SUMIFS(Jaugeage!$AA:$AA,Jaugeage!$AB:$AB,MATCH($A12,$A$2:$A$13,0),Jaugeage!$AC:$AC,B$1,Jaugeage!$H:$H,$AE$21),\"\")","v":0},{"$f":"IFERROR(SUMIFS(Jaugeage!$AA:$AA,Jaugeage!$AB:$AB,MATCH($A12,$A$2:$A$13,0),Jaugeage!$AC:$AC,C$1,Jaugeage!$H:$H,$AE$21),\"\")","v":0},{"$f":"IFERROR(SUMIFS(Jaugeage!$AA:$AA,Jaugeage!$AB:$AB,MATCH($A12,$A$2:$A$13,0),Jaugeage!$AC:$AC,D$1,Jaugeage!$H:$H,$AE$21),\"\")","v":0},{"$f":"IFERROR(SUMIFS(Jaugeage!$AA:$AA,Jaugeage!$AB:$AB,MATCH($A12,$A$2:$A$13,0),Jaugeage!$AC:$AC,E$1,Jaugeage!$H:$H,$AE$21),\"\")","v":0},{"$f":"IFERROR(SUMIFS(Jaugeage!$AA:$AA,Jaugeage!$AB:$AB,MATCH($A12,$A$2:$A$13,0),Jaugeage!$AC:$AC,F$1,Jaugeage!$H:$H,$AE$21),\"\")","v":0},{"$f":"IFERROR(SUMIFS(Jaugeage!$AA:$AA,Jaugeage!$AB:$AB,MATCH($A12,$A$2:$A$13,0),Jaugeage!$AC:$AC,G$1,Jaugeage!$H:$H,$AE$21),\"\")","v":0},{"$f":"IFERROR(SUMIFS(Jaugeage!$AA:$AA,Jaugeage!$AB:$AB,MATCH($A12,$A$2:$A$13,0),Jaugeage!$AC:$AC,H$1,Jaugeage!$H:$H,$AE$21),\"\")","v":0},{"$f":"IFERROR(SUMIFS(Jaugeage!$AA:$AA,Jaugeage!$AB:$AB,MATCH($A12,$A$2:$A$13,0),Jaugeage!$AC:$AC,I$1,Jaugeage!$H:$H,$AE$21),\"\")","v":0},{"$f":"IFERROR(SUMIFS(Jaugeage!$AA:$AA,Jaugeage!$AB:$AB,MATCH($A12,$A$2:$A$13,0),Jaugeage!$AC:$AC,J$1,Jaugeage!$H:$H,$AE$21),\"\")","v":0},{"$f":"IFERROR(SUMIFS(Jaugeage!$AA:$AA,Jaugeage!$AB:$AB,MATCH($A12,$A$2:$A$13,0),Jaugeage!$AC:$AC,K$1,Jaugeage!$H:$H,$AE$21),\"\")","v":0},{"$f":"IFERROR(SUMIFS(Jaugeage!$AA:$AA,Jaugeage!$AB:$AB,MATCH($A12,$A$2:$A$13,0),Jaugeage!$AC:$AC,L$1,Jaugeage!$H:$H,$AE$21),\"\")","v":0},{"$f":"IFERROR(SUMIFS(Jaugeage!$AA:$AA,Jaugeage!$AB:$AB,MATCH($A12,$A$2:$A$13,0),Jaugeage!$AC:$AC,M$1,Jaugeage!$H:$H,$AE$21),\"\")","v":0},{"$f":"IFERROR(SUMIFS(Jaugeage!$AA:$AA,Jaugeage!$AB:$AB,MATCH($A12,$A$2:$A$13,0),Jaugeage!$AC:$AC,N$1,Jaugeage!$H:$H,$AE$21),\"\")","v":0},{"$f":"IFERROR(SUMIFS(Jaugeage!$AA:$AA,Jaugeage!$AB:$AB,MATCH($A12,$A$2:$A$13,0),Jaugeage!$AC:$AC,O$1,Jaugeage!$H:$H,$AE$21),\"\")","v":0},{"$f":"IFERROR(SUMIFS(Jaugeage!$AA:$AA,Jaugeage!$AB:$AB,MATCH($A12,$A$2:$A$13,0),Jaugeage!$AC:$AC,P$1,Jaugeage!$H:$H,$AE$21),\"\")","v":0},{"$f":"IFERROR(SUMIFS(Jaugeage!$AA:$AA,Jaugeage!$AB:$AB,MATCH($A12,$A$2:$A$13,0),Jaugeage!$AC:$AC,Q$1,Jaugeage!$H:$H,$AE$21),\"\")","v":0},{"$f":"IFERROR(SUMIFS(Jaugeage!$AA:$AA,Jaugeage!$AB:$AB,MATCH($A12,$A$2:$A$13,0),Jaugeage!$AC:$AC,R$1,Jaugeage!$H:$H,$AE$21),\"\")","v":0},{"$f":"IFERROR(SUMIFS(Jaugeage!$AA:$AA,Jaugeage!$AB:$AB,MATCH($A12,$A$2:$A$13,0),Jaugeage!$AC:$AC,S$1,Jaugeage!$H:$H,$AE$21),\"\")","v":0},{"$f":"IFERROR(SUMIFS(Jaugeage!$AA:$AA,Jaugeage!$AB:$AB,MATCH($A12,$A$2:$A$13,0),Jaugeage!$AC:$AC,T$1,Jaugeage!$H:$H,$AE$21),\"\")","v":0},{"$f":"IFERROR(SUMIFS(Jaugeage!$AA:$AA,Jaugeage!$AB:$AB,MATCH($A12,$A$2:$A$13,0),Jaugeage!$AC:$AC,U$1,Jaugeage!$H:$H,$AE$21),\"\")","v":0},{"$f":"IFERROR(SUMIFS(Jaugeage!$AA:$AA,Jaugeage!$AB:$AB,MATCH($A12,$A$2:$A$13,0),Jaugeage!$AC:$AC,V$1,Jaugeage!$H:$H,$AE$21),\"\")","v":0},{"$f":"IFERROR(SUMIFS(Jaugeage!$AA:$AA,Jaugeage!$AB:$AB,MATCH($A12,$A$2:$A$13,0),Jaugeage!$AC:$AC,W$1,Jaugeage!$H:$H,$AE$21),\"\")","v":0},{"$f":"IFERROR(SUMIFS(Jaugeage!$AA:$AA,Jaugeage!$AB:$AB,MATCH($A12,$A$2:$A$13,0),Jaugeage!$AC:$AC,X$1,Jaugeage!$H:$H,$AE$21),\"\")","v":0},{"$f":"IFERROR(SUMIFS(Jaugeage!$AA:$AA,Jaugeage!$AB:$AB,MATCH($A12,$A$2:$A$13,0),Jaugeage!$AC:$AC,Y$1,Jaugeage!$H:$H,$AE$21),\"\")","v":0},{"$f":"IFERROR(SUMIFS(Jaugeage!$AA:$AA,Jaugeage!$AB:$AB,MATCH($A12,$A$2:$A$13,0),Jaugeage!$AC:$AC,Z$1,Jaugeage!$H:$H,$AE$21),\"\")","v":0},{"$f":"IFERROR(SUMIFS(Jaugeage!$AA:$AA,Jaugeage!$AB:$AB,MATCH($A12,$A$2:$A$13,0),Jaugeage!$AC:$AC,AA$1,Jaugeage!$H:$H,$AE$21),\"\")","v":0},{"$f":"IFERROR(SUMIFS(Jaugeage!$AA:$AA,Jaugeage!$AB:$AB,MATCH($A12,$A$2:$A$13,0),Jaugeage!$AC:$AC,AB$1,Jaugeage!$H:$H,$AE$21),\"\")","v":0},{"$f":"IFERROR(SUMIFS(Jaugeage!$AA:$AA,Jaugeage!$AB:$AB,MATCH($A12,$A$2:$A$13,0),Jaugeage!$AC:$AC,AC$1,Jaugeage!$H:$H,$AE$21),\"\")","v":0},{"$f":"IFERROR(SUMIFS(Jaugeage!$AA:$AA,Jaugeage!$AB:$AB,MATCH($A12,$A$2:$A$13,0),Jaugeage!$AC:$AC,AD$1,Jaugeage!$H:$H,$AE$21),\"\")","v":0},{"$f":"IFERROR(SUMIFS(Jaugeage!$AA:$AA,Jaugeage!$AB:$AB,MATCH($A12,$A$2:$A$13,0),Jaugeage!$AC:$AC,AE$1,Jaugeage!$H:$H,$AE$21),\"\")","v":0},{"$f":"IFERROR(SUMIFS(Jaugeage!$AA:$AA,Jaugeage!$AB:$AB,MATCH($A12,$A$2:$A$13,0),Jaugeage!$AC:$AC,AF$1,Jaugeage!$H:$H,$AE$21),\"\")","v":0},{"$f":"IFERROR(SUMIFS(Jaugeage!$AA:$AA,Jaugeage!$AB:$AB,MATCH($A12,$A$2:$A$13,0),Jaugeage!$AC:$AC,AG$1,Jaugeage!$H:$H,$AE$21),\"\")","v":0},{"$f":"IFERROR(SUMIFS(Jaugeage!$AA:$AA,Jaugeage!$AB:$AB,MATCH($A12,$A$2:$A$13,0),Jaugeage!$AC:$AC,AH$1,Jaugeage!$H:$H,$AE$21),\"\")","v":0},{"$f":"IFERROR(SUMIFS(Jaugeage!$AA:$AA,Jaugeage!$AB:$AB,MATCH($A12,$A$2:$A$13,0),Jaugeage!$AC:$AC,AI$1,Jaugeage!$H:$H,$AE$21),\"\")","v":0},{"$f":"IFERROR(SUMIFS(Jaugeage!$AA:$AA,Jaugeage!$AB:$AB,MATCH($A12,$A$2:$A$13,0),Jaugeage!$AC:$AC,AJ$1,Jaugeage!$H:$H,$AE$21),\"\")","v":0},{"$f":"IFERROR(AVERAGEIFS(Jaugeage!$AA:$AA,Jaugeage!$AB:$AB,MATCH($A12,$A$2:$A$13,0),Jaugeage!$AC:$AC,AK$1,Jaugeage!$H:$H,$AE$21),\"\")","v":""},{"$f":"IFERROR(AVERAGEIFS(Jaugeage!$AA:$AA,Jaugeage!$AB:$AB,MATCH($A12,$A$2:$A$13,0),Jaugeage!$AC:$AC,AL$1,Jaugeage!$H:$H,$AE$21),\"\")","v":""},{"$f":"IFERROR(AVERAGEIFS(Jaugeage!$AA:$AA,Jaugeage!$AB:$AB,MATCH($A12,$A$2:$A$13,0),Jaugeage!$AC:$AC,AM$1,Jaugeage!$H:$H,$AE$21),\"\")","v":""},{"$f":"IFERROR(AVERAGEIFS(Jaugeage!$AA:$AA,Jaugeage!$AB:$AB,MATCH($A12,$A$2:$A$13,0),Jaugeage!$AC:$AC,AN$1,Jaugeage!$H:$H,$AE$21),\"\")","v":""},{"$f":"IFERROR(AVERAGEIFS(Jaugeage!$AA:$AA,Jaugeage!$AB:$AB,MATCH($A12,$A$2:$A$13,0),Jaugeage!$AC:$AC,AO$1,Jaugeage!$H:$H,$AE$21),\"\")","v":""},{"$f":"IFERROR(AVERAGEIFS(Jaugeage!$AA:$AA,Jaugeage!$AB:$AB,MATCH($A12,$A$2:$A$13,0),Jaugeage!$AC:$AC,AP$1,Jaugeage!$H:$H,$AE$21),\"\")","v":""},{"$error":"#DIV/0!"}]
["Décembre",{"$f":"IFERROR(SUMIFS(Jaugeage!$AA:$AA,Jaugeage!$AB:$AB,MATCH($A13,$A$2:$A$13,0),Jaugeage!$AC:$AC,B$1,Jaugeage!$H:$H,$AE$21),\"\")","v":0},{"$f":"IFERROR(SUMIFS(Jaugeage!$AA:$AA,Jaugeage!$AB:$AB,MATCH($A13,$A$2:$A$13,0),Jaugeage!$AC:$AC,C$1,Jaugeage!$H:$H,$AE$21),\"\")","v":0},{"$f":"IFERROR(SUMIFS(Jaugeage!$AA:$AA,Jaugeage!$AB:$AB,MATCH($A13,$A$2:$A$13,0),Jaugeage!$AC:$AC,D$1,Jaugeage!$H:$H,$AE$21),\"\")","v":0},{"$f":"IFERROR(SUMIFS(Jaugeage!$AA:$AA,Jaugeage!$AB:$AB,MATCH($A13,$A$2:$A$13,0),Jaugeage!$AC:$AC,E$1,Jaugeage!$H:$H,$AE$21),\"\")","v":0},{"$f":"IFERROR(SUMIFS(Jaugeage!$AA:$AA,Jaugeage!$AB:$AB,MATCH($A13,$A$2:$A$13,0),Jaugeage!$AC:$AC,F$1,Jaugeage!$H:$H,$AE$21),\"\")","v":0},{"$f":"IFERROR(SUMIFS(Jaugeage!$AA:$AA,Jaugeage!$AB:$AB,MATCH($A13,$A$2:$A$13,0),Jaugeage!$AC:$AC,G$1,Jaugeage!$H:$H,$AE$21),\"\")","v":0},{"$f":"IFERROR(SUMIFS(Jaugeage!$AA:$AA,Jaugeage!$AB:$AB,MATCH($A13,$A$2:$A$13,0),Jaugeage!$AC:$AC,H$1,Jaugeage!$H:$H,$AE$21),\"\")","v":0},{"$f":"IFERROR(SUMIFS(Jaugeage!$AA:$AA,Jaugeage!$AB:$AB,MATCH($A13,$A$2:$A$13,0),Jaugeage!$AC:$AC,I$1,Jaugeage!$H:$H,$AE$21),\"\")","v":0},{"$f":"IFERROR(SUMIFS(Jaugeage!$AA:$AA,Jaugeage!$AB:$AB,MATCH($A13,$A$2:$A$13,0),Jaugeage!$AC:$AC,J$1,Jaugeage!$H:$H,$AE$21),\"\")","v":0},{"$f":"IFERROR(SUMIFS(Jaugeage!$AA:$AA,Jaugeage!$AB:$AB,MATCH($A13,$A$2:$A$13,0),Jaugeage!$AC:$AC,K$1,Jaugeage!$H:$H,$AE$21),\"\")","v":0},{"$f":"IFERROR(SUMIFS(Jaugeage!$AA:$AA,Jaugeage!$AB:$AB,MATCH($A13,$A$2:$A$13,0),Jaugeage!$AC:$AC,L$1,Jaugeage!$H:$H,$AE$21),\"\")","v":0},{"$f":"IFERROR(SUMIFS(Jaugeage!$AA:$AA,Jaugeage!$AB:$AB,MATCH($A13,$A$2:$A$13,0),Jaugeage!$AC:$AC,M$1,Jaugeage!$H:$H,$AE$21),\"\")","v":0},{"$f":"IFERROR(SUMIFS(Jaugeage!$AA:$AA,Jaugeage!$AB:$AB,MATCH($A13,$A$2:$A$13,0),Jaugeage!$AC:$AC,N$1,Jaugeage!$H:$H,$AE$21),\"\")","v":0},{"$f":"IFERROR(SUMIFS(Jaugeage!$AA:$AA,Jaugeage!$AB:$AB,MATCH($A13,$A$2:$A$13,0),Jaugeage!$AC:$AC,O$1,Jaugeage!$H:$H,$AE$21),\"\")","v":0},{"$f":"IFERROR(SUMIFS(Jaugeage!$AA:$AA,Jaugeage!$AB:$AB,MATCH($A13,$A$2:$A$13,0),Jaugeage!$AC:$AC,P$1,Jaugeage!$H:$H,$AE$21),\"\")","v":0},{"$f":"IFERROR(SUMIFS(Jaugeage!$AA:$AA,Jaugeage!$AB:$AB,MATCH($A13,$A$2:$A$13,0),Jaugeage!$AC:$AC,Q$1,Jaugeage!$H:$H,$AE$21),\"\")","v":0},{"$f":"IFERROR(SUMIFS(Jaugeage!$AA:$AA,Jaugeage!$AB:$AB,MATCH($A13,$A$2:$A$13,0),Jaugeage!$AC:$AC,R$1,Jaugeage!$H:$H,$AE$21),\"\")","v":0},{"$f":"IFERROR(SUMIFS(Jaugeage!$AA:$AA,Jaugeage!$AB:$AB,MATCH($A13,$A$2:$A$13,0),Jaugeage!$AC:$AC,S$1,Jaugeage!$H:$H,$AE$21),\"\")","v":0},{"$f":"IFERROR(SUMIFS(Jaugeage!$AA:$AA,Jaugeage!$AB:$AB,MATCH($A13,$A$2:$A$13,0),Jaugeage!$AC:$AC,T$1,Jaugeage!$H:$H,$AE$21),\"\")","v":0},{"$f":"IFERROR(SUMIFS(Jaugeage!$AA:$AA,Jaugeage!$AB:$AB,MATCH($A13,$A$2:$A$13,0),Jaugeage!$AC:$AC,U$1,Jaugeage!$H:$H,$AE$21),\"\")","v":0},{"$f":"IFERROR(SUMIFS(Jaugeage!$AA:$AA,Jaugeage!$AB:$AB,MATCH($A13,$A$2:$A$13,0),Jaugeage!$AC:$AC,V$1,Jaugeage!$H:$H,$AE$21),\"\")","v":0},{"$f":"IFERROR(SUMIFS(Jaugeage!$AA:$AA,Jaugeage!$AB:$AB,MATCH($A13,$A$2:$A$13,0),Jaugeage!$AC:$AC,W$1,Jaugeage!$H:$H,$AE$21),\"\")","v":0},{"$f":"IFERROR(SUMIFS(Jaugeage!$AA:$AA,Jaugeage!$AB:$AB,MATCH($A13,$A$2:$A$13,0),Jaugeage!$AC:$AC,X$1,Jaugeage!$H:$H,$AE$21),\"\")","v":0},{"$f":"IFERROR(SUMIFS(Jaugeage!$AA:$AA,Jaugeage!$AB:$AB,MATCH($A13,$A$2:$A$13,0),Jaugeage!$AC:$AC,Y$1,Jaugeage!$H:$H,$AE$21),\"\")","v":0},{"$f":"IFERROR(SUMIFS(Jaugeage!$AA:$AA,Jaugeage!$AB:$AB,MATCH($A13,$A$2:$A$13,0),Jaugeage!$AC:$AC,Z$1,Jaugeage!$H:$H,$AE$21),\"\")","v":0},{"$f":"IFERROR(SUMIFS(Jaugeage!$AA:$AA,Jaugeage!$AB:$AB,MATCH($A13,$A$2:$A$13,0),Jaugeage!$AC:$AC,AA$1,Jaugeage!$H:$H,$AE$21),\"\")","v":0},{"$f":"IFERROR(SUMIFS(Jaugeage!$AA:$AA,Jaugeage!$AB:$AB,MATCH($A13,$A$2:$A$13,0),Jaugeage!$AC:$AC,AB$1,Jaugeage!$H:$H,$AE$21),\"\")","v":0},{"$f":"IFERROR(SUMIFS(Jaugeage!$AA:$AA,Jaugeage!$AB:$AB,MATCH($A13,$A$2:$A$13,0),Jaugeage!$AC:$AC,AC$1,Jaugeage!$H:$H,$AE$21),\"\")","v":0},{"$f":"IFERROR(SUMIFS(Jaugeage!$AA:$AA,Jaugeage!$AB:$AB,MATCH($A13,$A$2:$A$13,0),Jaugeage!$AC:$AC,AD$1,Jaugeage!$H:$H,$AE$21),\"\")","v":0},{"$f":"IFERROR(SUMIFS(Jaugeage!$AA:$AA,Jaugeage!$AB:$AB,MATCH($A13,$A$2:$A$13,0),Jaugeage!$AC:$AC,AE$1,Jaugeage!$H:$H,$AE$21),\"\")","v":0},{"$f":"IFERROR(SUMIFS(Jaugeage!$AA:$AA,Jaugeage!$AB:$AB,MATCH($A13,$A$2:$A$13,0),Jaugeage!$AC:$AC,AF$1,Jaugeage!$H:$H,$AE$21),\"\")","v":0},{"$f":"IFERROR(SUMIFS(Jaugeage!$AA:$AA,Jaugeage!$AB:$AB,MATCH($A13,$A$2:$A$13,0),Jaugeage!$AC:$AC,AG$1,Jaugeage!$H:$H,$AE$21),\"\")","v":0},{"$f":"IFERROR(SUMIFS(Jaugeage!$AA:$AA,Jaugeage!$AB:$AB,MATCH($A13,$A$2:$A$13,0),Jaugeage!$AC:$AC,AH$1,Jaugeage!$H:$H,$AE$21),\"\")","v":0},{"$f":"IFERROR(SUMIFS(Jaugeage!$AA:$AA,Jaugeage!$AB:$AB,MATCH($A13,$A$2:$A$13,0),Jaugeage!$AC:$AC,AI$1,Jaugeage!$H:$H,$AE$21),\"\")","v":0},{"$f":"IFERROR(SUMIFS(Jaugeage!$AA:$AA,Jaugeage!$AB:$AB,MATCH($A13,$A$2:$A$13,0),Jaugeage!$AC:$AC,AJ$1,Jaugeage!$H:$H,$AE$21),\"\")","v":0},{"$f":"IFERROR(AVERAGEIFS(Jaugeage!$AA:$AA,Jaugeage!$AB:$AB,MATCH($A13,$A$2:$A$13,0),Jaugeage!$AC:$AC,AK$1,Jaugeage!$H:$H,$AE$21),\"\")","v":""},{"$f":"IFERROR(AVERAGEIFS(Jaugeage!$AA:$AA,Jaugeage!$AB:$AB,MATCH($A13,$A$2:$A$13,0),Jaugeage!$AC:$AC,AL$1,Jaugeage!$H:$H,$AE$21),\"\")","v":""},{"$f":"IFERROR(AVERAGEIFS(Jaugeage!$AA:$AA,Jaugeage!$AB:$AB,MATCH($A13,$A$2:$A$13,0),Jaugeage!$AC:$AC,AM$1,Jaugeage!$H:$H,$AE$21),\"\")","v":""},{"$f":"IFERROR(AVERAGEIFS(Jaugeage!$AA:$AA,Jaugeage!$AB:$AB,MATCH($A13,$A$2:$A$13,0),Jaugeage!$AC:$AC,AN$1,Jaugeage!$H:$H,$AE$21),\"\")","v":""},{"$f":"IFERROR(AVERAGEIFS(Jaugeage!$AA:$AA,Jaugeage!$AB:$AB,MATCH($A13,$A$2:$A$13,0),Jaugeage!$AC:$AC,AO$1,Jaugeage!$H:$H,$AE$21),\"\")","v":""},{"$f":"IFERROR(AVERAGEIFS(Jaugeage!$AA:$AA,Jaugeage!$AB:$AB,MATCH($A13,$A$2:$A$13,0),Jaugeage!$AC:$AC,AP$1,Jaugeage!$H:$H,$AE$21),\"\")","v":""},{"$error":"#DIV/0!"}]
[]
[]
[]
[]
[]
[]
[]
[null,null,null,null,null,null,null,null,null,null,null,null,null,null,null,null,null,null,null,null,null,null,"Poire",null,null,null,"Poireaux",null,null,null,"C"]
[]
[]
[null,null,null,null,null,null,null,null,null,null,null,null,null,null,null,null,null,null,null,null,null,null,null,null,{"$f":"\"Moyennes mensuelles interannuelles de : \" &AE21","v":"Moyennes mensuelles interannuelles de : C"}]

{"sheet":"Evolution ds le tps","index":4,"n_rows":5,"n_cols":2,"rows_kept":5,"cut":false,"hidden":false,"merged":[]}
["Étiquettes de lignes","Moyenne de Total général M3 /jrs"]
[104,22.966507177033495]
["A",22.966507177033495]
["2016-09-16",22.966507177033495]
["Total général",22.966507177033495]

{"sheet":"BDD 104","index":5,"n_rows":6,"n_cols":9,"rows_kept":6,"cut":false,"hidden":false,"merged":[]}
["Paul","Pomme","Poire","Navet","Carde","Courgette","Radis","Poireaux","Tomate"]
["Pomme","Navet","Poireaux",{"$f":"BDDG!F3","v":"A"},{"$f":"BDDG!F4","v":"B"},{"$f":"BDDG!F6","v":"D"},{"$f":"BDDG!F7","v":"E"},{"$f":"BDDG!F5","v":"C"},{"$f":"BDDG!F8","v":"F"}]
["Poire","Card"]
[null,"Courgette"]
[null,"Radis"]
[null,"Tomate"]

{"sheet":"Météo","index":6,"n_rows":7,"n_cols":1,"rows_kept":7,"cut":false,"hidden":false,"merged":[]}
["Couvert"]
["Froid"]
["Neige"]
["Pluie"]
["Sécheresse"]
["Soleil"]
["Vent chaud"]