{"text_format":"1","workbook":"xlsx","n_sheets":3,"sheets":["Moulinette","Codes composants CMS","Codes composants TRV"],"not_rendered":{"charts":0,"images":0,"macros":1,"external_links":0,"defined_names":0,"comments":0,"pivot_tables":0},"unopened":[],"bounds":{"document_bytes":16777216,"sheet_cells":100000,"rows_first":2000,"rows_last":500,"rows_between":2000,"halvings":0,"cell_chars":16384,"cell_head_chars":4096},"cells_cut":0,"cells_raw":0,"read":"whole","date_system":"1900"}

{"sheet":"Moulinette","index":0,"n_rows":1148,"n_cols":41,"rows_kept":1148,"cut":false,"hidden":false,"merged":[]}
["! Comment","Record",null,"X location",null,"Y location",null,"Reference ",null,"Component type",null,"Orientation",null,"Part Number",null,"Machine feeder",null,"Reference",null,"Shape",null,null,null,null,null,null,null,null,null,null,null,null,null,null,null,null,null,null,null,"Nom composant","Nb de lettres"]
[null,{"$f":"IF(EXACT(MID(H2,1,3),\"FID\"),\"f\",\"d\")","v":"d"}," ",{"$f":"IFERROR(_xlfn.NUMBERVALUE(SUBSTITUTE(MID(X2,AJ2+1,AK2-AJ2-1),\".\",\",\"))*25.4,\"\")","v":""}," ",{"$f":"IFERROR(_xlfn.NUMBERVALUE(SUBSTITUTE(MID(X2,AK2+1,AL2-1),\".\",\",\"))*25.4,\"\")","v":""}," ",{"$f":"IFERROR(MID(X2,AD2+1,AE2-AD2-1),\"\")","v":""}," ",{"$f":"IF(X2<>\"\",\"n0000\",\"\")","v":""}," ",{"$f":"IFERROR(_xlfn.NUMBERVALUE(MID(X2,AI2+1,AJ2-AI2-1))+90,\"\")","v":""}," ",{"$f":"IFERROR(MID(X2,AE2+2,AF2-AE2-3),\"\")","v":""}," ",{"$f":"IF(X2<>\"\",\"PP\",\"\")","v":""}," ",{"$f":"IFERROR(MID(X2,AD2+1,AE2-AD2-1),\"\")","v":""}," ",{"$f":"IFERROR(MID(X2,AF2+2,AG2-AF2-3),\"\")","v":""},null,null,null,null,null,null,null,null,null,{"$f":"IF(X2<>\"\",\"0\",\"\")","v":""},{"$f":"IFERROR(SEARCH(\",\",X2,1),\"\")","v":""},{"$f":"IFERROR(SEARCH(\",\",X2,AE2+1),\"\")","v":""},{"$f":"IFERROR(SEARCH(\",\",X2,AF2+1),\"\")","v":""},{"$f":"IFERROR(SEARCH(\",\",X2,AG2+1),\"\")","v":""},{"$f":"IFERROR(SEARCH(\",\",X2,AH2+1),\"\")","v":""},{"$f":"IFERROR(SEARCH(\",\",X2,AI2+1),\"\")","v":""},{"$f":"IFERROR(SEARCH(\",\",X2,AJ2+1),\"\")","v":""},{"$f":"IF(X2<>\"\",LEN(X2),\"\")","v":""},null,{"$f":"IFERROR(MID(X2,AE2+2,AF2-AE2-3),\"\")","v":""},{"$f":"IF(AN2<>\"\",LEN(AN2),\"\")","v":""}]
[null,{"$f":"IF(EXACT(MID(H3,1,3),\"FID\"),\"f\",\"d\")","v":"d"}," ",{"$f":"IFERROR(_xlfn.NUMBERVALUE(SUBSTITUTE(MID(X3,AJ3+1,AK3-AJ3-1),\".\",\",\"))*25.4,\"\")","v":""}," ",{"$f":"IFERROR(_xlfn.NUMBERVALUE(SUBSTITUTE(MID(X3,AK3+1,AL3-1),\".\",\",\"))*25.4,\"\")","v":""}," ",{"$f":"IFERROR(MID(X3,AD3+1,AE3-AD3-1),\"\")","v":""}," ",{"$f":"IF(X3<>\"\",\"n0000\",\"\")","v":""}," ",{"$f":"IFERROR(_xlfn.NUMBERVALUE(MID(X3,AI3+1,AJ3-AI3-1))+90,\"\")","v":""}," ",{"$f":"IFERROR(MID(X3,AE3+2,AF3-AE3-3),\"\")","v":""}," ",{"$f":"IF(X3<>\"\",\"PP\",\"\")","v":""}," ",{"$f":"IFERROR(MID(X3,AD3+1,AE3-AD3-1),\"\")","v":""}," ",{"$f":"IFERROR(MID(X3,AF3+2,AG3-AF3-3),\"\")","v":""},null,null,null,null,null,null,null,null,null,{"$f":"IF(X3<>\"\",\"0\",\"\")","v":""},{"$f":"IFERROR(SEARCH(\",\",X3,1),\"\")","v":""},{"$f":"IFERROR(SEARCH(\",\",X3,AE3+1),\"\")","v":""},{"$f":"IFERROR(SEARCH(\",\",X3,AF3+1),\"\")","v":""},{"$f":"IFERROR(SEARCH(\",\",X3,AG3+1),\"\")","v":""},{"$f":"IFERROR(SEARCH(\",\",X3,AH3+1),\"\")","v":""},{"$f":"IFERROR(SEARCH(\",\",X3,AI3+1),\"\")","v":""},{"$f":"IFERROR(SEARCH(\",\",X3,AJ3+1),\"\")","v":""},{"$f":"IF(X3<>\"\",LEN(X3),\"\")","v":""},null,{"$f":"IFERROR(MID(X3,AE3+2,AF3-AE3-3),\"\")","v":""},{"$f":"IF(AN3<>\"\",LEN(AN3),\"\")","v":""}]
[null,"d"," ",""," ",""," ",""," ",""," ",""," ",""," ",""," ",""," ","",null,null,null,null,null,null,null,null,null,"","","","","","","","","",null,"",""]
[null,"d"," ",""," ",""," ",""," ",""," ",""," ",""," ",""," ",""," ","",null,null,null,null,null,null,null,null,null,"","","","","","","","","",null,"",""]
[null,"d"," ",""," ",""," ",""," ",""," ",""," ",""," ",""," ",""," ","",null,null,null,null,null,null,null,null,null,"","","","","","","","","",null,"",""]
[null,"d"," ",""," ",""," ",""," ",""," ",""," ",""," ",""," ",""," ","",null,null,null,null,null,null,null,null,null,"","","","","","","","","",null,"",""]
[null,"d"," ",""," ",""," ",""," ",""," ",""," ",""," ",""," ",""," ","",null,null,null,null,null,null,null,null,null,"","","","","","","","","",null,"",""]
[null,"d"," ",-8820073.7999999989," ",-13297789," ","J21"," ","n0000"," ",0," ","FFC-ZIF-6"," ","PP"," ","J21"," ","FFC-ZIF-6 TME:F1003WV-S-06P",null,{"$f":"rdsnum(N9)","v":{"$error":"#VALUE!"}},{"$f":"rdsstr(N9)","v":"FFC-ZIF-6"},"J21,\"FFC-ZIF-6\",\"FFC-ZIF-6 TME:F1003WV-S-06P\",\"\",TOP,-90,-3472.47,-523.535",null,null,null,null,null,"0",4,16,46,49,53,57,66,74,null,"FFC-ZIF-6",9]
[null,"d"," ",-8289213.7999999998," ",-11291798.6," ","R20"," ","n0000"," ",90," ","330R"," ","PP"," ","R20"," ","0603",null,{"$f":"rdsnum(N10)","v":330},{"$f":"rdsstr(N10)","v":"R"},"R20,\"330R\",\"0603\",\"\",TOP,0,-3263.47,-444.559",null,null,null,null,null,"0",4,11,18,21,25,27,36,44,null,"330R",4]
[null,"d"," ",-8289213.7999999998," ",-12815798.6," ","R21"," ","n0000"," ",90," ","1K"," ","PP"," ","R21"," ","0603",null,1,"K","R21,\"1K\",\"0603\",\"\",TOP,0,-3263.47,-504.559",null,null,null,null,null,"0",4,9,16,19,23,25,34,42,null,"1K",2]
[null,"d"," ",-8289213.7999999998," ",-14339798.6," ","R22"," ","n0000"," ",90," ","330R"," ","PP"," ","R22"," ","0603",null,330,"R","R22,\"330R\",\"0603\",\"\",TOP,0,-3263.47,-564.559",null,null,null,null,null,"0",4,11,18,21,25,27,36,44,null,"330R",4]
[null,"d"," ",-8289213.7999999998," ",-9767798.5999999996," ","R16"," ","n0000"," ",-90," ","10K"," ","PP"," ","R16"," ","0603",null,10,"K","R16,\"10K\",\"0603\",\"\",TOP,-180,-3263.47,-384.559",null,null,null,null,null,"0",4,10,17,20,24,29,38,46,null,"10K",3]
[null,"d"," ",-36601.4," ",-23392206.199999999," ","C8"," ","n0000"," ",180," ","100n"," ","PP"," ","C8"," ","0603",null,100,"n","C8,\"100n\",\"0603\",\"\",TOP,90,-1441,-920.953",null,null,null,null,null,"0",3,10,17,20,24,27,33,41,null,"100n",4]
[null,"d"," ",-743127.79999999993," ",-15358389.399999999," ","C9"," ","n0000"," ",0," ","100nf"," ","PP"," ","C9"," ","0603",null,100,"nf","C9,\"100nf\",\"0603\",\"Farnell 317-287\",TOP,-90,-2925.7,-604.661",null,null,null,null,null,"0",3,11,18,36,40,44,52,60,null,"100nf",5]
[null,"d"," ",-757097.79999999993," ",-15358389.399999999," ","R2"," ","n0000"," ",180," ","4.7k"," ","PP"," ","R2"," ","0603",null,4,"k","R2,\"4.7k\",\"0603\",\"\",TOP,90,-2980.7,-604.661",null,null,null,null,null,"0",3,10,17,20,24,27,35,43,null,"4.7k",4]
[null,"d"," ",""," ",""," ",""," ",""," ",""," ",""," ",""," ",""," ","",null,null,"",null,null,null,null,null,null,"","","","","","","","","",null,"",""]
[null,"d"," ",""," ",""," ",""," ",""," ",""," ",""," ",""," ",""," ","",null,{"$f":"test(N15)","v":"nf"},"",null,null,null,null,null,null,"","","","","","","","","",null,"",""]
[null,"d"," ",""," ",""," ",""," ",""," ",""," ",""," ",""," ",""," ","",null,null,"",null,null,null,null,null,null,"","","","","","","","","",null,"",""]
[null,"d"," ",""," ",""," ",""," ",""," ",""," ",""," ",""," ",""," ","",null,null,"",null,null,null,null,null,null,"","","","","","","","","",null,"",""]
[null,"d"," ",""," ",""," ",""," ",""," ",""," ",""," ",""," ",""," ","",null,null,"",null,null,null,null,null,null,"","","","","","","","","",null,"",""]
[null,"d"," ",""," ",""," ",""," ",""," ",""," ",""," ",""," ",""," ","",null,null,"",null,null,null,null,null,null,"","","","","","","","",""]
[null,"d"," ",""," ",""," ",""," ",""," ",""," ",""," ",""," ",""," ","",null,null,"",null,null,null,null,null,null,"","","","","","","","",""]
[null,"d"," ",""," ",""," ",""," ",""," ",""," ",""," ",""," ",""," ","",null,null,null,null,null,null,null,null,null,"","","","","","","","",""]
[null,"d"," ",""," ",""," ",""," ",""," ",""," ",""," ",""," ",""," ","",null,null,null,null,null,null,null,null,null,"","","","","","","","",""]
[null,"d"," ",""," ",""," ",""," ",""," ",""," ",""," ",""," ",""," ","",null,null,null,null,null,null,null,null,null,"","","","","","","","",""]
[null,"d"," ",""," ",""," ",""," ",""," ",""," ",""," ",""," ",""," ","",null,null,null,null,null,null,null,null,null,"","","","","","","","",""]
[null,"d"," ",""," ",""," ",""," ",""," ",""," ",""," ",""," ",""," ","",null,null,null,null,null,null,null,null,null,"","","","","","","","",""]
[null,"d"," ",""," ",""," ",""," ",""," ",""," ",""," ",""," ",""," ","",null,null,null,null,null,null,null,null,null,"","","","","","","","",""]
[null,"d"," ",""," ",""," ",""," ",""," ",""," ",""," ",""," ",""," ","",null,null,null,null,null,null,null,null,null,"","","","","","","","",""]
[null,"d"," ",""," ",""," ",""," ",""," ",""," ",""," ",""," ",""," ","",null,null,null,null,null,null,null,null,null,"","","","","","","","",""]
[null,"d"," ",""," ",""," ",""," ",""," ",""," ",""," ",""," ",""," ","",null,null,null,null,null,null,null,null,null,"","","","","","","","",""]
[null,"d"," ",""," ",""," ",""," ",""," ",""," ",""," ",""," ",""," ","",null,null,null,null,null,null,null,null,null,"","","","","","","","",""]
[null,"d"," ",""," ",""," ",""," ",""," ",""," ",""," ",""," ",""," ","",null,null,null,null,null,null,null,null,null,"","","","","","","","",""]
[null,"d"," ",""," ",""," ",""," ",""," ",""," ",""," ",""," ",""," ","",null,null,null,null,null,null,null,null,null,"","","","","","","","",""]
[null,"d"," ",""," ",""," ",""," ",""," ",""," ",""," ",""," ",""," ","",null,null,null,null,null,null,null,null,null,"","","","","","","","",""]
[null,"d"," ",""," ",""," ",""," ",""," ",""," ",""," ",""," ",""," ","",null,null,null,null,null,null,null,null,null,"","","","","","","","",""]
[null,"d"," ",""," ",""," ",""," ",""," ",""," ",""," ",""," ",""," ","",null,null,null,null,null,null,null,null,null,"","","","","","","","",""]
[null,"d"," ",""," ",""," ",""," ",""," ",""," ",""," ",""," ",""," ","",null,null,null,null,null,null,null,null,null,"","","","","","","","",""]
[null,"d"," ",""," ",""," ",""," ",""," ",""," ",""," ",""," ",""," ","",null,null,null,null,null,null,null,null,null,"","","","","","","","",""]
[null,"d"," ",""," ",""," ",""," ",""," ",""," ",""," ",""," ",""," ","",null,null,null,null,null,null,null,null,null,"","","","","","","","",""]
[null,"d"," ",""," ",""," ",""," ",""," ",""," ",""," ",""," ",""," ","",null,null,null,null,null,null,null,null,null,"","","","","","","","",""]
[null,"d"," ",""," ",""," ",""," ",""," ",""," ",""," ",""," ",""," ","",null,null,null,null,null,null,null,null,null,"","","","","","","","",""]
[null,"d"," ",""," ",""," ",""," ",""," ",""," ",""," ",""," ",""," ","",null,null,null,null,null,null,null,null,null,"","","","","","","","",""]
[null,"d"," ",""," ",""," ",""," ",""," ",""," ",""," ",""," ",""," ","",null,null,null,null,null,null,null,null,null,"","","","","","","","",""]
[null,"d"," ",""," ",""," ",""," ",""," ",""," ",""," ",""," ",""," ","",null,null,null,null,null,null,null,null,null,"","","","","","","","",""]
[null,"d"," ",""," ",""," ",""," ",""," ",""," ",""," ",""," ",""," ","",null,null,null,null,null,null,null,null,null,"","","","","","","","",""]
[null,"d"," ",""," ",""," ",""," ",""," ",""," ",""," ",""," ",""," ","",null,null,null,null,null,null,null,null,null,"","","","","","","","",""]
[null,"d"," ",""," ",""," ",""," ",""," ",""," ",""," ",""," ",""," ","",null,null,null,null,null,null,null,null,null,"","","","","","","","",""]
[null,"d"," ",""," ",""," ",""," ",""," ",""," ",""," ",""," ",""," ","",null,null,null,null,null,null,null,null,null,"","","","","","","","",""]
[null,"d"," ",""," ",""," ",""," ",""," ",""," ",""," ",""," ",""," ","",null,null,null,null,null,null,null,null,null,"","","","","","","","",""]
[null,"d"," ",""," ",""," ",""," ",""," ",""," ",""," ",""," ",""," ","",null,null,null,null,null,null,null,null,null,"","","","","","","","",""]
[null,"d"," ",""," ",""," ",""," ",""," ",""," ",""," ",""," ",""," ","",null,null,null,null,null,null,null,null,null,"","","","","","","","",""]
[null,"d"," ",""," ",""," ",""," ",""," ",""," ",""," ",""," ",""," ","",null,null,null,null,null,null,null,null,null,"","","","","","","","",""]
[null,"d"," ",""," ",""," ",""," ",""," ",""," ",""," ",""," ",""," ","",null,null,null,null,null,null,null,null,null,"","","","","","","","",""]
[null,"d"," ",""," ",""," ",""," ",""," ",""," ",""," ",""," ",""," ","",null,null,null,null,null,null,null,null,null,"","","","","","","","",""]
[null,"d"," ",""," ",""," ",""," ",""," ",""," ",""," ",""," ",""," ","",null,null,null,null,null,null,null,null,null,"","","","","","","","",""]
[null,"d"," ",""," ",""," ",""," ",""," ",""," ",""," ",""," ",""," ","",null,null,null,null,null,null,null,null,null,"","","","","","","","",""]
[null,"d"," ",""," ",""," ",""," ",""," ",""," ",""," ",""," ",""," ","",null,null,null,null,null,null,null,null,null,"","","","","","","","",""]
[null,"d"," ",""," ",""," ",""," ",""," ",""," ",""," ",""," ",""," ","",null,null,null,null,null,null,null,null,null,"","","","","","","","",""]
[null,"d"," ",""," ",""," ",""," ",""," ",""," ",""," ",""," ",""," ","",null,null,null,null,null,null,null,null,null,"","","","","","","","",""]
[null,"d"," ",""," ",""," ",""," ",""," ",""," ",""," ",""," ",""," ","",null,null,null,null,null,null,null,null,null,"","","","","","","","",""]
[null,"d"," ",""," ",""," ",""," ",""," ",""," ",""," ",""," ",""," ","",null,null,null,null,null,null,null,null,null,"","","","","","","","",""]
[null,"d"," ",""," ",""," ",""," ",""," ",""," ",""," ",""," ",""," ","",null,null,null,null,null,null,null,null,null,"","","","","","","","",""]
[null,"d"," ",""," ",""," ",""," ",""," ",""," ",""," ",""," ",""," ","",null,null,null,null,null,null,null,null,null,"","","","","","","","",""]
[null,"d"," ",""," ",""," ",""," ",""," ",""," ",""," ",""," ",""," ","",null,null,null,null,null,null,null,null,null,"","","","","","","","",""]
[null,{"$f":"IF(EXACT(MID(H67,1,3),\"FID\"),\"f\",\"d\")","v":"d"}," ",{"$f":"IFERROR(_xlfn.NUMBERVALUE(SUBSTITUTE(MID(X67,AJ67+1,AK67-AJ67-1),\".\",\",\"))*25.4,\"\")","v":""}," ",{"$f":"IFERROR(_xlfn.NUMBERVALUE(SUBSTITUTE(MID(X67,AK67+1,AL67-1),\".\",\",\"))*25.4,\"\")","v":""}," ",{"$f":"IFERROR(MID(X67,AD67+1,AE67-AD67-1),\"\")","v":""}," ",{"$f":"IF(X67<>\"\",\"n0000\",\"\")","v":""}," ",{"$f":"IFERROR(_xlfn.NUMBERVALUE(MID(X67,AI67+1,AJ67-AI67-1))+90,\"\")","v":""}," ",{"$f":"IFERROR(MID(X67,AE67+2,AF67-AE67-3),\"\")","v":""}," ",{"$f":"IF(X67<>\"\",\"PP\",\"\")","v":""}," ",{"$f":"IFERROR(MID(X67,AD67+1,AE67-AD67-1),\"\")","v":""}," ",{"$f":"IFERROR(MID(X67,AF67+2,AG67-AF67-3),\"\")","v":""},null,null,null,null,null,null,null,null,null,{"$f":"IF(X67<>\"\",\"0\",\"\")","v":""},{"$f":"IFERROR(SEARCH(\",\",X67,1),\"\")","v":""},{"$f":"IFERROR(SEARCH(\",\",X67,AE67+1),\"\")","v":""},{"$f":"IFERROR(SEARCH(\",\",X67,AF67+1),\"\")","v":""},{"$f":"IFERROR(SEARCH(\",\",X67,AG67+1),\"\")","v":""},{"$f":"IFERROR(SEARCH(\",\",X67,AH67+1),\"\")","v":""},{"$f":"IFERROR(SEARCH(\",\",X67,AI67+1),\"\")","v":""},{"$f":"IFERROR(SEARCH(\",\",X67,AJ67+1),\"\")","v":""},{"$f":"IF(X67<>\"\",LEN(X67),\"\")","v":""}]
[null,"d"," ",""," ",""," ",""," ",""," ",""," ",""," ",""," ",""," ","",null,null,null,null,null,null,null,null,null,"","","","","","","","",""]
[null,"d"," ",""," ",""," ",""," ",""," ",""," ",""," ",""," ",""," ","",null,null,null,null,null,null,null,null,null,"","","","","","","","",""]
[null,"d"," ",""," ",""," ",""," ",""," ",""," ",""," ",""," ",""," ","",null,null,null,null,null,null,null,null,null,"","","","","","","","",""]
[null,"d"," ",""," ",""," ",""," ",""," ",""," ",""," ",""," ",""," ","",null,null,null,null,null,null,null,null,null,"","","","","","","","",""]
[null,"d"," ",""," ",""," ",""," ",""," ",""," ",""," ",""," ",""," ","",null,null,null,null,null,null,null,null,null,"","","","","","","","",""]
[null,"d"," ",""," ",""," ",""," ",""," ",""," ",""," ",""," ",""," ","",null,null,null,null,null,null,null,null,null,"","","","","","","","",""]
[null,"d"," ",""," ",""," ",""," ",""," ",""," ",""," ",""," ",""," ","",null,null,null,null,null,null,null,null,null,"","","","","","","","",""]
[null,"d"," ",""," ",""," ",""," ",""," ",""," ",""," ",""," ",""," ","",null,null,null,null,null,null,null,null,null,"","","","","","","","",""]
[null,"d"," ",""," ",""," ",""," ",""," ",""," ",""," ",""," ",""," ","",null,null,null,null,null,null,null,null,null,"","","","","","","","",""]
[null,"d"," ",""," ",""," ",""," ",""," ",""," ",""," ",""," ",""," ","",null,null,null,null,null,null,null,null,null,"","","","","","","","",""]
[null,"d"," ",""," ",""," ",""," ",""," ",""," ",""," ",""," ",""," ","",null,null,null,null,null,null,null,null,null,"","","","","","","","",""]
[null,"d"," ",""," ",""," ",""," ",""," ",""," ",""," ",""," ",""," ","",null,null,null,null,null,null,null,null,null,"","","","","","","","",""]
[null,"d"," ",""," ",""," ",""," ",""," ",""," ",""," ",""," ",""," ","",null,null,null,null,null,null,null,null,null,"","","","","","","","",""]
[null,"d"," ",""," ",""," ",""," ",""," ",""," ",""," ",""," ",""," ","",null,null,null,null,null,null,null,null,null,"","","","","","","","",""]
[null,"d"," ",""," ",""," ",""," ",""," ",""," ",""," ",""," ",""," ","",null,null,null,null,null,null,null,null,null,"","","","","","","","",""]
[null,"d"," ",""," ",""," ",""," ",""," ",""," ",""," ",""," ",""," ","",null,null,null,null,null,null,null,null,null,"","","","","","","","",""]
[null,"d"," ",""," ",""," ",""," ",""," ",""," ",""," ",""," ",""," ","",null,null,null,null,null,null,null,null,null,"","","","","","","","",""]
[null,"d"," ",""," ",""," ",""," ",""," ",""," ",""," ",""," ",""," ","",null,null,null,null,null,null,null,null,null,"","","","","","","","",""]
[null,"d"," ",""," ",""," ",""," ",""," ",""," ",""," ",""," ",""," ","",null,null,null,null,null,null,null,null,null,"","","","","","","","",""]
[null,"d"," ",""," ",""," ",""," ",""," ",""," ",""," ",""," ",""," ","",null,null,null,null,null,null,null,null,null,"","","","","","","","",""]
[null,"d"," ",""," ",""," ",""," ",""," ",""," ",""," ",""," ",""," ","",null,null,null,null,null,null,null,null,null,"","","","","","","","",""]
[null,"d"," ",""," ",""," ",""," ",""," ",""," ",""," ",""," ",""," ","",null,null,null,null,null,null,null,null,null,"","","","","","","","",""]
[null,"d"," ",""," ",""," ",""," ",""," ",""," ",""," ",""," ",""," ","",null,null,null,null,null,null,null,null,null,"","","","","","","","",""]
[null,"d"," ",""," ",""," ",""," ",""," ",""," ",""," ",""," ",""," ","",null,null,null,null,null,null,null,null,null,"","","","","","","","",""]
[null,"d"," ",""," ",""," ",""," ",""," ",""," ",""," ",""," ",""," ","",null,null,null,null,null,null,null,null,null,"","","","","","","","",""]
[null,"d"," ",""," ",""," ",""," ",""," ",""," ",""," ",""," ",""," ","",null,null,null,null,null,null,null,null,null,"","","","","","","","",""]
[null,"d"," ",""," ",""," ",""," ",""," ",""," ",""," ",""," ",""," ","",null,null,null,null,null,null,null,null,null,"","","","","","","","",""]
[null,"d"," ",""," ",""," ",""," ",""," ",""," ",""," ",""," ",""," ","",null,null,null,null,null,null,null,null,null,"","","","","","","","",""]
[null,"d"," ",""," ",""," ",""," ",""," ",""," ",""," ",""," ",""," ","",null,null,null,null,null,null,null,null,null,"","","","","","","","",""]
[null,"d"," ",""," ",""," ",""," ",""," ",""," ",""," ",""," ",""," ","",null,null,null,null,null,null,null,null,null,"","","","","","","","",""]
[null,"d"," ",""," ",""," ",""," ",""," ",""," ",""," ",""," ",""," ","",null,null,null,null,null,null,null,null,null,"","","","","","","","",""]
[null,"d"," ",""," ",""," ",""," ",""," ",""," ",""," ",""," ",""," ","",null,null,null,null,null,null,null,null,null,"","","","","","","","",""]
[null,"d"," ",""," ",""," ",""," ",""," ",""," ",""," ",""," ",""," ","",null,null,null,null,null,null,null,null,null,"","","","","","","","",""]
[null,"d"," ",""," ",""," ",""," ",""," ",""," ",""," ",""," ",""," ","",null,null,null,null,null,null,null,null,null,"","","","","","","","",""]
[null,"d"," ",""," ",""," ",""," ",""," ",""," ",""," ",""," ",""," ","",null,null,null,null,null,null,null,null,null,"","","","","","","","",""]
[null,"d"," ",""," ",""," ",""," ",""," ",""," ",""," ",""," ",""," ","",null,null,null,null,null,null,null,null,null,"","","","","","","","",""]
[null,"d"," ",""," ",""," ",""," ",""," ",""," ",""," ",""," ",""," ","",null,null,null,null,null,null,null,null,null,"","","","","","","","",""]
[null,"d"," ",""," ",""," ",""," ",""," ",""," ",""," ",""," ",""," ","",null,null,null,null,null,null,null,null,null,"","","","","","","","",""]
[null,"d"," ",""," ",""," ",""," ",""," ",""," ",""," ",""," ",""," ","",null,null,null,null,null,null,null,null,null,"","","","","","","","",""]
[null,"d"," ",""," ",""," ",""," ",""," ",""," ",""," ",""," ",""," ","",null,null,null,null,null,null,null,null,null,"","","","","","","","",""]
[null,"d"," ",""," ",""," ",""," ",""," ",""," ",""," ",""," ",""," ","",null,null,null,null,null,null,null,null,null,"","","","","","","","",""]
[null,"d"," ",""," ",""," ",""," ",""," ",""," ",""," ",""," ",""," ","",null,null,null,null,null,null,null,null,null,"","","","","","","","",""]
[null,"d"," ",""," ",""," ",""," ",""," ",""," ",""," ",""," ",""," ","",null,null,null,null,null,null,null,null,null,"","","","","","","","",""]
[null,"d"," ",""," ",""," ",""," ",""," ",""," ",""," ",""," ",""," ","",null,null,null,null,null,null,null,null,null,"","","","","","","","",""]
[null,"d"," ",""," ",""," ",""," ",""," ",""," ",""," ",""," ",""," ","",null,null,null,null,null,null,null,null,null,"","","","","","","","",""]
[null,"d"," ",""," ",""," ",""," ",""," ",""," ",""," ",""," ",""," ","",null,null,null,null,null,null,null,null,null,"","","","","","","","",""]
[null,"d"," ",""," ",""," ",""," ",""," ",""," ",""," ",""," ",""," ","",null,null,null,null,null,null,null,null,null,"","","","","","","","",""]
[null,"d"," ",""," ",""," ",""," ",""," ",""," ",""," ",""," ",""," ","",null,null,null,null,null,null,null,null,null,"","","","","","","","",""]
[null,"d"," ",""," ",""," ",""," ",""," ",""," ",""," ",""," ",""," ","",null,null,null,null,null,null,null,null,null,"","","","","","","","",""]
[null,"d"," ",""," ",""," ",""," ",""," ",""," ",""," ",""," ",""," ","",null,null,null,null,null,null,null,null,null,"","","","","","","","",""]
[null,"d"," ",""," ",""," ",""," ",""," ",""," ",""," ",""," ",""," ","",null,null,null,null,null,null,null,null,null,"","","","","","","","",""]
[null,"d"," ",""," ",""," ",""," ",""," ",""," ",""," ",""," ",""," ","",null,null,null,null,null,null,null,null,null,"","","","","","","","",""]
[null,"d"," ",""," ",""," ",""," ",""," ",""," ",""," ",""," ",""," ","",null,null,null,null,null,null,null,null,null,"","","","","","","","",""]
[null,"d"," ",""," ",""," ",""," ",""," ",""," ",""," ",""," ",""," ","",null,null,null,null,null,null,null,null,null,"","","","","","","","",""]
[null,"d"," ",""," ",""," ",""," ",""," ",""," ",""," ",""," ",""," ","",null,null,null,null,null,null,null,null,null,"","","","","","","","",""]
[null,"d"," ",""," ",""," ",""," ",""," ",""," ",""," ",""," ",""," ","",null,null,null,null,null,null,null,null,null,"","","","","","","","",""]
[null,"d"," ",""," ",""," ",""," ",""," ",""," ",""," ",""," ",""," ","",null,null,null,null,null,null,null,null,null,"","","","","","","","",""]
[null,"d"," ",""," ",""," ",""," ",""," ",""," ",""," ",""," ",""," ","",null,null,null,null,null,null,null,null,null,"","","","","","","","",""]
[null,"d"," ",""," ",""," ",""," ",""," ",""," ",""," ",""," ",""," ","",null,null,null,null,null,null,null,null,null,"","","","","","","","",""]
[null,"d"," ",""," ",""," ",""," ",""," ",""," ",""," ",""," ",""," ","",null,null,null,null,null,null,null,null,null,"","","","","","","","",""]
[null,"d"," ",""," ",""," ",""," ",""," ",""," ",""," ",""," ",""," ","",null,null,null,null,null,null,null,null,null,"","","","","","","","",""]
[null,"d"," ",""," ",""," ",""," ",""," ",""," ",""," ",""," ",""," ","",null,null,null,null,null,null,null,null,null,"","","","","","","","",""]
[null,"d"," ",""," ",""," ",""," ",""," ",""," ",""," ",""," ",""," ","",null,null,null,null,null,null,null,null,null,"","","","","","","","",""]
[null,{"$f":"IF(EXACT(MID(H131,1,3),\"FID\"),\"f\",\"d\")","v":"d"}," ",{"$f":"IFERROR(_xlfn.NUMBERVALUE(SUBSTITUTE(MID(X131,AJ131+1,AK131-AJ131-1),\".\",\",\"))*25.4,\"\")","v":""}," ",{"$f":"IFERROR(_xlfn.NUMBERVALUE(SUBSTITUTE(MID(X131,AK131+1,AL131-1),\".\",\",\"))*25.4,\"\")","v":""}," ",{"$f":"IFERROR(MID(X131,AD131+1,AE131-AD131-1),\"\")","v":""}," ",{"$f":"IF(X131<>\"\",\"n0000\",\"\")","v":""}," ",{"$f":"IFERROR(_xlfn.NUMBERVALUE(MID(X131,AI131+1,AJ131-AI131-1))+90,\"\")","v":""}," ",{"$f":"IFERROR(MID(X131,AE131+2,AF131-AE131-3),\"\")","v":""}," ",{"$f":"IF(X131<>\"\",\"PP\",\"\")","v":""}," ",{"$f":"IFERROR(MID(X131,AD131+1,AE131-AD131-1),\"\")","v":""}," ",{"$f":"IFERROR(MID(X131,AF131+2,AG131-AF131-3),\"\")","v":""},null,null,null,null,null,null,null,null,null,{"$f":"IF(X131<>\"\",\"0\",\"\")","v":""},{"$f":"IFERROR(SEARCH(\",\",X131,1),\"\")","v":""},{"$f":"IFERROR(SEARCH(\",\",X131,AE131+1),\"\")","v":""},{"$f":"IFERROR(SEARCH(\",\",X131,AF131+1),\"\")","v":""},{"$f":"IFERROR(SEARCH(\",\",X131,AG131+1),\"\")","v":""},{"$f":"IFERROR(SEARCH(\",\",X131,AH131+1),\"\")","v":""},{"$f":"IFERROR(SEARCH(\",\",X131,AI131+1),\"\")","v":""},{"$f":"IFERROR(SEARCH(\",\",X131,AJ131+1),\"\")","v":""},{"$f":"IF(X131<>\"\",LEN(X131),\"\")","v":""}]
[null,"d"," ",""," ",""," ",""," ",""," ",""," ",""," ",""," ",""," ","",null,null,null,null,null,null,null,null,null,"","","","","","","","",""]
[null,"d"," ",""," ",""," ",""," ",""," ",""," ",""," ",""," ",""," ","",null,null,null,null,null,null,null,null,null,"","","","","","","","",""]
[null,"d"," ",""," ",""," ",""," ",""," ",""," ",""," ",""," ",""," ","",null,null,null,null,null,null,null,null,null,"","","","","","","","",""]
[null,"d"," ",""," ",""," ",""," ",""," ",""," ",""," ",""," ",""," ","",null,null,null,null,null,null,null,null,null,"","","","","","","","",""]
[null,"d"," ",""," ",""," ",""," ",""," ",""," ",""," ",""," ",""," ","",null,null,null,null,null,null,null,null,null,"","","","","","","","",""]
[null,"d"," ",""," ",""," ",""," ",""," ",""," ",""," ",""," ",""," ","",null,null,null,null,null,null,null,null,null,"","","","","","","","",""]
[null,"d"," ",""," ",""," ",""," ",""," ",""," ",""," ",""," ",""," ","",null,null,null,null,null,null,null,null,null,"","","","","","","","",""]
[null,"d"," ",""," ",""," ",""," ",""," ",""," ",""," ",""," ",""," ","",null,null,null,null,null,null,null,null,null,"","","","","","","","",""]
[null,"d"," ",""," ",""," ",""," ",""," ",""," ",""," ",""," ",""," ","",null,null,null,null,null,null,null,null,null,"","","","","","","","",""]
[null,"d"," ",""," ",""," ",""," ",""," ",""," ",""," ",""," ",""," ","",null,null,null,null,null,null,null,null,null,"","","","","","","","",""]
[null,"d"," ",""," ",""," ",""," ",""," ",""," ",""," ",""," ",""," ","",null,null,null,null,null,null,null,null,null,"","","","","","","","",""]
[null,"d"," ",""," ",""," ",""," ",""," ",""," ",""," ",""," ",""," ","",null,null,null,null,null,null,null,null,null,"","","","","","","","",""]
[null,"d"," ",""," ",""," ",""," ",""," ",""," ",""," ",""," ",""," ","",null,null,null,null,null,null,null,null,null,"","","","","","","","",""]
[null,"d"," ",""," ",""," ",""," ",""," ",""," ",""," ",""," ",""," ","",null,null,null,null,null,null,null,null,null,"","","","","","","","",""]
[null,"d"," ",""," ",""," ",""," ",""," ",""," ",""," ",""," ",""," ","",null,null,null,null,null,null,null,null,null,"","","","","","","","",""]
[null,"d"," ",""," ",""," ",""," ",""," ",""," ",""," ",""," ",""," ","",null,null,null,null,null,null,null,null,null,"","","","","","","","",""]
[null,"d"," ",""," ",""," ",""," ",""," ",""," ",""," ",""," ",""," ","",null,null,null,null,null,null,null,null,null,"","","","","","","","",""]
[null,"d"," ",""," ",""," ",""," ",""," ",""," ",""," ",""," ",""," ","",null,null,null,null,null,null,null,null,null,"","","","","","","","",""]
[null,"d"," ",""," ",""," ",""," ",""," ",""," ",""," ",""," ",""," ","",null,null,null,null,null,null,null,null,null,"","","","","","","","",""]
[null,"d"," ",""," ",""," ",""," ",""," ",""," ",""," ",""," ",""," ","",null,null,null,null,null,null,null,null,null,"","","","","","","","",""]
[null,"d"," ",""," ",""," ",""," ",""," ",""," ",""," ",""," ",""," ","",null,null,null,null,null,null,null,null,null,"","","","","","","","",""]
[null,"d"," ",""," ",""," ",""," ",""," ",""," ",""," ",""," ",""," ","",null,null,null,null,null,null,null,null,null,"","","","","","","","",""]
[null,"d"," ",""," ",""," ",""," ",""," ",""," ",""," ",""," ",""," ","",null,null,null,null,null,null,null,null,null,"","","","","","","","",""]
[null,"d"," ",""," ",""," ",""," ",""," ",""," ",""," ",""," ",""," ","",null,null,null,null,null,null,null,null,null,"","","","","","","","",""]
[null,"d"," ",""," ",""," ",""," ",""," ",""," ",""," ",""," ",""," ","",null,null,null,null,null,null,null,null,null,"","","","","","","","",""]
[null,"d"," ",""," ",""," ",""," ",""," ",""," ",""," ",""," ",""," ","",null,null,null,null,null,null,null,null,null,"","","","","","","","",""]
[null,"d"," ",""," ",""," ",""," ",""," ",""," ",""," ",""," ",""," ","",null,null,null,null,null,null,null,null,null,"","","","","","","","",""]
[null,"d"," ",""," ",""," ",""," ",""," ",""," ",""," ",""," ",""," ","",null,null,null,null,null,null,null,null,null,"","","","","","","","",""]
[null,"d"," ",""," ",""," ",""," ",""," ",""," ",""," ",""," ",""," ","",null,null,null,null,null,null,null,null,null,"","","","","","","","",""]
[null,"d"," ",""," ",""," ",""," ",""," ",""," ",""," ",""," ",""," ","",null,null,null,null,null,null,null,null,null,"","","","","","","","",""]
[null,"d"," ",""," ",""," ",""," ",""," ",""," ",""," ",""," ",""," ","",null,null,null,null,null,null,null,null,null,"","","","","","","","",""]
[null,"d"," ",""," ",""," ",""," ",""," ",""," ",""," ",""," ",""," ","",null,null,null,null,null,null,null,null,null,"","","","","","","","",""]
[null,"d"," ",""," ",""," ",""," ",""," ",""," ",""," ",""," ",""," ","",null,null,null,null,null,null,null,null,null,"","","","","","","","",""]
[null,"d"," ",""," ",""," ",""," ",""," ",""," ",""," ",""," ",""," ","",null,null,null,null,null,null,null,null,null,"","","","","","","","",""]
[null,"d"," ",""," ",""," ",""," ",""," ",""," ",""," ",""," ",""," ","",null,null,null,null,null,null,null,null,null,"","","","","","","","",""]
[null,"d"," ",""," ",""," ",""," ",""," ",""," ",""," ",""," ",""," ","",null,null,null,null,null,null,null,null,null,"","","","","","","","",""]
[null,"d"," ",""," ",""," ",""," ",""," ",""," ",""," ",""," ",""," ","",null,null,null,null,null,null,null,null,null,"","","","","","","","",""]
[null,"d"," ",""," ",""," ",""," ",""," ",""," ",""," ",""," ",""," ","",null,null,null,null,null,null,null,null,null,"","","","","","","","",""]
[null,"d"," ",""," ",""," ",""," ",""," ",""," ",""," ",""," ",""," ","",null,null,null,null,null,null,null,null,null,"","","","","","","","",""]
[null,"d"," ",""," ",""," ",""," ",""," ",""," ",""," ",""," ",""," ","",null,null,null,null,null,null,null,null,null,"","","","","","","","",""]
[null,"d"," ",""," ",""," ",""," ",""," ",""," ",""," ",""," ",""," ","",null,null,null,null,null,null,null,null,null,"","","","","","","","",""]
[null,"d"," ",""," ",""," ",""," ",""," ",""," ",""," ",""," ",""," ","",null,null,null,null,null,null,null,null,null,"","","","","","","","",""]
[null,"d"," ",""," ",""," ",""," ",""," ",""," ",""," ",""," ",""," ","",null,null,null,null,null,null,null,null,null,"","","","","","","","",""]
[null,"d"," ",""," ",""," ",""," ",""," ",""," ",""," ",""," ",""," ","",null,null,null,null,null,null,null,null,null,"","","","","","","","",""]
[null,"d"," ",""," ",""," ",""," ",""," ",""," ",""," ",""," ",""," ","",null,null,null,null,null,null,null,null,null,"","","","","","","","",""]
[null,"d"," ",""," ",""," ",""," ",""," ",""," ",""," ",""," ",""," ","",null,null,null,null,null,null,null,null,null,"","","","","","","","",""]
[null,"d"," ",""," ",""," ",""," ",""," ",""," ",""," ",""," ",""," ","",null,null,null,null,null,null,null,null,null,"","","","","","","","",""]
[null,"d"," ",""," ",""," ",""," ",""," ",""," ",""," ",""," ",""," ","",null,null,null,null,null,null,null,null,null,"","","","","","","","",""]
[null,"d"," ",""," ",""," ",""," ",""," ",""," ",""," ",""," ",""," ","",null,null,null,null,null,null,null,null,null,"","","","","","","","",""]
[null,"d"," ",""," ",""," ",""," ",""," ",""," ",""," ",""," ",""," ","",null,null,null,null,null,null,null,null,null,"","","","","","","","",""]
[null,"d"," ",""," ",""," ",""," ",""," ",""," ",""," ",""," ",""," ","",null,null,null,null,null,null,null,null,null,"","","","","","","","",""]
[null,"d"," ",""," ",""," ",""," ",""," ",""," ",""," ",""," ",""," ","",null,null,null,null,null,null,null,null,null,"","","","","","","","",""]
[null,"d"," ",""," ",""," ",""," ",""," ",""," ",""," ",""," ",""," ","",null,null,null,null,null,null,null,null,null,"","","","","","","","",""]
[null,"d"," ",""," ",""," ",""," ",""," ",""," ",""," ",""," ",""," ","",null,null,null,null,null,null,null,null,null,"","","","","","","","",""]
[null,"d"," ",""," ",""," ",""," ",""," ",""," ",""," ",""," ",""," ","",null,null,null,null,null,null,null,null,null,"","","","","","","","",""]
[null,"d"," ",""," ",""," ",""," ",""," ",""," ",""," ",""," ",""," ","",null,null,null,null,null,null,null,null,null,"","","","","","","","",""]
[null,"d"," ",""," ",""," ",""," ",""," ",""," ",""," ",""," ",""," ","",null,null,null,null,null,null,null,null,null,"","","","","","","","",""]
[null,"d"," ",""," ",""," ",""," ",""," ",""," ",""," ",""," ",""," ","",null,null,null,null,null,null,null,null,null,"","","","","","","","",""]
[null,"d"," ",""," ",""," ",""," ",""," ",""," ",""," ",""," ",""," ","",null,null,null,null,null,null,null,null,null,"","","","","","","","",""]
[null,"d"," ",""," ",""," ",""," ",""," ",""," ",""," ",""," ",""," ","",null,null,null,null,null,null,null,null,null,"","","","","","","","",""]
[null,"d"," ",""," ",""," ",""," ",""," ",""," ",""," ",""," ",""," ","",null,null,null,null,null,null,null,null,null,"","","","","","","","",""]
[null,"d"," ",""," ",""," ",""," ",""," ",""," ",""," ",""," ",""," ","",null,null,null,null,null,null,null,null,null,"","","","","","","","",""]
[null,"d"," ",""," ",""," ",""," ",""," ",""," ",""," ",""," ",""," ","",null,null,null,null,null,null,null,null,null,"","","","","","","","",""]
[null,{"$f":"IF(EXACT(MID(H195,1,3),\"FID\"),\"f\",\"d\")","v":"d"}," ",{"$f":"IFERROR(_xlfn.NUMBERVALUE(SUBSTITUTE(MID(X195,AJ195+1,AK195-AJ195-1),\".\",\",\"))*25.4,\"\")","v":""}," ",{"$f":"IFERROR(_xlfn.NUMBERVALUE(SUBSTITUTE(MID(X195,AK195+1,AL195-1),\".\",\",\"))*25.4,\"\")","v":""}," ",{"$f":"IFERROR(MID(X195,AD195+1,AE195-AD195-1),\"\")","v":""}," ",{"$f":"IF(X195<>\"\",\"n0000\",\"\")","v":""}," ",{"$f":"IFERROR(_xlfn.NUMBERVALUE(MID(X195,AI195+1,AJ195-AI195-1))+90,\"\")","v":""}," ",{"$f":"IFERROR(MID(X195,AE195+2,AF195-AE195-3),\"\")","v":""}," ",{"$f":"IF(X195<>\"\",\"PP\",\"\")","v":""}," ",{"$f":"IFERROR(MID(X195,AD195+1,AE195-AD195-1),\"\")","v":""}," ",{"$f":"IFERROR(MID(X195,AF195+2,AG195-AF195-3),\"\")","v":""},null,null,null,null,null,null,null,null,null,{"$f":"IF(X195<>\"\",\"0\",\"\")","v":""},{"$f":"IFERROR(SEARCH(\",\",X195,1),\"\")","v":""},{"$f":"IFERROR(SEARCH(\",\",X195,AE195+1),\"\")","v":""},{"$f":"IFERROR(SEARCH(\",\",X195,AF195+1),\"\")","v":""},{"$f":"IFERROR(SEARCH(\",\",X195,AG195+1),\"\")","v":""},{"$f":"IFERROR(SEARCH(\",\",X195,AH195+1),\"\")","v":""},{"$f":"IFERROR(SEARCH(\",\",X195,AI195+1),\"\")","v":""},{"$f":"IFERROR(SEARCH(\",\",X195,AJ195+1),\"\")","v":""},{"$f":"IF(X195<>\"\",LEN(X195),\"\")","v":""}]
[null,"d"," ",""," ",""," ",""," ",""," ",""," ",""," ",""," ",""," ","",null,null,null,null,null,null,null,null,null,"","","","","","","","",""]
[null,"d"," ",""," ",""," ",""," ",""," ",""," ",""," ",""," ",""," ","",null,null,null,null,null,null,null,null,null,"","","","","","","","",""]
[null,"d"," ",""," ",""," ",""," ",""," ",""," ",""," ",""," ",""," ","",null,null,null,null,null,null,null,null,null,"","","","","","","","",""]
[null,"d"," ",""," ",""," ",""," ",""," ",""," ",""," ",""," ",""," ","",null,null,null,null,null,null,null,null,null,"","","","","","","","",""]
[null,"d"," ",""," ",""," ",""," ",""," ",""," ",""," ",""," ",""," ","",null,null,null,null,null,null,null,null,null,"","","","","","","","",""]
[null,"d"," ",""," ",""," ",""," ",""," ",""," ",""," ",""," ",""," ","",null,null,null,null,null,null,null,null,null,"","","","","","","","",""]
[null,"d"," ",""," ",""," ",""," ",""," ",""," ",""," ",""," ",""," ","",null,null,null,null,null,null,null,null,null,"","","","","","","","",""]
[null,"d"," ",""," ",""," ",""," ",""," ",""," ",""," ",""," ",""," ","",null,null,null,null,null,null,null,null,null,"","","","","","","","",""]
[null,"d"," ",""," ",""," ",""," ",""," ",""," ",""," ",""," ",""," ","",null,null,null,null,null,null,null,null,null,"","","","","","","","",""]
[null,"d"," ",""," ",""," ",""," ",""," ",""," ",""," ",""," ",""," ","",null,null,null,null,null,null,null,null,null,"","","","","","","","",""]
[null,"d"," ",""," ",""," ",""," ",""," ",""," ",""," ",""," ",""," ","",null,null,null,null,null,null,null,null,null,"","","","","","","","",""]
[null,"d"," ",""," ",""," ",""," ",""," ",""," ",""," ",""," ",""," ","",null,null,null,null,null,null,null,null,null,"","","","","","","","",""]
[null,"d"," ",""," ",""," ",""," ",""," ",""," ",""," ",""," ",""," ","",null,null,null,null,null,null,null,null,null,"","","","","","","","",""]
[null,"d"," ",""," ",""," ",""," ",""," ",""," ",""," ",""," ",""," ","",null,null,null,null,null,null,null,null,null,"","","","","","","","",""]
[null,"d"," ",""," ",""," ",""," ",""," ",""," ",""," ",""," ",""," ","",null,null,null,null,null,null,null,null,null,"","","","","","","","",""]
[null,"d"," ",""," ",""," ",""," ",""," ",""," ",""," ",""," ",""," ","",null,null,null,null,null,null,null,null,null,"","","","","","","","",""]
[null,"d"," ",""," ",""," ",""," ",""," ",""," ",""," ",""," ",""," ","",null,null,null,null,null,null,null,null,null,"","","","","","","","",""]
[null,"d"," ",""," ",""," ",""," ",""," ",""," ",""," ",""," ",""," ","",null,null,null,null,null,null,null,null,null,"","","","","","","","",""]
[null,"d"," ",""," ",""," ",""," ",""," ",""," ",""," ",""," ",""," ","",null,null,null,null,null,null,null,null,null,"","","","","","","","",""]
[null,"d"," ",""," ",""," ",""," ",""," ",""," ",""," ",""," ",""," ","",null,null,null,null,null,null,null,null,null,"","","","","","","","",""]
[null,"d"," ",""," ",""," ",""," ",""," ",""," ",""," ",""," ",""," ","",null,null,null,null,null,null,null,null,null,"","","","","","","","",""]
[null,"d"," ",""," ",""," ",""," ",""," ",""," ",""," ",""," ",""," ","",null,null,null,null,null,null,null,null,null,"","","","","","","","",""]
[null,"d"," ",""," ",""," ",""," ",""," ",""," ",""," ",""," ",""," ","",null,null,null,null,null,null,null,null,null,"","","","","","","","",""]
[null,"d"," ",""," ",""," ",""," ",""," ",""," ",""," ",""," ",""," ","",null,null,null,null,null,null,null,null,null,"","","","","","","","",""]
[null,"d"," ",""," ",""," ",""," ",""," ",""," ",""," ",""," ",""," ","",null,null,null,null,null,null,null,null,null,"","","","","","","","",""]
[null,"d"," ",""," ",""," ",""," ",""," ",""," ",""," ",""," ",""," ","",null,null,null,null,null,null,null,null,null,"","","","","","","","",""]
[null,"d"," ",""," ",""," ",""," ",""," ",""," ",""," ",""," ",""," ","",null,null,null,null,null,null,null,null,null,"","","","","","","","",""]
[null,"d"," ",""," ",""," ",""," ",""," ",""," ",""," ",""," ",""," ","",null,null,null,null,null,null,null,null,null,"","","","","","","","",""]
[null,"d"," ",""," ",""," ",""," ",""," ",""," ",""," ",""," ",""," ","",null,null,null,null,null,null,null,null,null,"","","","","","","","",""]
[null,"d"," ",""," ",""," ",""," ",""," ",""," ",""," ",""," ",""," ","",null,null,null,null,null,null,null,null,null,"","","","","","","","",""]
[null,"d"," ",""," ",""," ",""," ",""," ",""," ",""," ",""," ",""," ","",null,null,null,null,null,null,null,null,null,"","","","","","","","",""]
[null,"d"," ",""," ",""," ",""," ",""," ",""," ",""," ",""," ",""," ","",null,null,null,null,null,null,null,null,null,"","","","","","","","",""]
[null,"d"," ",""," ",""," ",""," ",""," ",""," ",""," ",""," ",""," ","",null,null,null,null,null,null,null,null,null,"","","","","","","","",""]
[null,"d"," ",""," ",""," ",""," ",""," ",""," ",""," ",""," ",""," ","",null,null,null,null,null,null,null,null,null,"","","","","","","","",""]
[null,"d"," ",""," ",""," ",""," ",""," ",""," ",""," ",""," ",""," ","",null,null,null,null,null,null,null,null,null,"","","","","","","","",""]
[null,"d"," ",""," ",""," ",""," ",""," ",""," ",""," ",""," ",""," ","",null,null,null,null,null,null,null,null,null,"","","","","","","","",""]
[null,"d"," ",""," ",""," ",""," ",""," ",""," ",""," ",""," ",""," ","",null,null,null,null,null,null,null,null,null,"","","","","","","","",""]
[null,"d"," ",""," ",""," ",""," ",""," ",""," ",""," ",""," ",""," ","",null,null,null,null,null,null,null,null,null,"","","","","","","","",""]
[null,"d"," ",""," ",""," ",""," ",""," ",""," ",""," ",""," ",""," ","",null,null,null,null,null,null,null,null,null,"","","","","","","","",""]
[null,"d"," ",""," ",""," ",""," ",""," ",""," ",""," ",""," ",""," ","",null,null,null,null,null,null,null,null,null,"","","","","","","","",""]
[null,"d"," ",""," ",""," ",""," ",""," ",""," ",""," ",""," ",""," ","",null,null,null,null,null,null,null,null,null,"","","","","","","","",""]
[null,"d"," ",""," ",""," ",""," ",""," ",""," ",""," ",""," ",""," ","",null,null,null,null,null,null,null,null,null,"","","","","","","","",""]
[null,"d"," ",""," ",""," ",""," ",""," ",""," ",""," ",""," ",""," ","",null,null,null,null,null,null,null,null,null,"","","","","","","","",""]
[null,"d"," ",""," ",""," ",""," ",""," ",""," ",""," ",""," ",""," ","",null,null,null,null,null,null,null,null,null,"","","","","","","","",""]
[null,"d"," ",""," ",""," ",""," ",""," ",""," ",""," ",""," ",""," ","",null,null,null,null,null,null,null,null,null,"","","","","","","","",""]
[null,"d"," ",""," ",""," ",""," ",""," ",""," ",""," ",""," ",""," ","",null,null,null,null,null,null,null,null,null,"","","","","","","","",""]
[null,"d"," ",""," ",""," ",""," ",""," ",""," ",""," ",""," ",""," ","",null,null,null,null,null,null,null,null,null,"","","","","","","","",""]
[null,"d"," ",""," ",""," ",""," ",""," ",""," ",""," ",""," ",""," ","",null,null,null,null,null,null,null,null,null,"","","","","","","","",""]
[null,"d"," ",""," ",""," ",""," ",""," ",""," ",""," ",""," ",""," ","",null,null,null,null,null,null,null,null,null,"","","","","","","","",""]
[null,"d"," ",""," ",""," ",""," ",""," ",""," ",""," ",""," ",""," ","",null,null,null,null,null,null,null,null,null,"","","","","","","","",""]
[null,"d"," ",""," ",""," ",""," ",""," ",""," ",""," ",""," ",""," ","",null,null,null,null,null,null,null,null,null,"","","","","","","","",""]
[null,"d"," ",""," ",""," ",""," ",""," ",""," ",""," ",""," ",""," ","",null,null,null,null,null,null,null,null,null,"","","","","","","","",""]
[null,"d"," ",""," ",""," ",""," ",""," ",""," ",""," ",""," ",""," ","",null,null,null,null,null,null,null,null,null,"","","","","","","","",""]
[null,"d"," ",""," ",""," ",""," ",""," ",""," ",""," ",""," ",""," ","",null,null,null,null,null,null,null,null,null,"","","","","","","","",""]
[null,"d"," ",""," ",""," ",""," ",""," ",""," ",""," ",""," ",""," ","",null,null,null,null,null,null,null,null,null,"","","","","","","","",""]
[null,"d"," ",""," ",""," ",""," ",""," ",""," ",""," ",""," ",""," ","",null,null,null,null,null,null,null,null,null,"","","","","","","","",""]
[null,"d"," ",""," ",""," ",""," ",""," ",""," ",""," ",""," ",""," ","",null,null,null,null,null,null,null,null,null,"","","","","","","","",""]
[null,"d"," ",""," ",""," ",""," ",""," ",""," ",""," ",""," ",""," ","",null,null,null,null,null,null,null,null,null,"","","","","","","","",""]
[null,"d"," ",""," ",""," ",""," ",""," ",""," ",""," ",""," ",""," ","",null,null,null,null,null,null,null,null,null,"","","","","","","","",""]
[null,"d"," ",""," ",""," ",""," ",""," ",""," ",""," ",""," ",""," ","",null,null,null,null,null,null,null,null,null,"","","","","","","","",""]
[null,"d"," ",""," ",""," ",""," ",""," ",""," ",""," ",""," ",""," ","",null,null,null,null,null,null,null,null,null,"","","","","","","","",""]
[null,"d"," ",""," ",""," ",""," ",""," ",""," ",""," ",""," ",""," ","",null,null,null,null,null,null,null,null,null,"","","","","","","","",""]
[null,"d"," ",""," ",""," ",""," ",""," ",""," ",""," ",""," ",""," ","",null,null,null,null,null,null,null,null,null,"","","","","","","","",""]
[null,{"$f":"IF(EXACT(MID(H259,1,3),\"FID\"),\"f\",\"d\")","v":"d"}," ",{"$f":"IFERROR(_xlfn.NUMBERVALUE(SUBSTITUTE(MID(X259,AJ259+1,AK259-AJ259-1),\".\",\",\"))*25.4,\"\")","v":""}," ",{"$f":"IFERROR(_xlfn.NUMBERVALUE(SUBSTITUTE(MID(X259,AK259+1,AL259-1),\".\",\",\"))*25.4,\"\")","v":""}," ",{"$f":"IFERROR(MID(X259,AD259+1,AE259-AD259-1),\"\")","v":""}," ",{"$f":"IF(X259<>\"\",\"n0000\",\"\")","v":""}," ",{"$f":"IFERROR(_xlfn.NUMBERVALUE(MID(X259,AI259+1,AJ259-AI259-1))+90,\"\")","v":""}," ",{"$f":"IFERROR(MID(X259,AE259+2,AF259-AE259-3),\"\")","v":""}," ",{"$f":"IF(X259<>\"\",\"PP\",\"\")","v":""}," ",{"$f":"IFERROR(MID(X259,AD259+1,AE259-AD259-1),\"\")","v":""}," ",{"$f":"IFERROR(MID(X259,AF259+2,AG259-AF259-3),\"\")","v":""},null,null,null,null,null,null,null,null,null,{"$f":"IF(X259<>\"\",\"0\",\"\")","v":""},{"$f":"IFERROR(SEARCH(\",\",X259,1),\"\")","v":""},{"$f":"IFERROR(SEARCH(\",\",X259,AE259+1),\"\")","v":""},{"$f":"IFERROR(SEARCH(\",\",X259,AF259+1),\"\")","v":""},{"$f":"IFERROR(SEARCH(\",\",X259,AG259+1),\"\")","v":""},{"$f":"IFERROR(SEARCH(\",\",X259,AH259+1),\"\")","v":""},{"$f":"IFERROR(SEARCH(\",\",X259,AI259+1),\"\")","v":""},{"$f":"IFERROR(SEARCH(\",\",X259,AJ259+1),\"\")","v":""},{"$f":"IF(X259<>\"\",LEN(X259),\"\")","v":""}]
[null,"d"," ",""," ",""," ",""," ",""," ",""," ",""," ",""," ",""," ","",null,null,null,null,null,null,null,null,null,"","","","","","","","",""]
[null,"d"," ",""," ",""," ",""," ",""," ",""," ",""," ",""," ",""," ","",null,null,null,null,null,null,null,null,null,"","","","","","","","",""]
[null,"d"," ",""," ",""," ",""," ",""," ",""," ",""," ",""," ",""," ","",null,null,null,null,null,null,null,null,null,"","","","","","","","",""]
[null,"d"," ",""," ",""," ",""," ",""," ",""," ",""," ",""," ",""," ","",null,null,null,null,null,null,null,null,null,"","","","","","","","",""]
[null,"d"," ",""," ",""," ",""," ",""," ",""," ",""," ",""," ",""," ","",null,null,null,null,null,null,null,null,null,"","","","","","","","",""]
[null,"d"," ",""," ",""," ",""," ",""," ",""," ",""," ",""," ",""," ","",null,null,null,null,null,null,null,null,null,"","","","","","","","",""]
[null,"d"," ",""," ",""," ",""," ",""," ",""," ",""," ",""," ",""," ","",null,null,null,null,null,null,null,null,null,"","","","","","","","",""]
[null,"d"," ",""," ",""," ",""," ",""," ",""," ",""," ",""," ",""," ","",null,null,null,null,null,null,null,null,null,"","","","","","","","",""]
[null,"d"," ",""," ",""," ",""," ",""," ",""," ",""," ",""," ",""," ","",null,null,null,null,null,null,null,null,null,"","","","","","","","",""]
[null,"d"," ",""," ",""," ",""," ",""," ",""," ",""," ",""," ",""," ","",null,null,null,null,null,null,null,null,null,"","","","","","","","",""]
[null,"d"," ",""," ",""," ",""," ",""," ",""," ",""," ",""," ",""," ","",null,null,null,null,null,null,null,null,null,"","","","","","","","",""]
[null,"d"," ",""," ",""," ",""," ",""," ",""," ",""," ",""," ",""," ","",null,null,null,null,null,null,null,null,null,"","","","","","","","",""]
[null,"d"," ",""," ",""," ",""," ",""," ",""," ",""," ",""," ",""," ","",null,null,null,null,null,null,null,null,null,"","","","","","","","",""]
[null,"d"," ",""," ",""," ",""," ",""," ",""," ",""," ",""," ",""," ","",null,null,null,null,null,null,null,null,null,"","","","","","","","",""]
[null,"d"," ",""," ",""," ",""," ",""," ",""," ",""," ",""," ",""," ","",null,null,null,null,null,null,null,null,null,"","","","","","","","",""]
[null,"d"," ",""," ",""," ",""," ",""," ",""," ",""," ",""," ",""," ","",null,null,null,null,null,null,null,null,null,"","","","","","","","",""]
[null,"d"," ",""," ",""," ",""," ",""," ",""," ",""," ",""," ",""," ","",null,null,null,null,null,null,null,null,null,"","","","","","","","",""]
[null,"d"," ",""," ",""," ",""," ",""," ",""," ",""," ",""," ",""," ","",null,null,null,null,null,null,null,null,null,"","","","","","","","",""]
[null,"d"," ",""," ",""," ",""," ",""," ",""," ",""," ",""," ",""," ","",null,null,null,null,null,null,null,null,null,"","","","","","","","",""]
[null,"d"," ",""," ",""," ",""," ",""," ",""," ",""," ",""," ",""," ","",null,null,null,null,null,null,null,null,null,"","","","","","","","",""]
[null,"d"," ",""," ",""," ",""," ",""," ",""," ",""," ",""," ",""," ","",null,null,null,null,null,null,null,null,null,"","","","","","","","",""]
[null,"d"," ",""," ",""," ",""," ",""," ",""," ",""," ",""," ",""," ","",null,null,null,null,null,null,null,null,null,"","","","","","","","",""]
[null,"d"," ",""," ",""," ",""," ",""," ",""," ",""," ",""," ",""," ","",null,null,null,null,null,null,null,null,null,"","","","","","","","",""]
[null,"d"," ",""," ",""," ",""," ",""," ",""," ",""," ",""," ",""," ","",null,null,null,null,null,null,null,null,null,"","","","","","","","",""]
[null,"d"," ",""," ",""," ",""," ",""," ",""," ",""," ",""," ",""," ","",null,null,null,null,null,null,null,null,null,"","","","","","","","",""]
[null,"d"," ",""," ",""," ",""," ",""," ",""," ",""," ",""," ",""," ","",null,null,null,null,null,null,null,null,null,"","","","","","","","",""]
[null,"d"," ",""," ",""," ",""," ",""," ",""," ",""," ",""," ",""," ","",null,null,null,null,null,null,null,null,null,"","","","","","","","",""]
[null,"d"," ",""," ",""," ",""," ",""," ",""," ",""," ",""," ",""," ","",null,null,null,null,null,null,null,null,null,"","","","","","","","",""]
[null,"d"," ",""," ",""," ",""," ",""," ",""," ",""," ",""," ",""," ","",null,null,null,null,null,null,null,null,null,"","","","","","","","",""]
[null,"d"," ",""," ",""," ",""," ",""," ",""," ",""," ",""," ",""," ","",null,null,null,null,null,null,null,null,null,"","","","","","","","",""]
[null,"d"," ",""," ",""," ",""," ",""," ",""," ",""," ",""," ",""," ","",null,null,null,null,null,null,null,null,null,"","","","","","","","",""]
[null,"d"," ",""," ",""," ",""," ",""," ",""," ",""," ",""," ",""," ","",null,null,null,null,null,null,null,null,null,"","","","","","","","",""]
[null,"d"," ",""," ",""," ",""," ",""," ",""," ",""," ",""," ",""," ","",null,null,null,null,null,null,null,null,null,"","","","","","","","",""]
[null,"d"," ",""," ",""," ",""," ",""," ",""," ",""," ",""," ",""," ","",null,null,null,null,null,null,null,null,null,"","","","","","","","",""]
[null,"d"," ",""," ",""," ",""," ",""," ",""," ",""," ",""," ",""," ","",null,null,null,null,null,null,null,null,null,"","","","","","","","",""]
[null,"d"," ",""," ",""," ",""," ",""," ",""," ",""," ",""," ",""," ","",null,null,null,null,null,null,null,null,null,"","","","","","","","",""]
[null,"d"," ",""," ",""," ",""," ",""," ",""," ",""," ",""," ",""," ","",null,null,null,null,null,null,null,null,null,"","","","","","","","",""]
[null,"d"," ",""," ",""," ",""," ",""," ",""," ",""," ",""," ",""," ","",null,null,null,null,null,null,null,null,null,"","","","","","","","",""]
[null,"d"," ",""," ",""," ",""," ",""," ",""," ",""," ",""," ",""," ","",null,null,null,null,null,null,null,null,null,"","","","","","","","",""]
[null,"d"," ",""," ",""," ",""," ",""," ",""," ",""," ",""," ",""," ","",null,null,null,null,null,null,null,null,null,"","","","","","","","",""]
[null,"d"," ",""," ",""," ",""," ",""," ",""," ",""," ",""," ",""," ","",null,null,null,null,null,null,null,null,null,"","","","","","","","",""]
[null,"d"," ",""," ",""," ",""," ",""," ",""," ",""," ",""," ",""," ","",null,null,null,null,null,null,null,null,null,"","","","","","","","",""]
[null,"d"," ",""," ",""," ",""," ",""," ",""," ",""," ",""," ",""," ","",null,null,null,null,null,null,null,null,null,"","","","","","","","",""]
[null,"d"," ",""," ",""," ",""," ",""," ",""," ",""," ",""," ",""," ","",null,null,null,null,null,null,null,null,null,"","","","","","","","",""]
[null,"d"," ",""," ",""," ",""," ",""," ",""," ",""," ",""," ",""," ","",null,null,null,null,null,null,null,null,null,"","","","","","","","",""]
[null,"d"," ",""," ",""," ",""," ",""," ",""," ",""," ",""," ",""," ","",null,null,null,null,null,null,null,null,null,"","","","","","","","",""]
[null,"d"," ",""," ",""," ",""," ",""," ",""," ",""," ",""," ",""," ","",null,null,null,null,null,null,null,null,null,"","","","","","","","",""]
[null,"d"," ",""," ",""," ",""," ",""," ",""," ",""," ",""," ",""," ","",null,null,null,null,null,null,null,null,null,"","","","","","","","",""]
[null,"d"," ",""," ",""," ",""," ",""," ",""," ",""," ",""," ",""," ","",null,null,null,null,null,null,null,null,null,"","","","","","","","",""]
[null,"d"," ",""," ",""," ",""," ",""," ",""," ",""," ",""," ",""," ","",null,null,null,null,null,null,null,null,null,"","","","","","","","",""]
[null,"d"," ",""," ",""," ",""," ",""," ",""," ",""," ",""," ",""," ","",null,null,null,null,null,null,null,null,null,"","","","","","","","",""]
[null,"d"," ",""," ",""," ",""," ",""," ",""," ",""," ",""," ",""," ","",null,null,null,null,null,null,null,null,null,"","","","","","","","",""]
[null,"d"," ",""," ",""," ",""," ",""," ",""," ",""," ",""," ",""," ","",null,null,null,null,null,null,null,null,null,"","","","","","","","",""]
[null,"d"," ",""," ",""," ",""," ",""," ",""," ",""," ",""," ",""," ","",null,null,null,null,null,null,null,null,null,"","","","","","","","",""]
[null,"d"," ",""," ",""," ",""," ",""," ",""," ",""," ",""," ",""," ","",null,null,null,null,null,null,null,null,null,"","","","","","","","",""]
[null,"d"," ",""," ",""," ",""," ",""," ",""," ",""," ",""," ",""," ","",null,null,null,null,null,null,null,null,null,"","","","","","","","",""]
[null,"d"," ",""," ",""," ",""," ",""," ",""," ",""," ",""," ",""," ","",null,null,null,null,null,null,null,null,null,"","","","","","","","",""]
[null,"d"," ",""," ",""," ",""," ",""," ",""," ",""," ",""," ",""," ","",null,null,null,null,null,null,null,null,null,"","","","","","","","",""]
[null,"d"," ",""," ",""," ",""," ",""," ",""," ",""," ",""," ",""," ","",null,null,null,null,null,null,null,null,null,"","","","","","","","",""]
[null,"d"," ",""," ",""," ",""," ",""," ",""," ",""," ",""," ",""," ","",null,null,null,null,null,null,null,null,null,"","","","","","","","",""]
[null,"d"," ",""," ",""," ",""," ",""," ",""," ",""," ",""," ",""," ","",null,null,null,null,null,null,null,null,null,"","","","","","","","",""]
[null,"d"," ",""," ",""," ",""," ",""," ",""," ",""," ",""," ",""," ","",null,null,null,null,null,null,null,null,null,"","","","","","","","",""]
[null,"d"," ",""," ",""," ",""," ",""," ",""," ",""," ",""," ",""," ","",null,null,null,null,null,null,null,null,null,"","","","","","","","",""]
[null,{"$f":"IF(EXACT(MID(H323,1,3),\"FID\"),\"f\",\"d\")","v":"d"}," ",{"$f":"IFERROR(_xlfn.NUMBERVALUE(SUBSTITUTE(MID(X323,AJ323+1,AK323-AJ323-1),\".\",\",\"))*25.4,\"\")","v":""}," ",{"$f":"IFERROR(_xlfn.NUMBERVALUE(SUBSTITUTE(MID(X323,AK323+1,AL323-1),\".\",\",\"))*25.4,\"\")","v":""}," ",{"$f":"IFERROR(MID(X323,AD323+1,AE323-AD323-1),\"\")","v":""}," ",{"$f":"IF(X323<>\"\",\"n0000\",\"\")","v":""}," ",{"$f":"IFERROR(_xlfn.NUMBERVALUE(MID(X323,AI323+1,AJ323-AI323-1))+90,\"\")","v":""}," ",{"$f":"IFERROR(MID(X323,AE323+2,AF323-AE323-3),\"\")","v":""}," ",{"$f":"IF(X323<>\"\",\"PP\",\"\")","v":""}," ",{"$f":"IFERROR(MID(X323,AD323+1,AE323-AD323-1),\"\")","v":""}," ",{"$f":"IFERROR(MID(X323,AF323+2,AG323-AF323-3),\"\")","v":""},null,null,null,null,null,null,null,null,null,{"$f":"IF(X323<>\"\",\"0\",\"\")","v":""},{"$f":"IFERROR(SEARCH(\",\",X323,1),\"\")","v":""},{"$f":"IFERROR(SEARCH(\",\",X323,AE323+1),\"\")","v":""},{"$f":"IFERROR(SEARCH(\",\",X323,AF323+1),\"\")","v":""},{"$f":"IFERROR(SEARCH(\",\",X323,AG323+1),\"\")","v":""},{"$f":"IFERROR(SEARCH(\",\",X323,AH323+1),\"\")","v":""},{"$f":"IFERROR(SEARCH(\",\",X323,AI323+1),\"\")","v":""},{"$f":"IFERROR(SEARCH(\",\",X323,AJ323+1),\"\")","v":""},{"$f":"IF(X323<>\"\",LEN(X323),\"\")","v":""}]
[null,"d"," ",""," ",""," ",""," ",""," ",""," ",""," ",""," ",""," ","",null,null,null,null,null,null,null,null,null,"","","","","","","","",""]
[null,"d"," ",""," ",""," ",""," ",""," ",""," ",""," ",""," ",""," ","",null,null,null,null,null,null,null,null,null,"","","","","","","","",""]
[null,"d"," ",""," ",""," ",""," ",""," ",""," ",""," ",""," ",""," ","",null,null,null,null,null,null,null,null,null,"","","","","","","","",""]
[null,"d"," ",""," ",""," ",""," ",""," ",""," ",""," ",""," ",""," ","",null,null,null,null,null,null,null,null,null,"","","","","","","","",""]
[null,"d"," ",""," ",""," ",""," ",""," ",""," ",""," ",""," ",""," ","",null,null,null,null,null,null,null,null,null,"","","","","","","","",""]
[null,"d"," ",""," ",""," ",""," ",""," ",""," ",""," ",""," ",""," ","",null,null,null,null,null,null,null,null,null,"","","","","","","","",""]
[null,"d"," ",""," ",""," ",""," ",""," ",""," ",""," ",""," ",""," ","",null,null,null,null,null,null,null,null,null,"","","","","","","","",""]
[null,"d"," ",""," ",""," ",""," ",""," ",""," ",""," ",""," ",""," ","",null,null,null,null,null,null,null,null,null,"","","","","","","","",""]
[null,"d"," ",""," ",""," ",""," ",""," ",""," ",""," ",""," ",""," ","",null,null,null,null,null,null,null,null,null,"","","","","","","","",""]
[null,"d"," ",""," ",""," ",""," ",""," ",""," ",""," ",""," ",""," ","",null,null,null,null,null,null,null,null,null,"","","","","","","","",""]
[null,"d"," ",""," ",""," ",""," ",""," ",""," ",""," ",""," ",""," ","",null,null,null,null,null,null,null,null,null,"","","","","","","","",""]
[null,"d"," ",""," ",""," ",""," ",""," ",""," ",""," ",""," ",""," ","",null,null,null,null,null,null,null,null,null,"","","","","","","","",""]
[null,"d"," ",""," ",""," ",""," ",""," ",""," ",""," ",""," ",""," ","",null,null,null,null,null,null,null,null,null,"","","","","","","","",""]
[null,"d"," ",""," ",""," ",""," ",""," ",""," ",""," ",""," ",""," ","",null,null,null,null,null,null,null,null,null,"","","","","","","","",""]
[null,"d"," ",""," ",""," ",""," ",""," ",""," ",""," ",""," ",""," ","",null,null,null,null,null,null,null,null,null,"","","","","","","","",""]
[null,"d"," ",""," ",""," ",""," ",""," ",""," ",""," ",""," ",""," ","",null,null,null,null,null,null,null,null,null,"","","","","","","","",""]
[null,"d"," ",""," ",""," ",""," ",""," ",""," ",""," ",""," ",""," ","",null,null,null,null,null,null,null,null,null,"","","","","","","","",""]
[null,"d"," ",""," ",""," ",""," ",""," ",""," ",""," ",""," ",""," ","",null,null,null,null,null,null,null,null,null,"","","","","","","","",""]
[null,"d"," ",""," ",""," ",""," ",""," ",""," ",""," ",""," ",""," ","",null,null,null,null,null,null,null,null,null,"","","","","","","","",""]
[null,"d"," ",""," ",""," ",""," ",""," ",""," ",""," ",""," ",""," ","",null,null,null,null,null,null,null,null,null,"","","","","","","","",""]
[null,"d"," ",""," ",""," ",""," ",""," ",""," ",""," ",""," ",""," ","",null,null,null,null,null,null,null,null,null,"","","","","","","","",""]
[null,"d"," ",""," ",""," ",""," ",""," ",""," ",""," ",""," ",""," ","",null,null,null,null,null,null,null,null,null,"","","","","","","","",""]
[null,"d"," ",""," ",""," ",""," ",""," ",""," ",""," ",""," ",""," ","",null,null,null,null,null,null,null,null,null,"","","","","","","","",""]
[null,"d"," ",""," ",""," ",""," ",""," ",""," ",""," ",""," ",""," ","",null,null,null,null,null,null,null,null,null,"","","","","","","","",""]
[null,"d"," ",""," ",""," ",""," ",""," ",""," ",""," ",""," ",""," ","",null,null,null,null,null,null,null,null,null,"","","","","","","","",""]
[null,"d"," ",""," ",""," ",""," ",""," ",""," ",""," ",""," ",""," ","",null,null,null,null,null,null,null,null,null,"","","","","","","","",""]
[null,"d"," ",""," ",""," ",""," ",""," ",""," ",""," ",""," ",""," ","",null,null,null,null,null,null,null,null,null,"","","","","","","","",""]
[null,"d"," ",""," ",""," ",""," ",""," ",""," ",""," ",""," ",""," ","",null,null,null,null,null,null,null,null,null,"","","","","","","","",""]
[null,"d"," ",""," ",""," ",""," ",""," ",""," ",""," ",""," ",""," ","",null,null,null,null,null,null,null,null,null,"","","","","","","","",""]
[null,"d"," ",""," ",""," ",""," ",""," ",""," ",""," ",""," ",""," ","",null,null,null,null,null,null,null,null,null,"","","","","","","","",""]
[null,"d"," ",""," ",""," ",""," ",""," ",""," ",""," ",""," ",""," ","",null,null,null,null,null,null,null,null,null,"","","","","","","","",""]
[null,"d"," ",""," ",""," ",""," ",""," ",""," ",""," ",""," ",""," ","",null,null,null,null,null,null,null,null,null,"","","","","","","","",""]
[null,"d"," ",""," ",""," ",""," ",""," ",""," ",""," ",""," ",""," ","",null,null,null,null,null,null,null,null,null,"","","","","","","","",""]
[null,"d"," ",""," ",""," ",""," ",""," ",""," ",""," ",""," ",""," ","",null,null,null,null,null,null,null,null,null,"","","","","","","","",""]
[null,"d"," ",""," ",""," ",""," ",""," ",""," ",""," ",""," ",""," ","",null,null,null,null,null,null,null,null,null,"","","","","","","","",""]
[null,"d"," ",""," ",""," ",""," ",""," ",""," ",""," ",""," ",""," ","",null,null,null,null,null,null,null,null,null,"","","","","","","","",""]
[null,"d"," ",""," ",""," ",""," ",""," ",""," ",""," ",""," ",""," ","",null,null,null,null,null,null,null,null,null,"","","","","","","","",""]
[null,"d"," ",""," ",""," ",""," ",""," ",""," ",""," ",""," ",""," ","",null,null,null,null,null,null,null,null,null,"","","","","","","","",""]
[null,"d"," ",""," ",""," ",""," ",""," ",""," ",""," ",""," ",""," ","",null,null,null,null,null,null,null,null,null,"","","","","","","","",""]
[null,"d"," ",""," ",""," ",""," ",""," ",""," ",""," ",""," ",""," ","",null,null,null,null,null,null,null,null,null,"","","","","","","","",""]
[null,"d"," ",""," ",""," ",""," ",""," ",""," ",""," ",""," ",""," ","",null,null,null,null,null,null,null,null,null,"","","","","","","","",""]
[null,"d"," ",""," ",""," ",""," ",""," ",""," ",""," ",""," ",""," ","",null,null,null,null,null,null,null,null,null,"","","","","","","","",""]
[null,"d"," ",""," ",""," ",""," ",""," ",""," ",""," ",""," ",""," ","",null,null,null,null,null,null,null,null,null,"","","","","","","","",""]
[null,"d"," ",""," ",""," ",""," ",""," ",""," ",""," ",""," ",""," ","",null,null,null,null,null,null,null,null,null,"","","","","","","","",""]
[null,"d"," ",""," ",""," ",""," ",""," ",""," ",""," ",""," ",""," ","",null,null,null,null,null,null,null,null,null,"","","","","","","","",""]
[null,"d"," ",""," ",""," ",""," ",""," ",""," ",""," ",""," ",""," ","",null,null,null,null,null,null,null,null,null,"","","","","","","","",""]
[null,"d"," ",""," ",""," ",""," ",""," ",""," ",""," ",""," ",""," ","",null,null,null,null,null,null,null,null,null,"","","","","","","","",""]
[null,"d"," ",""," ",""," ",""," ",""," ",""," ",""," ",""," ",""," ","",null,null,null,null,null,null,null,null,null,"","","","","","","","",""]
[null,"d"," ",""," ",""," ",""," ",""," ",""," ",""," ",""," ",""," ","",null,null,null,null,null,null,null,null,null,"","","","","","","","",""]
[null,"d"," ",""," ",""," ",""," ",""," ",""," ",""," ",""," ",""," ","",null,null,null,null,null,null,null,null,null,"","","","","","","","",""]
[null,"d"," ",""," ",""," ",""," ",""," ",""," ",""," ",""," ",""," ","",null,null,null,null,null,null,null,null,null,"","","","","","","","",""]
[null,"d"," ",""," ",""," ",""," ",""," ",""," ",""," ",""," ",""," ","",null,null,null,null,null,null,null,null,null,"","","","","","","","",""]
[null,"d"," ",""," ",""," ",""," ",""," ",""," ",""," ",""," ",""," ","",null,null,null,null,null,null,null,null,null,"","","","","","","","",""]
[null,"d"," ",""," ",""," ",""," ",""," ",""," ",""," ",""," ",""," ","",null,null,null,null,null,null,null,null,null,"","","","","","","","",""]
[null,"d"," ",""," ",""," ",""," ",""," ",""," ",""," ",""," ",""," ","",null,null,null,null,null,null,null,null,null,"","","","","","","","",""]
[null,"d"," ",""," ",""," ",""," ",""," ",""," ",""," ",""," ",""," ","",null,null,null,null,null,null,null,null,null,"","","","","","","","",""]
[null,"d"," ",""," ",""," ",""," ",""," ",""," ",""," ",""," ",""," ","",null,null,null,null,null,null,null,null,null,"","","","","","","","",""]
[null,"d"," ",""," ",""," ",""," ",""," ",""," ",""," ",""," ",""," ","",null,null,null,null,null,null,null,null,null,"","","","","","","","",""]
[null,"d"," ",""," ",""," ",""," ",""," ",""," ",""," ",""," ",""," ","",null,null,null,null,null,null,null,null,null,"","","","","","","","",""]
[null,"d"," ",""," ",""," ",""," ",""," ",""," ",""," ",""," ",""," ","",null,null,null,null,null,null,null,null,null,"","","","","","","","",""]
[null,"d"," ",""," ",""," ",""," ",""," ",""," ",""," ",""," ",""," ","",null,null,null,null,null,null,null,null,null,"","","","","","","","",""]
[null,"d"," ",""," ",""," ",""," ",""," ",""," ",""," ",""," ",""," ","",null,null,null,null,null,null,null,null,null,"","","","","","","","",""]
[null,"d"," ",""," ",""," ",""," ",""," ",""," ",""," ",""," ",""," ","",null,null,null,null,null,null,null,null,null,"","","","","","","","",""]
[null,{"$f":"IF(EXACT(MID(H387,1,3),\"FID\"),\"f\",\"d\")","v":"d"}," ",{"$f":"IFERROR(_xlfn.NUMBERVALUE(SUBSTITUTE(MID(X387,AJ387+1,AK387-AJ387-1),\".\",\",\"))*25.4,\"\")","v":""}," ",{"$f":"IFERROR(_xlfn.NUMBERVALUE(SUBSTITUTE(MID(X387,AK387+1,AL387-1),\".\",\",\"))*25.4,\"\")","v":""}," ",{"$f":"IFERROR(MID(X387,AD387+1,AE387-AD387-1),\"\")","v":""}," ",{"$f":"IF(X387<>\"\",\"n0000\",\"\")","v":""}," ",{"$f":"IFERROR(_xlfn.NUMBERVALUE(MID(X387,AI387+1,AJ387-AI387-1))+90,\"\")","v":""}," ",{"$f":"IFERROR(MID(X387,AE387+2,AF387-AE387-3),\"\")","v":""}," ",{"$f":"IF(X387<>\"\",\"PP\",\"\")","v":""}," ",{"$f":"IFERROR(MID(X387,AD387+1,AE387-AD387-1),\"\")","v":""}," ",{"$f":"IFERROR(MID(X387,AF387+2,AG387-AF387-3),\"\")","v":""},null,null,null,null,null,null,null,null,null,{"$f":"IF(X387<>\"\",\"0\",\"\")","v":""},{"$f":"IFERROR(SEARCH(\",\",X387,1),\"\")","v":""},{"$f":"IFERROR(SEARCH(\",\",X387,AE387+1),\"\")","v":""},{"$f":"IFERROR(SEARCH(\",\",X387,AF387+1),\"\")","v":""},{"$f":"IFERROR(SEARCH(\",\",X387,AG387+1),\"\")","v":""},{"$f":"IFERROR(SEARCH(\",\",X387,AH387+1),\"\")","v":""},{"$f":"IFERROR(SEARCH(\",\",X387,AI387+1),\"\")","v":""},{"$f":"IFERROR(SEARCH(\",\",X387,AJ387+1),\"\")","v":""},{"$f":"IF(X387<>\"\",LEN(X387),\"\")","v":""}]
[null,"d"," ",""," ",""," ",""," ",""," ",""," ",""," ",""," ",""," ","",null,null,null,null,null,null,null,null,null,"","","","","","","","",""]
[null,"d"," ",""," ",""," ",""," ",""," ",""," ",""," ",""," ",""," ","",null,null,null,null,null,null,null,null,null,"","","","","","","","",""]
[null,"d"," ",""," ",""," ",""," ",""," ",""," ",""," ",""," ",""," ","",null,null,null,null,null,null,null,null,null,"","","","","","","","",""]
[null,"d"," ",""," ",""," ",""," ",""," ",""," ",""," ",""," ",""," ","",null,null,null,null,null,null,null,null,null,"","","","","","","","",""]
[null,"d"," ",""," ",""," ",""," ",""," ",""," ",""," ",""," ",""," ","",null,null,null,null,null,null,null,null,null,"","","","","","","","",""]
[null,"d"," ",""," ",""," ",""," ",""," ",""," ",""," ",""," ",""," ","",null,null,null,null,null,null,null,null,null,"","","","","","","","",""]
[null,"d"," ",""," ",""," ",""," ",""," ",""," ",""," ",""," ",""," ","",null,null,null,null,null,null,null,null,null,"","","","","","","","",""]
[null,"d"," ",""," ",""," ",""," ",""," ",""," ",""," ",""," ",""," ","",null,null,null,null,null,null,null,null,null,"","","","","","","","",""]
[null,"d"," ",""," ",""," ",""," ",""," ",""," ",""," ",""," ",""," ","",null,null,null,null,null,null,null,null,null,"","","","","","","","",""]
[null,"d"," ",""," ",""," ",""," ",""," ",""," ",""," ",""," ",""," ","",null,null,null,null,null,null,null,null,null,"","","","","","","","",""]
[null,"d"," ",""," ",""," ",""," ",""," ",""," ",""," ",""," ",""," ","",null,null,null,null,null,null,null,null,null,"","","","","","","","",""]
[null,"d"," ",""," ",""," ",""," ",""," ",""," ",""," ",""," ",""," ","",null,null,null,null,null,null,null,null,null,"","","","","","","","",""]
[null,"d"," ",""," ",""," ",""," ",""," ",""," ",""," ",""," ",""," ","",null,null,null,null,null,null,null,null,null,"","","","","","","","",""]
[null,"d"," ",""," ",""," ",""," ",""," ",""," ",""," ",""," ",""," ","",null,null,null,null,null,null,null,null,null,"","","","","","","","",""]
[null,"d"," ",""," ",""," ",""," ",""," ",""," ",""," ",""," ",""," ","",null,null,null,null,null,null,null,null,null,"","","","","","","","",""]
[null,"d"," ",""," ",""," ",""," ",""," ",""," ",""," ",""," ",""," ","",null,null,null,null,null,null,null,null,null,"","","","","","","","",""]
[null,"d"," ",""," ",""," ",""," ",""," ",""," ",""," ",""," ",""," ","",null,null,null,null,null,null,null,null,null,"","","","","","","","",""]
[null,"d"," ",""," ",""," ",""," ",""," ",""," ",""," ",""," ",""," ","",null,null,null,null,null,null,null,null,null,"","","","","","","","",""]
[null,"d"," ",""," ",""," ",""," ",""," ",""," ",""," ",""," ",""," ","",null,null,null,null,null,null,null,null,null,"","","","","","","","",""]
[null,"d"," ",""," ",""," ",""," ",""," ",""," ",""," ",""," ",""," ","",null,null,null,null,null,null,null,null,null,"","","","","","","","",""]
[null,"d"," ",""," ",""," ",""," ",""," ",""," ",""," ",""," ",""," ","",null,null,null,null,null,null,null,null,null,"","","","","","","","",""]
[null,"d"," ",""," ",""," ",""," ",""," ",""," ",""," ",""," ",""," ","",null,null,null,null,null,null,null,null,null,"","","","","","","","",""]
[null,"d"," ",""," ",""," ",""," ",""," ",""," ",""," ",""," ",""," ","",null,null,null,null,null,null,null,null,null,"","","","","","","","",""]
[null,"d"," ",""," ",""," ",""," ",""," ",""," ",""," ",""," ",""," ","",null,null,null,null,null,null,null,null,null,"","","","","","","","",""]
[null,"d"," ",""," ",""," ",""," ",""," ",""," ",""," ",""," ",""," ","",null,null,null,null,null,null,null,null,null,"","","","","","","","",""]
[null,"d"," ",""," ",""," ",""," ",""," ",""," ",""," ",""," ",""," ","",null,null,null,null,null,null,null,null,null,"","","","","","","","",""]
[null,"d"," ",""," ",""," ",""," ",""," ",""," ",""," ",""," ",""," ","",null,null,null,null,null,null,null,null,null,"","","","","","","","",""]
[null,"d"," ",""," ",""," ",""," ",""," ",""," ",""," ",""," ",""," ","",null,null,null,null,null,null,null,null,null,"","","","","","","","",""]
[null,"d"," ",""," ",""," ",""," ",""," ",""," ",""," ",""," ",""," ","",null,null,null,null,null,null,null,null,null,"","","","","","","","",""]
[null,"d"," ",""," ",""," ",""," ",""," ",""," ",""," ",""," ",""," ","",null,null,null,null,null,null,null,null,null,"","","","","","","","",""]
[null,"d"," ",""," ",""," ",""," ",""," ",""," ",""," ",""," ",""," ","",null,null,null,null,null,null,null,null,null,"","","","","","","","",""]
[null,"d"," ",""," ",""," ",""," ",""," ",""," ",""," ",""," ",""," ","",null,null,null,null,null,null,null,null,null,"","","","","","","","",""]
[null,"d"," ",""," ",""," ",""," ",""," ",""," ",""," ",""," ",""," ","",null,null,null,null,null,null,null,null,null,"","","","","","","","",""]
[null,"d"," ",""," ",""," ",""," ",""," ",""," ",""," ",""," ",""," ","",null,null,null,null,null,null,null,null,null,"","","","","","","","",""]
[null,"d"," ",""," ",""," ",""," ",""," ",""," ",""," ",""," ",""," ","",null,null,null,null,null,null,null,null,null,"","","","","","","","",""]
[null,"d"," ",""," ",""," ",""," ",""," ",""," ",""," ",""," ",""," ","",null,null,null,null,null,null,null,null,null,"","","","","","","","",""]
[null,"d"," ",""," ",""," ",""," ",""," ",""," ",""," ",""," ",""," ","",null,null,null,null,null,null,null,null,null,"","","","","","","","",""]
[null,"d"," ",""," ",""," ",""," ",""," ",""," ",""," ",""," ",""," ","",null,null,null,null,null,null,null,null,null,"","","","","","","","",""]
[null,"d"," ",""," ",""," ",""," ",""," ",""," ",""," ",""," ",""," ","",null,null,null,null,null,null,null,null,null,"","","","","","","","",""]
[null,"d"," ",""," ",""," ",""," ",""," ",""," ",""," ",""," ",""," ","",null,null,null,null,null,null,null,null,null,"","","","","","","","",""]
[null,"d"," ",""," ",""," ",""," ",""," ",""," ",""," ",""," ",""," ","",null,null,null,null,null,null,null,null,null,"","","","","","","","",""]
[null,"d"," ",""," ",""," ",""," ",""," ",""," ",""," ",""," ",""," ","",null,null,null,null,null,null,null,null,null,"","","","","","","","",""]
[null,"d"," ",""," ",""," ",""," ",""," ",""," ",""," ",""," ",""," ","",null,null,null,null,null,null,null,null,null,"","","","","","","","",""]
[null,"d"," ",""," ",""," ",""," ",""," ",""," ",""," ",""," ",""," ","",null,null,null,null,null,null,null,null,null,"","","","","","","","",""]
[null,"d"," ",""," ",""," ",""," ",""," ",""," ",""," ",""," ",""," ","",null,null,null,null,null,null,null,null,null,"","","","","","","","",""]
[null,"d"," ",""," ",""," ",""," ",""," ",""," ",""," ",""," ",""," ","",null,null,null,null,null,null,null,null,null,"","","","","","","","",""]
[null,"d"," ",""," ",""," ",""," ",""," ",""," ",""," ",""," ",""," ","",null,null,null,null,null,null,null,null,null,"","","","","","","","",""]
[null,"d"," ",""," ",""," ",""," ",""," ",""," ",""," ",""," ",""," ","",null,null,null,null,null,null,null,null,null,"","","","","","","","",""]
[null,"d"," ",""," ",""," ",""," ",""," ",""," ",""," ",""," ",""," ","",null,null,null,null,null,null,null,null,null,"","","","","","","","",""]
[null,"d"," ",""," ",""," ",""," ",""," ",""," ",""," ",""," ",""," ","",null,null,null,null,null,null,null,null,null,"","","","","","","","",""]
[null,"d"," ",""," ",""," ",""," ",""," ",""," ",""," ",""," ",""," ","",null,null,null,null,null,null,null,null,null,"","","","","","","","",""]
[null,"d"," ",""," ",""," ",""," ",""," ",""," ",""," ",""," ",""," ","",null,null,null,null,null,null,null,null,null,"","","","","","","","",""]
[null,"d"," ",""," ",""," ",""," ",""," ",""," ",""," ",""," ",""," ","",null,null,null,null,null,null,null,null,null,"","","","","","","","",""]
[null,"d"," ",""," ",""," ",""," ",""," ",""," ",""," ",""," ",""," ","",null,null,null,null,null,null,null,null,null,"","","","","","","","",""]
[null,"d"," ",""," ",""," ",""," ",""," ",""," ",""," ",""," ",""," ","",null,null,null,null,null,null,null,null,null,"","","","","","","","",""]
[null,"d"," ",""," ",""," ",""," ",""," ",""," ",""," ",""," ",""," ","",null,null,null,null,null,null,null,null,null,"","","","","","","","",""]
[null,"d"," ",""," ",""," ",""," ",""," ",""," ",""," ",""," ",""," ","",null,null,null,null,null,null,null,null,null,"","","","","","","","",""]
[null,"d"," ",""," ",""," ",""," ",""," ",""," ",""," ",""," ",""," ","",null,null,null,null,null,null,null,null,null,"","","","","","","","",""]
[null,"d"," ",""," ",""," ",""," ",""," ",""," ",""," ",""," ",""," ","",null,null,null,null,null,null,null,null,null,"","","","","","","","",""]
[null,"d"," ",""," ",""," ",""," ",""," ",""," ",""," ",""," ",""," ","",null,null,null,null,null,null,null,null,null,"","","","","","","","",""]
[null,"d"," ",""," ",""," ",""," ",""," ",""," ",""," ",""," ",""," ","",null,null,null,null,null,null,null,null,null,"","","","","","","","",""]
[null,"d"," ",""," ",""," ",""," ",""," ",""," ",""," ",""," ",""," ","",null,null,null,null,null,null,null,null,null,"","","","","","","","",""]
[null,"d"," ",""," ",""," ",""," ",""," ",""," ",""," ",""," ",""," ","",null,null,null,null,null,null,null,null,null,"","","","","","","","",""]
[null,{"$f":"IF(EXACT(MID(H451,1,3),\"FID\"),\"f\",\"d\")","v":"d"}," ",{"$f":"IFERROR(_xlfn.NUMBERVALUE(SUBSTITUTE(MID(X451,AJ451+1,AK451-AJ451-1),\".\",\",\"))*25.4,\"\")","v":""}," ",{"$f":"IFERROR(_xlfn.NUMBERVALUE(SUBSTITUTE(MID(X451,AK451+1,AL451-1),\".\",\",\"))*25.4,\"\")","v":""}," ",{"$f":"IFERROR(MID(X451,AD451+1,AE451-AD451-1),\"\")","v":""}," ",{"$f":"IF(X451<>\"\",\"n0000\",\"\")","v":""}," ",{"$f":"IFERROR(_xlfn.NUMBERVALUE(MID(X451,AI451+1,AJ451-AI451-1))+90,\"\")","v":""}," ",{"$f":"IFERROR(MID(X451,AE451+2,AF451-AE451-3),\"\")","v":""}," ",{"$f":"IF(X451<>\"\",\"PP\",\"\")","v":""}," ",{"$f":"IFERROR(MID(X451,AD451+1,AE451-AD451-1),\"\")","v":""}," ",{"$f":"IFERROR(MID(X451,AF451+2,AG451-AF451-3),\"\")","v":""},null,null,null,null,null,null,null,null,null,{"$f":"IF(X451<>\"\",\"0\",\"\")","v":""},{"$f":"IFERROR(SEARCH(\",\",X451,1),\"\")","v":""},{"$f":"IFERROR(SEARCH(\",\",X451,AE451+1),\"\")","v":""},{"$f":"IFERROR(SEARCH(\",\",X451,AF451+1),\"\")","v":""},{"$f":"IFERROR(SEARCH(\",\",X451,AG451+1),\"\")","v":""},{"$f":"IFERROR(SEARCH(\",\",X451,AH451+1),\"\")","v":""},{"$f":"IFERROR(SEARCH(\",\",X451,AI451+1),\"\")","v":""},{"$f":"IFERROR(SEARCH(\",\",X451,AJ451+1),\"\")","v":""},{"$f":"IF(X451<>\"\",LEN(X451),\"\")","v":""}]
[null,"d"," ",""," ",""," ",""," ",""," ",""," ",""," ",""," ",""," ","",null,null,null,null,null,null,null,null,null,"","","","","","","","",""]
[null,"d"," ",""," ",""," ",""," ",""," ",""," ",""," ",""," ",""," ","",null,null,null,null,null,null,null,null,null,"","","","","","","","",""]
[null,"d"," ",""," ",""," ",""," ",""," ",""," ",""," ",""," ",""," ","",null,null,null,null,null,null,null,null,null,"","","","","","","","",""]
[null,"d"," ",""," ",""," ",""," ",""," ",""," ",""," ",""," ",""," ","",null,null,null,null,null,null,null,null,null,"","","","","","","","",""]
[null,"d"," ",""," ",""," ",""," ",""," ",""," ",""," ",""," ",""," ","",null,null,null,null,null,null,null,null,null,"","","","","","","","",""]
[null,"d"," ",""," ",""," ",""," ",""," ",""," ",""," ",""," ",""," ","",null,null,null,null,null,null,null,null,null,"","","","","","","","",""]
[null,"d"," ",""," ",""," ",""," ",""," ",""," ",""," ",""," ",""," ","",null,null,null,null,null,null,null,null,null,"","","","","","","","",""]
[null,"d"," ",""," ",""," ",""," ",""," ",""," ",""," ",""," ",""," ","",null,null,null,null,null,null,null,null,null,"","","","","","","","",""]
[null,"d"," ",""," ",""," ",""," ",""," ",""," ",""," ",""," ",""," ","",null,null,null,null,null,null,null,null,null,"","","","","","","","",""]
[null,"d"," ",""," ",""," ",""," ",""," ",""," ",""," ",""," ",""," ","",null,null,null,null,null,null,null,null,null,"","","","","","","","",""]
[null,"d"," ",""," ",""," ",""," ",""," ",""," ",""," ",""," ",""," ","",null,null,null,null,null,null,null,null,null,"","","","","","","","",""]
[null,"d"," ",""," ",""," ",""," ",""," ",""," ",""," ",""," ",""," ","",null,null,null,null,null,null,null,null,null,"","","","","","","","",""]
[null,"d"," ",""," ",""," ",""," ",""," ",""," ",""," ",""," ",""," ","",null,null,null,null,null,null,null,null,null,"","","","","","","","",""]
[null,"d"," ",""," ",""," ",""," ",""," ",""," ",""," ",""," ",""," ","",null,null,null,null,null,null,null,null,null,"","","","","","","","",""]
[null,"d"," ",""," ",""," ",""," ",""," ",""," ",""," ",""," ",""," ","",null,null,null,null,null,null,null,null,null,"","","","","","","","",""]
[null,"d"," ",""," ",""," ",""," ",""," ",""," ",""," ",""," ",""," ","",null,null,null,null,null,null,null,null,null,"","","","","","","","",""]
[null,"d"," ",""," ",""," ",""," ",""," ",""," ",""," ",""," ",""," ","",null,null,null,null,null,null,null,null,null,"","","","","","","","",""]
[null,"d"," ",""," ",""," ",""," ",""," ",""," ",""," ",""," ",""," ","",null,null,null,null,null,null,null,null,null,"","","","","","","","",""]
[null,"d"," ",""," ",""," ",""," ",""," ",""," ",""," ",""," ",""," ","",null,null,null,null,null,null,null,null,null,"","","","","","","","",""]
[null,"d"," ",""," ",""," ",""," ",""," ",""," ",""," ",""," ",""," ","",null,null,null,null,null,null,null,null,null,"","","","","","","","",""]
[null,"d"," ",""," ",""," ",""," ",""," ",""," ",""," ",""," ",""," ","",null,null,null,null,null,null,null,null,null,"","","","","","","","",""]
[null,"d"," ",""," ",""," ",""," ",""," ",""," ",""," ",""," ",""," ","",null,null,null,null,null,null,null,null,null,"","","","","","","","",""]
[null,"d"," ",""," ",""," ",""," ",""," ",""," ",""," ",""," ",""," ","",null,null,null,null,null,null,null,null,null,"","","","","","","","",""]
[null,"d"," ",""," ",""," ",""," ",""," ",""," ",""," ",""," ",""," ","",null,null,null,null,null,null,null,null,null,"","","","","","","","",""]
[null,"d"," ",""," ",""," ",""," ",""," ",""," ",""," ",""," ",""," ","",null,null,null,null,null,null,null,null,null,"","","","","","","","",""]
[null,"d"," ",""," ",""," ",""," ",""," ",""," ",""," ",""," ",""," ","",null,null,null,null,null,null,null,null,null,"","","","","","","","",""]
[null,"d"," ",""," ",""," ",""," ",""," ",""," ",""," ",""," ",""," ","",null,null,null,null,null,null,null,null,null,"","","","","","","","",""]
[null,"d"," ",""," ",""," ",""," ",""," ",""," ",""," ",""," ",""," ","",null,null,null,null,null,null,null,null,null,"","","","","","","","",""]
[null,"d"," ",""," ",""," ",""," ",""," ",""," ",""," ",""," ",""," ","",null,null,null,null,null,null,null,null,null,"","","","","","","","",""]
[null,"d"," ",""," ",""," ",""," ",""," ",""," ",""," ",""," ",""," ","",null,null,null,null,null,null,null,null,null,"","","","","","","","",""]
[null,"d"," ",""," ",""," ",""," ",""," ",""," ",""," ",""," ",""," ","",null,null,null,null,null,null,null,null,null,"","","","","","","","",""]
[null,"d"," ",""," ",""," ",""," ",""," ",""," ",""," ",""," ",""," ","",null,null,null,null,null,null,null,null,null,"","","","","","","","",""]
[null,"d"," ",""," ",""," ",""," ",""," ",""," ",""," ",""," ",""," ","",null,null,null,null,null,null,null,null,null,"","","","","","","","",""]
[null,"d"," ",""," ",""," ",""," ",""," ",""," ",""," ",""," ",""," ","",null,null,null,null,null,null,null,null,null,"","","","","","","","",""]
[null,"d"," ",""," ",""," ",""," ",""," ",""," ",""," ",""," ",""," ","",null,null,null,null,null,null,null,null,null,"","","","","","","","",""]
[null,"d"," ",""," ",""," ",""," ",""," ",""," ",""," ",""," ",""," ","",null,null,null,null,null,null,null,null,null,"","","","","","","","",""]
[null,"d"," ",""," ",""," ",""," ",""," ",""," ",""," ",""," ",""," ","",null,null,null,null,null,null,null,null,null,"","","","","","","","",""]
[null,"d"," ",""," ",""," ",""," ",""," ",""," ",""," ",""," ",""," ","",null,null,null,null,null,null,null,null,null,"","","","","","","","",""]
[null,"d"," ",""," ",""," ",""," ",""," ",""," ",""," ",""," ",""," ","",null,null,null,null,null,null,null,null,null,"","","","","","","","",""]
[null,"d"," ",""," ",""," ",""," ",""," ",""," ",""," ",""," ",""," ","",null,null,null,null,null,null,null,null,null,"","","","","","","","",""]
[null,"d"," ",""," ",""," ",""," ",""," ",""," ",""," ",""," ",""," ","",null,null,null,null,null,null,null,null,null,"","","","","","","","",""]
[null,"d"," ",""," ",""," ",""," ",""," ",""," ",""," ",""," ",""," ","",null,null,null,null,null,null,null,null,null,"","","","","","","","",""]
[null,"d"," ",""," ",""," ",""," ",""," ",""," ",""," ",""," ",""," ","",null,null,null,null,null,null,null,null,null,"","","","","","","","",""]
[null,"d"," ",""," ",""," ",""," ",""," ",""," ",""," ",""," ",""," ","",null,null,null,null,null,null,null,null,null,"","","","","","","","",""]
[null,"d"," ",""," ",""," ",""," ",""," ",""," ",""," ",""," ",""," ","",null,null,null,null,null,null,null,null,null,"","","","","","","","",""]
[null,"d"," ",""," ",""," ",""," ",""," ",""," ",""," ",""," ",""," ","",null,null,null,null,null,null,null,null,null,"","","","","","","","",""]
[null,"d"," ",""," ",""," ",""," ",""," ",""," ",""," ",""," ",""," ","",null,null,null,null,null,null,null,null,null,"","","","","","","","",""]
[null,"d"," ",""," ",""," ",""," ",""," ",""," ",""," ",""," ",""," ","",null,null,null,null,null,null,null,null,null,"","","","","","","","",""]
[null,"d"," ",""," ",""," ",""," ",""," ",""," ",""," ",""," ",""," ","",null,null,null,null,null,null,null,null,null,"","","","","","","","",""]
[null,"d"," ",""," ",""," ",""," ",""," ",""," ",""," ",""," ",""," ","",null,null,null,null,null,null,null,null,null,"","","","","","","","",""]
[null,"d"," ",""," ",""," ",""," ",""," ",""," ",""," ",""," ",""," ","",null,null,null,null,null,null,null,null,null,"","","","","","","","",""]
[null,"d"," ",""," ",""," ",""," ",""," ",""," ",""," ",""," ",""," ","",null,null,null,null,null,null,null,null,null,"","","","","","","","",""]
[null,"d"," ",""," ",""," ",""," ",""," ",""," ",""," ",""," ",""," ","",null,null,null,null,null,null,null,null,null,"","","","","","","","",""]
[null,"d"," ",""," ",""," ",""," ",""," ",""," ",""," ",""," ",""," ","",null,null,null,null,null,null,null,null,null,"","","","","","","","",""]
[null,"d"," ",""," ",""," ",""," ",""," ",""," ",""," ",""," ",""," ","",null,null,null,null,null,null,null,null,null,"","","","","","","","",""]
[null,"d"," ",""," ",""," ",""," ",""," ",""," ",""," ",""," ",""," ","",null,null,null,null,null,null,null,null,null,"","","","","","","","",""]
[null,"d"," ",""," ",""," ",""," ",""," ",""," ",""," ",""," ",""," ","",null,null,null,null,null,null,null,null,null,"","","","","","","","",""]
[null,"d"," ",""," ",""," ",""," ",""," ",""," ",""," ",""," ",""," ","",null,null,null,null,null,null,null,null,null,"","","","","","","","",""]
[null,"d"," ",""," ",""," ",""," ",""," ",""," ",""," ",""," ",""," ","",null,null,null,null,null,null,null,null,null,"","","","","","","","",""]
[null,"d"," ",""," ",""," ",""," ",""," ",""," ",""," ",""," ",""," ","",null,null,null,null,null,null,null,null,null,"","","","","","","","",""]
[null,"d"," ",""," ",""," ",""," ",""," ",""," ",""," ",""," ",""," ","",null,null,null,null,null,null,null,null,null,"","","","","","","","",""]
[null,"d"," ",""," ",""," ",""," ",""," ",""," ",""," ",""," ",""," ","",null,null,null,null,null,null,null,null,null,"","","","","","","","",""]
[null,"d"," ",""," ",""," ",""," ",""," ",""," ",""," ",""," ",""," ","",null,null,null,null,null,null,null,null,null,"","","","","","","","",""]
[null,{"$f":"IF(EXACT(MID(H515,1,3),\"FID\"),\"f\",\"d\")","v":"d"}," ",{"$f":"IFERROR(_xlfn.NUMBERVALUE(SUBSTITUTE(MID(X515,AJ515+1,AK515-AJ515-1),\".\",\",\"))*25.4,\"\")","v":""}," ",{"$f":"IFERROR(_xlfn.NUMBERVALUE(SUBSTITUTE(MID(X515,AK515+1,AL515-1),\".\",\",\"))*25.4,\"\")","v":""}," ",{"$f":"IFERROR(MID(X515,AD515+1,AE515-AD515-1),\"\")","v":""}," ",{"$f":"IF(X515<>\"\",\"n0000\",\"\")","v":""}," ",{"$f":"IFERROR(_xlfn.NUMBERVALUE(MID(X515,AI515+1,AJ515-AI515-1))+90,\"\")","v":""}," ",{"$f":"IFERROR(MID(X515,AE515+2,AF515-AE515-3),\"\")","v":""}," ",{"$f":"IF(X515<>\"\",\"PP\",\"\")","v":""}," ",{"$f":"IFERROR(MID(X515,AD515+1,AE515-AD515-1),\"\")","v":""}," ",{"$f":"IFERROR(MID(X515,AF515+2,AG515-AF515-3),\"\")","v":""},null,null,null,null,null,null,null,null,null,{"$f":"IF(X515<>\"\",\"0\",\"\")","v":""},{"$f":"IFERROR(SEARCH(\",\",X515,1),\"\")","v":""},{"$f":"IFERROR(SEARCH(\",\",X515,AE515+1),\"\")","v":""},{"$f":"IFERROR(SEARCH(\",\",X515,AF515+1),\"\")","v":""},{"$f":"IFERROR(SEARCH(\",\",X515,AG515+1),\"\")","v":""},{"$f":"IFERROR(SEARCH(\",\",X515,AH515+1),\"\")","v":""},{"$f":"IFERROR(SEARCH(\",\",X515,AI515+1),\"\")","v":""},{"$f":"IFERROR(SEARCH(\",\",X515,AJ515+1),\"\")","v":""},{"$f":"IF(X515<>\"\",LEN(X515),\"\")","v":""}]
[null,"d"," ",""," ",""," ",""," ",""," ",""," ",""," ",""," ",""," ","",null,null,null,null,null,null,null,null,null,"","","","","","","","",""]
[null,"d"," ",""," ",""," ",""," ",""," ",""," ",""," ",""," ",""," ","",null,null,null,null,null,null,null,null,null,"","","","","","","","",""]
[null,"d"," ",""," ",""," ",""," ",""," ",""," ",""," ",""," ",""," ","",null,null,null,null,null,null,null,null,null,"","","","","","","","",""]
[null,"d"," ",""," ",""," ",""," ",""," ",""," ",""," ",""," ",""," ","",null,null,null,null,null,null,null,null,null,"","","","","","","","",""]
[null,"d"," ",""," ",""," ",""," ",""," ",""," ",""," ",""," ",""," ","",null,null,null,null,null,null,null,null,null,"","","","","","","","",""]
[null,"d"," ",""," ",""," ",""," ",""," ",""," ",""," ",""," ",""," ","",null,null,null,null,null,null,null,null,null,"","","","","","","","",""]
[null,"d"," ",""," ",""," ",""," ",""," ",""," ",""," ",""," ",""," ","",null,null,null,null,null,null,null,null,null,"","","","","","","","",""]
[null,"d"," ",""," ",""," ",""," ",""," ",""," ",""," ",""," ",""," ","",null,null,null,null,null,null,null,null,null,"","","","","","","","",""]
[null,"d"," ",""," ",""," ",""," ",""," ",""," ",""," ",""," ",""," ","",null,null,null,null,null,null,null,null,null,"","","","","","","","",""]
[null,"d"," ",""," ",""," ",""," ",""," ",""," ",""," ",""," ",""," ","",null,null,null,null,null,null,null,null,null,"","","","","","","","",""]
[null,"d"," ",""," ",""," ",""," ",""," ",""," ",""," ",""," ",""," ","",null,null,null,null,null,null,null,null,null,"","","","","","","","",""]
[null,"d"," ",""," ",""," ",""," ",""," ",""," ",""," ",""," ",""," ","",null,null,null,null,null,null,null,null,null,"","","","","","","","",""]
[null,"d"," ",""," ",""," ",""," ",""," ",""," ",""," ",""," ",""," ","",null,null,null,null,null,null,null,null,null,"","","","","","","","",""]
[null,"d"," ",""," ",""," ",""," ",""," ",""," ",""," ",""," ",""," ","",null,null,null,null,null,null,null,null,null,"","","","","","","","",""]
[null,"d"," ",""," ",""," ",""," ",""," ",""," ",""," ",""," ",""," ","",null,null,null,null,null,null,null,null,null,"","","","","","","","",""]
[null,"d"," ",""," ",""," ",""," ",""," ",""," ",""," ",""," ",""," ","",null,null,null,null,null,null,null,null,null,"","","","","","","","",""]
[null,"d"," ",""," ",""," ",""," ",""," ",""," ",""," ",""," ",""," ","",null,null,null,null,null,null,null,null,null,"","","","","","","","",""]
[null,"d"," ",""," ",""," ",""," ",""," ",""," ",""," ",""," ",""," ","",null,null,null,null,null,null,null,null,null,"","","","","","","","",""]
[null,"d"," ",""," ",""," ",""," ",""," ",""," ",""," ",""," ",""," ","",null,null,null,null,null,null,null,null,null,"","","","","","","","",""]
[null,"d"," ",""," ",""," ",""," ",""," ",""," ",""," ",""," ",""," ","",null,null,null,null,null,null,null,null,null,"","","","","","","","",""]
[null,"d"," ",""," ",""," ",""," ",""," ",""," ",""," ",""," ",""," ","",null,null,null,null,null,null,null,null,null,"","","","","","","","",""]
[null,"d"," ",""," ",""," ",""," ",""," ",""," ",""," ",""," ",""," ","",null,null,null,null,null,null,null,null,null,"","","","","","","","",""]
[null,"d"," ",""," ",""," ",""," ",""," ",""," ",""," ",""," ",""," ","",null,null,null,null,null,null,null,null,null,"","","","","","","","",""]
[null,"d"," ",""," ",""," ",""," ",""," ",""," ",""," ",""," ",""," ","",null,null,null,null,null,null,null,null,null,"","","","","","","","",""]
[null,"d"," ",""," ",""," ",""," ",""," ",""," ",""," ",""," ",""," ","",null,null,null,null,null,null,null,null,null,"","","","","","","","",""]
[null,"d"," ",""," ",""," ",""," ",""," ",""," ",""," ",""," ",""," ","",null,null,null,null,null,null,null,null,null,"","","","","","","","",""]
[null,"d"," ",""," ",""," ",""," ",""," ",""," ",""," ",""," ",""," ","",null,null,null,null,null,null,null,null,null,"","","","","","","","",""]
[null,"d"," ",""," ",""," ",""," ",""," ",""," ",""," ",""," ",""," ","",null,null,null,null,null,null,null,null,null,"","","","","","","","",""]
[null,"d"," ",""," ",""," ",""," ",""," ",""," ",""," ",""," ",""," ","",null,null,null,null,null,null,null,null,null,"","","","","","","","",""]
[null,"d"," ",""," ",""," ",""," ",""," ",""," ",""," ",""," ",""," ","",null,null,null,null,null,null,null,null,null,"","","","","","","","",""]
[null,"d"," ",""," ",""," ",""," ",""," ",""," ",""," ",""," ",""," ","",null,null,null,null,null,null,null,null,null,"","","","","","","","",""]
[null,"d"," ",""," ",""," ",""," ",""," ",""," ",""," ",""," ",""," ","",null,null,null,null,null,null,null,null,null,"","","","","","","","",""]
[null,"d"," ",""," ",""," ",""," ",""," ",""," ",""," ",""," ",""," ","",null,null,null,null,null,null,null,null,null,"","","","","","","","",""]
[null,"d"," ",""," ",""," ",""," ",""," ",""," ",""," ",""," ",""," ","",null,null,null,null,null,null,null,null,null,"","","","","","","","",""]
[null,"d"," ",""," ",""," ",""," ",""," ",""," ",""," ",""," ",""," ","",null,null,null,null,null,null,null,null,null,"","","","","","","","",""]
[null,"d"," ",""," ",""," ",""," ",""," ",""," ",""," ",""," ",""," ","",null,null,null,null,null,null,null,null,null,"","","","","","","","",""]
[null,"d"," ",""," ",""," ",""," ",""," ",""," ",""," ",""," ",""," ","",null,null,null,null,null,null,null,null,null,"","","","","","","","",""]
[null,"d"," ",""," ",""," ",""," ",""," ",""," ",""," ",""," ",""," ","",null,null,null,null,null,null,null,null,null,"","","","","","","","",""]
[null,"d"," ",""," ",""," ",""," ",""," ",""," ",""," ",""," ",""," ","",null,null,null,null,null,null,null,null,null,"","","","","","","","",""]
[null,"d"," ",""," ",""," ",""," ",""," ",""," ",""," ",""," ",""," ","",null,null,null,null,null,null,null,null,null,"","","","","","","","",""]
[null,"d"," ",""," ",""," ",""," ",""," ",""," ",""," ",""," ",""," ","",null,null,null,null,null,null,null,null,null,"","","","","","","","",""]
[null,"d"," ",""," ",""," ",""," ",""," ",""," ",""," ",""," ",""," ","",null,null,null,null,null,null,null,null,null,"","","","","","","","",""]
[null,"d"," ",""," ",""," ",""," ",""," ",""," ",""," ",""," ",""," ","",null,null,null,null,null,null,null,null,null,"","","","","","","","",""]
[null,"d"," ",""," ",""," ",""," ",""," ",""," ",""," ",""," ",""," ","",null,null,null,null,null,null,null,null,null,"","","","","","","","",""]
[null,"d"," ",""," ",""," ",""," ",""," ",""," ",""," ",""," ",""," ","",null,null,null,null,null,null,null,null,null,"","","","","","","","",""]
[null,"d"," ",""," ",""," ",""," ",""," ",""," ",""," ",""," ",""," ","",null,null,null,null,null,null,null,null,null,"","","","","","","","",""]
[null,"d"," ",""," ",""," ",""," ",""," ",""," ",""," ",""," ",""," ","",null,null,null,null,null,null,null,null,null,"","","","","","","","",""]
[null,"d"," ",""," ",""," ",""," ",""," ",""," ",""," ",""," ",""," ","",null,null,null,null,null,null,null,null,null,"","","","","","","","",""]
[null,"d"," ",""," ",""," ",""," ",""," ",""," ",""," ",""," ",""," ","",null,null,null,null,null,null,null,null,null,"","","","","","","","",""]
[null,"d"," ",""," ",""," ",""," ",""," ",""," ",""," ",""," ",""," ","",null,null,null,null,null,null,null,null,null,"","","","","","","","",""]
[null,"d"," ",""," ",""," ",""," ",""," ",""," ",""," ",""," ",""," ","",null,null,null,null,null,null,null,null,null,"","","","","","","","",""]
[null,"d"," ",""," ",""," ",""," ",""," ",""," ",""," ",""," ",""," ","",null,null,null,null,null,null,null,null,null,"","","","","","","","",""]
[null,"d"," ",""," ",""," ",""," ",""," ",""," ",""," ",""," ",""," ","",null,null,null,null,null,null,null,null,null,"","","","","","","","",""]
[null,"d"," ",""," ",""," ",""," ",""," ",""," ",""," ",""," ",""," ","",null,null,null,null,null,null,null,null,null,"","","","","","","","",""]
[null,"d"," ",""," ",""," ",""," ",""," ",""," ",""," ",""," ",""," ","",null,null,null,null,null,null,null,null,null,"","","","","","","","",""]
[null,"d"," ",""," ",""," ",""," ",""," ",""," ",""," ",""," ",""," ","",null,null,null,null,null,null,null,null,null,"","","","","","","","",""]
[null,"d"," ",""," ",""," ",""," ",""," ",""," ",""," ",""," ",""," ","",null,null,null,null,null,null,null,null,null,"","","","","","","","",""]
[null,"d"," ",""," ",""," ",""," ",""," ",""," ",""," ",""," ",""," ","",null,null,null,null,null,null,null,null,null,"","","","","","","","",""]
[null,"d"," ",""," ",""," ",""," ",""," ",""," ",""," ",""," ",""," ","",null,null,null,null,null,null,null,null,null,"","","","","","","","",""]
[null,"d"," ",""," ",""," ",""," ",""," ",""," ",""," ",""," ",""," ","",null,null,null,null,null,null,null,null,null,"","","","","","","","",""]
[null,"d"," ",""," ",""," ",""," ",""," ",""," ",""," ",""," ",""," ","",null,null,null,null,null,null,null,null,null,"","","","","","","","",""]
[null,"d"," ",""," ",""," ",""," ",""," ",""," ",""," ",""," ",""," ","",null,null,null,null,null,null,null,null,null,"","","","","","","","",""]
[null,"d"," ",""," ",""," ",""," ",""," ",""," ",""," ",""," ",""," ","",null,null,null,null,null,null,null,null,null,"","","","","","","","",""]
[null,{"$f":"IF(EXACT(MID(H579,1,3),\"FID\"),\"f\",\"d\")","v":"d"}," ",{"$f":"IFERROR(_xlfn.NUMBERVALUE(SUBSTITUTE(MID(X579,AJ579+1,AK579-AJ579-1),\".\",\",\"))*25.4,\"\")","v":""}," ",{"$f":"IFERROR(_xlfn.NUMBERVALUE(SUBSTITUTE(MID(X579,AK579+1,AL579-1),\".\",\",\"))*25.4,\"\")","v":""}," ",{"$f":"IFERROR(MID(X579,AD579+1,AE579-AD579-1),\"\")","v":""}," ",{"$f":"IF(X579<>\"\",\"n0000\",\"\")","v":""}," ",{"$f":"IFERROR(_xlfn.NUMBERVALUE(MID(X579,AI579+1,AJ579-AI579-1))+90,\"\")","v":""}," ",{"$f":"IFERROR(MID(X579,AE579+2,AF579-AE579-3),\"\")","v":""}," ",{"$f":"IF(X579<>\"\",\"PP\",\"\")","v":""}," ",{"$f":"IFERROR(MID(X579,AD579+1,AE579-AD579-1),\"\")","v":""}," ",{"$f":"IFERROR(MID(X579,AF579+2,AG579-AF579-3),\"\")","v":""},null,null,null,null,null,null,null,null,null,{"$f":"IF(X579<>\"\",\"0\",\"\")","v":""},{"$f":"IFERROR(SEARCH(\",\",X579,1),\"\")","v":""},{"$f":"IFERROR(SEARCH(\",\",X579,AE579+1),\"\")","v":""},{"$f":"IFERROR(SEARCH(\",\",X579,AF579+1),\"\")","v":""},{"$f":"IFERROR(SEARCH(\",\",X579,AG579+1),\"\")","v":""},{"$f":"IFERROR(SEARCH(\",\",X579,AH579+1),\"\")","v":""},{"$f":"IFERROR(SEARCH(\",\",X579,AI579+1),\"\")","v":""},{"$f":"IFERROR(SEARCH(\",\",X579,AJ579+1),\"\")","v":""},{"$f":"IF(X579<>\"\",LEN(X579),\"\")","v":""}]
[null,"d"," ",""," ",""," ",""," ",""," ",""," ",""," ",""," ",""," ","",null,null,null,null,null,null,null,null,null,"","","","","","","","",""]
[null,"d"," ",""," ",""," ",""," ",""," ",""," ",""," ",""," ",""," ","",null,null,null,null,null,null,null,null,null,"","","","","","","","",""]
[null,"d"," ",""," ",""," ",""," ",""," ",""," ",""," ",""," ",""," ","",null,null,null,null,null,null,null,null,null,"","","","","","","","",""]
[null,"d"," ",""," ",""," ",""," ",""," ",""," ",""," ",""," ",""," ","",null,null,null,null,null,null,null,null,null,"","","","","","","","",""]
[null,"d"," ",""," ",""," ",""," ",""," ",""," ",""," ",""," ",""," ","",null,null,null,null,null,null,null,null,null,"","","","","","","","",""]
[null,"d"," ",""," ",""," ",""," ",""," ",""," ",""," ",""," ",""," ","",null,null,null,null,null,null,null,null,null,"","","","","","","","",""]
[null,"d"," ",""," ",""," ",""," ",""," ",""," ",""," ",""," ",""," ","",null,null,null,null,null,null,null,null,null,"","","","","","","","",""]
[null,"d"," ",""," ",""," ",""," ",""," ",""," ",""," ",""," ",""," ","",null,null,null,null,null,null,null,null,null,"","","","","","","","",""]
[null,"d"," ",""," ",""," ",""," ",""," ",""," ",""," ",""," ",""," ","",null,null,null,null,null,null,null,null,null,"","","","","","","","",""]
[null,"d"," ",""," ",""," ",""," ",""," ",""," ",""," ",""," ",""," ","",null,null,null,null,null,null,null,null,null,"","","","","","","","",""]
[null,"d"," ",""," ",""," ",""," ",""," ",""," ",""," ",""," ",""," ","",null,null,null,null,null,null,null,null,null,"","","","","","","","",""]
[null,"d"," ",""," ",""," ",""," ",""," ",""," ",""," ",""," ",""," ","",null,null,null,null,null,null,null,null,null,"","","","","","","","",""]
[null,"d"," ",""," ",""," ",""," ",""," ",""," ",""," ",""," ",""," ","",null,null,null,null,null,null,null,null,null,"","","","","","","","",""]
[null,"d"," ",""," ",""," ",""," ",""," ",""," ",""," ",""," ",""," ","",null,null,null,null,null,null,null,null,null,"","","","","","","","",""]
[null,"d"," ",""," ",""," ",""," ",""," ",""," ",""," ",""," ",""," ","",null,null,null,null,null,null,null,null,null,"","","","","","","","",""]
[null,"d"," ",""," ",""," ",""," ",""," ",""," ",""," ",""," ",""," ","",null,null,null,null,null,null,null,null,null,"","","","","","","","",""]
[null,"d"," ",""," ",""," ",""," ",""," ",""," ",""," ",""," ",""," ","",null,null,null,null,null,null,null,null,null,"","","","","","","","",""]
[null,"d"," ",""," ",""," ",""," ",""," ",""," ",""," ",""," ",""," ","",null,null,null,null,null,null,null,null,null,"","","","","","","","",""]
[null,"d"," ",""," ",""," ",""," ",""," ",""," ",""," ",""," ",""," ","",null,null,null,null,null,null,null,null,null,"","","","","","","","",""]
[null,"d"," ",""," ",""," ",""," ",""," ",""," ",""," ",""," ",""," ","",null,null,null,null,null,null,null,null,null,"","","","","","","","",""]
[null,"d"," ",""," ",""," ",""," ",""," ",""," ",""," ",""," ",""," ","",null,null,null,null,null,null,null,null,null,"","","","","","","","",""]
[null,"d"," ",""," ",""," ",""," ",""," ",""," ",""," ",""," ",""," ","",null,null,null,null,null,null,null,null,null,"","","","","","","","",""]
[null,"d"," ",""," ",""," ",""," ",""," ",""," ",""," ",""," ",""," ","",null,null,null,null,null,null,null,null,null,"","","","","","","","",""]
[null,"d"," ",""," ",""," ",""," ",""," ",""," ",""," ",""," ",""," ","",null,null,null,null,null,null,null,null,null,"","","","","","","","",""]
[null,"d"," ",""," ",""," ",""," ",""," ",""," ",""," ",""," ",""," ","",null,null,null,null,null,null,null,null,null,"","","","","","","","",""]
[null,"d"," ",""," ",""," ",""," ",""," ",""," ",""," ",""," ",""," ","",null,null,null,null,null,null,null,null,null,"","","","","","","","",""]
[null,"d"," ",""," ",""," ",""," ",""," ",""," ",""," ",""," ",""," ","",null,null,null,null,null,null,null,null,null,"","","","","","","","",""]
[null,"d"," ",""," ",""," ",""," ",""," ",""," ",""," ",""," ",""," ","",null,null,null,null,null,null,null,null,null,"","","","","","","","",""]
[null,"d"," ",""," ",""," ",""," ",""," ",""," ",""," ",""," ",""," ","",null,null,null,null,null,null,null,null,null,"","","","","","","","",""]
[null,"d"," ",""," ",""," ",""," ",""," ",""," ",""," ",""," ",""," ","",null,null,null,null,null,null,null,null,null,"","","","","","","","",""]
[null,"d"," ",""," ",""," ",""," ",""," ",""," ",""," ",""," ",""," ","",null,null,null,null,null,null,null,null,null,"","","","","","","","",""]
[null,"d"," ",""," ",""," ",""," ",""," ",""," ",""," ",""," ",""," ","",null,null,null,null,null,null,null,null,null,"","","","","","","","",""]
[null,"d"," ",""," ",""," ",""," ",""," ",""," ",""," ",""," ",""," ","",null,null,null,null,null,null,null,null,null,"","","","","","","","",""]
[null,"d"," ",""," ",""," ",""," ",""," ",""," ",""," ",""," ",""," ","",null,null,null,null,null,null,null,null,null,"","","","","","","","",""]
[null,"d"," ",""," ",""," ",""," ",""," ",""," ",""," ",""," ",""," ","",null,null,null,null,null,null,null,null,null,"","","","","","","","",""]
[null,"d"," ",""," ",""," ",""," ",""," ",""," ",""," ",""," ",""," ","",null,null,null,null,null,null,null,null,null,"","","","","","","","",""]
[null,"d"," ",""," ",""," ",""," ",""," ",""," ",""," ",""," ",""," ","",null,null,null,null,null,null,null,null,null,"","","","","","","","",""]
[null,"d"," ",""," ",""," ",""," ",""," ",""," ",""," ",""," ",""," ","",null,null,null,null,null,null,null,null,null,"","","","","","","","",""]
[null,"d"," ",""," ",""," ",""," ",""," ",""," ",""," ",""," ",""," ","",null,null,null,null,null,null,null,null,null,"","","","","","","","",""]
[null,"d"," ",""," ",""," ",""," ",""," ",""," ",""," ",""," ",""," ","",null,null,null,null,null,null,null,null,null,"","","","","","","","",""]
[null,"d"," ",""," ",""," ",""," ",""," ",""," ",""," ",""," ",""," ","",null,null,null,null,null,null,null,null,null,"","","","","","","","",""]
[null,"d"," ",""," ",""," ",""," ",""," ",""," ",""," ",""," ",""," ","",null,null,null,null,null,null,null,null,null,"","","","","","","","",""]
[null,"d"," ",""," ",""," ",""," ",""," ",""," ",""," ",""," ",""," ","",null,null,null,null,null,null,null,null,null,"","","","","","","","",""]
[null,"d"," ",""," ",""," ",""," ",""," ",""," ",""," ",""," ",""," ","",null,null,null,null,null,null,null,null,null,"","","","","","","","",""]
[null,"d"," ",""," ",""," ",""," ",""," ",""," ",""," ",""," ",""," ","",null,null,null,null,null,null,null,null,null,"","","","","","","","",""]
[null,"d"," ",""," ",""," ",""," ",""," ",""," ",""," ",""," ",""," ","",null,null,null,null,null,null,null,null,null,"","","","","","","","",""]
[null,"d"," ",""," ",""," ",""," ",""," ",""," ",""," ",""," ",""," ","",null,null,null,null,null,null,null,null,null,"","","","","","","","",""]
[null,"d"," ",""," ",""," ",""," ",""," ",""," ",""," ",""," ",""," ","",null,null,null,null,null,null,null,null,null,"","","","","","","","",""]
[null,"d"," ",""," ",""," ",""," ",""," ",""," ",""," ",""," ",""," ","",null,null,null,null,null,null,null,null,null,"","","","","","","","",""]
[null,"d"," ",""," ",""," ",""," ",""," ",""," ",""," ",""," ",""," ","",null,null,null,null,null,null,null,null,null,"","","","","","","","",""]
[null,"d"," ",""," ",""," ",""," ",""," ",""," ",""," ",""," ",""," ","",null,null,null,null,null,null,null,null,null,"","","","","","","","",""]
[null,"d"," ",""," ",""," ",""," ",""," ",""," ",""," ",""," ",""," ","",null,null,null,null,null,null,null,null,null,"","","","","","","","",""]
[null,"d"," ",""," ",""," ",""," ",""," ",""," ",""," ",""," ",""," ","",null,null,null,null,null,null,null,null,null,"","","","","","","","",""]
[null,"d"," ",""," ",""," ",""," ",""," ",""," ",""," ",""," ",""," ","",null,null,null,null,null,null,null,null,null,"","","","","","","","",""]
[null,"d"," ",""," ",""," ",""," ",""," ",""," ",""," ",""," ",""," ","",null,null,null,null,null,null,null,null,null,"","","","","","","","",""]
[null,"d"," ",""," ",""," ",""," ",""," ",""," ",""," ",""," ",""," ","",null,null,null,null,null,null,null,null,null,"","","","","","","","",""]
[null,"d"," ",""," ",""," ",""," ",""," ",""," ",""," ",""," ",""," ","",null,null,null,null,null,null,null,null,null,"","","","","","","","",""]
[null,"d"," ",""," ",""," ",""," ",""," ",""," ",""," ",""," ",""," ","",null,null,null,null,null,null,null,null,null,"","","","","","","","",""]
[null,"d"," ",""," ",""," ",""," ",""," ",""," ",""," ",""," ",""," ","",null,null,null,null,null,null,null,null,null,"","","","","","","","",""]
[null,"d"," ",""," ",""," ",""," ",""," ",""," ",""," ",""," ",""," ","",null,null,null,null,null,null,null,null,null,"","","","","","","","",""]
[null,"d"," ",""," ",""," ",""," ",""," ",""," ",""," ",""," ",""," ","",null,null,null,null,null,null,null,null,null,"","","","","","","","",""]
[null,"d"," ",""," ",""," ",""," ",""," ",""," ",""," ",""," ",""," ","",null,null,null,null,null,null,null,null,null,"","","","","","","","",""]
[null,"d"," ",""," ",""," ",""," ",""," ",""," ",""," ",""," ",""," ","",null,null,null,null,null,null,null,null,null,"","","","","","","","",""]
[null,{"$f":"IF(EXACT(MID(H643,1,3),\"FID\"),\"f\",\"d\")","v":"d"}," ",{"$f":"IFERROR(_xlfn.NUMBERVALUE(SUBSTITUTE(MID(X643,AJ643+1,AK643-AJ643-1),\".\",\",\"))*25.4,\"\")","v":""}," ",{"$f":"IFERROR(_xlfn.NUMBERVALUE(SUBSTITUTE(MID(X643,AK643+1,AL643-1),\".\",\",\"))*25.4,\"\")","v":""}," ",{"$f":"IFERROR(MID(X643,AD643+1,AE643-AD643-1),\"\")","v":""}," ",{"$f":"IF(X643<>\"\",\"n0000\",\"\")","v":""}," ",{"$f":"IFERROR(_xlfn.NUMBERVALUE(MID(X643,AI643+1,AJ643-AI643-1))+90,\"\")","v":""}," ",{"$f":"IFERROR(MID(X643,AE643+2,AF643-AE643-3),\"\")","v":""}," ",{"$f":"IF(X643<>\"\",\"PP\",\"\")","v":""}," ",{"$f":"IFERROR(MID(X643,AD643+1,AE643-AD643-1),\"\")","v":""}," ",{"$f":"IFERROR(MID(X643,AF643+2,AG643-AF643-3),\"\")","v":""},null,null,null,null,null,null,null,null,null,{"$f":"IF(X643<>\"\",\"0\",\"\")","v":""},{"$f":"IFERROR(SEARCH(\",\",X643,1),\"\")","v":""},{"$f":"IFERROR(SEARCH(\",\",X643,AE643+1),\"\")","v":""},{"$f":"IFERROR(SEARCH(\",\",X643,AF643+1),\"\")","v":""},{"$f":"IFERROR(SEARCH(\",\",X643,AG643+1),\"\")","v":""},{"$f":"IFERROR(SEARCH(\",\",X643,AH643+1),\"\")","v":""},{"$f":"IFERROR(SEARCH(\",\",X643,AI643+1),\"\")","v":""},{"$f":"IFERROR(SEARCH(\",\",X643,AJ643+1),\"\")","v":""},{"$f":"IF(X643<>\"\",LEN(X643),\"\")","v":""}]
[null,"d"," ",""," ",""," ",""," ",""," ",""," ",""," ",""," ",""," ","",null,null,null,null,null,null,null,null,null,"","","","","","","","",""]
[null,"d"," ",""," ",""," ",""," ",""," ",""," ",""," ",""," ",""," ","",null,null,null,null,null,null,null,null,null,"","","","","","","","",""]
[null,"d"," ",""," ",""," ",""," ",""," ",""," ",""," ",""," ",""," ","",null,null,null,null,null,null,null,null,null,"","","","","","","","",""]
[null,"d"," ",""," ",""," ",""," ",""," ",""," ",""," ",""," ",""," ","",null,null,null,null,null,null,null,null,null,"","","","","","","","",""]
[null,"d"," ",""," ",""," ",""," ",""," ",""," ",""," ",""," ",""," ","",null,null,null,null,null,null,null,null,null,"","","","","","","","",""]
[null,"d"," ",""," ",""," ",""," ",""," ",""," ",""," ",""," ",""," ","",null,null,null,null,null,null,null,null,null,"","","","","","","","",""]
[null,"d"," ",""," ",""," ",""," ",""," ",""," ",""," ",""," ",""," ","",null,null,null,null,null,null,null,null,null,"","","","","","","","",""]
[null,"d"," ",""," ",""," ",""," ",""," ",""," ",""," ",""," ",""," ","",null,null,null,null,null,null,null,null,null,"","","","","","","","",""]
[null,"d"," ",""," ",""," ",""," ",""," ",""," ",""," ",""," ",""," ","",null,null,null,null,null,null,null,null,null,"","","","","","","","",""]
[null,"d"," ",""," ",""," ",""," ",""," ",""," ",""," ",""," ",""," ","",null,null,null,null,null,null,null,null,null,"","","","","","","","",""]
[null,"d"," ",""," ",""," ",""," ",""," ",""," ",""," ",""," ",""," ","",null,null,null,null,null,null,null,null,null,"","","","","","","","",""]
[null,"d"," ",""," ",""," ",""," ",""," ",""," ",""," ",""," ",""," ","",null,null,null,null,null,null,null,null,null,"","","","","","","","",""]
[null,"d"," ",""," ",""," ",""," ",""," ",""," ",""," ",""," ",""," ","",null,null,null,null,null,null,null,null,null,"","","","","","","","",""]
[null,"d"," ",""," ",""," ",""," ",""," ",""," ",""," ",""," ",""," ","",null,null,null,null,null,null,null,null,null,"","","","","","","","",""]
[null,"d"," ",""," ",""," ",""," ",""," ",""," ",""," ",""," ",""," ","",null,null,null,null,null,null,null,null,null,"","","","","","","","",""]
[null,"d"," ",""," ",""," ",""," ",""," ",""," ",""," ",""," ",""," ","",null,null,null,null,null,null,null,null,null,"","","","","","","","",""]
[null,"d"," ",""," ",""," ",""," ",""," ",""," ",""," ",""," ",""," ","",null,null,null,null,null,null,null,null,null,"","","","","","","","",""]
[null,"d"," ",""," ",""," ",""," ",""," ",""," ",""," ",""," ",""," ","",null,null,null,null,null,null,null,null,null,"","","","","","","","",""]
[null,"d"," ",""," ",""," ",""," ",""," ",""," ",""," ",""," ",""," ","",null,null,null,null,null,null,null,null,null,"","","","","","","","",""]
[null,"d"," ",""," ",""," ",""," ",""," ",""," ",""," ",""," ",""," ","",null,null,null,null,null,null,null,null,null,"","","","","","","","",""]
[null,"d"," ",""," ",""," ",""," ",""," ",""," ",""," ",""," ",""," ","",null,null,null,null,null,null,null,null,null,"","","","","","","","",""]
[null,"d"," ",""," ",""," ",""," ",""," ",""," ",""," ",""," ",""," ","",null,null,null,null,null,null,null,null,null,"","","","","","","","",""]
[null,"d"," ",""," ",""," ",""," ",""," ",""," ",""," ",""," ",""," ","",null,null,null,null,null,null,null,null,null,"","","","","","","","",""]
[null,"d"," ",""," ",""," ",""," ",""," ",""," ",""," ",""," ",""," ","",null,null,null,null,null,null,null,null,null,"","","","","","","","",""]
[null,"d"," ",""," ",""," ",""," ",""," ",""," ",""," ",""," ",""," ","",null,null,null,null,null,null,null,null,null,"","","","","","","","",""]
[null,"d"," ",""," ",""," ",""," ",""," ",""," ",""," ",""," ",""," ","",null,null,null,null,null,null,null,null,null,"","","","","","","","",""]
[null,"d"," ",""," ",""," ",""," ",""," ",""," ",""," ",""," ",""," ","",null,null,null,null,null,null,null,null,null,"","","","","","","","",""]
[null,"d"," ",""," ",""," ",""," ",""," ",""," ",""," ",""," ",""," ","",null,null,null,null,null,null,null,null,null,"","","","","","","","",""]
[null,"d"," ",""," ",""," ",""," ",""," ",""," ",""," ",""," ",""," ","",null,null,null,null,null,null,null,null,null,"","","","","","","","",""]
[null,"d"," ",""," ",""," ",""," ",""," ",""," ",""," ",""," ",""," ","",null,null,null,null,null,null,null,null,null,"","","","","","","","",""]
[null,"d"," ",""," ",""," ",""," ",""," ",""," ",""," ",""," ",""," ","",null,null,null,null,null,null,null,null,null,"","","","","","","","",""]
[null,"d"," ",""," ",""," ",""," ",""," ",""," ",""," ",""," ",""," ","",null,null,null,null,null,null,null,null,null,"","","","","","","","",""]
[null,"d"," ",""," ",""," ",""," ",""," ",""," ",""," ",""," ",""," ","",null,null,null,null,null,null,null,null,null,"","","","","","","","",""]
[null,"d"," ",""," ",""," ",""," ",""," ",""," ",""," ",""," ",""," ","",null,null,null,null,null,null,null,null,null,"","","","","","","","",""]
[null,"d"," ",""," ",""," ",""," ",""," ",""," ",""," ",""," ",""," ","",null,null,null,null,null,null,null,null,null,"","","","","","","","",""]
[null,"d"," ",""," ",""," ",""," ",""," ",""," ",""," ",""," ",""," ","",null,null,null,null,null,null,null,null,null,"","","","","","","","",""]
[null,"d"," ",""," ",""," ",""," ",""," ",""," ",""," ",""," ",""," ","",null,null,null,null,null,null,null,null,null,"","","","","","","","",""]
[null,"d"," ",""," ",""," ",""," ",""," ",""," ",""," ",""," ",""," ","",null,null,null,null,null,null,null,null,null,"","","","","","","","",""]
[null,"d"," ",""," ",""," ",""," ",""," ",""," ",""," ",""," ",""," ","",null,null,null,null,null,null,null,null,null,"","","","","","","","",""]
[null,"d"," ",""," ",""," ",""," ",""," ",""," ",""," ",""," ",""," ","",null,null,null,null,null,null,null,null,null,"","","","","","","","",""]
[null,"d"," ",""," ",""," ",""," ",""," ",""," ",""," ",""," ",""," ","",null,null,null,null,null,null,null,null,null,"","","","","","","","",""]
[null,"d"," ",""," ",""," ",""," ",""," ",""," ",""," ",""," ",""," ","",null,null,null,null,null,null,null,null,null,"","","","","","","","",""]
[null,"d"," ",""," ",""," ",""," ",""," ",""," ",""," ",""," ",""," ","",null,null,null,null,null,null,null,null,null,"","","","","","","","",""]
[null,"d"," ",""," ",""," ",""," ",""," ",""," ",""," ",""," ",""," ","",null,null,null,null,null,null,null,null,null,"","","","","","","","",""]
[null,"d"," ",""," ",""," ",""," ",""," ",""," ",""," ",""," ",""," ","",null,null,null,null,null,null,null,null,null,"","","","","","","","",""]
[null,"d"," ",""," ",""," ",""," ",""," ",""," ",""," ",""," ",""," ","",null,null,null,null,null,null,null,null,null,"","","","","","","","",""]
[null,"d"," ",""," ",""," ",""," ",""," ",""," ",""," ",""," ",""," ","",null,null,null,null,null,null,null,null,null,"","","","","","","","",""]
[null,"d"," ",""," ",""," ",""," ",""," ",""," ",""," ",""," ",""," ","",null,null,null,null,null,null,null,null,null,"","","","","","","","",""]
[null,"d"," ",""," ",""," ",""," ",""," ",""," ",""," ",""," ",""," ","",null,null,null,null,null,null,null,null,null,"","","","","","","","",""]
[null,"d"," ",""," ",""," ",""," ",""," ",""," ",""," ",""," ",""," ","",null,null,null,null,null,null,null,null,null,"","","","","","","","",""]
[null,"d"," ",""," ",""," ",""," ",""," ",""," ",""," ",""," ",""," ","",null,null,null,null,null,null,null,null,null,"","","","","","","","",""]
[null,"d"," ",""," ",""," ",""," ",""," ",""," ",""," ",""," ",""," ","",null,null,null,null,null,null,null,null,null,"","","","","","","","",""]
[null,"d"," ",""," ",""," ",""," ",""," ",""," ",""," ",""," ",""," ","",null,null,null,null,null,null,null,null,null,"","","","","","","","",""]
[null,"d"," ",""," ",""," ",""," ",""," ",""," ",""," ",""," ",""," ","",null,null,null,null,null,null,null,null,null,"","","","","","","","",""]
[null,"d"," ",""," ",""," ",""," ",""," ",""," ",""," ",""," ",""," ","",null,null,null,null,null,null,null,null,null,"","","","","","","","",""]
[null,"d"," ",""," ",""," ",""," ",""," ",""," ",""," ",""," ",""," ","",null,null,null,null,null,null,null,null,null,"","","","","","","","",""]
[null,"d"," ",""," ",""," ",""," ",""," ",""," ",""," ",""," ",""," ","",null,null,null,null,null,null,null,null,null,"","","","","","","","",""]
[null,"d"," ",""," ",""," ",""," ",""," ",""," ",""," ",""," ",""," ","",null,null,null,null,null,null,null,null,null,"","","","","","","","",""]
[null,"d"," ",""," ",""," ",""," ",""," ",""," ",""," ",""," ",""," ","",null,null,null,null,null,null,null,null,null,"","","","","","","","",""]
[null,"d"," ",""," ",""," ",""," ",""," ",""," ",""," ",""," ",""," ","",null,null,null,null,null,null,null,null,null,"","","","","","","","",""]
[null,"d"," ",""," ",""," ",""," ",""," ",""," ",""," ",""," ",""," ","",null,null,null,null,null,null,null,null,null,"","","","","","","","",""]
[null,"d"," ",""," ",""," ",""," ",""," ",""," ",""," ",""," ",""," ","",null,null,null,null,null,null,null,null,null,"","","","","","","","",""]
[null,"d"," ",""," ",""," ",""," ",""," ",""," ",""," ",""," ",""," ","",null,null,null,null,null,null,null,null,null,"","","","","","","","",""]
[null,{"$f":"IF(EXACT(MID(H707,1,3),\"FID\"),\"f\",\"d\")","v":"d"}," ",{"$f":"IFERROR(_xlfn.NUMBERVALUE(SUBSTITUTE(MID(X707,AJ707+1,AK707-AJ707-1),\".\",\",\"))*25.4,\"\")","v":""}," ",{"$f":"IFERROR(_xlfn.NUMBERVALUE(SUBSTITUTE(MID(X707,AK707+1,AL707-1),\".\",\",\"))*25.4,\"\")","v":""}," ",{"$f":"IFERROR(MID(X707,AD707+1,AE707-AD707-1),\"\")","v":""}," ",{"$f":"IF(X707<>\"\",\"n0000\",\"\")","v":""}," ",{"$f":"IFERROR(_xlfn.NUMBERVALUE(MID(X707,AI707+1,AJ707-AI707-1))+90,\"\")","v":""}," ",{"$f":"IFERROR(MID(X707,AE707+2,AF707-AE707-3),\"\")","v":""}," ",{"$f":"IF(X707<>\"\",\"PP\",\"\")","v":""}," ",{"$f":"IFERROR(MID(X707,AD707+1,AE707-AD707-1),\"\")","v":""}," ",{"$f":"IFERROR(MID(X707,AF707+2,AG707-AF707-3),\"\")","v":""},null,null,null,null,null,null,null,null,null,{"$f":"IF(X707<>\"\",\"0\",\"\")","v":""},{"$f":"IFERROR(SEARCH(\",\",X707,1),\"\")","v":""},{"$f":"IFERROR(SEARCH(\",\",X707,AE707+1),\"\")","v":""},{"$f":"IFERROR(SEARCH(\",\",X707,AF707+1),\"\")","v":""},{"$f":"IFERROR(SEARCH(\",\",X707,AG707+1),\"\")","v":""},{"$f":"IFERROR(SEARCH(\",\",X707,AH707+1),\"\")","v":""},{"$f":"IFERROR(SEARCH(\",\",X707,AI707+1),\"\")","v":""},{"$f":"IFERROR(SEARCH(\",\",X707,AJ707+1),\"\")","v":""},{"$f":"IF(X707<>\"\",LEN(X707),\"\")","v":""}]
[null,"d"," ",""," ",""," ",""," ",""," ",""," ",""," ",""," ",""," ","",null,null,null,null,null,null,null,null,null,"","","","","","","","",""]
[null,"d"," ",""," ",""," ",""," ",""," ",""," ",""," ",""," ",""," ","",null,null,null,null,null,null,null,null,null,"","","","","","","","",""]
[null,"d"," ",""," ",""," ",""," ",""," ",""," ",""," ",""," ",""," ","",null,null,null,null,null,null,null,null,null,"","","","","","","","",""]
[null,"d"," ",""," ",""," ",""," ",""," ",""," ",""," ",""," ",""," ","",null,null,null,null,null,null,null,null,null,"","","","","","","","",""]
[null,"d"," ",""," ",""," ",""," ",""," ",""," ",""," ",""," ",""," ","",null,null,null,null,null,null,null,null,null,"","","","","","","","",""]
[null,"d"," ",""," ",""," ",""," ",""," ",""," ",""," ",""," ",""," ","",null,null,null,null,null,null,null,null,null,"","","","","","","","",""]
[null,"d"," ",""," ",""," ",""," ",""," ",""," ",""," ",""," ",""," ","",null,null,null,null,null,null,null,null,null,"","","","","","","","",""]
[null,"d"," ",""," ",""," ",""," ",""," ",""," ",""," ",""," ",""," ","",null,null,null,null,null,null,null,null,null,"","","","","","","","",""]
[null,"d"," ",""," ",""," ",""," ",""," ",""," ",""," ",""," ",""," ","",null,null,null,null,null,null,null,null,null,"","","","","","","","",""]
[null,"d"," ",""," ",""," ",""," ",""," ",""," ",""," ",""," ",""," ","",null,null,null,null,null,null,null,null,null,"","","","","","","","",""]
[null,"d"," ",""," ",""," ",""," ",""," ",""," ",""," ",""," ",""," ","",null,null,null,null,null,null,null,null,null,"","","","","","","","",""]
[null,"d"," ",""," ",""," ",""," ",""," ",""," ",""," ",""," ",""," ","",null,null,null,null,null,null,null,null,null,"","","","","","","","",""]
[null,"d"," ",""," ",""," ",""," ",""," ",""," ",""," ",""," ",""," ","",null,null,null,null,null,null,null,null,null,"","","","","","","","",""]
[null,"d"," ",""," ",""," ",""," ",""," ",""," ",""," ",""," ",""," ","",null,null,null,null,null,null,null,null,null,"","","","","","","","",""]
[null,"d"," ",""," ",""," ",""," ",""," ",""," ",""," ",""," ",""," ","",null,null,null,null,null,null,null,null,null,"","","","","","","","",""]
[null,"d"," ",""," ",""," ",""," ",""," ",""," ",""," ",""," ",""," ","",null,null,null,null,null,null,null,null,null,"","","","","","","","",""]
[null,"d"," ",""," ",""," ",""," ",""," ",""," ",""," ",""," ",""," ","",null,null,null,null,null,null,null,null,null,"","","","","","","","",""]
[null,"d"," ",""," ",""," ",""," ",""," ",""," ",""," ",""," ",""," ","",null,null,null,null,null,null,null,null,null,"","","","","","","","",""]
[null,"d"," ",""," ",""," ",""," ",""," ",""," ",""," ",""," ",""," ","",null,null,null,null,null,null,null,null,null,"","","","","","","","",""]
[null,"d"," ",""," ",""," ",""," ",""," ",""," ",""," ",""," ",""," ","",null,null,null,null,null,null,null,null,null,"","","","","","","","",""]
[null,"d"," ",""," ",""," ",""," ",""," ",""," ",""," ",""," ",""," ","",null,null,null,null,null,null,null,null,null,"","","","","","","","",""]
[null,"d"," ",""," ",""," ",""," ",""," ",""," ",""," ",""," ",""," ","",null,null,null,null,null,null,null,null,null,"","","","","","","","",""]
[null,"d"," ",""," ",""," ",""," ",""," ",""," ",""," ",""," ",""," ","",null,null,null,null,null,null,null,null,null,"","","","","","","","",""]
[null,"d"," ",""," ",""," ",""," ",""," ",""," ",""," ",""," ",""," ","",null,null,null,null,null,null,null,null,null,"","","","","","","","",""]
[null,"d"," ",""," ",""," ",""," ",""," ",""," ",""," ",""," ",""," ","",null,null,null,null,null,null,null,null,null,"","","","","","","","",""]
[null,"d"," ",""," ",""," ",""," ",""," ",""," ",""," ",""," ",""," ","",null,null,null,null,null,null,null,null,null,"","","","","","","","",""]
[null,"d"," ",""," ",""," ",""," ",""," ",""," ",""," ",""," ",""," ","",null,null,null,null,null,null,null,null,null,"","","","","","","","",""]
[null,"d"," ",""," ",""," ",""," ",""," ",""," ",""," ",""," ",""," ","",null,null,null,null,null,null,null,null,null,"","","","","","","","",""]
[null,"d"," ",""," ",""," ",""," ",""," ",""," ",""," ",""," ",""," ","",null,null,null,null,null,null,null,null,null,"","","","","","","","",""]
[null,"d"," ",""," ",""," ",""," ",""," ",""," ",""," ",""," ",""," ","",null,null,null,null,null,null,null,null,null,"","","","","","","","",""]
[null,"d"," ",""," ",""," ",""," ",""," ",""," ",""," ",""," ",""," ","",null,null,null,null,null,null,null,null,null,"","","","","","","","",""]
[null,"d"," ",""," ",""," ",""," ",""," ",""," ",""," ",""," ",""," ","",null,null,null,null,null,null,null,null,null,"","","","","","","","",""]
[null,"d"," ",""," ",""," ",""," ",""," ",""," ",""," ",""," ",""," ","",null,null,null,null,null,null,null,null,null,"","","","","","","","",""]
[null,"d"," ",""," ",""," ",""," ",""," ",""," ",""," ",""," ",""," ","",null,null,null,null,null,null,null,null,null,"","","","","","","","",""]
[null,"d"," ",""," ",""," ",""," ",""," ",""," ",""," ",""," ",""," ","",null,null,null,null,null,null,null,null,null,"","","","","","","","",""]
[null,"d"," ",""," ",""," ",""," ",""," ",""," ",""," ",""," ",""," ","",null,null,null,null,null,null,null,null,null,"","","","","","","","",""]
[null,"d"," ",""," ",""," ",""," ",""," ",""," ",""," ",""," ",""," ","",null,null,null,null,null,null,null,null,null,"","","","","","","","",""]
[null,"d"," ",""," ",""," ",""," ",""," ",""," ",""," ",""," ",""," ","",null,null,null,null,null,null,null,null,null,"","","","","","","","",""]
[null,"d"," ",""," ",""," ",""," ",""," ",""," ",""," ",""," ",""," ","",null,null,null,null,null,null,null,null,null,"","","","","","","","",""]
[null,"d"," ",""," ",""," ",""," ",""," ",""," ",""," ",""," ",""," ","",null,null,null,null,null,null,null,null,null,"","","","","","","","",""]
[null,"d"," ",""," ",""," ",""," ",""," ",""," ",""," ",""," ",""," ","",null,null,null,null,null,null,null,null,null,"","","","","","","","",""]
[null,"d"," ",""," ",""," ",""," ",""," ",""," ",""," ",""," ",""," ","",null,null,null,null,null,null,null,null,null,"","","","","","","","",""]
[null,"d"," ",""," ",""," ",""," ",""," ",""," ",""," ",""," ",""," ","",null,null,null,null,null,null,null,null,null,"","","","","","","","",""]
[null,"d"," ",""," ",""," ",""," ",""," ",""," ",""," ",""," ",""," ","",null,null,null,null,null,null,null,null,null,"","","","","","","","",""]
[null,"d"," ",""," ",""," ",""," ",""," ",""," ",""," ",""," ",""," ","",null,null,null,null,null,null,null,null,null,"","","","","","","","",""]
[null,"d"," ",""," ",""," ",""," ",""," ",""," ",""," ",""," ",""," ","",null,null,null,null,null,null,null,null,null,"","","","","","","","",""]
[null,"d"," ",""," ",""," ",""," ",""," ",""," ",""," ",""," ",""," ","",null,null,null,null,null,null,null,null,null,"","","","","","","","",""]
[null,"d"," ",""," ",""," ",""," ",""," ",""," ",""," ",""," ",""," ","",null,null,null,null,null,null,null,null,null,"","","","","","","","",""]
[null,"d"," ",""," ",""," ",""," ",""," ",""," ",""," ",""," ",""," ","",null,null,null,null,null,null,null,null,null,"","","","","","","","",""]
[null,"d"," ",""," ",""," ",""," ",""," ",""," ",""," ",""," ",""," ","",null,null,null,null,null,null,null,null,null,"","","","","","","","",""]
[null,"d"," ",""," ",""," ",""," ",""," ",""," ",""," ",""," ",""," ","",null,null,null,null,null,null,null,null,null,"","","","","","","","",""]
[null,"d"," ",""," ",""," ",""," ",""," ",""," ",""," ",""," ",""," ","",null,null,null,null,null,null,null,null,null,"","","","","","","","",""]
[null,"d"," ",""," ",""," ",""," ",""," ",""," ",""," ",""," ",""," ","",null,null,null,null,null,null,null,null,null,"","","","","","","","",""]
[null,"d"," ",""," ",""," ",""," ",""," ",""," ",""," ",""," ",""," ","",null,null,null,null,null,null,null,null,null,"","","","","","","","",""]
[null,"d"," ",""," ",""," ",""," ",""," ",""," ",""," ",""," ",""," ","",null,null,null,null,null,null,null,null,null,"","","","","","","","",""]
[null,"d"," ",""," ",""," ",""," ",""," ",""," ",""," ",""," ",""," ","",null,null,null,null,null,null,null,null,null,"","","","","","","","",""]
[null,"d"," ",""," ",""," ",""," ",""," ",""," ",""," ",""," ",""," ","",null,null,null,null,null,null,null,null,null,"","","","","","","","",""]
[null,"d"," ",""," ",""," ",""," ",""," ",""," ",""," ",""," ",""," ","",null,null,null,null,null,null,null,null,null,"","","","","","","","",""]
[null,"d"," ",""," ",""," ",""," ",""," ",""," ",""," ",""," ",""," ","",null,null,null,null,null,null,null,null,null,"","","","","","","","",""]
[null,"d"," ",""," ",""," ",""," ",""," ",""," ",""," ",""," ",""," ","",null,null,null,null,null,null,null,null,null,"","","","","","","","",""]
[null,"d"," ",""," ",""," ",""," ",""," ",""," ",""," ",""," ",""," ","",null,null,null,null,null,null,null,null,null,"","","","","","","","",""]
[null,"d"," ",""," ",""," ",""," ",""," ",""," ",""," ",""," ",""," ","",null,null,null,null,null,null,null,null,null,"","","","","","","","",""]
[null,"d"," ",""," ",""," ",""," ",""," ",""," ",""," ",""," ",""," ","",null,null,null,null,null,null,null,null,null,"","","","","","","","",""]
[null,{"$f":"IF(EXACT(MID(H771,1,3),\"FID\"),\"f\",\"d\")","v":"d"}," ",{"$f":"IFERROR(_xlfn.NUMBERVALUE(SUBSTITUTE(MID(X771,AJ771+1,AK771-AJ771-1),\".\",\",\"))*25.4,\"\")","v":""}," ",{"$f":"IFERROR(_xlfn.NUMBERVALUE(SUBSTITUTE(MID(X771,AK771+1,AL771-1),\".\",\",\"))*25.4,\"\")","v":""}," ",{"$f":"IFERROR(MID(X771,AD771+1,AE771-AD771-1),\"\")","v":""}," ",{"$f":"IF(X771<>\"\",\"n0000\",\"\")","v":""}," ",{"$f":"IFERROR(_xlfn.NUMBERVALUE(MID(X771,AI771+1,AJ771-AI771-1))+90,\"\")","v":""}," ",{"$f":"IFERROR(MID(X771,AE771+2,AF771-AE771-3),\"\")","v":""}," ",{"$f":"IF(X771<>\"\",\"PP\",\"\")","v":""}," ",{"$f":"IFERROR(MID(X771,AD771+1,AE771-AD771-1),\"\")","v":""}," ",{"$f":"IFERROR(MID(X771,AF771+2,AG771-AF771-3),\"\")","v":""},null,null,null,null,null,null,null,null,null,{"$f":"IF(X771<>\"\",\"0\",\"\")","v":""},{"$f":"IFERROR(SEARCH(\",\",X771,1),\"\")","v":""},{"$f":"IFERROR(SEARCH(\",\",X771,AE771+1),\"\")","v":""},{"$f":"IFERROR(SEARCH(\",\",X771,AF771+1),\"\")","v":""},{"$f":"IFERROR(SEARCH(\",\",X771,AG771+1),\"\")","v":""},{"$f":"IFERROR(SEARCH(\",\",X771,AH771+1),\"\")","v":""},{"$f":"IFERROR(SEARCH(\",\",X771,AI771+1),\"\")","v":""},{"$f":"IFERROR(SEARCH(\",\",X771,AJ771+1),\"\")","v":""},{"$f":"IF(X771<>\"\",LEN(X771),\"\")","v":""}]
[null,"d"," ",""," ",""," ",""," ",""," ",""," ",""," ",""," ",""," ","",null,null,null,null,null,null,null,null,null,"","","","","","","","",""]
[null,"d"," ",""," ",""," ",""," ",""," ",""," ",""," ",""," ",""," ","",null,null,null,null,null,null,null,null,null,"","","","","","","","",""]
[null,"d"," ",""," ",""," ",""," ",""," ",""," ",""," ",""," ",""," ","",null,null,null,null,null,null,null,null,null,"","","","","","","","",""]
[null,"d"," ",""," ",""," ",""," ",""," ",""," ",""," ",""," ",""," ","",null,null,null,null,null,null,null,null,null,"","","","","","","","",""]
[null,"d"," ",""," ",""," ",""," ",""," ",""," ",""," ",""," ",""," ","",null,null,null,null,null,null,null,null,null,"","","","","","","","",""]
[null,"d"," ",""," ",""," ",""," ",""," ",""," ",""," ",""," ",""," ","",null,null,null,null,null,null,null,null,null,"","","","","","","","",""]
[null,"d"," ",""," ",""," ",""," ",""," ",""," ",""," ",""," ",""," ","",null,null,null,null,null,null,null,null,null,"","","","","","","","",""]
[null,"d"," ",""," ",""," ",""," ",""," ",""," ",""," ",""," ",""," ","",null,null,null,null,null,null,null,null,null,"","","","","","","","",""]
[null,"d"," ",""," ",""," ",""," ",""," ",""," ",""," ",""," ",""," ","",null,null,null,null,null,null,null,null,null,"","","","","","","","",""]
[null,"d"," ",""," ",""," ",""," ",""," ",""," ",""," ",""," ",""," ","",null,null,null,null,null,null,null,null,null,"","","","","","","","",""]
[null,"d"," ",""," ",""," ",""," ",""," ",""," ",""," ",""," ",""," ","",null,null,null,null,null,null,null,null,null,"","","","","","","","",""]
[null,"d"," ",""," ",""," ",""," ",""," ",""," ",""," ",""," ",""," ","",null,null,null,null,null,null,null,null,null,"","","","","","","","",""]
[null,"d"," ",""," ",""," ",""," ",""," ",""," ",""," ",""," ",""," ","",null,null,null,null,null,null,null,null,null,"","","","","","","","",""]
[null,"d"," ",""," ",""," ",""," ",""," ",""," ",""," ",""," ",""," ","",null,null,null,null,null,null,null,null,null,"","","","","","","","",""]
[null,"d"," ",""," ",""," ",""," ",""," ",""," ",""," ",""," ",""," ","",null,null,null,null,null,null,null,null,null,"","","","","","","","",""]
[null,"d"," ",""," ",""," ",""," ",""," ",""," ",""," ",""," ",""," ","",null,null,null,null,null,null,null,null,null,"","","","","","","","",""]
[null,"d"," ",""," ",""," ",""," ",""," ",""," ",""," ",""," ",""," ","",null,null,null,null,null,null,null,null,null,"","","","","","","","",""]
[null,"d"," ",""," ",""," ",""," ",""," ",""," ",""," ",""," ",""," ","",null,null,null,null,null,null,null,null,null,"","","","","","","","",""]
[null,"d"," ",""," ",""," ",""," ",""," ",""," ",""," ",""," ",""," ","",null,null,null,null,null,null,null,null,null,"","","","","","","","",""]
[null,"d"," ",""," ",""," ",""," ",""," ",""," ",""," ",""," ",""," ","",null,null,null,null,null,null,null,null,null,"","","","","","","","",""]
[null,"d"," ",""," ",""," ",""," ",""," ",""," ",""," ",""," ",""," ","",null,null,null,null,null,null,null,null,null,"","","","","","","","",""]
[null,"d"," ",""," ",""," ",""," ",""," ",""," ",""," ",""," ",""," ","",null,null,null,null,null,null,null,null,null,"","","","","","","","",""]
[null,"d"," ",""," ",""," ",""," ",""," ",""," ",""," ",""," ",""," ","",null,null,null,null,null,null,null,null,null,"","","","","","","","",""]
[null,"d"," ",""," ",""," ",""," ",""," ",""," ",""," ",""," ",""," ","",null,null,null,null,null,null,null,null,null,"","","","","","","","",""]
[null,"d"," ",""," ",""," ",""," ",""," ",""," ",""," ",""," ",""," ","",null,null,null,null,null,null,null,null,null,"","","","","","","","",""]
[null,"d"," ",""," ",""," ",""," ",""," ",""," ",""," ",""," ",""," ","",null,null,null,null,null,null,null,null,null,"","","","","","","","",""]
[null,"d"," ",""," ",""," ",""," ",""," ",""," ",""," ",""," ",""," ","",null,null,null,null,null,null,null,null,null,"","","","","","","","",""]
[null,"d"," ",""," ",""," ",""," ",""," ",""," ",""," ",""," ",""," ","",null,null,null,null,null,null,null,null,null,"","","","","","","","",""]
[null,"d"," ",""," ",""," ",""," ",""," ",""," ",""," ",""," ",""," ","",null,null,null,null,null,null,null,null,null,"","","","","","","","",""]
[null,"d"," ",""," ",""," ",""," ",""," ",""," ",""," ",""," ",""," ","",null,null,null,null,null,null,null,null,null,"","","","","","","","",""]
[null,"d"," ",""," ",""," ",""," ",""," ",""," ",""," ",""," ",""," ","",null,null,null,null,null,null,null,null,null,"","","","","","","","",""]
[null,"d"," ",""," ",""," ",""," ",""," ",""," ",""," ",""," ",""," ","",null,null,null,null,null,null,null,null,null,"","","","","","","","",""]
[null,"d"," ",""," ",""," ",""," ",""," ",""," ",""," ",""," ",""," ","",null,null,null,null,null,null,null,null,null,"","","","","","","","",""]
[null,"d"," ",""," ",""," ",""," ",""," ",""," ",""," ",""," ",""," ","",null,null,null,null,null,null,null,null,null,"","","","","","","","",""]
[null,"d"," ",""," ",""," ",""," ",""," ",""," ",""," ",""," ",""," ","",null,null,null,null,null,null,null,null,null,"","","","","","","","",""]
[null,"d"," ",""," ",""," ",""," ",""," ",""," ",""," ",""," ",""," ","",null,null,null,null,null,null,null,null,null,"","","","","","","","",""]
[null,"d"," ",""," ",""," ",""," ",""," ",""," ",""," ",""," ",""," ","",null,null,null,null,null,null,null,null,null,"","","","","","","","",""]
[null,"d"," ",""," ",""," ",""," ",""," ",""," ",""," ",""," ",""," ","",null,null,null,null,null,null,null,null,null,"","","","","","","","",""]
[null,"d"," ",""," ",""," ",""," ",""," ",""," ",""," ",""," ",""," ","",null,null,null,null,null,null,null,null,null,"","","","","","","","",""]
[null,"d"," ",""," ",""," ",""," ",""," ",""," ",""," ",""," ",""," ","",null,null,null,null,null,null,null,null,null,"","","","","","","","",""]
[null,"d"," ",""," ",""," ",""," ",""," ",""," ",""," ",""," ",""," ","",null,null,null,null,null,null,null,null,null,"","","","","","","","",""]
[null,"d"," ",""," ",""," ",""," ",""," ",""," ",""," ",""," ",""," ","",null,null,null,null,null,null,null,null,null,"","","","","","","","",""]
[null,"d"," ",""," ",""," ",""," ",""," ",""," ",""," ",""," ",""," ","",null,null,null,null,null,null,null,null,null,"","","","","","","","",""]
[null,"d"," ",""," ",""," ",""," ",""," ",""," ",""," ",""," ",""," ","",null,null,null,null,null,null,null,null,null,"","","","","","","","",""]
[null,"d"," ",""," ",""," ",""," ",""," ",""," ",""," ",""," ",""," ","",null,null,null,null,null,null,null,null,null,"","","","","","","","",""]
[null,"d"," ",""," ",""," ",""," ",""," ",""," ",""," ",""," ",""," ","",null,null,null,null,null,null,null,null,null,"","","","","","","","",""]
[null,"d"," ",""," ",""," ",""," ",""," ",""," ",""," ",""," ",""," ","",null,null,null,null,null,null,null,null,null,"","","","","","","","",""]
[null,"d"," ",""," ",""," ",""," ",""," ",""," ",""," ",""," ",""," ","",null,null,null,null,null,null,null,null,null,"","","","","","","","",""]
[null,"d"," ",""," ",""," ",""," ",""," ",""," ",""," ",""," ",""," ","",null,null,null,null,null,null,null,null,null,"","","","","","","","",""]
[null,"d"," ",""," ",""," ",""," ",""," ",""," ",""," ",""," ",""," ","",null,null,null,null,null,null,null,null,null,"","","","","","","","",""]
[null,"d"," ",""," ",""," ",""," ",""," ",""," ",""," ",""," ",""," ","",null,null,null,null,null,null,null,null,null,"","","","","","","","",""]
[null,"d"," ",""," ",""," ",""," ",""," ",""," ",""," ",""," ",""," ","",null,null,null,null,null,null,null,null,null,"","","","","","","","",""]
[null,"d"," ",""," ",""," ",""," ",""," ",""," ",""," ",""," ",""," ","",null,null,null,null,null,null,null,null,null,"","","","","","","","",""]
[null,"d"," ",""," ",""," ",""," ",""," ",""," ",""," ",""," ",""," ","",null,null,null,null,null,null,null,null,null,"","","","","","","","",""]
[null,"d"," ",""," ",""," ",""," ",""," ",""," ",""," ",""," ",""," ","",null,null,null,null,null,null,null,null,null,"","","","","","","","",""]
[null,"d"," ",""," ",""," ",""," ",""," ",""," ",""," ",""," ",""," ","",null,null,null,null,null,null,null,null,null,"","","","","","","","",""]
[null,"d"," ",""," ",""," ",""," ",""," ",""," ",""," ",""," ",""," ","",null,null,null,null,null,null,null,null,null,"","","","","","","","",""]
[null,"d"," ",""," ",""," ",""," ",""," ",""," ",""," ",""," ",""," ","",null,null,null,null,null,null,null,null,null,"","","","","","","","",""]
[null,"d"," ",""," ",""," ",""," ",""," ",""," ",""," ",""," ",""," ","",null,null,null,null,null,null,null,null,null,"","","","","","","","",""]
[null,"d"," ",""," ",""," ",""," ",""," ",""," ",""," ",""," ",""," ","",null,null,null,null,null,null,null,null,null,"","","","","","","","",""]
[null,"d"," ",""," ",""," ",""," ",""," ",""," ",""," ",""," ",""," ","",null,null,null,null,null,null,null,null,null,"","","","","","","","",""]
[null,"d"," ",""," ",""," ",""," ",""," ",""," ",""," ",""," ",""," ","",null,null,null,null,null,null,null,null,null,"","","","","","","","",""]
[null,"d"," ",""," ",""," ",""," ",""," ",""," ",""," ",""," ",""," ","",null,null,null,null,null,null,null,null,null,"","","","","","","","",""]
[null,{"$f":"IF(EXACT(MID(H835,1,3),\"FID\"),\"f\",\"d\")","v":"d"}," ",{"$f":"IFERROR(_xlfn.NUMBERVALUE(SUBSTITUTE(MID(X835,AJ835+1,AK835-AJ835-1),\".\",\",\"))*25.4,\"\")","v":""}," ",{"$f":"IFERROR(_xlfn.NUMBERVALUE(SUBSTITUTE(MID(X835,AK835+1,AL835-1),\".\",\",\"))*25.4,\"\")","v":""}," ",{"$f":"IFERROR(MID(X835,AD835+1,AE835-AD835-1),\"\")","v":""}," ",{"$f":"IF(X835<>\"\",\"n0000\",\"\")","v":""}," ",{"$f":"IFERROR(_xlfn.NUMBERVALUE(MID(X835,AI835+1,AJ835-AI835-1))+90,\"\")","v":""}," ",{"$f":"IFERROR(MID(X835,AE835+2,AF835-AE835-3),\"\")","v":""}," ",{"$f":"IF(X835<>\"\",\"PP\",\"\")","v":""}," ",{"$f":"IFERROR(MID(X835,AD835+1,AE835-AD835-1),\"\")","v":""}," ",{"$f":"IFERROR(MID(X835,AF835+2,AG835-AF835-3),\"\")","v":""},null,null,null,null,null,null,null,null,null,{"$f":"IF(X835<>\"\",\"0\",\"\")","v":""},{"$f":"IFERROR(SEARCH(\",\",X835,1),\"\")","v":""},{"$f":"IFERROR(SEARCH(\",\",X835,AE835+1),\"\")","v":""},{"$f":"IFERROR(SEARCH(\",\",X835,AF835+1),\"\")","v":""},{"$f":"IFERROR(SEARCH(\",\",X835,AG835+1),\"\")","v":""},{"$f":"IFERROR(SEARCH(\",\",X835,AH835+1),\"\")","v":""},{"$f":"IFERROR(SEARCH(\",\",X835,AI835+1),\"\")","v":""},{"$f":"IFERROR(SEARCH(\",\",X835,AJ835+1),\"\")","v":""},{"$f":"IF(X835<>\"\",LEN(X835),\"\")","v":""}]
[null,"d"," ",""," ",""," ",""," ",""," ",""," ",""," ",""," ",""," ","",null,null,null,null,null,null,null,null,null,"","","","","","","","",""]
[null,"d"," ",""," ",""," ",""," ",""," ",""," ",""," ",""," ",""," ","",null,null,null,null,null,null,null,null,null,"","","","","","","","",""]
[null,"d"," ",""," ",""," ",""," ",""," ",""," ",""," ",""," ",""," ","",null,null,null,null,null,null,null,null,null,"","","","","","","","",""]
[null,"d"," ",""," ",""," ",""," ",""," ",""," ",""," ",""," ",""," ","",null,null,null,null,null,null,null,null,null,"","","","","","","","",""]
[null,"d"," ",""," ",""," ",""," ",""," ",""," ",""," ",""," ",""," ","",null,null,null,null,null,null,null,null,null,"","","","","","","","",""]
[null,"d"," ",""," ",""," ",""," ",""," ",""," ",""," ",""," ",""," ","",null,null,null,null,null,null,null,null,null,"","","","","","","","",""]
[null,"d"," ",""," ",""," ",""," ",""," ",""," ",""," ",""," ",""," ","",null,null,null,null,null,null,null,null,null,"","","","","","","","",""]
[null,"d"," ",""," ",""," ",""," ",""," ",""," ",""," ",""," ",""," ","",null,null,null,null,null,null,null,null,null,"","","","","","","","",""]
[null,"d"," ",""," ",""," ",""," ",""," ",""," ",""," ",""," ",""," ","",null,null,null,null,null,null,null,null,null,"","","","","","","","",""]
[null,"d"," ",""," ",""," ",""," ",""," ",""," ",""," ",""," ",""," ","",null,null,null,null,null,null,null,null,null,"","","","","","","","",""]
[null,"d"," ",""," ",""," ",""," ",""," ",""," ",""," ",""," ",""," ","",null,null,null,null,null,null,null,null,null,"","","","","","","","",""]
[null,"d"," ",""," ",""," ",""," ",""," ",""," ",""," ",""," ",""," ","",null,null,null,null,null,null,null,null,null,"","","","","","","","",""]
[null,"d"," ",""," ",""," ",""," ",""," ",""," ",""," ",""," ",""," ","",null,null,null,null,null,null,null,null,null,"","","","","","","","",""]
[null,"d"," ",""," ",""," ",""," ",""," ",""," ",""," ",""," ",""," ","",null,null,null,null,null,null,null,null,null,"","","","","","","","",""]
[null,"d"," ",""," ",""," ",""," ",""," ",""," ",""," ",""," ",""," ","",null,null,null,null,null,null,null,null,null,"","","","","","","","",""]
[null,"d"," ",""," ",""," ",""," ",""," ",""," ",""," ",""," ",""," ","",null,null,null,null,null,null,null,null,null,"","","","","","","","",""]
[null,"d"," ",""," ",""," ",""," ",""," ",""," ",""," ",""," ",""," ","",null,null,null,null,null,null,null,null,null,"","","","","","","","",""]
[null,"d"," ",""," ",""," ",""," ",""," ",""," ",""," ",""," ",""," ","",null,null,null,null,null,null,null,null,null,"","","","","","","","",""]
[null,"d"," ",""," ",""," ",""," ",""," ",""," ",""," ",""," ",""," ","",null,null,null,null,null,null,null,null,null,"","","","","","","","",""]
[null,"d"," ",""," ",""," ",""," ",""," ",""," ",""," ",""," ",""," ","",null,null,null,null,null,null,null,null,null,"","","","","","","","",""]
[null,"d"," ",""," ",""," ",""," ",""," ",""," ",""," ",""," ",""," ","",null,null,null,null,null,null,null,null,null,"","","","","","","","",""]
[null,"d"," ",""," ",""," ",""," ",""," ",""," ",""," ",""," ",""," ","",null,null,null,null,null,null,null,null,null,"","","","","","","","",""]
[null,"d"," ",""," ",""," ",""," ",""," ",""," ",""," ",""," ",""," ","",null,null,null,null,null,null,null,null,null,"","","","","","","","",""]
[null,"d"," ",""," ",""," ",""," ",""," ",""," ",""," ",""," ",""," ","",null,null,null,null,null,null,null,null,null,"","","","","","","","",""]
[null,"d"," ",""," ",""," ",""," ",""," ",""," ",""," ",""," ",""," ","",null,null,null,null,null,null,null,null,null,"","","","","","","","",""]
[null,"d"," ",""," ",""," ",""," ",""," ",""," ",""," ",""," ",""," ","",null,null,null,null,null,null,null,null,null,"","","","","","","","",""]
[null,"d"," ",""," ",""," ",""," ",""," ",""," ",""," ",""," ",""," ","",null,null,null,null,null,null,null,null,null,"","","","","","","","",""]
[null,"d"," ",""," ",""," ",""," ",""," ",""," ",""," ",""," ",""," ","",null,null,null,null,null,null,null,null,null,"","","","","","","","",""]
[null,"d"," ",""," ",""," ",""," ",""," ",""," ",""," ",""," ",""," ","",null,null,null,null,null,null,null,null,null,"","","","","","","","",""]
[null,"d"," ",""," ",""," ",""," ",""," ",""," ",""," ",""," ",""," ","",null,null,null,null,null,null,null,null,null,"","","","","","","","",""]
[null,"d"," ",""," ",""," ",""," ",""," ",""," ",""," ",""," ",""," ","",null,null,null,null,null,null,null,null,null,"","","","","","","","",""]
[null,"d"," ",""," ",""," ",""," ",""," ",""," ",""," ",""," ",""," ","",null,null,null,null,null,null,null,null,null,"","","","","","","","",""]
[null,"d"," ",""," ",""," ",""," ",""," ",""," ",""," ",""," ",""," ","",null,null,null,null,null,null,null,null,null,"","","","","","","","",""]
[null,"d"," ",""," ",""," ",""," ",""," ",""," ",""," ",""," ",""," ","",null,null,null,null,null,null,null,null,null,"","","","","","","","",""]
[null,"d"," ",""," ",""," ",""," ",""," ",""," ",""," ",""," ",""," ","",null,null,null,null,null,null,null,null,null,"","","","","","","","",""]
[null,"d"," ",""," ",""," ",""," ",""," ",""," ",""," ",""," ",""," ","",null,null,null,null,null,null,null,null,null,"","","","","","","","",""]
[null,"d"," ",""," ",""," ",""," ",""," ",""," ",""," ",""," ",""," ","",null,null,null,null,null,null,null,null,null,"","","","","","","","",""]
[null,"d"," ",""," ",""," ",""," ",""," ",""," ",""," ",""," ",""," ","",null,null,null,null,null,null,null,null,null,"","","","","","","","",""]
[null,"d"," ",""," ",""," ",""," ",""," ",""," ",""," ",""," ",""," ","",null,null,null,null,null,null,null,null,null,"","","","","","","","",""]
[null,"d"," ",""," ",""," ",""," ",""," ",""," ",""," ",""," ",""," ","",null,null,null,null,null,null,null,null,null,"","","","","","","","",""]
[null,"d"," ",""," ",""," ",""," ",""," ",""," ",""," ",""," ",""," ","",null,null,null,null,null,null,null,null,null,"","","","","","","","",""]
[null,"d"," ",""," ",""," ",""," ",""," ",""," ",""," ",""," ",""," ","",null,null,null,null,null,null,null,null,null,"","","","","","","","",""]
[null,"d"," ",""," ",""," ",""," ",""," ",""," ",""," ",""," ",""," ","",null,null,null,null,null,null,null,null,null,"","","","","","","","",""]
[null,"d"," ",""," ",""," ",""," ",""," ",""," ",""," ",""," ",""," ","",null,null,null,null,null,null,null,null,null,"","","","","","","","",""]
[null,"d"," ",""," ",""," ",""," ",""," ",""," ",""," ",""," ",""," ","",null,null,null,null,null,null,null,null,null,"","","","","","","","",""]
[null,"d"," ",""," ",""," ",""," ",""," ",""," ",""," ",""," ",""," ","",null,null,null,null,null,null,null,null,null,"","","","","","","","",""]
[null,"d"," ",""," ",""," ",""," ",""," ",""," ",""," ",""," ",""," ","",null,null,null,null,null,null,null,null,null,"","","","","","","","",""]
[null,"d"," ",""," ",""," ",""," ",""," ",""," ",""," ",""," ",""," ","",null,null,null,null,null,null,null,null,null,"","","","","","","","",""]
[null,"d"," ",""," ",""," ",""," ",""," ",""," ",""," ",""," ",""," ","",null,null,null,null,null,null,null,null,null,"","","","","","","","",""]
[null,"d"," ",""," ",""," ",""," ",""," ",""," ",""," ",""," ",""," ","",null,null,null,null,null,null,null,null,null,"","","","","","","","",""]
[null,"d"," ",""," ",""," ",""," ",""," ",""," ",""," ",""," ",""," ","",null,null,null,null,null,null,null,null,null,"","","","","","","","",""]
[null,"d"," ",""," ",""," ",""," ",""," ",""," ",""," ",""," ",""," ","",null,null,null,null,null,null,null,null,null,"","","","","","","","",""]
[null,"d"," ",""," ",""," ",""," ",""," ",""," ",""," ",""," ",""," ","",null,null,null,null,null,null,null,null,null,"","","","","","","","",""]
[null,"d"," ",""," ",""," ",""," ",""," ",""," ",""," ",""," ",""," ","",null,null,null,null,null,null,null,null,null,"","","","","","","","",""]
[null,"d"," ",""," ",""," ",""," ",""," ",""," ",""," ",""," ",""," ","",null,null,null,null,null,null,null,null,null,"","","","","","","","",""]
[null,"d"," ",""," ",""," ",""," ",""," ",""," ",""," ",""," ",""," ","",null,null,null,null,null,null,null,null,null,"","","","","","","","",""]
[null,"d"," ",""," ",""," ",""," ",""," ",""," ",""," ",""," ",""," ","",null,null,null,null,null,null,null,null,null,"","","","","","","","",""]
[null,"d"," ",""," ",""," ",""," ",""," ",""," ",""," ",""," ",""," ","",null,null,null,null,null,null,null,null,null,"","","","","","","","",""]
[null,"d"," ",""," ",""," ",""," ",""," ",""," ",""," ",""," ",""," ","",null,null,null,null,null,null,null,null,null,"","","","","","","","",""]
[null,"d"," ",""," ",""," ",""," ",""," ",""," ",""," ",""," ",""," ","",null,null,null,null,null,null,null,null,null,"","","","","","","","",""]
[null,"d"," ",""," ",""," ",""," ",""," ",""," ",""," ",""," ",""," ","",null,null,null,null,null,null,null,null,null,"","","","","","","","",""]
[null,"d"," ",""," ",""," ",""," ",""," ",""," ",""," ",""," ",""," ","",null,null,null,null,null,null,null,null,null,"","","","","","","","",""]
[null,"d"," ",""," ",""," ",""," ",""," ",""," ",""," ",""," ",""," ","",null,null,null,null,null,null,null,null,null,"","","","","","","","",""]
[null,{"$f":"IF(EXACT(MID(H899,1,3),\"FID\"),\"f\",\"d\")","v":"d"}," ",{"$f":"IFERROR(_xlfn.NUMBERVALUE(SUBSTITUTE(MID(X899,AJ899+1,AK899-AJ899-1),\".\",\",\"))*25.4,\"\")","v":""}," ",{"$f":"IFERROR(_xlfn.NUMBERVALUE(SUBSTITUTE(MID(X899,AK899+1,AL899-1),\".\",\",\"))*25.4,\"\")","v":""}," ",{"$f":"IFERROR(MID(X899,AD899+1,AE899-AD899-1),\"\")","v":""}," ",{"$f":"IF(X899<>\"\",\"n0000\",\"\")","v":""}," ",{"$f":"IFERROR(_xlfn.NUMBERVALUE(MID(X899,AI899+1,AJ899-AI899-1))+90,\"\")","v":""}," ",{"$f":"IFERROR(MID(X899,AE899+2,AF899-AE899-3),\"\")","v":""}," ",{"$f":"IF(X899<>\"\",\"PP\",\"\")","v":""}," ",{"$f":"IFERROR(MID(X899,AD899+1,AE899-AD899-1),\"\")","v":""}," ",{"$f":"IFERROR(MID(X899,AF899+2,AG899-AF899-3),\"\")","v":""},null,null,null,null,null,null,null,null,null,{"$f":"IF(X899<>\"\",\"0\",\"\")","v":""},{"$f":"IFERROR(SEARCH(\",\",X899,1),\"\")","v":""},{"$f":"IFERROR(SEARCH(\",\",X899,AE899+1),\"\")","v":""},{"$f":"IFERROR(SEARCH(\",\",X899,AF899+1),\"\")","v":""},{"$f":"IFERROR(SEARCH(\",\",X899,AG899+1),\"\")","v":""},{"$f":"IFERROR(SEARCH(\",\",X899,AH899+1),\"\")","v":""},{"$f":"IFERROR(SEARCH(\",\",X899,AI899+1),\"\")","v":""},{"$f":"IFERROR(SEARCH(\",\",X899,AJ899+1),\"\")","v":""},{"$f":"IF(X899<>\"\",LEN(X899),\"\")","v":""}]
[null,"d"," ",""," ",""," ",""," ",""," ",""," ",""," ",""," ",""," ","",null,null,null,null,null,null,null,null,null,"","","","","","","","",""]
[null,"d"," ",""," ",""," ",""," ",""," ",""," ",""," ",""," ",""," ","",null,null,null,null,null,null,null,null,null,"","","","","","","","",""]
[null,"d"," ",""," ",""," ",""," ",""," ",""," ",""," ",""," ",""," ","",null,null,null,null,null,null,null,null,null,"","","","","","","","",""]
[null,"d"," ",""," ",""," ",""," ",""," ",""," ",""," ",""," ",""," ","",null,null,null,null,null,null,null,null,null,"","","","","","","","",""]
[null,"d"," ",""," ",""," ",""," ",""," ",""," ",""," ",""," ",""," ","",null,null,null,null,null,null,null,null,null,"","","","","","","","",""]
[null,"d"," ",""," ",""," ",""," ",""," ",""," ",""," ",""," ",""," ","",null,null,null,null,null,null,null,null,null,"","","","","","","","",""]
[null,"d"," ",""," ",""," ",""," ",""," ",""," ",""," ",""," ",""," ","",null,null,null,null,null,null,null,null,null,"","","","","","","","",""]
[null,"d"," ",""," ",""," ",""," ",""," ",""," ",""," ",""," ",""," ","",null,null,null,null,null,null,null,null,null,"","","","","","","","",""]
[null,"d"," ",""," ",""," ",""," ",""," ",""," ",""," ",""," ",""," ","",null,null,null,null,null,null,null,null,null,"","","","","","","","",""]
[null,"d"," ",""," ",""," ",""," ",""," ",""," ",""," ",""," ",""," ","",null,null,null,null,null,null,null,null,null,"","","","","","","","",""]
[null,"d"," ",""," ",""," ",""," ",""," ",""," ",""," ",""," ",""," ","",null,null,null,null,null,null,null,null,null,"","","","","","","","",""]
[null,"d"," ",""," ",""," ",""," ",""," ",""," ",""," ",""," ",""," ","",null,null,null,null,null,null,null,null,null,"","","","","","","","",""]
[null,"d"," ",""," ",""," ",""," ",""," ",""," ",""," ",""," ",""," ","",null,null,null,null,null,null,null,null,null,"","","","","","","","",""]
[null,"d"," ",""," ",""," ",""," ",""," ",""," ",""," ",""," ",""," ","",null,null,null,null,null,null,null,null,null,"","","","","","","","",""]
[null,"d"," ",""," ",""," ",""," ",""," ",""," ",""," ",""," ",""," ","",null,null,null,null,null,null,null,null,null,"","","","","","","","",""]
[null,"d"," ",""," ",""," ",""," ",""," ",""," ",""," ",""," ",""," ","",null,null,null,null,null,null,null,null,null,"","","","","","","","",""]
[null,"d"," ",""," ",""," ",""," ",""," ",""," ",""," ",""," ",""," ","",null,null,null,null,null,null,null,null,null,"","","","","","","","",""]
[null,"d"," ",""," ",""," ",""," ",""," ",""," ",""," ",""," ",""," ","",null,null,null,null,null,null,null,null,null,"","","","","","","","",""]
[null,"d"," ",""," ",""," ",""," ",""," ",""," ",""," ",""," ",""," ","",null,null,null,null,null,null,null,null,null,"","","","","","","","",""]
[null,"d"," ",""," ",""," ",""," ",""," ",""," ",""," ",""," ",""," ","",null,null,null,null,null,null,null,null,null,"","","","","","","","",""]
[null,"d"," ",""," ",""," ",""," ",""," ",""," ",""," ",""," ",""," ","",null,null,null,null,null,null,null,null,null,"","","","","","","","",""]
[null,"d"," ",""," ",""," ",""," ",""," ",""," ",""," ",""," ",""," ","",null,null,null,null,null,null,null,null,null,"","","","","","","","",""]
[null,"d"," ",""," ",""," ",""," ",""," ",""," ",""," ",""," ",""," ","",null,null,null,null,null,null,null,null,null,"","","","","","","","",""]
[null,"d"," ",""," ",""," ",""," ",""," ",""," ",""," ",""," ",""," ","",null,null,null,null,null,null,null,null,null,"","","","","","","","",""]
[null,"d"," ",""," ",""," ",""," ",""," ",""," ",""," ",""," ",""," ","",null,null,null,null,null,null,null,null,null,"","","","","","","","",""]
[null,"d"," ",""," ",""," ",""," ",""," ",""," ",""," ",""," ",""," ","",null,null,null,null,null,null,null,null,null,"","","","","","","","",""]
[null,"d"," ",""," ",""," ",""," ",""," ",""," ",""," ",""," ",""," ","",null,null,null,null,null,null,null,null,null,"","","","","","","","",""]
[null,"d"," ",""," ",""," ",""," ",""," ",""," ",""," ",""," ",""," ","",null,null,null,null,null,null,null,null,null,"","","","","","","","",""]
[null,"d"," ",""," ",""," ",""," ",""," ",""," ",""," ",""," ",""," ","",null,null,null,null,null,null,null,null,null,"","","","","","","","",""]
[null,"d"," ",""," ",""," ",""," ",""," ",""," ",""," ",""," ",""," ","",null,null,null,null,null,null,null,null,null,"","","","","","","","",""]
[null,"d"," ",""," ",""," ",""," ",""," ",""," ",""," ",""," ",""," ","",null,null,null,null,null,null,null,null,null,"","","","","","","","",""]
[null,"d"," ",""," ",""," ",""," ",""," ",""," ",""," ",""," ",""," ","",null,null,null,null,null,null,null,null,null,"","","","","","","","",""]
[null,"d"," ",""," ",""," ",""," ",""," ",""," ",""," ",""," ",""," ","",null,null,null,null,null,null,null,null,null,"","","","","","","","",""]
[null,"d"," ",""," ",""," ",""," ",""," ",""," ",""," ",""," ",""," ","",null,null,null,null,null,null,null,null,null,"","","","","","","","",""]
[null,"d"," ",""," ",""," ",""," ",""," ",""," ",""," ",""," ",""," ","",null,null,null,null,null,null,null,null,null,"","","","","","","","",""]
[null,"d"," ",""," ",""," ",""," ",""," ",""," ",""," ",""," ",""," ","",null,null,null,null,null,null,null,null,null,"","","","","","","","",""]
[null,"d"," ",""," ",""," ",""," ",""," ",""," ",""," ",""," ",""," ","",null,null,null,null,null,null,null,null,null,"","","","","","","","",""]
[null,"d"," ",""," ",""," ",""," ",""," ",""," ",""," ",""," ",""," ","",null,null,null,null,null,null,null,null,null,"","","","","","","","",""]
[null,"d"," ",""," ",""," ",""," ",""," ",""," ",""," ",""," ",""," ","",null,null,null,null,null,null,null,null,null,"","","","","","","","",""]
[null,"d"," ",""," ",""," ",""," ",""," ",""," ",""," ",""," ",""," ","",null,null,null,null,null,null,null,null,null,"","","","","","","","",""]
[null,"d"," ",""," ",""," ",""," ",""," ",""," ",""," ",""," ",""," ","",null,null,null,null,null,null,null,null,null,"","","","","","","","",""]
[null,"d"," ",""," ",""," ",""," ",""," ",""," ",""," ",""," ",""," ","",null,null,null,null,null,null,null,null,null,"","","","","","","","",""]
[null,"d"," ",""," ",""," ",""," ",""," ",""," ",""," ",""," ",""," ","",null,null,null,null,null,null,null,null,null,"","","","","","","","",""]
[null,"d"," ",""," ",""," ",""," ",""," ",""," ",""," ",""," ",""," ","",null,null,null,null,null,null,null,null,null,"","","","","","","","",""]
[null,"d"," ",""," ",""," ",""," ",""," ",""," ",""," ",""," ",""," ","",null,null,null,null,null,null,null,null,null,"","","","","","","","",""]
[null,"d"," ",""," ",""," ",""," ",""," ",""," ",""," ",""," ",""," ","",null,null,null,null,null,null,null,null,null,"","","","","","","","",""]
[null,"d"," ",""," ",""," ",""," ",""," ",""," ",""," ",""," ",""," ","",null,null,null,null,null,null,null,null,null,"","","","","","","","",""]
[null,"d"," ",""," ",""," ",""," ",""," ",""," ",""," ",""," ",""," ","",null,null,null,null,null,null,null,null,null,"","","","","","","","",""]
[null,"d"," ",""," ",""," ",""," ",""," ",""," ",""," ",""," ",""," ","",null,null,null,null,null,null,null,null,null,"","","","","","","","",""]
[null,"d"," ",""," ",""," ",""," ",""," ",""," ",""," ",""," ",""," ","",null,null,null,null,null,null,null,null,null,"","","","","","","","",""]
[null,"d"," ",""," ",""," ",""," ",""," ",""," ",""," ",""," ",""," ","",null,null,null,null,null,null,null,null,null,"","","","","","","","",""]
[null,"d"," ",""," ",""," ",""," ",""," ",""," ",""," ",""," ",""," ","",null,null,null,null,null,null,null,null,null,"","","","","","","","",""]
[null,"d"," ",""," ",""," ",""," ",""," ",""," ",""," ",""," ",""," ","",null,null,null,null,null,null,null,null,null,"","","","","","","","",""]
[null,"d"," ",""," ",""," ",""," ",""," ",""," ",""," ",""," ",""," ","",null,null,null,null,null,null,null,null,null,"","","","","","","","",""]
[null,"d"," ",""," ",""," ",""," ",""," ",""," ",""," ",""," ",""," ","",null,null,null,null,null,null,null,null,null,"","","","","","","","",""]
[null,"d"," ",""," ",""," ",""," ",""," ",""," ",""," ",""," ",""," ","",null,null,null,null,null,null,null,null,null,"","","","","","","","",""]
[null,"d"," ",""," ",""," ",""," ",""," ",""," ",""," ",""," ",""," ","",null,null,null,null,null,null,null,null,null,"","","","","","","","",""]
[null,"d"," ",""," ",""," ",""," ",""," ",""," ",""," ",""," ",""," ","",null,null,null,null,null,null,null,null,null,"","","","","","","","",""]
[null,"d"," ",""," ",""," ",""," ",""," ",""," ",""," ",""," ",""," ","",null,null,null,null,null,null,null,null,null,"","","","","","","","",""]
[null,"d"," ",""," ",""," ",""," ",""," ",""," ",""," ",""," ",""," ","",null,null,null,null,null,null,null,null,null,"","","","","","","","",""]
[null,"d"," ",""," ",""," ",""," ",""," ",""," ",""," ",""," ",""," ","",null,null,null,null,null,null,null,null,null,"","","","","","","","",""]
[null,"d"," ",""," ",""," ",""," ",""," ",""," ",""," ",""," ",""," ","",null,null,null,null,null,null,null,null,null,"","","","","","","","",""]
[null,"d"," ",""," ",""," ",""," ",""," ",""," ",""," ",""," ",""," ","",null,null,null,null,null,null,null,null,null,"","","","","","","","",""]
[null,{"$f":"IF(EXACT(MID(H963,1,3),\"FID\"),\"f\",\"d\")","v":"d"}," ",{"$f":"IFERROR(_xlfn.NUMBERVALUE(SUBSTITUTE(MID(X963,AJ963+1,AK963-AJ963-1),\".\",\",\"))*25.4,\"\")","v":""}," ",{"$f":"IFERROR(_xlfn.NUMBERVALUE(SUBSTITUTE(MID(X963,AK963+1,AL963-1),\".\",\",\"))*25.4,\"\")","v":""}," ",{"$f":"IFERROR(MID(X963,AD963+1,AE963-AD963-1),\"\")","v":""}," ",{"$f":"IF(X963<>\"\",\"n0000\",\"\")","v":""}," ",{"$f":"IFERROR(_xlfn.NUMBERVALUE(MID(X963,AI963+1,AJ963-AI963-1))+90,\"\")","v":""}," ",{"$f":"IFERROR(MID(X963,AE963+2,AF963-AE963-3),\"\")","v":""}," ",{"$f":"IF(X963<>\"\",\"PP\",\"\")","v":""}," ",{"$f":"IFERROR(MID(X963,AD963+1,AE963-AD963-1),\"\")","v":""}," ",{"$f":"IFERROR(MID(X963,AF963+2,AG963-AF963-3),\"\")","v":""},null,null,null,null,null,null,null,null,null,{"$f":"IF(X963<>\"\",\"0\",\"\")","v":""},{"$f":"IFERROR(SEARCH(\",\",X963,1),\"\")","v":""},{"$f":"IFERROR(SEARCH(\",\",X963,AE963+1),\"\")","v":""},{"$f":"IFERROR(SEARCH(\",\",X963,AF963+1),\"\")","v":""},{"$f":"IFERROR(SEARCH(\",\",X963,AG963+1),\"\")","v":""},{"$f":"IFERROR(SEARCH(\",\",X963,AH963+1),\"\")","v":""},{"$f":"IFERROR(SEARCH(\",\",X963,AI963+1),\"\")","v":""},{"$f":"IFERROR(SEARCH(\",\",X963,AJ963+1),\"\")","v":""},{"$f":"IF(X963<>\"\",LEN(X963),\"\")","v":""}]
[null,"d"," ",""," ",""," ",""," ",""," ",""," ",""," ",""," ",""," ","",null,null,null,null,null,null,null,null,null,"","","","","","","","",""]
[null,"d"," ",""," ",""," ",""," ",""," ",""," ",""," ",""," ",""," ","",null,null,null,null,null,null,null,null,null,"","","","","","","","",""]
[null,"d"," ",""," ",""," ",""," ",""," ",""," ",""," ",""," ",""," ","",null,null,null,null,null,null,null,null,null,"","","","","","","","",""]
[null,"d"," ",""," ",""," ",""," ",""," ",""," ",""," ",""," ",""," ","",null,null,null,null,null,null,null,null,null,"","","","","","","","",""]
[null,"d"," ",""," ",""," ",""," ",""," ",""," ",""," ",""," ",""," ","",null,null,null,null,null,null,null,null,null,"","","","","","","","",""]
[null,"d"," ",""," ",""," ",""," ",""," ",""," ",""," ",""," ",""," ","",null,null,null,null,null,null,null,null,null,"","","","","","","","",""]
[null,"d"," ",""," ",""," ",""," ",""," ",""," ",""," ",""," ",""," ","",null,null,null,null,null,null,null,null,null,"","","","","","","","",""]
[null,"d"," ",""," ",""," ",""," ",""," ",""," ",""," ",""," ",""," ","",null,null,null,null,null,null,null,null,null,"","","","","","","","",""]
[null,"d"," ",""," ",""," ",""," ",""," ",""," ",""," ",""," ",""," ","",null,null,null,null,null,null,null,null,null,"","","","","","","","",""]
[null,"d"," ",""," ",""," ",""," ",""," ",""," ",""," ",""," ",""," ","",null,null,null,null,null,null,null,null,null,"","","","","","","","",""]
[null,"d"," ",""," ",""," ",""," ",""," ",""," ",""," ",""," ",""," ","",null,null,null,null,null,null,null,null,null,"","","","","","","","",""]
[null,"d"," ",""," ",""," ",""," ",""," ",""," ",""," ",""," ",""," ","",null,null,null,null,null,null,null,null,null,"","","","","","","","",""]
[null,"d"," ",""," ",""," ",""," ",""," ",""," ",""," ",""," ",""," ","",null,null,null,null,null,null,null,null,null,"","","","","","","","",""]
[null,"d"," ",""," ",""," ",""," ",""," ",""," ",""," ",""," ",""," ","",null,null,null,null,null,null,null,null,null,"","","","","","","","",""]
[null,"d"," ",""," ",""," ",""," ",""," ",""," ",""," ",""," ",""," ","",null,null,null,null,null,null,null,null,null,"","","","","","","","",""]
[null,"d"," ",""," ",""," ",""," ",""," ",""," ",""," ",""," ",""," ","",null,null,null,null,null,null,null,null,null,"","","","","","","","",""]
[null,"d"," ",""," ",""," ",""," ",""," ",""," ",""," ",""," ",""," ","",null,null,null,null,null,null,null,null,null,"","","","","","","","",""]
[null,"d"," ",""," ",""," ",""," ",""," ",""," ",""," ",""," ",""," ","",null,null,null,null,null,null,null,null,null,"","","","","","","","",""]
[null,"d"," ",""," ",""," ",""," ",""," ",""," ",""," ",""," ",""," ","",null,null,null,null,null,null,null,null,null,"","","","","","","","",""]
[null,"d"," ",""," ",""," ",""," ",""," ",""," ",""," ",""," ",""," ","",null,null,null,null,null,null,null,null,null,"","","","","","","","",""]
[null,"d"," ",""," ",""," ",""," ",""," ",""," ",""," ",""," ",""," ","",null,null,null,null,null,null,null,null,null,"","","","","","","","",""]
[null,"d"," ",""," ",""," ",""," ",""," ",""," ",""," ",""," ",""," ","",null,null,null,null,null,null,null,null,null,"","","","","","","","",""]
[null,"d"," ",""," ",""," ",""," ",""," ",""," ",""," ",""," ",""," ","",null,null,null,null,null,null,null,null,null,"","","","","","","","",""]
[null,"d"," ",""," ",""," ",""," ",""," ",""," ",""," ",""," ",""," ","",null,null,null,null,null,null,null,null,null,"","","","","","","","",""]
[null,"d"," ",""," ",""," ",""," ",""," ",""," ",""," ",""," ",""," ","",null,null,null,null,null,null,null,null,null,"","","","","","","","",""]
[null,"d"," ",""," ",""," ",""," ",""," ",""," ",""," ",""," ",""," ","",null,null,null,null,null,null,null,null,null,"","","","","","","","",""]
[null,"d"," ",""," ",""," ",""," ",""," ",""," ",""," ",""," ",""," ","",null,null,null,null,null,null,null,null,null,"","","","","","","","",""]
[null,"d"," ",""," ",""," ",""," ",""," ",""," ",""," ",""," ",""," ","",null,null,null,null,null,null,null,null,null,"","","","","","","","",""]
[null,"d"," ",""," ",""," ",""," ",""," ",""," ",""," ",""," ",""," ","",null,null,null,null,null,null,null,null,null,"","","","","","","","",""]
[null,"d"," ",""," ",""," ",""," ",""," ",""," ",""," ",""," ",""," ","",null,null,null,null,null,null,null,null,null,"","","","","","","","",""]
[null,"d"," ",""," ",""," ",""," ",""," ",""," ",""," ",""," ",""," ","",null,null,null,null,null,null,null,null,null,"","","","","","","","",""]
[null,"d"," ",""," ",""," ",""," ",""," ",""," ",""," ",""," ",""," ","",null,null,null,null,null,null,null,null,null,"","","","","","","","",""]
[null,"d"," ",""," ",""," ",""," ",""," ",""," ",""," ",""," ",""," ","",null,null,null,null,null,null,null,null,null,"","","","","","","","",""]
[null,"d"," ",""," ",""," ",""," ",""," ",""," ",""," ",""," ",""," ","",null,null,null,null,null,null,null,null,null,"","","","","","","","",""]
[null,"d"," ",""," ",""," ",""," ",""," ",""," ",""," ",""," ",""," ","",null,null,null,null,null,null,null,null,null,"","","","","","","","",""]
[null,"d"," ",""," ",""," ",""," ",""," ",""," ",""," ",""," ",""," ","",null,null,null,null,null,null,null,null,null,"","","","","","","","",""]
[null,"d"," ",""," ",""," ",""," ",""," ",""," ",""," ",""," ",""," ","",null,null,null,null,null,null,null,null,null,"","","","","","","","",""]
[null,"d"," ",""," ",""," ",""," ",""," ",""," ",""," ",""," ",""," ","",null,null,null,null,null,null,null,null,null,"","","","","","","","",""]
[null,"d"," ",""," ",""," ",""," ",""," ",""," ",""," ",""," ",""," ","",null,null,null,null,null,null,null,null,null,"","","","","","","","",""]
[null,"d"," ",""," ",""," ",""," ",""," ",""," ",""," ",""," ",""," ","",null,null,null,null,null,null,null,null,null,"","","","","","","","",""]
[null,"d"," ",""," ",""," ",""," ",""," ",""," ",""," ",""," ",""," ","",null,null,null,null,null,null,null,null,null,"","","","","","","","",""]
[null,"d"," ",""," ",""," ",""," ",""," ",""," ",""," ",""," ",""," ","",null,null,null,null,null,null,null,null,null,"","","","","","","","",""]
[null,"d"," ",""," ",""," ",""," ",""," ",""," ",""," ",""," ",""," ","",null,null,null,null,null,null,null,null,null,"","","","","","","","",""]
[null,"d"," ",""," ",""," ",""," ",""," ",""," ",""," ",""," ",""," ","",null,null,null,null,null,null,null,null,null,"","","","","","","","",""]
[null,"d"," ",""," ",""," ",""," ",""," ",""," ",""," ",""," ",""," ","",null,null,null,null,null,null,null,null,null,"","","","","","","","",""]
[null,"d"," ",""," ",""," ",""," ",""," ",""," ",""," ",""," ",""," ","",null,null,null,null,null,null,null,null,null,"","","","","","","","",""]
[null,"d"," ",""," ",""," ",""," ",""," ",""," ",""," ",""," ",""," ","",null,null,null,null,null,null,null,null,null,"","","","","","","","",""]
[null,"d"," ",""," ",""," ",""," ",""," ",""," ",""," ",""," ",""," ","",null,null,null,null,null,null,null,null,null,"","","","","","","","",""]
[null,"d"," ",""," ",""," ",""," ",""," ",""," ",""," ",""," ",""," ","",null,null,null,null,null,null,null,null,null,"","","","","","","","",""]
[null,"d"," ",""," ",""," ",""," ",""," ",""," ",""," ",""," ",""," ","",null,null,null,null,null,null,null,null,null,"","","","","","","","",""]
[null,"d"," ",""," ",""," ",""," ",""," ",""," ",""," ",""," ",""," ","",null,null,null,null,null,null,null,null,null,"","","","","","","","",""]
[null,"d"," ",""," ",""," ",""," ",""," ",""," ",""," ",""," ",""," ","",null,null,null,null,null,null,null,null,null,"","","","","","","","",""]
[null,"d"," ",""," ",""," ",""," ",""," ",""," ",""," ",""," ",""," ","",null,null,null,null,null,null,null,null,null,"","","","","","","","",""]
[null,"d"," ",""," ",""," ",""," ",""," ",""," ",""," ",""," ",""," ","",null,null,null,null,null,null,null,null,null,"","","","","","","","",""]
[null,"d"," ",""," ",""," ",""," ",""," ",""," ",""," ",""," ",""," ","",null,null,null,null,null,null,null,null,null,"","","","","","","","",""]
[null,"d"," ",""," ",""," ",""," ",""," ",""," ",""," ",""," ",""," ","",null,null,null,null,null,null,null,null,null,"","","","","","","","",""]
[null,"d"," ",""," ",""," ",""," ",""," ",""," ",""," ",""," ",""," ","",null,null,null,null,null,null,null,null,null,"","","","","","","","",""]
[null,"d"," ",""," ",""," ",""," ",""," ",""," ",""," ",""," ",""," ","",null,null,null,null,null,null,null,null,null,"","","","","","","","",""]
[null,"d"," ",""," ",""," ",""," ",""," ",""," ",""," ",""," ",""," ","",null,null,null,null,null,null,null,null,null,"","","","","","","","",""]
[null,"d"," ",""," ",""," ",""," ",""," ",""," ",""," ",""," ",""," ","",null,null,null,null,null,null,null,null,null,"","","","","","","","",""]
[null,"d"," ",""," ",""," ",""," ",""," ",""," ",""," ",""," ",""," ","",null,null,null,null,null,null,null,null,null,"","","","","","","","",""]
[null,"d"," ",""," ",""," ",""," ",""," ",""," ",""," ",""," ",""," ","",null,null,null,null,null,null,null,null,null,"","","","","","","","",""]
[null,"d"," ",""," ",""," ",""," ",""," ",""," ",""," ",""," ",""," ","",null,null,null,null,null,null,null,null,null,"","","","","","","","",""]
[null,{"$f":"IF(EXACT(MID(H1027,1,3),\"FID\"),\"f\",\"d\")","v":"d"}," ",{"$f":"IFERROR(_xlfn.NUMBERVALUE(SUBSTITUTE(MID(X1027,AJ1027+1,AK1027-AJ1027-1),\".\",\",\"))*25.4,\"\")","v":""}," ",{"$f":"IFERROR(_xlfn.NUMBERVALUE(SUBSTITUTE(MID(X1027,AK1027+1,AL1027-1),\".\",\",\"))*25.4,\"\")","v":""}," ",{"$f":"IFERROR(MID(X1027,AD1027+1,AE1027-AD1027-1),\"\")","v":""}," ",{"$f":"IF(X1027<>\"\",\"n0000\",\"\")","v":""}," ",{"$f":"IFERROR(_xlfn.NUMBERVALUE(MID(X1027,AI1027+1,AJ1027-AI1027-1))+90,\"\")","v":""}," ",{"$f":"IFERROR(MID(X1027,AE1027+2,AF1027-AE1027-3),\"\")","v":""}," ",{"$f":"IF(X1027<>\"\",\"PP\",\"\")","v":""}," ",{"$f":"IFERROR(MID(X1027,AD1027+1,AE1027-AD1027-1),\"\")","v":""}," ",{"$f":"IFERROR(MID(X1027,AF1027+2,AG1027-AF1027-3),\"\")","v":""},null,null,null,null,null,null,null,null,null,{"$f":"IF(X1027<>\"\",\"0\",\"\")","v":""},{"$f":"IFERROR(SEARCH(\",\",X1027,1),\"\")","v":""},{"$f":"IFERROR(SEARCH(\",\",X1027,AE1027+1),\"\")","v":""},{"$f":"IFERROR(SEARCH(\",\",X1027,AF1027+1),\"\")","v":""},{"$f":"IFERROR(SEARCH(\",\",X1027,AG1027+1),\"\")","v":""},{"$f":"IFERROR(SEARCH(\",\",X1027,AH1027+1),\"\")","v":""},{"$f":"IFERROR(SEARCH(\",\",X1027,AI1027+1),\"\")","v":""},{"$f":"IFERROR(SEARCH(\",\",X1027,AJ1027+1),\"\")","v":""},{"$f":"IF(X1027<>\"\",LEN(X1027),\"\")","v":""}]
[null,"d"," ",""," ",""," ",""," ",""," ",""," ",""," ",""," ",""," ","",null,null,null,null,null,null,null,null,null,"","","","","","","","",""]
[null,"d"," ",""," ",""," ",""," ",""," ",""," ",""," ",""," ",""," ","",null,null,null,null,null,null,null,null,null,"","","","","","","","",""]
[null,"d"," ",""," ",""," ",""," ",""," ",""," ",""," ",""," ",""," ","",null,null,null,null,null,null,null,null,null,"","","","","","","","",""]
[null,"d"," ",""," ",""," ",""," ",""," ",""," ",""," ",""," ",""," ","",null,null,null,null,null,null,null,null,null,"","","","","","","","",""]
[null,"d"," ",""," ",""," ",""," ",""," ",""," ",""," ",""," ",""," ","",null,null,null,null,null,null,null,null,null,"","","","","","","","",""]
[null,"d"," ",""," ",""," ",""," ",""," ",""," ",""," ",""," ",""," ","",null,null,null,null,null,null,null,null,null,"","","","","","","","",""]
[null,"d"," ",""," ",""," ",""," ",""," ",""," ",""," ",""," ",""," ","",null,null,null,null,null,null,null,null,null,"","","","","","","","",""]
[null,"d"," ",""," ",""," ",""," ",""," ",""," ",""," ",""," ",""," ","",null,null,null,null,null,null,null,null,null,"","","","","","","","",""]
[null,"d"," ",""," ",""," ",""," ",""," ",""," ",""," ",""," ",""," ","",null,null,null,null,null,null,null,null,null,"","","","","","","","",""]
[null,"d"," ",""," ",""," ",""," ",""," ",""," ",""," ",""," ",""," ","",null,null,null,null,null,null,null,null,null,"","","","","","","","",""]
[null,"d"," ",""," ",""," ",""," ",""," ",""," ",""," ",""," ",""," ","",null,null,null,null,null,null,null,null,null,"","","","","","","","",""]
[null,"d"," ",""," ",""," ",""," ",""," ",""," ",""," ",""," ",""," ","",null,null,null,null,null,null,null,null,null,"","","","","","","","",""]
[null,"d"," ",""," ",""," ",""," ",""," ",""," ",""," ",""," ",""," ","",null,null,null,null,null,null,null,null,null,"","","","","","","","",""]
[null,"d"," ",""," ",""," ",""," ",""," ",""," ",""," ",""," ",""," ","",null,null,null,null,null,null,null,null,null,"","","","","","","","",""]
[null,"d"," ",""," ",""," ",""," ",""," ",""," ",""," ",""," ",""," ","",null,null,null,null,null,null,null,null,null,"","","","","","","","",""]
[null,"d"," ",""," ",""," ",""," ",""," ",""," ",""," ",""," ",""," ","",null,null,null,null,null,null,null,null,null,"","","","","","","","",""]
[null,"d"," ",""," ",""," ",""," ",""," ",""," ",""," ",""," ",""," ","",null,null,null,null,null,null,null,null,null,"","","","","","","","",""]
[null,"d"," ",""," ",""," ",""," ",""," ",""," ",""," ",""," ",""," ","",null,null,null,null,null,null,null,null,null,"","","","","","","","",""]
[null,"d"," ",""," ",""," ",""," ",""," ",""," ",""," ",""," ",""," ","",null,null,null,null,null,null,null,null,null,"","","","","","","","",""]
[null,"d"," ",""," ",""," ",""," ",""," ",""," ",""," ",""," ",""," ","",null,null,null,null,null,null,null,null,null,"","","","","","","","",""]
[null,"d"," ",""," ",""," ",""," ",""," ",""," ",""," ",""," ",""," ","",null,null,null,null,null,null,null,null,null,"","","","","","","","",""]
[null,"d"," ",""," ",""," ",""," ",""," ",""," ",""," ",""," ",""," ","",null,null,null,null,null,null,null,null,null,"","","","","","","","",""]
[null,"d"," ",""," ",""," ",""," ",""," ",""," ",""," ",""," ",""," ","",null,null,null,null,null,null,null,null,null,"","","","","","","","",""]
[null,"d"," ",""," ",""," ",""," ",""," ",""," ",""," ",""," ",""," ","",null,null,null,null,null,null,null,null,null,"","","","","","","","",""]
[null,"d"," ",""," ",""," ",""," ",""," ",""," ",""," ",""," ",""," ","",null,null,null,null,null,null,null,null,null,"","","","","","","","",""]
[null,"d"," ",""," ",""," ",""," ",""," ",""," ",""," ",""," ",""," ","",null,null,null,null,null,null,null,null,null,"","","","","","","","",""]
[null,"d"," ",""," ",""," ",""," ",""," ",""," ",""," ",""," ",""," ","",null,null,null,null,null,null,null,null,null,"","","","","","","","",""]
[null,"d"," ",""," ",""," ",""," ",""," ",""," ",""," ",""," ",""," ","",null,null,null,null,null,null,null,null,null,"","","","","","","","",""]
[null,"d"," ",""," ",""," ",""," ",""," ",""," ",""," ",""," ",""," ","",null,null,null,null,null,null,null,null,null,"","","","","","","","",""]
[null,"d"," ",""," ",""," ",""," ",""," ",""," ",""," ",""," ",""," ","",null,null,null,null,null,null,null,null,null,"","","","","","","","",""]
[null,"d"," ",""," ",""," ",""," ",""," ",""," ",""," ",""," ",""," ","",null,null,null,null,null,null,null,null,null,"","","","","","","","",""]
[null,"d"," ",""," ",""," ",""," ",""," ",""," ",""," ",""," ",""," ","",null,null,null,null,null,null,null,null,null,"","","","","","","","",""]
[null,"d"," ",""," ",""," ",""," ",""," ",""," ",""," ",""," ",""," ","",null,null,null,null,null,null,null,null,null,"","","","","","","","",""]
[null,"d"," ",""," ",""," ",""," ",""," ",""," ",""," ",""," ",""," ","",null,null,null,null,null,null,null,null,null,"","","","","","","","",""]
[null,"d"," ",""," ",""," ",""," ",""," ",""," ",""," ",""," ",""," ","",null,null,null,null,null,null,null,null,null,"","","","","","","","",""]
[null,"d"," ",""," ",""," ",""," ",""," ",""," ",""," ",""," ",""," ","",null,null,null,null,null,null,null,null,null,"","","","","","","","",""]
[null,"d"," ",""," ",""," ",""," ",""," ",""," ",""," ",""," ",""," ","",null,null,null,null,null,null,null,null,null,"","","","","","","","",""]
[null,"d"," ",""," ",""," ",""," ",""," ",""," ",""," ",""," ",""," ","",null,null,null,null,null,null,null,null,null,"","","","","","","","",""]
[null,"d"," ",""," ",""," ",""," ",""," ",""," ",""," ",""," ",""," ","",null,null,null,null,null,null,null,null,null,"","","","","","","","",""]
[null,"d"," ",""," ",""," ",""," ",""," ",""," ",""," ",""," ",""," ","",null,null,null,null,null,null,null,null,null,"","","","","","","","",""]
[null,"d"," ",""," ",""," ",""," ",""," ",""," ",""," ",""," ",""," ","",null,null,null,null,null,null,null,null,null,"","","","","","","","",""]
[null,"d"," ",""," ",""," ",""," ",""," ",""," ",""," ",""," ",""," ","",null,null,null,null,null,null,null,null,null,"","","","","","","","",""]
[null,"d"," ",""," ",""," ",""," ",""," ",""," ",""," ",""," ",""," ","",null,null,null,null,null,null,null,null,null,"","","","","","","","",""]
[null,"d"," ",""," ",""," ",""," ",""," ",""," ",""," ",""," ",""," ","",null,null,null,null,null,null,null,null,null,"","","","","","","","",""]
[null,"d"," ",""," ",""," ",""," ",""," ",""," ",""," ",""," ",""," ","",null,null,null,null,null,null,null,null,null,"","","","","","","","",""]
[null,"d"," ",""," ",""," ",""," ",""," ",""," ",""," ",""," ",""," ","",null,null,null,null,null,null,null,null,null,"","","","","","","","",""]
[null,"d"," ",""," ",""," ",""," ",""," ",""," ",""," ",""," ",""," ","",null,null,null,null,null,null,null,null,null,"","","","","","","","",""]
[null,"d"," ",""," ",""," ",""," ",""," ",""," ",""," ",""," ",""," ","",null,null,null,null,null,null,null,null,null,"","","","","","","","",""]
[null,"d"," ",""," ",""," ",""," ",""," ",""," ",""," ",""," ",""," ","",null,null,null,null,null,null,null,null,null,"","","","","","","","",""]
[null,"d"," ",""," ",""," ",""," ",""," ",""," ",""," ",""," ",""," ","",null,null,null,null,null,null,null,null,null,"","","","","","","","",""]
[null,"d"," ",""," ",""," ",""," ",""," ",""," ",""," ",""," ",""," ","",null,null,null,null,null,null,null,null,null,"","","","","","","","",""]
[null,"d"," ",""," ",""," ",""," ",""," ",""," ",""," ",""," ",""," ","",null,null,null,null,null,null,null,null,null,"","","","","","","","",""]
[null,"d"," ",""," ",""," ",""," ",""," ",""," ",""," ",""," ",""," ","",null,null,null,null,null,null,null,null,null,"","","","","","","","",""]
[null,"d"," ",""," ",""," ",""," ",""," ",""," ",""," ",""," ",""," ","",null,null,null,null,null,null,null,null,null,"","","","","","","","",""]
[null,"d"," ",""," ",""," ",""," ",""," ",""," ",""," ",""," ",""," ","",null,null,null,null,null,null,null,null,null,"","","","","","","","",""]
[null,"d"," ",""," ",""," ",""," ",""," ",""," ",""," ",""," ",""," ","",null,null,null,null,null,null,null,null,null,"","","","","","","","",""]
[null,"d"," ",""," ",""," ",""," ",""," ",""," ",""," ",""," ",""," ","",null,null,null,null,null,null,null,null,null,"","","","","","","","",""]
[null,"d"," ",""," ",""," ",""," ",""," ",""," ",""," ",""," ",""," ","",null,null,null,null,null,null,null,null,null,"","","","","","","","",""]
[null,"d"," ",""," ",""," ",""," ",""," ",""," ",""," ",""," ",""," ","",null,null,null,null,null,null,null,null,null,"","","","","","","","",""]
[null,"d"," ",""," ",""," ",""," ",""," ",""," ",""," ",""," ",""," ","",null,null,null,null,null,null,null,null,null,"","","","","","","","",""]
[null,"d"," ",""," ",""," ",""," ",""," ",""," ",""," ",""," ",""," ","",null,null,null,null,null,null,null,null,null,"","","","","","","","",""]
[null,"d"," ",""," ",""," ",""," ",""," ",""," ",""," ",""," ",""," ","",null,null,null,null,null,null,null,null,null,"","","","","","","","",""]
[null,"d"," ",""," ",""," ",""," ",""," ",""," ",""," ",""," ",""," ","",null,null,null,null,null,null,null,null,null,"","","","","","","","",""]
[null,{"$f":"IF(EXACT(MID(H1091,1,3),\"FID\"),\"f\",\"d\")","v":"d"}," ",{"$f":"IFERROR(_xlfn.NUMBERVALUE(SUBSTITUTE(MID(X1091,AJ1091+1,AK1091-AJ1091-1),\".\",\",\"))*25.4,\"\")","v":""}," ",{"$f":"IFERROR(_xlfn.NUMBERVALUE(SUBSTITUTE(MID(X1091,AK1091+1,AL1091-1),\".\",\",\"))*25.4,\"\")","v":""}," ",{"$f":"IFERROR(MID(X1091,AD1091+1,AE1091-AD1091-1),\"\")","v":""}," ",{"$f":"IF(X1091<>\"\",\"n0000\",\"\")","v":""}," ",{"$f":"IFERROR(_xlfn.NUMBERVALUE(MID(X1091,AI1091+1,AJ1091-AI1091-1))+90,\"\")","v":""}," ",{"$f":"IFERROR(MID(X1091,AE1091+2,AF1091-AE1091-3),\"\")","v":""}," ",{"$f":"IF(X1091<>\"\",\"PP\",\"\")","v":""}," ",{"$f":"IFERROR(MID(X1091,AD1091+1,AE1091-AD1091-1),\"\")","v":""}," ",{"$f":"IFERROR(MID(X1091,AF1091+2,AG1091-AF1091-3),\"\")","v":""},null,null,null,null,null,null,null,null,null,{"$f":"IF(X1091<>\"\",\"0\",\"\")","v":""},{"$f":"IFERROR(SEARCH(\",\",X1091,1),\"\")","v":""},{"$f":"IFERROR(SEARCH(\",\",X1091,AE1091+1),\"\")","v":""},{"$f":"IFERROR(SEARCH(\",\",X1091,AF1091+1),\"\")","v":""},{"$f":"IFERROR(SEARCH(\",\",X1091,AG1091+1),\"\")","v":""},{"$f":"IFERROR(SEARCH(\",\",X1091,AH1091+1),\"\")","v":""},{"$f":"IFERROR(SEARCH(\",\",X1091,AI1091+1),\"\")","v":""},{"$f":"IFERROR(SEARCH(\",\",X1091,AJ1091+1),\"\")","v":""},{"$f":"IF(X1091<>\"\",LEN(X1091),\"\")","v":""}]
[null,"d"," ",""," ",""," ",""," ",""," ",""," ",""," ",""," ",""," ","",null,null,null,null,null,null,null,null,null,"","","","","","","","",""]
[null,"d"," ",""," ",""," ",""," ",""," ",""," ",""," ",""," ",""," ","",null,null,null,null,null,null,null,null,null,"","","","","","","","",""]
[null,"d"," ",""," ",""," ",""," ",""," ",""," ",""," ",""," ",""," ","",null,null,null,null,null,null,null,null,null,"","","","","","","","",""]
[null,"d"," ",""," ",""," ",""," ",""," ",""," ",""," ",""," ",""," ","",null,null,null,null,null,null,null,null,null,"","","","","","","","",""]
[null,"d"," ",""," ",""," ",""," ",""," ",""," ",""," ",""," ",""," ","",null,null,null,null,null,null,null,null,null,"","","","","","","","",""]
[null,"d"," ",""," ",""," ",""," ",""," ",""," ",""," ",""," ",""," ","",null,null,null,null,null,null,null,null,null,"","","","","","","","",""]
[null,"d"," ",""," ",""," ",""," ",""," ",""," ",""," ",""," ",""," ","",null,null,null,null,null,null,null,null,null,"","","","","","","","",""]
[null,"d"," ",""," ",""," ",""," ",""," ",""," ",""," ",""," ",""," ","",null,null,null,null,null,null,null,null,null,"","","","","","","","",""]
[null,"d"," ",""," ",""," ",""," ",""," ",""," ",""," ",""," ",""," ","",null,null,null,null,null,null,null,null,null,"","","","","","","","",""]
[null,"d"," ",""," ",""," ",""," ",""," ",""," ",""," ",""," ",""," ","",null,null,null,null,null,null,null,null,null,"","","","","","","","",""]
[null,"d"," ",""," ",""," ",""," ",""," ",""," ",""," ",""," ",""," ","",null,null,null,null,null,null,null,null,null,"","","","","","","","",""]
[null,"d"," ",""," ",""," ",""," ",""," ",""," ",""," ",""," ",""," ","",null,null,null,null,null,null,null,null,null,"","","","","","","","",""]
[null,"d"," ",""," ",""," ",""," ",""," ",""," ",""," ",""," ",""," ","",null,null,null,null,null,null,null,null,null,"","","","","","","","",""]
[null,"d"," ",""," ",""," ",""," ",""," ",""," ",""," ",""," ",""," ","",null,null,null,null,null,null,null,null,null,"","","","","","","","",""]
[null,"d"," ",""," ",""," ",""," ",""," ",""," ",""," ",""," ",""," ","",null,null,null,null,null,null,null,null,null,"","","","","","","","",""]
[null,"d"," ",""," ",""," ",""," ",""," ",""," ",""," ",""," ",""," ","",null,null,null,null,null,null,null,null,null,"","","","","","","","",""]
[null,"d"," ",""," ",""," ",""," ",""," ",""," ",""," ",""," ",""," ","",null,null,null,null,null,null,null,null,null,"","","","","","","","",""]
[null,"d"," ",""," ",""," ",""," ",""," ",""," ",""," ",""," ",""," ","",null,null,null,null,null,null,null,null,null,"","","","","","","","",""]
[null,"d"," ",""," ",""," ",""," ",""," ",""," ",""," ",""," ",""," ","",null,null,null,null,null,null,null,null,null,"","","","","","","","",""]
[null,"d"," ",""," ",""," ",""," ",""," ",""," ",""," ",""," ",""," ","",null,null,null,null,null,null,null,null,null,"","","","","","","","",""]
[null,"d"," ",""," ",""," ",""," ",""," ",""," ",""," ",""," ",""," ","",null,null,null,null,null,null,null,null,null,"","","","","","","","",""]
[null,"d"," ",""," ",""," ",""," ",""," ",""," ",""," ",""," ",""," ","",null,null,null,null,null,null,null,null,null,"","","","","","","","",""]
[null,"d"," ",""," ",""," ",""," ",""," ",""," ",""," ",""," ",""," ","",null,null,null,null,null,null,null,null,null,"","","","","","","","",""]
[null,"d"," ",""," ",""," ",""," ",""," ",""," ",""," ",""," ",""," ","",null,null,null,null,null,null,null,null,null,"","","","","","","","",""]
[null,"d"," ",""," ",""," ",""," ",""," ",""," ",""," ",""," ",""," ","",null,null,null,null,null,null,null,null,null,"","","","","","","","",""]
[null,"d"," ",""," ",""," ",""," ",""," ",""," ",""," ",""," ",""," ","",null,null,null,null,null,null,null,null,null,"","","","","","","","",""]
[null,"d"," ",""," ",""," ",""," ",""," ",""," ",""," ",""," ",""," ","",null,null,null,null,null,null,null,null,null,"","","","","","","","",""]
[null,"d"," ",""," ",""," ",""," ",""," ",""," ",""," ",""," ",""," ","",null,null,null,null,null,null,null,null,null,"","","","","","","","",""]
[null,"d"," ",""," ",""," ",""," ",""," ",""," ",""," ",""," ",""," ","",null,null,null,null,null,null,null,null,null,"","","","","","","","",""]
[null,"d"," ",""," ",""," ",""," ",""," ",""," ",""," ",""," ",""," ","",null,null,null,null,null,null,null,null,null,"","","","","","","","",""]
[null,"d"," ",""," ",""," ",""," ",""," ",""," ",""," ",""," ",""," ","",null,null,null,null,null,null,null,null,null,"","","","","","","","",""]
[null,"d"," ",""," ",""," ",""," ",""," ",""," ",""," ",""," ",""," ","",null,null,null,null,null,null,null,null,null,"","","","","","","","",""]
[null,"d"," ",""," ",""," ",""," ",""," ",""," ",""," ",""," ",""," ","",null,null,null,null,null,null,null,null,null,"","","","","","","","",""]
[null,"d"," ",""," ",""," ",""," ",""," ",""," ",""," ",""," ",""," ","",null,null,null,null,null,null,null,null,null,"","","","","","","","",""]
[null,"d"," ",""," ",""," ",""," ",""," ",""," ",""," ",""," ",""," ","",null,null,null,null,null,null,null,null,null,"","","","","","","","",""]
[null,"d"," ",""," ",""," ",""," ",""," ",""," ",""," ",""," ",""," ","",null,null,null,null,null,null,null,null,null,"","","","","","","","",""]
[null,"d"," ",""," ",""," ",""," ",""," ",""," ",""," ",""," ",""," ","",null,null,null,null,null,null,null,null,null,"","","","","","","","",""]
[null,"d"," ",""," ",""," ",""," ",""," ",""," ",""," ",""," ",""," ","",null,null,null,null,null,null,null,null,null,"","","","","","","","",""]
[null,"d"," ",""," ",""," ",""," ",""," ",""," ",""," ",""," ",""," ","",null,null,null,null,null,null,null,null,null,"","","","","","","","",""]
[null,"d"," ",""," ",""," ",""," ",""," ",""," ",""," ",""," ",""," ","",null,null,null,null,null,null,null,null,null,"","","","","","","","",""]
[null,"d"," ",""," ",""," ",""," ",""," ",""," ",""," ",""," ",""," ","",null,null,null,null,null,null,null,null,null,"","","","","","","","",""]
[null,"d"," ",""," ",""," ",""," ",""," ",""," ",""," ",""," ",""," ","",null,null,null,null,null,null,null,null,null,"","","","","","","","",""]
[null,"d"," ",""," ",""," ",""," ",""," ",""," ",""," ",""," ",""," ","",null,null,null,null,null,null,null,null,null,"","","","","","","","",""]
[null,"d"," ",""," ",""," ",""," ",""," ",""," ",""," ",""," ",""," ","",null,null,null,null,null,null,null,null,null,"","","","","","","","",""]
[null,"d"," ",""," ",""," ",""," ",""," ",""," ",""," ",""," ",""," ","",null,null,null,null,null,null,null,null,null,"","","","","","","","",""]
[null,"d"," ",""," ",""," ",""," ",""," ",""," ",""," ",""," ",""," ","",null,null,null,null,null,null,null,null,null,"","","","","","","","",""]
[null,"d"," ",""," ",""," ",""," ",""," ",""," ",""," ",""," ",""," ","",null,null,null,null,null,null,null,null,null,"","","","","","","","",""]
[null,"d"," ",""," ",""," ",""," ",""," ",""," ",""," ",""," ",""," ","",null,null,null,null,null,null,null,null,null,"","","","","","","","",""]
[null,"d"," ",""," ",""," ",""," ",""," ",""," ",""," ",""," ",""," ","",null,null,null,null,null,null,null,null,null,"","","","","","","","",""]
[null,"d"," ",""," ",""," ",""," ",""," ",""," ",""," ",""," ",""," ","",null,null,null,null,null,null,null,null,null,"","","","","","","","",""]
[null,"d"," ",""," ",""," ",""," ",""," ",""," ",""," ",""," ",""," ","",null,null,null,null,null,null,null,null,null,"","","","","","","","",""]
[null,"d"," ",""," ",""," ",""," ",""," ",""," ",""," ",""," ",""," ","",null,null,null,null,null,null,null,null,null,"","","","","","","","",""]
[null,"d"," ",{"$f":"IFERROR(_xlfn.NUMBERVALUE(SUBSTITUTE(MID(X1144,AJ1144+1,AK1144-AJ1144-1),\".\",\",\"))*25.4,\"\")","v":""}," ",{"$f":"IFERROR(_xlfn.NUMBERVALUE(SUBSTITUTE(MID(X1144,AK1144+1,AL1144-1),\".\",\",\"))*25.4,\"\")","v":""}," ",{"$f":"IFERROR(MID(X1144,AD1144+1,AE1144-AD1144-1),\"\")","v":""}," ",{"$f":"IF(X1144<>\"\",\"n0000\",\"\")","v":""}," ",""," ",{"$f":"IFERROR(MID(X1144,AE1144+2,AF1144-AE1144-3),\"\")","v":""}," ",{"$f":"IF(X1144<>\"\",\"PP\",\"\")","v":""}," ",{"$f":"IFERROR(MID(X1144,AD1144+1,AE1144-AD1144-1),\"\")","v":""}," ",{"$f":"IFERROR(MID(X1144,AF1144+2,AG1144-AF1144-3),\"\")","v":""},null,null,null,null,null,null,null,null,null,"","","","","","","","",""]
[null,"d"," ",""," ",""," ",""," ",""," ",""," ",""," ",""," ",""," ","",null,null,null,null,null,null,null,null,null,"","","","","","","","",""]
[null,"d"," ",""," ",""," ",""," ",""," ",""," ",""," ",""," ",""," ","",null,null,null,null,null,null,null,null,null,"","","","","","","","",""]
[null,"d"," ",""," ",""," ",""," ",""," ",""," ",""," ",""," ",""," ","",null,null,null,null,null,null,null,null,null,"","","","","","","","",""]
[null,"d"," ",""," ",""," ",""," ",""," ",""," ",""," ",""," ",""," ","",null,null,null,null,null,null,null,null,null,{"$f":"IF(X1148<>\"\",\"0\",\"\")","v":""},{"$f":"IFERROR(SEARCH(\",\",X1148,1),\"\")","v":""},{"$f":"IFERROR(SEARCH(\",\",X1148,AE1148+1),\"\")","v":""},{"$f":"IFERROR(SEARCH(\",\",X1148,AF1148+1),\"\")","v":""},{"$f":"IFERROR(SEARCH(\",\",X1148,AG1148+1),\"\")","v":""},{"$f":"IFERROR(SEARCH(\",\",X1148,AH1148+1),\"\")","v":""},{"$f":"IFERROR(SEARCH(\",\",X1148,AI1148+1),\"\")","v":""},{"$f":"IFERROR(SEARCH(\",\",X1148,AJ1148+1),\"\")","v":""},{"$f":"IF(X1148<>\"\",LEN(X1148),\"\")","v":""}]

{"sheet":"Codes composants CMS","index":1,"n_rows":114,"n_cols":3,"rows_kept":114,"cut":false,"hidden":false,"merged":[]}
["COMPOSANT","Boitier","CODE GCE"]
["100 NF 0603","0603","SMD-0001"]
["BLM21 0805","0805","SMD-0002"]
["10UF 0603 10V","0603","SMD-0003"]
["18PF 0603","0603","SMD-0004"]
["33R 0603","0603","SMD-0005"]
[" 4,7K 0603","0603","SMD-0006"]
["POLYSWITCH 350mA",null,"SMD-0007"]
["SP1001-04JTG",null,"SMD-0008"]
["MR25H256",null,"SMD-0009"]
["SST26VF064",null,"SMD-0010"]
["100K 0603","0603","SMD-0011"]
["330R 0603","0603","SMD-0012"]
["1N4448",null,"SMD-0013"]
["49,9R 0603","0603","SMD-0014"]
["12PF 0603","0603","SMD-0015"]
["2K26 0603","0603","SMD-0016"]
["10K 0603","0603","SMD-0017"]
["1K 0603","0603","SMD-0018"]
["10N 0603","0603","SMD-0019"]
["1U 0603 25V","0603","SMD-0020"]
["470PF 0603","0603","SMD-0021"]
["12K1 0603","0603","SMD-0022"]
["1K5 0603","0603","SMD-0023"]
["0R 0603","0603","SMD-0024"]
["22NF 0603","0603","SMD-0025"]
["S1G",null,"SMD-0026"]
["NFM21",null,"SMD-0027"]
["10UF 0805","0805","SMD-0028"]
["1M 0805","0805","SMD-0029"]
["DIODE PD3S130H-7",null,"SMD-0030"]
["INDUCTANCE 15UH",null,"SMD-0031"]
["31,6K 0603","0603","SMD-0032"]
["MCP16301",null,"SMD-0033"]
["ULN2803",null,"SMD-0034"]
["PIC32MX795F512",null,"SMD-0035"]
["LAN8740",null,"SMD-0036"]
["OSC 50MHZ",null,"SMD-0037"]
["MMZ2012",null,"SMD-0038"]
["Connecteur ZIP 6P",null,"SMD-0039"]
["SN74LVC2G17",null,"SMD-0040"]
["Quartz 32,768Khz",null,"SMD-0041"]
["MCP79410",null,"SMD-0042"]
["ST3485EBD",null,"SMD-0043"]
["100 NF 0402","0402","SMD-0044"]
["1K 0402 1 %","0402","SMD-0045"]
["10K 0402 1 %","0402","SMD-0046"]
["SHT21",null,"SMD-0047"]
["BH1750",null,"SMD-0048"]
["PIC16F1825 QFN",null,"SMD-0049"]
["IRLML9303",null,"SMD-0050"]
["LP2985",null,"SMD-0051"]
["Conn  2P  Led Mini trap",null,"SMD-0052"]
["4,7uF 0805","0805","SMD-0053"]
["01uF 0402","0402","SMD-0054"]
["47pf 0402","0402","SMD-0055"]
["10nF 0402","0402","SMD-0056"]
["100nF 0402","0402","SMD-0057"]
["220p 0402","0402","SMD-0058"]
["15pF 0402","0402","SMD-0059"]
["3,9pF 0402","0402","SMD-0060"]
["8,2pF 0402","0402","SMD-0061"]
["5,6pF 0402","0402","SMD-0062"]
["100pF 0402","0402","SMD-0063"]
["1pF 0402","0402","SMD-0064"]
["1,5pF 0402","0402","SMD-0065"]
["3,3pF 0402","0402","SMD-0066"]
["LED 2 COLOR WURTH","PLCC4","SMD-0067"]
["PESD0402-140","0402","SMD-0068"]
["FERRITE 200R 0402","0402","SMD-0069"]
["27nH 0402","0402","SMD-0070-27nH-0402"]
["12nH 0402","0402","SMD-0071-12nH-0402"]
["18nH 0402","0402","SMD-0072-18nH-0402"]
["100K 0402","0402","SMD-0073-100K-0402"]
["56K 0402","0402","SMD-0074-056K-0402"]
["10K 0402","0402","SMD-0075-010K-0402"]
["330R 0402","0402","SMD-0076-330R-0402"]
["SWITCH SPST SMT","SSMT","SMD-0077-SWIT-SSMT"]
["TLV70033DDCT","SOT 23.5","SMD-0078-TL33-S235"]
["FTDI FT232RL","SSOP 28","SMD-0079-FTDI-SS28"]
["25AA080B","SOIC 8","SMD-0080-AA08-SO08"]
["CC1101","FQFN 50","SMD-0081-CC1101-QF50"]
["SST26WF016B","SO 8","SMD-0082-WF16-SO08"]
["PIC24FJ128GA106","TQFP 64","SMD-0083-P24F-064P"]
["SAW 868","DCC6C","SMD-0084-SAW8-CC6C"]
["SAW 433","DCC6C","SMD-0085-SAW4-CC6C"]
["QUARTZ 26M","3,2  x 2,5","SMD-0086-Q26M-3225"]
["10UF 0402","0402","SMD-0087"]
["PIC18F66K22",null,"SMD-0088"]
["2N7002",null,"SMD-0089"]
["10R 0603","0603","SMD-0090"]
["68R 0603","0603","SMD-0091"]
["33pF 0603","0603","SMD-0092"]
["ESDA6V1SC6","SOT23-6","SMD-0093"]
["CONN CARTE SIM",null,"SMD-0094"]
["470uF TANT-E",null,"SMD-0095"]
["SIM800F",null,"SMD-0096"]
["LED  ",null,"SMD-0097"]
["42K 0805","0805","SMD-0098"]
["SN74LVC1G08",null,"SMD-0099"]
["100uF TANT-E 16V",null,"SMD-0100"]
["330uF TANT-E 6V3",null,"SMD-0101"]
["INDUCTANCE 100UH",null,"SMD-0102"]
["DIODE B350A",null,"SMD-0103"]
["LM2596",null,"SMD-0104"]
["ULN2003",null,"SMD-0105"]
["100R 0603",null,"SMD-0106"]
["22U 0805","0805","SMD-0107"]
["0R 0603","0603","SMD-0108"]
["TCM310",null,"SMD-0109"]
["3K3 0603","0603","SMD-0110"]
["47U TANTALE B",null,"SMD-0111"]
["10U TANTALE A",null,"SMD-0112"]
["LD1117",null,"SMD-0113"]

{"sheet":"Codes composants TRV","index":2,"n_rows":24,"n_cols":2,"rows_kept":24,"cut":false,"hidden":false,"merged":[]}
["COMPOSANTS TRAVERSANTS","CODE GCE"]
["QUARTZ 8MHZ","TRV-0001"]
["RJ12","TRV-0002"]
["Connecteur 8 P 5MM","TRV-0003"]
["Power Jack 2,1MM","TRV-0004"]
["Connecteur 2 P 5MM","TRV-0005"]
["Connecteur 6P 5MM","TRV-0006"]
["Relais G5LA-12","TRV-0007"]
["RJ45 Magnetic","TRV-0008"]
["USBA-LP/SMD","TRV-0009"]
["RP-SMA EDGE 1,6mm","TRV-0010"]
["SMA-EDGE 1,6mm","TRV-0011"]
["RJ45G NINIGI","TRV-0012"]
["Fusible 200mA","TRV-0013"]
["MOV-14D431KTR","TRV-0014"]
["VTX-214-105","TRV-0015"]
["RELAIS 5V OJE-SH-105HM","TRV-0016"]
["SMA 90° X-ENO","TRV-0017"]
["SUPERCAP 1F","TRV-0018"]
["QUARTZ 32768","TRV-0019"]
[]
["Conn ISCP 5 x 2,54","TRV-0021"]
["Jack 3,5mm stéréo","TRV-0022"]
["Conn 2P 7,5mm","TRV-0023"]