{"text_format":"1","workbook":"xlsx","n_sheets":8,"sheets":["Menu general","CDE client du jour","MPR suivi","MP","Relance Cergy","LX02","Code MPR","Date"],"not_rendered":{"charts":0,"images":0,"macros":1,"external_links":2,"defined_names":27,"comments":0,"pivot_tables":0},"unopened":[],"bounds":{"document_bytes":16777216,"sheet_cells":100000,"rows_first":2000,"rows_last":500,"rows_between":2000,"halvings":0,"cell_chars":16384,"cell_head_chars":4096},"cells_cut":0,"cells_raw":0,"read":"whole","date_system":"1900"}

{"sheet":"Menu general","index":0,"n_rows":10,"n_cols":6,"rows_kept":10,"cut":false,"hidden":false,"merged":[]}
[{"$f":"TODAY()","v":"2016-10-24"},null,{"$error":"#REF!"}]
["Indicateur journalier MPR"]
[]
[]
["Gestion des encours MPR","Total lignes en cours","En attente de réception MPR","Réception commande du jour","Reliquats annoncés","Total réceptiondu jour"]
["Nb de lignes de commandes",{"$f":"COUNTA('MPR suivi'!E:E)-1","v":167},{"$f":"COUNTIF('MPR suivi'!L:L,\"Différé\")","v":98},{"$f":"COUNTIF('MPR suivi'!O:O,\"Soldé\")-1","v":60},{"$f":"COUNTIF('MPR suivi'!T:T,\"Reliquat\")-1","v":16},{"$f":"D6+E6","v":76}]
[]
[]
[]
[" Statistiques MPR du mois",null,"Reliquats TCR",{"$f":"COUNTIF('MPR suivi'!K:K,\"X\")-1","v":0}]

{"sheet":"CDE client du jour","index":1,"n_rows":252,"n_cols":7,"rows_kept":252,"cut":false,"hidden":false,"merged":[]}
["242961563R",200989266,"HULEUX AURELIE",9.1300000000000008,"GOULOTTE CABLAGE HABITACLE",1,"ST"]
["242964304R",200989266,"HULEUX AURELIE",2.5299999999999998,"GOULOTTE CABLAGE HABITACLE",1,"ST"]
[8200110146,200989267,"ROUET ANDRE",16.68,"ROUE 5 1/2XJ 15 4 43",2,"ST"]
[7700801863,200989267,"ROUET ANDRE",2.73,"VALVE SOUPLE MOYENNE",20,"ST"]
[7711781027,200989268,"GUIGNOT SILVERE",21,"POLAIRE RENAULT CORPORATE XXL",1,"ST"]
[7711781026,200989268,"GUIGNOT SILVERE",63,"POLAIRE RENAULT CORPORATE XL",3,"ST"]
[7711781025,200989268,"GUIGNOT SILVERE",21,"POLAIRE RENAULT CORPORATE L",1,"ST"]
["R100582895",200989269,"BIGOT PASCALE",60.09,"CASQUETTE COTON POLYESTER NOIR VISIERE R",6,"ST"]
["R100179700",200989272,"BIGOT PASCALE",44.52,"SAC TOILE PLASTIFIEE  DIM:600 X 400 X 25",3,"ST"]
["R100138764",200989273,"BELLEMOU FARID",13.89,"JERRICAN PLASTIQUE ROUGE CAPAC.10 LITRES",2,"ST"]
["R100138766",200989273,"BELLEMOU FARID",68.150000000000006,"JERRICAN PLASTIQUE ROUGE CAPACITE 20LITR",3,"ST"]
["R100645809",200989273,"BELLEMOU FARID",35,"GANTS TRICOTE TEGERA 868 NEUF",100,"ST"]
[7711781027,200989274,"JEHANNET MICHAEL",42,"POLAIRE RENAULT CORPORATE XXL",2,"ST"]
["T511373370",200989276,"COZLER DANIEL ROGER ALBERT",6.25,"BOBINE EN OUATE DE CELLULOSE COULEUR CHA",2,"ST"]
[4820990007,200989276,"COZLER DANIEL ROGER ALBERT",14.5,"C.A. 1 300X250X200 FEFCO 0201 P.A. CLASS",50,"ST"]
["290E10279R",200989288,"MOUNIER ERIC",8.92,"CABLE EXCTN CTRLR NRJ - MOTOREDUCTEUR",1,"ST"]
["R100595274",200989289,"MELOTTE DIDIER",63.5,"RUBAN ADHESIF LARG:1MM LG:16M COULEUR JA",10,"ST"]
["T732120875",200989289,"MELOTTE DIDIER",175.53,"PLAQUE DE MOUSSE POLYURETHANE RIGIDE ENT",9,"ST"]
["T517994713",200989289,"MELOTTE DIDIER",15.83,"CONTRECOLLE BLANC       1090GR/M2 EP: 1,",1,"ST"]
["802808690R",200989291,"DECAUDAIN JEAN FRANCOIS",5.42,"ENJOLIVEUR AV CADRE PORTE AV D",1,"ST"]
["802753377R",200989291,"DECAUDAIN JEAN FRANCOIS",5.42,"ENJOLIVEUR AV CADRE PORTE AV G",1,"ST"]
["802933427R",200989291,"DECAUDAIN JEAN FRANCOIS",0.75,"CACHE RETROVISEUR G",1,"ST"]
["802920366R",200989291,"DECAUDAIN JEAN FRANCOIS",0.75,"CACHE RETROVISEUR D",1,"ST"]
["801M31409R",200989291,"DECAUDAIN JEAN FRANCOIS",3.13,"CLCN FIX ENJOLIVEUR CADRE PR AV G APV",1,"ST"]
["801M25000R",200989291,"DECAUDAIN JEAN FRANCOIS",3.13,"CLCN FIX ENJOLIVEUR CADRE PR AV D APV",1,"ST"]
["963012080R",200989291,"DECAUDAIN JEAN FRANCOIS",42.56,"RETROVISEUR EXT D ELCT",1,"ST"]
["963024306R",200989291,"DECAUDAIN JEAN FRANCOIS",42.48,"RETROVISEUR EXT G ELCT",1,"ST"]
["963743020R",200989291,"DECAUDAIN JEAN FRANCOIS",2.31,"COQUILLE RTRV EXT D NOIR ETOILE",1,"ST"]
["963736440R",200989291,"DECAUDAIN JEAN FRANCOIS",5.46,"COQUILLE RETRO EXT G NEUTRE HFE",1,"ST"]
["261F15441R",200989291,"DECAUDAIN JEAN FRANCOIS",5.66,"RPTT LAT INDICATEUR DRC RTRV EXT D APV",1,"ST"]
["261F66896R",200989291,"DECAUDAIN JEAN FRANCOIS",5.66,"RPTT LAT INDICATEUR DRC RTRV EXT G APV",1,"ST"]
["963061131R",200989291,"DECAUDAIN JEAN FRANCOIS",15.31,"ENJ RPTT LAT INDC DRCL RTRV EXT G APV",1,"ST"]
["963058575R",200989291,"DECAUDAIN JEAN FRANCOIS",15.31,"ENJ RPTT LAT INDC DRCL RTRV EXT D APV",1,"ST"]
["802924312R",200989291,"DECAUDAIN JEAN FRANCOIS",2.93,"CACHE RETROVISEUR D",1,"ST"]
[8201415224,200989292,"ARNOULD JEROME",395.92,"COLLECTION CORDON DE",4,"ST"]
[7711422414,200989294,"MENAGER LAURENT",9.6,"NETTOYANT FREIN RENAULT - CAPACITE 600ML",12,"ST"]
[7711428130,200989294,"MENAGER LAURENT",39.479999999999997,"LIQUIDE DE REFROIDISSSMENT 5L APV",12,"ST"]
["R100438330",200989294,"MENAGER LAURENT",8.56,"BLOUSE H STANDARD SERGE GRIS CLAIR",1,"ST"]
["X957595004",200989294,"MENAGER LAURENT",1.1200000000000001,"SEMELLE AMOVIBLE A IMPREGNATION BACTERIO",2,"ST"]
["622568767R",200989295,"GILLES MARC",7.23,"CONVERGENT INF BOUCLIER AV",1,"ST"]
["403009592R",200989295,"GILLES MARC",91.48,"ROUE 7 1/2XJ 18 CH 5 55",2,"ST"]
["R100642534",200989297,"HERVIOU ALAIN",38.159999999999997,"AEROSOL 500ML WD40 AEROSOL",6,"ST"]
["550204EA0B",200989298,"DUHEM XAVIER",8.68,"SPR-RR",2,"ST"]
["R100339670",200989300,"AGNOLA OLIVIER",76,"RINCE OEIL (DOUCHE OPHTALMOLOGIQUE)",4,"ST"]
[8201373014,200989303,"GIRARD LOIC",37.76,"COLLECTION AIDE PARKING",1,"ST"]
[8201537464,200989303,"GIRARD LOIC",46.88,"COLLECTION AIDE PARKING AVANT APV",1,"ST"]
[8201527754,200989303,"GIRARD LOIC",176.6,"COLLECTION CAMERA AI",1,"ST"]
[7711578030,200989303,"GIRARD LOIC",48,"PACK ECLAIRAGE ZONE",1,"ST"]
[8201468376,200989303,"GIRARD LOIC",16.14,"PROTECTION COFFRE",1,"ST"]
[8200461531,200989303,"GIRARD LOIC",7.33,"BAVETTE AV",1,"ST"]
[8201487253,200989303,"GIRARD LOIC",28.66,"COLLECTION COQUILLE DE RETROVISEUR EXT",1,"ST"]
[8201275128,200989303,"GIRARD LOIC",98.31,"ALARME",1,"ST"]
["R100472924",200989304,"DENIS JEAN CLAUDE",98.3,"CABLE DE LIAISON AUTOMATE TSX MICRO PREM",2,"ST"]
[7703297121,200989305,"HAREL PATRICE",19,"SUPPORT MAXI-FUSE.REINSHAGEN ID 403145",20,"ST"]
[7711781026,200989307,"FARCY JULIEN",105,"POLAIRE RENAULT CORPORATE XL",5,"ST"]
[7711781027,200989307,"FARCY JULIEN",126,"POLAIRE RENAULT CORPORATE XXL",6,"ST"]
[7711781023,200989307,"FARCY JULIEN",21,"POLAIRE RENAULT CORPORATE S",1,"ST"]
[7711781024,200989307,"FARCY JULIEN",42,"POLAIRE RENAULT CORPORATE M",2,"ST"]
[7703602338,200989308,"POEYDOMENGE BRUNO",0.31,"VIS H EMBASE RDL M12X175-55 10-9 SA3GS",1E-3,"TH"]
["R100388724",200989310,"DUMONTIER GERALDINE",9,"SURLUNETTE  INCOLORE MONOBLOC POLYCARBON",10,"ST"]
["X955401025",200989310,"DUMONTIER GERALDINE",39.78,"VESTE STANDARD     \"IMAGE PHASE II\"  EN",3,"ST"]
["X955400034",200989310,"DUMONTIER GERALDINE",39.78,"VESTE STANDARD     \"IMAGE PHASE II\"  EN",3,"ST"]
["X955402012",200989310,"DUMONTIER GERALDINE",39.78,"VESTE STANDARD     \"IMAGE PHASE II\"  EN",3,"ST"]
["X955403014",200989310,"DUMONTIER GERALDINE",26.52,"VESTE STANDARD     \"IMAGE PHASE II\"  EN",2,"ST"]
["R100491109",200989310,"DUMONTIER GERALDINE",77.099999999999994,"CASQUETTE DE PROTECTION A VISIERE TYPE B",10,"ST"]
["R100437382",200989312,"PECQUEUR PASCAL",36.36,"PARKA GRIS MOYEN AVEC BANDE JAUNE FLUO",1,"ST"]
["X191001819",200989313,"PECQUEUR PASCAL",12231,"RACCORD  RAPIDE INOX  FILETE FEM GAZ",300,"ST"]
["X153060703",200989313,"PECQUEUR PASCAL",220.8,"UNION SIMPLE MALE LAITON TUBE  8 GAZ CO",360,"ST"]
["D180050002",200989313,"PECQUEUR PASCAL",621,"BARRETTE DE SUSPENSION TUBE   PRELEVEMEN",60,"ST"]
["888419687R",200989319,"GILLES MARC",16.510000000000002,"CEINTURE SCR G 2EME RNG",1,"ST"]
["R100151476",200989320,"SUSS MARC",36.04,"ESSUIE-MAINS  \"KLEENEX\"    ROULEAU BLANC",6,"ST"]
["R100518602",200989321,"GREGOIRE MURIELLE",22.56,"CHAUSSURES DE SECURITE \"VILLE\" NOIRES CU",1,"ST"]
["X771101006",200989322,"GALLET GILLES",7.67,"PILE BOUTON OXYDE D'ARGENT 1,5V  D:11,5",10,"ST"]
[7711382005,200989336,"TROUBOUL NICOLAS",50,"OUTIL CONSIGNE BATTE",50,"ST"]
[7703090413,200989337,"GILLES MARC",1.72,"ROULEMENT ROULEAUX CNQ 25X47-15",1,"ST"]
[143300181,200989338,"LE GAC ERWAN",2,"VIS FIX GACHE DE PORTE DE COFFRE",20,"ST"]
["R100648460",200989339,"MOUS NORDINE",74.16,"CHAUSSURE GLOVE S3-HRO-SRA T42 NOIR",1,"ST"]
["R100648461",200989339,"MOUS NORDINE",74.16,"CHAUSSURE GLOVE S3-HRO-SRA T43 NOIR",1,"ST"]
["X957594303",200989339,"MOUS NORDINE",5.54,"SEMELLE AMOVIBLE A IMPREGNATION BACTERIO",10,"ST"]
[8201454538,200989340,"GIRARD LOIC",39.75,"GRILLE PROTECTION VITRE AR",1,"ST"]
[8201454540,200989340,"GIRARD LOIC",36.130000000000003,"GRILLE PROTECTION VITRE LAT",1,"ST"]
[8201454542,200989340,"GIRARD LOIC",36.130000000000003,"GRILLE PROTECTION VITRE LAT",1,"ST"]
[8201409818,200989340,"GIRARD LOIC",43.57,"HOUSSE SIEGE AV",1,"ST"]
["788128132R",200989340,"GIRARD LOIC",8.44,"BAVETTE AR",1,"ST"]
[8201506977,200989340,"GIRARD LOIC",20.88,"PARE-SOLEIL PORTES BATTANTE ARRIERE",1,"ST"]
[8201506978,200989340,"GIRARD LOIC",21.62,"PARE-SOLEIL VITRES LATERALES",1,"ST"]
[8201506979,200989340,"GIRARD LOIC",24.62,"PARE-SOLEIL VITRES LATERALES",1,"ST"]
[8201543434,200989340,"GIRARD LOIC",31.84,"PARE-SOLEIL",1,"ST"]
[8201543439,200989340,"GIRARD LOIC",23.08,"PARE-SOLEIL",1,"ST"]
[8201353131,200989340,"GIRARD LOIC",289.57,"COLLECTION CORDON DE",1,"ST"]
["288866647R",200989341,"HAVEL ALEXANDRE MARC PHILIPPE",3.12,"BRAS ESSUIE PARE-BRISE COTE PASSAGER",1,"ST"]
["288B57752R",200989341,"HAVEL ALEXANDRE MARC PHILIPPE",3.42,"RACLETTE BALAI PASSAGER",1,"ST"]
["288810288R",200989341,"HAVEL ALEXANDRE MARC PHILIPPE",3.13,"BRAS BALAI E/PBR COTE CDC",1,"ST"]
["288953663R",200989341,"HAVEL ALEXANDRE MARC PHILIPPE",4.54,"RACLETTE ESSUIE GLACE CONDUCTEUR",1,"ST"]
["P953112572",200989344,"GOBLET EMMANUEL WILLIAM",27.56,"ANNEAU DE LEVAGE A EMBASE F:  160KG    D",4,"ST"]
["P953113572",200989344,"GOBLET EMMANUEL WILLIAM",63.8,"ANNEAU DE LEVAGE A EMBASE F:  400KG",4,"ST"]
["P953114572",200989344,"GOBLET EMMANUEL WILLIAM",38.32,"ANNEAU DE LEVAGE A EMBASE F:  630KG    D",4,"ST"]
["X971149506",200989347,"VIGNET DAVID",18.88,"CRAYON FEUTRE    INDELEBILE NOIR",10,"ST"]
[7711171413,200989349,"BLANGER ALAIN",54.46,"GODETS DE MEL. PLASTIQ. 1400ML  SECT.729",2,"ST"]
["R100174591",200989351,"FEVRIER JEAN PAUL",94.92,"ROND TREMPE-MURI     2017A(A-U4G)  T4",6,"M"]
["R100174594",200989351,"FEVRIER JEAN PAUL",133.80000000000001,"ROND TREMPE-MURI     2017A(A-U4G)  T4",6,"M"]
["R100174788",200989351,"FEVRIER JEAN PAUL",675.75,"CARRE TREMPE MURI 2017A (A-U4G) T4  70 X",3,"M"]
["T443415810",200989351,"FEVRIER JEAN PAUL",288,"CARRE TREMPE-MURI    2017A(A-U4G)  T4",2,"M"]
["X489045700",200989351,"FEVRIER JEAN PAUL",11.34,"TIGE FILETEE M22   ACIER 6-8   LG:1000",6,"ST"]
["X211353501",200989351,"FEVRIER JEAN PAUL",38.4,"TUBE ACIER NOIR  D.EXT. 33,70 EP. 3,25 P",6,"M"]
["272778970R",200989352,"GILLES MARC",5.9,"FILTRE HABITACLE",2,"ST"]
["164009384R",200989352,"GILLES MARC",11.94,"COLLECTION FILTRE CARBURANT",2,"ST"]
["165465647R",200989352,"GILLES MARC",4.3,"CARTOUCHE FILTRANTE AIR",2,"ST"]
[7701064237,200989352,"GILLES MARC",5.76,"FILTRE PARTICULE",2,"ST"]
["X771113501",200989355,"PECQUEUR PASCAL",5.34,"BLISTER DE 2 PILES LITHIUM 3V D:20MM EP:",10,"ST"]
[7711781025,200989355,"PECQUEUR PASCAL",21,"POLAIRE RENAULT CORPORATE L",1,"ST"]
["440604694R",200989356,"SEMIAO NELSON",27.1,"JEU PLAQUETTE AR",2,"ST"]
["465015137R",200989357,"KELLOU HAKIM",20.94,"PEDALIER FREIN DAD BVA",2,"ST"]
["180205139R",200989357,"KELLOU HAKIM",15.2,"PEDALIER FREIN DAG BVA",2,"ST"]
["296936637R",200989358,"LEREDDE ALEXANDRE",4.29,"MECANISME CONDAMNATION PRISE CHARGE",1,"ST"]
["R100141252",200989359,"GILLES MARC",42.92,"PINCE A RIVETER CAPACITE D:5 ALU ET 4 AC",2,"ST"]
[8201506974,200989362,"GIRARD LOIC",18.79,"PARE-SOLEIL HAYON",1,"ST"]
[8201487417,200989362,"GIRARD LOIC",101.77,"ALARME",1,"ST"]
[8201468223,200989362,"GIRARD LOIC",66.849999999999994,"ECHELLE H1 PEINTE",1,"ST"]
["R100518647",200989363,"DRAPEAU PATRICIA",26.22,"CHAUSSURES DE SECURITE BASSES TYPE BASKE",1,"ST"]
["R100518605",200989364,"JACOULT BEATRICE MARTIN",45.9,"CHAUSSURES DE SECURITE \"VILLE\" NOIRES CU",1,"ST"]
["R100033975",200989367,"FRANC ANTOINE",6.77,"ADAPTATEUR  CARRE FEM.3/8\" CARRE MALE 3/",1,"ST"]
["R100021995",200989367,"FRANC ANTOINE",10.68,"RALLONGE A ENTRAINEMET  CARRE FEMELLE 9,",1,"ST"]
["P68631621A",200989367,"FRANC ANTOINE",7.86,"RALLONGE   CARRE CONDUCTEUR MALE 3/8   F",1,"ST"]
["P68631770A",200989367,"FRANC ANTOINE",20.93,"RALLONGE CARRE CONDUCT.MALE 3/8(9,52) FE",1,"ST"]
["P686325571",200989367,"FRANC ANTOINE",13.93,"RALLONGE A ENTRAINEMENT CARRE FEM:12,7 R",1,"ST"]
["R100179193",200989367,"FRANC ANTOINE",24.11,"RALLONGE CARRE CONDUCTEUR MALE 1/2 FEMEL",1,"ST"]
["R100367649",200989367,"FRANC ANTOINE",0.64,"EMBOUT TOURNEVIS A HEXAGONE CONDUCTEUR M",1,"ST"]
["P685186571",200989367,"FRANC ANTOINE",6.86,"EMBOUT TOURNEVIS TORX ENTRAIN.HEXA.MALE:",2,"ST"]
["P685086974",200989367,"FRANC ANTOINE",0.67,"EMBOUT TOURNEVIS A HEXAGONE CONDUCTEUR M",1,"ST"]
["P685187101",200989367,"FRANC ANTOINE",1.25,"EMBOUT TOURNEVIS A ENTRAIN.HEXAG.MALE 7,",1,"ST"]
["P685022201",200989367,"FRANC ANTOINE",1.02,"EMBOUT TOURNEVIS A HEXAGONE CONDUCTEUR M",1,"ST"]
["P685022500",200989367,"FRANC ANTOINE",0.81,"EMBOUT TOURNEVIS A HEXAGONE CONDUCTEUR M",1,"ST"]
["P687173001",200989367,"FRANC ANTOINE",4.95,"ADAPTATEUR A ENTRAINEMENT CARRE  FEM. 12",1,"ST"]
["P687165002",200989367,"FRANC ANTOINE",5.09,"ADAPTATEUR A ENTRAINEMENT CARRE  FEM.  9",1,"ST"]
["P687301001",200989367,"FRANC ANTOINE",2.79,"ADAPTATEUR A ENTRAINEMENT CARRE  FEM.  6",1,"ST"]
["P687312001",200989367,"FRANC ANTOINE",5.35,"ADAPTATEUR A ENTRAINEMENT CARRE  FEM.  9",1,"ST"]
["P68731100A",200989367,"FRANC ANTOINE",4.45,"ADAPTATEUR ENTRAINEMENT CARRE FEM:9,52 (",1,"ST"]
["P683222671",200989367,"FRANC ANTOINE",5.64,"DOUILLE FEMELLE DE 7 AVEC AIMANT ENTRAIN",1,"ST"]
["P683221472",200989367,"FRANC ANTOINE",5.47,"DOUILLE HEXFEM.DE 8 ENTRAIN. HEXAG. MALE",1,"ST"]
["P683221471",200989367,"FRANC ANTOINE",5.13,"NOIX DE SERRAGE HEXA FEMELLE DE 10 MAGNE",1,"ST"]
["P687451100",200989367,"FRANC ANTOINE",3.37,"ADAPTATEUR A ENTRAINEMENT HEXAG. MALE:6,",1,"ST"]
["R100178998",200989367,"FRANC ANTOINE",5.85,"ADAPTATEUR CARRE CONDUCTEUR MALE 1/4 REC",1,"ST"]
["R100179236",200989367,"FRANC ANTOINE",28.62,"ADAPTATEUR CARRE COND.MALE 3/8 HEX.MALE",3,"ST"]
["P683221471",200989367,"FRANC ANTOINE",5.13,"NOIX DE SERRAGE HEXA FEMELLE DE 10 MAGNE",1,"ST"]
["R100491109",200989368,"FARCY JULIEN",38.549999999999997,"CASQUETTE DE PROTECTION A VISIERE TYPE B",5,"ST"]
["R100596949",200989369,"DENIS JEAN CLAUDE",0,"SERRURE MGB A INTERVERROUILLAGE COMPLETE",1,"ST"]
["656015563R",200989370,"PODEVIN LUC HERVE",6,"SERRURE CAPOT",3,"ST"]
["R100638010",200989394,"JOY MICKAEL FREDERIC",367.5,"PAIRE DE GANTS 5 DOIGTS ANTI-CHALEUR 250",30,"ST"]
["R100638009",200989394,"JOY MICKAEL FREDERIC",490,"PAIRE DE GANTS 5 DOIGTS ANTI-CHALEUR 250",40,"ST"]
["R100638008",200989394,"JOY MICKAEL FREDERIC",245,"PAIRE DE GANTS 5 DOIGTS ANTI-CHALEUR 250",20,"ST"]
["R100638007",200989394,"JOY MICKAEL FREDERIC",245,"PAIRE DE GANTS 5 DOIGTS ANTI-CHALEUR 250",20,"ST"]
["T821267141",200989397,"ENCHE JOEL",24960,"CIRE MICRONISEE,  CHARGE\"SUPERCLAY\"",4800,"KG"]
["R100187167",200989398,"MELOTTE DIDIER",3515.44,"ROULEAU DI-NOC GRIS METALLISE  LARG:0,91",2,"ST"]
["R100496604",200989398,"MELOTTE DIDIER",1430,"ROULEAU DI-NOC GRIS FONCE 20MX96CM POUR",1,"ST"]
["R100552279",200989398,"MELOTTE DIDIER",1704.84,"ROULEAU DI-NOC NOIR MAT LARG:0,930M LONG",1,"ST"]
["R100595276",200989398,"MELOTTE DIDIER",44.45,"RUBAN ADHESIF LARG:2MM LG:16M COULEUR JA",7,"ST"]
["R100595279",200989398,"MELOTTE DIDIER",68.2,"RUBAN ADHESIF LARG:4MM LG:16M COULEUR JA",10,"ST"]
["R100595284",200989398,"MELOTTE DIDIER",18.5,"RUBAN ADHESIF LARG:8MM LG:16M COULEUR JA",2,"ST"]
["R100595278",200989398,"MELOTTE DIDIER",34.1,"RUBAN ADHESIF LARG:3MM LG:16M COULEUR JA",5,"ST"]
["R100595281",200989398,"MELOTTE DIDIER",37,"RUBAN ADHESIF LARG:5MM LG:16M COULEUR JA",4,"ST"]
["R100595282",200989398,"MELOTTE DIDIER",37,"RUBAN ADHESIF LARG:6MM LG:16M COULEUR JA",4,"ST"]
["R100595284",200989398,"MELOTTE DIDIER",18.5,"RUBAN ADHESIF LARG:8MM LG:16M COULEUR JA",2,"ST"]
["T533015067",200989398,"MELOTTE DIDIER",5.63,"RUBAN ADHESIF PAPIER CREPE NOIR MAT",1,"ST"]
["R100626010",200989398,"MELOTTE DIDIER",36.5,"RUBAN ADHESIF BLANC SPECIAL CLAY",5,"ST"]
["R100604246",200989398,"MELOTTE DIDIER",19.86,"PLAQUE DE MOUSSE POLYURETHANE RIGIDE ENT",1,"ST"]
["R100364716",200989399,"EL JAHILI SARA",31.39,"PAIRE DE CHAUSSURES BASSE EN CUIR NOIR,T",1,"ST"]
["R100518629",200989401,"JULIEN WILLI",29.69,"CHAUSSURES DE SECURITE \"VILLE\" TYPE MOCA",1,"ST"]
["R100518630",200989401,"JULIEN WILLI",27.5,"CHAUSSURES DE SECURITE \"VILLE\" TYPE MOCA",1,"ST"]
[8201327012,200989402,"CHEN TCHIENG",98.28,"SURTAPIS",6,"ST"]
["R100518605",200989403,"ZELLER THIERRY",45.9,"CHAUSSURES DE SECURITE \"VILLE\" NOIRES CU",1,"ST"]
["R100648460",200989416,"AVELANGE SYLVAIN",74.16,"CHAUSSURE GLOVE S3-HRO-SRA T42 NOIR",1,"ST"]
["T533052451",200989417,"DANIOU MARTIAL",113.25,"RUBAN ADHESIF DOUBLE FACE ACRYLIQUE BLAN",5,"ST"]
["R100296382",200989418,"HABBOUT HASSANE",9.89,"PAIRE DE GANTS 5 DOIGTS TRICOTES DYNEMA",2,"ST"]
[7711781026,200989420,"LEVAAST NICOLAS",84,"POLAIRE RENAULT CORPORATE XL",4,"ST"]
[7711781027,200989420,"LEVAAST NICOLAS",42,"POLAIRE RENAULT CORPORATE XXL",2,"ST"]
["R100438330",200989420,"LEVAAST NICOLAS",17.11,"BLOUSE H STANDARD SERGE GRIS CLAIR",2,"ST"]
["R000111100",200989420,"LEVAAST NICOLAS",1.22,"PACK DE 10 PILES ALCALINE TYPE CEI :LR6",5,"ST"]
["X771101008",200989420,"LEVAAST NICOLAS",1.1200000000000001,"PACK DE 10 PILES ALCALINE 1,5V D.10 H.44",5,"ST"]
["R100095945",200989421,"DELASSUS MICHEL",2.81,"SAC POLYETHYLENE 110L STD ROUGE EP:45 MI",20,"ST"]
["R100225670",200989421,"DELASSUS MICHEL",1249.2,"FEUILLE ALUMINIUM SPECIAL POUR MESURE EP",1,"ST"]
[7711170069,200989421,"DELASSUS MICHEL",19.100000000000001,"MASQ PEINTURE                  SECT.729",2,"ST"]
["R100189360",200989423,"BROCAIL VINCENT ALAIN",10.41,"BLISTER DE 2 PILES CYLINDRIQUE D:7X41 1,",10,"ST"]
["R100539341",200989427,"FEVRIER JEAN PAUL",862.5,"PLA. USI.VERT 150M MOUSSE POLYURETHANE P",10,"ST"]
["R100539376",200989427,"FEVRIER JEAN PAUL",2300,"PLAQ USI.VERT 150M MOUSSE POLYURETHANE P",10,"ST"]
["403003754R",200989428,"DECAUDAIN JEAN FRANCOIS",530.32000000000005,"ROUE 8 J 19 5 49",8,"ST"]
[7711780423,200989429,"LEFEVRE-SIMON ISABELLE",450,"PIN'S LOSANGE 2D 15 MM",1000,"ST"]
[7711781023,200989433,"BENCHRIF SOUMAYA",21,"POLAIRE RENAULT CORPORATE S",1,"ST"]
[7711781024,200989433,"BENCHRIF SOUMAYA",21,"POLAIRE RENAULT CORPORATE M",1,"ST"]
[7711781025,200989433,"BENCHRIF SOUMAYA",21,"POLAIRE RENAULT CORPORATE L",1,"ST"]
[7711781023,200989433,"BENCHRIF SOUMAYA",21,"POLAIRE RENAULT CORPORATE S",1,"ST"]
["R100503233",200989435,"HABBOUT HASSANE",2.9,"BOITE DE 100 GANTS JETABLES POUDRES EN V",1,"ST"]
["R100503233",200989436,"HABBOUT HASSANE",2.9,"BOITE DE 100 GANTS JETABLES POUDRES EN V",1,"ST"]
["R100507482",200989437,"HABBOUT HASSANE",16.52,"BOITE DE 100 GANTS JETABLES EN NITRILE V",2,"ST"]
["R100187249",200989439,"PIAT JEROME",137,"TAPIS ABSORBANT POUR LIQUIDE CHIMIQUE 40",100,"ST"]
["R100115468",200989440,"HABBOUT HASSANE",36.9,"AEROSOL 150ML LE SPRAY DU MARCHEUR",5,"ST"]
["R100438329",200989441,"ADAM SYLVIE PATRICIA MURIEL",26.09,"BLOUSE H STANDARD SERGE GRIS CLAIR",3,"ST"]
["R100582895",200989441,"ADAM SYLVIE PATRICIA MURIEL",100.15,"CASQUETTE COTON POLYESTER NOIR VISIERE R",10,"ST"]
["R100437413",200989441,"ADAM SYLVIE PATRICIA MURIEL",24.24,"VESTE H STANDARD GRIS MOYEN OPPOSITION G",3,"ST"]
["R100162178",200989442,"MARONGIU JEAN-FRANCOIS",12.2,"BACTERICIDE \"WYRITOL\"  EN AEROSOL  750ML",2,"ST"]
["P935852670",200989444,"HERVIOU ALAIN",10.1,"MOUCHOIRS ENCHEVETRES  BOITE DE 100",10,"ST"]
["403004629R",200989446,"DECAUDAIN JEAN FRANCOIS",41.04,"ROUE 6 J 15 H2 5 44",4,"ST"]
["403154960R",200989446,"DECAUDAIN JEAN FRANCOIS",18.93,"ENJOLIVEUR ROUE",4,"ST"]
[8200381353,200989446,"DECAUDAIN JEAN FRANCOIS",1.1200000000000001,"ENJOLIVEUR ROUE SCRIPT",4,"ST"]
["P739602006",200989448,"HERVIOU ALAIN",4.46,"JAUGE D'EPAISSEUR LG:90 AV.19 LAMES.",1,"ST"]
["R100211944",200989451,"HERVIOU ALAIN",29,"CHARGEUR D'ACCU NIMH SANS EFFET MEMOIRE",1,"ST"]
[8201440358,200989453,"GIRARD LOIC",45.57,"FAISCEAU 7 BROCHE X82",1,"ST"]
[8201441948,200989453,"GIRARD LOIC",48.4,"FAISCEAU 13BAM",1,"ST"]
[8201413368,200989453,"GIRARD LOIC",32.369999999999997,"TRAVERSE ATTELAGE CARAVANE",1,"ST"]
[8201413366,200989453,"GIRARD LOIC",28.22,"ROTULE ATTELAGE REMORQUE",1,"ST"]
["T860569804",200989454,"TOUTAIN THIERRY",64.5,"PEINTURE NOIRE MAT ISOLANTE ELECT. AEROS",6,"ST"]
[8200070652,200989455,"TOUTAIN THIERRY",15.92,"GOUJON M8-125",50,"ST"]
[7700854668,200989455,"TOUTAIN THIERRY",132.19999999999999,"JOINT POUR BRIDE PLATE",10,"ST"]
["R100648459",200989456,"VITALIS DE GRANZIAL LAETITIA",145,"CHAUSSURE GLOVE S3-HRO-SRA T40 NOIR",2,"ST"]
["R100648463",200989456,"VITALIS DE GRANZIAL LAETITIA",74.16,"CHAUSSURE GLOVE S3-HRO-SRA T45 NOIR",1,"ST"]
["964112215R",200989457,"RUELLAN ANDRE",0.8,"CROCHET CTL PARE-SOLEIL",2,"ST"]
["681006566R",200989459,"VEUILLOT OLIVIER",312.64,"PLANCHE BORD EQP",4,"ST"]
["R100648461",200989460,"ADAM SYLVIE PATRICIA MURIEL",74.16,"CHAUSSURE GLOVE S3-HRO-SRA T43 NOIR",1,"ST"]
["R100636841",200989460,"ADAM SYLVIE PATRICIA MURIEL",9.1,"GANTS PROTECTION COUPURE NIV 5 TAILLE 7",2,"ST"]
["R100636850",200989460,"ADAM SYLVIE PATRICIA MURIEL",9.1,"GANTS PROTECTION COUPURE NIV 5 TAILLE 9",2,"ST"]
["R100648467",200989460,"ADAM SYLVIE PATRICIA MURIEL",74.16,"CHAUSSURE GLOVE S3-HRO-SRA T38 NOIR",1,"ST"]
["985253411R",200989462,"PILLAUD PATRICE",129.66,"SAC GONFLABLE PASSAGER",6,"ST"]
["403000579R",200989463,"GILLES MARC",96.16,"ROUE 7 J 17 CH 5 49",2,"ST"]
["R100023101",200989463,"GILLES MARC",404.58,"PERCEUSE R.ANGLE VARIAT.VIT.0A800T/MN BA",2,"ST"]
["R100437425",200989464,"ADAM SYLVIE PATRICIA MURIEL",17.62,"VESTE F STANDARD GRIS MOYEN OPPOSITION G",2,"ST"]
["R100437741",200989464,"ADAM SYLVIE PATRICIA MURIEL",49.74,"VESTE H TOLIER GRIS MOYEN OPPOSITION GRI",3,"ST"]
[8201327012,200989468,"RATHERY KARINE",655.20000000000005,"SURTAPIS",40,"ST"]
["R100648462",200989469,"ADAM SYLVIE PATRICIA MURIEL",74.16,"CHAUSSURE GLOVE S3-HRO-SRA T44 NOIR",1,"ST"]
["802856201R",200989470,"MALGUY STEPHANE",3.49,"ENJOLIVEUR MONTANT AR PORTE AV G",1,"ST"]
["822826998R",200989470,"MALGUY STEPHANE",3.52,"ENJOLIVEUR MONTANT AV PORTE AR G",1,"ST"]
["X959411700",200989475,"GUIGNOT SILVERE",135.68,"BARRIERE EXTENSIBLE SUR PIEDS COULEUR RO",2,"ST"]
["R900589056",200989476,"MARTIN JOEL",1000,"FRAISE RAGREAGE 2 LAMES CENTREES BRISE C",4,"ST"]
["R900589056",200989477,"MARTIN JOEL",1000,"FRAISE RAGREAGE 2 LAMES CENTREES BRISE C",4,"ST"]
["R900589057",200989477,"MARTIN JOEL",1000,"FRAISE DE RAGREAGE 2 LAMES CENTREES BRIS",4,"ST"]
[7703072361,200989478,"LE GAC ERWAN",0.51,"PLASTI RIVET DIAM 6",20,"ST"]
[7703046143,200989478,"LE GAC ERWAN",0.15,"ECROU TOLE DIAM 4,2 SA1GD",10,"ST"]
[7703081222,200989478,"LE GAC ERWAN",0.12,"CLIP DE MAINTIEN DIAM 6",5,"ST"]
["054000001R",200989478,"LE GAC ERWAN",0.26,"PLASTI-RIVET  8",20,"ST"]
[7711429184,200989484,"MELOTTE DIDIER",7.74,"SUPER DEGRIP NON INFLAMMABLE",6,"ST"]
["P021117102",200989484,"MELOTTE DIDIER",8.76,"FORET D:3,5 LG.TOT:70 LG.TAIL:39 Q.CYL.A",5,"ST"]
["P931114100",200989484,"MELOTTE DIDIER",7.69,"PINCEAU PLAT BATIMENT N°24  LARG.45",24,"ST"]
["P67112640A",200989484,"MELOTTE DIDIER",19.66,"PINCE PLATE     A BOUTS DR. ET COURS  FA",2,"ST"]
[7711420184,200989484,"MELOTTE DIDIER",29.4,"IXTAR NETTOYANT JANTES",12,"ST"]
["X912167187",200989484,"MELOTTE DIDIER",30,"CADENAS LAITON MASSIF  CYLINDRE LAITON A",10,"ST"]
[7703072132,200989484,"MELOTTE DIDIER",10.4,"RIVET G4,8-12,5",500,"ST"]
[7711170356,200989484,"MELOTTE DIDIER",2820,"RIVET 4.26 BLANC               SECT.729",500,"ST"]
[7703072047,200989484,"MELOTTE DIDIER",12.05,"RIVET G4,8-16 ALU",500,"ST"]
[7711170355,200989484,"MELOTTE DIDIER",2820,"RIVET 4.26 JAUNE               SECT.729",500,"ST"]
["R100525245",200989485,"GILLES MARC",61.2,"GANTS ENDUIT POLYURETHANE/NITRILE NOIR E",30,"ST"]
["R100525247",200989485,"GILLES MARC",61.17,"GANTS ENDUIT POLYURETHANE/NITRILE NOIR E",30,"ST"]
[7711780930,200989486,"BEAUDOUIN ENRIQUE",175.9,"PACK HISTORIC 1",1,"ST"]
[7711780931,200989486,"BEAUDOUIN ENRIQUE",138.4,"PACK HISTORIC 2",1,"ST"]

{"sheet":"MPR suivi","index":2,"n_rows":169,"n_cols":25,"rows_kept":169,"cut":false,"hidden":false,"merged":[]}
[{"$f":"CONCATENATE(C1,\"-\",D1)","v":"-"},{"$f":"G1-DATE(YEAR(G1),1,0)","v":1},null,null,null,null,"2004-01-01",null,null,{"$f":"IF(ISERROR(VLOOKUP(A1,Base_MP,6,FALSE)),\"\",\"X\")","v":"X"},{"$f":"IF(ISERROR(VLOOKUP(E1,'LX02'!$A$1:$D$150,1,FALSE)),\"\",\"X\")","v":"X"},{"$f":"IF(I1=\"\",TODAY(),\"Différé\")","v":"2016-10-24"},{"$f":"IF(ISERROR(VLOOKUP(A1,Base_MP,11,0)),H1,VLOOKUP(A1,Base_MP,11,0))","v":0},{"$f":"IF(I1=\"\",\"520\",\"\")","v":"520"},{"$f":"IF(N1=\"Litige\",\"Litige\",IF(AND(N1=\"520\",H1=M1),\"Soldé\",IF(N1=\"Annulé\",\"Annulé\",\"\")))","v":"Soldé"},{"$f":"IF(N1=\"Litige\",\"Litige\",IF(O1=\"Soldé\",1,IF(O1=520,$L1-$G1-INT(($L1-MOD($L1-JUn,7)-$G1+7)/7)-INT(($L1-MOD($L1-JDeux,7)-$G1+7)/7)-(SUMPRODUCT((_Fer2>=$G1)-(_Fer2>$L1)))+SUMPRODUCT(((WEEKDAY(_Fer2)=WEEKDAY(JUn))+(WEEKDAY(_Fer2)=WEEKDAY(JDeux)))*(_Fer2>=$L1)*(_Fer2<=$L1)),IF(N1=\"Annulé\",\"Annulé\",\"\"))))","v":1},{"$f":"IF(AND(J1=\"x\",I1=\"\"),\"351 ou litige\",IF(AND(O1=\"Soldé\",H1=M1),\"\",IF(ISERROR(VLOOKUP(N1,Code_MPR,2,FALSE)),\"351 ou Litige\",VLOOKUP(N1,Code_MPR,2,FALSE))))","v":"351 ou litige"},null,{"$f":"IF(P1=\"Annulé\",\"Annulé\",IF(P1=\"Litige\",\"Litige\",IF(P1>3,\"+ de 3 jours\",P1)))","v":1},{"$f":"IF(N1=311,\"Reliquat\",IF(O1=311,\"Reliquat\",IF(I1<>\"X\",\"CDE Jour\",\"\")))","v":"CDE Jour"},{"$f":"VLOOKUP(E1,client,3,FALSE)","v":{"$error":"#N/A"}},{"$f":"VLOOKUP(E1,client,2,FALSE)","v":{"$error":"#N/A"}},{"$f":"VLOOKUP(E1,client,6,FALSE)","v":{"$error":"#N/A"}},{"$f":"H1","v":0}]
["Controle","Quantieme","N° de commande RE03","Ligne RE03","Référence","Désignation","Date","Qté C","x","Sq","LX02","Reliquats",{"$f":"IF(ISERROR(VLOOKUP(A2,Base_MP,11,0)),H2,VLOOKUP(A2,Base_MP,11,0))","v":"Qté C"},"Motif ","Statut final MPR\nou Commentaires","Délai MPR","Motif différé MPR","Motif différé TCR","Calcul tranche délai TDB","Attendu de livraison","Nom client","Commande client","Qté  CDE Client","Qté cde frs"]
[{"$f":"CONCATENATE(C3,\"-\",D3)","v":"4700043626-320"},{"$f":"G3-DATE(YEAR(G3),1,0)","v":173},4700043626,320,7711575964,"Pack Historic 2\n7711780931","2016-06-21",1,"X",{"$f":"IF(ISERROR(VLOOKUP(A3,Base_MP,6,FALSE)),\"\",\"X\")","v":"X"},{"$f":"IF(ISERROR(VLOOKUP(E3,'LX02'!$A$1:$D$150,1,FALSE)),\"\",\"X\")","v":""},{"$f":"IF(I3=\"\",TODAY(),\"Différé\")","v":"Différé"},{"$f":"IF(ISERROR(VLOOKUP(A3,Base_MP,11,0)),H3,VLOOKUP(A3,Base_MP,11,0))","v":1},230,{"$f":"IF(N3=\"Litige\",\"Litige\",IF(AND(N3=\"520\",H3=M3),\"Soldé\",IF(N3=\"Annulé\",\"Annulé\",\"\")))","v":""},{"$f":"IF(N3=\"Litige\",\"Litige\",IF(O3=\"Soldé\",1,IF(O3=520,$L3-$G3-INT(($L3-MOD($L3-JUn,7)-$G3+7)/7)-INT(($L3-MOD($L3-JDeux,7)-$G3+7)/7)-(SUMPRODUCT((_Fer2>=$G3)-(_Fer2>$L3)))+SUMPRODUCT(((WEEKDAY(_Fer2)=WEEKDAY(JUn))+(WEEKDAY(_Fer2)=WEEKDAY(JDeux)))*(_Fer2>=$L3)*(_Fer2<=$L3)),IF(N3=\"Annulé\",\"Annulé\",\"\"))))","v":""},"Manque stock",null,{"$f":"IF(P3=\"Annulé\",\"Annulé\",IF(P3=\"Litige\",\"Litige\",IF(P3>3,\"+ de 3 jours\",P3)))","v":"+ de 3 jours"},{"$f":"IF(N3=311,\"Reliquat\",IF(O3=311,\"Reliquat\",IF(I3<>\"X\",\"CDE Jour\",\"\")))","v":""},{"$error":"#N/A"},{"$error":"#N/A"},{"$error":"#N/A"},{"$f":"H3","v":1},"mi-décembre"]
["4700043671-350",180,4700043671,350,"410114EA0A","CALIPER ASSY-BRAKE,W/O PAD LH","2016-06-28",30,"X","X",{"$f":"IF(ISERROR(VLOOKUP(E4,'LX02'!$A$1:$D$150,1,FALSE)),\"\",\"X\")","v":""},"Différé",30,230,"","","Manque stock",null,"+ de 3 jours","",{"$error":"#N/A"},{"$error":"#N/A"},{"$error":"#N/A"},30,"2016-09-30"]
["4700043822-170",207,4700043822,170,7705030156,"RACCORD 2 VOIES 20X20","2016-07-25",20,"X","X",{"$f":"IF(ISERROR(VLOOKUP(E5,'LX02'!$A$1:$D$150,1,FALSE)),\"\",\"X\")","v":""},"Différé",20,230,"","","Manque stock",null,"+ de 3 jours","",{"$error":"#N/A"},{"$error":"#N/A"},{"$error":"#N/A"},20]
["4700043829-320",208,4700043829,320,"144B05233R","POMPE EAU ADDITIONNELLE","2016-07-26",2,"X","X",{"$f":"IF(ISERROR(VLOOKUP(E6,'LX02'!$A$1:$D$150,1,FALSE)),\"\",\"X\")","v":""},"Différé",2,220,"","","Bloquée pénurie gestionnaire",null,"+ de 3 jours","","GINOUX CHRISTIAN",200984281,0.02,2]
["4700043864-310",215,4700043864,310,7711782372,"SPINBOARD ALPINE","2016-08-02",1,"X","X",{"$f":"IF(ISERROR(VLOOKUP(E7,'LX02'!$A$1:$D$150,1,FALSE)),\"\",\"X\")","v":""},"Différé",1,130,"","","Nouvelle référence",null,"+ de 3 jours","",{"$error":"#N/A"},{"$error":"#N/A"},{"$error":"#N/A"},1]
["4700043996-200",242,4700043996,200,"628908106R","EMBLEME AV","2016-08-29",2,"X","X",{"$f":"IF(ISERROR(VLOOKUP(E8,'LX02'!$A$1:$D$150,1,FALSE)),\"\",\"X\")","v":""},"Différé",2,220,"","",{"$f":"IF(AND(J8=\"x\",I8=\"\"),\"351 ou litige\",IF(AND(O8=\"Soldé\",H8=M8),\"\",IF(ISERROR(VLOOKUP(N8,Code_MPR,2,FALSE)),\"351 ou Litige\",VLOOKUP(N8,Code_MPR,2,FALSE))))","v":"Bloquée pénurie gestionnaire"},null,"+ de 3 jours","","BELLETOILE MARTIAL",200984265,2,2]
["4700044012-490",244,4700044012,490,"255545857R","TRANSMISSION ELCT RTTF CDE SOUS VLT","2016-08-31",12,null,"X",{"$f":"IF(ISERROR(VLOOKUP(E9,'LX02'!$A$1:$D$150,1,FALSE)),\"\",\"X\")","v":""},"2016-10-24",12,230,520,38,"351 ou litige",null,"+ de 3 jours","CDE Jour",{"$error":"#N/A"},{"$error":"#N/A"},{"$error":"#N/A"},12]
["4700044052-360",250,4700044052,360,7711419431,"PON\\EUSE 1 MAIN","2016-09-06",2,"X","X",{"$f":"IF(ISERROR(VLOOKUP(E10,'LX02'!$A$1:$D$150,1,FALSE)),\"\",\"X\")","v":""},"Différé",2,230,"","","Manque stock",null,"+ de 3 jours","","GILLES MARC",200984319,1,2]
["4700044063-700",251,4700044063,700,"628908106R","EMBLEME AV","2016-09-07",2,"X","X",{"$f":"IF(ISERROR(VLOOKUP(E11,'LX02'!$A$1:$D$150,1,FALSE)),\"\",\"X\")","v":""},"Différé",2,220,"","","Bloquée pénurie gestionnaire",null,"+ de 3 jours","","COTTENCIN FREDERIC",200984297,2,2]
["4700044073-200",252,4700044073,200,7701421117,"REPARATION PLASTIQUE","2016-09-08",2,"X","X",{"$f":"IF(ISERROR(VLOOKUP(E12,'LX02'!$A$1:$D$150,1,FALSE)),\"\",\"X\")","v":""},"Différé",2,230,"","","Manque stock",null,"+ de 3 jours","","SERBAN FLORIN MIHAIL",200984424,2,2]
["4700044073-230",252,4700044073,230,7701512272,"TENDEUR","2016-09-08",1,"X","X",{"$f":"IF(ISERROR(VLOOKUP(E13,'LX02'!$A$1:$D$150,1,FALSE)),\"\",\"X\")","v":""},"Différé",1,230,"","","Manque stock",null,"+ de 3 jours","","GILLES MARC",200984427,1,1]
["4700044073-380",252,4700044073,380,7711579329,"PINS ALPINE BRILLANT","2016-09-08",200,"X","X",{"$f":"IF(ISERROR(VLOOKUP(E14,'LX02'!$A$1:$D$150,1,FALSE)),\"\",\"X\")","v":""},"Différé",200,311,"","","Affectée non expédiée",null,"+ de 3 jours","Reliquat","TOURNEUR SOPHIE",200984343,200,200]
["4700044073-520",252,4700044073,520,"403006329R","ROUE 6 J 16 H2 5 50","2016-09-08",125,"X","X",{"$f":"IF(ISERROR(VLOOKUP(E15,'LX02'!$A$1:$D$150,1,FALSE)),\"\",\"X\")","v":""},"Différé",125,230,"","","Manque stock",null,"+ de 3 jours","","LEGENDRE SEBASTIEN",200984347,125,125]
["4700044091-120",256,4700044091,120,"727125064R","VITRE PARE-BRISE ACOUSTIQUE CPTR PLUIE","2016-09-12",3,"X","X",{"$f":"IF(ISERROR(VLOOKUP(E16,'LX02'!$A$1:$D$150,1,FALSE)),\"\",\"X\")","v":""},"Différé",3,230,"","","Manque stock",null,"+ de 3 jours","","GILLES MARC",200984650,2,3]
["4700044099-250",257,4700044099,250,"8200420632\n8200725767","CHAPE DEBRAYAGE DAG","2016-09-13",2,"X","X",{"$f":"IF(ISERROR(VLOOKUP(E17,'LX02'!$A$1:$D$150,1,FALSE)),\"\",\"X\")","v":""},"Différé",2,230,"","","Manque stock",null,"+ de 3 jours","","DELPUECH PATRICK JEAN ANTOINE",200984968,2,2]
["4700044099-300",257,4700044099,300,"8200517930\n8200725767","PEDALIER DEBRAYAGE CPSR DAG EQP","2016-09-13",2,"X","X",{"$f":"IF(ISERROR(VLOOKUP(E18,'LX02'!$A$1:$D$150,1,FALSE)),\"\",\"X\")","v":""},"Différé",2,230,"","","Manque stock",null,"+ de 3 jours","","DELPUECH PATRICK JEAN ANTOINE",200984968,2,2]
["4700044110-230",258,4700044110,230,8200545725,"CALE MOUSSE","2016-09-14",300,"X","X",{"$f":"IF(ISERROR(VLOOKUP(E19,'LX02'!$A$1:$D$150,1,FALSE)),\"\",\"X\")","v":""},"Différé",300,230,"","",{"$f":"IF(AND(J19=\"x\",I19=\"\"),\"351 ou litige\",IF(AND(O19=\"Soldé\",H19=M19),\"\",IF(ISERROR(VLOOKUP(N19,Code_MPR,2,FALSE)),\"351 ou Litige\",VLOOKUP(N19,Code_MPR,2,FALSE))))","v":"Manque stock"},null,"+ de 3 jours","","GILLES MARC",200985089,300,300]
["4700044119-320",259,4700044119,320,"628908106R","EMBLEME AV","2016-09-15",2,"X","X",{"$f":"IF(ISERROR(VLOOKUP(E20,'LX02'!$A$1:$D$150,1,FALSE)),\"\",\"X\")","v":""},"Différé",2,220,"","","Bloquée pénurie gestionnaire",null,"+ de 3 jours","","COTTENCIN FREDERIC",200985229,2,2]
["4700044137-470",263,4700044137,470,"628908106R","EMBLEME AV","2016-09-19",2,"X","X",{"$f":"IF(ISERROR(VLOOKUP(E21,'LX02'!$A$1:$D$150,1,FALSE)),\"\",\"X\")","v":""},"Différé",2,220,"","",{"$f":"IF(AND(J21=\"x\",I21=\"\"),\"351 ou litige\",IF(AND(O21=\"Soldé\",H21=M21),\"\",IF(ISERROR(VLOOKUP(N21,Code_MPR,2,FALSE)),\"351 ou Litige\",VLOOKUP(N21,Code_MPR,2,FALSE))))","v":"Bloquée pénurie gestionnaire"},null,"+ de 3 jours","","COTTENCIN FREDERIC",200985466,1,2]
["4700044166-170",266,4700044166,170,7700428589,"SUPPORT POMPE CRBT.DRAFTEX 500802000","2016-09-22",100,"X","X",{"$f":"IF(ISERROR(VLOOKUP(E22,'LX02'!$A$1:$D$150,1,FALSE)),\"\",\"X\")","v":""},"Différé",100,230,"","","Manque stock",null,"+ de 3 jours","","BROTONNE NICOLAS",200985980,100,100]
["4700044166-310",266,4700044166,310,7711425783,"FILTRE FIN","2016-09-22",1,"X","X",{"$f":"IF(ISERROR(VLOOKUP(E23,'LX02'!$A$1:$D$150,1,FALSE)),\"\",\"X\")","v":""},"Différé",1,230,"","","Manque stock",null,"+ de 3 jours","","ROSENSTIEL ARNAUD",200986043,1,1]
["4700044174-420",267,4700044174,420,"144B05233R","POMPE EAU ADDITIONNELLE","2016-09-23",1,"X","X",{"$f":"IF(ISERROR(VLOOKUP(E24,'LX02'!$A$1:$D$150,1,FALSE)),\"\",\"X\")","v":""},"Différé",1,230,"","","Manque stock",null,"+ de 3 jours","","DIOUF FATOU",200986140,1,1]
["4700044182-300",270,4700044182,300,7703297121,"SUPPORT MAXI-FUSE.REINSHAGEN ID 403145","2016-09-26",200,"X","X",{"$f":"IF(ISERROR(VLOOKUP(E25,'LX02'!$A$1:$D$150,1,FALSE)),\"\",\"X\")","v":""},"Différé",200,230,"","","Manque stock",null,"+ de 3 jours","","FEFEU JOEL",200986422,200,200]
["4700044182-330",270,4700044182,330,7711381969,"OUTIL CALAGE AAC","2016-09-26",3,"X","X",{"$f":"IF(ISERROR(VLOOKUP(E26,'LX02'!$A$1:$D$150,1,FALSE)),\"\",\"X\")","v":""},"Différé",3,230,"","","Manque stock",null,"+ de 3 jours","","NICOL YVES",200986404,3,3]
["4700044182-720",270,4700044182,720,"296955229R","CABLAGE PRISE CHARGE","2016-09-26",3,"X","X",{"$f":"IF(ISERROR(VLOOKUP(E27,'LX02'!$A$1:$D$150,1,FALSE)),\"\",\"X\")","v":""},"Différé",3,230,"","","Manque stock",null,"+ de 3 jours","","BERNARD DE JANDIN BENOIT",200986402,3,3]
["4700044182-780",270,4700044182,780,"465039034R","PEDALIER DEBRAYAGE DAG","2016-09-26",6,"X","X",{"$f":"IF(ISERROR(VLOOKUP(E28,'LX02'!$A$1:$D$150,1,FALSE)),\"\",\"X\")","v":""},"Différé",6,230,"","","Manque stock",null,"+ de 3 jours","","KELLOU HAKIM",200986313,6,6]
["4700044189-480",271,4700044189,480,"749021679R","TAPIS HABITACLE AV","2016-09-27",1,"X","X",{"$f":"IF(ISERROR(VLOOKUP(E29,'LX02'!$A$1:$D$150,1,FALSE)),\"\",\"X\")","v":""},"Différé",1,230,"","","Manque stock",null,"+ de 3 jours","","CRUCHET CHRISTIAN",200986595,1,1]
["4700044196-330",272,4700044196,330,7711381769,"CALAGE AAC M9R","2016-09-28",3,"X","X",{"$f":"IF(ISERROR(VLOOKUP(E30,'LX02'!$A$1:$D$150,1,FALSE)),\"\",\"X\")","v":""},"Différé",3,230,"","","Manque stock",null,"+ de 3 jours","","NICOL YVES",200986635,3,3]
["4700044196-340",272,4700044196,340,7711419431,"PON\\EUSE 1 MAIN","2016-09-28",6,"X","X",{"$f":"IF(ISERROR(VLOOKUP(E31,'LX02'!$A$1:$D$150,1,FALSE)),\"\",\"X\")","v":""},"Différé",6,230,"","","Manque stock",null,"+ de 3 jours","","MANCEL FRANCIS",200986727,6,6]
["4700044215-190",274,4700044215,190,7711392297,"CLES USB R.NET","2016-09-30",20,"X","X",{"$f":"IF(ISERROR(VLOOKUP(E32,'LX02'!$A$1:$D$150,1,FALSE)),\"\",\"X\")","v":""},"Différé",20,230,"","","Manque stock",null,"+ de 3 jours","","BOURGUIGNON ISABEL",200987062,20,20]
["4700044223-60",277,4700044223,60,7711381973,"CLE 4-40 NMRQ 1/4","2016-10-03",1,"X","X",{"$f":"IF(ISERROR(VLOOKUP(E33,'LX02'!$A$1:$D$150,1,FALSE)),\"\",\"X\")","v":""},"Différé",1,230,"","",{"$f":"IF(AND(J33=\"x\",I33=\"\"),\"351 ou litige\",IF(AND(O33=\"Soldé\",H33=M33),\"\",IF(ISERROR(VLOOKUP(N33,Code_MPR,2,FALSE)),\"351 ou Litige\",VLOOKUP(N33,Code_MPR,2,FALSE))))","v":"Manque stock"},null,"+ de 3 jours","","TOUTAIN THIERRY",200987246,1,1]
["4700044223-310",277,4700044223,310,7703497285,"CLIP TIMER CAGE.AMP 144432-1","2016-10-03",50,"X","X",{"$f":"IF(ISERROR(VLOOKUP(E34,'LX02'!$A$1:$D$150,1,FALSE)),\"\",\"X\")","v":""},"Différé",50,230,"","","Manque stock",null,"+ de 3 jours","","POUX JEAN",200987111,50,50]
["4700044223-460",277,4700044223,460,"214101428R","RADIATEUR","2016-10-03",1,"X",{"$f":"IF(ISERROR(VLOOKUP(A35,Base_MP,6,FALSE)),\"\",\"X\")","v":"X"},{"$f":"IF(ISERROR(VLOOKUP(E35,'LX02'!$A$1:$D$150,1,FALSE)),\"\",\"X\")","v":""},"Différé",1,230,"",{"$f":"IF(N35=\"Litige\",\"Litige\",IF(O35=\"Soldé\",1,IF(O35=520,$L35-$G35-INT(($L35-MOD($L35-JUn,7)-$G35+7)/7)-INT(($L35-MOD($L35-JDeux,7)-$G35+7)/7)-(SUMPRODUCT((_Fer2>=$G35)-(_Fer2>$L35)))+SUMPRODUCT(((WEEKDAY(_Fer2)=WEEKDAY(JUn))+(WEEKDAY(_Fer2)=WEEKDAY(JDeux)))*(_Fer2>=$L35)*(_Fer2<=$L35)),IF(N35=\"Annulé\",\"Annulé\",\"\"))))","v":""},"Manque stock",null,"+ de 3 jours","","MENAGER LAURENT",200987164,1,1]
["4700044223-580",277,4700044223,580,"476608628R","BLOC HYDRAULIQUE ABS","2016-10-03",1,"X","X",{"$f":"IF(ISERROR(VLOOKUP(E36,'LX02'!$A$1:$D$150,1,FALSE)),\"\",\"X\")","v":""},"Différé",1,230,"","","Manque stock",null,"+ de 3 jours","","MAIGNE EMMANUEL",200987124,1,1]
["4700044234-150",278,4700044234,150,7701394430,"ADHESIF EPOXY  RAP","2016-10-04",3,"X","X",{"$f":"IF(ISERROR(VLOOKUP(E37,'LX02'!$A$1:$D$150,1,FALSE)),\"\",\"X\")","v":""},"Différé",3,230,"","","Manque stock",null,"+ de 3 jours","","RICHARD JEAN",200987336,2,3]
["4700044234-310",278,4700044234,310,"296099924R","CHARGEUR-BOITIER CONNEXION CALIBRE","2016-10-04",1,"X","X",{"$f":"IF(ISERROR(VLOOKUP(E38,'LX02'!$A$1:$D$150,1,FALSE)),\"\",\"X\")","v":""},"Différé",1,230,"","","Manque stock",null,"+ de 3 jours","","POUX JEAN",200987325,1,1]
["4700044242-380",279,4700044242,380,"749021679R","TAPIS HABITACLE AV","2016-10-05",2,"X","X",{"$f":"IF(ISERROR(VLOOKUP(E39,'LX02'!$A$1:$D$150,1,FALSE)),\"\",\"X\")","v":""},"Différé",2,230,"","","Manque stock",null,"+ de 3 jours","","CRUCHET CHRISTIAN",200987546,1,2]
["4700044260-80",281,4700044260,80,8201571730,"COLLECTION CORDON DE","2016-10-07",1,"X","X",{"$f":"IF(ISERROR(VLOOKUP(E40,'LX02'!$A$1:$D$150,1,FALSE)),\"\",\"X\")","v":""},"Différé",1,230,"","","Manque stock",null,"+ de 3 jours","",{"$error":"#N/A"},{"$error":"#N/A"},{"$error":"#N/A"},1]
["4700044260-390",281,4700044260,390,8201489213,"COLLECTION CORDON DE","2016-10-07",2,"X","X",{"$f":"IF(ISERROR(VLOOKUP(E41,'LX02'!$A$1:$D$150,1,FALSE)),\"\",\"X\")","v":""},"Différé",2,220,"","",{"$f":"IF(AND(J41=\"x\",I41=\"\"),\"351 ou litige\",IF(AND(O41=\"Soldé\",H41=M41),\"\",IF(ISERROR(VLOOKUP(N41,Code_MPR,2,FALSE)),\"351 ou Litige\",VLOOKUP(N41,Code_MPR,2,FALSE))))","v":"Bloquée pénurie gestionnaire"},null,"+ de 3 jours","",{"$error":"#N/A"},{"$error":"#N/A"},{"$error":"#N/A"},2]
["4700044272-170",284,4700044272,170,7701394430,"ADHESIF EPOXY  RAP","2016-10-10",5,"X","X",{"$f":"IF(ISERROR(VLOOKUP(E42,'LX02'!$A$1:$D$150,1,FALSE)),\"\",\"X\")","v":""},"Différé",5,230,"","","Manque stock",null,"+ de 3 jours","","TOUTAIN THIERRY",200987886,5,5]
["4700044289-50",286,4700044289,50,7711426403,"BOBINE ESSUY BLEU","2016-10-12",2,"X","X",{"$f":"IF(ISERROR(VLOOKUP(E43,'LX02'!$A$1:$D$150,1,FALSE)),\"\",\"X\")","v":""},{"$f":"IF(I43=\"\",TODAY(),\"Différé\")","v":"Différé"},2,"commande directe 156","","",{"$f":"IF(AND(J43=\"x\",I43=\"\"),\"351 ou litige\",IF(AND(O43=\"Soldé\",H43=M43),\"\",IF(ISERROR(VLOOKUP(N43,Code_MPR,2,FALSE)),\"351 ou Litige\",VLOOKUP(N43,Code_MPR,2,FALSE))))","v":"351 ou Litige"},null,"+ de 3 jours","","POUPLARD FREDERIC",200988337,2,2]
["4700044289-60",286,4700044289,60,7711780436,"CH. RENAULT FLEX T40","2016-10-12",1,"X","X",{"$f":"IF(ISERROR(VLOOKUP(E44,'LX02'!$A$1:$D$150,1,FALSE)),\"\",\"X\")","v":""},"Différé",1,230,"","","Manque stock",null,"+ de 3 jours","","BELLETOILE MARTIAL",200988313,1,1]
["4700044289-170",286,4700044289,170,7711216791,"CHARIOT RANGEMENT PINCES       SECT.729","2016-10-12",2,"X","X",{"$f":"IF(ISERROR(VLOOKUP(E45,'LX02'!$A$1:$D$150,1,FALSE)),\"\",\"X\")","v":""},"Différé",2,230,"","","Manque stock",null,"+ de 3 jours","","MALGUY STEPHANE",200988358,2,2]
["4700044289-220",286,4700044289,220,7711419431,"PON\\EUSE 1 MAIN","2016-10-12",4,"X","X",{"$f":"IF(ISERROR(VLOOKUP(E46,'LX02'!$A$1:$D$150,1,FALSE)),\"\",\"X\")","v":""},"Différé",4,230,"","","Manque stock",null,"+ de 3 jours","","BELLETOILE MARTIAL",200988313,4,4]
["4700044289-480",286,4700044289,480,"283E85657R","COMMANDE ELECTRIQUE MULTIFONCTION","2016-10-12",10,null,"",{"$f":"IF(ISERROR(VLOOKUP(E47,'LX02'!$A$1:$D$150,1,FALSE)),\"\",\"X\")","v":""},"2016-10-24",10,230,520,8,"Manque stock",null,"+ de 3 jours","CDE Jour","GERVAIS LAURENT",200988211,10,10]
["4700044289-590",286,4700044289,590,"628908106R","EMBLEME AV","2016-10-12",2,"X","X",{"$f":"IF(ISERROR(VLOOKUP(E48,'LX02'!$A$1:$D$150,1,FALSE)),\"\",\"X\")","v":""},"Différé",2,220,"","","Bloquée pénurie gestionnaire",null,"+ de 3 jours","","RUELLAN ANDRE",200988354,2,2]
["4700044301-60",287,4700044301,60,7711573597,"BOB CHAMOIS 1000F","2016-10-13",2,"X","X",{"$f":"IF(ISERROR(VLOOKUP(E49,'LX02'!$A$1:$D$150,1,FALSE)),\"\",\"X\")","v":""},"Différé",2,"commande directe 152","","",{"$f":"IF(AND(J49=\"x\",I49=\"\"),\"351 ou litige\",IF(AND(O49=\"Soldé\",H49=M49),\"\",IF(ISERROR(VLOOKUP(N49,Code_MPR,2,FALSE)),\"351 ou Litige\",VLOOKUP(N49,Code_MPR,2,FALSE))))","v":"351 ou Litige"},null,"+ de 3 jours","","MOUSSA CHRISTINE SIMONE",200988500,2,2]
["4700044301-150",287,4700044301,150,7711239373,"PEAU DE CHAMOIS N","2016-10-13",1,"X","X",{"$f":"IF(ISERROR(VLOOKUP(E50,'LX02'!$A$1:$D$150,1,FALSE)),\"\",\"X\")","v":""},"Différé",1,230,"","","Manque stock",null,"+ de 3 jours","","PICHOT JEAN CHARLES",200988476,1,1]
["4700044301-440",287,4700044301,440,"288953663R","RACLETTE ESSUIE GLACE CONDUCTEUR","2016-10-13",1,"X","X",{"$f":"IF(ISERROR(VLOOKUP(E51,'LX02'!$A$1:$D$150,1,FALSE)),\"\",\"X\")","v":""},"Différé",1,230,"","",{"$f":"IF(AND(J51=\"x\",I51=\"\"),\"351 ou litige\",IF(AND(O51=\"Soldé\",H51=M51),\"\",IF(ISERROR(VLOOKUP(N51,Code_MPR,2,FALSE)),\"351 ou Litige\",VLOOKUP(N51,Code_MPR,2,FALSE))))","v":"Manque stock"},null,"+ de 3 jours","","BOUSSIOUS JEREMIE",200988479,1,1]
["4700044301-450",287,4700044301,450,"288B55332R","RACLETTE BALAI PASSAGER","2016-10-13",1,"X","X",{"$f":"IF(ISERROR(VLOOKUP(E52,'LX02'!$A$1:$D$150,1,FALSE)),\"\",\"X\")","v":""},"Différé",1,230,"","","Manque stock",null,"+ de 3 jours","","BOUSSIOUS JEREMIE",200988479,1,1]
["4700044301-570",287,4700044301,570,"964013442R","PARE-SOLEIL G","2016-10-13",2,"X","X",{"$f":"IF(ISERROR(VLOOKUP(E53,'LX02'!$A$1:$D$150,1,FALSE)),\"\",\"X\")","v":""},"Différé",2,230,"","","Manque stock",null,"+ de 3 jours","","DECAUDAIN JEAN FRANCOIS",200988430,2,2]
["4700044310-80",288,4700044310,80,7711573599,"BOB BLANC 1000F","2016-10-14",6,"X","X",{"$f":"IF(ISERROR(VLOOKUP(E54,'LX02'!$A$1:$D$150,1,FALSE)),\"\",\"X\")","v":""},"Différé",6,"commande directe 153","","",{"$f":"IF(AND(J54=\"x\",I54=\"\"),\"351 ou litige\",IF(AND(O54=\"Soldé\",H54=M54),\"\",IF(ISERROR(VLOOKUP(N54,Code_MPR,2,FALSE)),\"351 ou Litige\",VLOOKUP(N54,Code_MPR,2,FALSE))))","v":"351 ou Litige"},null,"+ de 3 jours","",{"$error":"#N/A"},{"$error":"#N/A"},{"$error":"#N/A"},6]
["4700044310-120",288,4700044310,120,7700843546,"BUTEE CAPOT AV","2016-10-14",1000,"X","X",{"$f":"IF(ISERROR(VLOOKUP(E55,'LX02'!$A$1:$D$150,1,FALSE)),\"\",\"X\")","v":""},"Différé",1000,230,"","","Manque stock",null,"+ de 3 jours","",{"$error":"#N/A"},{"$error":"#N/A"},{"$error":"#N/A"},1000]
["4700044310-200",288,4700044310,200,7711573596,"BOB CHAMOIS 450F","2016-10-14",6,"X","X",{"$f":"IF(ISERROR(VLOOKUP(E56,'LX02'!$A$1:$D$150,1,FALSE)),\"\",\"X\")","v":""},"Différé",6,"commande directe 155","","","351 ou Litige",null,"+ de 3 jours","",{"$error":"#N/A"},{"$error":"#N/A"},{"$error":"#N/A"},6]
["4700044310-220",288,4700044310,220,7711576123,"PACK GO 500 + HOUSSE + CHARGEUR RAPIDE","2016-10-14",1,"X","X",{"$f":"IF(ISERROR(VLOOKUP(E57,'LX02'!$A$1:$D$150,1,FALSE)),\"\",\"X\")","v":""},"Différé",1,230,"","","Manque stock",null,"+ de 3 jours","",{"$error":"#N/A"},{"$error":"#N/A"},{"$error":"#N/A"},1]
["4700044310-370",288,4700044310,370,8201645511,"FAISCEAU ATTELAGE 13B RETRACTABLE","2016-10-14",2,"X","X",{"$f":"IF(ISERROR(VLOOKUP(E58,'LX02'!$A$1:$D$150,1,FALSE)),\"\",\"X\")","v":""},"Différé",2,"commande directe 154","","","351 ou Litige",null,"+ de 3 jours","",{"$error":"#N/A"},{"$error":"#N/A"},{"$error":"#N/A"},2]
["4700044318-180",291,4700044318,180,7704002509,"SUPPORT ELASTIQUE","2016-10-17",300,"X","X",{"$f":"IF(ISERROR(VLOOKUP(E59,'LX02'!$A$1:$D$150,1,FALSE)),\"\",\"X\")","v":""},"Différé",300,230,"","",{"$f":"IF(AND(J59=\"x\",I59=\"\"),\"351 ou litige\",IF(AND(O59=\"Soldé\",H59=M59),\"\",IF(ISERROR(VLOOKUP(N59,Code_MPR,2,FALSE)),\"351 ou Litige\",VLOOKUP(N59,Code_MPR,2,FALSE))))","v":"Manque stock"},null,"+ de 3 jours","",{"$error":"#N/A"},{"$error":"#N/A"},{"$error":"#N/A"},300]
["4700044318-200",291,4700044318,200,7711172286,"NENETOL                        SECT.729","2016-10-17",12,"X","X",{"$f":"IF(ISERROR(VLOOKUP(E60,'LX02'!$A$1:$D$150,1,FALSE)),\"\",\"X\")","v":""},"Différé",12,230,"","","Manque stock",null,"+ de 3 jours","",{"$error":"#N/A"},{"$error":"#N/A"},{"$error":"#N/A"},12]
["4700044318-360",291,4700044318,360,7711782082,"SUPPORT MASQUE COMPLET DOUBLE CARTOUCHE","2016-10-17",4,"X","X",{"$f":"IF(ISERROR(VLOOKUP(E61,'LX02'!$A$1:$D$150,1,FALSE)),\"\",\"X\")","v":""},"Différé",4,130,"","","Nouvelle référence",null,"+ de 3 jours","",{"$error":"#N/A"},{"$error":"#N/A"},{"$error":"#N/A"},4]
["4700044318-420",291,4700044318,420,8201420512,"JANTE 8,5 J 20 5 47 KUBERA","2016-10-17",4,"X","X",{"$f":"IF(ISERROR(VLOOKUP(E62,'LX02'!$A$1:$D$150,1,FALSE)),\"\",\"X\")","v":""},"Différé",4,210,"","","Référence bloquée cause technique",null,"+ de 3 jours","",{"$error":"#N/A"},{"$error":"#N/A"},{"$error":"#N/A"},4]
["4700044318-511",291,4700044318,511,"484007956R","VOLANT DIRECTION","2016-10-17",2,"X","X",{"$f":"IF(ISERROR(VLOOKUP(E63,'LX02'!$A$1:$D$150,1,FALSE)),\"\",\"X\")","v":""},"Différé",2,311,"","",{"$f":"IF(AND(J63=\"x\",I63=\"\"),\"351 ou litige\",IF(AND(O63=\"Soldé\",H63=M63),\"\",IF(ISERROR(VLOOKUP(N63,Code_MPR,2,FALSE)),\"351 ou Litige\",VLOOKUP(N63,Code_MPR,2,FALSE))))","v":"Affectée non expédiée"},null,"+ de 3 jours","Reliquat",{"$error":"#N/A"},{"$error":"#N/A"},{"$error":"#N/A"},2]
["4700044318-610",291,4700044318,610,"873203208R","GARNITURE COUSSIN SIEGE 1ERE RNG","2016-10-17",1,"X","X",{"$f":"IF(ISERROR(VLOOKUP(E64,'LX02'!$A$1:$D$150,1,FALSE)),\"\",\"X\")","v":""},"Différé",1,230,"","","Manque stock",null,"+ de 3 jours","",{"$error":"#N/A"},{"$error":"#N/A"},{"$error":"#N/A"},1]
["4700044325-50",292,4700044325,50,7711426403,"BOBINE ESSUY BLEU","2016-10-18",2,"X","X",{"$f":"IF(ISERROR(VLOOKUP(E65,'LX02'!$A$1:$D$150,1,FALSE)),\"\",\"X\")","v":""},"Différé",2,"comamnde directe 157","","",{"$f":"IF(AND(J65=\"x\",I65=\"\"),\"351 ou litige\",IF(AND(O65=\"Soldé\",H65=M65),\"\",IF(ISERROR(VLOOKUP(N65,Code_MPR,2,FALSE)),\"351 ou Litige\",VLOOKUP(N65,Code_MPR,2,FALSE))))","v":"351 ou Litige"},null,"+ de 3 jours","",{"$error":"#N/A"},{"$error":"#N/A"},{"$error":"#N/A"},2]
["4700044325-70",292,4700044325,70,8200070652,"GOUJON M8-125","2016-10-18",6,"X","X",{"$f":"IF(ISERROR(VLOOKUP(E66,'LX02'!$A$1:$D$150,1,FALSE)),\"\",\"X\")","v":""},"Différé",6,230,"","","Manque stock",null,"+ de 3 jours","",{"$error":"#N/A"},{"$error":"#N/A"},{"$error":"#N/A"},6]
[{"$f":"CONCATENATE(C67,\"-\",D67)","v":"4700044325-280"},{"$f":"G67-DATE(YEAR(G67),1,0)","v":292},4700044325,280,7711392297,"CLES USB R.NET","2016-10-18",20,"X",{"$f":"IF(ISERROR(VLOOKUP(A67,Base_MP,6,FALSE)),\"\",\"X\")","v":"X"},{"$f":"IF(ISERROR(VLOOKUP(E67,'LX02'!$A$1:$D$150,1,FALSE)),\"\",\"X\")","v":""},{"$f":"IF(I67=\"\",TODAY(),\"Différé\")","v":"Différé"},{"$f":"IF(ISERROR(VLOOKUP(A67,Base_MP,11,0)),H67,VLOOKUP(A67,Base_MP,11,0))","v":20},230,{"$f":"IF(N67=\"Litige\",\"Litige\",IF(AND(N67=\"520\",H67=M67),\"Soldé\",IF(N67=\"Annulé\",\"Annulé\",\"\")))","v":""},{"$f":"IF(N67=\"Litige\",\"Litige\",IF(O67=\"Soldé\",1,IF(O67=520,$L67-$G67-INT(($L67-MOD($L67-JUn,7)-$G67+7)/7)-INT(($L67-MOD($L67-JDeux,7)-$G67+7)/7)-(SUMPRODUCT((_Fer2>=$G67)-(_Fer2>$L67)))+SUMPRODUCT(((WEEKDAY(_Fer2)=WEEKDAY(JUn))+(WEEKDAY(_Fer2)=WEEKDAY(JDeux)))*(_Fer2>=$L67)*(_Fer2<=$L67)),IF(N67=\"Annulé\",\"Annulé\",\"\"))))","v":""},"Manque stock",null,{"$f":"IF(P67=\"Annulé\",\"Annulé\",IF(P67=\"Litige\",\"Litige\",IF(P67>3,\"+ de 3 jours\",P67)))","v":"+ de 3 jours"},{"$f":"IF(N67=311,\"Reliquat\",IF(O67=311,\"Reliquat\",IF(I67<>\"X\",\"CDE Jour\",\"\")))","v":""},{"$error":"#N/A"},{"$error":"#N/A"},{"$error":"#N/A"},{"$f":"H67","v":20}]
["4700044335-70",293,4700044335,70,7711382005,"OUTIL CONSIGNE BATTE","2016-10-19",30,"X","X",{"$f":"IF(ISERROR(VLOOKUP(E68,'LX02'!$A$1:$D$150,1,FALSE)),\"\",\"X\")","v":""},"Différé",30,230,"","","Manque stock",null,"+ de 3 jours","","GIRAUD XAVIER",200989143,30,30]
["4700044335-480",293,4700044335,480,"217102781R","RESERVOIR DEGAZAGE","2016-10-19",2,"X","X",{"$f":"IF(ISERROR(VLOOKUP(E69,'LX02'!$A$1:$D$150,1,FALSE)),\"\",\"X\")","v":""},"Différé",2,230,"","",{"$f":"IF(AND(J69=\"x\",I69=\"\"),\"351 ou litige\",IF(AND(O69=\"Soldé\",H69=M69),\"\",IF(ISERROR(VLOOKUP(N69,Code_MPR,2,FALSE)),\"351 ou Litige\",VLOOKUP(N69,Code_MPR,2,FALSE))))","v":"Manque stock"},null,"+ de 3 jours","",{"$error":"#N/A"},{"$error":"#N/A"},{"$error":"#N/A"},2]
["4700044335-530",293,4700044335,530,"280907095R","PANNEAU CTL COMMANDE INSTRUMENTATION","2016-10-19",2,"X","X",{"$f":"IF(ISERROR(VLOOKUP(E70,'LX02'!$A$1:$D$150,1,FALSE)),\"\",\"X\")","v":""},"Différé",2,230,"","",{"$f":"IF(AND(J70=\"x\",I70=\"\"),\"351 ou litige\",IF(AND(O70=\"Soldé\",H70=M70),\"\",IF(ISERROR(VLOOKUP(N70,Code_MPR,2,FALSE)),\"351 ou Litige\",VLOOKUP(N70,Code_MPR,2,FALSE))))","v":"Manque stock"},null,"+ de 3 jours","",{"$error":"#N/A"},{"$error":"#N/A"},{"$error":"#N/A"},2]
["4700044335-610",293,4700044335,610,"296950307R","CABLAGE PRISE CHARGE","2016-10-19",1,"X","X",{"$f":"IF(ISERROR(VLOOKUP(E71,'LX02'!$A$1:$D$150,1,FALSE)),\"\",\"X\")","v":""},"Différé",1,230,"","","Manque stock",null,"+ de 3 jours","",{"$error":"#N/A"},{"$error":"#N/A"},{"$error":"#N/A"},1]
["4700044335-620",293,4700044335,620,"297A38225R","CABLE ALMT CTRLR ENERGIE - MOTOREDUCTEUR","2016-10-19",1,"X","X",{"$f":"IF(ISERROR(VLOOKUP(E72,'LX02'!$A$1:$D$150,1,FALSE)),\"\",\"X\")","v":""},"Différé",1,230,"","","Manque stock",null,"+ de 3 jours","",{"$error":"#N/A"},{"$error":"#N/A"},{"$error":"#N/A"},1]
["4700044335-630",293,4700044335,630,"402622Y000","ECROU BLOCAGE ROULEMENT ROUE","2016-10-19",4,"X","X",{"$f":"IF(ISERROR(VLOOKUP(E73,'LX02'!$A$1:$D$150,1,FALSE)),\"\",\"X\")","v":""},"Différé",4,230,"","","Manque stock",null,"+ de 3 jours","",{"$error":"#N/A"},{"$error":"#N/A"},{"$error":"#N/A"},4]
["4700044335-640",293,4700044335,640,"40262JA000","NUT-LOCK","2016-10-19",4,"X","X",{"$f":"IF(ISERROR(VLOOKUP(E74,'LX02'!$A$1:$D$150,1,FALSE)),\"\",\"X\")","v":""},"Différé",4,230,"","","Manque stock",null,"+ de 3 jours","",{"$error":"#N/A"},{"$error":"#N/A"},{"$error":"#N/A"},4]
["4700044335-650",293,4700044335,650,"502705683R","SUPPORT BARRE PANHARD","2016-10-19",10,"X","X",{"$f":"IF(ISERROR(VLOOKUP(E75,'LX02'!$A$1:$D$150,1,FALSE)),\"\",\"X\")","v":""},"Différé",10,230,"","","Manque stock",null,"+ de 3 jours","","BREBEC SEBASTIEN",200989125,10,10]
["4700044335-760",293,4700044335,760,"809013617R","GARNITURE PANNEAU PORTE AV G ASS","2016-10-19",1,"X","X",{"$f":"IF(ISERROR(VLOOKUP(E76,'LX02'!$A$1:$D$150,1,FALSE)),\"\",\"X\")","v":""},"Différé",1,230,"","","Manque stock",null,"+ de 3 jours","","DECAUDAIN JEAN FRANCOIS",200989147,1,1]
["4700044335-820",293,4700044335,820,"924871682R","ELECTROVANNE 2 VOIES AC CHF","2016-10-19",4,"X","X",{"$f":"IF(ISERROR(VLOOKUP(E77,'LX02'!$A$1:$D$150,1,FALSE)),\"\",\"X\")","v":""},"Différé",4,230,"","",{"$f":"IF(AND(J77=\"x\",I77=\"\"),\"351 ou litige\",IF(AND(O77=\"Soldé\",H77=M77),\"\",IF(ISERROR(VLOOKUP(N77,Code_MPR,2,FALSE)),\"351 ou Litige\",VLOOKUP(N77,Code_MPR,2,FALSE))))","v":"Manque stock"},null,"+ de 3 jours","",{"$error":"#N/A"},{"$error":"#N/A"},{"$error":"#N/A"},4]
["4700044335-880",293,4700044335,880,"403001068R","ROUE 8 1/4XJ 19 CH 5 65","2016-10-19",4,"X","X",{"$f":"IF(ISERROR(VLOOKUP(E78,'LX02'!$A$1:$D$150,1,FALSE)),\"\",\"X\")","v":""},"Différé",4,230,"","","Manque stock",null,"+ de 3 jours","",{"$error":"#N/A"},{"$error":"#N/A"},{"$error":"#N/A"},4]
["4700044346-41",294,4700044346,41,7711423177,"BATTERIE 800A","2016-10-20",2,null,"",{"$f":"IF(ISERROR(VLOOKUP(E79,'LX02'!$A$1:$D$150,1,FALSE)),\"\",\"X\")","v":""},"2016-10-24",2,{"$f":"IF(I79=\"\",\"520\",\"\")","v":"520"},"Soldé",1,{"$f":"IF(AND(J79=\"x\",I79=\"\"),\"351 ou litige\",IF(AND(O79=\"Soldé\",H79=M79),\"\",IF(ISERROR(VLOOKUP(N79,Code_MPR,2,FALSE)),\"351 ou Litige\",VLOOKUP(N79,Code_MPR,2,FALSE))))","v":""},null,1,"CDE Jour","GILLES MARC",200989217,2,2]
["4700044346-51",294,4700044346,51,7711238597,"BATTERIE","2016-10-20",2,null,"",{"$f":"IF(ISERROR(VLOOKUP(E80,'LX02'!$A$1:$D$150,1,FALSE)),\"\",\"X\")","v":""},"2016-10-24",2,"520","Soldé",1,"",null,1,"CDE Jour","GILLES MARC",200989217,2,2]
["4700044346-60",294,4700044346,60,7711382005,"OUTIL CONSIGNE BATTE","2016-10-20",50,"X","X",{"$f":"IF(ISERROR(VLOOKUP(E81,'LX02'!$A$1:$D$150,1,FALSE)),\"\",\"X\")","v":""},"Différé",50,230,"","","Manque stock",null,"+ de 3 jours","","GIRAUD XAVIER",200989143,30,50]
["4700044346-70",294,4700044346,70,7711419085,"BATTERIE 760A","2016-10-20",1,null,"",{"$f":"IF(ISERROR(VLOOKUP(E82,'LX02'!$A$1:$D$150,1,FALSE)),\"\",\"X\")","v":""},"2016-10-24",1,"520","Soldé",1,"",null,1,"CDE Jour","GILLES MARC",200989222,1,1]
["4700044346-111",294,4700044346,111,7711238596,"BATTERIE","2016-10-20",2,null,"",{"$f":"IF(ISERROR(VLOOKUP(E83,'LX02'!$A$1:$D$150,1,FALSE)),\"\",\"X\")","v":""},"2016-10-24",2,"520","Soldé",1,"",null,1,"CDE Jour","GILLES MARC",200989217,2,2]
["4700044346-120",294,4700044346,120,4820990007,"C.A. 1 300X250X200 FEFCO 0201 P.A. CLASS","2016-10-20",50,null,"",{"$f":"IF(ISERROR(VLOOKUP(E84,'LX02'!$A$1:$D$150,1,FALSE)),\"\",\"X\")","v":""},"2016-10-24",50,311,520,2,"Affectée non expédiée",null,2,"Reliquat","COZLER DANIEL ROGER ALBERT",200989276,50,50]
["4700044346-190",294,4700044346,190,7711423286,"BATTERIE","2016-10-20",1,null,"",{"$f":"IF(ISERROR(VLOOKUP(E85,'LX02'!$A$1:$D$150,1,FALSE)),\"\",\"X\")","v":""},"2016-10-24",1,"520","Soldé",1,"",null,1,"CDE Jour","GILLES MARC",200989222,1,1]
["4700044346-201",294,4700044346,201,7711428130,"LIQUIDE DE REFROIDISSSMENT 5L APV","2016-10-20",12,null,"",{"$f":"IF(ISERROR(VLOOKUP(E86,'LX02'!$A$1:$D$150,1,FALSE)),\"\",\"X\")","v":""},"2016-10-24",12,"520","Soldé",1,"",null,1,"CDE Jour","MENAGER LAURENT",200989294,12,12]
["4700044346-220",294,4700044346,220,7711781023,"POLAIRE RENAULT CORPORATE S","2016-10-20",1,null,"",{"$f":"IF(ISERROR(VLOOKUP(E87,'LX02'!$A$1:$D$150,1,FALSE)),\"\",\"X\")","v":""},"2016-10-24",1,311,520,2,"Affectée non expédiée",null,2,"Reliquat","NICOL YVES",200989098,1,1]
["4700044346-230",294,4700044346,230,7711781024,"POLAIRE RENAULT CORPORATE M","2016-10-20",2,null,"",{"$f":"IF(ISERROR(VLOOKUP(E88,'LX02'!$A$1:$D$150,1,FALSE)),\"\",\"X\")","v":""},"2016-10-24",2,311,520,2,"Affectée non expédiée",null,2,"Reliquat","LE MOUZER YANNICK CARMEL",200989139,10,2]
["4700044346-240",294,4700044346,240,7711781025,"POLAIRE RENAULT CORPORATE L","2016-10-20",1,null,"",{"$f":"IF(ISERROR(VLOOKUP(E89,'LX02'!$A$1:$D$150,1,FALSE)),\"\",\"X\")","v":""},"2016-10-24",1,311,520,2,"Affectée non expédiée",null,2,"Reliquat","BELLEMOU FARID",200989095,3,1]
["4700044346-250",294,4700044346,250,7711781026,"POLAIRE RENAULT CORPORATE XL","2016-10-20",8,null,"",{"$f":"IF(ISERROR(VLOOKUP(E90,'LX02'!$A$1:$D$150,1,FALSE)),\"\",\"X\")","v":""},"2016-10-24",8,311,520,2,"Affectée non expédiée",null,2,"Reliquat","NICOL YVES",200989098,1,8]
["4700044346-260",294,4700044346,260,7711781027,"POLAIRE RENAULT CORPORATE XXL","2016-10-20",9,null,"",{"$f":"IF(ISERROR(VLOOKUP(E91,'LX02'!$A$1:$D$150,1,FALSE)),\"\",\"X\")","v":""},"2016-10-24",9,311,520,2,"Affectée non expédiée",null,2,"Reliquat","LE MOUZER YANNICK CARMEL",200989139,10,9]
["4700044346-320",294,4700044346,320,8201487253,"COLLECTION COQUILLE DE RETROVISEUR EXT","2016-10-20",1,"X","X",{"$f":"IF(ISERROR(VLOOKUP(E92,'LX02'!$A$1:$D$150,1,FALSE)),\"\",\"X\")","v":""},"Différé",1,220,"","","Bloquée pénurie gestionnaire",null,"+ de 3 jours","","GIRARD LOIC",200989303,1,1]
["4700044346-430",294,4700044346,430,"403009592R","ROUE 7 1/2XJ 18 CH 5 55","2016-10-20",2,"X","X",{"$f":"IF(ISERROR(VLOOKUP(E93,'LX02'!$A$1:$D$150,1,FALSE)),\"\",\"X\")","v":""},"Différé",2,220,"","",{"$f":"IF(AND(J93=\"x\",I93=\"\"),\"351 ou litige\",IF(AND(O93=\"Soldé\",H93=M93),\"\",IF(ISERROR(VLOOKUP(N93,Code_MPR,2,FALSE)),\"351 ou Litige\",VLOOKUP(N93,Code_MPR,2,FALSE))))","v":"Bloquée pénurie gestionnaire"},null,"+ de 3 jours","","GILLES MARC",200989295,2,2]
["4700044346-480",294,4700044346,480,"801M25000R","CLCN FIX ENJOLIVEUR CADRE PR AV D APV","2016-10-20",1,null,"",{"$f":"IF(ISERROR(VLOOKUP(E94,'LX02'!$A$1:$D$150,1,FALSE)),\"\",\"X\")","v":""},"2016-10-24",1,230,520,2,"Manque stock",null,2,"CDE Jour","DECAUDAIN JEAN FRANCOIS",200989291,1,1]
["4700044346-560",294,4700044346,560,"963024306R","RETROVISEUR EXT G ELCT","2016-10-20",1,"X","X",{"$f":"IF(ISERROR(VLOOKUP(E95,'LX02'!$A$1:$D$150,1,FALSE)),\"\",\"X\")","v":""},"Différé",1,230,"","","Manque stock",null,"+ de 3 jours","","DECAUDAIN JEAN FRANCOIS",200989291,1,1]
["4700044346-610",294,4700044346,610,7711424423,"BATTERIE 760A","2016-10-20",1,null,"",{"$f":"IF(ISERROR(VLOOKUP(E96,'LX02'!$A$1:$D$150,1,FALSE)),\"\",\"X\")","v":""},"2016-10-24",1,{"$f":"IF(I96=\"\",\"520\",\"\")","v":"520"},"Soldé",1,"",null,1,"CDE Jour","GILLES MARC",200989222,1,1]
["4700044346-631",294,4700044346,631,7711238598,"BATTERIE","2016-10-20",2,null,"",{"$f":"IF(ISERROR(VLOOKUP(E97,'LX02'!$A$1:$D$150,1,FALSE)),\"\",\"X\")","v":""},"2016-10-24",2,"520","Soldé",1,"",null,1,"CDE Jour","GILLES MARC",200989217,2,2]
["4700044346-640",294,4700044346,640,7711230453,"BATTERIE 80AH 760A LB4","2016-10-20",1,null,"",{"$f":"IF(ISERROR(VLOOKUP(E98,'LX02'!$A$1:$D$150,1,FALSE)),\"\",\"X\")","v":""},"2016-10-24",1,"520","Soldé",1,"",null,1,"CDE Jour","GILLES MARC",200989222,1,1]
["4700044346-650",294,4700044346,650,7711423287,"BATTERIE","2016-10-20",1,null,"",{"$f":"IF(ISERROR(VLOOKUP(E99,'LX02'!$A$1:$D$150,1,FALSE)),\"\",\"X\")","v":""},"2016-10-24",1,"520","Soldé",{"$f":"IF(N99=\"Litige\",\"Litige\",IF(O99=\"Soldé\",1,IF(O99=520,$L99-$G99-INT(($L99-MOD($L99-JUn,7)-$G99+7)/7)-INT(($L99-MOD($L99-JDeux,7)-$G99+7)/7)-(SUMPRODUCT((_Fer2>=$G99)-(_Fer2>$L99)))+SUMPRODUCT(((WEEKDAY(_Fer2)=WEEKDAY(JUn))+(WEEKDAY(_Fer2)=WEEKDAY(JDeux)))*(_Fer2>=$L99)*(_Fer2<=$L99)),IF(N99=\"Annulé\",\"Annulé\",\"\"))))","v":1},{"$f":"IF(AND(J99=\"x\",I99=\"\"),\"351 ou litige\",IF(AND(O99=\"Soldé\",H99=M99),\"\",IF(ISERROR(VLOOKUP(N99,Code_MPR,2,FALSE)),\"351 ou Litige\",VLOOKUP(N99,Code_MPR,2,FALSE))))","v":""},null,1,"CDE Jour","GILLES MARC",200989222,1,1]
["4700044346-660",294,4700044346,660,7711419086,"BATTERIE 850A","2016-10-20",1,null,"",{"$f":"IF(ISERROR(VLOOKUP(E100,'LX02'!$A$1:$D$150,1,FALSE)),\"\",\"X\")","v":""},"2016-10-24",1,"520","Soldé",1,"",null,1,"CDE Jour","GILLES MARC",200989222,1,1]
["4700044346-681",294,4700044346,681,7711575175,"BATTERIE","2016-10-20",2,null,"",{"$f":"IF(ISERROR(VLOOKUP(E101,'LX02'!$A$1:$D$150,1,FALSE)),\"\",\"X\")","v":""},"2016-10-24",2,"520","Soldé",1,"",null,1,"CDE Jour","GILLES MARC",200989217,2,2]
["4700044346-710",294,4700044346,710,"403006336R","ROUE 7 1/2XJ 18 5 46","2016-10-20",1,"X","X",{"$f":"IF(ISERROR(VLOOKUP(E102,'LX02'!$A$1:$D$150,1,FALSE)),\"\",\"X\")","v":""},"Différé",1,230,"","","Manque stock",null,"+ de 3 jours","","ROUET ANDRE",200989196,1,1]
["4700044354-10",{"$f":"G103-DATE(YEAR(G103),1,0)","v":295},4700044354,10,7703090413,"ROULEMENT ROULEAUX CNQ 25X47-15","2016-10-21",1,null,{"$f":"IF(ISERROR(VLOOKUP(A103,Base_MP,6,FALSE)),\"\",\"X\")","v":""},{"$f":"IF(ISERROR(VLOOKUP(E103,'LX02'!$A$1:$D$150,1,FALSE)),\"\",\"X\")","v":""},{"$f":"IF(I103=\"\",TODAY(),\"Différé\")","v":"2016-10-24"},1,{"$f":"IF(I103=\"\",\"520\",\"\")","v":"520"},{"$f":"IF(N103=\"Litige\",\"Litige\",IF(AND(N103=\"520\",H103=M103),\"Soldé\",IF(N103=\"Annulé\",\"Annulé\",\"\")))","v":"Soldé"},{"$f":"IF(N103=\"Litige\",\"Litige\",IF(O103=\"Soldé\",1,IF(O103=520,$L103-$G103-INT(($L103-MOD($L103-JUn,7)-$G103+7)/7)-INT(($L103-MOD($L103-JDeux,7)-$G103+7)/7)-(SUMPRODUCT((_Fer2>=$G103)-(_Fer2>$L103)))+SUMPRODUCT(((WEEKDAY(_Fer2)=WEEKDAY(JUn))+(WEEKDAY(_Fer2)=WEEKDAY(JDeux)))*(_Fer2>=$L103)*(_Fer2<=$L103)),IF(N103=\"Annulé\",\"Annulé\",\"\"))))","v":1},{"$f":"IF(AND(J103=\"x\",I103=\"\"),\"351 ou litige\",IF(AND(O103=\"Soldé\",H103=M103),\"\",IF(ISERROR(VLOOKUP(N103,Code_MPR,2,FALSE)),\"351 ou Litige\",VLOOKUP(N103,Code_MPR,2,FALSE))))","v":""},null,{"$f":"IF(P103=\"Annulé\",\"Annulé\",IF(P103=\"Litige\",\"Litige\",IF(P103>3,\"+ de 3 jours\",P103)))","v":1},{"$f":"IF(N103=311,\"Reliquat\",IF(O103=311,\"Reliquat\",IF(I103<>\"X\",\"CDE Jour\",\"\")))","v":"CDE Jour"},"GILLES MARC",200989337,1,{"$f":"H103","v":1}]
["4700044354-20",295,4700044354,20,7711780930,"PACK HISTORIC 1","2016-10-21",1,"X","X",{"$f":"IF(ISERROR(VLOOKUP(E104,'LX02'!$A$1:$D$150,1,FALSE)),\"\",\"X\")","v":""},"Différé",1,311,"","","Affectée non expédiée",null,"+ de 3 jours","Reliquat","BEAUDOUIN ENRIQUE",200989486,1,1]
["4700044354-30",295,4700044354,30,8200070652,"GOUJON M8-125","2016-10-21",50,"X","X",{"$f":"IF(ISERROR(VLOOKUP(E105,'LX02'!$A$1:$D$150,1,FALSE)),\"\",\"X\")","v":""},"Différé",50,230,"","","Manque stock",null,"+ de 3 jours","","TOUTAIN THIERRY",200989455,50,50]
["4700044354-40",295,4700044354,40,"165465647R","CARTOUCHE FILTRANTE AIR","2016-10-21",2,null,"",{"$f":"IF(ISERROR(VLOOKUP(E106,'LX02'!$A$1:$D$150,1,FALSE)),\"\",\"X\")","v":""},"2016-10-24",2,"520","Soldé",1,"",null,1,"CDE Jour","GILLES MARC",200989352,2,2]
["4700044354-50",295,4700044354,50,"272778970R","FILTRE HABITACLE","2016-10-21",2,null,"",{"$f":"IF(ISERROR(VLOOKUP(E107,'LX02'!$A$1:$D$150,1,FALSE)),\"\",\"X\")","v":""},"2016-10-24",2,"520","Soldé",1,"",null,1,"CDE Jour","GILLES MARC",200989352,2,2]
["4700044354-60",295,4700044354,60,"440604694R","JEU PLAQUETTE AR","2016-10-21",2,null,"X",{"$f":"IF(ISERROR(VLOOKUP(E108,'LX02'!$A$1:$D$150,1,FALSE)),\"\",\"X\")","v":""},"2016-10-24",2,"520","Soldé",1,"351 ou litige",null,1,"CDE Jour","SEMIAO NELSON",200989356,2,2]
["4700044354-70",295,4700044354,70,7703046143,"ECROU TOLE DIAM 4,2 SA1GD","2016-10-21",10,null,"",{"$f":"IF(ISERROR(VLOOKUP(E109,'LX02'!$A$1:$D$150,1,FALSE)),\"\",\"X\")","v":""},"2016-10-24",10,"520","Soldé",1,"",null,1,"CDE Jour","LE GAC ERWAN",200989478,10,10]
["4700044354-80",295,4700044354,80,7711780423,"PIN'S LOSANGE 2D 15 MM","2016-10-21",1000,"X","X",{"$f":"IF(ISERROR(VLOOKUP(E110,'LX02'!$A$1:$D$150,1,FALSE)),\"\",\"X\")","v":""},"Différé",1000,311,"","","Affectée non expédiée",null,"+ de 3 jours","Reliquat","LEFEVRE-SIMON ISABELLE",200989429,1000,1000]
["4700044354-90",295,4700044354,90,7711420184,"IXTAR NETTOYANT JANTES","2016-10-21",12,null,"",{"$f":"IF(ISERROR(VLOOKUP(E111,'LX02'!$A$1:$D$150,1,FALSE)),\"\",\"X\")","v":""},"2016-10-24",12,"520","Soldé",1,"",null,1,"CDE Jour","MELOTTE DIDIER",200989484,12,12]
["4700044354-100",295,4700044354,100,7711429184,"SUPER DEGRIP NON INFLAMMABLE","2016-10-21",6,null,"",{"$f":"IF(ISERROR(VLOOKUP(E112,'LX02'!$A$1:$D$150,1,FALSE)),\"\",\"X\")","v":""},"2016-10-24",6,"520","Soldé",1,"",null,1,"CDE Jour","MELOTTE DIDIER",200989484,6,6]
["4700044354-110",295,4700044354,110,143300181,"VIS FIX GACHE DE PORTE DE COFFRE","2016-10-21",20,null,"X",{"$f":"IF(ISERROR(VLOOKUP(E113,'LX02'!$A$1:$D$150,1,FALSE)),\"\",\"X\")","v":""},"2016-10-24",20,"520","Soldé",1,"351 ou litige",null,1,"CDE Jour","LE GAC ERWAN",200989338,20,20]
["4700044354-120",295,4700044354,120,7700854668,"JOINT POUR BRIDE PLATE","2016-10-21",10,null,"",{"$f":"IF(ISERROR(VLOOKUP(E114,'LX02'!$A$1:$D$150,1,FALSE)),\"\",\"X\")","v":""},"2016-10-24",10,"520","Soldé",1,"",null,1,"CDE Jour","TOUTAIN THIERRY",200989455,10,10]
["4700044354-130",295,4700044354,130,7701064237,"FILTRE PARTICULE","2016-10-21",2,null,"",{"$f":"IF(ISERROR(VLOOKUP(E115,'LX02'!$A$1:$D$150,1,FALSE)),\"\",\"X\")","v":""},"2016-10-24",2,"520","Soldé",1,"",null,1,"CDE Jour","GILLES MARC",200989352,2,2]
["4700044354-140",295,4700044354,140,7703072047,"RIVET G4,8-16 ALU","2016-10-21",500,null,"",{"$f":"IF(ISERROR(VLOOKUP(E116,'LX02'!$A$1:$D$150,1,FALSE)),\"\",\"X\")","v":""},"2016-10-24",500,"520","Soldé",1,"",null,1,"CDE Jour","MELOTTE DIDIER",200989484,500,500]
["4700044354-150",295,4700044354,150,7703072132,"RIVET G4,8-12,5","2016-10-21",500,"X","X",{"$f":"IF(ISERROR(VLOOKUP(E117,'LX02'!$A$1:$D$150,1,FALSE)),\"\",\"X\")","v":""},"Différé",500,230,"","","Manque stock",null,"+ de 3 jours","","MELOTTE DIDIER",200989484,500,500]
["4700044354-160",295,4700044354,160,7703072361,"PLASTI RIVET DIAM 6","2016-10-21",20,null,"",{"$f":"IF(ISERROR(VLOOKUP(E118,'LX02'!$A$1:$D$150,1,FALSE)),\"\",\"X\")","v":""},"2016-10-24",20,"520","Soldé",1,"",null,1,"CDE Jour","LE GAC ERWAN",200989478,20,20]
["4700044354-170",295,4700044354,170,7703081222,"CLIP DE MAINTIEN DIAM 6","2016-10-21",5,null,"",{"$f":"IF(ISERROR(VLOOKUP(E119,'LX02'!$A$1:$D$150,1,FALSE)),\"\",\"X\")","v":""},"2016-10-24",5,"520","Soldé",1,"",null,1,"CDE Jour","LE GAC ERWAN",200989478,5,5]
["4700044354-180",295,4700044354,180,7711170069,"MASQ PEINTURE                  SECT.729","2016-10-21",2,null,"",{"$f":"IF(ISERROR(VLOOKUP(E120,'LX02'!$A$1:$D$150,1,FALSE)),\"\",\"X\")","v":""},"2016-10-24",2,"520","Soldé",1,"",null,1,"CDE Jour","DELASSUS MICHEL",200989421,2,2]
["4700044354-190",295,4700044354,190,7711170355,"RIVET 4.26 JAUNE               SECT.729","2016-10-21",500,"X","X",{"$f":"IF(ISERROR(VLOOKUP(E121,'LX02'!$A$1:$D$150,1,FALSE)),\"\",\"X\")","v":""},"Différé",500,110,"","","A confirmer",null,"+ de 3 jours","","MELOTTE DIDIER",200989484,500,500]
["4700044354-200",295,4700044354,200,7711170356,"RIVET 4.26 BLANC               SECT.729","2016-10-21",500,"X","X",{"$f":"IF(ISERROR(VLOOKUP(E122,'LX02'!$A$1:$D$150,1,FALSE)),\"\",\"X\")","v":""},"Différé",500,230,"","","Manque stock",null,"+ de 3 jours","","MELOTTE DIDIER",200989484,500,500]
["4700044354-211",295,4700044354,211,7711171413,"GODETS DE MEL. PLASTIQ. 1400ML  SECT.729","2016-10-21",2,null,"",{"$f":"IF(ISERROR(VLOOKUP(E123,'LX02'!$A$1:$D$150,1,FALSE)),\"\",\"X\")","v":""},"2016-10-24",2,"520","Soldé",1,"",null,1,"CDE Jour","BLANGER ALAIN",200989349,2,2]
["4700044354-220",295,4700044354,220,7711780931,"PACK HISTORIC 2","2016-10-21",1,"X","X",{"$f":"IF(ISERROR(VLOOKUP(E124,'LX02'!$A$1:$D$150,1,FALSE)),\"\",\"X\")","v":""},"Différé",1,130,"","","Nouvelle référence",null,"+ de 3 jours","","BEAUDOUIN ENRIQUE",200989486,1,1]
["4700044354-230",295,4700044354,230,7711781023,"POLAIRE RENAULT CORPORATE S","2016-10-21",2,"X","X",{"$f":"IF(ISERROR(VLOOKUP(E125,'LX02'!$A$1:$D$150,1,FALSE)),\"\",\"X\")","v":""},"Différé",2,311,"","","Affectée non expédiée",null,"+ de 3 jours","Reliquat","FARCY JULIEN",200989307,1,2]
["4700044354-240",295,4700044354,240,7711781024,"POLAIRE RENAULT CORPORATE M","2016-10-21",1,"X","X",{"$f":"IF(ISERROR(VLOOKUP(E126,'LX02'!$A$1:$D$150,1,FALSE)),\"\",\"X\")","v":""},"Différé",1,311,"","","Affectée non expédiée",null,"+ de 3 jours","Reliquat","FARCY JULIEN",200989307,2,1]
["4700044354-250",295,4700044354,250,7711781025,"POLAIRE RENAULT CORPORATE L","2016-10-21",2,"X","X",{"$f":"IF(ISERROR(VLOOKUP(E127,'LX02'!$A$1:$D$150,1,FALSE)),\"\",\"X\")","v":""},"Différé",2,311,"","","Affectée non expédiée",null,"+ de 3 jours","Reliquat","GUIGNOT SILVERE",200989268,1,2]
["4700044354-260",295,4700044354,260,7711781026,"POLAIRE RENAULT CORPORATE XL","2016-10-21",4,"X","X",{"$f":"IF(ISERROR(VLOOKUP(E128,'LX02'!$A$1:$D$150,1,FALSE)),\"\",\"X\")","v":""},"Différé",4,311,"","","Affectée non expédiée",null,"+ de 3 jours","Reliquat","GUIGNOT SILVERE",200989268,3,4]
["4700044354-270",295,4700044354,270,7711781027,"POLAIRE RENAULT CORPORATE XXL","2016-10-21",2,"X","X",{"$f":"IF(ISERROR(VLOOKUP(E129,'LX02'!$A$1:$D$150,1,FALSE)),\"\",\"X\")","v":""},"Différé",2,311,"","","Affectée non expédiée",null,"+ de 3 jours","Reliquat","GUIGNOT SILVERE",200989268,1,2]
["4700044354-280",295,4700044354,280,8200381353,"ENJOLIVEUR ROUE SCRIPT","2016-10-21",4,null,"",{"$f":"IF(ISERROR(VLOOKUP(E130,'LX02'!$A$1:$D$150,1,FALSE)),\"\",\"X\")","v":""},"2016-10-24",4,"520","Soldé",1,"",null,1,"CDE Jour","DECAUDAIN JEAN FRANCOIS",200989446,4,4]
[{"$f":"CONCATENATE(C131,\"-\",D131)","v":"4700044354-290"},295,4700044354,290,8201327012,"SURTAPIS","2016-10-21",46,null,"X",{"$f":"IF(ISERROR(VLOOKUP(E131,'LX02'!$A$1:$D$150,1,FALSE)),\"\",\"X\")","v":""},"2016-10-24",{"$f":"IF(ISERROR(VLOOKUP(A131,Base_MP,11,0)),H131,VLOOKUP(A131,Base_MP,11,0))","v":46},"520","Soldé",1,"351 ou litige",null,1,"CDE Jour","CHEN TCHIENG",200989402,6,46]
["4700044354-300",295,4700044354,300,8201353131,"COLLECTION CORDON DE","2016-10-21",1,"X","X",{"$f":"IF(ISERROR(VLOOKUP(E132,'LX02'!$A$1:$D$150,1,FALSE)),\"\",\"X\")","v":""},"Différé",1,230,"","","Manque stock",null,"+ de 3 jours","","GIRARD LOIC",200989340,1,1]
["4700044354-310",295,4700044354,310,8201409818,"HOUSSE SIEGE AV","2016-10-21",1,null,"",{"$f":"IF(ISERROR(VLOOKUP(E133,'LX02'!$A$1:$D$150,1,FALSE)),\"\",\"X\")","v":""},"2016-10-24",1,"520","Soldé",1,"",null,1,"CDE Jour","GIRARD LOIC",200989340,1,1]
["4700044354-320",295,4700044354,320,8201413366,"ROTULE ATTELAGE REMORQUE","2016-10-21",1,null,"",{"$f":"IF(ISERROR(VLOOKUP(E134,'LX02'!$A$1:$D$150,1,FALSE)),\"\",\"X\")","v":""},"2016-10-24",1,"520","Soldé",1,"",null,1,"CDE Jour","GIRARD LOIC",200989453,1,1]
["4700044354-330",{"$f":"G135-DATE(YEAR(G135),1,0)","v":295},4700044354,330,8201413368,"TRAVERSE ATTELAGE CARAVANE","2016-10-21",1,null,{"$f":"IF(ISERROR(VLOOKUP(A135,Base_MP,6,FALSE)),\"\",\"X\")","v":"X"},{"$f":"IF(ISERROR(VLOOKUP(E135,'LX02'!$A$1:$D$150,1,FALSE)),\"\",\"X\")","v":""},{"$f":"IF(I135=\"\",TODAY(),\"Différé\")","v":"2016-10-24"},1,{"$f":"IF(I135=\"\",\"520\",\"\")","v":"520"},{"$f":"IF(N135=\"Litige\",\"Litige\",IF(AND(N135=\"520\",H135=M135),\"Soldé\",IF(N135=\"Annulé\",\"Annulé\",\"\")))","v":"Soldé"},{"$f":"IF(N135=\"Litige\",\"Litige\",IF(O135=\"Soldé\",1,IF(O135=520,$L135-$G135-INT(($L135-MOD($L135-JUn,7)-$G135+7)/7)-INT(($L135-MOD($L135-JDeux,7)-$G135+7)/7)-(SUMPRODUCT((_Fer2>=$G135)-(_Fer2>$L135)))+SUMPRODUCT(((WEEKDAY(_Fer2)=WEEKDAY(JUn))+(WEEKDAY(_Fer2)=WEEKDAY(JDeux)))*(_Fer2>=$L135)*(_Fer2<=$L135)),IF(N135=\"Annulé\",\"Annulé\",\"\"))))","v":1},{"$f":"IF(AND(J135=\"x\",I135=\"\"),\"351 ou litige\",IF(AND(O135=\"Soldé\",H135=M135),\"\",IF(ISERROR(VLOOKUP(N135,Code_MPR,2,FALSE)),\"351 ou Litige\",VLOOKUP(N135,Code_MPR,2,FALSE))))","v":"351 ou litige"},null,{"$f":"IF(P135=\"Annulé\",\"Annulé\",IF(P135=\"Litige\",\"Litige\",IF(P135>3,\"+ de 3 jours\",P135)))","v":1},{"$f":"IF(N135=311,\"Reliquat\",IF(O135=311,\"Reliquat\",IF(I135<>\"X\",\"CDE Jour\",\"\")))","v":"CDE Jour"},"GIRARD LOIC",200989453,1,{"$f":"H135","v":1}]
["4700044354-340",295,4700044354,340,8201440358,"FAISCEAU 7 BROCHE X82","2016-10-21",1,null,"",{"$f":"IF(ISERROR(VLOOKUP(E136,'LX02'!$A$1:$D$150,1,FALSE)),\"\",\"X\")","v":""},"2016-10-24",1,"520","Soldé",1,"",null,1,"CDE Jour","GIRARD LOIC",200989453,1,1]
["4700044354-350",295,4700044354,350,8201441948,"FAISCEAU 13BAM","2016-10-21",1,null,"",{"$f":"IF(ISERROR(VLOOKUP(E137,'LX02'!$A$1:$D$150,1,FALSE)),\"\",\"X\")","v":""},"2016-10-24",1,"520","Soldé",1,"",null,1,"CDE Jour","GIRARD LOIC",200989453,1,1]
["4700044354-360",295,4700044354,360,8201454538,"GRILLE PROTECTION VITRE AR","2016-10-21",1,null,"",{"$f":"IF(ISERROR(VLOOKUP(E138,'LX02'!$A$1:$D$150,1,FALSE)),\"\",\"X\")","v":""},"2016-10-24",1,"520","Soldé",1,"",null,1,"CDE Jour","GIRARD LOIC",200989340,1,1]
["4700044354-370",295,4700044354,370,8201454540,"GRILLE PROTECTION VITRE LAT","2016-10-21",1,null,"",{"$f":"IF(ISERROR(VLOOKUP(E139,'LX02'!$A$1:$D$150,1,FALSE)),\"\",\"X\")","v":""},"2016-10-24",1,"520","Soldé",1,"",null,1,"CDE Jour","GIRARD LOIC",200989340,1,1]
["4700044354-380",295,4700044354,380,8201454542,"GRILLE PROTECTION VITRE LAT","2016-10-21",1,null,"",{"$f":"IF(ISERROR(VLOOKUP(E140,'LX02'!$A$1:$D$150,1,FALSE)),\"\",\"X\")","v":""},"2016-10-24",1,"520","Soldé",1,"",null,1,"CDE Jour","GIRARD LOIC",200989340,1,1]
["4700044354-390",295,4700044354,390,8201468223,"ECHELLE H1 PEINTE","2016-10-21",1,"X","X",{"$f":"IF(ISERROR(VLOOKUP(E141,'LX02'!$A$1:$D$150,1,FALSE)),\"\",\"X\")","v":""},"Différé",1,230,"","","Manque stock",null,"+ de 3 jours","","GIRARD LOIC",200989362,1,1]
["4700044354-400",295,4700044354,400,8201484430,"PACK SPORT K95NBI","2016-10-21",1,"X","X",{"$f":"IF(ISERROR(VLOOKUP(E142,'LX02'!$A$1:$D$150,1,FALSE)),\"\",\"X\")","v":""},"Différé",1,311,"","","Affectée non expédiée",null,"+ de 3 jours","Reliquat",{"$error":"#N/A"},{"$error":"#N/A"},{"$error":"#N/A"},1]
["4700044354-410",295,4700044354,410,8201487417,"ALARME","2016-10-21",1,null,"",{"$f":"IF(ISERROR(VLOOKUP(E143,'LX02'!$A$1:$D$150,1,FALSE)),\"\",\"X\")","v":""},"2016-10-24",1,"520","Soldé",1,"",null,1,"CDE Jour","GIRARD LOIC",200989362,1,1]
["4700044354-420",295,4700044354,420,8201506974,"PARE-SOLEIL HAYON","2016-10-21",1,null,"",{"$f":"IF(ISERROR(VLOOKUP(E144,'LX02'!$A$1:$D$150,1,FALSE)),\"\",\"X\")","v":""},"2016-10-24",1,"520","Soldé",1,"",null,1,"CDE Jour","GIRARD LOIC",200989362,1,1]
["4700044354-430",295,4700044354,430,8201506977,"PARE-SOLEIL PORTES BATTANTE ARRIERE","2016-10-21",1,null,"",{"$f":"IF(ISERROR(VLOOKUP(E145,'LX02'!$A$1:$D$150,1,FALSE)),\"\",\"X\")","v":""},"2016-10-24",1,"520","Soldé",1,"",null,1,"CDE Jour","GIRARD LOIC",200989340,1,1]
["4700044354-440",295,4700044354,440,8201506978,"PARE-SOLEIL VITRES LATERALES","2016-10-21",1,null,"",{"$f":"IF(ISERROR(VLOOKUP(E146,'LX02'!$A$1:$D$150,1,FALSE)),\"\",\"X\")","v":""},"2016-10-24",1,"520","Soldé",1,"",null,1,"CDE Jour","GIRARD LOIC",200989340,1,1]
["4700044354-450",295,4700044354,450,8201506979,"PARE-SOLEIL VITRES LATERALES","2016-10-21",1,null,"",{"$f":"IF(ISERROR(VLOOKUP(E147,'LX02'!$A$1:$D$150,1,FALSE)),\"\",\"X\")","v":""},"2016-10-24",1,"520","Soldé",1,"",null,1,"CDE Jour","GIRARD LOIC",200989340,1,1]
["4700044354-460",295,4700044354,460,8201543434,"PARE-SOLEIL","2016-10-21",1,null,"",{"$f":"IF(ISERROR(VLOOKUP(E148,'LX02'!$A$1:$D$150,1,FALSE)),\"\",\"X\")","v":""},"2016-10-24",1,"520","Soldé",1,"",null,1,"CDE Jour","GIRARD LOIC",200989340,1,1]
["4700044354-470",295,4700044354,470,8201543439,"PARE-SOLEIL","2016-10-21",1,null,"",{"$f":"IF(ISERROR(VLOOKUP(E149,'LX02'!$A$1:$D$150,1,FALSE)),\"\",\"X\")","v":""},"2016-10-24",1,"520","Soldé",1,"",null,1,"CDE Jour","GIRARD LOIC",200989340,1,1]
["4700044354-480",295,4700044354,480,"054000001R","PLASTI-RIVET  8","2016-10-21",20,null,"X",{"$f":"IF(ISERROR(VLOOKUP(E150,'LX02'!$A$1:$D$150,1,FALSE)),\"\",\"X\")","v":""},"2016-10-24",20,"520","Soldé",1,"351 ou litige",null,1,"CDE Jour","LE GAC ERWAN",200989478,20,20]
["4700044354-490",295,4700044354,490,"164009384R","COLLECTION FILTRE CARBURANT","2016-10-21",2,null,"",{"$f":"IF(ISERROR(VLOOKUP(E151,'LX02'!$A$1:$D$150,1,FALSE)),\"\",\"X\")","v":""},"2016-10-24",2,"520","Soldé",1,"",null,1,"CDE Jour","GILLES MARC",200989352,2,2]
["4700044354-500",295,4700044354,500,"180205139R","PEDALIER FREIN DAG BVA","2016-10-21",2,null,"",{"$f":"IF(ISERROR(VLOOKUP(E152,'LX02'!$A$1:$D$150,1,FALSE)),\"\",\"X\")","v":""},"2016-10-24",2,"520","Soldé",1,"",null,1,"CDE Jour","KELLOU HAKIM",200989357,2,2]
["4700044354-510",295,4700044354,510,"288810288R","BRAS BALAI E/PBR COTE CDC","2016-10-21",1,null,"",{"$f":"IF(ISERROR(VLOOKUP(E153,'LX02'!$A$1:$D$150,1,FALSE)),\"\",\"X\")","v":""},"2016-10-24",1,"520","Soldé",1,"",null,1,"CDE Jour","HAVEL ALEXANDRE MARC PHILIPPE",200989341,1,1]
["4700044354-520",295,4700044354,520,"288866647R","BRAS ESSUIE PARE-BRISE COTE PASSAGER","2016-10-21",1,null,"",{"$f":"IF(ISERROR(VLOOKUP(E154,'LX02'!$A$1:$D$150,1,FALSE)),\"\",\"X\")","v":""},"2016-10-24",1,"520","Soldé",1,"",null,1,"CDE Jour","HAVEL ALEXANDRE MARC PHILIPPE",200989341,1,1]
["4700044354-530",295,4700044354,530,"288953663R","RACLETTE ESSUIE GLACE CONDUCTEUR","2016-10-21",1,"X","X",{"$f":"IF(ISERROR(VLOOKUP(E155,'LX02'!$A$1:$D$150,1,FALSE)),\"\",\"X\")","v":""},"Différé",1,230,"","","Manque stock",null,"+ de 3 jours","","HAVEL ALEXANDRE MARC PHILIPPE",200989341,1,1]
["4700044354-540",295,4700044354,540,"288B57752R","RACLETTE BALAI PASSAGER","2016-10-21",1,null,"",{"$f":"IF(ISERROR(VLOOKUP(E156,'LX02'!$A$1:$D$150,1,FALSE)),\"\",\"X\")","v":""},"2016-10-24",1,"520","Soldé",1,"",null,1,"CDE Jour","HAVEL ALEXANDRE MARC PHILIPPE",200989341,1,1]
["4700044354-550",295,4700044354,550,"296936637R","MECANISME CONDAMNATION PRISE CHARGE","2016-10-21",1,null,"",{"$f":"IF(ISERROR(VLOOKUP(E157,'LX02'!$A$1:$D$150,1,FALSE)),\"\",\"X\")","v":""},"2016-10-24",1,"520","Soldé",1,"",null,1,"CDE Jour","LEREDDE ALEXANDRE",200989358,1,1]
["4700044354-561",295,4700044354,561,"403000579R","ROUE 7 J 17 CH 5 49","2016-10-21",2,null,"",{"$f":"IF(ISERROR(VLOOKUP(E158,'LX02'!$A$1:$D$150,1,FALSE)),\"\",\"X\")","v":""},"2016-10-24",2,"520","Soldé",1,"",null,1,"CDE Jour","GILLES MARC",200989463,2,2]
["4700044354-570",295,4700044354,570,"403154960R","ENJOLIVEUR ROUE","2016-10-21",4,"X","X",{"$f":"IF(ISERROR(VLOOKUP(E159,'LX02'!$A$1:$D$150,1,FALSE)),\"\",\"X\")","v":""},"Différé",4,230,"","","Manque stock",null,"+ de 3 jours","","DECAUDAIN JEAN FRANCOIS",200989446,4,4]
["4700044354-580",295,4700044354,580,"465015137R","PEDALIER FREIN DAD BVA","2016-10-21",2,"X","X",{"$f":"IF(ISERROR(VLOOKUP(E160,'LX02'!$A$1:$D$150,1,FALSE)),\"\",\"X\")","v":""},"Différé",2,230,"","","Manque stock",null,"+ de 3 jours","","KELLOU HAKIM",200989357,2,2]
["4700044354-590",295,4700044354,590,"656015563R","SERRURE CAPOT","2016-10-21",3,"X","X",{"$f":"IF(ISERROR(VLOOKUP(E161,'LX02'!$A$1:$D$150,1,FALSE)),\"\",\"X\")","v":""},"Différé",3,311,"","","Affectée non expédiée",null,"+ de 3 jours","Reliquat","PODEVIN LUC HERVE",200989370,3,3]
["4700044354-601",295,4700044354,601,"681006566R","PLANCHE BORD EQP","2016-10-21",4,null,"",{"$f":"IF(ISERROR(VLOOKUP(E162,'LX02'!$A$1:$D$150,1,FALSE)),\"\",\"X\")","v":""},"2016-10-24",4,"520","Soldé",1,"",null,1,"CDE Jour","VEUILLOT OLIVIER",200989459,4,4]
["4700044354-610",295,4700044354,610,"788128132R","BAVETTE AR","2016-10-21",1,null,"",{"$f":"IF(ISERROR(VLOOKUP(E163,'LX02'!$A$1:$D$150,1,FALSE)),\"\",\"X\")","v":""},"2016-10-24",1,"520","Soldé",1,"",null,1,"CDE Jour","GIRARD LOIC",200989340,1,1]
["4700044354-620",295,4700044354,620,"802856201R","ENJOLIVEUR MONTANT AR PORTE AV G","2016-10-21",1,null,"",{"$f":"IF(ISERROR(VLOOKUP(E164,'LX02'!$A$1:$D$150,1,FALSE)),\"\",\"X\")","v":""},"2016-10-24",1,"520","Soldé",1,"",null,1,"CDE Jour","MALGUY STEPHANE",200989470,1,1]
["4700044354-630",295,4700044354,630,"822826998R","ENJOLIVEUR MONTANT AV PORTE AR G","2016-10-21",1,null,"",{"$f":"IF(ISERROR(VLOOKUP(E165,'LX02'!$A$1:$D$150,1,FALSE)),\"\",\"X\")","v":""},"2016-10-24",1,"520","Soldé",1,"",null,1,"CDE Jour","MALGUY STEPHANE",200989470,1,1]
["4700044354-640",295,4700044354,640,"964112215R","CROCHET CTL PARE-SOLEIL","2016-10-21",2,null,"",{"$f":"IF(ISERROR(VLOOKUP(E166,'LX02'!$A$1:$D$150,1,FALSE)),\"\",\"X\")","v":""},"2016-10-24",2,"520","Soldé",1,"",null,1,"CDE Jour","RUELLAN ANDRE",200989457,2,2]
["4700044354-651",295,4700044354,651,"985253411R","SAC GONFLABLE PASSAGER","2016-10-21",6,null,"",{"$f":"IF(ISERROR(VLOOKUP(E167,'LX02'!$A$1:$D$150,1,FALSE)),\"\",\"X\")","v":""},"2016-10-24",6,"520",{"$f":"IF(N167=\"Litige\",\"Litige\",IF(AND(N167=\"520\",H167=M167),\"Soldé\",IF(N167=\"Annulé\",\"Annulé\",\"\")))","v":"Soldé"},{"$f":"IF(N167=\"Litige\",\"Litige\",IF(O167=\"Soldé\",1,IF(O167=520,$L167-$G167-INT(($L167-MOD($L167-JUn,7)-$G167+7)/7)-INT(($L167-MOD($L167-JDeux,7)-$G167+7)/7)-(SUMPRODUCT((_Fer2>=$G167)-(_Fer2>$L167)))+SUMPRODUCT(((WEEKDAY(_Fer2)=WEEKDAY(JUn))+(WEEKDAY(_Fer2)=WEEKDAY(JDeux)))*(_Fer2>=$L167)*(_Fer2<=$L167)),IF(N167=\"Annulé\",\"Annulé\",\"\"))))","v":1},"",null,1,"CDE Jour","PILLAUD PATRICE",200989462,6,6]
["4700044354-661",295,4700044354,661,"403003754R","ROUE 8 J 19 5 49","2016-10-21",8,null,"",{"$f":"IF(ISERROR(VLOOKUP(E168,'LX02'!$A$1:$D$150,1,FALSE)),\"\",\"X\")","v":""},"2016-10-24",8,"520","Soldé",1,"",null,1,"CDE Jour","DECAUDAIN JEAN FRANCOIS",200989428,8,8]
["4700044354-671",295,4700044354,671,"403004629R","ROUE 6 J 15 H2 5 44","2016-10-21",4,null,"",{"$f":"IF(ISERROR(VLOOKUP(E169,'LX02'!$A$1:$D$150,1,FALSE)),\"\",\"X\")","v":""},"2016-10-24",4,"520","Soldé",1,"",null,1,"CDE Jour","DECAUDAIN JEAN FRANCOIS",200989446,4,4]

{"sheet":"MP","index":3,"n_rows":11051,"n_cols":11,"rows_kept":11051,"cut":false,"hidden":false,"merged":[]}
["Contrôle","LF","Suivi MPR"]
[{"$f":"CONCATENATE(D2,\"-\",E2)","v":"4700043626-320"},{"$f":"IF(J2=K2,\"X\",\"\")","v":""},{"$f":"IF(ISERROR(VLOOKUP(A2,Base_suivi_MPR,1,FALSE)),\"\",\"X\")","v":"X"},4700043626,320,7711575964,"Pack Historic 2","2016-06-21","2016-07-11",1,0]
[{"$f":"CONCATENATE(D3,\"-\",E3)","v":"4700043671-350"},"",{"$f":"IF(ISERROR(VLOOKUP(A3,Base_suivi_MPR,1,FALSE)),\"\",\"X\")","v":"X"},4700043671,350,"410114EA0A","CALIPER ASSY-BRAKE,W/O PAD LH","2016-06-28","2016-06-29",30,6]
[{"$f":"CONCATENATE(D4,\"-\",E4)","v":"4700043822-170"},"",{"$f":"IF(ISERROR(VLOOKUP(A4,Base_suivi_MPR,1,FALSE)),\"\",\"X\")","v":"X"},4700043822,170,7705030156,"RACCORD 2 VOIES 20X20","2016-07-25","2016-07-26",20,0]
["4700043829-320","","X",4700043829,320,"144B05233R","POMPE EAU ADDITIONNELLE","2016-07-26","2016-07-27",2,0]
["4700043864-310","","X",4700043864,310,7711782372,"SPINBOARD ALPINE","2016-08-02","2016-08-03",1,0]
["4700043996-200","","X",4700043996,200,"628908106R","EMBLEME AV","2016-08-29","2016-08-30",2,0]
["4700044012-490","","X",4700044012,490,"255545857R","TRANSMISSION ELCT RTTF CDE SOUS VLT","2016-08-31","2016-09-01",12,0]
["4700044052-360","","X",4700044052,360,7711419431,"PON\\EUSE 1 MAIN","2016-09-06","2016-09-07",2,0]
["4700044063-700","","X",4700044063,700,"628908106R","EMBLEME AV","2016-09-07","2016-09-08",2,0]
["4700044073-200","","X",4700044073,200,7701421117,"REPARATION PLASTIQUE","2016-09-08","2016-09-09",2,0]
["4700044073-230","","X",4700044073,230,7701512272,"TENDEUR","2016-09-08","2016-09-09",1,0]
["4700044073-380","","X",4700044073,380,7711579329,"PINS ALPINE BRILLANT","2016-09-08","2016-09-23",200,160]
["4700044073-520","","X",4700044073,520,"403006329R","ROUE 6 J 16 H2 5 50","2016-09-08","2016-09-09",125,105]
["4700044091-120","","X",4700044091,120,"727125064R","VITRE PARE-BRISE ACOUSTIQUE CPTR PLUIE","2016-09-12","2016-09-13",3,0]
["4700044099-250","","X",4700044099,250,8200725767,"PEDALIER DEBRAYAGE DAG","2016-09-13","2016-09-14",2,0]
["4700044099-300","","X",4700044099,300,8200725767,"PEDALIER DEBRAYAGE DAG","2016-09-13","2016-09-14",2,0]
["4700044110-230","","X",4700044110,230,8200545725,"CALE MOUSSE","2016-09-14","2016-09-15",300,250]
["4700044119-320","","X",4700044119,320,"628908106R","EMBLEME AV","2016-09-15","2016-09-16",2,0]
["4700044137-470","","X",4700044137,470,"628908106R","EMBLEME AV","2016-09-19","2016-09-20",2,0]
["4700044166-170","","X",4700044166,170,7700428589,"SUPPORT POMPE CRBT.DRAFTEX 500802000","2016-09-22","2016-09-23",100,0]
["4700044166-310","","X",4700044166,310,7711425783,"FILTRE FIN","2016-09-22","2016-09-23",1,0]
["4700044174-420","","X",4700044174,420,"144B05233R","POMPE EAU ADDITIONNELLE","2016-09-23","2016-09-26",1,0]
["4700044182-300","","X",4700044182,300,7703297121,"SUPPORT MAXI-FUSE.REINSHAGEN ID 403145","2016-09-26","2016-09-27",200,50]
["4700044182-330","","X",4700044182,330,7711381969,"OUTIL CALAGE AAC","2016-09-26","2016-09-27",3,0]
["4700044182-720","","X",4700044182,720,"296955229R","CABLAGE PRISE CHARGE","2016-09-26","2016-09-27",3,0]
["4700044182-780","","X",4700044182,780,"465039034R","PEDALIER DEBRAYAGE DAG","2016-09-26","2016-09-27",6,0]
["4700044189-480","","X",4700044189,480,"749021679R","TAPIS HABITACLE AV","2016-09-27","2016-09-28",1,0]
["4700044196-330","","X",4700044196,330,7711381769,"CALAGE AAC M9R","2016-09-28","2016-09-29",3,0]
["4700044196-340","","X",4700044196,340,7711419431,"PON\\EUSE 1 MAIN","2016-09-28","2016-09-29",6,0]
["4700044215-190","","X",4700044215,190,7711392297,"CLES USB R.NET","2016-09-30","2016-10-03",20,0]
["4700044223-60","","X",4700044223,60,7711381973,"CLE 4-40 NMRQ 1/4","2016-10-03","2016-10-04",1,0]
["4700044223-310","","X",4700044223,310,7703497285,"CLIP TIMER CAGE.AMP 144432-1","2016-10-03","2016-10-04",50,0]
["4700044223-460","","X",4700044223,460,"214101428R","RADIATEUR","2016-10-03","2016-10-04",1,0]
["4700044223-580","","X",4700044223,580,"476608628R","BLOC HYDRAULIQUE ABS","2016-10-03","2016-10-04",1,0]
["4700044234-150","","X",4700044234,150,7701394430,"ADHESIF EPOXY  RAP","2016-10-04","2016-10-05",3,0]
["4700044234-310","","X",4700044234,310,"296099924R","CHARGEUR-BOITIER CONNEXION CALIBRE","2016-10-04","2016-10-05",1,0]
["4700044242-380","","X",4700044242,380,"749021679R","TAPIS HABITACLE AV","2016-10-05","2016-10-06",2,0]
["4700044260-80","","X",4700044260,80,8201571730,"COLLECTION CORDON DE","2016-10-07","2016-10-10",1,0]
["4700044260-390","","X",4700044260,390,8201489213,"COLLECTION CORDON DE","2016-10-07","2016-10-10",2,0]
["4700044272-170","","X",4700044272,170,7701394430,"ADHESIF EPOXY  RAP","2016-10-10","2016-10-11",5,0]
["4700044289-50","","X",4700044289,50,7711426403,"BOBINE ESSUY BLEU","2016-10-12","2016-10-13",2,0]
["4700044289-60","","X",4700044289,60,7711780436,"CH. RENAULT FLEX T40","2016-10-12","2016-10-13",1,0]
["4700044289-170","","X",4700044289,170,7711216791,"CHARIOT RANGEMENT PINCES       SECT.729","2016-10-12","2016-10-13",2,0]
["4700044289-220","","X",4700044289,220,7711419431,"PON\\EUSE 1 MAIN","2016-10-12","2016-10-13",4,0]
["4700044289-590","","X",4700044289,590,"628908106R","EMBLEME AV","2016-10-12","2016-10-13",2,0]
["4700044301-60","","X",4700044301,60,7711573597,"BOB CHAMOIS 1000F","2016-10-13","2016-10-14",2,0]
["4700044301-150","","X",4700044301,150,7711239373,"PEAU DE CHAMOIS N","2016-10-13","2016-10-14",1,0]
["4700044301-440","","X",4700044301,440,"288953663R","RACLETTE ESSUIE GLACE CONDUCTEUR","2016-10-13","2016-10-14",1,0]
["4700044301-450","","X",4700044301,450,"288B55332R","RACLETTE BALAI PASSAGER","2016-10-13","2016-10-14",1,0]
["4700044301-570","",{"$f":"IF(ISERROR(VLOOKUP(A51,Base_suivi_MPR,1,FALSE)),\"\",\"X\")","v":"X"},4700044301,570,"964013442R","PARE-SOLEIL G","2016-10-13","2016-10-14",2,0]
["4700044310-80","","X",4700044310,80,7711573599,"BOB BLANC 1000F","2016-10-14","2016-10-17",6,0]
["4700044310-120","","X",4700044310,120,7700843546,"BUTEE CAPOT AV","2016-10-14","2016-10-17",1000,500]
["4700044310-200","","X",4700044310,200,7711573596,"BOB CHAMOIS 450F","2016-10-14","2016-10-17",6,0]
["4700044310-220","","X",4700044310,220,7711576123,"PACK GO 500 + HOUSSE + CHARGEUR RAPIDE","2016-10-14","2016-10-17",1,0]
["4700044310-370","",{"$f":"IF(ISERROR(VLOOKUP(A56,Base_suivi_MPR,1,FALSE)),\"\",\"X\")","v":"X"},4700044310,370,8201645511,"FAISCEAU ATTELAGE 13B RETRACTABLE","2016-10-14","2016-10-17",2,0]
["4700044318-180","","X",4700044318,180,7704002509,"SUPPORT ELASTIQUE","2016-10-17","2016-10-18",300,0]
["4700044318-200","","X",4700044318,200,7711172286,"NENETOL                        SECT.729","2016-10-17","2016-10-18",12,0]
["4700044318-360","","X",4700044318,360,7711782082,"SUPPORT MASQUE COMPLET DOUBLE CARTOUCHE","2016-10-17","2016-10-18",4,0]
["4700044318-420","","X",4700044318,420,8201420512,"JANTE 8,5 J 20 5 47 KUBERA","2016-10-17","2016-10-18",4,0]
["4700044318-511","","X",4700044318,511,"484007956R","VOLANT DIRECTION","2016-10-17","2016-10-18",2,0]
["4700044318-610","","X",4700044318,610,"873203208R","GARNITURE COUSSIN SIEGE 1ERE RNG","2016-10-17","2016-10-18",1,0]
["4700044325-50","","X",4700044325,50,7711426403,"BOBINE ESSUY BLEU","2016-10-18","2016-10-19",2,0]
["4700044325-280","","X",4700044325,280,7711392297,"CLES USB R.NET","2016-10-18","2016-10-19",20,0]
["4700044325-300","","",4700044325,300,7711577450,"PACK ATTELAGE RDSO 7","2016-10-18","2016-10-19",1,0]
["4700044335-70","","X",4700044335,70,7711382005,"OUTIL CONSIGNE BATTE","2016-10-19","2016-10-20",30,0]
["4700044335-480",{"$f":"IF(J67=K67,\"X\",\"\")","v":""},"X",4700044335,480,"217102781R","RESERVOIR DEGAZAGE","2016-10-19","2016-10-20",2,0]
[{"$f":"CONCATENATE(D68,\"-\",E68)","v":"4700044335-530"},"","X",4700044335,530,"280907095R","PANNEAU CTL COMMANDE INSTRUMENTATION","2016-10-19","2016-10-20",2,0]
["4700044335-610","","X",4700044335,610,"296950307R","CABLAGE PRISE CHARGE","2016-10-19","2016-10-20",1,0]
["4700044335-620","","X",4700044335,620,"297A38225R","CABLE ALMT CTRLR ENERGIE - MOTOREDUCTEUR","2016-10-19","2016-10-20",1,0]
["4700044335-630","","X",4700044335,630,"402622Y000","ECROU BLOCAGE ROULEMENT ROUE","2016-10-19","2016-10-20",4,0]
["4700044335-640","",{"$f":"IF(ISERROR(VLOOKUP(A72,Base_suivi_MPR,1,FALSE)),\"\",\"X\")","v":"X"},4700044335,640,"40262JA000","NUT-LOCK","2016-10-19","2016-10-20",10,0]
["4700044335-650","","X",4700044335,650,"502705683R","SUPPORT BARRE PANHARD","2016-10-19","2016-10-31",10,0]
["4700044335-760","","X",4700044335,760,"809013617R","GARNITURE PANNEAU PORTE AV G ASS","2016-10-19","2016-10-20",1,0]
["4700044335-820","",{"$f":"IF(ISERROR(VLOOKUP(A75,Base_suivi_MPR,1,FALSE)),\"\",\"X\")","v":"X"},4700044335,820,"924871682R","ELECTROVANNE 2 VOIES AC CHF","2016-10-19","2016-10-21",4,0]
["4700044335-880","","X",4700044335,880,"403001068R","ROUE 8 1/4XJ 19 CH 5 65","2016-10-19","2016-10-20",4,0]
["4700044346-60","","X",4700044346,60,7711382005,"OUTIL CONSIGNE BATTE","2016-10-20","2016-10-21",50,0]
["4700044346-320","","X",4700044346,320,8201487253,"COLLECTION COQUILLE DE RETROVISEUR EXT","2016-10-20","2016-10-21",1,0]
["4700044346-430","","X",4700044346,430,"403009592R","ROUE 7 1/2XJ 18 CH 5 55","2016-10-20","2016-10-21",2,0]
["4700044346-560","","X",4700044346,560,"963024306R","RETROVISEUR EXT G ELCT","2016-10-20","2016-10-21",1,0]
["4700044346-710","","X",4700044346,710,"403006336R","ROUE 7 1/2XJ 18 5 46","2016-10-20","2016-10-21",1,0]
["4700044354-20","","X",4700044354,20,7711780930,"PACK HISTORIC 1","2016-10-21","2016-10-24",1,0]
["4700044354-30","","X",4700044354,30,8200070652,"GOUJON M8-125","2016-10-21","2016-10-24",50,0]
["4700044354-60","","X",4700044354,60,"440604694R","JEU PLAQUETTE AR","2016-10-21","2016-10-24",2,0]
["4700044354-80","","X",4700044354,80,7711780423,"PIN'S LOSANGE 2D 15 MM","2016-10-21","2016-10-24",1000,0]
["4700044354-110","","X",4700044354,110,143300181,"VIS FIX GACHE DE PORTE DE COFFRE","2016-10-21","2016-10-24",20,0]
["4700044354-150","","X",4700044354,150,7703072132,"RIVET G4,8-12,5","2016-10-21","2016-10-24",500,0]
["4700044354-190","","X",4700044354,190,7711170355,"RIVET 4.26 JAUNE               SECT.729","2016-10-21","2016-10-24",500,0]
["4700044354-200","","X",4700044354,200,7711170356,"RIVET 4.26 BLANC               SECT.729","2016-10-21","2016-10-24",500,0]
["4700044354-220","","X",4700044354,220,7711780931,"PACK HISTORIC 2","2016-10-21","2016-10-24",1,0]
["4700044354-230","","X",4700044354,230,7711781023,"POLAIRE RENAULT CORPORATE S","2016-10-21","2016-10-24",2,0]
["4700044354-240","","X",4700044354,240,7711781024,"POLAIRE RENAULT CORPORATE M","2016-10-21","2016-10-24",1,0]
["4700044354-250","","X",4700044354,250,7711781025,"POLAIRE RENAULT CORPORATE L","2016-10-21","2016-10-24",2,0]
["4700044354-260","","X",4700044354,260,7711781026,"POLAIRE RENAULT CORPORATE XL","2016-10-21","2016-10-24",4,0]
["4700044354-270","",{"$f":"IF(ISERROR(VLOOKUP(A95,Base_suivi_MPR,1,FALSE)),\"\",\"X\")","v":"X"},4700044354,270,7711781027,"POLAIRE RENAULT CORPORATE XXL","2016-10-21","2016-10-24",2,0]
["4700044354-290","","X",4700044354,290,8201327012,"SURTAPIS","2016-10-21","2016-10-24",46,0]
["4700044354-300",{"$f":"IF(J95=K95,\"X\",\"\")","v":""},"X",4700044354,300,8201353131,"COLLECTION CORDON DE","2016-10-21","2016-10-24",1,0]
["4700044354-330","","X",4700044354,330,8201413368,"TRAVERSE ATTELAGE CARAVANE","2016-10-21","2016-10-24",1,0]
["4700044354-390",{"$f":"IF(J99=K99,\"X\",\"\")","v":""},{"$f":"IF(ISERROR(VLOOKUP(A99,Base_suivi_MPR,1,FALSE)),\"\",\"X\")","v":"X"},4700044354,390,8201468223,"ECHELLE H1 PEINTE","2016-10-21","2016-10-24",1,0]
["4700044354-400",{"$f":"IF(J100=K100,\"X\",\"\")","v":""},{"$f":"IF(ISERROR(VLOOKUP(A100,Base_suivi_MPR,1,FALSE)),\"\",\"X\")","v":"X"},4700044354,400,8201484430,"PACK SPORT K95NBI","2016-10-21","2016-10-24",1,0]
["4700044354-480","","X",4700044354,480,"054000001R","PLASTI-RIVET  8","2016-10-21","2016-10-24",0.02,0]
["4700044354-530",{"$f":"IF(J102=K102,\"X\",\"\")","v":""},"X",4700044354,530,"288953663R","RACLETTE ESSUIE GLACE CONDUCTEUR","2016-10-21","2016-10-24",1,0]
["4700044354-570",{"$f":"IF(J103=K103,\"X\",\"\")","v":""},"X",4700044354,570,"403154960R","ENJOLIVEUR ROUE","2016-10-21","2016-10-24",4,0]
["4700044354-580","","X",4700044354,580,"465015137R","PEDALIER FREIN DAD BVA","2016-10-21","2016-10-24",2,0]
["4700044354-590","","X",4700044354,590,"656015563R","SERRURE CAPOT","2016-10-21","2016-10-28",3,0]
["4700044335-480","","X",4700044335,480,"217102781R","RESERVOIR DEGAZAGE","2016-10-19","2016-10-20",2,0]
["4700044335-530","","X",4700044335,530,"280907095R","PANNEAU CTL COMMANDE INSTRUMENTATION","2016-10-19","2016-10-20",2,0]
["4700044335-610","","X",4700044335,610,"296950307R","CABLAGE PRISE CHARGE","2016-10-19","2016-10-20",1,0]
["4700044335-620","","X",4700044335,620,"297A38225R","CABLE ALMT CTRLR ENERGIE - MOTOREDUCTEUR","2016-10-19","2016-10-20",1,0]
["4700044335-630","","X",4700044335,630,"402622Y000","ECROU BLOCAGE ROULEMENT ROUE","2016-10-19","2016-10-20",4,0]
["4700044335-640","","X",4700044335,640,"40262JA000","NUT-LOCK","2016-10-19","2016-10-20",10,0]
["4700044335-650","","X",4700044335,650,"502705683R","SUPPORT BARRE PANHARD","2016-10-19","2016-10-31",10,0]
["4700044335-760","","X",4700044335,760,"809013617R","GARNITURE PANNEAU PORTE AV G ASS","2016-10-19","2016-10-20",1,0]
["4700044335-820","","X",4700044335,820,"924871682R","ELECTROVANNE 2 VOIES AC CHF","2016-10-19","2016-10-21",4,0]
["4700044325-300","","",4700044325,300,7711577450,"PACK ATTELAGE RDSO 7","2016-10-18","2016-10-19",1,0]
["4700044325-280","","X",4700044325,280,7711392297,"CLES USB R.NET","2016-10-18","2016-10-19",20,0]
["4700044325-70","","X",4700044325,70,8200070652,"GOUJON M8-125","2016-10-18","2016-10-19",6,0]
["4700043626-320","","X",4700043626,320,7711575964,"Pack Historic 2","2016-06-21","2016-07-11",1,0]
["4700043671-350","","X",4700043671,350,"410114EA0A","CALIPER ASSY-BRAKE,W/O PAD LH","2016-06-28","2016-06-29",30,6]
["4700043822-170","","X",4700043822,170,7705030156,"RACCORD 2 VOIES 20X20","2016-07-25","2016-07-26",20,0]
["4700043829-320","","X",4700043829,320,"144B05233R","POMPE EAU ADDITIONNELLE","2016-07-26","2016-07-27",2,0]
["4700043864-310","","X",4700043864,310,7711782372,"SPINBOARD ALPINE","2016-08-02","2016-08-03",1,0]
["4700043996-200","","X",4700043996,200,"628908106R","EMBLEME AV","2016-08-29","2016-08-30",2,0]
["4700044012-490","",{"$f":"IF(ISERROR(VLOOKUP(A124,Base_suivi_MPR,1,FALSE)),\"\",\"X\")","v":"X"},4700044012,490,"255545857R","TRANSMISSION ELCT RTTF CDE SOUS VLT","2016-08-31","2016-09-01",12,0]
["4700044052-360","","X",4700044052,360,7711419431,"PON\\EUSE 1 MAIN","2016-09-06","2016-09-07",2,0]
["4700044063-700","","X",4700044063,700,"628908106R","EMBLEME AV","2016-09-07","2016-09-08",2,0]
["4700044073-520","","X",4700044073,520,"403006329R","ROUE 6 J 16 H2 5 50","2016-09-08","2016-09-09",125,105]
["4700044091-120","","X",4700044091,120,"727125064R","VITRE PARE-BRISE ACOUSTIQUE CPTR PLUIE","2016-09-12","2016-09-13",3,0]
["4700044099-250","","X",4700044099,250,8200725767,"PEDALIER DEBRAYAGE DAG","2016-09-13","2016-09-14",2,0]
["4700044099-300","","X",4700044099,300,8200725767,"PEDALIER DEBRAYAGE DAG","2016-09-13","2016-09-14",2,0]
["4700044110-230","","X",4700044110,230,8200545725,"CALE MOUSSE","2016-09-14","2016-09-15",300,250]
["4700044119-320","","X",4700044119,320,"628908106R","EMBLEME AV","2016-09-15","2016-09-16",2,0]
[{"$f":"CONCATENATE(D133,\"-\",E133)","v":"4700044137-470"},"","X",4700044137,470,"628908106R","EMBLEME AV","2016-09-19","2016-09-20",2,0]
["4700044166-170","","X",4700044166,170,7700428589,"SUPPORT POMPE CRBT.DRAFTEX 500802000","2016-09-22","2016-09-23",100,0]
["4700044166-310","","X",4700044166,310,7711425783,"FILTRE FIN","2016-09-22","2016-09-23",1,0]
["4700044182-300","","X",4700044182,300,7703297121,"SUPPORT MAXI-FUSE.REINSHAGEN ID 403145","2016-09-26","2016-09-27",200,50]
["4700044182-330","","X",4700044182,330,7711381969,"OUTIL CALAGE AAC","2016-09-26","2016-09-27",3,0]
["4700044182-720","","X",4700044182,720,"296955229R","CABLAGE PRISE CHARGE","2016-09-26","2016-09-27",3,0]
["4700044182-780","","X",4700044182,780,"465039034R","PEDALIER DEBRAYAGE DAG","2016-09-26","2016-09-27",6,0]
["4700044189-480","","X",4700044189,480,"749021679R","TAPIS HABITACLE AV","2016-09-27","2016-09-28",1,0]
["4700044215-190","","X",4700044215,190,7711392297,"CLES USB R.NET","2016-09-30","2016-10-03",20,0]
["4700044223-60","","X",4700044223,60,7711381973,"CLE 4-40 NMRQ 1/4","2016-10-03","2016-10-04",1,0]
["4700044223-310","","X",4700044223,310,7703497285,"CLIP TIMER CAGE.AMP 144432-1","2016-10-03","2016-10-04",50,0]
["4700044223-460","","X",4700044223,460,"214101428R","RADIATEUR","2016-10-03","2016-10-04",1,0]
["4700044223-580","",{"$f":"IF(ISERROR(VLOOKUP(A145,Base_suivi_MPR,1,FALSE)),\"\",\"X\")","v":"X"},4700044223,580,"476608628R","BLOC HYDRAULIQUE ABS","2016-10-03","2016-10-04",1,0]
["4700044234-150","","X",4700044234,150,7701394430,"ADHESIF EPOXY  RAP","2016-10-04","2016-10-05",3,0]
["4700044234-310","","X",4700044234,310,"296099924R","CHARGEUR-BOITIER CONNEXION CALIBRE","2016-10-04","2016-10-05",1,0]
["4700044242-380","","X",4700044242,380,"749021679R","TAPIS HABITACLE AV","2016-10-05","2016-10-06",2,0]
["4700044260-80","","X",4700044260,80,8201571730,"COLLECTION CORDON DE","2016-10-07","2016-10-10",1,0]
["4700044260-390","","X",4700044260,390,8201489213,"COLLECTION CORDON DE","2016-10-07","2016-10-10",2,0]
["4700044272-170","","X",4700044272,170,7701394430,"ADHESIF EPOXY  RAP","2016-10-10","2016-10-11",5,0]
["4700044289-50","","X",4700044289,50,7711426403,"BOBINE ESSUY BLEU","2016-10-12","2016-10-13",2,0]
["4700044289-60","","X",4700044289,60,7711780436,"CH. RENAULT FLEX T40","2016-10-12","2016-10-13",1,0]
["4700044301-60","","X",4700044301,60,7711573597,"BOB CHAMOIS 1000F","2016-10-13","2016-10-14",2,0]
["4700044301-150","","X",4700044301,150,7711239373,"PEAU DE CHAMOIS N","2016-10-13","2016-10-14",1,0]
["4700044301-440","","X",4700044301,440,"288953663R","RACLETTE ESSUIE GLACE CONDUCTEUR","2016-10-13","2016-10-14",1,0]
["4700044301-450","","X",4700044301,450,"288B55332R","RACLETTE BALAI PASSAGER","2016-10-13","2016-10-14",1,0]
["4700044301-570","","X",4700044301,570,"964013442R","PARE-SOLEIL G","2016-10-13","2016-10-14",2,0]
["4700044310-80","","X",4700044310,80,7711573599,"BOB BLANC 1000F","2016-10-14","2016-10-17",6,0]
["4700044310-120","","X",4700044310,120,7700843546,"BUTEE CAPOT AV","2016-10-14","2016-10-17",1000,500]
["4700044310-200",{"$f":"IF(J159=K159,\"X\",\"\")","v":""},"X",4700044310,200,7711573596,"BOB CHAMOIS 450F","2016-10-14","2016-10-17",6,0]
["4700044310-220","","X",4700044310,220,7711576123,"PACK GO 500 + HOUSSE + CHARGEUR RAPIDE","2016-10-14","2016-10-17",1,0]
["4700044310-370","","X",4700044310,370,8201645511,"FAISCEAU ATTELAGE 13B RETRACTABLE","2016-10-14","2016-10-17",2,0]
["4700044318-180","","X",4700044318,180,7704002509,"SUPPORT ELASTIQUE","2016-10-17","2016-10-18",300,0]
["4700044318-200","",{"$f":"IF(ISERROR(VLOOKUP(A165,Base_suivi_MPR,1,FALSE)),\"\",\"X\")","v":"X"},4700044318,200,7711172286,"NENETOL                        SECT.729","2016-10-17","2016-10-18",12,0]
["4700044318-360","","X",4700044318,360,7711782082,"SUPPORT MASQUE COMPLET DOUBLE CARTOUCHE","2016-10-17","2016-10-18",4,0]
["4700044318-420","","X",4700044318,420,8201420512,"JANTE 8,5 J 20 5 47 KUBERA","2016-10-17","2016-10-18",4,0]
["4700044318-511","","X",4700044318,511,"484007956R","VOLANT DIRECTION","2016-10-17","2016-10-18",2,0]
["4700044325-50","","X",4700044325,50,7711426403,"BOBINE ESSUY BLEU","2016-10-18","2016-10-19",2,0]
["-","",""]
["-","",""]
["-","X",""]
["-","X",""]
["-","X",""]
["-","X",""]
[{"$f":"CONCATENATE(D174,\"-\",E174)","v":"-"},"X",""]
["-","X",""]
["-","X",""]
["-","X",""]
["-","X",""]
["-","X",""]
["-","X",""]
["-","X",""]
["-","X",""]
["-","X",""]
["-","X",""]
["-","X",""]
["-","X",""]
["-","X",""]
["-","X",""]
["-","X",""]
["-","X",""]
["-","X",""]
["-","X",""]
["-","X",""]
["-","X",""]
["-","X",""]
["-","X",""]
["-","X",""]
["-","X",""]
["-","X",""]
["-","X",""]
["-","X",""]
["-","X",""]
["-","X",""]
["-","X",""]
["-","X",""]
["-","X",""]
["-","X",""]
["-","X",""]
["-","X",""]
["-","X",""]
["-","X",""]
["-","X",""]
["-","X",""]
["-","X",""]
["-","X",""]
["-","X",""]
["-","X",""]
["-","X",{"$f":"IF(ISERROR(VLOOKUP(A220,Base_suivi_MPR,1,FALSE)),\"\",\"X\")","v":""}]
["-","X",""]
["-","X",""]
["-","X",""]
["-","X",""]
["-",{"$f":"IF(J223=K223,\"X\",\"\")","v":"X"},""]
["-","X",""]
["-","X",""]
["-","X",""]
["-","X",""]
["-","X",""]
["-","X",""]
["-","X",""]
["-","X",""]
["-","X",""]
["-","X",""]
["-","X",""]
["-","X",""]
["-","X",""]
["-","X",""]
[{"$f":"CONCATENATE(D238,\"-\",E238)","v":"-"},"X",""]
["-","X",""]
["-","X",""]
["-","X",""]
["-","X",""]
["-","X",""]
["-","X",""]
["-","X",""]
["-","X",""]
["-","X",""]
["-","X",""]
["-","X",""]
["-","X",""]
["-","X",""]
["-","X",""]
["-","X",""]
["-","X",""]
["-","X",""]
["-","X",""]
["-","X",""]
["-","X",""]
["-","X",""]
["-","X",""]
["-","X",""]
["-","X",""]
["-","X",""]
["-","X",""]
["-","X",""]
["-","X",""]
["-","X",""]
["-","X",""]
["-","X",""]
["-","X",""]
["-","X",""]
["-","X",""]
["-","X",""]
["-","X",""]
["-","X",""]
["-","X",""]
["-","X",""]
["-","X",""]
["-","X",""]
["-","X",""]
["-","X",""]
["-","X",{"$f":"IF(ISERROR(VLOOKUP(A284,Base_suivi_MPR,1,FALSE)),\"\",\"X\")","v":""}]
["-","X",""]
["-","X",""]
["-","X",""]
["-","X",""]
["-",{"$f":"IF(J287=K287,\"X\",\"\")","v":"X"},""]
["-","X",""]
["-","X",""]
["-","X",""]
["-","X",""]
["-","X",""]
["-","X",""]
["-","X",""]
["-","X",""]
["-","X",""]
["-","X",""]
["-","X",""]
["-","X",""]
["-","X",""]
["-","X",""]
[{"$f":"CONCATENATE(D302,\"-\",E302)","v":"-"},"X",""]
["-","X",""]
["-","X",""]
["-","X",""]
["-","X",""]
["-","X",""]
["-","X",""]
["-","X",""]
["-","X",""]
["-","X",""]
["-","X",""]
["-","X",""]
["-","X",""]
["-","X",""]
["-","X",""]
["-","X",""]
["-","X",""]
["-","X",""]
["-","X",""]
["-","X",""]
["-","X",""]
["-","X",""]
["-","X",""]
["-","X",""]
["-","X",""]
["-","X",""]
["-","X",""]
["-","X",""]
["-","X",""]
["-","X",""]
["-","X",""]
["-","X",""]
["-","X",""]
["-","X",""]
["-","X",""]
["-","X",""]
["-","X",""]
["-","X",""]
["-","X",""]
["-","X",""]
["-","X",""]
["-","X",""]
["-","X",""]
["-","X",""]
["-","X",{"$f":"IF(ISERROR(VLOOKUP(A348,Base_suivi_MPR,1,FALSE)),\"\",\"X\")","v":""}]
["-","X",""]
["-","X",""]
["-","X",""]
["-","X",""]
["-",{"$f":"IF(J351=K351,\"X\",\"\")","v":"X"},""]
["-","X",""]
["-","X",""]
["-","X",""]
["-","X",""]
["-","X",""]
["-","X",""]
["-","X",""]
["-","X",""]
["-","X",""]
["-","X",""]
["-","X",""]
["-","X",""]
["-","X",""]
["-","X",""]
[{"$f":"CONCATENATE(D366,\"-\",E366)","v":"-"},"X",""]
["-","X",""]
["-","X",""]
["-","X",""]
["-","X",""]
["-","X",""]
["-","X",""]
["-","X",""]
["-","X",""]
["-","X",""]
["-","X",""]
["-","X",""]
["-","X",""]
["-","X",""]
["-","X",""]
["-","X",""]
["-","X",""]
["-","X",""]
["-","X",""]
["-","X",""]
["-","X",""]
["-","X",""]
["-","X",""]
["-","X",""]
["-","X",""]
["-","X",""]
["-","X",""]
["-","X",""]
["-","X",""]
["-","X",""]
["-","X",""]
["-","X",""]
["-","X",""]
["-","X",""]
["-","X",""]
["-","X",""]
["-","X",""]
["-","X",""]
["-","X",""]
["-","X",""]
["-","X",""]
["-","X",""]
["-","X",""]
["-","X",""]
["-","X",{"$f":"IF(ISERROR(VLOOKUP(A412,Base_suivi_MPR,1,FALSE)),\"\",\"X\")","v":""}]
["-","X",""]
["-","X",""]
["-","X",""]
["-","X",""]
["-",{"$f":"IF(J415=K415,\"X\",\"\")","v":"X"},""]
["-","X",""]
["-","X",""]
["-","X",""]
["-","X",""]
["-","X",""]
["-","X",""]
["-","X",""]
["-","X",""]
["-","X",""]
["-","X",""]
["-","X",""]
["-","X",""]
["-","X",""]
["-","X",""]
[{"$f":"CONCATENATE(D430,\"-\",E430)","v":"-"},"X",""]
["-","X",""]
["-","X",""]
["-","X",""]
["-","X",""]
["-","X",""]
["-","X",""]
["-","X",""]
["-","X",""]
["-","X",""]
["-","X",""]
["-","X",""]
["-","X",""]
["-","X",""]
["-","X",""]
["-","X",""]
["-","X",""]
["-","X",""]
["-","X",""]
["-","X",""]
["-","X",""]
["-","X",""]
["-","X",""]
["-","X",""]
["-","X",""]
["-","X",""]
["-","X",""]
["-","X",""]
["-","X",""]
["-","X",""]
["-","X",""]
["-","X",""]
["-","X",""]
["-","X",""]
["-","X",""]
["-","X",""]
["-","X",""]
["-","X",""]
["-","X",""]
["-","X",""]
["-","X",""]
["-","X",""]
["-","X",""]
["-","X",""]
["-","X",{"$f":"IF(ISERROR(VLOOKUP(A476,Base_suivi_MPR,1,FALSE)),\"\",\"X\")","v":""}]
["-","X",""]
["-","X",""]
["-","X",""]
["-","X",""]
["-",{"$f":"IF(J479=K479,\"X\",\"\")","v":"X"},""]
["-","X",""]
["-","X",""]
["-","X",""]
["-","X",""]
["-","X",""]
["-","X",""]
["-","X",""]
["-","X",""]
["-","X",""]
["-","X",""]
["-","X",""]
["-","X",""]
["-","X",""]
["-","X",""]
[{"$f":"CONCATENATE(D494,\"-\",E494)","v":"-"},"X",""]
["-","X",""]
["-","X",""]
["-","X",""]
["-","X",""]
["-","X",""]
["-","X",""]
["-","X",""]
["-","X",""]
["-","X",""]
["-","X",""]
["-","X",""]
["-","X",""]
["-","X",""]
["-","X",""]
["-","X",""]
["-","X",""]
["-","X",""]
["-","X",""]
["-","X",""]
["-","X",""]
["-","X",""]
["-","X",""]
["-","X",""]
["-","X",""]
["-","X",""]
["-","X",""]
["-","X",""]
["-","X",""]
["-","X",""]
["-","X",""]
["-","X",""]
["-","X",""]
["-","X",""]
["-","X",""]
["-","X",""]
["-","X",""]
["-","X",""]
["-","X",""]
["-","X",""]
["-","X",""]
["-","X",""]
["-","X",""]
["-","X",""]
["-","X",{"$f":"IF(ISERROR(VLOOKUP(A540,Base_suivi_MPR,1,FALSE)),\"\",\"X\")","v":""}]
["-","X",""]
["-","X",""]
["-","X",""]
["-","X",""]
["-",{"$f":"IF(J543=K543,\"X\",\"\")","v":"X"},""]
["-","X",""]
["-","X",""]
["-","X",""]
["-","X",""]
["-","X",""]
["-","X",""]
["-","X",""]
["-","X",""]
["-","X",""]
["-","X",""]
["-","X",""]
["-","X",""]
["-","X",""]
["-","X",""]
[{"$f":"CONCATENATE(D558,\"-\",E558)","v":"-"},"X",""]
["-","X",""]
["-","X",""]
["-","X",""]
["-","X",""]
["-","X",""]
["-","X",""]
["-","X",""]
["-","X",""]
["-","X",""]
["-","X",""]
["-","X",""]
["-","X",""]
["-","X",""]
["-","X",""]
["-","X",""]
["-","X",""]
["-","X",""]
["-","X",""]
["-","X",""]
["-","X",""]
["-","X",""]
["-","X",""]
["-","X",""]
["-","X",""]
["-","X",""]
["-","X",""]
["-","X",""]
["-","X",""]
["-","X",""]
["-","X",""]
["-","X",""]
["-","X",""]
["-","X",""]
["-","X",""]
["-","X",""]
["-","X",""]
["-","X",""]
["-","X",""]
["-","X",""]
["-","X",""]
["-","X",""]
["-","X",""]
["-","X",""]
["-","X",{"$f":"IF(ISERROR(VLOOKUP(A604,Base_suivi_MPR,1,FALSE)),\"\",\"X\")","v":""}]
["-","X",""]
["-","X",""]
["-","X",""]
["-","X",""]
["-",{"$f":"IF(J607=K607,\"X\",\"\")","v":"X"},""]
["-","X",""]
["-","X",""]
["-","X",""]
["-","X",""]
["-","X",""]
["-","X",""]
["-","X",""]
["-","X",""]
["-","X",""]
["-","X",""]
["-","X",""]
["-","X",""]
["-","X",""]
["-","X",""]
[{"$f":"CONCATENATE(D622,\"-\",E622)","v":"-"},"X",""]
["-","X",""]
["-","X",""]
["-","X",""]
["-","X",""]
["-","X",""]
["-","X",""]
["-","X",""]
["-","X",""]
["-","X",""]
["-","X",""]
["-","X",""]
["-","X",""]
["-","X",""]
["-","X",""]
["-","X",""]
["-","X",""]
["-","X",""]
["-","X",""]
["-","X",""]
["-","X",""]
["-","X",""]
["-","X",""]
["-","X",""]
["-","X",""]
["-","X",""]
["-","X",""]
["-","X",""]
["-","X",""]
["-","X",""]
["-","X",""]
["-","X",""]
["-","X",""]
["-","X",""]
["-","X",""]
["-","X",""]
["-","X",""]
["-","X",""]
["-","X",""]
["-","X",""]
["-","X",""]
["-","X",""]
["-","X",""]
["-","X",""]
["-","X",{"$f":"IF(ISERROR(VLOOKUP(A668,Base_suivi_MPR,1,FALSE)),\"\",\"X\")","v":""}]
["-","X",""]
["-","X",""]
["-","X",""]
["-","X",""]
["-",{"$f":"IF(J671=K671,\"X\",\"\")","v":"X"},""]
["-","X",""]
["-","X",""]
["-","X",""]
["-","X",""]
["-","X",""]
["-","X",""]
["-","X",""]
["-","X",""]
["-","X",""]
["-","X",""]
["-","X",""]
["-","X",""]
["-","X",""]
["-","X",""]
[{"$f":"CONCATENATE(D686,\"-\",E686)","v":"-"},"X",""]
["-","X",""]
["-","X",""]
["-","X",""]
["-","X",""]
["-","X",""]
["-","X",""]
["-","X",""]
["-","X",""]
["-","X",""]
["-","X",""]
["-","X",""]
["-","X",""]
["-","X",""]
["-","X",""]
["-","X",""]
["-","X",""]
["-","X",""]
["-","X",""]
["-","X",""]
["-","X",""]
["-","X",""]
["-","X",""]
["-","X",""]
["-","X",""]
["-","X",""]
["-","X",""]
["-","X",""]
["-","X",""]
["-","X",""]
["-","X",""]
["-","X",""]
["-","X",""]
["-","X",""]
["-","X",""]
["-","X",""]
["-","X",""]
["-","X",""]
["-","X",""]
["-","X",""]
["-","X",""]
["-","X",""]
["-","X",""]
["-","X",""]
["-","X",{"$f":"IF(ISERROR(VLOOKUP(A732,Base_suivi_MPR,1,FALSE)),\"\",\"X\")","v":""}]
["-","X",""]
["-","X",""]
["-","X",""]
["-","X",""]
["-",{"$f":"IF(J735=K735,\"X\",\"\")","v":"X"},""]
["-","X",""]
["-","X",""]
["-","X",""]
["-","X",""]
["-","X",""]
["-","X",""]
["-","X",""]
["-","X",""]
["-","X",""]
["-","X",""]
["-","X",""]
["-","X",""]
["-","X",""]
["-","X",""]
[{"$f":"CONCATENATE(D750,\"-\",E750)","v":"-"},"X",""]
["-","X",""]
["-","X",""]
["-","X",""]
["-","X",""]
["-","X",""]
["-","X",""]
["-","X",""]
["-","X",""]
["-","X",""]
["-","X",""]
["-","X",""]
["-","X",""]
["-","X",""]
["-","X",""]
["-","X",""]
["-","X",""]
["-","X",""]
["-","X",""]
["-","X",""]
["-","X",""]
["-","X",""]
["-","X",""]
["-","X",""]
["-","X",""]
["-","X",""]
["-","X",""]
["-","X",""]
["-","X",""]
["-","X",""]
["-","X",""]
["-","X",""]
["-","X",""]
["-","X",""]
["-","X",""]
["-","X",""]
["-","X",""]
["-","X",""]
["-","X",""]
["-","X",""]
["-","X",""]
["-","X",""]
["-","X",""]
["-","X",""]
["-","X",{"$f":"IF(ISERROR(VLOOKUP(A796,Base_suivi_MPR,1,FALSE)),\"\",\"X\")","v":""}]
["-","X",""]
["-","X",""]
["-","X",""]
["-","X",""]
["-",{"$f":"IF(J799=K799,\"X\",\"\")","v":"X"},""]
["-","X",""]
["-","X",""]
["-","X",""]
["-","X",""]
["-","X",""]
["-","X",""]
["-","X",""]
["-","X",""]
["-","X",""]
["-","X",""]
["-","X",""]
["-","X",""]
["-","X",""]
["-","X",""]
[{"$f":"CONCATENATE(D814,\"-\",E814)","v":"-"},"X",""]
["-","X",""]
["-","X",""]
["-","X",""]
["-","X",""]
["-","X",""]
["-","X",""]
["-","X",""]
["-","X",""]
["-","X",""]
["-","X",""]
["-","X",""]
["-","X",""]
["-","X",""]
["-","X",""]
["-","X",""]
["-","X",""]
["-","X",""]
["-","X",""]
["-","X",""]
["-","X",""]
["-","X",""]
["-","X",""]
["-","X",""]
["-","X",""]
["-","X",""]
["-","X",""]
["-","X",""]
["-","X",""]
["-","X",""]
["-","X",""]
["-","X",""]
["-","X",""]
["-","X",""]
["-","X",""]
["-","X",""]
["-","X",""]
["-","X",""]
["-","X",""]
["-","X",""]
["-","X",""]
["-","X",""]
["-","X",""]
["-","X",""]
["-","X",{"$f":"IF(ISERROR(VLOOKUP(A860,Base_suivi_MPR,1,FALSE)),\"\",\"X\")","v":""}]
["-","X",""]
["-","X",""]
["-","X",""]
["-","X",""]
["-",{"$f":"IF(J863=K863,\"X\",\"\")","v":"X"},""]
["-","X",""]
["-","X",""]
["-","X",""]
["-","X",""]
["-","X",""]
["-","X",""]
["-","X",""]
["-","X",""]
["-","X",""]
["-","X",""]
["-","X",""]
["-","X",""]
["-","X",""]
["-","X",""]
[{"$f":"CONCATENATE(D878,\"-\",E878)","v":"-"},"X",""]
["-","X",""]
["-","X",""]
["-","X",""]
["-","X",""]
["-","X",""]
["-","X",""]
["-","X",""]
["-","X",""]
["-","X",""]
["-","X",""]
["-","X",""]
["-","X",""]
["-","X",""]
["-","X",""]
["-","X",""]
["-","X",""]
["-","X",""]
["-","X",""]
["-","X",""]
["-","X",""]
["-","X",""]
["-","X",""]
["-","X",""]
["-","X",""]
["-","X",""]
["-","X",""]
["-","X",""]
["-","X",""]
["-","X",""]
["-","X",""]
["-","X",""]
["-","X",""]
["-","X",""]
["-","X",""]
["-","X",""]
["-","X",""]
["-","X",""]
["-","X",""]
["-","X",""]
["-","X",""]
["-","X",""]
["-","X",""]
["-","X",""]
["-","X",{"$f":"IF(ISERROR(VLOOKUP(A924,Base_suivi_MPR,1,FALSE)),\"\",\"X\")","v":""}]
["-","X",""]
["-","X",""]
["-","X",""]
["-","X",""]
["-",{"$f":"IF(J927=K927,\"X\",\"\")","v":"X"},""]
["-","X",""]
["-","X",""]
["-","X",""]
["-","X",""]
["-","X",""]
["-","X",""]
["-","X",""]
["-","X",""]
["-","X",""]
["-","X",""]
["-","X",""]
["-","X",""]
["-","X",""]
["-","X",""]
[{"$f":"CONCATENATE(D942,\"-\",E942)","v":"-"},"X",""]
["-","X",""]
["-","X",""]
["-","X",""]
["-","X",""]
["-","X",""]
["-","X",""]
["-","X",""]
["-","X",""]
["-","X",""]
["-","X",""]
["-","X",""]
["-","X",""]
["-","X",""]
["-","X",""]
["-","X",""]
["-","X",""]
["-","X",""]
["-","X",""]
["-","X",""]
["-","X",""]
["-","X",""]
["-","X",""]
["-","X",""]
["-","X",""]
["-","X",""]
["-","X",""]
["-","X",""]
["-","X",""]
["-","X",""]
["-","X",""]
["-","X",""]
["-","X",""]
["-","X",""]
["-","X",""]
["-","X",""]
["-","X",""]
["-","X",""]
["-","X",""]
["-","X",""]
["-","X",""]
["-","X",""]
["-","X",""]
["-","X",""]
["-","X",{"$f":"IF(ISERROR(VLOOKUP(A988,Base_suivi_MPR,1,FALSE)),\"\",\"X\")","v":""}]
["-","X",""]
["-","X",""]
["-","X",""]
["-","X",""]
["-",{"$f":"IF(J991=K991,\"X\",\"\")","v":"X"},""]
["-","X",""]
["-","X",""]
["-","X",""]
["-","X",""]
["-","X",""]
["-","X",""]
["-","X",""]
["-","X",""]
["-","X",""]
["-","X",""]
["-","X",""]
["-","X",""]
["-","X",""]
["-","X",""]
[{"$f":"CONCATENATE(D1006,\"-\",E1006)","v":"-"},"X",""]
["-","X",""]
["-","X",""]
["-","X",""]
["-","X",""]
["-","X",""]
["-","X",""]
["-","X",""]
["-","X",""]
["-","X",""]
["-","X",""]
["-","X",""]
["-","X",""]
["-","X",""]
["-","X",""]
["-","X",""]
["-","X",""]
["-","X",""]
["-","X",""]
["-","X",""]
["-","X",""]
["-","X",""]
["-","X",""]
["-","X",""]
["-","X",""]
["-","X",""]
["-","X",""]
["-","X",""]
["-","X",""]
["-","X",""]
["-","X",""]
["-","X",""]
["-","X",""]
["-","X",""]
["-","X",""]
["-","X",""]
["-","X",""]
["-","X",""]
["-","X",""]
["-","X",""]
["-","X",""]
["-","X",""]
["-","X",""]
["-","X",""]
["-","X",{"$f":"IF(ISERROR(VLOOKUP(A1052,Base_suivi_MPR,1,FALSE)),\"\",\"X\")","v":""}]
["-","X",""]
["-","X",""]
["-","X",""]
["-","X",""]
["-",{"$f":"IF(J1055=K1055,\"X\",\"\")","v":"X"},""]
["-","X",""]
["-","X",""]
["-","X",""]
["-","X",""]
["-","X",""]
["-","X",""]
["-","X",""]
["-","X",""]
["-","X",""]
["-","X",""]
["-","X",""]
["-","X",""]
["-","X",""]
["-","X",""]
[{"$f":"CONCATENATE(D1070,\"-\",E1070)","v":"-"},"X",""]
["-","X",""]
["-","X",""]
["-","X",""]
["-","X",""]
["-","X",""]
["-","X",""]
["-","X",""]
["-","X",""]
["-","X",""]
["-","X",""]
["-","X",""]
["-","X",""]
["-","X",""]
["-","X",""]
["-","X",""]
["-","X",""]
["-","X",""]
["-","X",""]
["-","X",""]
["-","X",""]
["-","X",""]
["-","X",""]
["-","X",""]
["-","X",""]
["-","X",""]
["-","X",""]
["-","X",""]
["-","X",""]
["-","X",""]
["-","X",""]
["-","X",""]
["-","X",""]
["-","X",""]
["-","X",""]
["-","X",""]
["-","X",""]
["-","X",""]
["-","X",""]
["-","X",""]
["-","X",""]
["-","X",""]
["-","X",""]
["-","X",""]
["-","X",{"$f":"IF(ISERROR(VLOOKUP(A1116,Base_suivi_MPR,1,FALSE)),\"\",\"X\")","v":""}]
["-","X",""]
["-","X",""]
["-","X",""]
["-","X",""]
["-",{"$f":"IF(J1119=K1119,\"X\",\"\")","v":"X"},""]
["-","X",""]
["-","X",""]
["-","X",""]
["-","X",""]
["-","X",""]
["-","X",""]
["-","X",""]
["-","X",""]
["-","X",""]
["-","X",""]
["-","X",""]
["-","X",""]
["-","X",""]
["-","X",""]
[{"$f":"CONCATENATE(D1134,\"-\",E1134)","v":"-"},"X",""]
["-","X",""]
["-","X",""]
["-","X",""]
["-","X",""]
["-","X",""]
["-","X",""]
["-","X",""]
["-","X",""]
["-","X",""]
["-","X",""]
["-","X",""]
["-","X",""]
["-","X",""]
["-","X",""]
["-","X",""]
["-","X",""]
["-","X",""]
["-","X",""]
["-","X",""]
["-","X",""]
["-","X",""]
["-","X",""]
["-","X",""]
["-","X",""]
["-","X",""]
["-","X",""]
["-","X",""]
["-","X",""]
["-","X",""]
["-","X",""]
["-","X",""]
["-","X",""]
["-","X",""]
["-","X",""]
["-","X",""]
["-","X",""]
["-","X",""]
["-","X",""]
["-","X",""]
["-","X",""]
["-","X",""]
["-","X",""]
["-","X",""]
["-","X",{"$f":"IF(ISERROR(VLOOKUP(A1180,Base_suivi_MPR,1,FALSE)),\"\",\"X\")","v":""}]
["-","X",""]
["-","X",""]
["-","X",""]
["-","X",""]
["-",{"$f":"IF(J1183=K1183,\"X\",\"\")","v":"X"},""]
["-","X",""]
["-","X",""]
["-","X",""]
["-","X",""]
["-","X",""]
["-","X",""]
["-","X",""]
["-","X",""]
["-","X",""]
["-","X",""]
["-","X",""]
["-","X",""]
["-","X",""]
["-","X",""]
[{"$f":"CONCATENATE(D1198,\"-\",E1198)","v":"-"},"X",""]
["-","X",""]
["-","X",""]
["-","X",""]
["-","X",""]
["-","X",""]
["-","X",""]
["-","X",""]
["-","X",""]
["-","X",""]
["-","X",""]
["-","X",""]
["-","X",""]
["-","X",""]
["-","X",""]
["-","X",""]
["-","X",""]
["-","X",""]
["-","X",""]
["-","X",""]
["-","X",""]
["-","X",""]
["-","X",""]
["-","X",""]
["-","X",""]
["-","X",""]
["-","X",""]
["-","X",""]
["-","X",""]
["-","X",""]
["-","X",""]
["-","X",""]
["-","X",""]
["-","X",""]
["-","X",""]
["-","X",""]
["-","X",""]
["-","X",""]
["-","X",""]
["-","X",""]
["-","X",""]
["-","X",""]
["-","X",""]
["-","X",""]
["-","X",{"$f":"IF(ISERROR(VLOOKUP(A1244,Base_suivi_MPR,1,FALSE)),\"\",\"X\")","v":""}]
["-","X",""]
["-","X",""]
["-","X",""]
["-","X",""]
["-",{"$f":"IF(J1247=K1247,\"X\",\"\")","v":"X"},""]
["-","X",""]
["-","X",""]
["-","X",""]
["-","X",""]
["-","X",""]
["-","X",""]
["-","X",""]
["-","X",""]
["-","X",""]
["-","X",""]
["-","X",""]
["-","X",""]
["-","X",""]
["-","X",""]
[{"$f":"CONCATENATE(D1262,\"-\",E1262)","v":"-"},"X",""]
["-","X",""]
["-","X",""]
["-","X",""]
["-","X",""]
["-","X",""]
["-","X",""]
["-","X",""]
["-","X",""]
["-","X",""]
["-","X",""]
["-","X",""]
["-","X",""]
["-","X",""]
["-","X",""]
["-","X",""]
["-","X",""]
["-","X",""]
["-","X",""]
["-","X",""]
["-","X",""]
["-","X",""]
["-","X",""]
["-","X",""]
["-","X",""]
["-","X",""]
["-","X",""]
["-","X",""]
["-","X",""]
["-","X",""]
["-","X",""]
["-","X",""]
["-","X",""]
["-","X",""]
["-","X",""]
["-","X",""]
["-","X",""]
["-","X",""]
["-","X",""]
["-","X",""]
["-","X",""]
["-","X",""]
["-","X",""]
["-","X",""]
["-","X",{"$f":"IF(ISERROR(VLOOKUP(A1308,Base_suivi_MPR,1,FALSE)),\"\",\"X\")","v":""}]
["-","X",""]
["-","X",""]
["-","X",""]
["-","X",""]
["-",{"$f":"IF(J1311=K1311,\"X\",\"\")","v":"X"},""]
["-","X",""]
["-","X",""]
["-","X",""]
["-","X",""]
["-","X",""]
["-","X",""]
["-","X",""]
["-","X",""]
["-","X",""]
["-","X",""]
["-","X",""]
["-","X",""]
["-","X",""]
["-","X",""]
[{"$f":"CONCATENATE(D1326,\"-\",E1326)","v":"-"},"X",""]
["-","X",""]
["-","X",""]
["-","X",""]
["-","X",""]
["-","X",""]
["-","X",""]
["-","X",""]
["-","X",""]
["-","X",""]
["-","X",""]
["-","X",""]
["-","X",""]
["-","X",""]
["-","X",""]
["-","X",""]
["-","X",""]
["-","X",""]
["-","X",""]
["-","X",""]
["-","X",""]
["-","X",""]
["-","X",""]
["-","X",""]
["-","X",""]
["-","X",""]
["-","X",""]
["-","X",""]
["-","X",""]
["-","X",""]
["-","X",""]
["-","X",""]
["-","X",""]
["-","X",""]
["-","X",""]
["-","X",""]
["-","X",""]
["-","X",""]
["-","X",""]
["-","X",""]
["-","X",""]
["-","X",""]
["-","X",""]
["-","X",""]
["-","X",{"$f":"IF(ISERROR(VLOOKUP(A1372,Base_suivi_MPR,1,FALSE)),\"\",\"X\")","v":""}]
["-","X",""]
["-","X",""]
["-","X",""]
["-","X",""]
["-",{"$f":"IF(J1375=K1375,\"X\",\"\")","v":"X"},""]
["-","X",""]
["-","X",""]
["-","X",""]
["-","X",""]
["-","X",""]
["-","X",""]
["-","X",""]
["-","X",""]
["-","X",""]
["-","X",""]
["-","X",""]
["-","X",""]
["-","X",""]
["-","X",""]
[{"$f":"CONCATENATE(D1390,\"-\",E1390)","v":"-"},"X",""]
["-","X",""]
["-","X",""]
["-","X",""]
["-","X",""]
["-","X",""]
["-","X",""]
["-","X",""]
["-","X",""]
["-","X",""]
["-","X",""]
["-","X",""]
["-","X",""]
["-","X",""]
["-","X",""]
["-","X",""]
["-","X",""]
["-","X",""]
["-","X",""]
["-","X",""]
["-","X",""]
["-","X",""]
["-","X",""]
["-","X",""]
["-","X",""]
["-","X",""]
["-","X",""]
["-","X",""]
["-","X",""]
["-","X",""]
["-","X",""]
["-","X",""]
["-","X",""]
["-","X",""]
["-","X",""]
["-","X",""]
["-","X",""]
["-","X",""]
["-","X",""]
["-","X",""]
["-","X",""]
["-","X",""]
["-","X",""]
["-","X",""]
["-","X",{"$f":"IF(ISERROR(VLOOKUP(A1436,Base_suivi_MPR,1,FALSE)),\"\",\"X\")","v":""}]
["-","X",""]
["-","X",""]
["-","X",""]
["-","X",""]
["-",{"$f":"IF(J1439=K1439,\"X\",\"\")","v":"X"},""]
["-","X",""]
["-","X",""]
["-","X",""]
["-","X",""]
["-","X",""]
["-","X",""]
["-","X",""]
["-","X",""]
["-","X",""]
["-","X",""]
["-","X",""]
["-","X",""]
["-","X",""]
["-","X",""]
[{"$f":"CONCATENATE(D1454,\"-\",E1454)","v":"-"},"X",""]
["-","X",""]
["-","X",""]
["-","X",""]
["-","X",""]
["-","X",""]
["-","X",""]
["-","X",""]
["-","X",""]
["-","X",""]
["-","X",""]
["-","X",""]
["-","X",""]
["-","X",""]
["-","X",""]
["-","X",""]
["-","X",""]
["-","X",""]
["-","X",""]
["-","X",""]
["-","X",""]
["-","X",""]
["-","X",""]
["-","X",""]
["-","X",""]
["-","X",""]
["-","X",""]
["-","X",""]
["-","X",""]
["-","X",""]
["-","X",""]
["-","X",""]
["-","X",""]
["-","X",""]
["-","X",""]
["-","X",""]
["-","X",""]
["-","X",""]
["-","X",""]
["-","X",""]
["-","X",""]
["-","X",""]
["-","X",""]
["-","X",""]
["-","X",{"$f":"IF(ISERROR(VLOOKUP(A1500,Base_suivi_MPR,1,FALSE)),\"\",\"X\")","v":""}]
["-","X",""]
["-","X",""]
["-","X",""]
["-","X",""]
["-",{"$f":"IF(J1503=K1503,\"X\",\"\")","v":"X"},""]
["-","X",""]
["-","X",""]
["-","X",""]
["-","X",""]
["-","X",""]
["-","X",""]
["-","X",""]
["-","X",""]
["-","X",""]
["-","X",""]
["-","X",""]
["-","X",""]
["-","X",""]
["-","X",""]
[{"$f":"CONCATENATE(D1518,\"-\",E1518)","v":"-"},"X",""]
["-","X",""]
["-","X",""]
["-","X",""]
["-","X",""]
["-","X",""]
["-","X",""]
["-","X",""]
["-","X",""]
["-","X",""]
["-","X",""]
["-","X",""]
["-","X",""]
["-","X",""]
["-","X",""]
["-","X",""]
["-","X",""]
["-","X",""]
["-","X",""]
["-","X",""]
["-","X",""]
["-","X",""]
["-","X",""]
["-","X",""]
["-","X",""]
["-","X",""]
["-","X",""]
["-","X",""]
["-","X",""]
["-","X",""]
["-","X",""]
["-","X",""]
["-","X",""]
["-","X",""]
["-","X",""]
["-","X",""]
["-","X",""]
["-","X",""]
["-","X",""]
["-","X",""]
["-","X",""]
["-","X",""]
["-","X",""]
["-","X",""]
["-","X",{"$f":"IF(ISERROR(VLOOKUP(A1564,Base_suivi_MPR,1,FALSE)),\"\",\"X\")","v":""}]
["-","X",""]
["-","X",""]
["-","X",""]
["-","X",""]
["-",{"$f":"IF(J1567=K1567,\"X\",\"\")","v":"X"},""]
["-","X",""]
["-","X",""]
["-","X",""]
["-","X",""]
["-","X",""]
["-","X",""]
["-","X",""]
["-","X",""]
["-","X",""]
["-","X",""]
["-","X",""]
["-","X",""]
["-","X",""]
["-","X",""]
[{"$f":"CONCATENATE(D1582,\"-\",E1582)","v":"-"},"X",""]
["-","X",""]
["-","X",""]
["-","X",""]
["-","X",""]
["-","X",""]
["-","X",""]
["-","X",""]
["-","X",""]
["-","X",""]
["-","X",""]
["-","X",""]
["-","X",""]
["-","X",""]
["-","X",""]
["-","X",""]
["-","X",""]
["-","X",""]
["-","X",""]
["-","X",""]
["-","X",""]
["-","X",""]
["-","X",""]
["-","X",""]
["-","X",""]
["-","X",""]
["-","X",""]
["-","X",""]
["-","X",""]
["-","X",""]
["-","X",""]
["-","X",""]
["-","X",""]
["-","X",""]
["-","X",""]
["-","X",""]
["-","X",""]
["-","X",""]
["-","X",""]
["-","X",""]
["-","X",""]
["-","X",""]
["-","X",""]
["-","X",""]
["-","X",{"$f":"IF(ISERROR(VLOOKUP(A1628,Base_suivi_MPR,1,FALSE)),\"\",\"X\")","v":""}]
["-","X",""]
["-","X",""]
["-","X",""]
["-","X",""]
["-",{"$f":"IF(J1631=K1631,\"X\",\"\")","v":"X"},""]
["-","X",""]
["-","X",""]
["-","X",""]
["-","X",""]
["-","X",""]
["-","X",""]
["-","X",""]
["-","X",""]
["-","X",""]
["-","X",""]
["-","X",""]
["-","X",""]
["-","X",""]
["-","X",""]
[{"$f":"CONCATENATE(D1646,\"-\",E1646)","v":"-"},"X",""]
["-","X",""]
["-","X",""]
["-","X",""]
["-","X",""]
["-","X",""]
["-","X",""]
["-","X",""]
["-","X",""]
["-","X",""]
["-","X",""]
["-","X",""]
["-","X",""]
["-","X",""]
["-","X",""]
["-","X",""]
["-","X",""]
["-","X",""]
["-","X",""]
["-","X",""]
["-","X",""]
["-","X",""]
["-","X",""]
["-","X",""]
["-","X",""]
["-","X",""]
["-","X",""]
["-","X",""]
["-","X",""]
["-","X",""]
["-","X",""]
["-","X",""]
["-","X",""]
["-","X",""]
["-","X",""]
["-","X",""]
["-","X",""]
["-","X",""]
["-","X",""]
["-","X",""]
["-","X",""]
["-","X",""]
["-","X",""]
["-","X",""]
["-","X",{"$f":"IF(ISERROR(VLOOKUP(A1692,Base_suivi_MPR,1,FALSE)),\"\",\"X\")","v":""}]
["-","X",""]
["-","X",""]
["-","X",""]
["-","X",""]
["-",{"$f":"IF(J1695=K1695,\"X\",\"\")","v":"X"},""]
["-","X",""]
["-","X",""]
["-","X",""]
["-","X",""]
["-","X",""]
["-","X",""]
["-","X",""]
["-","X",""]
["-","X",""]
["-","X",""]
["-","X",""]
["-","X",""]
["-","X",""]
["-","X",""]
[{"$f":"CONCATENATE(D1710,\"-\",E1710)","v":"-"},"X",""]
["-","X",""]
["-","X",""]
["-","X",""]
["-","X",""]
["-","X",""]
["-","X",""]
["-","X",""]
["-","X",""]
["-","X",""]
["-","X",""]
["-","X",""]
["-","X",""]
["-","X",""]
["-","X",""]
["-","X",""]
["-","X",""]
["-","X",""]
["-","X",""]
["-","X",""]
["-","X",""]
["-","X",""]
["-","X",""]
["-","X",""]
["-","X",""]
["-","X",""]
["-","X",""]
["-","X",""]
["-","X",""]
["-","X",""]
["-","X",""]
["-","X",""]
["-","X",""]
["-","X",""]
["-","X",""]
["-","X",""]
["-","X",""]
["-","X",""]
["-","X",""]
["-","X",""]
["-","X",""]
["-","X",""]
["-","X",""]
["-","X",""]
["-","X",{"$f":"IF(ISERROR(VLOOKUP(A1756,Base_suivi_MPR,1,FALSE)),\"\",\"X\")","v":""}]
["-","X",""]
["-","X",""]
["-","X",""]
["-","X",""]
["-",{"$f":"IF(J1759=K1759,\"X\",\"\")","v":"X"},""]
["-","X",""]
["-","X",""]
["-","X",""]
["-","X",""]
["-","X",""]
["-","X",""]
["-","X",""]
["-","X",""]
["-","X",""]
["-","X",""]
["-","X",""]
["-","X",""]
["-","X",""]
["-","X",""]
[{"$f":"CONCATENATE(D1774,\"-\",E1774)","v":"-"},"X",""]
["-","X",""]
["-","X",""]
["-","X",""]
["-","X",""]
["-","X",""]
["-","X",""]
["-","X",""]
["-","X",""]
["-","X",""]
["-","X",""]
["-","X",""]
["-","X",""]
["-","X",""]
["-","X",""]
["-","X",""]
["-","X",""]
["-","X",""]
["-","X",""]
["-","X",""]
["-","X",""]
["-","X",""]
["-","X",""]
["-","X",""]
["-","X",""]
["-","X",""]
["-","X",""]
["-","X",""]
["-","X",""]
["-","X",""]
["-","X",""]
["-","X",""]
["-","X",""]
["-","X",""]
["-","X",""]
["-","X",""]
["-","X",""]
["-","X",""]
["-","X",""]
["-","X",""]
["-","X",""]
["-","X",""]
["-","X",""]
["-","X",""]
["-","X",{"$f":"IF(ISERROR(VLOOKUP(A1820,Base_suivi_MPR,1,FALSE)),\"\",\"X\")","v":""}]
["-","X",""]
["-","X",""]
["-","X",""]
["-","X",""]
["-",{"$f":"IF(J1823=K1823,\"X\",\"\")","v":"X"},""]
["-","X",""]
["-","X",""]
["-","X",""]
["-","X",""]
["-","X",""]
["-","X",""]
["-","X",""]
["-","X",""]
["-","X",""]
["-","X",""]
["-","X",""]
["-","X",""]
["-","X",""]
["-","X",""]
[{"$f":"CONCATENATE(D1838,\"-\",E1838)","v":"-"},"X",""]
["-","X",""]
["-","X",""]
["-","X",""]
["-","X",""]
["-","X",""]
["-","X",""]
["-","X",""]
["-","X",""]
["-","X",""]
["-","X",""]
["-","X",""]
["-","X",""]
["-","X",""]
["-","X",""]
["-","X",""]
["-","X",""]
["-","X",""]
["-","X",""]
["-","X",""]
["-","X",""]
["-","X",""]
["-","X",""]
["-","X",""]
["-","X",""]
["-","X",""]
["-","X",""]
["-","X",""]
["-","X",""]
["-","X",""]
["-","X",""]
["-","X",""]
["-","X",""]
["-","X",""]
["-","X",""]
["-","X",""]
["-","X",""]
["-","X",""]
["-","X",""]
["-","X",""]
["-","X",""]
["-","X",""]
["-","X",""]
["-","X",""]
["-","X",{"$f":"IF(ISERROR(VLOOKUP(A1884,Base_suivi_MPR,1,FALSE)),\"\",\"X\")","v":""}]
["-","X",""]
["-","X",""]
["-","X",""]
["-","X",""]
["-",{"$f":"IF(J1887=K1887,\"X\",\"\")","v":"X"},""]
["-","X",""]
["-","X",""]
["-","X",""]
["-","X",""]
["-","X",""]
["-","X",""]
["-","X",""]
["-","X",""]
["-","X",""]
["-","X",""]
["-","X",""]
["-","X",""]
["-","X",""]
["-","X",""]
[{"$f":"CONCATENATE(D1902,\"-\",E1902)","v":"-"},"X",""]
["-","X",""]
["-","X",""]
["-","X",""]
["-","X",""]
["-","X",""]
["-","X",""]
["-","X",""]
["-","X",""]
["-","X",""]
["-","X",""]
["-","X",""]
["-","X",""]
["-","X",""]
["-","X",""]
["-","X",""]
["-","X",""]
["-","X",""]
["-","X",""]
["-","X",""]
["-","X",""]
["-","X",""]
["-","X",""]
["-","X",""]
["-","X",""]
["-","X",""]
["-","X",""]
["-","X",""]
["-","X",""]
["-","X",""]
["-","X",""]
["-","X",""]
["-","X",""]
["-","X",""]
["-","X",""]
["-","X",""]
["-","X",""]
["-","X",""]
["-","X",""]
["-","X",""]
["-","X",""]
["-","X",""]
["-","X",""]
["-","X",""]
["-","X",{"$f":"IF(ISERROR(VLOOKUP(A1948,Base_suivi_MPR,1,FALSE)),\"\",\"X\")","v":""}]
["-","X",""]
["-","X",""]
["-","X",""]
["-","X",""]
["-",{"$f":"IF(J1951=K1951,\"X\",\"\")","v":"X"},""]
["-","X",""]
["-","X",""]
["-","X",""]
["-","X",""]
["-","X",""]
["-","X",""]
["-","X",""]
["-","X",""]
["-","X",""]
["-","X",""]
["-","X",""]
["-","X",""]
["-","X",""]
["-","X",""]
[{"$f":"CONCATENATE(D1966,\"-\",E1966)","v":"-"},"X",""]
["-","X",""]
["-","X",""]
["-","X",""]
["-","X",""]
["-","X",""]
["-","X",""]
["-","X",""]
["-","X",""]
["-","X",""]
["-","X",""]
["-","X",""]
["-","X",""]
["-","X",""]
["-","X",""]
["-","X",""]
["-","X",""]
["-","X",""]
["-","X",""]
["-","X",""]
["-","X",""]
["-","X",""]
["-","X",""]
["-","X",""]
["-","X",""]
["-","X",""]
["-","X",""]
["-","X",""]
["-","X",""]
["-","X",""]
["-","X",""]
["-","X",""]
["-","X",""]
["-","X",""]
["-","X",""]
["-","X",""]
["-","X",""]
["-","X",""]
["-","X",""]
["-","X",""]
["-","X",""]
["-","X",""]
["-","X",""]
["-","X",""]
["-","X",{"$f":"IF(ISERROR(VLOOKUP(A2012,Base_suivi_MPR,1,FALSE)),\"\",\"X\")","v":""}]
["-","X",""]
["-","X",""]
["-","X",""]
["-","X",""]
["-",{"$f":"IF(J2015=K2015,\"X\",\"\")","v":"X"},""]
["-","X",""]
["-","X",""]
["-","X",""]
["-","X",""]
["-","X",""]
["-","X",""]
["-","X",""]
["-","X",""]
["-","X",""]
["-","X",""]
["-","X",""]
["-","X",""]
["-","X",""]
["-","X",""]
[{"$f":"CONCATENATE(D2030,\"-\",E2030)","v":"-"},"X",""]
["-","X",""]
["-","X",""]
["-","X",""]
["-","X",""]
["-","X",""]
["-","X",""]
["-","X",""]
["-","X",""]
["-","X",""]
["-","X",""]
["-","X",""]
["-","X",""]
["-","X",""]
["-","X",""]
["-","X",""]
["-","X",""]
["-","X",""]
["-","X",""]
["-","X",""]
["-","X",""]
["-","X",""]
["-","X",""]
["-","X",""]
["-","X",""]
["-","X",""]
["-","X",""]
["-","X",""]
["-","X",""]
["-","X",""]
["-","X",""]
["-","X",""]
["-","X",""]
["-","X",""]
["-","X",""]
["-","X",""]
["-","X",""]
["-","X",""]
["-","X",""]
["-","X",""]
["-","X",""]
["-","X",""]
["-","X",""]
["-","X",""]
["-","X",{"$f":"IF(ISERROR(VLOOKUP(A2076,Base_suivi_MPR,1,FALSE)),\"\",\"X\")","v":""}]
["-","X",""]
["-","X",""]
["-","X",""]
["-","X",""]
["-",{"$f":"IF(J2079=K2079,\"X\",\"\")","v":"X"},""]
["-","X",""]
["-","X",""]
["-","X",""]
["-","X",""]
["-","X",""]
["-","X",""]
["-","X",""]
["-","X",""]
["-","X",""]
["-","X",""]
["-","X",""]
["-","X",""]
["-","X",""]
["-","X",""]
[{"$f":"CONCATENATE(D2094,\"-\",E2094)","v":"-"},"X",""]
["-","X",""]
["-","X",""]
["-","X",""]
["-","X",""]
["-","X",""]
["-","X",""]
["-","X",""]
["-","X",""]
["-","X",""]
["-","X",""]
["-","X",""]
["-","X",""]
["-","X",""]
["-","X",""]
["-","X",""]
["-","X",""]
["-","X",""]
["-","X",""]
["-","X",""]
["-","X",""]
["-","X",""]
["-","X",""]
["-","X",""]
["-","X",""]
["-","X",""]
["-","X",""]
["-","X",""]
["-","X",""]
["-","X",""]
["-","X",""]
["-","X",""]
["-","X",""]
["-","X",""]
["-","X",""]
["-","X",""]
["-","X",""]
["-","X",""]
["-","X",""]
["-","X",""]
["-","X",""]
["-","X",""]
["-","X",""]
["-","X",""]
["-","X",{"$f":"IF(ISERROR(VLOOKUP(A2140,Base_suivi_MPR,1,FALSE)),\"\",\"X\")","v":""}]
["-","X",""]
["-","X",""]
["-","X",""]
["-","X",""]
["-",{"$f":"IF(J2143=K2143,\"X\",\"\")","v":"X"},""]
["-","X",""]
["-","X",""]
["-","X",""]
["-","X",""]
["-","X",""]
["-","X",""]
["-","X",""]
["-","X",""]
["-","X",""]
["-","X",""]
["-","X",""]
["-","X",""]
["-","X",""]
["-","X",""]
[{"$f":"CONCATENATE(D2158,\"-\",E2158)","v":"-"},"X",""]
["-","X",""]
["-","X",""]
["-","X",""]
["-","X",""]
["-","X",""]
["-","X",""]
["-","X",""]
["-","X",""]
["-","X",""]
["-","X",""]
["-","X",""]
["-","X",""]
["-","X",""]
["-","X",""]
["-","X",""]
["-","X",""]
["-","X",""]
["-","X",""]
["-","X",""]
["-","X",""]
["-","X",""]
["-","X",""]
["-","X",""]
["-","X",""]
["-","X",""]
["-","X",""]
["-","X",""]
["-","X",""]
["-","X",""]
["-","X",""]
["-","X",""]
["-","X",""]
["-","X",""]
["-","X",""]
["-","X",""]
["-","X",""]
["-","X",""]
["-","X",""]
["-","X",""]
["-","X",""]
["-","X",""]
["-","X",""]
["-","X",""]
["-","X",{"$f":"IF(ISERROR(VLOOKUP(A2204,Base_suivi_MPR,1,FALSE)),\"\",\"X\")","v":""}]
["-","X",""]
["-","X",""]
["-","X",""]
["-","X",""]
["-",{"$f":"IF(J2207=K2207,\"X\",\"\")","v":"X"},""]
["-","X",""]
["-","X",""]
["-","X",""]
["-","X",""]
["-","X",""]
["-","X",""]
["-","X",""]
["-","X",""]
["-","X",""]
["-","X",""]
["-","X",""]
["-","X",""]
["-","X",""]
["-","X",""]
[{"$f":"CONCATENATE(D2222,\"-\",E2222)","v":"-"},"X",""]
["-","X",""]
["-","X",""]
["-","X",""]
["-","X",""]
["-","X",""]
["-","X",""]
["-","X",""]
["-","X",""]
["-","X",""]
["-","X",""]
["-","X",""]
["-","X",""]
["-","X",""]
["-","X",""]
["-","X",""]
["-","X",""]
["-","X",""]
["-","X",""]
["-","X",""]
["-","X",""]
["-","X",""]
["-","X",""]
["-","X",""]
["-","X",""]
["-","X",""]
["-","X",""]
["-","X",""]
["-","X",""]
["-","X",""]
["-","X",""]
["-","X",""]
["-","X",""]
["-","X",""]
["-","X",""]
["-","X",""]
["-","X",""]
["-","X",""]
["-","X",""]
["-","X",""]
["-","X",""]
["-","X",""]
["-","X",""]
["-","X",""]
["-","X",{"$f":"IF(ISERROR(VLOOKUP(A2268,Base_suivi_MPR,1,FALSE)),\"\",\"X\")","v":""}]
["-","X",""]
["-","X",""]
["-","X",""]
["-","X",""]
["-",{"$f":"IF(J2271=K2271,\"X\",\"\")","v":"X"},""]
["-","X",""]
["-","X",""]
["-","X",""]
["-","X",""]
["-","X",""]
["-","X",""]
["-","X",""]
["-","X",""]
["-","X",""]
["-","X",""]
["-","X",""]
["-","X",""]
["-","X",""]
["-","X",""]
[{"$f":"CONCATENATE(D2286,\"-\",E2286)","v":"-"},"X",""]
["-","X",""]
["-","X",""]
["-","X",""]
["-","X",""]
["-","X",""]
["-","X",""]
["-","X",""]
["-","X",""]
["-","X",""]
["-","X",""]
["-","X",""]
["-","X",""]
["-","X",""]
["-","X",""]
["-","X",""]
["-","X",""]
["-","X",""]
["-","X",""]
["-","X",""]
["-","X",""]
["-","X",""]
["-","X",""]
["-","X",""]
["-","X",""]
["-","X",""]
["-","X",""]
["-","X",""]
["-","X",""]
["-","X",""]
["-","X",""]
["-","X",""]
["-","X",""]
["-","X",""]
["-","X",""]
["-","X",""]
["-","X",""]
["-","X",""]
["-","X",""]
["-","X",""]
["-","X",""]
["-","X",""]
["-","X",""]
["-","X",""]
["-","X",{"$f":"IF(ISERROR(VLOOKUP(A2332,Base_suivi_MPR,1,FALSE)),\"\",\"X\")","v":""}]
["-","X",""]
["-","X",""]
["-","X",""]
["-","X",""]
["-",{"$f":"IF(J2335=K2335,\"X\",\"\")","v":"X"},""]
["-","X",""]
["-","X",""]
["-","X",""]
["-","X",""]
["-","X",""]
["-","X",""]
["-","X",""]
["-","X",""]
["-","X",""]
["-","X",""]
["-","X",""]
["-","X",""]
["-","X",""]
["-","X",""]
[{"$f":"CONCATENATE(D2350,\"-\",E2350)","v":"-"},"X",""]
["-","X",""]
["-","X",""]
["-","X",""]
["-","X",""]
["-","X",""]
["-","X",""]
["-","X",""]
["-","X",""]
["-","X",""]
["-","X",""]
["-","X",""]
["-","X",""]
["-","X",""]
["-","X",""]
["-","X",""]
["-","X",""]
["-","X",""]
["-","X",""]
["-","X",""]
["-","X",""]
["-","X",""]
["-","X",""]
["-","X",""]
["-","X",""]
["-","X",""]
["-","X",""]
["-","X",""]
["-","X",""]
["-","X",""]
["-","X",""]
["-","X",""]
["-","X",""]
["-","X",""]
["-","X",""]
["-","X",""]
["-","X",""]
["-","X",""]
["-","X",""]
["-","X",""]
["-","X",""]
["-","X",""]
["-","X",""]
["-","X",""]
["-","X",{"$f":"IF(ISERROR(VLOOKUP(A2396,Base_suivi_MPR,1,FALSE)),\"\",\"X\")","v":""}]
["-","X",""]
["-","X",""]
["-","X",""]
["-","X",""]
["-",{"$f":"IF(J2399=K2399,\"X\",\"\")","v":"X"},""]
["-","X",""]
["-","X",""]
["-","X",""]
["-","X",""]
["-","X",""]
["-","X",""]
["-","X",""]
["-","X",""]
["-","X",""]
["-","X",""]
["-","X",""]
["-","X",""]
["-","X",""]
["-","X",""]
[{"$f":"CONCATENATE(D2414,\"-\",E2414)","v":"-"},"X",""]
["-","X",""]
["-","X",""]
["-","X",""]
["-","X",""]
["-","X",""]
["-","X",""]
["-","X",""]
["-","X",""]
["-","X",""]
["-","X",""]
["-","X",""]
["-","X",""]
["-","X",""]
["-","X",""]
["-","X",""]
["-","X",""]
["-","X",""]
["-","X",""]
["-","X",""]
["-","X",""]
["-","X",""]
["-","X",""]
["-","X",""]
["-","X",""]
["-","X",""]
["-","X",""]
["-","X",""]
["-","X",""]
["-","X",""]
["-","X",""]
["-","X",""]
["-","X",""]
["-","X",""]
["-","X",""]
["-","X",""]
["-","X",""]
["-","X",""]
["-","X",""]
["-","X",""]
["-","X",""]
["-","X",""]
["-","X",""]
["-","X",""]
["-","X",{"$f":"IF(ISERROR(VLOOKUP(A2460,Base_suivi_MPR,1,FALSE)),\"\",\"X\")","v":""}]
["-","X",""]
["-","X",""]
["-","X",""]
["-","X",""]
["-",{"$f":"IF(J2463=K2463,\"X\",\"\")","v":"X"},""]
["-","X",""]
["-","X",""]
["-","X",""]
["-","X",""]
["-","X",""]
["-","X",""]
["-","X",""]
["-","X",""]
["-","X",""]
["-","X",""]
["-","X",""]
["-","X",""]
["-","X",""]
["-","X",""]
[{"$f":"CONCATENATE(D2478,\"-\",E2478)","v":"-"},"X",""]
["-","X",""]
["-","X",""]
["-","X",""]
["-","X",""]
["-","X",""]
["-","X",""]
["-","X",""]
["-","X",""]
["-","X",""]
["-","X",""]
["-","X",""]
["-","X",""]
["-","X",""]
["-","X",""]
["-","X",""]
["-","X",""]
["-","X",""]
["-","X",""]
["-","X",""]
["-","X",""]
["-","X",""]
["-","X",""]
["-","X",""]
["-","X",""]
["-","X",""]
["-","X",""]
["-","X",""]
["-","X",""]
["-","X",""]
["-","X",""]
["-","X",""]
["-","X",""]
["-","X",""]
["-","X",""]
["-","X",""]
["-","X",""]
["-","X",""]
["-","X",""]
["-","X",""]
["-","X",""]
["-","X",""]
["-","X",""]
["-","X",""]
["-","X",{"$f":"IF(ISERROR(VLOOKUP(A2524,Base_suivi_MPR,1,FALSE)),\"\",\"X\")","v":""}]
["-","X",""]
["-","X",""]
["-","X",""]
["-","X",""]
["-",{"$f":"IF(J2527=K2527,\"X\",\"\")","v":"X"},""]
["-","X",""]
["-","X",""]
["-","X",""]
["-","X",""]
["-","X",""]
["-","X",""]
["-","X",""]
["-","X",""]
["-","X",""]
["-","X",""]
["-","X",""]
["-","X",""]
["-","X",""]
["-","X",""]
[{"$f":"CONCATENATE(D2542,\"-\",E2542)","v":"-"},"X",""]
["-","X",""]
["-","X",""]
["-","X",""]
["-","X",""]
["-","X",""]
["-","X",""]
["-","X",""]
["-","X",""]
["-","X",""]
["-","X",""]
["-","X",""]
["-","X",""]
["-","X",""]
["-","X",""]
["-","X",""]
["-","X",""]
["-","X",""]
["-","X",""]
["-","X",""]
["-","X",""]
["-","X",""]
["-","X",""]
["-","X",""]
["-","X",""]
["-","X",""]
["-","X",""]
["-","X",""]
["-","X",""]
["-","X",""]
["-","X",""]
["-","X",""]
["-","X",""]
["-","X",""]
["-","X",""]
["-","X",""]
["-","X",""]
["-","X",""]
["-","X",""]
["-","X",""]
["-","X",""]
["-","X",""]
["-","X",""]
["-","X",""]
["-","X",{"$f":"IF(ISERROR(VLOOKUP(A2588,Base_suivi_MPR,1,FALSE)),\"\",\"X\")","v":""}]
["-","X",""]
["-","X",""]
["-","X",""]
["-","X",""]
["-",{"$f":"IF(J2591=K2591,\"X\",\"\")","v":"X"},""]
["-","X",""]
["-","X",""]
["-","X",""]
["-","X",""]
["-","X",""]
["-","X",""]
["-","X",""]
["-","X",""]
["-","X",""]
["-","X",""]
["-","X",""]
["-","X",""]
["-","X",""]
["-","X",""]
[{"$f":"CONCATENATE(D2606,\"-\",E2606)","v":"-"},"X",""]
["-","X",""]
["-","X",""]
["-","X",""]
["-","X",""]
["-","X",""]
["-","X",""]
["-","X",""]
["-","X",""]
["-","X",""]
["-","X",""]
["-","X",""]
["-","X",""]
["-","X",""]
["-","X",""]
["-","X",""]
["-","X",""]
["-","X",""]
["-","X",""]
["-","X",""]
["-","X",""]
["-","X",""]
["-","X",""]
["-","X",""]
["-","X",""]
["-","X",""]
["-","X",""]
["-","X",""]
["-","X",""]
["-","X",""]
["-","X",""]
["-","X",""]
["-","X",""]
["-","X",""]
["-","X",""]
["-","X",""]
["-","X",""]
["-","X",""]
["-","X",""]
["-","X",""]
["-","X",""]
["-","X",""]
["-","X",""]
["-","X",""]
["-","X",{"$f":"IF(ISERROR(VLOOKUP(A2652,Base_suivi_MPR,1,FALSE)),\"\",\"X\")","v":""}]
["-","X",""]
["-","X",""]
["-","X",""]
["-","X",""]
["-",{"$f":"IF(J2655=K2655,\"X\",\"\")","v":"X"},""]
["-","X",""]
["-","X",""]
["-","X",""]
["-","X",""]
["-","X",""]
["-","X",""]
["-","X",""]
["-","X",""]
["-","X",""]
["-","X",""]
["-","X",""]
["-","X",""]
["-","X",""]
["-","X",""]
[{"$f":"CONCATENATE(D2670,\"-\",E2670)","v":"-"},"X",""]
["-","X",""]
["-","X",""]
["-","X",""]
["-","X",""]
["-","X",""]
["-","X",""]
["-","X",""]
["-","X",""]
["-","X",""]
["-","X",""]
["-","X",""]
["-","X",""]
["-","X",""]
["-","X",""]
["-","X",""]
["-","X",""]
["-","X",""]
["-","X",""]
["-","X",""]
["-","X",""]
["-","X",""]
["-","X",""]
["-","X",""]
["-","X",""]
["-","X",""]
["-","X",""]
["-","X",""]
["-","X",""]
["-","X",""]
["-","X",""]
["-","X",""]
["-","X",""]
["-","X",""]
["-","X",""]
["-","X",""]
["-","X",""]
["-","X",""]
["-","X",""]
["-","X",""]
["-","X",""]
["-","X",""]
["-","X",""]
["-","X",""]
["-","X",{"$f":"IF(ISERROR(VLOOKUP(A2716,Base_suivi_MPR,1,FALSE)),\"\",\"X\")","v":""}]
["-","X",""]
["-","X",""]
["-","X",""]
["-","X",""]
["-",{"$f":"IF(J2719=K2719,\"X\",\"\")","v":"X"},""]
["-","X",""]
["-","X",""]
["-","X",""]
["-","X",""]
["-","X",""]
["-","X",""]
["-","X",""]
["-","X",""]
["-","X",""]
["-","X",""]
["-","X",""]
["-","X",""]
["-","X",""]
["-","X",""]
[{"$f":"CONCATENATE(D2734,\"-\",E2734)","v":"-"},"X",""]
["-","X",""]
["-","X",""]
["-","X",""]
["-","X",""]
["-","X",""]
["-","X",""]
["-","X",""]
["-","X",""]
["-","X",""]
["-","X",""]
["-","X",""]
["-","X",""]
["-","X",""]
["-","X",""]
["-","X",""]
["-","X",""]
["-","X",""]
["-","X",""]
["-","X",""]
["-","X",""]
["-","X",""]
["-","X",""]
["-","X",""]
["-","X",""]
["-","X",""]
["-","X",""]
["-","X",""]
["-","X",""]
["-","X",""]
["-","X",""]
["-","X",""]
["-","X",""]
["-","X",""]
["-","X",""]
["-","X",""]
["-","X",""]
["-","X",""]
["-","X",""]
["-","X",""]
["-","X",""]
["-","X",""]
["-","X",""]
["-","X",""]
["-","X",{"$f":"IF(ISERROR(VLOOKUP(A2780,Base_suivi_MPR,1,FALSE)),\"\",\"X\")","v":""}]
["-","X",""]
["-","X",""]
["-","X",""]
["-","X",""]
["-",{"$f":"IF(J2783=K2783,\"X\",\"\")","v":"X"},""]
["-","X",""]
["-","X",""]
["-","X",""]
["-","X",""]
["-","X",""]
["-","X",""]
["-","X",""]
["-","X",""]
["-","X",""]
["-","X",""]
["-","X",""]
["-","X",""]
["-","X",""]
["-","X",""]
[{"$f":"CONCATENATE(D2798,\"-\",E2798)","v":"-"},"X",""]
["-","X",""]
["-","X",""]
["-","X",""]
["-","X",""]
["-","X",""]
["-","X",""]
["-","X",""]
["-","X",""]
["-","X",""]
["-","X",""]
["-","X",""]
["-","X",""]
["-","X",""]
["-","X",""]
["-","X",""]
["-","X",""]
["-","X",""]
["-","X",""]
["-","X",""]
["-","X",""]
["-","X",""]
["-","X",""]
["-","X",""]
["-","X",""]
["-","X",""]
["-","X",""]
["-","X",""]
["-","X",""]
["-","X",""]
["-","X",""]
["-","X",""]
["-","X",""]
["-","X",""]
["-","X",""]
["-","X",""]
["-","X",""]
["-","X",""]
["-","X",""]
["-","X",""]
["-","X",""]
["-","X",""]
["-","X",""]
["-","X",""]
["-","X",{"$f":"IF(ISERROR(VLOOKUP(A2844,Base_suivi_MPR,1,FALSE)),\"\",\"X\")","v":""}]
["-","X",""]
["-","X",""]
["-","X",""]
["-","X",""]
["-",{"$f":"IF(J2847=K2847,\"X\",\"\")","v":"X"},""]
["-","X",""]
["-","X",""]
["-","X",""]
["-","X",""]
["-","X",""]
["-","X",""]
["-","X",""]
["-","X",""]
["-","X",""]
["-","X",""]
["-","X",""]
["-","X",""]
["-","X",""]
["-","X",""]
[{"$f":"CONCATENATE(D2862,\"-\",E2862)","v":"-"},"X",""]
["-","X",""]
["-","X",""]
["-","X",""]
["-","X",""]
["-","X",""]
["-","X",""]
["-","X",""]
["-","X",""]
["-","X",""]
["-","X",""]
["-","X",""]
["-","X",""]
["-","X",""]
["-","X",""]
["-","X",""]
["-","X",""]
["-","X",""]
["-","X",""]
["-","X",""]
["-","X",""]
["-","X",""]
["-","X",""]
["-","X",""]
["-","X",""]
["-","X",""]
["-","X",""]
["-","X",""]
["-","X",""]
["-","X",""]
["-","X",""]
["-","X",""]
["-","X",""]
["-","X",""]
["-","X",""]
["-","X",""]
["-","X",""]
["-","X",""]
["-","X",""]
["-","X",""]
["-","X",""]
["-","X",""]
["-","X",""]
["-","X",""]
["-","X",{"$f":"IF(ISERROR(VLOOKUP(A2908,Base_suivi_MPR,1,FALSE)),\"\",\"X\")","v":""}]
["-","X",""]
["-","X",""]
["-","X",""]
["-","X",""]
["-",{"$f":"IF(J2911=K2911,\"X\",\"\")","v":"X"},""]
["-","X",""]
["-","X",""]
["-","X",""]
["-","X",""]
["-","X",""]
["-","X",""]
["-","X",""]
["-","X",""]
["-","X",""]
["-","X",""]
["-","X",""]
["-","X",""]
["-","X",""]
["-","X",""]
[{"$f":"CONCATENATE(D2926,\"-\",E2926)","v":"-"},"X",""]
["-","X",""]
["-","X",""]
["-","X",""]
["-","X",""]
["-","X",""]
["-","X",""]
["-","X",""]
["-","X",""]
["-","X",""]
["-","X",""]
["-","X",""]
["-","X",""]
["-","X",""]
["-","X",""]
["-","X",""]
["-","X",""]
["-","X",""]
["-","X",""]
["-","X",""]
["-","X",""]
["-","X",""]
["-","X",""]
["-","X",""]
["-","X",""]
["-","X",""]
["-","X",""]
["-","X",""]
["-","X",""]
["-","X",""]
["-","X",""]
["-","X",""]
["-","X",""]
["-","X",""]
["-","X",""]
["-","X",""]
["-","X",""]
["-","X",""]
["-","X",""]
["-","X",""]
["-","X",""]
["-","X",""]
["-","X",""]
["-","X",""]
["-","X",{"$f":"IF(ISERROR(VLOOKUP(A2972,Base_suivi_MPR,1,FALSE)),\"\",\"X\")","v":""}]
["-","X",""]
["-","X",""]
["-","X",""]
["-","X",""]
["-",{"$f":"IF(J2975=K2975,\"X\",\"\")","v":"X"},""]
["-","X",""]
["-","X",""]
["-","X",""]
["-","X",""]
["-","X",""]
["-","X",""]
["-","X",""]
["-","X",""]
["-","X",""]
["-","X",""]
["-","X",""]
["-","X",""]
["-","X",""]
["-","X",""]
[{"$f":"CONCATENATE(D2990,\"-\",E2990)","v":"-"},"X",""]
["-","X",""]
["-","X",""]
["-","X",""]
["-","X",""]
["-","X",""]
["-","X",""]
["-","X",""]
["-","X",""]
["-","X",""]
["-","X",""]
["-","X",""]
["-","X",""]
["-","X",""]
["-","X",""]
["-","X",""]
["-","X",""]
["-","X",""]
["-","X",""]
["-","X",""]
["-","X",""]
["-","X",""]
["-","X",""]
["-","X",""]
["-","X",""]
["-","X",""]
["-","X",""]
["-","X",""]
["-","X",""]
["-","X",""]
["-","X",""]
["-","X",""]
["-","X",""]
["-","X",""]
["-","X",""]
["-","X",""]
["-","X",""]
["-","X",""]
["-","X",""]
["-","X",""]
["-","X",""]
["-","X",""]
["-","X",""]
["-","X",""]
["-","X",{"$f":"IF(ISERROR(VLOOKUP(A3036,Base_suivi_MPR,1,FALSE)),\"\",\"X\")","v":""}]
["-","X",""]
["-","X",""]
["-","X",""]
["-","X",""]
["-",{"$f":"IF(J3039=K3039,\"X\",\"\")","v":"X"},""]
["-","X",""]
["-","X",""]
["-","X",""]
["-","X",""]
["-","X",""]
["-","X",""]
["-","X",""]
["-","X",""]
["-","X",""]
["-","X",""]
["-","X",""]
["-","X",""]
["-","X",""]
["-","X",""]
[{"$f":"CONCATENATE(D3054,\"-\",E3054)","v":"-"},"X",""]
["-","X",""]
["-","X",""]
["-","X",""]
["-","X",""]
["-","X",""]
["-","X",""]
["-","X",""]
["-","X",""]
["-","X",""]
["-","X",""]
["-","X",""]
["-","X",""]
["-","X",""]
["-","X",""]
["-","X",""]
["-","X",""]
["-","X",""]
["-","X",""]
["-","X",""]
["-","X",""]
["-","X",""]
["-","X",""]
["-","X",""]
["-","X",""]
["-","X",""]
["-","X",""]
["-","X",""]
["-","X",""]
["-","X",""]
["-","X",""]
["-","X",""]
["-","X",""]
["-","X",""]
["-","X",""]
["-","X",""]
["-","X",""]
["-","X",""]
["-","X",""]
["-","X",""]
["-","X",""]
["-","X",""]
["-","X",""]
["-","X",""]
["-","X",{"$f":"IF(ISERROR(VLOOKUP(A3100,Base_suivi_MPR,1,FALSE)),\"\",\"X\")","v":""}]
["-","X",""]
["-","X",""]
["-","X",""]
["-","X",""]
["-",{"$f":"IF(J3103=K3103,\"X\",\"\")","v":"X"},""]
["-","X",""]
["-","X",""]
["-","X",""]
["-","X",""]
["-","X",""]
["-","X",""]
["-","X",""]
["-","X",""]
["-","X",""]
["-","X",""]
["-","X",""]
["-","X",""]
["-","X",""]
["-","X",""]
[{"$f":"CONCATENATE(D3118,\"-\",E3118)","v":"-"},"X",""]
["-","X",""]
["-","X",""]
["-","X",""]
["-","X",""]
["-","X",""]
["-","X",""]
["-","X",""]
["-","X",""]
["-","X",""]
["-","X",""]
["-","X",""]
["-","X",""]
["-","X",""]
["-","X",""]
["-","X",""]
["-","X",""]
["-","X",""]
["-","X",""]
["-","X",""]
["-","X",""]
["-","X",""]
["-","X",""]
["-","X",""]
["-","X",""]
["-","X",""]
["-","X",""]
["-","X",""]
["-","X",""]
["-","X",""]
["-","X",""]
["-","X",""]
["-","X",""]
["-","X",""]
["-","X",""]
["-","X",""]
["-","X",""]
["-","X",""]
["-","X",""]
["-","X",""]
["-","X",""]
["-","X",""]
["-","X",""]
["-","X",""]
["-","X",{"$f":"IF(ISERROR(VLOOKUP(A3164,Base_suivi_MPR,1,FALSE)),\"\",\"X\")","v":""}]
["-","X",""]
["-","X",""]
["-","X",""]
["-","X",""]
["-",{"$f":"IF(J3167=K3167,\"X\",\"\")","v":"X"},""]
["-","X",""]
["-","X",""]
["-","X",""]
["-","X",""]
["-","X",""]
["-","X",""]
["-","X",""]
["-","X",""]
["-","X",""]
["-","X",""]
["-","X",""]
["-","X",""]
["-","X",""]
["-","X",""]
[{"$f":"CONCATENATE(D3182,\"-\",E3182)","v":"-"},"X",""]
["-","X",""]
["-","X",""]
["-","X",""]
["-","X",""]
["-","X",""]
["-","X",""]
["-","X",""]
["-","X",""]
["-","X",""]
["-","X",""]
["-","X",""]
["-","X",""]
["-","X",""]
["-","X",""]
["-","X",""]
["-","X",""]
["-","X",""]
["-","X",""]
["-","X",""]
["-","X",""]
["-","X",""]
["-","X",""]
["-","X",""]
["-","X",""]
["-","X",""]
["-","X",""]
["-","X",""]
["-","X",""]
["-","X",""]
["-","X",""]
["-","X",""]
["-","X",""]
["-","X",""]
["-","X",""]
["-","X",""]
["-","X",""]
["-","X",""]
["-","X",""]
["-","X",""]
["-","X",""]
["-","X",""]
["-","X",""]
["-","X",""]
["-","X",{"$f":"IF(ISERROR(VLOOKUP(A3228,Base_suivi_MPR,1,FALSE)),\"\",\"X\")","v":""}]
["-","X",""]
["-","X",""]
["-","X",""]
["-","X",""]
["-",{"$f":"IF(J3231=K3231,\"X\",\"\")","v":"X"},""]
["-","X",""]
["-","X",""]
["-","X",""]
["-","X",""]
["-","X",""]
["-","X",""]
["-","X",""]
["-","X",""]
["-","X",""]
["-","X",""]
["-","X",""]
["-","X",""]
["-","X",""]
["-","X",""]
[{"$f":"CONCATENATE(D3246,\"-\",E3246)","v":"-"},"X",""]
["-","X",""]
["-","X",""]
["-","X",""]
["-","X",""]
["-","X",""]
["-","X",""]
["-","X",""]
["-","X",""]
["-","X",""]
["-","X",""]
["-","X",""]
["-","X",""]
["-","X",""]
["-","X",""]
["-","X",""]
["-","X",""]
["-","X",""]
["-","X",""]
["-","X",""]
["-","X",""]
["-","X",""]
["-","X",""]
["-","X",""]
["-","X",""]
["-","X",""]
["-","X",""]
["-","X",""]
["-","X",""]
["-","X",""]
["-","X",""]
["-","X",""]
["-","X",""]
["-","X",""]
["-","X",""]
["-","X",""]
["-","X",""]
["-","X",""]
["-","X",""]
["-","X",""]
["-","X",""]
["-","X",""]
["-","X",""]
["-","X",""]
["-","X",{"$f":"IF(ISERROR(VLOOKUP(A3292,Base_suivi_MPR,1,FALSE)),\"\",\"X\")","v":""}]
["-","X",""]
["-","X",""]
["-","X",""]
["-","X",""]
["-",{"$f":"IF(J3295=K3295,\"X\",\"\")","v":"X"},""]
["-","X",""]
["-","X",""]
["-","X",""]
["-","X",""]
["-","X",""]
["-","X",""]
["-","X",""]
["-","X",""]
["-","X",""]
["-","X",""]
["-","X",""]
["-","X",""]
["-","X",""]
["-","X",""]
[{"$f":"CONCATENATE(D3310,\"-\",E3310)","v":"-"},"X",""]
["-","X",""]
["-","X",""]
["-","X",""]
["-","X",""]
["-","X",""]
["-","X",""]
["-","X",""]
["-","X",""]
["-","X",""]
["-","X",""]
["-","X",""]
["-","X",""]
["-","X",""]
["-","X",""]
["-","X",""]
["-","X",""]
["-","X",""]
["-","X",""]
["-","X",""]
["-","X",""]
["-","X",""]
["-","X",""]
["-","X",""]
["-","X",""]
["-","X",""]
["-","X",""]
["-","X",""]
["-","X",""]
["-","X",""]
["-","X",""]
["-","X",""]
["-","X",""]
["-","X",""]
["-","X",""]
["-","X",""]
["-","X",""]
["-","X",""]
["-","X",""]
["-","X",""]
["-","X",""]
["-","X",""]
["-","X",""]
["-","X",""]
["-","X",{"$f":"IF(ISERROR(VLOOKUP(A3356,Base_suivi_MPR,1,FALSE)),\"\",\"X\")","v":""}]
["-","X",""]
["-","X",""]
["-","X",""]
["-","X",""]
["-",{"$f":"IF(J3359=K3359,\"X\",\"\")","v":"X"},""]
["-","X",""]
["-","X",""]
["-","X",""]
["-","X",""]
["-","X",""]
["-","X",""]
["-","X",""]
["-","X",""]
["-","X",""]
["-","X",""]
["-","X",""]
["-","X",""]
["-","X",""]
["-","X",""]
[{"$f":"CONCATENATE(D3374,\"-\",E3374)","v":"-"},"X",""]
["-","X",""]
["-","X",""]
["-","X",""]
["-","X",""]
["-","X",""]
["-","X",""]
["-","X",""]
["-","X",""]
["-","X",""]
["-","X",""]
["-","X",""]
["-","X",""]
["-","X",""]
["-","X",""]
["-","X",""]
["-","X",""]
["-","X",""]
["-","X",""]
["-","X",""]
["-","X",""]
["-","X",""]
["-","X",""]
["-","X",""]
["-","X",""]
["-","X",""]
["-","X",""]
["-","X",""]
["-","X",""]
["-","X",""]
["-","X",""]
["-","X",""]
["-","X",""]
["-","X",""]
["-","X",""]
["-","X",""]
["-","X",""]
["-","X",""]
["-","X",""]
["-","X",""]
["-","X",""]
["-","X",""]
["-","X",""]
["-","X",""]
["-","X",{"$f":"IF(ISERROR(VLOOKUP(A3420,Base_suivi_MPR,1,FALSE)),\"\",\"X\")","v":""}]
["-","X",""]
["-","X",""]
["-","X",""]
["-","X",""]
["-",{"$f":"IF(J3423=K3423,\"X\",\"\")","v":"X"},""]
["-","X",""]
["-","X",""]
["-","X",""]
["-","X",""]
["-","X",""]
["-","X",""]
["-","X",""]
["-","X",""]
["-","X",""]
["-","X",""]
["-","X",""]
["-","X",""]
["-","X",""]
["-","X",""]
[{"$f":"CONCATENATE(D3438,\"-\",E3438)","v":"-"},"X",""]
["-","X",""]
["-","X",""]
["-","X",""]
["-","X",""]
["-","X",""]
["-","X",""]
["-","X",""]
["-","X",""]
["-","X",""]
["-","X",""]
["-","X",""]
["-","X",""]
["-","X",""]
["-","X",""]
["-","X",""]
["-","X",""]
["-","X",""]
["-","X",""]
["-","X",""]
["-","X",""]
["-","X",""]
["-","X",""]
["-","X",""]
["-","X",""]
["-","X",""]
["-","X",""]
["-","X",""]
["-","X",""]
["-","X",""]
["-","X",""]
["-","X",""]
["-","X",""]
["-","X",""]
["-","X",""]
["-","X",""]
["-","X",""]
["-","X",""]
["-","X",""]
["-","X",""]
["-","X",""]
["-","X",""]
["-","X",""]
["-","X",""]
["-","X",{"$f":"IF(ISERROR(VLOOKUP(A3484,Base_suivi_MPR,1,FALSE)),\"\",\"X\")","v":""}]
["-","X",""]
["-","X",""]
["-","X",""]
["-","X",""]
["-",{"$f":"IF(J3487=K3487,\"X\",\"\")","v":"X"},""]
["-","X",""]
["-","X",""]
["-","X",""]
["-","X",""]
["-","X",""]
["-","X",""]
["-","X",""]
["-","X",""]
["-","X",""]
["-","X",""]
["-","X",""]
["-","X",""]
["-","X",""]
["-","X",""]
[{"$f":"CONCATENATE(D3502,\"-\",E3502)","v":"-"},"X",""]
["-","X",""]
["-","X",""]
["-","X",""]
["-","X",""]
["-","X",""]
["-","X",""]
["-","X",""]
["-","X",""]
["-","X",""]
["-","X",""]
["-","X",""]
["-","X",""]
["-","X",""]
["-","X",""]
["-","X",""]
["-","X",""]
["-","X",""]
["-","X",""]
["-","X",""]
["-","X",""]
["-","X",""]
["-","X",""]
["-","X",""]
["-","X",""]
["-","X",""]
["-","X",""]
["-","X",""]
["-","X",""]
["-","X",""]
["-","X",""]
["-","X",""]
["-","X",""]
["-","X",""]
["-","X",""]
["-","X",""]
["-","X",""]
["-","X",""]
["-","X",""]
["-","X",""]
["-","X",""]
["-","X",""]
["-","X",""]
["-","X",""]
["-","X",{"$f":"IF(ISERROR(VLOOKUP(A3548,Base_suivi_MPR,1,FALSE)),\"\",\"X\")","v":""}]
["-","X",""]
["-","X",""]
["-","X",""]
["-","X",""]
["-",{"$f":"IF(J3551=K3551,\"X\",\"\")","v":"X"},""]
["-","X",""]
["-","X",""]
["-","X",""]
["-","X",""]
["-","X",""]
["-","X",""]
["-","X",""]
["-","X",""]
["-","X",""]
["-","X",""]
["-","X",""]
["-","X",""]
["-","X",""]
["-","X",""]
[{"$f":"CONCATENATE(D3566,\"-\",E3566)","v":"-"},"X",""]
["-","X",""]
["-","X",""]
["-","X",""]
["-","X",""]
["-","X",""]
["-","X",""]
["-","X",""]
["-","X",""]
["-","X",""]
["-","X",""]
["-","X",""]
["-","X",""]
["-","X",""]
["-","X",""]
["-","X",""]
["-","X",""]
["-","X",""]
["-","X",""]
["-","X",""]
["-","X",""]
["-","X",""]
["-","X",""]
["-","X",""]
["-","X",""]
["-","X",""]
["-","X",""]
["-","X",""]
["-","X",""]
["-","X",""]
["-","X",""]
["-","X",""]
["-","X",""]
["-","X",""]
["-","X",""]
["-","X",""]
["-","X",""]
["-","X",""]
["-","X",""]
["-","X",""]
["-","X",""]
["-","X",""]
["-","X",""]
["-","X",""]
["-","X",{"$f":"IF(ISERROR(VLOOKUP(A3612,Base_suivi_MPR,1,FALSE)),\"\",\"X\")","v":""}]
["-","X",""]
["-","X",""]
["-","X",""]
["-","X",""]
["-",{"$f":"IF(J3615=K3615,\"X\",\"\")","v":"X"},""]
["-","X",""]
["-","X",""]
["-","X",""]
["-","X",""]
["-","X",""]
["-","X",""]
["-","X",""]
["-","X",""]
["-","X",""]
["-","X",""]
["-","X",""]
["-","X",""]
["-","X",""]
["-","X",""]
[{"$f":"CONCATENATE(D3630,\"-\",E3630)","v":"-"},"X",""]
["-","X",""]
["-","X",""]
["-","X",""]
["-","X",""]
["-","X",""]
["-","X",""]
["-","X",""]
["-","X",""]
["-","X",""]
["-","X",""]
["-","X",""]
["-","X",""]
["-","X",""]
["-","X",""]
["-","X",""]
["-","X",""]
["-","X",""]
["-","X",""]
["-","X",""]
["-","X",""]
["-","X",""]
["-","X",""]
["-","X",""]
["-","X",""]
["-","X",""]
["-","X",""]
["-","X",""]
["-","X",""]
["-","X",""]
["-","X",""]
["-","X",""]
["-","X",""]
["-","X",""]
["-","X",""]
["-","X",""]
["-","X",""]
["-","X",""]
["-","X",""]
["-","X",""]
["-","X",""]
["-","X",""]
["-","X",""]
["-","X",""]
["-","X",{"$f":"IF(ISERROR(VLOOKUP(A3676,Base_suivi_MPR,1,FALSE)),\"\",\"X\")","v":""}]
["-","X",""]
["-","X",""]
["-","X",""]
["-","X",""]
["-",{"$f":"IF(J3679=K3679,\"X\",\"\")","v":"X"},""]
["-","X",""]
["-","X",""]
["-","X",""]
["-","X",""]
["-","X",""]
["-","X",""]
["-","X",""]
["-","X",""]
["-","X",""]
["-","X",""]
["-","X",""]
["-","X",""]
["-","X",""]
["-","X",""]
[{"$f":"CONCATENATE(D3694,\"-\",E3694)","v":"-"},"X",""]
["-","X",""]
["-","X",""]
["-","X",""]
["-","X",""]
["-","X",""]
["-","X",""]
["-","X",""]
["-","X",""]
["-","X",""]
["-","X",""]
["-","X",""]
["-","X",""]
["-","X",""]
["-","X",""]
["-","X",""]
["-","X",""]
["-","X",""]
["-","X",""]
["-","X",""]
["-","X",""]
["-","X",""]
["-","X",""]
["-","X",""]
["-","X",""]
["-","X",""]
["-","X",""]
["-","X",""]
["-","X",""]
["-","X",""]
["-","X",""]
["-","X",""]
["-","X",""]
["-","X",""]
["-","X",""]
["-","X",""]
["-","X",""]
["-","X",""]
["-","X",""]
["-","X",""]
["-","X",""]
["-","X",""]
["-","X",""]
["-","X",""]
["-","X",{"$f":"IF(ISERROR(VLOOKUP(A3740,Base_suivi_MPR,1,FALSE)),\"\",\"X\")","v":""}]
["-","X",""]
["-","X",""]
["-","X",""]
["-","X",""]
["-",{"$f":"IF(J3743=K3743,\"X\",\"\")","v":"X"},""]
["-","X",""]
["-","X",""]
["-","X",""]
["-","X",""]
["-","X",""]
["-","X",""]
["-","X",""]
["-","X",""]
["-","X",""]
["-","X",""]
["-","X",""]
["-","X",""]
["-","X",""]
["-","X",""]
[{"$f":"CONCATENATE(D3758,\"-\",E3758)","v":"-"},"X",""]
["-","X",""]
["-","X",""]
["-","X",""]
["-","X",""]
["-","X",""]
["-","X",""]
["-","X",""]
["-","X",""]
["-","X",""]
["-","X",""]
["-","X",""]
["-","X",""]
["-","X",""]
["-","X",""]
["-","X",""]
["-","X",""]
["-","X",""]
["-","X",""]
["-","X",""]
["-","X",""]
["-","X",""]
["-","X",""]
["-","X",""]
["-","X",""]
["-","X",""]
["-","X",""]
["-","X",""]
["-","X",""]
["-","X",""]
["-","X",""]
["-","X",""]
["-","X",""]
["-","X",""]
["-","X",""]
["-","X",""]
["-","X",""]
["-","X",""]
["-","X",""]
["-","X",""]
["-","X",""]
["-","X",""]
["-","X",""]
["-","X",""]
["-","X",{"$f":"IF(ISERROR(VLOOKUP(A3804,Base_suivi_MPR,1,FALSE)),\"\",\"X\")","v":""}]
["-","X",""]
["-","X",""]
["-","X",""]
["-","X",""]
["-",{"$f":"IF(J3807=K3807,\"X\",\"\")","v":"X"},""]
["-","X",""]
["-","X",""]
["-","X",""]
["-","X",""]
["-","X",""]
["-","X",""]
["-","X",""]
["-","X",""]
["-","X",""]
["-","X",""]
["-","X",""]
["-","X",""]
["-","X",""]
["-","X",""]
[{"$f":"CONCATENATE(D3822,\"-\",E3822)","v":"-"},"X",""]
["-","X",""]
["-","X",""]
["-","X",""]
["-","X",""]
["-","X",""]
["-","X",""]
["-","X",""]
["-","X",""]
["-","X",""]
["-","X",""]
["-","X",""]
["-","X",""]
["-","X",""]
["-","X",""]
["-","X",""]
["-","X",""]
["-","X",""]
["-","X",""]
["-","X",""]
["-","X",""]
["-","X",""]
["-","X",""]
["-","X",""]
["-","X",""]
["-","X",""]
["-","X",""]
["-","X",""]
["-","X",""]
["-","X",""]
["-","X",""]
["-","X",""]
["-","X",""]
["-","X",""]
["-","X",""]
["-","X",""]
["-","X",""]
["-","X",""]
["-","X",""]
["-","X",""]
["-","X",""]
["-","X",""]
["-","X",""]
["-","X",""]
["-","X",{"$f":"IF(ISERROR(VLOOKUP(A3868,Base_suivi_MPR,1,FALSE)),\"\",\"X\")","v":""}]
["-","X",""]
["-","X",""]
["-","X",""]
["-","X",""]
["-",{"$f":"IF(J3871=K3871,\"X\",\"\")","v":"X"},""]
["-","X",""]
["-","X",""]
["-","X",""]
["-","X",""]
["-","X",""]
["-","X",""]
["-","X",""]
["-","X",""]
["-","X",""]
["-","X",""]
["-","X",""]
["-","X",""]
["-","X",""]
["-","X",""]
[{"$f":"CONCATENATE(D3886,\"-\",E3886)","v":"-"},"X",""]
["-","X",""]
["-","X",""]
["-","X",""]
["-","X",""]
["-","X",""]
["-","X",""]
["-","X",""]
["-","X",""]
["-","X",""]
["-","X",""]
["-","X",""]
["-","X",""]
["-","X",""]
["-","X",""]
["-","X",""]
["-","X",""]
["-","X",""]
["-","X",""]
["-","X",""]
["-","X",""]
["-","X",""]
["-","X",""]
["-","X",""]
["-","X",""]
["-","X",""]
["-","X",""]
["-","X",""]
["-","X",""]
["-","X",""]
["-","X",""]
["-","X",""]
["-","X",""]
["-","X",""]
["-","X",""]
["-","X",""]
["-","X",""]
["-","X",""]
["-","X",""]
["-","X",""]
["-","X",""]
["-","X",""]
["-","X",""]
["-","X",""]
["-","X",{"$f":"IF(ISERROR(VLOOKUP(A3932,Base_suivi_MPR,1,FALSE)),\"\",\"X\")","v":""}]
["-","X",""]
["-","X",""]
["-","X",""]
["-","X",""]
["-",{"$f":"IF(J3935=K3935,\"X\",\"\")","v":"X"},""]
["-","X",""]
["-","X",""]
["-","X",""]
["-","X",""]
["-","X",""]
["-","X",""]
["-","X",""]
["-","X",""]
["-","X",""]
["-","X",""]
["-","X",""]
["-","X",""]
["-","X",""]
["-","X",""]
[{"$f":"CONCATENATE(D3950,\"-\",E3950)","v":"-"},"X",""]
["-","X",""]
["-","X",""]
["-","X",""]
["-","X",""]
["-","X",""]
["-","X",""]
["-","X",""]
["-","X",""]
["-","X",""]
["-","X",""]
["-","X",""]
["-","X",""]
["-","X",""]
["-","X",""]
["-","X",""]
["-","X",""]
["-","X",""]
["-","X",""]
["-","X",""]
["-","X",""]
["-","X",""]
["-","X",""]
["-","X",""]
["-","X",""]
["-","X",""]
["-","X",""]
["-","X",""]
["-","X",""]
["-","X",""]
["-","X",""]
["-","X",""]
["-","X",""]
["-","X",""]
["-","X",""]
["-","X",""]
["-","X",""]
["-","X",""]
["-","X",""]
["-","X",""]
["-","X",""]
["-","X",""]
["-","X",""]
["-","X",""]
["-","X",{"$f":"IF(ISERROR(VLOOKUP(A3996,Base_suivi_MPR,1,FALSE)),\"\",\"X\")","v":""}]
["-","X",""]
["-","X",""]
["-","X",""]
["-","X",""]
["-",{"$f":"IF(J3999=K3999,\"X\",\"\")","v":"X"},""]
["-","X",""]
["-","X",""]
["-","X",""]
["-","X",""]
["-","X",""]
["-","X",""]
["-","X",""]
["-","X",""]
["-","X",""]
["-","X",""]
["-","X",""]
["-","X",""]
["-","X",""]
["-","X",""]
[{"$f":"CONCATENATE(D4014,\"-\",E4014)","v":"-"},"X",""]
["-","X",""]
["-","X",""]
["-","X",""]
["-","X",""]
["-","X",""]
["-","X",""]
["-","X",""]
["-","X",""]
["-","X",""]
["-","X",""]
["-","X",""]
["-","X",""]
["-","X",""]
["-","X",""]
["-","X",""]
["-","X",""]
["-","X",""]
["-","X",""]
["-","X",""]
["-","X",""]
["-","X",""]
["-","X",""]
["-","X",""]
["-","X",""]
["-","X",""]
["-","X",""]
["-","X",""]
["-","X",""]
["-","X",""]
["-","X",""]
["-","X",""]
["-","X",""]
["-","X",""]
["-","X",""]
["-","X",""]
["-","X",""]
["-","X",""]
["-","X",""]
["-","X",""]
["-","X",""]
["-","X",""]
["-","X",""]
["-","X",""]
["-","X",{"$f":"IF(ISERROR(VLOOKUP(A4060,Base_suivi_MPR,1,FALSE)),\"\",\"X\")","v":""}]
["-","X",""]
["-","X",""]
["-","X",""]
["-","X",""]
["-",{"$f":"IF(J4063=K4063,\"X\",\"\")","v":"X"},""]
["-","X",""]
["-","X",""]
["-","X",""]
["-","X",""]
["-","X",""]
["-","X",""]
["-","X",""]
["-","X",""]
["-","X",""]
["-","X",""]
["-","X",""]
["-","X",""]
["-","X",""]
["-","X",""]
[{"$f":"CONCATENATE(D4078,\"-\",E4078)","v":"-"},"X",""]
["-","X",""]
["-","X",""]
["-","X",""]
["-","X",""]
["-","X",""]
["-","X",""]
["-","X",""]
["-","X",""]
["-","X",""]
["-","X",""]
["-","X",""]
["-","X",""]
["-","X",""]
["-","X",""]
["-","X",""]
["-","X",""]
["-","X",""]
["-","X",""]
["-","X",""]
["-","X",""]
["-","X",""]
["-","X",""]
["-","X",""]
["-","X",""]
["-","X",""]
["-","X",""]
["-","X",""]
["-","X",""]
["-","X",""]
["-","X",""]
["-","X",""]
["-","X",""]
["-","X",""]
["-","X",""]
["-","X",""]
["-","X",""]
["-","X",""]
["-","X",""]
["-","X",""]
["-","X",""]
["-","X",""]
["-","X",""]
["-","X",""]
["-","X",{"$f":"IF(ISERROR(VLOOKUP(A4124,Base_suivi_MPR,1,FALSE)),\"\",\"X\")","v":""}]
["-","X",""]
["-","X",""]
["-","X",""]
["-","X",""]
["-",{"$f":"IF(J4127=K4127,\"X\",\"\")","v":"X"},""]
["-","X",""]
["-","X",""]
["-","X",""]
["-","X",""]
["-","X",""]
["-","X",""]
["-","X",""]
["-","X",""]
["-","X",""]
["-","X",""]
["-","X",""]
["-","X",""]
["-","X",""]
["-","X",""]
[{"$f":"CONCATENATE(D4142,\"-\",E4142)","v":"-"},"X",""]
["-","X",""]
["-","X",""]
["-","X",""]
["-","X",""]
["-","X",""]
["-","X",""]
["-","X",""]
["-","X",""]
["-","X",""]
["-","X",""]
["-","X",""]
["-","X",""]
["-","X",""]
["-","X",""]
["-","X",""]
["-","X",""]
["-","X",""]
["-","X",""]
["-","X",""]
["-","X",""]
["-","X",""]
["-","X",""]
["-","X",""]
["-","X",""]
["-","X",""]
["-","X",""]
["-","X",""]
["-","X",""]
["-","X",""]
["-","X",""]
["-","X",""]
["-","X",""]
["-","X",""]
["-","X",""]
["-","X",""]
["-","X",""]
["-","X",""]
["-","X",""]
["-","X",""]
["-","X",""]
["-","X",""]
["-","X",""]
["-","X",""]
["-","X",{"$f":"IF(ISERROR(VLOOKUP(A4188,Base_suivi_MPR,1,FALSE)),\"\",\"X\")","v":""}]
["-","X",""]
["-","X",""]
["-","X",""]
["-","X",""]
["-",{"$f":"IF(J4191=K4191,\"X\",\"\")","v":"X"},""]
["-","X",""]
["-","X",""]
["-","X",""]
["-","X",""]
["-","X",""]
["-","X",""]
["-","X",""]
["-","X",""]
["-","X",""]
["-","X",""]
["-","X",""]
["-","X",""]
["-","X",""]
["-","X",""]
[{"$f":"CONCATENATE(D4206,\"-\",E4206)","v":"-"},"X",""]
["-","X",""]
["-","X",""]
["-","X",""]
["-","X",""]
["-","X",""]
["-","X",""]
["-","X",""]
["-","X",""]
["-","X",""]
["-","X",""]
["-","X",""]
["-","X",""]
["-","X",""]
["-","X",""]
["-","X",""]
["-","X",""]
["-","X",""]
["-","X",""]
["-","X",""]
["-","X",""]
["-","X",""]
["-","X",""]
["-","X",""]
["-","X",""]
["-","X",""]
["-","X",""]
["-","X",""]
["-","X",""]
["-","X",""]
["-","X",""]
["-","X",""]
["-","X",""]
["-","X",""]
["-","X",""]
["-","X",""]
["-","X",""]
["-","X",""]
["-","X",""]
["-","X",""]
["-","X",""]
["-","X",""]
["-","X",""]
["-","X",""]
["-","X",{"$f":"IF(ISERROR(VLOOKUP(A4252,Base_suivi_MPR,1,FALSE)),\"\",\"X\")","v":""}]
["-","X",""]
["-","X",""]
["-","X",""]
["-","X",""]
["-",{"$f":"IF(J4255=K4255,\"X\",\"\")","v":"X"},""]
["-","X",""]
["-","X",""]
["-","X",""]
["-","X",""]
["-","X",""]
["-","X",""]
["-","X",""]
["-","X",""]
["-","X",""]
["-","X",""]
["-","X",""]
["-","X",""]
["-","X",""]
["-","X",""]
[{"$f":"CONCATENATE(D4270,\"-\",E4270)","v":"-"},"X",""]
["-","X",""]
["-","X",""]
["-","X",""]
["-","X",""]
["-","X",""]
["-","X",""]
["-","X",""]
["-","X",""]
["-","X",""]
["-","X",""]
["-","X",""]
["-","X",""]
["-","X",""]
["-","X",""]
["-","X",""]
["-","X",""]
["-","X",""]
["-","X",""]
["-","X",""]
["-","X",""]
["-","X",""]
["-","X",""]
["-","X",""]
["-","X",""]
["-","X",""]
["-","X",""]
["-","X",""]
["-","X",""]
["-","X",""]
["-","X",""]
["-","X",""]
["-","X",""]
["-","X",""]
["-","X",""]
["-","X",""]
["-","X",""]
["-","X",""]
["-","X",""]
["-","X",""]
["-","X",""]
["-","X",""]
["-","X",""]
["-","X",""]
["-","X",{"$f":"IF(ISERROR(VLOOKUP(A4316,Base_suivi_MPR,1,FALSE)),\"\",\"X\")","v":""}]
["-","X",""]
["-","X",""]
["-","X",""]
["-","X",""]
["-",{"$f":"IF(J4319=K4319,\"X\",\"\")","v":"X"},""]
["-","X",""]
["-","X",""]
["-","X",""]
["-","X",""]
["-","X",""]
["-","X",""]
["-","X",""]
["-","X",""]
["-","X",""]
["-","X",""]
["-","X",""]
["-","X",""]
["-","X",""]
["-","X",""]
[{"$f":"CONCATENATE(D4334,\"-\",E4334)","v":"-"},"X",""]
["-","X",""]
["-","X",""]
["-","X",""]
["-","X",""]
["-","X",""]
["-","X",""]
["-","X",""]
["-","X",""]
["-","X",""]
["-","X",""]
["-","X",""]
["-","X",""]
["-","X",""]
["-","X",""]
["-","X",""]
["-","X",""]
["-","X",""]
["-","X",""]
["-","X",""]
["-","X",""]
["-","X",""]
["-","X",""]
["-","X",""]
["-","X",""]
["-","X",""]
["-","X",""]
["-","X",""]
["-","X",""]
["-","X",""]
["-","X",""]
["-","X",""]
["-","X",""]
["-","X",""]
["-","X",""]
["-","X",""]
["-","X",""]
["-","X",""]
["-","X",""]
["-","X",""]
["-","X",""]
["-","X",""]
["-","X",""]
["-","X",""]
["-","X",{"$f":"IF(ISERROR(VLOOKUP(A4380,Base_suivi_MPR,1,FALSE)),\"\",\"X\")","v":""}]
["-","X",""]
["-","X",""]
["-","X",""]
["-","X",""]
["-",{"$f":"IF(J4383=K4383,\"X\",\"\")","v":"X"},""]
["-","X",""]
["-","X",""]
["-","X",""]
["-","X",""]
["-","X",""]
["-","X",""]
["-","X",""]
["-","X",""]
["-","X",""]
["-","X",""]
["-","X",""]
["-","X",""]
["-","X",""]
["-","X",""]
[{"$f":"CONCATENATE(D4398,\"-\",E4398)","v":"-"},"X",""]
["-","X",""]
["-","X",""]
["-","X",""]
["-","X",""]
["-","X",""]
["-","X",""]
["-","X",""]
["-","X",""]
["-","X",""]
["-","X",""]
["-","X",""]
["-","X",""]
["-","X",""]
["-","X",""]
["-","X",""]
["-","X",""]
["-","X",""]
["-","X",""]
["-","X",""]
["-","X",""]
["-","X",""]
["-","X",""]
["-","X",""]
["-","X",""]
["-","X",""]
["-","X",""]
["-","X",""]
["-","X",""]
["-","X",""]
["-","X",""]
["-","X",""]
["-","X",""]
["-","X",""]
["-","X",""]
["-","X",""]
["-","X",""]
["-","X",""]
["-","X",""]
["-","X",""]
["-","X",""]
["-","X",""]
["-","X",""]
["-","X",""]
["-","X",{"$f":"IF(ISERROR(VLOOKUP(A4444,Base_suivi_MPR,1,FALSE)),\"\",\"X\")","v":""}]
["-","X",""]
["-","X",""]
["-","X",""]
["-","X",""]
["-",{"$f":"IF(J4447=K4447,\"X\",\"\")","v":"X"},""]
["-","X",""]
["-","X",""]
["-","X",""]
["-","X",""]
["-","X",""]
["-","X",""]
["-","X",""]
["-","X",""]
["-","X",""]
["-","X",""]
["-","X",""]
["-","X",""]
["-","X",""]
["-","X",""]
[{"$f":"CONCATENATE(D4462,\"-\",E4462)","v":"-"},"X",""]
["-","X",""]
["-","X",""]
["-","X",""]
["-","X",""]
["-","X",""]
["-","X",""]
["-","X",""]
["-","X",""]
["-","X",""]
["-","X",""]
["-","X",""]
["-","X",""]
["-","X",""]
["-","X",""]
["-","X",""]
["-","X",""]
["-","X",""]
["-","X",""]
["-","X",""]
["-","X",""]
["-","X",""]
["-","X",""]
["-","X",""]
["-","X",""]
["-","X",""]
["-","X",""]
["-","X",""]
["-","X",""]
["-","X",""]
["-","X",""]
["-","X",""]
["-","X",""]
["-","X",""]
["-","X",""]
["-","X",""]
["-","X",""]
["-","X",""]
["-","X",""]
["-","X",""]
["-","X",""]
["-","X",""]
["-","X",""]
["-","X",""]
["-","X",{"$f":"IF(ISERROR(VLOOKUP(A4508,Base_suivi_MPR,1,FALSE)),\"\",\"X\")","v":""}]
["-","X",""]
["-","X",""]
["-","X",""]
["-","X",""]
["-",{"$f":"IF(J4511=K4511,\"X\",\"\")","v":"X"},""]
["-","X",""]
["-","X",""]
["-","X",""]
["-","X",""]
["-","X",""]
["-","X",""]
["-","X",""]
["-","X",""]
["-","X",""]
["-","X",""]
["-","X",""]
["-","X",""]
["-","X",""]
["-","X",""]
[{"$f":"CONCATENATE(D4526,\"-\",E4526)","v":"-"},"X",""]
["-","X",""]
["-","X",""]
["-","X",""]
["-","X",""]
["-","X",""]
["-","X",""]
["-","X",""]
["-","X",""]
["-","X",""]
["-","X",""]
["-","X",""]
["-","X",""]
["-","X",""]
["-","X",""]
["-","X",""]
["-","X",""]
["-","X",""]
["-","X",""]
["-","X",""]
["-","X",""]
["-","X",""]
["-","X",""]
["-","X",""]
["-","X",""]
["-","X",""]
["-","X",""]
["-","X",""]
["-","X",""]
["-","X",""]
["-","X",""]
["-","X",""]
["-","X",""]
["-","X",""]
["-","X",""]
["-","X",""]
["-","X",""]
["-","X",""]
["-","X",""]
["-","X",""]
["-","X",""]
["-","X",""]
["-","X",""]
["-","X",""]
["-","X",{"$f":"IF(ISERROR(VLOOKUP(A4572,Base_suivi_MPR,1,FALSE)),\"\",\"X\")","v":""}]
["-","X",""]
["-","X",""]
["-","X",""]
["-","X",""]
["-",{"$f":"IF(J4575=K4575,\"X\",\"\")","v":"X"},""]
["-","X",""]
["-","X",""]
["-","X",""]
["-","X",""]
["-","X",""]
["-","X",""]
["-","X",""]
["-","X",""]
["-","X",""]
["-","X",""]
["-","X",""]
["-","X",""]
["-","X",""]
["-","X",""]
[{"$f":"CONCATENATE(D4590,\"-\",E4590)","v":"-"},"X",""]
["-","X",""]
["-","X",""]
["-","X",""]
["-","X",""]
["-","X",""]
["-","X",""]
["-","X",""]
["-","X",""]
["-","X",""]
["-","X",""]
["-","X",""]
["-","X",""]
["-","X",""]
["-","X",""]
["-","X",""]
["-","X",""]
["-","X",""]
["-","X",""]
["-","X",""]
["-","X",""]
["-","X",""]
["-","X",""]
["-","X",""]
["-","X",""]
["-","X",""]
["-","X",""]
["-","X",""]
["-","X",""]
["-","X",""]
["-","X",""]
["-","X",""]
["-","X",""]
["-","X",""]
["-","X",""]
["-","X",""]
["-","X",""]
["-","X",""]
["-","X",""]
["-","X",""]
["-","X",""]
["-","X",""]
["-","X",""]
["-","X",""]
["-","X",{"$f":"IF(ISERROR(VLOOKUP(A4636,Base_suivi_MPR,1,FALSE)),\"\",\"X\")","v":""}]
["-","X",""]
["-","X",""]
["-","X",""]
["-","X",""]
["-",{"$f":"IF(J4639=K4639,\"X\",\"\")","v":"X"},""]
["-","X",""]
["-","X",""]
["-","X",""]
["-","X",""]
["-","X",""]
["-","X",""]
["-","X",""]
["-","X",""]
["-","X",""]
["-","X",""]
["-","X",""]
["-","X",""]
["-","X",""]
["-","X",""]
[{"$f":"CONCATENATE(D4654,\"-\",E4654)","v":"-"},"X",""]
["-","X",""]
["-","X",""]
["-","X",""]
["-","X",""]
["-","X",""]
["-","X",""]
["-","X",""]
["-","X",""]
["-","X",""]
["-","X",""]
["-","X",""]
["-","X",""]
["-","X",""]
["-","X",""]
["-","X",""]
["-","X",""]
["-","X",""]
["-","X",""]
["-","X",""]
["-","X",""]
["-","X",""]
["-","X",""]
["-","X",""]
["-","X",""]
["-","X",""]
["-","X",""]
["-","X",""]
["-","X",""]
["-","X",""]
["-","X",""]
["-","X",""]
["-","X",""]
["-","X",""]
["-","X",""]
["-","X",""]
["-","X",""]
["-","X",""]
["-","X",""]
["-","X",""]
["-","X",""]
["-","X",""]
["-","X",""]
["-","X",""]
["-","X",{"$f":"IF(ISERROR(VLOOKUP(A4700,Base_suivi_MPR,1,FALSE)),\"\",\"X\")","v":""}]
["-","X",""]
["-","X",""]
["-","X",""]
["-","X",""]
["-",{"$f":"IF(J4703=K4703,\"X\",\"\")","v":"X"},""]
["-","X",""]
["-","X",""]
["-","X",""]
["-","X",""]
["-","X",""]
["-","X",""]
["-","X",""]
["-","X",""]
["-","X",""]
["-","X",""]
["-","X",""]
["-","X",""]
["-","X",""]
["-","X",""]
[{"$f":"CONCATENATE(D4718,\"-\",E4718)","v":"-"},"X",""]
["-","X",""]
["-","X",""]
["-","X",""]
["-","X",""]
["-","X",""]
["-","X",""]
["-","X",""]
["-","X",""]
["-","X",""]
["-","X",""]
["-","X",""]
["-","X",""]
["-","X",""]
["-","X",""]
["-","X",""]
["-","X",""]
["-","X",""]
["-","X",""]
["-","X",""]
["-","X",""]
["-","X",""]
["-","X",""]
["-","X",""]
["-","X",""]
["-","X",""]
["-","X",""]
["-","X",""]
["-","X",""]
["-","X",""]
["-","X",""]
["-","X",""]
["-","X",""]
["-","X",""]
["-","X",""]
["-","X",""]
["-","X",""]
["-","X",""]
["-","X",""]
["-","X",""]
["-","X",""]
["-","X",""]
["-","X",""]
["-","X",""]
["-","X",{"$f":"IF(ISERROR(VLOOKUP(A4764,Base_suivi_MPR,1,FALSE)),\"\",\"X\")","v":""}]
["-","X",""]
["-","X",""]
["-","X",""]
["-","X",""]
["-",{"$f":"IF(J4767=K4767,\"X\",\"\")","v":"X"},""]
["-","X",""]
["-","X",""]
["-","X",""]
["-","X",""]
["-","X",""]
["-","X",""]
["-","X",""]
["-","X",""]
["-","X",""]
["-","X",""]
["-","X",""]
["-","X",""]
["-","X",""]
["-","X",""]
[{"$f":"CONCATENATE(D4782,\"-\",E4782)","v":"-"},"X",""]
["-","X",""]
["-","X",""]
["-","X",""]
["-","X",""]
["-","X",""]
["-","X",""]
["-","X",""]
["-","X",""]
["-","X",""]
["-","X",""]
["-","X",""]
["-","X",""]
["-","X",""]
["-","X",""]
["-","X",""]
["-","X",""]
["-","X",""]
["-","X",""]
["-","X",""]
["-","X",""]
["-","X",""]
["-","X",""]
["-","X",""]
["-","X",""]
["-","X",""]
["-","X",""]
["-","X",""]
["-","X",""]
["-","X",""]
["-","X",""]
["-","X",""]
["-","X",""]
["-","X",""]
["-","X",""]
["-","X",""]
["-","X",""]
["-","X",""]
["-","X",""]
["-","X",""]
["-","X",""]
["-","X",""]
["-","X",""]
["-","X",""]
["-","X",{"$f":"IF(ISERROR(VLOOKUP(A4828,Base_suivi_MPR,1,FALSE)),\"\",\"X\")","v":""}]
["-","X",""]
["-","X",""]
["-","X",""]
["-","X",""]
["-",{"$f":"IF(J4831=K4831,\"X\",\"\")","v":"X"},""]
["-","X",""]
["-","X",""]
["-","X",""]
["-","X",""]
["-","X",""]
["-","X",""]
["-","X",""]
["-","X",""]
["-","X",""]
["-","X",""]
["-","X",""]
["-","X",""]
["-","X",""]
["-","X",""]
[{"$f":"CONCATENATE(D4846,\"-\",E4846)","v":"-"},"X",""]
["-","X",""]
["-","X",""]
["-","X",""]
["-","X",""]
["-","X",""]
["-","X",""]
["-","X",""]
["-","X",""]
["-","X",""]
["-","X",""]
["-","X",""]
["-","X",""]
["-","X",""]
["-","X",""]
["-","X",""]
["-","X",""]
["-","X",""]
["-","X",""]
["-","X",""]
["-","X",""]
["-","X",""]
["-","X",""]
["-","X",""]
["-","X",""]
["-","X",""]
["-","X",""]
["-","X",""]
["-","X",""]
["-","X",""]
["-","X",""]
["-","X",""]
["-","X",""]
["-","X",""]
["-","X",""]
["-","X",""]
["-","X",""]
["-","X",""]
["-","X",""]
["-","X",""]
["-","X",""]
["-","X",""]
["-","X",""]
["-","X",""]
["-","X",{"$f":"IF(ISERROR(VLOOKUP(A4892,Base_suivi_MPR,1,FALSE)),\"\",\"X\")","v":""}]
["-","X",""]
["-","X",""]
["-","X",""]
["-","X",""]
["-",{"$f":"IF(J4895=K4895,\"X\",\"\")","v":"X"},""]
["-","X",""]
["-","X",""]
["-","X",""]
["-","X",""]
["-","X",""]
["-","X",""]
["-","X",""]
["-","X",""]
["-","X",""]
["-","X",""]
["-","X",""]
["-","X",""]
["-","X",""]
["-","X",""]
[{"$f":"CONCATENATE(D4910,\"-\",E4910)","v":"-"},"X",""]
["-","X",""]
["-","X",""]
["-","X",""]
["-","X",""]
["-","X",""]
["-","X",""]
["-","X",""]
["-","X",""]
["-","X",""]
["-","X",""]
["-","X",""]
["-","X",""]
["-","X",""]
["-","X",""]
["-","X",""]
["-","X",""]
["-","X",""]
["-","X",""]
["-","X",""]
["-","X",""]
["-","X",""]
["-","X",""]
["-","X",""]
["-","X",""]
["-","X",""]
["-","X",""]
["-","X",""]
["-","X",""]
["-","X",""]
["-","X",""]
["-","X",""]
["-","X",""]
["-","X",""]
["-","X",""]
["-","X",""]
["-","X",""]
["-","X",""]
["-","X",""]
["-","X",""]
["-","X",""]
["-","X",""]
["-","X",""]
["-","X",""]
["-","X",{"$f":"IF(ISERROR(VLOOKUP(A4956,Base_suivi_MPR,1,FALSE)),\"\",\"X\")","v":""}]
["-","X",""]
["-","X",""]
["-","X",""]
["-","X",""]
["-",{"$f":"IF(J4959=K4959,\"X\",\"\")","v":"X"},""]
["-","X",""]
["-","X",""]
["-","X",""]
["-","X",""]
["-","X",""]
["-","X",""]
["-","X",""]
["-","X",""]
["-","X",""]
["-","X",""]
["-","X",""]
["-","X",""]
["-","X",""]
["-","X",""]
[{"$f":"CONCATENATE(D4974,\"-\",E4974)","v":"-"},"X",""]
["-","X",""]
["-","X",""]
["-","X",""]
["-","X",""]
["-","X",""]
["-","X",""]
["-","X",""]
["-","X",""]
["-","X",""]
["-","X",""]
["-","X",""]
["-","X",""]
["-","X",""]
["-","X",""]
["-","X",""]
["-","X",""]
["-","X",""]
["-","X",""]
["-","X",""]
["-","X",""]
["-","X",""]
["-","X",""]
["-","X",""]
["-","X",""]
["-","X",""]
["-","X",""]
["-","X",""]
["-","X",""]
["-","X",""]
["-","X",""]
["-","X",""]
["-","X",""]
["-","X",""]
["-","X",""]
["-","X",""]
["-","X",""]
["-","X",""]
["-","X",""]
["-","X",""]
["-","X",""]
["-","X",""]
["-","X",""]
["-","X",""]
["-","X",{"$f":"IF(ISERROR(VLOOKUP(A5020,Base_suivi_MPR,1,FALSE)),\"\",\"X\")","v":""}]
["-","X",""]
["-","X",""]
["-","X",""]
["-","X",""]
["-",{"$f":"IF(J5023=K5023,\"X\",\"\")","v":"X"},""]
["-","X",""]
["-","X",""]
["-","X",""]
["-","X",""]
["-","X",""]
["-","X",""]
["-","X",""]
["-","X",""]
["-","X",""]
["-","X",""]
["-","X",""]
["-","X",""]
["-","X",""]
["-","X",""]
[{"$f":"CONCATENATE(D5038,\"-\",E5038)","v":"-"},"X",""]
["-","X",""]
["-","X",""]
["-","X",""]
["-","X",""]
["-","X",""]
["-","X",""]
["-","X",""]
["-","X",""]
["-","X",""]
["-","X",""]
["-","X",""]
["-","X",""]
["-","X",""]
["-","X",""]
["-","X",""]
["-","X",""]
["-","X",""]
["-","X",""]
["-","X",""]
["-","X",""]
["-","X",""]
["-","X",""]
["-","X",""]
["-","X",""]
["-","X",""]
["-","X",""]
["-","X",""]
["-","X",""]
["-","X",""]
["-","X",""]
["-","X",""]
["-","X",""]
["-","X",""]
["-","X",""]
["-","X",""]
["-","X",""]
["-","X",""]
["-","X",""]
["-","X",""]
["-","X",""]
["-","X",""]
["-","X",""]
["-","X",""]
["-","X",{"$f":"IF(ISERROR(VLOOKUP(A5084,Base_suivi_MPR,1,FALSE)),\"\",\"X\")","v":""}]
["-","X",""]
["-","X",""]
["-","X",""]
["-","X",""]
["-",{"$f":"IF(J5087=K5087,\"X\",\"\")","v":"X"},""]
["-","X",""]
["-","X",""]
["-","X",""]
["-","X",""]
["-","X",""]
["-","X",""]
["-","X",""]
["-","X",""]
["-","X",""]
["-","X",""]
["-","X",""]
["-","X",""]
["-","X",""]
["-","X",""]
[{"$f":"CONCATENATE(D5102,\"-\",E5102)","v":"-"},"X",""]
["-","X",""]
["-","X",""]
["-","X",""]
["-","X",""]
["-","X",""]
["-","X",""]
["-","X",""]
["-","X",""]
["-","X",""]
["-","X",""]
["-","X",""]
["-","X",""]
["-","X",""]
["-","X",""]
["-","X",""]
["-","X",""]
["-","X",""]
["-","X",""]
["-","X",""]
["-","X",""]
["-","X",""]
["-","X",""]
["-","X",""]
["-","X",""]
["-","X",""]
["-","X",""]
["-","X",""]
["-","X",""]
["-","X",""]
["-","X",""]
["-","X",""]
["-","X",""]
["-","X",""]
["-","X",""]
["-","X",""]
["-","X",""]
["-","X",""]
["-","X",""]
["-","X",""]
["-","X",""]
["-","X",""]
["-","X",""]
["-","X",""]
["-","X",{"$f":"IF(ISERROR(VLOOKUP(A5148,Base_suivi_MPR,1,FALSE)),\"\",\"X\")","v":""}]
["-","X",""]
["-","X",""]
["-","X",""]
["-","X",""]
["-",{"$f":"IF(J5151=K5151,\"X\",\"\")","v":"X"},""]
["-","X",""]
["-","X",""]
["-","X",""]
["-","X",""]
["-","X",""]
["-","X",""]
["-","X",""]
["-","X",""]
["-","X",""]
["-","X",""]
["-","X",""]
["-","X",""]
["-","X",""]
["-","X",""]
[{"$f":"CONCATENATE(D5166,\"-\",E5166)","v":"-"},"X",""]
["-","X",""]
["-","X",""]
["-","X",""]
["-","X",""]
["-","X",""]
["-","X",""]
["-","X",""]
["-","X",""]
["-","X",""]
["-","X",""]
["-","X",""]
["-","X",""]
["-","X",""]
["-","X",""]
["-","X",""]
["-","X",""]
["-","X",""]
["-","X",""]
["-","X",""]
["-","X",""]
["-","X",""]
["-","X",""]
["-","X",""]
["-","X",""]
["-","X",""]
["-","X",""]
["-","X",""]
["-","X",""]
["-","X",""]
["-","X",""]
["-","X",""]
["-","X",""]
["-","X",""]
["-","X",""]
["-","X",""]
["-","X",""]
["-","X",""]
["-","X",""]
["-","X",""]
["-","X",""]
["-","X",""]
["-","X",""]
["-","X",""]
["-","X",{"$f":"IF(ISERROR(VLOOKUP(A5212,Base_suivi_MPR,1,FALSE)),\"\",\"X\")","v":""}]
["-","X",""]
["-","X",""]
["-","X",""]
["-","X",""]
["-",{"$f":"IF(J5215=K5215,\"X\",\"\")","v":"X"},""]
["-","X",""]
["-","X",""]
["-","X",""]
["-","X",""]
["-","X",""]
["-","X",""]
["-","X",""]
["-","X",""]
["-","X",""]
["-","X",""]
["-","X",""]
["-","X",""]
["-","X",""]
["-","X",""]
[{"$f":"CONCATENATE(D5230,\"-\",E5230)","v":"-"},"X",""]
["-","X",""]
["-","X",""]
["-","X",""]
["-","X",""]
["-","X",""]
["-","X",""]
["-","X",""]
["-","X",""]
["-","X",""]
["-","X",""]
["-","X",""]
["-","X",""]
["-","X",""]
["-","X",""]
["-","X",""]
["-","X",""]
["-","X",""]
["-","X",""]
["-","X",""]
["-","X",""]
["-","X",""]
["-","X",""]
["-","X",""]
["-","X",""]
["-","X",""]
["-","X",""]
["-","X",""]
["-","X",""]
["-","X",""]
["-","X",""]
["-","X",""]
["-","X",""]
["-","X",""]
["-","X",""]
["-","X",""]
["-","X",""]
["-","X",""]
["-","X",""]
["-","X",""]
["-","X",""]
["-","X",""]
["-","X",""]
["-","X",""]
["-","X",{"$f":"IF(ISERROR(VLOOKUP(A5276,Base_suivi_MPR,1,FALSE)),\"\",\"X\")","v":""}]
["-","X",""]
["-","X",""]
["-","X",""]
["-","X",""]
["-",{"$f":"IF(J5279=K5279,\"X\",\"\")","v":"X"},""]
["-","X",""]
["-","X",""]
["-","X",""]
["-","X",""]
["-","X",""]
["-","X",""]
["-","X",""]
["-","X",""]
["-","X",""]
["-","X",""]
["-","X",""]
["-","X",""]
["-","X",""]
["-","X",""]
[{"$f":"CONCATENATE(D5294,\"-\",E5294)","v":"-"},"X",""]
["-","X",""]
["-","X",""]
["-","X",""]
["-","X",""]
["-","X",""]
["-","X",""]
["-","X",""]
["-","X",""]
["-","X",""]
["-","X",""]
["-","X",""]
["-","X",""]
["-","X",""]
["-","X",""]
["-","X",""]
["-","X",""]
["-","X",""]
["-","X",""]
["-","X",""]
["-","X",""]
["-","X",""]
["-","X",""]
["-","X",""]
["-","X",""]
["-","X",""]
["-","X",""]
["-","X",""]
["-","X",""]
["-","X",""]
["-","X",""]
["-","X",""]
["-","X",""]
["-","X",""]
["-","X",""]
["-","X",""]
["-","X",""]
["-","X",""]
["-","X",""]
["-","X",""]
["-","X",""]
["-","X",""]
["-","X",""]
["-","X",""]
["-","X",{"$f":"IF(ISERROR(VLOOKUP(A5340,Base_suivi_MPR,1,FALSE)),\"\",\"X\")","v":""}]
["-","X",""]
["-","X",""]
["-","X",""]
["-","X",""]
["-",{"$f":"IF(J5343=K5343,\"X\",\"\")","v":"X"},""]
["-","X",""]
["-","X",""]
["-","X",""]
["-","X",""]
["-","X",""]
["-","X",""]
["-","X",""]
["-","X",""]
["-","X",""]
["-","X",""]
["-","X",""]
["-","X",""]
["-","X",""]
["-","X",""]
[{"$f":"CONCATENATE(D5358,\"-\",E5358)","v":"-"},"X",""]
["-","X",""]
["-","X",""]
["-","X",""]
["-","X",""]
["-","X",""]
["-","X",""]
["-","X",""]
["-","X",""]
["-","X",""]
["-","X",""]
["-","X",""]
["-","X",""]
["-","X",""]
["-","X",""]
["-","X",""]
["-","X",""]
["-","X",""]
["-","X",""]
["-","X",""]
["-","X",""]
["-","X",""]
["-","X",""]
["-","X",""]
["-","X",""]
["-","X",""]
["-","X",""]
["-","X",""]
["-","X",""]
["-","X",""]
["-","X",""]
["-","X",""]
["-","X",""]
["-","X",""]
["-","X",""]
["-","X",""]
["-","X",""]
["-","X",""]
["-","X",""]
["-","X",""]
["-","X",""]
["-","X",""]
["-","X",""]
["-","X",""]
["-","X",{"$f":"IF(ISERROR(VLOOKUP(A5404,Base_suivi_MPR,1,FALSE)),\"\",\"X\")","v":""}]
["-","X",""]
["-","X",""]
["-","X",""]
["-","X",""]
["-",{"$f":"IF(J5407=K5407,\"X\",\"\")","v":"X"},""]
["-","X",""]
["-","X",""]
["-","X",""]
["-","X",""]
["-","X",""]
["-","X",""]
["-","X",""]
["-","X",""]
["-","X",""]
["-","X",""]
["-","X",""]
["-","X",""]
["-","X",""]
["-","X",""]
[{"$f":"CONCATENATE(D5422,\"-\",E5422)","v":"-"},"X",""]
["-","X",""]
["-","X",""]
["-","X",""]
["-","X",""]
["-","X",""]
["-","X",""]
["-","X",""]
["-","X",""]
["-","X",""]
["-","X",""]
["-","X",""]
["-","X",""]
["-","X",""]
["-","X",""]
["-","X",""]
["-","X",""]
["-","X",""]
["-","X",""]
["-","X",""]
["-","X",""]
["-","X",""]
["-","X",""]
["-","X",""]
["-","X",""]
["-","X",""]
["-","X",""]
["-","X",""]
["-","X",""]
["-","X",""]
["-","X",""]
["-","X",""]
["-","X",""]
["-","X",""]
["-","X",""]
["-","X",""]
["-","X",""]
["-","X",""]
["-","X",""]
["-","X",""]
["-","X",""]
["-","X",""]
["-","X",""]
["-","X",""]
["-","X",{"$f":"IF(ISERROR(VLOOKUP(A5468,Base_suivi_MPR,1,FALSE)),\"\",\"X\")","v":""}]
["-","X",""]
["-","X",""]
["-","X",""]
["-","X",""]
["-",{"$f":"IF(J5471=K5471,\"X\",\"\")","v":"X"},""]
["-","X",""]
["-","X",""]
["-","X",""]
["-","X",""]
["-","X",""]
["-","X",""]
["-","X",""]
["-","X",""]
["-","X",""]
["-","X",""]
["-","X",""]
["-","X",""]
["-","X",""]
["-","X",""]
[{"$f":"CONCATENATE(D5486,\"-\",E5486)","v":"-"},"X",""]
["-","X",""]
["-","X",""]
["-","X",""]
["-","X",""]
["-","X",""]
["-","X",""]
["-","X",""]
["-","X",""]
["-","X",""]
["-","X",""]
["-","X",""]
["-","X",""]
["-","X",""]
["-","X",""]
["-","X",""]
["-","X",""]
["-","X",""]
["-","X",""]
["-","X",""]
["-","X",""]
["-","X",""]
["-","X",""]
["-","X",""]
["-","X",""]
["-","X",""]
["-","X",""]
["-","X",""]
["-","X",""]
["-","X",""]
["-","X",""]
["-","X",""]
["-","X",""]
["-","X",""]
["-","X",""]
["-","X",""]
["-","X",""]
["-","X",""]
["-","X",""]
["-","X",""]
["-","X",""]
["-","X",""]
["-","X",""]
["-","X",""]
["-","X",{"$f":"IF(ISERROR(VLOOKUP(A5532,Base_suivi_MPR,1,FALSE)),\"\",\"X\")","v":""}]
["-","X",""]
["-","X",""]
["-","X",""]
["-","X",""]
["-",{"$f":"IF(J5535=K5535,\"X\",\"\")","v":"X"},""]
["-","X",""]
["-","X",""]
["-","X",""]
["-","X",""]
["-","X",""]
["-","X",""]
["-","X",""]
["-","X",""]
["-","X",""]
["-","X",""]
["-","X",""]
["-","X",""]
["-","X",""]
["-","X",""]
[{"$f":"CONCATENATE(D5550,\"-\",E5550)","v":"-"},"X",""]
["-","X",""]
["-","X",""]
["-","X",""]
["-","X",""]
["-","X",""]
["-","X",""]
["-","X",""]
["-","X",""]
["-","X",""]
["-","X",""]
["-","X",""]
["-","X",""]
["-","X",""]
["-","X",""]
["-","X",""]
["-","X",""]
["-","X",""]
["-","X",""]
["-","X",""]
["-","X",""]
["-","X",""]
["-","X",""]
["-","X",""]
["-","X",""]
["-","X",""]
["-","X",""]
["-","X",""]
["-","X",""]
["-","X",""]
["-","X",""]
["-","X",""]
["-","X",""]
["-","X",""]
["-","X",""]
["-","X",""]
["-","X",""]
["-","X",""]
["-","X",""]
["-","X",""]
["-","X",""]
["-","X",""]
["-","X",""]
["-","X",""]
["-","X",{"$f":"IF(ISERROR(VLOOKUP(A5596,Base_suivi_MPR,1,FALSE)),\"\",\"X\")","v":""}]
["-","X",""]
["-","X",""]
["-","X",""]
["-","X",""]
["-",{"$f":"IF(J5599=K5599,\"X\",\"\")","v":"X"},""]
["-","X",""]
["-","X",""]
["-","X",""]
["-","X",""]
["-","X",""]
["-","X",""]
["-","X",""]
["-","X",""]
["-","X",""]
["-","X",""]
["-","X",""]
["-","X",""]
["-","X",""]
["-","X",""]
[{"$f":"CONCATENATE(D5614,\"-\",E5614)","v":"-"},"X",""]
["-","X",""]
["-","X",""]
["-","X",""]
["-","X",""]
["-","X",""]
["-","X",""]
["-","X",""]
["-","X",""]
["-","X",""]
["-","X",""]
["-","X",""]
["-","X",""]
["-","X",""]
["-","X",""]
["-","X",""]
["-","X",""]
["-","X",""]
["-","X",""]
["-","X",""]
["-","X",""]
["-","X",""]
["-","X",""]
["-","X",""]
["-","X",""]
["-","X",""]
["-","X",""]
["-","X",""]
["-","X",""]
["-","X",""]
["-","X",""]
["-","X",""]
["-","X",""]
["-","X",""]
["-","X",""]
["-","X",""]
["-","X",""]
["-","X",""]
["-","X",""]
["-","X",""]
["-","X",""]
["-","X",""]
["-","X",""]
["-","X",""]
["-","X",{"$f":"IF(ISERROR(VLOOKUP(A5660,Base_suivi_MPR,1,FALSE)),\"\",\"X\")","v":""}]
["-","X",""]
["-","X",""]
["-","X",""]
["-","X",""]
["-",{"$f":"IF(J5663=K5663,\"X\",\"\")","v":"X"},""]
["-","X",""]
["-","X",""]
["-","X",""]
["-","X",""]
["-","X",""]
["-","X",""]
["-","X",""]
["-","X",""]
["-","X",""]
["-","X",""]
["-","X",""]
["-","X",""]
["-","X",""]
["-","X",""]
[{"$f":"CONCATENATE(D5678,\"-\",E5678)","v":"-"},"X",""]
["-","X",""]
["-","X",""]
["-","X",""]
["-","X",""]
["-","X",""]
["-","X",""]
["-","X",""]
["-","X",""]
["-","X",""]
["-","X",""]
["-","X",""]
["-","X",""]
["-","X",""]
["-","X",""]
["-","X",""]
["-","X",""]
["-","X",""]
["-","X",""]
["-","X",""]
["-","X",""]
["-","X",""]
["-","X",""]
["-","X",""]
["-","X",""]
["-","X",""]
["-","X",""]
["-","X",""]
["-","X",""]
["-","X",""]
["-","X",""]
["-","X",""]
["-","X",""]
["-","X",""]
["-","X",""]
["-","X",""]
["-","X",""]
["-","X",""]
["-","X",""]
["-","X",""]
["-","X",""]
["-","X",""]
["-","X",""]
["-","X",""]
["-","X",{"$f":"IF(ISERROR(VLOOKUP(A5724,Base_suivi_MPR,1,FALSE)),\"\",\"X\")","v":""}]
["-","X",""]
["-","X",""]
["-","X",""]
["-","X",""]
["-",{"$f":"IF(J5727=K5727,\"X\",\"\")","v":"X"},""]
["-","X",""]
["-","X",""]
["-","X",""]
["-","X",""]
["-","X",""]
["-","X",""]
["-","X",""]
["-","X",""]
["-","X",""]
["-","X",""]
["-","X",""]
["-","X",""]
["-","X",""]
["-","X",""]
[{"$f":"CONCATENATE(D5742,\"-\",E5742)","v":"-"},"X",""]
["-","X",""]
["-","X",""]
["-","X",""]
["-","X",""]
["-","X",""]
["-","X",""]
["-","X",""]
["-","X",""]
["-","X",""]
["-","X",""]
["-","X",""]
["-","X",""]
["-","X",""]
["-","X",""]
["-","X",""]
["-","X",""]
["-","X",""]
["-","X",""]
["-","X",""]
["-","X",""]
["-","X",""]
["-","X",""]
["-","X",""]
["-","X",""]
["-","X",""]
["-","X",""]
["-","X",""]
["-","X",""]
["-","X",""]
["-","X",""]
["-","X",""]
["-","X",""]
["-","X",""]
["-","X",""]
["-","X",""]
["-","X",""]
["-","X",""]
["-","X",""]
["-","X",""]
["-","X",""]
["-","X",""]
["-","X",""]
["-","X",""]
["-","X",{"$f":"IF(ISERROR(VLOOKUP(A5788,Base_suivi_MPR,1,FALSE)),\"\",\"X\")","v":""}]
["-","X",""]
["-","X",""]
["-","X",""]
["-","X",""]
["-",{"$f":"IF(J5791=K5791,\"X\",\"\")","v":"X"},""]
["-","X",""]
["-","X",""]
["-","X",""]
["-","X",""]
["-","X",""]
["-","X",""]
["-","X",""]
["-","X",""]
["-","X",""]
["-","X",""]
["-","X",""]
["-","X",""]
["-","X",""]
["-","X",""]
[{"$f":"CONCATENATE(D5806,\"-\",E5806)","v":"-"},"X",""]
["-","X",""]
["-","X",""]
["-","X",""]
["-","X",""]
["-","X",""]
["-","X",""]
["-","X",""]
["-","X",""]
["-","X",""]
["-","X",""]
["-","X",""]
["-","X",""]
["-","X",""]
["-","X",""]
["-","X",""]
["-","X",""]
["-","X",""]
["-","X",""]
["-","X",""]
["-","X",""]
["-","X",""]
["-","X",""]
["-","X",""]
["-","X",""]
["-","X",""]
["-","X",""]
["-","X",""]
["-","X",""]
["-","X",""]
["-","X",""]
["-","X",""]
["-","X",""]
["-","X",""]
["-","X",""]
["-","X",""]
["-","X",""]
["-","X",""]
["-","X",""]
["-","X",""]
["-","X",""]
["-","X",""]
["-","X",""]
["-","X",""]
["-","X",{"$f":"IF(ISERROR(VLOOKUP(A5852,Base_suivi_MPR,1,FALSE)),\"\",\"X\")","v":""}]
["-","X",""]
["-","X",""]
["-","X",""]
["-","X",""]
["-",{"$f":"IF(J5855=K5855,\"X\",\"\")","v":"X"},""]
["-","X",""]
["-","X",""]
["-","X",""]
["-","X",""]
["-","X",""]
["-","X",""]
["-","X",""]
["-","X",""]
["-","X",""]
["-","X",""]
["-","X",""]
["-","X",""]
["-","X",""]
["-","X",""]
[{"$f":"CONCATENATE(D5870,\"-\",E5870)","v":"-"},"X",""]
["-","X",""]
["-","X",""]
["-","X",""]
["-","X",""]
["-","X",""]
["-","X",""]
["-","X",""]
["-","X",""]
["-","X",""]
["-","X",""]
["-","X",""]
["-","X",""]
["-","X",""]
["-","X",""]
["-","X",""]
["-","X",""]
["-","X",""]
["-","X",""]
["-","X",""]
["-","X",""]
["-","X",""]
["-","X",""]
["-","X",""]
["-","X",""]
["-","X",""]
["-","X",""]
["-","X",""]
["-","X",""]
["-","X",""]
["-","X",""]
["-","X",""]
["-","X",""]
["-","X",""]
["-","X",""]
["-","X",""]
["-","X",""]
["-","X",""]
["-","X",""]
["-","X",""]
["-","X",""]
["-","X",""]
["-","X",""]
["-","X",""]
["-","X",{"$f":"IF(ISERROR(VLOOKUP(A5916,Base_suivi_MPR,1,FALSE)),\"\",\"X\")","v":""}]
["-","X",""]
["-","X",""]
["-","X",""]
["-","X",""]
["-",{"$f":"IF(J5919=K5919,\"X\",\"\")","v":"X"},""]
["-","X",""]
["-","X",""]
["-","X",""]
["-","X",""]
["-","X",""]
["-","X",""]
["-","X",""]
["-","X",""]
["-","X",""]
["-","X",""]
["-","X",""]
["-","X",""]
["-","X",""]
["-","X",""]
[{"$f":"CONCATENATE(D5934,\"-\",E5934)","v":"-"},"X",""]
["-","X",""]
["-","X",""]
["-","X",""]
["-","X",""]
["-","X",""]
["-","X",""]
["-","X",""]
["-","X",""]
["-","X",""]
["-","X",""]
["-","X",""]
["-","X",""]
["-","X",""]
["-","X",""]
["-","X",""]
["-","X",""]
["-","X",""]
["-","X",""]
["-","X",""]
["-","X",""]
["-","X",""]
["-","X",""]
["-","X",""]
["-","X",""]
["-","X",""]
["-","X",""]
["-","X",""]
["-","X",""]
["-","X",""]
["-","X",""]
["-","X",""]
["-","X",""]
["-","X",""]
["-","X",""]
["-","X",""]
["-","X",""]
["-","X",""]
["-","X",""]
["-","X",""]
["-","X",""]
["-","X",""]
["-","X",""]
["-","X",""]
["-","X",{"$f":"IF(ISERROR(VLOOKUP(A5980,Base_suivi_MPR,1,FALSE)),\"\",\"X\")","v":""}]
["-","X",""]
["-","X",""]
["-","X",""]
["-","X",""]
["-",{"$f":"IF(J5983=K5983,\"X\",\"\")","v":"X"},""]
["-","X",""]
["-","X",""]
["-","X",""]
["-","X",""]
["-","X",""]
["-","X",""]
["-","X",""]
["-","X",""]
["-","X",""]
["-","X",""]
["-","X",""]
["-","X",""]
["-","X",""]
["-","X",""]
[{"$f":"CONCATENATE(D5998,\"-\",E5998)","v":"-"},"X",""]
["-","X",""]
["-","X",""]
["-","X",""]
["-","X",""]
["-","X",""]
["-","X",""]
["-","X",""]
["-","X",""]
["-","X",""]
["-","X",""]
["-","X",""]
["-","X",""]
["-","X",""]
["-","X",""]
["-","X",""]
["-","X",""]
["-","X",""]
["-","X",""]
["-","X",""]
["-","X",""]
["-","X",""]
["-","X",""]
["-","X",""]
["-","X",""]
["-","X",""]
["-","X",""]
["-","X",""]
["-","X",""]
["-","X",""]
["-","X",""]
["-","X",""]
["-","X",""]
["-","X",""]
["-","X",""]
["-","X",""]
["-","X",""]
["-","X",""]
["-","X",""]
["-","X",""]
["-","X",""]
["-","X",""]
["-","X",""]
["-","X",""]
["-","X",{"$f":"IF(ISERROR(VLOOKUP(A6044,Base_suivi_MPR,1,FALSE)),\"\",\"X\")","v":""}]
["-","X",""]
["-","X",""]
["-","X",""]
["-","X",""]
["-",{"$f":"IF(J6047=K6047,\"X\",\"\")","v":"X"},""]
["-","X",""]
["-","X",""]
["-","X",""]
["-","X",""]
["-","X",""]
["-","X",""]
["-","X",""]
["-","X",""]
["-","X",""]
["-","X",""]
["-","X",""]
["-","X",""]
["-","X",""]
["-","X",""]
[{"$f":"CONCATENATE(D6062,\"-\",E6062)","v":"-"},"X",""]
["-","X",""]
["-","X",""]
["-","X",""]
["-","X",""]
["-","X",""]
["-","X",""]
["-","X",""]
["-","X",""]
["-","X",""]
["-","X",""]
["-","X",""]
["-","X",""]
["-","X",""]
["-","X",""]
["-","X",""]
["-","X",""]
["-","X",""]
["-","X",""]
["-","X",""]
["-","X",""]
["-","X",""]
["-","X",""]
["-","X",""]
["-","X",""]
["-","X",""]
["-","X",""]
["-","X",""]
["-","X",""]
["-","X",""]
["-","X",""]
["-","X",""]
["-","X",""]
["-","X",""]
["-","X",""]
["-","X",""]
["-","X",""]
["-","X",""]
["-","X",""]
["-","X",""]
["-","X",""]
["-","X",""]
["-","X",""]
["-","X",""]
["-","X",{"$f":"IF(ISERROR(VLOOKUP(A6108,Base_suivi_MPR,1,FALSE)),\"\",\"X\")","v":""}]
["-","X",""]
["-","X",""]
["-","X",""]
["-","X",""]
["-",{"$f":"IF(J6111=K6111,\"X\",\"\")","v":"X"},""]
["-","X",""]
["-","X",""]
["-","X",""]
["-","X",""]
["-","X",""]
["-","X",""]
["-","X",""]
["-","X",""]
["-","X",""]
["-","X",""]
["-","X",""]
["-","X",""]
["-","X",""]
["-","X",""]
[{"$f":"CONCATENATE(D6126,\"-\",E6126)","v":"-"},"X",""]
["-","X",""]
["-","X",""]
["-","X",""]
["-","X",""]
["-","X",""]
["-","X",""]
["-","X",""]
["-","X",""]
["-","X",""]
["-","X",""]
["-","X",""]
["-","X",""]
["-","X",""]
["-","X",""]
["-","X",""]
["-","X",""]
["-","X",""]
["-","X",""]
["-","X",""]
["-","X",""]
["-","X",""]
["-","X",""]
["-","X",""]
["-","X",""]
["-","X",""]
["-","X",""]
["-","X",""]
["-","X",""]
["-","X",""]
["-","X",""]
["-","X",""]
["-","X",""]
["-","X",""]
["-","X",""]
["-","X",""]
["-","X",""]
["-","X",""]
["-","X",""]
["-","X",""]
["-","X",""]
["-","X",""]
["-","X",""]
["-","X",""]
["-","X",{"$f":"IF(ISERROR(VLOOKUP(A6172,Base_suivi_MPR,1,FALSE)),\"\",\"X\")","v":""}]
["-","X",""]
["-","X",""]
["-","X",""]
["-","X",""]
["-",{"$f":"IF(J6175=K6175,\"X\",\"\")","v":"X"},""]
["-","X",""]
["-","X",""]
["-","X",""]
["-","X",""]
["-","X",""]
["-","X",""]
["-","X",""]
["-","X",""]
["-","X",""]
["-","X",""]
["-","X",""]
["-","X",""]
["-","X",""]
["-","X",""]
[{"$f":"CONCATENATE(D6190,\"-\",E6190)","v":"-"},"X",""]
["-","X",""]
["-","X",""]
["-","X",""]
["-","X",""]
["-","X",""]
["-","X",""]
["-","X",""]
["-","X",""]
["-","X",""]
["-","X",""]
["-","X",""]
["-","X",""]
["-","X",""]
["-","X",""]
["-","X",""]
["-","X",""]
["-","X",""]
["-","X",""]
["-","X",""]
["-","X",""]
["-","X",""]
["-","X",""]
["-","X",""]
["-","X",""]
["-","X",""]
["-","X",""]
["-","X",""]
["-","X",""]
["-","X",""]
["-","X",""]
["-","X",""]
["-","X",""]
["-","X",""]
["-","X",""]
["-","X",""]
["-","X",""]
["-","X",""]
["-","X",""]
["-","X",""]
["-","X",""]
["-","X",""]
["-","X",""]
["-","X",""]
["-","X",{"$f":"IF(ISERROR(VLOOKUP(A6236,Base_suivi_MPR,1,FALSE)),\"\",\"X\")","v":""}]
["-","X",""]
["-","X",""]
["-","X",""]
["-","X",""]
["-",{"$f":"IF(J6239=K6239,\"X\",\"\")","v":"X"},""]
["-","X",""]
["-","X",""]
["-","X",""]
["-","X",""]
["-","X",""]
["-","X",""]
["-","X",""]
["-","X",""]
["-","X",""]
["-","X",""]
["-","X",""]
["-","X",""]
["-","X",""]
["-","X",""]
[{"$f":"CONCATENATE(D6254,\"-\",E6254)","v":"-"},"X",""]
["-","X",""]
["-","X",""]
["-","X",""]
["-","X",""]
["-","X",""]
["-","X",""]
["-","X",""]
["-","X",""]
["-","X",""]
["-","X",""]
["-","X",""]
["-","X",""]
["-","X",""]
["-","X",""]
["-","X",""]
["-","X",""]
["-","X",""]
["-","X",""]
["-","X",""]
["-","X",""]
["-","X",""]
["-","X",""]
["-","X",""]
["-","X",""]
["-","X",""]
["-","X",""]
["-","X",""]
["-","X",""]
["-","X",""]
["-","X",""]
["-","X",""]
["-","X",""]
["-","X",""]
["-","X",""]
["-","X",""]
["-","X",""]
["-","X",""]
["-","X",""]
["-","X",""]
["-","X",""]
["-","X",""]
["-","X",""]
["-","X",""]
["-","X",{"$f":"IF(ISERROR(VLOOKUP(A6300,Base_suivi_MPR,1,FALSE)),\"\",\"X\")","v":""}]
["-","X",""]
["-","X",""]
["-","X",""]
["-","X",""]
["-",{"$f":"IF(J6303=K6303,\"X\",\"\")","v":"X"},""]
["-","X",""]
["-","X",""]
["-","X",""]
["-","X",""]
["-","X",""]
["-","X",""]
["-","X",""]
["-","X",""]
["-","X",""]
["-","X",""]
["-","X",""]
["-","X",""]
["-","X",""]
["-","X",""]
[{"$f":"CONCATENATE(D6318,\"-\",E6318)","v":"-"},"X",""]
["-","X",""]
["-","X",""]
["-","X",""]
["-","X",""]
["-","X",""]
["-","X",""]
["-","X",""]
["-","X",""]
["-","X",""]
["-","X",""]
["-","X",""]
["-","X",""]
["-","X",""]
["-","X",""]
["-","X",""]
["-","X",""]
["-","X",""]
["-","X",""]
["-","X",""]
["-","X",""]
["-","X",""]
["-","X",""]
["-","X",""]
["-","X",""]
["-","X",""]
["-","X",""]
["-","X",""]
["-","X",""]
["-","X",""]
["-","X",""]
["-","X",""]
["-","X",""]
["-","X",""]
["-","X",""]
["-","X",""]
["-","X",""]
["-","X",""]
["-","X",""]
["-","X",""]
["-","X",""]
["-","X",""]
["-","X",""]
["-","X",""]
["-","X",{"$f":"IF(ISERROR(VLOOKUP(A6364,Base_suivi_MPR,1,FALSE)),\"\",\"X\")","v":""}]
["-","X",""]
["-","X",""]
["-","X",""]
["-","X",""]
["-",{"$f":"IF(J6367=K6367,\"X\",\"\")","v":"X"},""]
["-","X",""]
["-","X",""]
["-","X",""]
["-","X",""]
["-","X",""]
["-","X",""]
["-","X",""]
["-","X",""]
["-","X",""]
["-","X",""]
["-","X",""]
["-","X",""]
["-","X",""]
["-","X",""]
[{"$f":"CONCATENATE(D6382,\"-\",E6382)","v":"-"},"X",""]
["-","X",""]
["-","X",""]
["-","X",""]
["-","X",""]
["-","X",""]
["-","X",""]
["-","X",""]
["-","X",""]
["-","X",""]
["-","X",""]
["-","X",""]
["-","X",""]
["-","X",""]
["-","X",""]
["-","X",""]
["-","X",""]
["-","X",""]
["-","X",""]
["-","X",""]
["-","X",""]
["-","X",""]
["-","X",""]
["-","X",""]
["-","X",""]
["-","X",""]
["-","X",""]
["-","X",""]
["-","X",""]
["-","X",""]
["-","X",""]
["-","X",""]
["-","X",""]
["-","X",""]
["-","X",""]
["-","X",""]
["-","X",""]
["-","X",""]
["-","X",""]
["-","X",""]
["-","X",""]
["-","X",""]
["-","X",""]
["-","X",""]
["-","X",{"$f":"IF(ISERROR(VLOOKUP(A6428,Base_suivi_MPR,1,FALSE)),\"\",\"X\")","v":""}]
["-","X",""]
["-","X",""]
["-","X",""]
["-","X",""]
["-",{"$f":"IF(J6431=K6431,\"X\",\"\")","v":"X"},""]
["-","X",""]
["-","X",""]
["-","X",""]
["-","X",""]
["-","X",""]
["-","X",""]
["-","X",""]
["-","X",""]
["-","X",""]
["-","X",""]
["-","X",""]
["-","X",""]
["-","X",""]
["-","X",""]
[{"$f":"CONCATENATE(D6446,\"-\",E6446)","v":"-"},"X",""]
["-","X",""]
["-","X",""]
["-","X",""]
["-","X",""]
["-","X",""]
["-","X",""]
["-","X",""]
["-","X",""]
["-","X",""]
["-","X",""]
["-","X",""]
["-","X",""]
["-","X",""]
["-","X",""]
["-","X",""]
["-","X",""]
["-","X",""]
["-","X",""]
["-","X",""]
["-","X",""]
["-","X",""]
["-","X",""]
["-","X",""]
["-","X",""]
["-","X",""]
["-","X",""]
["-","X",""]
["-","X",""]
["-","X",""]
["-","X",""]
["-","X",""]
["-","X",""]
["-","X",""]
["-","X",""]
["-","X",""]
["-","X",""]
["-","X",""]
["-","X",""]
["-","X",""]
["-","X",""]
["-","X",""]
["-","X",""]
["-","X",""]
["-","X",{"$f":"IF(ISERROR(VLOOKUP(A6492,Base_suivi_MPR,1,FALSE)),\"\",\"X\")","v":""}]
["-","X",""]
["-","X",""]
["-","X",""]
["-","X",""]
["-",{"$f":"IF(J6495=K6495,\"X\",\"\")","v":"X"},""]
["-","X",""]
["-","X",""]
["-","X",""]
["-","X",""]
["-","X",""]
["-","X",""]
["-","X",""]
["-","X",""]
["-","X",""]
["-","X",""]
["-","X",""]
["-","X",""]
["-","X",""]
["-","X",""]
[{"$f":"CONCATENATE(D6510,\"-\",E6510)","v":"-"},"X",""]
["-","X",""]
["-","X",""]
["-","X",""]
["-","X",""]
["-","X",""]
["-","X",""]
["-","X",""]
["-","X",""]
["-","X",""]
["-","X",""]
["-","X",""]
["-","X",""]
["-","X",""]
["-","X",""]
["-","X",""]
["-","X",""]
["-","X",""]
["-","X",""]
["-","X",""]
["-","X",""]
["-","X",""]
["-","X",""]
["-","X",""]
["-","X",""]
["-","X",""]
["-","X",""]
["-","X",""]
["-","X",""]
["-","X",""]
["-","X",""]
["-","X",""]
["-","X",""]
["-","X",""]
["-","X",""]
["-","X",""]
["-","X",""]
["-","X",""]
["-","X",""]
["-","X",""]
["-","X",""]
["-","X",""]
["-","X",""]
["-","X",""]
["-","X",{"$f":"IF(ISERROR(VLOOKUP(A6556,Base_suivi_MPR,1,FALSE)),\"\",\"X\")","v":""}]
["-","X",""]
["-","X",""]
["-","X",""]
["-","X",""]
["-",{"$f":"IF(J6559=K6559,\"X\",\"\")","v":"X"},""]
["-","X",""]
["-","X",""]
["-","X",""]
["-","X",""]
["-","X",""]
["-","X",""]
["-","X",""]
["-","X",""]
["-","X",""]
["-","X",""]
["-","X",""]
["-","X",""]
["-","X",""]
["-","X",""]
[{"$f":"CONCATENATE(D6574,\"-\",E6574)","v":"-"},"X",""]
["-","X",""]
["-","X",""]
["-","X",""]
["-","X",""]
["-","X",""]
["-","X",""]
["-","X",""]
["-","X",""]
["-","X",""]
["-","X",""]
["-","X",""]
["-","X",""]
["-","X",""]
["-","X",""]
["-","X",""]
["-","X",""]
["-","X",""]
["-","X",""]
["-","X",""]
["-","X",""]
["-","X",""]
["-","X",""]
["-","X",""]
["-","X",""]
["-","X",""]
["-","X",""]
["-","X",""]
["-","X",""]
["-","X",""]
["-","X",""]
["-","X",""]
["-","X",""]
["-","X",""]
["-","X",""]
["-","X",""]
["-","X",""]
["-","X",""]
["-","X",""]
["-","X",""]
["-","X",""]
["-","X",""]
["-","X",""]
["-","X",""]
["-","X",{"$f":"IF(ISERROR(VLOOKUP(A6620,Base_suivi_MPR,1,FALSE)),\"\",\"X\")","v":""}]
["-","X",""]
["-","X",""]
["-","X",""]
["-","X",""]
["-",{"$f":"IF(J6623=K6623,\"X\",\"\")","v":"X"},""]
["-","X",""]
["-","X",""]
["-","X",""]
["-","X",""]
["-","X",""]
["-","X",""]
["-","X",""]
["-","X",""]
["-","X",""]
["-","X",""]
["-","X",""]
["-","X",""]
["-","X",""]
["-","X",""]
[{"$f":"CONCATENATE(D6638,\"-\",E6638)","v":"-"},"X",""]
["-","X",""]
["-","X",""]
["-","X",""]
["-","X",""]
["-","X",""]
["-","X",""]
["-","X",""]
["-","X",""]
["-","X",""]
["-","X",""]
["-","X",""]
["-","X",""]
["-","X",""]
["-","X",""]
["-","X",""]
["-","X",""]
["-","X",""]
["-","X",""]
["-","X",""]
["-","X",""]
["-","X",""]
["-","X",""]
["-","X",""]
["-","X",""]
["-","X",""]
["-","X",""]
["-","X",""]
["-","X",""]
["-","X",""]
["-","X",""]
["-","X",""]
["-","X",""]
["-","X",""]
["-","X",""]
["-","X",""]
["-","X",""]
["-","X",""]
["-","X",""]
["-","X",""]
["-","X",""]
["-","X",""]
["-","X",""]
["-","X",""]
["-","X",{"$f":"IF(ISERROR(VLOOKUP(A6684,Base_suivi_MPR,1,FALSE)),\"\",\"X\")","v":""}]
["-","X",""]
["-","X",""]
["-","X",""]
["-","X",""]
["-",{"$f":"IF(J6687=K6687,\"X\",\"\")","v":"X"},""]
["-","X",""]
["-","X",""]
["-","X",""]
["-","X",""]
["-","X",""]
["-","X",""]
["-","X",""]
["-","X",""]
["-","X",""]
["-","X",""]
["-","X",""]
["-","X",""]
["-","X",""]
["-","X",""]
[{"$f":"CONCATENATE(D6702,\"-\",E6702)","v":"-"},"X",""]
["-","X",""]
["-","X",""]
["-","X",""]
["-","X",""]
["-","X",""]
["-","X",""]
["-","X",""]
["-","X",""]
["-","X",""]
["-","X",""]
["-","X",""]
["-","X",""]
["-","X",""]
["-","X",""]
["-","X",""]
["-","X",""]
["-","X",""]
["-","X",""]
["-","X",""]
["-","X",""]
["-","X",""]
["-","X",""]
["-","X",""]
["-","X",""]
["-","X",""]
["-","X",""]
["-","X",""]
["-","X",""]
["-","X",""]
["-","X",""]
["-","X",""]
["-","X",""]
["-","X",""]
["-","X",""]
["-","X",""]
["-","X",""]
["-","X",""]
["-","X",""]
["-","X",""]
["-","X",""]
["-","X",""]
["-","X",""]
["-","X",""]
["-","X",{"$f":"IF(ISERROR(VLOOKUP(A6748,Base_suivi_MPR,1,FALSE)),\"\",\"X\")","v":""}]
["-","X",""]
["-","X",""]
["-","X",""]
["-","X",""]
["-",{"$f":"IF(J6751=K6751,\"X\",\"\")","v":"X"},""]
["-","X",""]
["-","X",""]
["-","X",""]
["-","X",""]
["-","X",""]
["-","X",""]
["-","X",""]
["-","X",""]
["-","X",""]
["-","X",""]
["-","X",""]
["-","X",""]
["-","X",""]
["-","X",""]
[{"$f":"CONCATENATE(D6766,\"-\",E6766)","v":"-"},"X",""]
["-","X",""]
["-","X",""]
["-","X",""]
["-","X",""]
["-","X",""]
["-","X",""]
["-","X",""]
["-","X",""]
["-","X",""]
["-","X",""]
["-","X",""]
["-","X",""]
["-","X",""]
["-","X",""]
["-","X",""]
["-","X",""]
["-","X",""]
["-","X",""]
["-","X",""]
["-","X",""]
["-","X",""]
["-","X",""]
["-","X",""]
["-","X",""]
["-","X",""]
["-","X",""]
["-","X",""]
["-","X",""]
["-","X",""]
["-","X",""]
["-","X",""]
["-","X",""]
["-","X",""]
["-","X",""]
["-","X",""]
["-","X",""]
["-","X",""]
["-","X",""]
["-","X",""]
["-","X",""]
["-","X",""]
["-","X",""]
["-","X",""]
["-","X",{"$f":"IF(ISERROR(VLOOKUP(A6812,Base_suivi_MPR,1,FALSE)),\"\",\"X\")","v":""}]
["-","X",""]
["-","X",""]
["-","X",""]
["-","X",""]
["-",{"$f":"IF(J6815=K6815,\"X\",\"\")","v":"X"},""]
["-","X",""]
["-","X",""]
["-","X",""]
["-","X",""]
["-","X",""]
["-","X",""]
["-","X",""]
["-","X",""]
["-","X",""]
["-","X",""]
["-","X",""]
["-","X",""]
["-","X",""]
["-","X",""]
[{"$f":"CONCATENATE(D6830,\"-\",E6830)","v":"-"},"X",""]
["-","X",""]
["-","X",""]
["-","X",""]
["-","X",""]
["-","X",""]
["-","X",""]
["-","X",""]
["-","X",""]
["-","X",""]
["-","X",""]
["-","X",""]
["-","X",""]
["-","X",""]
["-","X",""]
["-","X",""]
["-","X",""]
["-","X",""]
["-","X",""]
["-","X",""]
["-","X",""]
["-","X",""]
["-","X",""]
["-","X",""]
["-","X",""]
["-","X",""]
["-","X",""]
["-","X",""]
["-","X",""]
["-","X",""]
["-","X",""]
["-","X",""]
["-","X",""]
["-","X",""]
["-","X",""]
["-","X",""]
["-","X",""]
["-","X",""]
["-","X",""]
["-","X",""]
["-","X",""]
["-","X",""]
["-","X",""]
["-","X",""]
["-","X",{"$f":"IF(ISERROR(VLOOKUP(A6876,Base_suivi_MPR,1,FALSE)),\"\",\"X\")","v":""}]
["-","X",""]
["-","X",""]
["-","X",""]
["-","X",""]
["-",{"$f":"IF(J6879=K6879,\"X\",\"\")","v":"X"},""]
["-","X",""]
["-","X",""]
["-","X",""]
["-","X",""]
["-","X",""]
["-","X",""]
["-","X",""]
["-","X",""]
["-","X",""]
["-","X",""]
["-","X",""]
["-","X",""]
["-","X",""]
["-","X",""]
[{"$f":"CONCATENATE(D6894,\"-\",E6894)","v":"-"},"X",""]
["-","X",""]
["-","X",""]
["-","X",""]
["-","X",""]
["-","X",""]
["-","X",""]
["-","X",""]
["-","X",""]
["-","X",""]
["-","X",""]
["-","X",""]
["-","X",""]
["-","X",""]
["-","X",""]
["-","X",""]
["-","X",""]
["-","X",""]
["-","X",""]
["-","X",""]
["-","X",""]
["-","X",""]
["-","X",""]
["-","X",""]
["-","X",""]
["-","X",""]
["-","X",""]
["-","X",""]
["-","X",""]
["-","X",""]
["-","X",""]
["-","X",""]
["-","X",""]
["-","X",""]
["-","X",""]
["-","X",""]
["-","X",""]
["-","X",""]
["-","X",""]
["-","X",""]
["-","X",""]
["-","X",""]
["-","X",""]
["-","X",""]
["-","X",{"$f":"IF(ISERROR(VLOOKUP(A6940,Base_suivi_MPR,1,FALSE)),\"\",\"X\")","v":""}]
["-","X",""]
["-","X",""]
["-","X",""]
["-","X",""]
["-",{"$f":"IF(J6943=K6943,\"X\",\"\")","v":"X"},""]
["-","X",""]
["-","X",""]
["-","X",""]
["-","X",""]
["-","X",""]
["-","X",""]
["-","X",""]
["-","X",""]
["-","X",""]
["-","X",""]
["-","X",""]
["-","X",""]
["-","X",""]
["-","X",""]
[{"$f":"CONCATENATE(D6958,\"-\",E6958)","v":"-"},"X",""]
["-","X",""]
["-","X",""]
["-","X",""]
["-","X",""]
["-","X",""]
["-","X",""]
["-","X",""]
["-","X",""]
["-","X",""]
["-","X",""]
["-","X",""]
["-","X",""]
["-","X",""]
["-","X",""]
["-","X",""]
["-","X",""]
["-","X",""]
["-","X",""]
["-","X",""]
["-","X",""]
["-","X",""]
["-","X",""]
["-","X",""]
["-","X",""]
["-","X",""]
["-","X",""]
["-","X",""]
["-","X",""]
["-","X",""]
["-","X",""]
["-","X",""]
["-","X",""]
["-","X",""]
["-","X",""]
["-","X",""]
["-","X",""]
["-","X",""]
["-","X",""]
["-","X",""]
["-","X",""]
["-","X",""]
["-","X",""]
["-","X",""]
["-","X",{"$f":"IF(ISERROR(VLOOKUP(A7004,Base_suivi_MPR,1,FALSE)),\"\",\"X\")","v":""}]
["-","X",""]
["-","X",""]
["-","X",""]
["-","X",""]
["-",{"$f":"IF(J7007=K7007,\"X\",\"\")","v":"X"},""]
["-","X",""]
["-","X",""]
["-","X",""]
["-","X",""]
["-","X",""]
["-","X",""]
["-","X",""]
["-","X",""]
["-","X",""]
["-","X",""]
["-","X",""]
["-","X",""]
["-","X",""]
["-","X",""]
[{"$f":"CONCATENATE(D7022,\"-\",E7022)","v":"-"},"X",""]
["-","X",""]
["-","X",""]
["-","X",""]
["-","X",""]
["-","X",""]
["-","X",""]
["-","X",""]
["-","X",""]
["-","X",""]
["-","X",""]
["-","X",""]
["-","X",""]
["-","X",""]
["-","X",""]
["-","X",""]
["-","X",""]
["-","X",""]
["-","X",""]
["-","X",""]
["-","X",""]
["-","X",""]
["-","X",""]
["-","X",""]
["-","X",""]
["-","X",""]
["-","X",""]
["-","X",""]
["-","X",""]
["-","X",""]
["-","X",""]
["-","X",""]
["-","X",""]
["-","X",""]
["-","X",""]
["-","X",""]
["-","X",""]
["-","X",""]
["-","X",""]
["-","X",""]
["-","X",""]
["-","X",""]
["-","X",""]
["-","X",""]
["-","X",{"$f":"IF(ISERROR(VLOOKUP(A7068,Base_suivi_MPR,1,FALSE)),\"\",\"X\")","v":""}]
["-","X",""]
["-","X",""]
["-","X",""]
["-","X",""]
["-",{"$f":"IF(J7071=K7071,\"X\",\"\")","v":"X"},""]
["-","X",""]
["-","X",""]
["-","X",""]
["-","X",""]
["-","X",""]
["-","X",""]
["-","X",""]
["-","X",""]
["-","X",""]
["-","X",""]
["-","X",""]
["-","X",""]
["-","X",""]
["-","X",""]
[{"$f":"CONCATENATE(D7086,\"-\",E7086)","v":"-"},"X",""]
["-","X",""]
["-","X",""]
["-","X",""]
["-","X",""]
["-","X",""]
["-","X",""]
["-","X",""]
["-","X",""]
["-","X",""]
["-","X",""]
["-","X",""]
["-","X",""]
["-","X",""]
["-","X",""]
["-","X",""]
["-","X",""]
["-","X",""]
["-","X",""]
["-","X",""]
["-","X",""]
["-","X",""]
["-","X",""]
["-","X",""]
["-","X",""]
["-","X",""]
["-","X",""]
["-","X",""]
["-","X",""]
["-","X",""]
["-","X",""]
["-","X",""]
["-","X",""]
["-","X",""]
["-","X",""]
["-","X",""]
["-","X",""]
["-","X",""]
["-","X",""]
["-","X",""]
["-","X",""]
["-","X",""]
["-","X",""]
["-","X",""]
["-","X",{"$f":"IF(ISERROR(VLOOKUP(A7132,Base_suivi_MPR,1,FALSE)),\"\",\"X\")","v":""}]
["-","X",""]
["-","X",""]
["-","X",""]
["-","X",""]
["-",{"$f":"IF(J7135=K7135,\"X\",\"\")","v":"X"},""]
["-","X",""]
["-","X",""]
["-","X",""]
["-","X",""]
["-","X",""]
["-","X",""]
["-","X",""]
["-","X",""]
["-","X",""]
["-","X",""]
["-","X",""]
["-","X",""]
["-","X",""]
["-","X",""]
[{"$f":"CONCATENATE(D7150,\"-\",E7150)","v":"-"},"X",""]
["-","X",""]
["-","X",""]
["-","X",""]
["-","X",""]
["-","X",""]
["-","X",""]
["-","X",""]
["-","X",""]
["-","X",""]
["-","X",""]
["-","X",""]
["-","X",""]
["-","X",""]
["-","X",""]
["-","X",""]
["-","X",""]
["-","X",""]
["-","X",""]
["-","X",""]
["-","X",""]
["-","X",""]
["-","X",""]
["-","X",""]
["-","X",""]
["-","X",""]
["-","X",""]
["-","X",""]
["-","X",""]
["-","X",""]
["-","X",""]
["-","X",""]
["-","X",""]
["-","X",""]
["-","X",""]
["-","X",""]
["-","X",""]
["-","X",""]
["-","X",""]
["-","X",""]
["-","X",""]
["-","X",""]
["-","X",""]
["-","X",""]
["-","X",{"$f":"IF(ISERROR(VLOOKUP(A7196,Base_suivi_MPR,1,FALSE)),\"\",\"X\")","v":""}]
["-","X",""]
["-","X",""]
["-","X",""]
["-","X",""]
["-",{"$f":"IF(J7199=K7199,\"X\",\"\")","v":"X"},""]
["-","X",""]
["-","X",""]
["-","X",""]
["-","X",""]
["-","X",""]
["-","X",""]
["-","X",""]
["-","X",""]
["-","X",""]
["-","X",""]
["-","X",""]
["-","X",""]
["-","X",""]
["-","X",""]
[{"$f":"CONCATENATE(D7214,\"-\",E7214)","v":"-"},"X",""]
["-","X",""]
["-","X",""]
["-","X",""]
["-","X",""]
["-","X",""]
["-","X",""]
["-","X",""]
["-","X",""]
["-","X",""]
["-","X",""]
["-","X",""]
["-","X",""]
["-","X",""]
["-","X",""]
["-","X",""]
["-","X",""]
["-","X",""]
["-","X",""]
["-","X",""]
["-","X",""]
["-","X",""]
["-","X",""]
["-","X",""]
["-","X",""]
["-","X",""]
["-","X",""]
["-","X",""]
["-","X",""]
["-","X",""]
["-","X",""]
["-","X",""]
["-","X",""]
["-","X",""]
["-","X",""]
["-","X",""]
["-","X",""]
["-","X",""]
["-","X",""]
["-","X",""]
["-","X",""]
["-","X",""]
["-","X",""]
["-","X",""]
["-","X",{"$f":"IF(ISERROR(VLOOKUP(A7260,Base_suivi_MPR,1,FALSE)),\"\",\"X\")","v":""}]
["-","X",""]
["-","X",""]
["-","X",""]
["-","X",""]
["-",{"$f":"IF(J7263=K7263,\"X\",\"\")","v":"X"},""]
["-","X",""]
["-","X",""]
["-","X",""]
["-","X",""]
["-","X",""]
["-","X",""]
["-","X",""]
["-","X",""]
["-","X",""]
["-","X",""]
["-","X",""]
["-","X",""]
["-","X",""]
["-","X",""]
[{"$f":"CONCATENATE(D7278,\"-\",E7278)","v":"-"},"X",""]
["-","X",""]
["-","X",""]
["-","X",""]
["-","X",""]
["-","X",""]
["-","X",""]
["-","X",""]
["-","X",""]
["-","X",""]
["-","X",""]
["-","X",""]
["-","X",""]
["-","X",""]
["-","X",""]
["-","X",""]
["-","X",""]
["-","X",""]
["-","X",""]
["-","X",""]
["-","X",""]
["-","X",""]
["-","X",""]
["-","X",""]
["-","X",""]
["-","X",""]
["-","X",""]
["-","X",""]
["-","X",""]
["-","X",""]
["-","X",""]
["-","X",""]
["-","X",""]
["-","X",""]
["-","X",""]
["-","X",""]
["-","X",""]
["-","X",""]
["-","X",""]
["-","X",""]
["-","X",""]
["-","X",""]
["-","X",""]
["-","X",""]
["-","X",{"$f":"IF(ISERROR(VLOOKUP(A7324,Base_suivi_MPR,1,FALSE)),\"\",\"X\")","v":""}]
["-","X",""]
["-","X",""]
["-","X",""]
["-","X",""]
["-",{"$f":"IF(J7327=K7327,\"X\",\"\")","v":"X"},""]
["-","X",""]
["-","X",""]
["-","X",""]
["-","X",""]
["-","X",""]
["-","X",""]
["-","X",""]
["-","X",""]
["-","X",""]
["-","X",""]
["-","X",""]
["-","X",""]
["-","X",""]
["-","X",""]
[{"$f":"CONCATENATE(D7342,\"-\",E7342)","v":"-"},"X",""]
["-","X",""]
["-","X",""]
["-","X",""]
["-","X",""]
["-","X",""]
["-","X",""]
["-","X",""]
["-","X",""]
["-","X",""]
["-","X",""]
["-","X",""]
["-","X",""]
["-","X",{"$f":"IF(ISERROR(VLOOKUP(A7357,Base_suivi_MPR,1,FALSE)),\"\",\"X\")","v":""}]
["-","X",""]
["-","X",""]
["-","X",""]
["-","X",""]
["-","X",""]
["-","X",""]
["-","X",""]
["-","X",""]
["-","X",""]
["-","X",""]
["-","X",""]
["-","X",""]
["-","X",""]
["-","X",""]
["-","X",""]
["-","X",""]
["-","X",""]
["-","X",""]
["-","X",""]
["-","X",""]
["-","X",""]
["-","X",""]
["-","X",""]
["-","X",""]
["-","X",""]
["-","X",""]
["-","X",""]
["-","X",""]
["-","X",""]
["-","X",""]
["-","X",""]
["-","X",""]
["-","X",""]
["-","X",""]
["-","X",""]
["-",{"$f":"IF(J7391=K7391,\"X\",\"\")","v":"X"},""]
["-","X",""]
["-","X",""]
["-","X",""]
["-","X",""]
["-","X",""]
["-","X",""]
["-","X",""]
["-","X",""]
["-","X",""]
["-","X",""]
["-","X",""]
["-","X",""]
["-","X",""]
["-","X",""]
[{"$f":"CONCATENATE(D7406,\"-\",E7406)","v":"-"},"X",""]
["-","X",""]
["-","X",""]
["-","X",""]
["-","X",""]
["-","X",""]
["-","X",""]
["-","X",""]
["-","X",""]
["-","X",""]
["-","X",""]
["-","X",""]
["-","X",""]
["-","X",{"$f":"IF(ISERROR(VLOOKUP(A7421,Base_suivi_MPR,1,FALSE)),\"\",\"X\")","v":""}]
["-","X",""]
["-","X",""]
["-","X",""]
["-","X",""]
["-","X",""]
["-","X",""]
["-","X",""]
["-","X",""]
["-","X",""]
["-","X",""]
["-","X",""]
["-","X",""]
["-","X",""]
["-","X",""]
["-","X",""]
["-","X",""]
["-","X",""]
["-","X",""]
["-","X",""]
["-","X",""]
["-","X",""]
["-","X",""]
["-","X",""]
["-","X",""]
["-","X",""]
["-","X",""]
["-","X",""]
["-","X",""]
["-","X",""]
["-","X",""]
["-","X",""]
["-","X",""]
["-","X",""]
["-","X",""]
["-","X",""]
["-",{"$f":"IF(J7455=K7455,\"X\",\"\")","v":"X"},""]
["-","X",""]
["-","X",""]
["-","X",""]
["-","X",""]
["-","X",""]
["-","X",""]
["-","X",""]
["-","X",""]
["-","X",""]
["-","X",""]
["-","X",""]
["-","X",""]
["-","X",""]
["-","X",""]
[{"$f":"CONCATENATE(D7470,\"-\",E7470)","v":"-"},"X",""]
["-","X",""]
["-","X",""]
["-","X",""]
["-","X",""]
["-","X",""]
["-","X",""]
["-","X",""]
["-","X",""]
["-","X",""]
["-","X",""]
["-","X",""]
["-","X",""]
["-","X",{"$f":"IF(ISERROR(VLOOKUP(A7485,Base_suivi_MPR,1,FALSE)),\"\",\"X\")","v":""}]
["-","X",""]
["-","X",""]
["-","X",""]
["-","X",""]
["-","X",""]
["-","X",""]
["-","X",""]
["-","X",""]
["-","X",""]
["-","X",""]
["-","X",""]
["-","X",""]
["-","X",""]
["-","X",""]
["-","X",""]
["-","X",""]
["-","X",""]
["-","X",""]
["-","X",""]
["-","X",""]
["-","X",""]
["-","X",""]
["-","X",""]
["-","X",""]
["-","X",""]
["-","X",""]
["-","X",""]
["-","X",""]
["-","X",""]
["-","X",""]
["-","X",""]
["-","X",""]
["-","X",""]
["-","X",""]
["-","X",""]
["-",{"$f":"IF(J7519=K7519,\"X\",\"\")","v":"X"},""]
["-","X",""]
["-","X",""]
["-","X",""]
["-","X",""]
["-","X",""]
["-","X",""]
["-","X",""]
["-","X",""]
["-","X",""]
["-","X",""]
["-","X",""]
["-","X",""]
["-","X",""]
["-","X",""]
[{"$f":"CONCATENATE(D7534,\"-\",E7534)","v":"-"},"X",""]
["-","X",""]
["-","X",""]
["-","X",""]
["-","X",""]
["-","X",""]
["-","X",""]
["-","X",""]
["-","X",""]
["-","X",""]
["-","X",""]
["-","X",""]
["-","X",""]
["-","X",{"$f":"IF(ISERROR(VLOOKUP(A7549,Base_suivi_MPR,1,FALSE)),\"\",\"X\")","v":""}]
["-","X",""]
["-","X",""]
["-","X",""]
["-","X",""]
["-","X",""]
["-","X",""]
["-","X",""]
["-","X",""]
["-","X",""]
["-","X",""]
["-","X",""]
["-","X",""]
["-","X",""]
["-","X",""]
["-","X",""]
["-","X",""]
["-","X",""]
["-","X",""]
["-","X",""]
["-","X",""]
["-","X",""]
["-","X",""]
["-","X",""]
["-","X",""]
["-","X",""]
["-","X",""]
["-","X",""]
["-","X",""]
["-","X",""]
["-","X",""]
["-","X",""]
["-","X",""]
["-","X",""]
["-","X",""]
["-","X",""]
["-",{"$f":"IF(J7583=K7583,\"X\",\"\")","v":"X"},""]
["-","X",""]
["-","X",""]
["-","X",""]
["-","X",""]
["-","X",""]
["-","X",""]
["-","X",""]
["-","X",""]
["-","X",""]
["-","X",""]
["-","X",""]
["-","X",""]
["-","X",""]
["-","X",""]
[{"$f":"CONCATENATE(D7598,\"-\",E7598)","v":"-"},"X",""]
["-","X",""]
["-","X",""]
["-","X",""]
["-","X",""]
["-","X",""]
["-","X",""]
["-","X",""]
["-","X",""]
["-","X",""]
["-","X",""]
["-","X",""]
["-","X",""]
["-","X",{"$f":"IF(ISERROR(VLOOKUP(A7613,Base_suivi_MPR,1,FALSE)),\"\",\"X\")","v":""}]
["-","X",""]
["-","X",""]
["-","X",""]
["-","X",""]
["-","X",""]
["-","X",""]
["-","X",""]
["-","X",""]
["-","X",""]
["-","X",""]
["-","X",""]
["-","X",""]
["-","X",""]
["-","X",""]
["-","X",""]
["-","X",""]
["-","X",""]
["-","X",""]
["-","X",""]
["-","X",""]
["-","X",""]
["-","X",""]
["-","X",""]
["-","X",""]
["-","X",""]
["-","X",""]
["-","X",""]
["-","X",""]
["-","X",""]
["-","X",""]
["-","X",""]
["-","X",""]
["-","X",""]
["-","X",""]
["-","X",""]
["-",{"$f":"IF(J7647=K7647,\"X\",\"\")","v":"X"},""]
["-","X",""]
["-","X",""]
["-","X",""]
["-","X",""]
["-","X",""]
["-","X",""]
["-","X",""]
["-","X",""]
["-","X",""]
["-","X",""]
["-","X",""]
["-","X",""]
["-","X",""]
["-","X",""]
[{"$f":"CONCATENATE(D7662,\"-\",E7662)","v":"-"},"X",""]
["-","X",""]
["-","X",""]
["-","X",""]
["-","X",""]
["-","X",""]
["-","X",""]
["-","X",""]
["-","X",""]
["-","X",""]
["-","X",""]
["-","X",""]
["-","X",""]
["-","X",{"$f":"IF(ISERROR(VLOOKUP(A7677,Base_suivi_MPR,1,FALSE)),\"\",\"X\")","v":""}]
["-","X",""]
["-","X",""]
["-","X",""]
["-","X",""]
["-","X",""]
["-","X",""]
["-","X",""]
["-","X",""]
["-","X",""]
["-","X",""]
["-","X",""]
["-","X",""]
["-","X",""]
["-","X",""]
["-","X",""]
["-","X",""]
["-","X",""]
["-","X",""]
["-","X",""]
["-","X",""]
["-","X",""]
["-","X",""]
["-","X",""]
["-","X",""]
["-","X",""]
["-","X",""]
["-","X",""]
["-","X",""]
["-","X",""]
["-","X",""]
["-","X",""]
["-","X",""]
["-","X",""]
["-","X",""]
["-","X",""]
["-",{"$f":"IF(J7711=K7711,\"X\",\"\")","v":"X"},""]
["-","X",""]
["-","X",""]
["-","X",""]
["-","X",""]
["-","X",""]
["-","X",""]
["-","X",""]
["-","X",""]
["-","X",""]
["-","X",""]
["-","X",""]
["-","X",""]
["-","X",""]
["-","X",""]
[{"$f":"CONCATENATE(D7726,\"-\",E7726)","v":"-"},"X",""]
["-","X",""]
["-","X",""]
["-","X",""]
["-","X",""]
["-","X",""]
["-","X",""]
["-","X",""]
["-","X",""]
["-","X",""]
["-","X",""]
["-","X",""]
["-","X",""]
["-","X",{"$f":"IF(ISERROR(VLOOKUP(A7741,Base_suivi_MPR,1,FALSE)),\"\",\"X\")","v":""}]
["-","X",""]
["-","X",""]
["-","X",""]
["-","X",""]
["-","X",""]
["-","X",""]
["-","X",""]
["-","X",""]
["-","X",""]
["-","X",""]
["-","X",""]
["-","X",""]
["-","X",""]
["-","X",""]
["-","X",""]
["-","X",""]
["-","X",""]
["-","X",""]
["-","X",""]
["-","X",""]
["-","X",""]
["-","X",""]
["-","X",""]
["-","X",""]
["-","X",""]
["-","X",""]
["-","X",""]
["-","X",""]
["-","X",""]
["-","X",""]
["-","X",""]
["-","X",""]
["-","X",""]
["-","X",""]
["-","X",""]
["-",{"$f":"IF(J7775=K7775,\"X\",\"\")","v":"X"},""]
["-","X",""]
["-","X",""]
["-","X",""]
["-","X",""]
["-","X",""]
["-","X",""]
["-","X",""]
["-","X",""]
["-","X",""]
["-","X",""]
["-","X",""]
["-","X",""]
["-","X",""]
["-","X",""]
[{"$f":"CONCATENATE(D7790,\"-\",E7790)","v":"-"},"X",""]
["-","X",""]
["-","X",""]
["-","X",""]
["-","X",""]
["-","X",""]
["-","X",""]
["-","X",""]
["-","X",""]
["-","X",""]
["-","X",""]
["-","X",""]
["-","X",""]
["-","X",{"$f":"IF(ISERROR(VLOOKUP(A7805,Base_suivi_MPR,1,FALSE)),\"\",\"X\")","v":""}]
["-","X",""]
["-","X",""]
["-","X",""]
["-","X",""]
["-","X",""]
["-","X",""]
["-","X",""]
["-","X",""]
["-","X",""]
["-","X",""]
["-","X",""]
["-","X",""]
["-","X",""]
["-","X",""]
["-","X",""]
["-","X",""]
["-","X",""]
["-","X",""]
["-","X",""]
["-","X",""]
["-","X",""]
["-","X",""]
["-","X",""]
["-","X",""]
["-","X",""]
["-","X",""]
["-","X",""]
["-","X",""]
["-","X",""]
["-","X",""]
["-","X",""]
["-","X",""]
["-","X",""]
["-","X",""]
["-","X",""]
["-",{"$f":"IF(J7839=K7839,\"X\",\"\")","v":"X"},""]
["-","X",""]
["-","X",""]
["-","X",""]
["-","X",""]
["-","X",""]
["-","X",""]
["-","X",""]
["-","X",""]
["-","X",""]
["-","X",""]
["-","X",""]
["-","X",""]
["-","X",""]
["-","X",""]
[{"$f":"CONCATENATE(D7854,\"-\",E7854)","v":"-"},"X",""]
["-","X",""]
["-","X",""]
["-","X",""]
["-","X",""]
["-","X",""]
["-","X",""]
["-","X",""]
["-","X",""]
["-","X",""]
["-","X",""]
["-","X",""]
["-","X",""]
["-","X",{"$f":"IF(ISERROR(VLOOKUP(A7869,Base_suivi_MPR,1,FALSE)),\"\",\"X\")","v":""}]
["-","X",""]
["-","X",""]
["-","X",""]
["-","X",""]
["-","X",""]
["-","X",""]
["-","X",""]
["-","X",""]
["-","X",""]
["-","X",""]
["-","X",""]
["-","X",""]
["-","X",""]
["-","X",""]
["-","X",""]
["-","X",""]
["-","X",""]
["-","X",""]
["-","X",""]
["-","X",""]
["-","X",""]
["-","X",""]
["-","X",""]
["-","X",""]
["-","X",""]
["-","X",""]
["-","X",""]
["-","X",""]
["-","X",""]
["-","X",""]
["-","X",""]
["-","X",""]
["-","X",""]
["-","X",""]
["-","X",""]
["-",{"$f":"IF(J7903=K7903,\"X\",\"\")","v":"X"},""]
["-","X",""]
["-","X",""]
["-","X",""]
["-","X",""]
["-","X",""]
["-","X",""]
["-","X",""]
["-","X",""]
["-","X",""]
["-","X",""]
["-","X",""]
["-","X",""]
["-","X",""]
["-","X",""]
[{"$f":"CONCATENATE(D7918,\"-\",E7918)","v":"-"},"X",""]
["-","X",""]
["-","X",""]
["-","X",""]
["-","X",""]
["-","X",""]
["-","X",""]
["-","X",""]
["-","X",""]
["-","X",""]
["-","X",""]
["-","X",""]
["-","X",""]
["-","X",{"$f":"IF(ISERROR(VLOOKUP(A7933,Base_suivi_MPR,1,FALSE)),\"\",\"X\")","v":""}]
["-","X",""]
["-","X",""]
["-","X",""]
["-","X",""]
["-","X",""]
["-","X",""]
["-","X",""]
["-","X",""]
["-","X",""]
["-","X",""]
["-","X",""]
["-","X",""]
["-","X",""]
["-","X",""]
["-","X",""]
["-","X",""]
["-","X",""]
["-","X",""]
["-","X",""]
["-","X",""]
["-","X",""]
["-","X",""]
["-","X",""]
["-","X",""]
["-","X",""]
["-","X",""]
["-","X",""]
["-","X",""]
["-","X",""]
["-","X",""]
["-","X",""]
["-","X",""]
["-","X",""]
["-","X",""]
["-","X",""]
["-",{"$f":"IF(J7967=K7967,\"X\",\"\")","v":"X"},""]
["-","X",""]
["-","X",""]
["-","X",""]
["-","X",""]
["-","X",""]
["-","X",""]
["-","X",""]
["-","X",""]
["-","X",""]
["-","X",""]
["-","X",""]
["-","X",""]
["-","X",""]
["-","X",""]
[{"$f":"CONCATENATE(D7982,\"-\",E7982)","v":"-"},"X",""]
["-","X",""]
["-","X",""]
["-","X",""]
["-","X",""]
["-","X",""]
["-","X",""]
["-","X",""]
["-","X",""]
["-","X",""]
["-","X",""]
["-","X",""]
["-","X",""]
["-","X",{"$f":"IF(ISERROR(VLOOKUP(A7997,Base_suivi_MPR,1,FALSE)),\"\",\"X\")","v":""}]
["-","X",""]
["-","X",""]
["-","X",""]
["-","X",""]
["-","X",""]
["-","X",""]
["-","X",""]
["-","X",""]
["-","X",""]
["-","X",""]
["-","X",""]
["-","X",""]
["-","X",""]
["-","X",""]
["-","X",""]
["-","X",""]
["-","X",""]
["-","X",""]
["-","X",""]
["-","X",""]
["-","X",""]
["-","X",""]
["-","X",""]
["-","X",""]
["-","X",""]
["-","X",""]
["-","X",""]
["-","X",""]
["-","X",""]
["-","X",""]
["-","X",""]
["-","X",""]
["-","X",""]
["-","X",""]
["-","X",""]
["-",{"$f":"IF(J8031=K8031,\"X\",\"\")","v":"X"},""]
["-","X",""]
["-","X",""]
["-","X",""]
["-","X",""]
["-","X",""]
["-","X",""]
["-","X",""]
["-","X",""]
["-","X",""]
["-","X",""]
["-","X",""]
["-","X",""]
["-","X",""]
["-","X",""]
[{"$f":"CONCATENATE(D8046,\"-\",E8046)","v":"-"},"X",""]
["-","X",""]
["-","X",""]
["-","X",""]
["-","X",""]
["-","X",""]
["-","X",""]
["-","X",""]
["-","X",""]
["-","X",""]
["-","X",""]
["-","X",""]
["-","X",""]
["-","X",{"$f":"IF(ISERROR(VLOOKUP(A8061,Base_suivi_MPR,1,FALSE)),\"\",\"X\")","v":""}]
["-","X",""]
["-","X",""]
["-","X",""]
["-","X",""]
["-","X",""]
["-","X",""]
["-","X",""]
["-","X",""]
["-","X",""]
["-","X",""]
["-","X",""]
["-","X",""]
["-","X",""]
["-","X",""]
["-","X",""]
["-","X",""]
["-","X",""]
["-","X",""]
["-","X",""]
["-","X",""]
["-","X",""]
["-","X",""]
["-","X",""]
["-","X",""]
["-","X",""]
["-","X",""]
["-","X",""]
["-","X",""]
["-","X",""]
["-","X",""]
["-","X",""]
["-","X",""]
["-","X",""]
["-","X",""]
["-","X",""]
["-",{"$f":"IF(J8095=K8095,\"X\",\"\")","v":"X"},""]
["-","X",""]
["-","X",""]
["-","X",""]
["-","X",""]
["-","X",""]
["-","X",""]
["-","X",""]
["-","X",""]
["-","X",""]
["-","X",""]
["-","X",""]
["-","X",""]
["-","X",""]
["-","X",""]
[{"$f":"CONCATENATE(D8110,\"-\",E8110)","v":"-"},"X",""]
["-","X",""]
["-","X",""]
["-","X",""]
["-","X",""]
["-","X",""]
["-","X",""]
["-","X",""]
["-","X",""]
["-","X",""]
["-","X",""]
["-","X",""]
["-","X",""]
["-","X",{"$f":"IF(ISERROR(VLOOKUP(A8125,Base_suivi_MPR,1,FALSE)),\"\",\"X\")","v":""}]
["-","X",""]
["-","X",""]
["-","X",""]
["-","X",""]
["-","X",""]
["-","X",""]
["-","X",""]
["-","X",""]
["-","X",""]
["-","X",""]
["-","X",""]
["-","X",""]
["-","X",""]
["-","X",""]
["-","X",""]
["-","X",""]
["-","X",""]
["-","X",""]
["-","X",""]
["-","X",""]
["-","X",""]
["-","X",""]
["-","X",""]
["-","X",""]
["-","X",""]
["-","X",""]
["-","X",""]
["-","X",""]
["-","X",""]
["-","X",""]
["-","X",""]
["-","X",""]
["-","X",""]
["-","X",""]
["-","X",""]
["-",{"$f":"IF(J8159=K8159,\"X\",\"\")","v":"X"},""]
["-","X",""]
["-","X",""]
["-","X",""]
["-","X",""]
["-","X",""]
["-","X",""]
["-","X",""]
["-","X",""]
["-","X",""]
["-","X",""]
["-","X",""]
["-","X",""]
["-","X",""]
["-","X",""]
[{"$f":"CONCATENATE(D8174,\"-\",E8174)","v":"-"},"X",""]
["-","X",""]
["-","X",""]
["-","X",""]
["-","X",""]
["-","X",""]
["-","X",""]
["-","X",""]
["-","X",""]
["-","X",""]
["-","X",""]
["-","X",""]
["-","X",""]
["-","X",{"$f":"IF(ISERROR(VLOOKUP(A8189,Base_suivi_MPR,1,FALSE)),\"\",\"X\")","v":""}]
["-","X",""]
["-","X",""]
["-","X",""]
["-","X",""]
["-","X",""]
["-","X",""]
["-","X",""]
["-","X",""]
["-","X",""]
["-","X",""]
["-","X",""]
["-","X",""]
["-","X",""]
["-","X",""]
["-","X",""]
["-","X",""]
["-","X",""]
["-","X",""]
["-","X",""]
["-","X",""]
["-","X",""]
["-","X",""]
["-","X",""]
["-","X",""]
["-","X",""]
["-","X",""]
["-","X",""]
["-","X",""]
["-","X",""]
["-","X",""]
["-","X",""]
["-","X",""]
["-","X",""]
["-","X",""]
["-","X",""]
["-",{"$f":"IF(J8223=K8223,\"X\",\"\")","v":"X"},""]
["-","X",""]
["-","X",""]
["-","X",""]
["-","X",""]
["-","X",""]
["-","X",""]
["-","X",""]
["-","X",""]
["-","X",""]
["-","X",""]
["-","X",""]
["-","X",""]
["-","X",""]
["-","X",""]
[{"$f":"CONCATENATE(D8238,\"-\",E8238)","v":"-"},"X",""]
["-","X",""]
["-","X",""]
["-","X",""]
["-","X",""]
["-","X",""]
["-","X",""]
["-","X",""]
["-","X",""]
["-","X",""]
["-","X",""]
["-","X",""]
["-","X",""]
["-","X",{"$f":"IF(ISERROR(VLOOKUP(A8253,Base_suivi_MPR,1,FALSE)),\"\",\"X\")","v":""}]
["-","X",""]
["-","X",""]
["-","X",""]
["-","X",""]
["-","X",""]
["-","X",""]
["-","X",""]
["-","X",""]
["-","X",""]
["-","X",""]
["-","X",""]
["-","X",""]
["-","X",""]
["-","X",""]
["-","X",""]
["-","X",""]
["-","X",""]
["-","X",""]
["-","X",""]
["-","X",""]
["-","X",""]
["-","X",""]
["-","X",""]
["-","X",""]
["-","X",""]
["-","X",""]
["-","X",""]
["-","X",""]
["-","X",""]
["-","X",""]
["-","X",""]
["-","X",""]
["-","X",""]
["-","X",""]
["-","X",""]
["-",{"$f":"IF(J8287=K8287,\"X\",\"\")","v":"X"},""]
["-","X",""]
["-","X",""]
["-","X",""]
["-","X",""]
["-","X",""]
["-","X",""]
["-","X",""]
["-","X",""]
["-","X",""]
["-","X",""]
["-","X",""]
["-","X",""]
["-","X",""]
["-","X",""]
[{"$f":"CONCATENATE(D8302,\"-\",E8302)","v":"-"},"X",""]
["-","X",""]
["-","X",""]
["-","X",""]
["-","X",""]
["-","X",""]
["-","X",""]
["-","X",""]
["-","X",""]
["-","X",""]
["-","X",""]
["-","X",""]
["-","X",""]
["-","X",{"$f":"IF(ISERROR(VLOOKUP(A8317,Base_suivi_MPR,1,FALSE)),\"\",\"X\")","v":""}]
["-","X",""]
["-","X",""]
["-","X",""]
["-","X",""]
["-","X",""]
["-","X",""]
["-","X",""]
["-","X",""]
["-","X",""]
["-","X",""]
["-","X",""]
["-","X",""]
["-","X",""]
["-","X",""]
["-","X",""]
["-","X",""]
["-","X",""]
["-","X",""]
["-","X",""]
["-","X",""]
["-","X",""]
["-","X",""]
["-","X",""]
["-","X",""]
["-","X",""]
["-","X",""]
["-","X",""]
["-","X",""]
["-","X",""]
["-","X",""]
["-","X",""]
["-","X",""]
["-","X",""]
["-","X",""]
["-","X",""]
["-",{"$f":"IF(J8351=K8351,\"X\",\"\")","v":"X"},""]
["-","X",""]
["-","X",""]
["-","X",""]
["-","X",""]
["-","X",""]
["-","X",""]
["-","X",""]
["-","X",""]
["-","X",""]
["-","X",""]
["-","X",""]
["-","X",""]
["-","X",""]
["-","X",""]
[{"$f":"CONCATENATE(D8366,\"-\",E8366)","v":"-"},"X",""]
["-","X",""]
["-","X",""]
["-","X",""]
["-","X",""]
["-","X",""]
["-","X",""]
["-","X",""]
["-","X",""]
["-","X",""]
["-","X",""]
["-","X",""]
["-","X",""]
["-","X",{"$f":"IF(ISERROR(VLOOKUP(A8381,Base_suivi_MPR,1,FALSE)),\"\",\"X\")","v":""}]
["-","X",""]
["-","X",""]
["-","X",""]
["-","X",""]
["-","X",""]
["-","X",""]
["-","X",""]
["-","X",""]
["-","X",""]
["-","X",""]
["-","X",""]
["-","X",""]
["-","X",""]
["-","X",""]
["-","X",""]
["-","X",""]
["-","X",""]
["-","X",""]
["-","X",""]
["-","X",""]
["-","X",""]
["-","X",""]
["-","X",""]
["-","X",""]
["-","X",""]
["-","X",""]
["-","X",""]
["-","X",""]
["-","X",""]
["-","X",""]
["-","X",""]
["-","X",""]
["-","X",""]
["-","X",""]
["-","X",""]
["-",{"$f":"IF(J8415=K8415,\"X\",\"\")","v":"X"},""]
["-","X",""]
["-","X",""]
["-","X",""]
["-","X",""]
["-","X",""]
["-","X",""]
["-","X",""]
["-","X",""]
["-","X",""]
["-","X",""]
["-","X",""]
["-","X",""]
["-","X",""]
["-","X",""]
[{"$f":"CONCATENATE(D8430,\"-\",E8430)","v":"-"},"X",""]
["-","X",""]
["-","X",""]
["-","X",""]
["-","X",""]
["-","X",""]
["-","X",""]
["-","X",""]
["-","X",""]
["-","X",""]
["-","X",""]
["-","X",""]
["-","X",""]
["-","X",{"$f":"IF(ISERROR(VLOOKUP(A8445,Base_suivi_MPR,1,FALSE)),\"\",\"X\")","v":""}]
["-","X",""]
["-","X",""]
["-","X",""]
["-","X",""]
["-","X",""]
["-","X",""]
["-","X",""]
["-","X",""]
["-","X",""]
["-","X",""]
["-","X",""]
["-","X",""]
["-","X",""]
["-","X",""]
["-","X",""]
["-","X",""]
["-","X",""]
["-","X",""]
["-","X",""]
["-","X",""]
["-","X",""]
["-","X",""]
["-","X",""]
["-","X",""]
["-","X",""]
["-","X",""]
["-","X",""]
["-","X",""]
["-","X",""]
["-","X",""]
["-","X",""]
["-","X",""]
["-","X",""]
["-","X",""]
["-","X",""]
["-",{"$f":"IF(J8479=K8479,\"X\",\"\")","v":"X"},""]
["-","X",""]
["-","X",""]
["-","X",""]
["-","X",""]
["-","X",""]
["-","X",""]
["-","X",""]
["-","X",""]
["-","X",""]
["-","X",""]
["-","X",""]
["-","X",""]
["-","X",""]
["-","X",""]
[{"$f":"CONCATENATE(D8494,\"-\",E8494)","v":"-"},"X",""]
["-","X",""]
["-","X",""]
["-","X",""]
["-","X",""]
["-","X",""]
["-","X",""]
["-","X",""]
["-","X",""]
["-","X",""]
["-","X",""]
["-","X",""]
["-","X",""]
["-","X",{"$f":"IF(ISERROR(VLOOKUP(A8509,Base_suivi_MPR,1,FALSE)),\"\",\"X\")","v":""}]
["-","X",""]
["-","X",""]
["-","X",""]
["-","X",""]
["-","X",""]
["-","X",""]
["-","X",""]
["-","X",""]
["-","X",""]
["-","X",""]
["-","X",""]
["-","X",""]
["-","X",""]
["-","X",""]
["-","X",""]
["-","X",""]
["-","X",""]
["-","X",""]
["-","X",""]
["-","X",""]
["-","X",""]
["-","X",""]
["-","X",""]
["-","X",""]
["-","X",""]
["-","X",""]
["-","X",""]
["-","X",""]
["-","X",""]
["-","X",""]
["-","X",""]
["-","X",""]
["-","X",""]
["-","X",""]
["-","X",""]
["-",{"$f":"IF(J8543=K8543,\"X\",\"\")","v":"X"},""]
["-","X",""]
["-","X",""]
["-","X",""]
["-","X",""]
["-","X",""]
["-","X",""]
["-","X",""]
["-","X",""]
["-","X",""]
["-","X",""]
["-","X",""]
["-","X",""]
["-","X",""]
["-","X",""]
[{"$f":"CONCATENATE(D8558,\"-\",E8558)","v":"-"},"X",""]
["-","X",""]
["-","X",""]
["-","X",""]
["-","X",""]
["-","X",""]
["-","X",""]
["-","X",""]
["-","X",""]
["-","X",""]
["-","X",""]
["-","X",""]
["-","X",""]
["-","X",{"$f":"IF(ISERROR(VLOOKUP(A8573,Base_suivi_MPR,1,FALSE)),\"\",\"X\")","v":""}]
["-","X",""]
["-","X",""]
["-","X",""]
["-","X",""]
["-","X",""]
["-","X",""]
["-","X",""]
["-","X",""]
["-","X",""]
["-","X",""]
["-","X",""]
["-","X",""]
["-","X",""]
["-","X",""]
["-","X",""]
["-","X",""]
["-","X",""]
["-","X",""]
["-","X",""]
["-","X",""]
["-","X",""]
["-","X",""]
["-","X",""]
["-","X",""]
["-","X",""]
["-","X",""]
["-","X",""]
["-","X",""]
["-","X",""]
["-","X",""]
["-","X",""]
["-","X",""]
["-","X",""]
["-","X",""]
["-","X",""]
["-",{"$f":"IF(J8607=K8607,\"X\",\"\")","v":"X"},""]
["-","X",""]
["-","X",""]
["-","X",""]
["-","X",""]
["-","X",""]
["-","X",""]
["-","X",""]
["-","X",""]
["-","X",""]
["-","X",""]
["-","X",""]
["-","X",""]
["-","X",""]
["-","X",""]
[{"$f":"CONCATENATE(D8622,\"-\",E8622)","v":"-"},"X",""]
["-","X",""]
["-","X",""]
["-","X",""]
["-","X",""]
["-","X",""]
["-","X",""]
["-","X",""]
["-","X",""]
["-","X",""]
["-","X",""]
["-","X",""]
["-","X",""]
["-","X",{"$f":"IF(ISERROR(VLOOKUP(A8637,Base_suivi_MPR,1,FALSE)),\"\",\"X\")","v":""}]
["-","X",""]
["-","X",""]
["-","X",""]
["-","X",""]
["-","X",""]
["-","X",""]
["-","X",""]
["-","X",""]
["-","X",""]
["-","X",""]
["-","X",""]
["-","X",""]
["-","X",""]
["-","X",""]
["-","X",""]
["-","X",""]
["-","X",""]
["-","X",""]
["-","X",""]
["-","X",""]
["-","X",""]
["-","X",""]
["-","X",""]
["-","X",""]
["-","X",""]
["-","X",""]
["-","X",""]
["-","X",""]
["-","X",""]
["-","X",""]
["-","X",""]
["-","X",""]
["-","X",""]
["-","X",""]
["-","X",""]
["-",{"$f":"IF(J8671=K8671,\"X\",\"\")","v":"X"},""]
["-","X",""]
["-","X",""]
["-","X",""]
["-","X",""]
["-","X",""]
["-","X",""]
["-","X",""]
["-","X",""]
["-","X",""]
["-","X",""]
["-","X",""]
["-","X",""]
["-","X",""]
["-","X",""]
[{"$f":"CONCATENATE(D8686,\"-\",E8686)","v":"-"},"X",""]
["-","X",""]
["-","X",""]
["-","X",""]
["-","X",""]
["-","X",""]
["-","X",""]
["-","X",""]
["-","X",""]
["-","X",""]
["-","X",""]
["-","X",""]
["-","X",""]
["-","X",{"$f":"IF(ISERROR(VLOOKUP(A8701,Base_suivi_MPR,1,FALSE)),\"\",\"X\")","v":""}]
["-","X",""]
["-","X",""]
["-","X",""]
["-","X",""]
["-","X",""]
["-","X",""]
["-","X",""]
["-","X",""]
["-","X",""]
["-","X",""]
["-","X",""]
["-","X",""]
["-","X",""]
["-","X",""]
["-","X",""]
["-","X",""]
["-","X",""]
["-","X",""]
["-","X",""]
["-","X",""]
["-","X",""]
["-","X",""]
["-","X",""]
["-","X",""]
["-","X",""]
["-","X",""]
["-","X",""]
["-","X",""]
["-","X",""]
["-","X",""]
["-","X",""]
["-","X",""]
["-","X",""]
["-","X",""]
["-","X",""]
["-",{"$f":"IF(J8735=K8735,\"X\",\"\")","v":"X"},""]
["-","X",""]
["-","X",""]
["-","X",""]
["-","X",""]
["-","X",""]
["-","X",""]
["-","X",""]
["-","X",""]
["-","X",""]
["-","X",""]
["-","X",""]
["-","X",""]
["-","X",""]
["-","X",""]
[{"$f":"CONCATENATE(D8750,\"-\",E8750)","v":"-"},"X",""]
["-","X",""]
["-","X",""]
["-","X",""]
["-","X",""]
["-","X",""]
["-","X",""]
["-","X",""]
["-","X",""]
["-","X",""]
["-","X",""]
["-","X",""]
["-","X",""]
["-","X",{"$f":"IF(ISERROR(VLOOKUP(A8765,Base_suivi_MPR,1,FALSE)),\"\",\"X\")","v":""}]
["-","X",""]
["-","X",""]
["-","X",""]
["-","X",""]
["-","X",""]
["-","X",""]
["-","X",""]
["-","X",""]
["-","X",""]
["-","X",""]
["-","X",""]
["-","X",""]
["-","X",""]
["-","X",""]
["-","X",""]
["-","X",""]
["-","X",""]
["-","X",""]
["-","X",""]
["-","X",""]
["-","X",""]
["-","X",""]
["-","X",""]
["-","X",""]
["-","X",""]
["-","X",""]
["-","X",""]
["-","X",""]
["-","X",""]
["-","X",""]
["-","X",""]
["-","X",""]
["-","X",""]
["-","X",""]
["-","X",""]
["-",{"$f":"IF(J8799=K8799,\"X\",\"\")","v":"X"},""]
["-","X",""]
["-","X",""]
["-","X",""]
["-","X",""]
["-","X",""]
["-","X",""]
["-","X",""]
["-","X",""]
["-","X",""]
["-","X",""]
["-","X",""]
["-","X",""]
["-","X",""]
["-","X",""]
[{"$f":"CONCATENATE(D8814,\"-\",E8814)","v":"-"},"X",""]
["-","X",""]
["-","X",""]
["-","X",""]
["-","X",""]
["-","X",""]
["-","X",""]
["-","X",""]
["-","X",""]
["-","X",""]
["-","X",""]
["-","X",""]
["-","X",""]
["-","X",{"$f":"IF(ISERROR(VLOOKUP(A8829,Base_suivi_MPR,1,FALSE)),\"\",\"X\")","v":""}]
["-","X",""]
["-","X",""]
["-","X",""]
["-","X",""]
["-","X",""]
["-","X",""]
["-","X",""]
["-","X",""]
["-","X",""]
["-","X",""]
["-","X",""]
["-","X",""]
["-","X",""]
["-","X",""]
["-","X",""]
["-","X",""]
["-","X",""]
["-","X",""]
["-","X",""]
["-","X",""]
["-","X",""]
["-","X",""]
["-","X",""]
["-","X",""]
["-","X",""]
["-","X",""]
["-","X",""]
["-","X",""]
["-","X",""]
["-","X",""]
["-","X",""]
["-","X",""]
["-","X",""]
["-","X",""]
["-","X",""]
["-",{"$f":"IF(J8863=K8863,\"X\",\"\")","v":"X"},""]
["-","X",""]
["-","X",""]
["-","X",""]
["-","X",""]
["-","X",""]
["-","X",""]
["-","X",""]
["-","X",""]
["-","X",""]
["-","X",""]
["-","X",""]
["-","X",""]
["-","X",""]
["-","X",""]
[{"$f":"CONCATENATE(D8878,\"-\",E8878)","v":"-"},"X",""]
["-","X",""]
["-","X",""]
["-","X",""]
["-","X",""]
["-","X",""]
["-","X",""]
["-","X",""]
["-","X",""]
["-","X",""]
["-","X",""]
["-","X",""]
["-","X",""]
["-","X",{"$f":"IF(ISERROR(VLOOKUP(A8893,Base_suivi_MPR,1,FALSE)),\"\",\"X\")","v":""}]
["-","X",""]
["-","X",""]
["-","X",""]
["-","X",""]
["-","X",""]
["-","X",""]
["-","X",""]
["-","X",""]
["-","X",""]
["-","X",""]
["-","X",""]
["-","X",""]
["-","X",""]
["-","X",""]
["-","X",""]
["-","X",""]
["-","X",""]
["-","X",""]
["-","X",""]
["-","X",""]
["-","X",""]
["-","X",""]
["-","X",""]
["-","X",""]
["-","X",""]
["-","X",""]
["-","X",""]
["-","X",""]
["-","X",""]
["-","X",""]
["-","X",""]
["-","X",""]
["-","X",""]
["-","X",""]
["-","X",""]
["-",{"$f":"IF(J8927=K8927,\"X\",\"\")","v":"X"},""]
["-","X",""]
["-","X",""]
["-","X",""]
["-","X",""]
["-","X",""]
["-","X",""]
["-","X",""]
["-","X",""]
["-","X",""]
["-","X",""]
["-","X",""]
["-","X",""]
["-","X",""]
["-","X",""]
[{"$f":"CONCATENATE(D8942,\"-\",E8942)","v":"-"},"X",""]
["-","X",""]
["-","X",""]
["-","X",""]
["-","X",""]
["-","X",""]
["-","X",""]
["-","X",""]
["-","X",""]
["-","X",""]
["-","X",""]
["-","X",""]
["-","X",""]
["-","X",{"$f":"IF(ISERROR(VLOOKUP(A8957,Base_suivi_MPR,1,FALSE)),\"\",\"X\")","v":""}]
["-","X",""]
["-","X",""]
["-","X",""]
["-","X",""]
["-","X",""]
["-","X",""]
["-","X",""]
["-","X",""]
["-","X",""]
["-","X",""]
["-","X",""]
["-","X",""]
["-","X",""]
["-","X",""]
["-","X",""]
["-","X",""]
["-","X",""]
["-","X",""]
["-","X",""]
["-","X",""]
["-","X",""]
["-","X",""]
["-","X",""]
["-","X",""]
["-","X",""]
["-","X",""]
["-","X",""]
["-","X",""]
["-","X",""]
["-","X",""]
["-","X",""]
["-","X",""]
["-","X",""]
["-","X",""]
["-","X",""]
["-",{"$f":"IF(J8991=K8991,\"X\",\"\")","v":"X"},""]
["-","X",""]
["-","X",""]
["-","X",""]
["-","X",""]
["-","X",""]
["-","X",""]
["-","X",""]
["-","X",""]
["-","X",""]
["-","X",""]
["-","X",""]
["-","X",""]
["-","X",""]
["-","X",""]
[{"$f":"CONCATENATE(D9006,\"-\",E9006)","v":"-"},"X",""]
["-","X",""]
["-","X",""]
["-","X",""]
["-","X",""]
["-","X",""]
["-","X",""]
["-","X",""]
["-","X",""]
["-","X",""]
["-","X",""]
["-","X",""]
["-","X",""]
["-","X",{"$f":"IF(ISERROR(VLOOKUP(A9021,Base_suivi_MPR,1,FALSE)),\"\",\"X\")","v":""}]
["-","X",""]
["-","X",""]
["-","X",""]
["-","X",""]
["-","X",""]
["-","X",""]
["-","X",""]
["-","X",""]
["-","X",""]
["-","X",""]
["-","X",""]
["-","X",""]
["-","X",""]
["-","X",""]
["-","X",""]
["-","X",""]
["-","X",""]
["-","X",""]
["-","X",""]
["-","X",""]
["-","X",""]
["-","X",""]
["-","X",""]
["-","X",""]
["-","X",""]
["-","X",""]
["-","X",""]
["-","X",""]
["-","X",""]
["-","X",""]
["-","X",""]
["-","X",""]
["-","X",""]
["-","X",""]
["-","X",""]
["-",{"$f":"IF(J9055=K9055,\"X\",\"\")","v":"X"},""]
["-","X",""]
["-","X",""]
["-","X",""]
["-","X",""]
["-","X",""]
["-","X",""]
["-","X",""]
["-","X",""]
["-","X",""]
["-","X",""]
["-","X",""]
["-","X",""]
["-","X",""]
["-","X",""]
[{"$f":"CONCATENATE(D9070,\"-\",E9070)","v":"-"},"X",""]
["-","X",""]
["-","X",""]
["-","X",""]
["-","X",""]
["-","X",""]
["-","X",""]
["-","X",""]
["-","X",""]
["-","X",""]
["-","X",""]
["-","X",""]
["-","X",""]
["-","X",{"$f":"IF(ISERROR(VLOOKUP(A9085,Base_suivi_MPR,1,FALSE)),\"\",\"X\")","v":""}]
["-","X",""]
["-","X",""]
["-","X",""]
["-","X",""]
["-","X",""]
["-","X",""]
["-","X",""]
["-","X",""]
["-","X",""]
["-","X",""]
["-","X",""]
["-","X",""]
["-","X",""]
["-","X",""]
["-","X",""]
["-","X",""]
["-","X",""]
["-","X",""]
["-","X",""]
["-","X",""]
["-","X",""]
["-","X",""]
["-","X",""]
["-","X",""]
["-","X",""]
["-","X",""]
["-","X",""]
["-","X",""]
["-","X",""]
["-","X",""]
["-","X",""]
["-","X",""]
["-","X",""]
["-","X",""]
["-","X",""]
["-",{"$f":"IF(J9119=K9119,\"X\",\"\")","v":"X"},""]
["-","X",""]
["-","X",""]
["-","X",""]
["-","X",""]
["-","X",""]
["-","X",""]
["-","X",""]
["-","X",""]
["-","X",""]
["-","X",""]
["-","X",""]
["-","X",""]
["-","X",""]
["-","X",""]
[{"$f":"CONCATENATE(D9134,\"-\",E9134)","v":"-"},"X",""]
["-","X",""]
["-","X",""]
["-","X",""]
["-","X",""]
["-","X",""]
["-","X",""]
["-","X",""]
["-","X",""]
["-","X",""]
["-","X",""]
["-","X",""]
["-","X",""]
["-","X",{"$f":"IF(ISERROR(VLOOKUP(A9149,Base_suivi_MPR,1,FALSE)),\"\",\"X\")","v":""}]
["-","X",""]
["-","X",""]
["-","X",""]
["-","X",""]
["-","X",""]
["-","X",""]
["-","X",""]
["-","X",""]
["-","X",""]
["-","X",""]
["-","X",""]
["-","X",""]
["-","X",""]
["-","X",""]
["-","X",""]
["-","X",""]
["-","X",""]
["-","X",""]
["-","X",""]
["-","X",""]
["-","X",""]
["-","X",""]
["-","X",""]
["-","X",""]
["-","X",""]
["-","X",""]
["-","X",""]
["-","X",""]
["-","X",""]
["-","X",""]
["-","X",""]
["-","X",""]
["-","X",""]
["-","X",""]
["-","X",""]
["-",{"$f":"IF(J9183=K9183,\"X\",\"\")","v":"X"},""]
["-","X",""]
["-","X",""]
["-","X",""]
["-","X",""]
["-","X",""]
["-","X",""]
["-","X",""]
["-","X",""]
["-","X",""]
["-","X",""]
["-","X",""]
["-","X",""]
["-","X",""]
["-","X",""]
[{"$f":"CONCATENATE(D9198,\"-\",E9198)","v":"-"},"X",""]
["-","X",""]
["-","X",""]
["-","X",""]
["-","X",""]
["-","X",""]
["-","X",""]
["-","X",""]
["-","X",""]
["-","X",""]
["-","X",""]
["-","X",""]
["-","X",""]
["-","X",{"$f":"IF(ISERROR(VLOOKUP(A9213,Base_suivi_MPR,1,FALSE)),\"\",\"X\")","v":""}]
["-","X",""]
["-","X",""]
["-","X",""]
["-","X",""]
["-","X",""]
["-","X",""]
["-","X",""]
["-","X",""]
["-","X",""]
["-","X",""]
["-","X",""]
["-","X",""]
["-","X",""]
["-","X",""]
["-","X",""]
["-","X",""]
["-","X",""]
["-","X",""]
["-","X",""]
["-","X",""]
["-","X",""]
["-","X",""]
["-","X",""]
["-","X",""]
["-","X",""]
["-","X",""]
["-","X",""]
["-","X",""]
["-","X",""]
["-","X",""]
["-","X",""]
["-","X",""]
["-","X",""]
["-","X",""]
["-","X",""]
["-",{"$f":"IF(J9247=K9247,\"X\",\"\")","v":"X"},""]
["-","X",""]
["-","X",""]
["-","X",""]
["-","X",""]
["-","X",""]
["-","X",""]
["-","X",""]
["-","X",""]
["-","X",""]
["-","X",""]
["-","X",""]
["-","X",""]
["-","X",""]
["-","X",""]
[{"$f":"CONCATENATE(D9262,\"-\",E9262)","v":"-"},"X",""]
["-","X",""]
["-","X",""]
["-","X",""]
["-","X",""]
["-","X",""]
["-","X",""]
["-","X",""]
["-","X",""]
["-","X",""]
["-","X",""]
["-","X",""]
["-","X",""]
["-","X",{"$f":"IF(ISERROR(VLOOKUP(A9277,Base_suivi_MPR,1,FALSE)),\"\",\"X\")","v":""}]
["-","X",""]
["-","X",""]
["-","X",""]
["-","X",""]
["-","X",""]
["-","X",""]
["-","X",""]
["-","X",""]
["-","X",""]
["-","X",""]
["-","X",""]
["-","X",""]
["-","X",""]
["-","X",""]
["-","X",""]
["-","X",""]
["-","X",""]
["-","X",""]
["-","X",""]
["-","X",""]
["-","X",""]
["-","X",""]
["-","X",""]
["-","X",""]
["-","X",""]
["-","X",""]
["-","X",""]
["-","X",""]
["-","X",""]
["-","X",""]
["-","X",""]
["-","X",""]
["-","X",""]
["-","X",""]
["-","X",""]
["-",{"$f":"IF(J9311=K9311,\"X\",\"\")","v":"X"},""]
["-","X",""]
["-","X",""]
["-","X",""]
["-","X",""]
["-","X",""]
["-","X",""]
["-","X",""]
["-","X",""]
["-","X",""]
["-","X",""]
["-","X",""]
["-","X",""]
["-","X",""]
["-","X",""]
[{"$f":"CONCATENATE(D9326,\"-\",E9326)","v":"-"},"X",""]
["-","X",""]
["-","X",""]
["-","X",""]
["-","X",""]
["-","X",""]
["-","X",""]
["-","X",""]
["-","X",""]
["-","X",""]
["-","X",""]
["-","X",""]
["-","X",""]
["-","X",{"$f":"IF(ISERROR(VLOOKUP(A9341,Base_suivi_MPR,1,FALSE)),\"\",\"X\")","v":""}]
["-","X",""]
["-","X",""]
["-","X",""]
["-","X",""]
["-","X",""]
["-","X",""]
["-","X",""]
["-","X",""]
["-","X",""]
["-","X",""]
["-","X",""]
["-","X",""]
["-","X",""]
["-","X",""]
["-","X",""]
["-","X",""]
["-","X",""]
["-","X",""]
["-","X",""]
["-","X",""]
["-","X",""]
["-","X",""]
["-","X",""]
["-","X",""]
["-","X",""]
["-","X",""]
["-","X",""]
["-","X",""]
["-","X",""]
["-","X",""]
["-","X",""]
["-","X",""]
["-","X",""]
["-","X",""]
["-","X",""]
["-",{"$f":"IF(J9375=K9375,\"X\",\"\")","v":"X"},""]
["-","X",""]
["-","X",""]
["-","X",""]
["-","X",""]
["-","X",""]
["-","X",""]
["-","X",""]
["-","X",""]
["-","X",""]
["-","X",""]
["-","X",""]
["-","X",""]
["-","X",""]
["-","X",""]
[{"$f":"CONCATENATE(D9390,\"-\",E9390)","v":"-"},"X",""]
["-","X",""]
["-","X",""]
["-","X",""]
["-","X",""]
["-","X",""]
["-","X",""]
["-","X",""]
["-","X",""]
["-","X",""]
["-","X",""]
["-","X",""]
["-","X",""]
["-","X",{"$f":"IF(ISERROR(VLOOKUP(A9405,Base_suivi_MPR,1,FALSE)),\"\",\"X\")","v":""}]
["-","X",""]
["-","X",""]
["-","X",""]
["-","X",""]
["-","X",""]
["-","X",""]
["-","X",""]
["-","X",""]
["-","X",""]
["-","X",""]
["-","X",""]
["-","X",""]
["-","X",""]
["-","X",""]
["-","X",""]
["-","X",""]
["-","X",""]
["-","X",""]
["-","X",""]
["-","X",""]
["-","X",""]
["-","X",""]
["-","X",""]
["-","X",""]
["-","X",""]
["-","X",""]
["-","X",""]
["-","X",""]
["-","X",""]
["-","X",""]
["-","X",""]
["-","X",""]
["-","X",""]
["-","X",""]
["-","X",""]
["-",{"$f":"IF(J9439=K9439,\"X\",\"\")","v":"X"},""]
["-","X",""]
["-","X",""]
["-","X",""]
["-","X",""]
["-","X",""]
["-","X",""]
["-","X",""]
["-","X",""]
["-","X",""]
["-","X",""]
["-","X",""]
["-","X",""]
["-","X",""]
["-","X",""]
[{"$f":"CONCATENATE(D9454,\"-\",E9454)","v":"-"},"X",""]
["-","X",""]
["-","X",""]
["-","X",""]
["-","X",""]
["-","X",""]
["-","X",""]
["-","X",""]
["-","X",""]
["-","X",""]
["-","X",""]
["-","X",""]
["-","X",""]
["-","X",{"$f":"IF(ISERROR(VLOOKUP(A9469,Base_suivi_MPR,1,FALSE)),\"\",\"X\")","v":""}]
["-","X",""]
["-","X",""]
["-","X",""]
["-","X",""]
["-","X",""]
["-","X",""]
["-","X",""]
["-","X",""]
["-","X",""]
["-","X",""]
["-","X",""]
["-","X",""]
["-","X",""]
["-","X",""]
["-","X",""]
["-","X",""]
["-","X",""]
["-","X",""]
["-","X",""]
["-","X",""]
["-","X",""]
["-","X",""]
["-","X",""]
["-","X",""]
["-","X",""]
["-","X",""]
["-","X",""]
["-","X",""]
["-","X",""]
["-","X",""]
["-","X",""]
["-","X",""]
["-","X",""]
["-","X",""]
["-","X",""]
["-",{"$f":"IF(J9503=K9503,\"X\",\"\")","v":"X"},""]
["-","X",""]
["-","X",""]
["-","X",""]
["-","X",""]
["-","X",""]
["-","X",""]
["-","X",""]
["-","X",""]
["-","X",""]
["-","X",""]
["-","X",""]
["-","X",""]
["-","X",""]
["-","X",""]
[{"$f":"CONCATENATE(D9518,\"-\",E9518)","v":"-"},"X",""]
["-","X",""]
["-","X",""]
["-","X",""]
["-","X",""]
["-","X",""]
["-","X",""]
["-","X",""]
["-","X",""]
["-","X",""]
["-","X",""]
["-","X",""]
["-","X",""]
["-","X",{"$f":"IF(ISERROR(VLOOKUP(A9533,Base_suivi_MPR,1,FALSE)),\"\",\"X\")","v":""}]
["-","X",""]
["-","X",""]
["-","X",""]
["-","X",""]
["-","X",""]
["-","X",""]
["-","X",""]
["-","X",""]
["-","X",""]
["-","X",""]
["-","X",""]
["-","X",""]
["-","X",""]
["-","X",""]
["-","X",""]
["-","X",""]
["-","X",""]
["-","X",""]
["-","X",""]
["-","X",""]
["-","X",""]
["-","X",""]
["-","X",""]
["-","X",""]
["-","X",""]
["-","X",""]
["-","X",""]
["-","X",""]
["-","X",""]
["-","X",""]
["-","X",""]
["-","X",""]
["-","X",""]
["-","X",""]
["-","X",""]
["-",{"$f":"IF(J9567=K9567,\"X\",\"\")","v":"X"},""]
["-","X",""]
["-","X",""]
["-","X",""]
["-","X",""]
["-","X",""]
["-","X",""]
["-","X",""]
["-","X",""]
["-","X",""]
["-","X",""]
["-","X",""]
["-","X",""]
["-","X",""]
["-","X",""]
[{"$f":"CONCATENATE(D9582,\"-\",E9582)","v":"-"},"X",""]
["-","X",""]
["-","X",""]
["-","X",""]
["-","X",""]
["-","X",""]
["-","X",""]
["-","X",""]
["-","X",""]
["-","X",""]
["-","X",""]
["-","X",""]
["-","X",""]
["-","X",{"$f":"IF(ISERROR(VLOOKUP(A9597,Base_suivi_MPR,1,FALSE)),\"\",\"X\")","v":""}]
["-","X",""]
["-","X",""]
["-","X",""]
["-","X",""]
["-","X",""]
["-","X",""]
["-","X",""]
["-","X",""]
["-","X",""]
["-","X",""]
["-","X",""]
["-","X",""]
["-","X",""]
["-","X",""]
["-","X",""]
["-","X",""]
["-","X",""]
["-","X",""]
["-","X",""]
["-","X",""]
["-","X",""]
["-","X",""]
["-","X",{"$f":"IF(ISERROR(VLOOKUP(A9620,Base_suivi_MPR,1,FALSE)),\"\",\"X\")","v":""}]
["-","X",""]
["-","X",""]
["-","X",""]
["-","X",""]
["-","X",""]
["-","X",""]
["-","X",""]
["-","X",""]
["-","X",""]
["-","X",""]
["-","X",""]
["-","X",""]
["-",{"$f":"IF(J9631=K9631,\"X\",\"\")","v":"X"},""]
["-","X",""]
["-","X",""]
["-","X",""]
["-","X",""]
["-","X",""]
["-","X",""]
["-","X",""]
["-","X",""]
["-","X",""]
["-","X",""]
["-","X",""]
["-","X",""]
["-","X",""]
["-","X",""]
[{"$f":"CONCATENATE(D9646,\"-\",E9646)","v":"-"},"X",""]
["-","X",""]
["-","X",""]
["-","X",""]
["-","X",""]
["-","X",""]
["-","X",""]
["-","X",""]
["-","X",""]
["-","X",""]
["-","X",""]
["-","X",""]
["-","X",""]
["-","X",""]
["-","X",""]
["-","X",""]
["-","X",""]
["-","X",""]
["-","X",""]
["-","X",""]
["-","X",""]
["-","X",""]
["-","X",""]
["-","X",""]
["-","X",""]
["-","X",""]
["-","X",""]
["-","X",""]
["-","X",""]
["-","X",""]
["-","X",""]
["-","X",""]
["-","X",""]
["-","X",""]
["-","X",""]
["-","X",""]
["-","X",{"$f":"IF(ISERROR(VLOOKUP(A9684,Base_suivi_MPR,1,FALSE)),\"\",\"X\")","v":""}]
["-","X",""]
["-","X",""]
["-","X",""]
["-","X",""]
["-","X",""]
["-","X",""]
["-","X",""]
["-","X",""]
["-","X",""]
["-","X",""]
["-","X",""]
["-","X",""]
["-",{"$f":"IF(J9695=K9695,\"X\",\"\")","v":"X"},""]
["-","X",""]
["-","X",""]
["-","X",""]
["-","X",""]
["-","X",""]
["-","X",""]
["-","X",""]
["-","X",""]
["-","X",""]
["-","X",""]
["-","X",""]
["-","X",""]
["-","X",""]
["-","X",""]
[{"$f":"CONCATENATE(D9710,\"-\",E9710)","v":"-"},"X",""]
["-","X",""]
["-","X",""]
["-","X",""]
["-","X",""]
["-","X",""]
["-","X",""]
["-","X",""]
["-","X",""]
["-","X",""]
["-","X",""]
["-","X",""]
["-","X",""]
["-","X",""]
["-","X",""]
["-","X",""]
["-","X",""]
["-","X",""]
["-","X",""]
["-","X",""]
["-","X",""]
["-","X",""]
["-","X",""]
["-","X",""]
["-","X",""]
["-","X",""]
["-","X",""]
["-","X",""]
["-","X",""]
["-","X",""]
["-","X",""]
["-","X",""]
["-","X",""]
["-","X",""]
["-","X",""]
["-","X",""]
["-","X",{"$f":"IF(ISERROR(VLOOKUP(A9748,Base_suivi_MPR,1,FALSE)),\"\",\"X\")","v":""}]
["-","X",""]
["-","X",""]
["-","X",""]
["-","X",""]
["-","X",""]
["-","X",""]
["-","X",""]
["-","X",""]
["-","X",""]
["-","X",""]
["-","X",""]
["-","X",""]
["-",{"$f":"IF(J9759=K9759,\"X\",\"\")","v":"X"},""]
["-","X",""]
["-","X",""]
["-","X",""]
["-","X",""]
["-","X",""]
["-","X",""]
["-","X",""]
["-","X",""]
["-","X",""]
["-","X",""]
["-","X",""]
["-","X",""]
["-","X",""]
["-","X",""]
[{"$f":"CONCATENATE(D9774,\"-\",E9774)","v":"-"},"X",""]
["-","X",""]
["-","X",""]
["-","X",""]
["-","X",""]
["-","X",""]
["-","X",""]
["-","X",""]
["-","X",""]
["-","X",""]
["-","X",""]
["-","X",""]
["-","X",""]
["-","X",""]
["-","X",""]
["-","X",""]
["-","X",""]
["-","X",""]
["-","X",""]
["-","X",""]
["-","X",""]
["-","X",""]
["-","X",""]
["-","X",""]
["-","X",""]
["-","X",""]
["-","X",""]
["-","X",""]
["-","X",""]
["-","X",""]
["-","X",""]
["-","X",""]
["-","X",""]
["-","X",""]
["-","X",""]
["-","X",""]
["-","X",{"$f":"IF(ISERROR(VLOOKUP(A9812,Base_suivi_MPR,1,FALSE)),\"\",\"X\")","v":""}]
["-","X",""]
["-","X",""]
["-","X",""]
["-","X",""]
["-","X",""]
["-","X",""]
["-","X",""]
["-","X",""]
["-","X",""]
["-","X",""]
["-","X",""]
["-","X",""]
["-",{"$f":"IF(J9823=K9823,\"X\",\"\")","v":"X"},""]
["-","X",""]
["-","X",""]
["-","X",""]
["-","X",""]
["-","X",""]
["-","X",""]
["-","X",""]
["-","X",""]
["-","X",""]
["-","X",""]
["-","X",""]
["-","X",""]
["-","X",""]
["-","X",""]
[{"$f":"CONCATENATE(D9838,\"-\",E9838)","v":"-"},"X",""]
["-","X",""]
["-","X",""]
["-","X",""]
["-","X",""]
["-","X",""]
["-","X",""]
["-","X",""]
["-","X",""]
["-","X",""]
["-","X",""]
["-","X",""]
["-","X",""]
["-","X",""]
["-","X",""]
["-","X",""]
["-","X",""]
["-","X",""]
["-","X",""]
["-","X",""]
["-","X",""]
["-","X",""]
["-","X",""]
["-","X",""]
["-","X",""]
["-","X",""]
["-","X",""]
["-","X",""]
["-","X",""]
["-","X",""]
["-","X",""]
["-","X",""]
["-","X",""]
["-","X",""]
["-","X",""]
["-","X",""]
["-","X",{"$f":"IF(ISERROR(VLOOKUP(A9876,Base_suivi_MPR,1,FALSE)),\"\",\"X\")","v":""}]
["-","X",""]
["-","X",""]
["-","X",""]
["-","X",""]
["-","X",""]
["-","X",""]
["-","X",""]
["-","X",""]
["-","X",""]
["-","X",""]
["-","X",""]
["-","X",""]
["-",{"$f":"IF(J9887=K9887,\"X\",\"\")","v":"X"},""]
["-","X",""]
["-","X",""]
["-","X",""]
["-","X",""]
["-","X",""]
["-","X",""]
["-","X",""]
["-","X",""]
["-","X",""]
["-","X",""]
["-","X",""]
["-","X",""]
["-","X",""]
["-","X",""]
[{"$f":"CONCATENATE(D9902,\"-\",E9902)","v":"-"},"X",""]
["-","X",""]
["-","X",""]
["-","X",""]
["-","X",""]
["-","X",""]
["-","X",""]
["-","X",""]
["-","X",""]
["-","X",""]
["-","X",""]
["-","X",""]
["-","X",""]
["-","X",""]
["-","X",""]
["-","X",""]
["-","X",""]
["-","X",""]
["-","X",""]
["-","X",""]
["-","X",""]
["-","X",""]
["-","X",""]
["-","X",""]
["-","X",""]
["-","X",""]
["-","X",""]
["-","X",""]
["-","X",""]
["-","X",""]
["-","X",""]
["-","X",""]
["-","X",""]
["-","X",""]
["-","X",""]
["-","X",""]
["-","X",{"$f":"IF(ISERROR(VLOOKUP(A9940,Base_suivi_MPR,1,FALSE)),\"\",\"X\")","v":""}]
["-","X",""]
["-","X",""]
["-","X",""]
["-","X",""]
["-","X",""]
["-","X",""]
["-","X",""]
["-","X",""]
["-","X",""]
["-","X",""]
["-","X",""]
["-","X",""]
["-",{"$f":"IF(J9951=K9951,\"X\",\"\")","v":"X"},""]
["-","X",""]
["-","X",""]
["-","X",""]
["-","X",""]
["-","X",""]
["-","X",""]
["-","X",""]
["-","X",""]
["-","X",""]
["-","X",""]
["-","X",""]
["-","X",""]
["-","X",""]
["-","X",""]
[{"$f":"CONCATENATE(D9966,\"-\",E9966)","v":"-"},"X",""]
["-","X",""]
["-","X",""]
["-","X",""]
["-","X",""]
["-","X",""]
["-","X",""]
["-","X",""]
["-","X",""]
["-","X",""]
["-","X",""]
["-","X",""]
["-","X",""]
["-","X",""]
["-","X",""]
["-","X",""]
["-","X",""]
["-","X",""]
["-","X",""]
["-","X",""]
["-","X",""]
["-","X",""]
["-","X",""]
["-","X",""]
["-","X",""]
["-","X",""]
["-","X",""]
["-","X",""]
["-","X",""]
["-","X",""]
["-","X",""]
["-","X",""]
["-","X",""]
["-","X",""]
["-","X",""]
["-","X",""]
["-","X",{"$f":"IF(ISERROR(VLOOKUP(A10004,Base_suivi_MPR,1,FALSE)),\"\",\"X\")","v":""}]
["-","X",""]
["-","X",""]
["-","X",""]
["-","X",""]
["-","X",""]
["-","X",""]
["-","X",""]
["-","X",""]
["-","X",""]
["-","X",""]
["-","X",""]
["-","X",""]
["-",{"$f":"IF(J10015=K10015,\"X\",\"\")","v":"X"},""]
["-","X",""]
["-","X",""]
["-","X",""]
["-","X",""]
["-","X",""]
["-","X",""]
["-","X",""]
["-","X",""]
["-","X",""]
["-","X",""]
["-","X",""]
["-","X",""]
["-","X",""]
["-","X",""]
[{"$f":"CONCATENATE(D10030,\"-\",E10030)","v":"-"},"X",""]
["-","X",""]
["-","X",""]
["-","X",""]
["-","X",""]
["-","X",""]
["-","X",""]
["-","X",""]
["-","X",""]
["-","X",""]
["-","X",""]
["-","X",""]
["-","X",""]
["-","X",""]
["-","X",""]
["-","X",""]
["-","X",""]
["-","X",""]
["-","X",""]
["-","X",""]
["-","X",""]
["-","X",""]
["-","X",""]
["-","X",""]
["-","X",""]
["-","X",""]
["-","X",""]
["-","X",""]
["-","X",""]
["-","X",""]
["-","X",""]
["-","X",""]
["-","X",""]
["-","X",""]
["-","X",""]
["-","X",""]
["-","X",{"$f":"IF(ISERROR(VLOOKUP(A10068,Base_suivi_MPR,1,FALSE)),\"\",\"X\")","v":""}]
["-","X",""]
["-","X",""]
["-","X",""]
["-","X",""]
["-","X",""]
["-","X",""]
["-","X",""]
["-","X",""]
["-","X",""]
["-","X",""]
["-","X",""]
["-","X",""]
["-",{"$f":"IF(J10079=K10079,\"X\",\"\")","v":"X"},""]
["-","X",""]
["-","X",""]
["-","X",""]
["-","X",""]
["-","X",""]
["-","X",""]
["-","X",""]
["-","X",""]
["-","X",""]
["-","X",""]
["-","X",""]
["-","X",""]
["-","X",""]
["-","X",""]
[{"$f":"CONCATENATE(D10094,\"-\",E10094)","v":"-"},"X",""]
["-","X",""]
["-","X",""]
["-","X",""]
["-","X",""]
["-","X",""]
["-","X",""]
["-","X",""]
["-","X",""]
["-","X",""]
["-","X",""]
["-","X",""]
["-","X",""]
["-","X",""]
["-","X",""]
["-","X",""]
["-","X",""]
["-","X",""]
["-","X",""]
["-","X",""]
["-","X",""]
["-","X",""]
["-","X",""]
["-","X",""]
["-","X",""]
["-","X",""]
["-","X",""]
["-","X",""]
["-","X",""]
["-","X",""]
["-","X",""]
["-","X",""]
["-","X",""]
["-","X",""]
["-","X",""]
["-","X",""]
["-","X",{"$f":"IF(ISERROR(VLOOKUP(A10132,Base_suivi_MPR,1,FALSE)),\"\",\"X\")","v":""}]
["-","X",""]
["-","X",""]
["-","X",""]
["-","X",""]
["-","X",""]
["-","X",""]
["-","X",""]
["-","X",""]
["-","X",""]
["-","X",""]
["-","X",""]
["-","X",""]
["-",{"$f":"IF(J10143=K10143,\"X\",\"\")","v":"X"},""]
["-","X",""]
["-","X",""]
["-","X",""]
["-","X",""]
["-","X",""]
["-","X",""]
["-","X",""]
["-","X",""]
["-","X",""]
["-","X",""]
["-","X",""]
["-","X",""]
["-","X",""]
["-","X",""]
[{"$f":"CONCATENATE(D10158,\"-\",E10158)","v":"-"},"X",""]
["-","X",""]
["-","X",""]
["-","X",""]
["-","X",""]
["-","X",""]
["-","X",""]
["-","X",""]
["-","X",""]
["-","X",""]
["-","X",""]
["-","X",""]
["-","X",""]
["-","X",""]
["-","X",""]
["-","X",""]
["-","X",""]
["-","X",""]
["-","X",""]
["-","X",""]
["-","X",""]
["-","X",""]
["-","X",""]
["-","X",""]
["-","X",""]
["-","X",""]
["-","X",""]
["-","X",""]
["-","X",""]
["-","X",""]
["-","X",""]
["-","X",""]
["-","X",""]
["-","X",""]
["-","X",""]
["-","X",""]
["-","X",{"$f":"IF(ISERROR(VLOOKUP(A10196,Base_suivi_MPR,1,FALSE)),\"\",\"X\")","v":""}]
["-","X",""]
["-","X",""]
["-","X",""]
["-","X",""]
["-","X",""]
["-","X",""]
["-","X",""]
["-","X",""]
["-","X",""]
["-","X",""]
["-","X",""]
["-","X",""]
["-",{"$f":"IF(J10207=K10207,\"X\",\"\")","v":"X"},""]
["-","X",""]
["-","X",""]
["-","X",""]
["-","X",""]
["-","X",""]
["-","X",""]
["-","X",""]
["-","X",""]
["-","X",""]
["-","X",""]
["-","X",""]
["-","X",""]
["-","X",""]
["-","X",""]
[{"$f":"CONCATENATE(D10222,\"-\",E10222)","v":"-"},"X",""]
["-","X",""]
["-","X",""]
["-","X",""]
["-","X",""]
["-","X",""]
["-","X",""]
["-","X",""]
["-","X",""]
["-","X",""]
["-","X",""]
["-","X",""]
["-","X",""]
["-","X",""]
["-","X",""]
["-","X",""]
["-","X",""]
["-","X",""]
["-","X",""]
["-","X",""]
["-","X",""]
["-","X",""]
["-","X",""]
["-","X",""]
["-","X",""]
["-","X",""]
["-","X",""]
["-","X",""]
["-","X",""]
["-","X",""]
["-","X",""]
["-","X",""]
["-","X",""]
["-","X",""]
["-","X",""]
["-","X",""]
["-","X",{"$f":"IF(ISERROR(VLOOKUP(A10260,Base_suivi_MPR,1,FALSE)),\"\",\"X\")","v":""}]
["-","X",""]
["-","X",""]
["-","X",""]
["-","X",""]
["-","X",""]
["-","X",""]
["-","X",""]
["-","X",""]
["-","X",""]
["-","X",""]
["-","X",""]
["-","X",""]
["-",{"$f":"IF(J10271=K10271,\"X\",\"\")","v":"X"},""]
["-","X",""]
["-","X",""]
["-","X",""]
["-","X",""]
["-","X",""]
["-","X",""]
["-","X",""]
["-","X",""]
["-","X",""]
["-","X",""]
["-","X",""]
["-","X",""]
["-","X",""]
["-","X",""]
[{"$f":"CONCATENATE(D10286,\"-\",E10286)","v":"-"},"X",""]
["-","X",""]
["-","X",""]
["-","X",""]
["-","X",""]
["-","X",""]
["-","X",""]
["-","X",""]
["-","X",""]
["-","X",""]
["-","X",""]
["-","X",""]
["-","X",""]
["-","X",""]
["-","X",""]
["-","X",""]
["-","X",""]
["-","X",""]
["-","X",""]
["-","X",""]
["-","X",""]
["-","X",""]
["-","X",""]
["-","X",""]
["-","X",""]
["-","X",""]
["-","X",""]
["-","X",""]
["-","X",""]
["-","X",""]
["-","X",""]
["-","X",""]
["-","X",""]
["-","X",""]
["-","X",""]
["-","X",""]
["-","X",{"$f":"IF(ISERROR(VLOOKUP(A10324,Base_suivi_MPR,1,FALSE)),\"\",\"X\")","v":""}]
["-","X",""]
["-","X",""]
["-","X",""]
["-","X",""]
["-","X",""]
["-","X",""]
["-","X",""]
["-","X",""]
["-","X",""]
["-","X",""]
["-","X",""]
["-","X",""]
["-",{"$f":"IF(J10335=K10335,\"X\",\"\")","v":"X"},""]
["-","X",""]
["-","X",""]
["-","X",""]
["-","X",""]
["-","X",""]
["-","X",""]
["-","X",""]
["-","X",""]
["-","X",""]
["-","X",""]
["-","X",""]
["-","X",""]
["-","X",""]
["-","X",""]
[{"$f":"CONCATENATE(D10350,\"-\",E10350)","v":"-"},"X",""]
["-","X",""]
["-","X",""]
["-","X",""]
["-","X",""]
["-","X",""]
["-","X",""]
["-","X",""]
["-","X",""]
["-","X",""]
["-","X",""]
["-","X",""]
["-","X",""]
["-","X",""]
["-","X",""]
["-","X",""]
["-","X",""]
["-","X",""]
["-","X",""]
["-","X",""]
["-","X",""]
["-","X",""]
["-","X",""]
["-","X",""]
["-","X",""]
["-","X",""]
["-","X",""]
["-","X",""]
["-","X",""]
["-","X",""]
["-","X",""]
["-","X",""]
["-","X",""]
["-","X",""]
["-","X",""]
["-","X",""]
["-","X",{"$f":"IF(ISERROR(VLOOKUP(A10388,Base_suivi_MPR,1,FALSE)),\"\",\"X\")","v":""}]
["-","X",""]
["-","X",""]
["-","X",""]
["-","X",""]
["-","X",""]
["-","X",""]
["-","X",""]
["-","X",""]
["-","X",""]
["-","X",""]
["-","X",""]
["-","X",""]
["-",{"$f":"IF(J10399=K10399,\"X\",\"\")","v":"X"},""]
["-","X",""]
["-","X",""]
["-","X",""]
["-","X",""]
["-","X",""]
["-","X",""]
["-","X",""]
["-","X",""]
["-","X",""]
["-","X",""]
["-","X",""]
["-","X",""]
["-","X",""]
["-","X",""]
[{"$f":"CONCATENATE(D10414,\"-\",E10414)","v":"-"},"X",""]
["-","X",""]
["-","X",""]
["-","X",""]
["-","X",""]
["-","X",""]
["-","X",""]
["-","X",""]
["-","X",""]
["-","X",""]
["-","X",""]
["-","X",""]
["-","X",""]
["-","X",""]
["-","X",""]
["-","X",""]
["-","X",""]
["-","X",""]
["-","X",""]
["-","X",""]
["-","X",""]
["-","X",""]
["-","X",""]
["-","X",""]
["-","X",""]
["-","X",""]
["-","X",""]
["-","X",""]
["-","X",""]
["-","X",""]
["-","X",""]
["-","X",""]
["-","X",""]
["-","X",""]
["-","X",""]
["-","X",""]
["-","X",{"$f":"IF(ISERROR(VLOOKUP(A10452,Base_suivi_MPR,1,FALSE)),\"\",\"X\")","v":""}]
["-","X",""]
["-","X",""]
["-","X",""]
["-","X",""]
["-","X",""]
["-","X",""]
["-","X",""]
["-","X",""]
["-","X",""]
["-","X",""]
["-","X",""]
["-","X",""]
["-",{"$f":"IF(J10463=K10463,\"X\",\"\")","v":"X"},""]
["-","X",""]
["-","X",""]
["-","X",""]
["-","X",""]
["-","X",""]
["-","X",""]
["-","X",""]
["-","X",""]
["-","X",""]
["-","X",""]
["-","X",""]
["-","X",""]
["-","X",""]
["-","X",""]
[{"$f":"CONCATENATE(D10478,\"-\",E10478)","v":"-"},"X",""]
["-","X",""]
["-","X",""]
["-","X",""]
["-","X",""]
["-","X",""]
["-","X",""]
["-","X",""]
["-","X",""]
["-","X",""]
["-","X",""]
["-","X",""]
["-","X",""]
["-","X",""]
["-","X",""]
["-","X",""]
["-","X",""]
["-","X",""]
["-","X",""]
["-","X",""]
["-","X",""]
["-","X",""]
["-","X",""]
["-","X",""]
["-","X",""]
["-","X",""]
["-","X",""]
["-","X",""]
["-","X",""]
["-","X",""]
["-","X",""]
["-","X",""]
["-","X",""]
["-","X",""]
["-","X",""]
["-","X",""]
["-","X",{"$f":"IF(ISERROR(VLOOKUP(A10516,Base_suivi_MPR,1,FALSE)),\"\",\"X\")","v":""}]
["-","X",""]
["-","X",""]
["-","X",""]
["-","X",""]
["-","X",""]
["-","X",""]
["-","X",""]
["-","X",""]
["-","X",""]
["-","X",""]
["-","X",""]
["-","X",""]
["-",{"$f":"IF(J10527=K10527,\"X\",\"\")","v":"X"},""]
["-","X",""]
["-","X",""]
["-","X",""]
["-","X",""]
["-","X",""]
["-","X",""]
["-","X",""]
["-","X",""]
["-","X",""]
["-","X",""]
["-","X",""]
["-","X",""]
["-","X",""]
["-","X",""]
[{"$f":"CONCATENATE(D10542,\"-\",E10542)","v":"-"},"X",""]
["-","X",""]
["-","X",""]
["-","X",""]
["-","X",""]
["-","X",""]
["-","X",""]
["-","X",""]
["-","X",""]
["-","X",""]
["-","X",""]
["-","X",""]
["-","X",""]
["-","X",""]
["-","X",""]
["-","X",""]
["-","X",""]
["-","X",""]
["-","X",""]
["-","X",""]
["-","X",""]
["-","X",""]
["-","X",""]
["-","X",""]
["-","X",""]
["-","X",""]
["-","X",""]
["-","X",""]
["-","X",""]
["-","X",""]
["-","X",""]
["-","X",""]
["-","X",""]
["-","X",""]
["-","X",""]
["-","X",""]
["-","X",{"$f":"IF(ISERROR(VLOOKUP(A10580,Base_suivi_MPR,1,FALSE)),\"\",\"X\")","v":""}]
["-","X",""]
["-","X",""]
["-","X",""]
["-","X",""]
["-","X",""]
["-","X",""]
["-","X",""]
["-","X",""]
["-","X",""]
["-","X",""]
["-","X",""]
["-","X",""]
["-",{"$f":"IF(J10591=K10591,\"X\",\"\")","v":"X"},""]
["-","X",""]
["-","X",""]
["-","X",""]
["-","X",""]
["-","X",""]
["-","X",""]
["-","X",""]
["-","X",""]
["-","X",""]
["-","X",""]
["-","X",""]
["-","X",""]
["-","X",""]
["-","X",""]
[{"$f":"CONCATENATE(D10606,\"-\",E10606)","v":"-"},"X",""]
["-","X",""]
["-","X",""]
["-","X",""]
["-","X",""]
["-","X",""]
["-","X",""]
["-","X",""]
["-","X",""]
["-","X",""]
["-","X",""]
["-","X",""]
["-","X",""]
["-","X",""]
["-","X",""]
["-","X",""]
["-","X",""]
["-","X",""]
["-","X",""]
["-","X",""]
["-","X",""]
["-","X",""]
["-","X",""]
["-","X",""]
["-","X",""]
["-","X",""]
["-","X",""]
["-","X",""]
["-","X",""]
["-","X",""]
["-","X",""]
["-","X",""]
["-","X",""]
["-","X",""]
["-","X",""]
["-","X",""]
["-","X",{"$f":"IF(ISERROR(VLOOKUP(A10644,Base_suivi_MPR,1,FALSE)),\"\",\"X\")","v":""}]
["-","X",""]
["-","X",""]
["-","X",""]
["-","X",""]
["-","X",""]
["-","X",""]
["-","X",""]
["-","X",""]
["-","X",""]
["-","X",""]
["-","X",""]
["-","X",""]
["-",{"$f":"IF(J10655=K10655,\"X\",\"\")","v":"X"},""]
["-","X",""]
["-","X",""]
["-","X",""]
["-","X",""]
["-","X",""]
["-","X",""]
["-","X",""]
["-","X",""]
["-","X",""]
["-","X",""]
["-","X",""]
["-","X",""]
["-","X",""]
["-","X",""]
[{"$f":"CONCATENATE(D10670,\"-\",E10670)","v":"-"},"X",""]
["-","X",""]
["-","X",""]
["-","X",""]
["-","X",""]
["-","X",""]
["-","X",""]
["-","X",""]
["-","X",""]
["-","X",""]
["-","X",""]
["-","X",""]
["-","X",""]
["-","X",""]
["-","X",""]
["-","X",""]
["-","X",""]
["-","X",""]
["-","X",""]
["-","X",""]
["-","X",""]
["-","X",""]
["-","X",""]
["-","X",""]
["-","X",""]
["-","X",""]
["-","X",""]
["-","X",""]
["-","X",""]
["-","X",""]
["-","X",""]
["-","X",""]
["-","X",""]
["-","X",""]
["-","X",""]
["-","X",""]
["-","X",{"$f":"IF(ISERROR(VLOOKUP(A10708,Base_suivi_MPR,1,FALSE)),\"\",\"X\")","v":""}]
["-","X",""]
["-","X",""]
["-","X",""]
["-","X",""]
["-","X",""]
["-","X",""]
["-","X",""]
["-","X",""]
["-","X",""]
["-","X",""]
["-","X",""]
["-","X",""]
["-",{"$f":"IF(J10719=K10719,\"X\",\"\")","v":"X"},""]
["-","X",""]
["-","X",""]
["-","X",""]
["-","X",""]
["-","X",""]
["-","X",""]
["-","X",""]
["-","X",""]
["-","X",""]
["-","X",""]
["-","X",""]
["-","X",""]
["-","X",""]
["-","X",""]
[{"$f":"CONCATENATE(D10734,\"-\",E10734)","v":"-"},"X",""]
["-","X",""]
["-","X",""]
["-","X",""]
["-","X",""]
["-","X",""]
["-","X",""]
["-","X",""]
["-","X",""]
["-","X",""]
["-","X",""]
["-","X",""]
["-","X",""]
["-","X",""]
["-","X",""]
["-","X",""]
["-","X",""]
["-","X",""]
["-","X",""]
["-","X",""]
["-","X",""]
["-","X",""]
["-","X",""]
["-","X",""]
["-","X",""]
["-","X",""]
["-","X",""]
["-","X",""]
["-","X",""]
["-","X",""]
["-","X",""]
["-","X",""]
["-","X",""]
["-","X",""]
["-","X",""]
["-","X",""]
["-","X",{"$f":"IF(ISERROR(VLOOKUP(A10772,Base_suivi_MPR,1,FALSE)),\"\",\"X\")","v":""}]
["-","X",""]
["-","X",""]
["-","X",""]
["-","X",""]
["-","X",""]
["-","X",""]
["-","X",""]
["-","X",""]
["-","X",""]
["-","X",""]
["-","X",""]
["-","X",""]
["-",{"$f":"IF(J10783=K10783,\"X\",\"\")","v":"X"},""]
["-","X",""]
["-","X",""]
["-","X",""]
["-","X",""]
["-","X",""]
["-","X",""]
["-","X",""]
["-","X",""]
["-","X",""]
["-","X",""]
["-","X",""]
["-","X",""]
["-","X",""]
["-","X",""]
[{"$f":"CONCATENATE(D10798,\"-\",E10798)","v":"-"},"X",""]
["-","X",""]
["-","X",""]
["-","X",""]
["-","X",""]
["-","X",""]
["-","X",""]
["-","X",""]
["-","X",""]
["-","X",""]
["-","X",""]
["-","X",""]
["-","X",""]
["-","X",""]
["-","X",""]
["-","X",""]
["-","X",""]
["-","X",""]
["-","X",""]
["-","X",""]
["-","X",""]
["-","X",""]
["-","X",""]
["-","X",""]
["-","X",""]
["-","X",""]
["-","X",""]
["-","X",""]
["-","X",""]
["-","X",""]
["-","X",""]
["-","X",""]
["-","X",""]
["-","X",""]
["-","X",""]
["-","X",""]
["-","X",{"$f":"IF(ISERROR(VLOOKUP(A10836,Base_suivi_MPR,1,FALSE)),\"\",\"X\")","v":""}]
["-","X",""]
["-","X",""]
["-","X",""]
["-","X",""]
["-","X",""]
["-","X",""]
["-","X",""]
["-","X",""]
["-","X",""]
["-","X",""]
["-","X",""]
["-","X",""]
["-",{"$f":"IF(J10847=K10847,\"X\",\"\")","v":"X"},""]
["-","X",""]
["-","X",""]
["-","X",""]
["-","X",""]
["-","X",""]
["-","X",""]
["-","X",""]
["-","X",""]
["-","X",""]
["-","X",""]
["-","X",""]
["-","X",""]
["-","X",""]
["-","X",""]
[{"$f":"CONCATENATE(D10862,\"-\",E10862)","v":"-"},"X",""]
["-","X",""]
["-","X",""]
["-","X",""]
["-","X",""]
["-","X",""]
["-","X",""]
["-","X",""]
["-","X",""]
["-","X",""]
["-","X",""]
["-","X",""]
["-","X",""]
["-","X",""]
["-","X",""]
["-","X",""]
["-","X",""]
["-","X",""]
["-","X",""]
["-","X",""]
["-","X",""]
["-","X",""]
["-","X",""]
["-","X",""]
["-","X",""]
["-","X",""]
["-","X",""]
["-","X",""]
["-","X",""]
["-","X",""]
["-","X",""]
["-","X",""]
["-","X",""]
["-","X",""]
["-","X",""]
["-","X",""]
["-","X",{"$f":"IF(ISERROR(VLOOKUP(A10900,Base_suivi_MPR,1,FALSE)),\"\",\"X\")","v":""}]
["-","X",""]
["-","X",""]
["-","X",""]
["-","X",""]
["-","X",""]
["-","X",""]
["-","X",""]
["-","X",""]
["-","X",""]
["-","X",""]
["-","X",""]
["-","X",""]
["-",{"$f":"IF(J10911=K10911,\"X\",\"\")","v":"X"},""]
["-","X",""]
["-","X",""]
["-","X",""]
["-","X",""]
["-","X",""]
["-","X",""]
["-","X",""]
["-","X",""]
["-","X",""]
["-","X",""]
["-","X",""]
["-","X",""]
["-","X",""]
["-","X",""]
[{"$f":"CONCATENATE(D10926,\"-\",E10926)","v":"-"},"X",""]
["-","X",""]
["-","X",""]
["-","X",""]
["-","X",""]
["-","X",""]
["-","X",""]
["-","X",""]
["-","X",""]
["-","X",""]
["-","X",""]
["-","X",""]
["-","X",""]
["-","X",""]
["-","X",""]
["-","X",""]
["-","X",""]
["-","X",""]
["-","X",""]
["-","X",""]
["-","X",""]
["-","X",""]
["-","X",""]
["-","X",""]
["-","X",""]
["-","X",""]
["-","X",""]
["-","X",""]
["-","X",""]
["-","X",""]
["-","X",""]
["-","X",""]
["-","X",""]
["-","X",""]
["-","X",""]
["-","X",""]
["-","X",{"$f":"IF(ISERROR(VLOOKUP(A10964,Base_suivi_MPR,1,FALSE)),\"\",\"X\")","v":""}]
["-","X",""]
["-","X",""]
["-","X",""]
["-","X",""]
["-","X",""]
["-","X",""]
["-","X",""]
["-","X",""]
["-","X",""]
["-","X",""]
["-","X",""]
["-","X",""]
["-",{"$f":"IF(J10975=K10975,\"X\",\"\")","v":"X"},""]
["-","X",""]
["-","X",""]
["-","X",""]
["-","X",""]
["-","X",""]
["-","X",""]
["-","X",""]
["-","X",""]
["-","X",""]
["-","X",""]
["-","X",""]
["-","X",""]
["-","X",""]
["-","X",""]
[{"$f":"CONCATENATE(D10990,\"-\",E10990)","v":"-"},"X",""]
["-","X",""]
["-","X",""]
["-","X",""]
["-","X",""]
["-","X",""]
["-","X",""]
["-","X",""]
["-","X",""]
["-","X",""]
["-","X",""]
["-","X",""]
["-","X",""]
["-","X",""]
["-","X",""]
["-","X",""]
["-","X",""]
["-","X",""]
["-","X",""]
["-","X",""]
["-","X",""]
["-","X",""]
["-","X",""]
["-","X",""]
["-","X",""]
["-","X",""]
["-","X",""]
["-","X",""]
["-","X",""]
["-","X",""]
["-","X",""]
["-","X",""]
["-","X",""]
["-","X",""]
["-","X",""]
["-","X",""]
["-","X",{"$f":"IF(ISERROR(VLOOKUP(A11028,Base_suivi_MPR,1,FALSE)),\"\",\"X\")","v":""}]
["-","X",""]
["-","X",""]
["-","X",""]
["-","X",""]
["-","X",""]
["-","X",""]
["-","X",""]
["-","X",""]
["-","X",""]
["-","X",""]
["-","X",""]
["-","X",""]
["-",{"$f":"IF(J11039=K11039,\"X\",\"\")","v":"X"},""]
["-","X",""]
["-","X",""]
["-","X",""]
["-","X",""]
["-","X",""]
["-","X",""]
["-","X",""]
["-","X",""]
["-","X",""]
[null,"X"]

{"sheet":"Relance Cergy","index":4,"n_rows":93,"n_cols":8,"rows_kept":93,"cut":false,"hidden":false,"merged":[]}
[]
["Cde","Ligne","Référence","Date commande","Qté","Statut initial","Commentaire Initial MPR","Réponse MPR"]
[180,350,"410114EA0A","2016-06-28",30,230]
[207,170,7705030156,"2016-07-25",20,230]
[208,320,"144B05233R","2016-07-26",2,220]
[215,310,7711782372,"2016-08-02",1,130]
[242,200,"628908106R","2016-08-29",2,220]
[244,490,"255545857R","2016-08-31",12,230]
[250,360,7711419431,"2016-09-06",2,230]
[251,700,"628908106R","2016-09-07",2,220]
[252,200,7701421117,"2016-09-08",2,230]
[252,230,7701512272,"2016-09-08",1,230]
[252,520,"403006329R","2016-09-08",125,230]
[256,120,"727125064R","2016-09-12",3,230]
[257,250,"8200420632\n8200725767","2016-09-13",2,230]
[257,300,"8200517930\n8200725767","2016-09-13",2,230]
[258,230,8200545725,"2016-09-14",300,230]
[259,320,"628908106R","2016-09-15",2,220]
[263,470,"628908106R","2016-09-19",2,220]
[266,170,7700428589,"2016-09-22",100,230]
[266,310,7711425783,"2016-09-22",1,230]
[267,420,"144B05233R","2016-09-23",1,230]
[270,300,7703297121,"2016-09-26",200,230]
[270,330,7711381969,"2016-09-26",3,230]
[270,720,"296955229R","2016-09-26",3,230]
[270,780,"465039034R","2016-09-26",6,230]
[271,480,"749021679R","2016-09-27",1,230]
[272,330,7711381769,"2016-09-28",3,230]
[272,340,7711419431,"2016-09-28",6,230]
[274,190,7711392297,"2016-09-30",20,230]
[277,60,7711381973,"2016-10-03",1,230]
[277,310,7703497285,"2016-10-03",50,230]
[277,460,"214101428R","2016-10-03",1,230]
[277,580,"476608628R","2016-10-03",1,230]
[278,150,7701394430,"2016-10-04",3,230]
[278,310,"296099924R","2016-10-04",1,230]
[279,380,"749021679R","2016-10-05",2,230]
[281,80,8201571730,"2016-10-07",1,230]
[281,390,8201489213,"2016-10-07",2,220]
[284,170,7701394430,"2016-10-10",5,230]
[286,50,7711426403,"2016-10-12",2,"commande directe 156"]
[286,60,7711780436,"2016-10-12",1,230]
[286,170,7711216791,"2016-10-12",2,230]
[286,220,7711419431,"2016-10-12",4,230]
[286,480,"283E85657R","2016-10-12",10,230]
[286,590,"628908106R","2016-10-12",2,220]
[287,60,7711573597,"2016-10-13",2,"commande directe 152"]
[287,150,7711239373,"2016-10-13",1,230]
[287,440,"288953663R","2016-10-13",1,230]
[287,450,"288B55332R","2016-10-13",1,230]
[287,570,"964013442R","2016-10-13",2,230]
[288,80,7711573599,"2016-10-14",6,"commande directe 153"]
[288,120,7700843546,"2016-10-14",1000,230]
[288,200,7711573596,"2016-10-14",6,"commande directe 155"]
[288,220,7711576123,"2016-10-14",1,230]
[288,370,8201645511,"2016-10-14",2,"commande directe 154"]
[291,180,7704002509,"2016-10-17",300,230]
[291,200,7711172286,"2016-10-17",12,230]
[291,360,7711782082,"2016-10-17",4,130]
[291,420,8201420512,"2016-10-17",4,210]
[291,610,"873203208R","2016-10-17",1,230]
[292,50,7711426403,"2016-10-18",2,"comamnde directe 157"]
[292,70,8200070652,"2016-10-18",6,230]
[292,280,7711392297,"2016-10-18",20,230]
[293,70,7711382005,"2016-10-19",30,230]
[293,480,"217102781R","2016-10-19",2,230]
[293,530,"280907095R","2016-10-19",2,230]
[293,610,"296950307R","2016-10-19",1,230]
[293,620,"297A38225R","2016-10-19",1,230]
[293,630,"402622Y000","2016-10-19",4,230]
[293,640,"40262JA000","2016-10-19",4,230]
[293,650,"502705683R","2016-10-19",10,230]
[293,760,"809013617R","2016-10-19",1,230]
[293,820,"924871682R","2016-10-19",4,230]
[293,880,"403001068R","2016-10-19",4,230]
[294,41,7711423177,"2016-10-20",2]
[294,51,7711238597,"2016-10-20",2]
[294,60,7711382005,"2016-10-20",50,230]
[294,70,7711419085,"2016-10-20",1]
[294,111,7711238596,"2016-10-20",2]
[294,190,7711423286,"2016-10-20",1]
[294,201,7711428130,"2016-10-20",12]
[294,320,8201487253,"2016-10-20",1,220]
[294,430,"403009592R","2016-10-20",2,220]
[294,480,"801M25000R","2016-10-20",1,230]
[294,560,"963024306R","2016-10-20",1,230]
[294,610,7711424423,"2016-10-20",1]
[294,631,7711238598,"2016-10-20",2]
[294,640,7711230453,"2016-10-20",1]
[294,650,7711423287,"2016-10-20",1]
[294,660,7711419086,"2016-10-20",1]
[294,681,7711575175,"2016-10-20",2]
[294,710,"403006336R","2016-10-20",1,230]

{"sheet":"LX02","index":5,"n_rows":150,"n_cols":4,"rows_kept":150,"cut":false,"hidden":false,"merged":[]}
[{"$f":"'[2]LX02 transfert'!A1","v":7700777886},{"$f":"'[2]LX02 transfert'!B1","v":"RONDELLE POUR AGRAFE DE FIXATION"},{"$f":"'[2]LX02 transfert'!C1","v":8},{"$f":"'[2]LX02 transfert'!D1","v":"2007-03-27"}]
[{"$f":"'[2]LX02 transfert'!A2","v":7701207066},{"$f":"'[2]LX02 transfert'!B2","v":"PLAQUETTE DE FREIN X65 GIRLING"},{"$f":"'[2]LX02 transfert'!C2","v":5},{"$f":"'[2]LX02 transfert'!D2","v":"2007-03-27"}]
[{"$f":"'[2]LX02 transfert'!A3","v":0},{"$f":"'[2]LX02 transfert'!B3","v":0},{"$f":"'[2]LX02 transfert'!C3","v":0},{"$f":"'[2]LX02 transfert'!D3","v":"00:00:00"}]
[{"$f":"'[2]LX02 transfert'!A4","v":0},{"$f":"'[2]LX02 transfert'!B4","v":0},{"$f":"'[2]LX02 transfert'!C4","v":0},{"$f":"'[2]LX02 transfert'!D4","v":"00:00:00"}]
[{"$f":"'[2]LX02 transfert'!A5","v":0},{"$f":"'[2]LX02 transfert'!B5","v":0},{"$f":"'[2]LX02 transfert'!C5","v":0},{"$f":"'[2]LX02 transfert'!D5","v":"00:00:00"}]
[{"$f":"'[2]LX02 transfert'!A6","v":0},{"$f":"'[2]LX02 transfert'!B6","v":0},{"$f":"'[2]LX02 transfert'!C6","v":0},{"$f":"'[2]LX02 transfert'!D6","v":"00:00:00"}]
[{"$f":"'[2]LX02 transfert'!A7","v":0},{"$f":"'[2]LX02 transfert'!B7","v":0},{"$f":"'[2]LX02 transfert'!C7","v":0},{"$f":"'[2]LX02 transfert'!D7","v":"00:00:00"}]
[{"$f":"'[2]LX02 transfert'!A8","v":0},{"$f":"'[2]LX02 transfert'!B8","v":0},{"$f":"'[2]LX02 transfert'!C8","v":0},{"$f":"'[2]LX02 transfert'!D8","v":"00:00:00"}]
[{"$f":"'[2]LX02 transfert'!A9","v":0},{"$f":"'[2]LX02 transfert'!B9","v":0},{"$f":"'[2]LX02 transfert'!C9","v":0},{"$f":"'[2]LX02 transfert'!D9","v":"00:00:00"}]
[{"$f":"'[2]LX02 transfert'!A10","v":0},{"$f":"'[2]LX02 transfert'!B10","v":0},{"$f":"'[2]LX02 transfert'!C10","v":0},{"$f":"'[2]LX02 transfert'!D10","v":"00:00:00"}]
[{"$f":"'[2]LX02 transfert'!A11","v":0},{"$f":"'[2]LX02 transfert'!B11","v":0},{"$f":"'[2]LX02 transfert'!C11","v":0},{"$f":"'[2]LX02 transfert'!D11","v":"00:00:00"}]
[{"$f":"'[2]LX02 transfert'!A12","v":0},{"$f":"'[2]LX02 transfert'!B12","v":0},{"$f":"'[2]LX02 transfert'!C12","v":0},{"$f":"'[2]LX02 transfert'!D12","v":"00:00:00"}]
[{"$f":"'[2]LX02 transfert'!A13","v":0},{"$f":"'[2]LX02 transfert'!B13","v":0},{"$f":"'[2]LX02 transfert'!C13","v":0},{"$f":"'[2]LX02 transfert'!D13","v":"00:00:00"}]
[{"$f":"'[2]LX02 transfert'!A14","v":0},{"$f":"'[2]LX02 transfert'!B14","v":0},{"$f":"'[2]LX02 transfert'!C14","v":0},{"$f":"'[2]LX02 transfert'!D14","v":"00:00:00"}]
[{"$f":"'[2]LX02 transfert'!A15","v":0},{"$f":"'[2]LX02 transfert'!B15","v":0},{"$f":"'[2]LX02 transfert'!C15","v":0},{"$f":"'[2]LX02 transfert'!D15","v":"00:00:00"}]
[{"$f":"'[2]LX02 transfert'!A16","v":0},{"$f":"'[2]LX02 transfert'!B16","v":0},{"$f":"'[2]LX02 transfert'!C16","v":0},{"$f":"'[2]LX02 transfert'!D16","v":"00:00:00"}]
[{"$f":"'[2]LX02 transfert'!A17","v":0},{"$f":"'[2]LX02 transfert'!B17","v":0},{"$f":"'[2]LX02 transfert'!C17","v":0},{"$f":"'[2]LX02 transfert'!D17","v":"00:00:00"}]
[{"$f":"'[2]LX02 transfert'!A18","v":0},{"$f":"'[2]LX02 transfert'!B18","v":0},{"$f":"'[2]LX02 transfert'!C18","v":0},{"$f":"'[2]LX02 transfert'!D18","v":"00:00:00"}]
[{"$f":"'[2]LX02 transfert'!A19","v":0},{"$f":"'[2]LX02 transfert'!B19","v":0},{"$f":"'[2]LX02 transfert'!C19","v":0},{"$f":"'[2]LX02 transfert'!D19","v":"00:00:00"}]
[{"$f":"'[2]LX02 transfert'!A20","v":0},{"$f":"'[2]LX02 transfert'!B20","v":0},{"$f":"'[2]LX02 transfert'!C20","v":0},{"$f":"'[2]LX02 transfert'!D20","v":"00:00:00"}]
[{"$f":"'[2]LX02 transfert'!A21","v":0},{"$f":"'[2]LX02 transfert'!B21","v":0},{"$f":"'[2]LX02 transfert'!C21","v":0},{"$f":"'[2]LX02 transfert'!D21","v":"00:00:00"}]
[{"$f":"'[2]LX02 transfert'!A22","v":0},{"$f":"'[2]LX02 transfert'!B22","v":0},{"$f":"'[2]LX02 transfert'!C22","v":0},{"$f":"'[2]LX02 transfert'!D22","v":"00:00:00"}]
[{"$f":"'[2]LX02 transfert'!A23","v":0},{"$f":"'[2]LX02 transfert'!B23","v":0},{"$f":"'[2]LX02 transfert'!C23","v":0},{"$f":"'[2]LX02 transfert'!D23","v":"00:00:00"}]
[{"$f":"'[2]LX02 transfert'!A24","v":0},{"$f":"'[2]LX02 transfert'!B24","v":0},{"$f":"'[2]LX02 transfert'!C24","v":0},{"$f":"'[2]LX02 transfert'!D24","v":"00:00:00"}]
[{"$f":"'[2]LX02 transfert'!A25","v":0},{"$f":"'[2]LX02 transfert'!B25","v":0},{"$f":"'[2]LX02 transfert'!C25","v":0},{"$f":"'[2]LX02 transfert'!D25","v":"00:00:00"}]
[{"$f":"'[2]LX02 transfert'!A26","v":0},{"$f":"'[2]LX02 transfert'!B26","v":0},{"$f":"'[2]LX02 transfert'!C26","v":0},{"$f":"'[2]LX02 transfert'!D26","v":"00:00:00"}]
[{"$f":"'[2]LX02 transfert'!A27","v":0},{"$f":"'[2]LX02 transfert'!B27","v":0},{"$f":"'[2]LX02 transfert'!C27","v":0},{"$f":"'[2]LX02 transfert'!D27","v":"00:00:00"}]
[{"$f":"'[2]LX02 transfert'!A28","v":0},{"$f":"'[2]LX02 transfert'!B28","v":0},{"$f":"'[2]LX02 transfert'!C28","v":0},{"$f":"'[2]LX02 transfert'!D28","v":"00:00:00"}]
[{"$f":"'[2]LX02 transfert'!A29","v":0},{"$f":"'[2]LX02 transfert'!B29","v":0},{"$f":"'[2]LX02 transfert'!C29","v":0},{"$f":"'[2]LX02 transfert'!D29","v":"00:00:00"}]
[{"$f":"'[2]LX02 transfert'!A30","v":0},{"$f":"'[2]LX02 transfert'!B30","v":0},{"$f":"'[2]LX02 transfert'!C30","v":0},{"$f":"'[2]LX02 transfert'!D30","v":"00:00:00"}]
[{"$f":"'[2]LX02 transfert'!A31","v":0},{"$f":"'[2]LX02 transfert'!B31","v":0},{"$f":"'[2]LX02 transfert'!C31","v":0},{"$f":"'[2]LX02 transfert'!D31","v":"00:00:00"}]
[{"$f":"'[2]LX02 transfert'!A32","v":0},{"$f":"'[2]LX02 transfert'!B32","v":0},{"$f":"'[2]LX02 transfert'!C32","v":0},{"$f":"'[2]LX02 transfert'!D32","v":"00:00:00"}]
[{"$f":"'[2]LX02 transfert'!A33","v":0},{"$f":"'[2]LX02 transfert'!B33","v":0},{"$f":"'[2]LX02 transfert'!C33","v":0},{"$f":"'[2]LX02 transfert'!D33","v":"00:00:00"}]
[{"$f":"'[2]LX02 transfert'!A34","v":0},{"$f":"'[2]LX02 transfert'!B34","v":0},{"$f":"'[2]LX02 transfert'!C34","v":0},{"$f":"'[2]LX02 transfert'!D34","v":"00:00:00"}]
[{"$f":"'[2]LX02 transfert'!A35","v":0},{"$f":"'[2]LX02 transfert'!B35","v":0},{"$f":"'[2]LX02 transfert'!C35","v":0},{"$f":"'[2]LX02 transfert'!D35","v":"00:00:00"}]
[{"$f":"'[2]LX02 transfert'!A36","v":0},{"$f":"'[2]LX02 transfert'!B36","v":0},{"$f":"'[2]LX02 transfert'!C36","v":0},{"$f":"'[2]LX02 transfert'!D36","v":"00:00:00"}]
[{"$f":"'[2]LX02 transfert'!A37","v":0},{"$f":"'[2]LX02 transfert'!B37","v":0},{"$f":"'[2]LX02 transfert'!C37","v":0},{"$f":"'[2]LX02 transfert'!D37","v":"00:00:00"}]
[{"$f":"'[2]LX02 transfert'!A38","v":0},{"$f":"'[2]LX02 transfert'!B38","v":0},{"$f":"'[2]LX02 transfert'!C38","v":0},{"$f":"'[2]LX02 transfert'!D38","v":"00:00:00"}]
[{"$f":"'[2]LX02 transfert'!A39","v":0},{"$f":"'[2]LX02 transfert'!B39","v":0},{"$f":"'[2]LX02 transfert'!C39","v":0},{"$f":"'[2]LX02 transfert'!D39","v":"00:00:00"}]
[{"$f":"'[2]LX02 transfert'!A40","v":0},{"$f":"'[2]LX02 transfert'!B40","v":0},{"$f":"'[2]LX02 transfert'!C40","v":0},{"$f":"'[2]LX02 transfert'!D40","v":"00:00:00"}]
[{"$f":"'[2]LX02 transfert'!A41","v":0},{"$f":"'[2]LX02 transfert'!B41","v":0},{"$f":"'[2]LX02 transfert'!C41","v":0},{"$f":"'[2]LX02 transfert'!D41","v":"00:00:00"}]
[{"$f":"'[2]LX02 transfert'!A42","v":0},{"$f":"'[2]LX02 transfert'!B42","v":0},{"$f":"'[2]LX02 transfert'!C42","v":0},{"$f":"'[2]LX02 transfert'!D42","v":"00:00:00"}]
[{"$f":"'[2]LX02 transfert'!A43","v":0},{"$f":"'[2]LX02 transfert'!B43","v":0},{"$f":"'[2]LX02 transfert'!C43","v":0},{"$f":"'[2]LX02 transfert'!D43","v":"00:00:00"}]
[{"$f":"'[2]LX02 transfert'!A44","v":0},{"$f":"'[2]LX02 transfert'!B44","v":0},{"$f":"'[2]LX02 transfert'!C44","v":0},{"$f":"'[2]LX02 transfert'!D44","v":"00:00:00"}]
[{"$f":"'[2]LX02 transfert'!A45","v":0},{"$f":"'[2]LX02 transfert'!B45","v":0},{"$f":"'[2]LX02 transfert'!C45","v":0},{"$f":"'[2]LX02 transfert'!D45","v":"00:00:00"}]
[{"$f":"'[2]LX02 transfert'!A46","v":0},{"$f":"'[2]LX02 transfert'!B46","v":0},{"$f":"'[2]LX02 transfert'!C46","v":0},{"$f":"'[2]LX02 transfert'!D46","v":"00:00:00"}]
[{"$f":"'[2]LX02 transfert'!A47","v":0},{"$f":"'[2]LX02 transfert'!B47","v":0},{"$f":"'[2]LX02 transfert'!C47","v":0},{"$f":"'[2]LX02 transfert'!D47","v":"00:00:00"}]
[{"$f":"'[2]LX02 transfert'!A48","v":0},{"$f":"'[2]LX02 transfert'!B48","v":0},{"$f":"'[2]LX02 transfert'!C48","v":0},{"$f":"'[2]LX02 transfert'!D48","v":"00:00:00"}]
[{"$f":"'[2]LX02 transfert'!A49","v":0},{"$f":"'[2]LX02 transfert'!B49","v":0},{"$f":"'[2]LX02 transfert'!C49","v":0},{"$f":"'[2]LX02 transfert'!D49","v":"00:00:00"}]
[{"$f":"'[2]LX02 transfert'!A50","v":0},{"$f":"'[2]LX02 transfert'!B50","v":0},{"$f":"'[2]LX02 transfert'!C50","v":0},{"$f":"'[2]LX02 transfert'!D50","v":"00:00:00"}]
[{"$f":"'[2]LX02 transfert'!A51","v":0},{"$f":"'[2]LX02 transfert'!B51","v":0},{"$f":"'[2]LX02 transfert'!C51","v":0},{"$f":"'[2]LX02 transfert'!D51","v":"00:00:00"}]
[{"$f":"'[2]LX02 transfert'!A52","v":0},{"$f":"'[2]LX02 transfert'!B52","v":0},{"$f":"'[2]LX02 transfert'!C52","v":0},{"$f":"'[2]LX02 transfert'!D52","v":"00:00:00"}]
[{"$f":"'[2]LX02 transfert'!A53","v":0},{"$f":"'[2]LX02 transfert'!B53","v":0},{"$f":"'[2]LX02 transfert'!C53","v":0},{"$f":"'[2]LX02 transfert'!D53","v":"00:00:00"}]
[{"$f":"'[2]LX02 transfert'!A54","v":0},{"$f":"'[2]LX02 transfert'!B54","v":0},{"$f":"'[2]LX02 transfert'!C54","v":0},{"$f":"'[2]LX02 transfert'!D54","v":"00:00:00"}]
[{"$f":"'[2]LX02 transfert'!A55","v":0},{"$f":"'[2]LX02 transfert'!B55","v":0},{"$f":"'[2]LX02 transfert'!C55","v":0},{"$f":"'[2]LX02 transfert'!D55","v":"00:00:00"}]
[{"$f":"'[2]LX02 transfert'!A56","v":0},{"$f":"'[2]LX02 transfert'!B56","v":0},{"$f":"'[2]LX02 transfert'!C56","v":0},{"$f":"'[2]LX02 transfert'!D56","v":"00:00:00"}]
[{"$f":"'[2]LX02 transfert'!A57","v":0},{"$f":"'[2]LX02 transfert'!B57","v":0},{"$f":"'[2]LX02 transfert'!C57","v":0},{"$f":"'[2]LX02 transfert'!D57","v":"00:00:00"}]
[{"$f":"'[2]LX02 transfert'!A58","v":0},{"$f":"'[2]LX02 transfert'!B58","v":0},{"$f":"'[2]LX02 transfert'!C58","v":0},{"$f":"'[2]LX02 transfert'!D58","v":"00:00:00"}]
[{"$f":"'[2]LX02 transfert'!A59","v":0},{"$f":"'[2]LX02 transfert'!B59","v":0},{"$f":"'[2]LX02 transfert'!C59","v":0},{"$f":"'[2]LX02 transfert'!D59","v":"00:00:00"}]
[{"$f":"'[2]LX02 transfert'!A60","v":0},{"$f":"'[2]LX02 transfert'!B60","v":0},{"$f":"'[2]LX02 transfert'!C60","v":0},{"$f":"'[2]LX02 transfert'!D60","v":"00:00:00"}]
[{"$f":"'[2]LX02 transfert'!A61","v":0},{"$f":"'[2]LX02 transfert'!B61","v":0},{"$f":"'[2]LX02 transfert'!C61","v":0},{"$f":"'[2]LX02 transfert'!D61","v":"00:00:00"}]
[{"$f":"'[2]LX02 transfert'!A62","v":0},{"$f":"'[2]LX02 transfert'!B62","v":0},{"$f":"'[2]LX02 transfert'!C62","v":0},{"$f":"'[2]LX02 transfert'!D62","v":"00:00:00"}]
[{"$f":"'[2]LX02 transfert'!A63","v":0},{"$f":"'[2]LX02 transfert'!B63","v":0},{"$f":"'[2]LX02 transfert'!C63","v":0},{"$f":"'[2]LX02 transfert'!D63","v":"00:00:00"}]
[{"$f":"'[2]LX02 transfert'!A64","v":0},{"$f":"'[2]LX02 transfert'!B64","v":0},{"$f":"'[2]LX02 transfert'!C64","v":0},{"$f":"'[2]LX02 transfert'!D64","v":"00:00:00"}]
[{"$f":"'[2]LX02 transfert'!A65","v":0},{"$f":"'[2]LX02 transfert'!B65","v":0},{"$f":"'[2]LX02 transfert'!C65","v":0},{"$f":"'[2]LX02 transfert'!D65","v":"00:00:00"}]
[{"$f":"'[2]LX02 transfert'!A66","v":0},{"$f":"'[2]LX02 transfert'!B66","v":0},{"$f":"'[2]LX02 transfert'!C66","v":0},{"$f":"'[2]LX02 transfert'!D66","v":"00:00:00"}]
[{"$f":"'[2]LX02 transfert'!A67","v":0},{"$f":"'[2]LX02 transfert'!B67","v":0},{"$f":"'[2]LX02 transfert'!C67","v":0},{"$f":"'[2]LX02 transfert'!D67","v":"00:00:00"}]
[{"$f":"'[2]LX02 transfert'!A68","v":0},{"$f":"'[2]LX02 transfert'!B68","v":0},{"$f":"'[2]LX02 transfert'!C68","v":0},{"$f":"'[2]LX02 transfert'!D68","v":"00:00:00"}]
[{"$f":"'[2]LX02 transfert'!A69","v":0},{"$f":"'[2]LX02 transfert'!B69","v":0},{"$f":"'[2]LX02 transfert'!C69","v":0},{"$f":"'[2]LX02 transfert'!D69","v":"00:00:00"}]
[{"$f":"'[2]LX02 transfert'!A70","v":0},{"$f":"'[2]LX02 transfert'!B70","v":0},{"$f":"'[2]LX02 transfert'!C70","v":0},{"$f":"'[2]LX02 transfert'!D70","v":"00:00:00"}]
[{"$f":"'[2]LX02 transfert'!A71","v":0},{"$f":"'[2]LX02 transfert'!B71","v":0},{"$f":"'[2]LX02 transfert'!C71","v":0},{"$f":"'[2]LX02 transfert'!D71","v":"00:00:00"}]
[{"$f":"'[2]LX02 transfert'!A72","v":0},{"$f":"'[2]LX02 transfert'!B72","v":0},{"$f":"'[2]LX02 transfert'!C72","v":0},{"$f":"'[2]LX02 transfert'!D72","v":"00:00:00"}]
[{"$f":"'[2]LX02 transfert'!A73","v":0},{"$f":"'[2]LX02 transfert'!B73","v":0},{"$f":"'[2]LX02 transfert'!C73","v":0},{"$f":"'[2]LX02 transfert'!D73","v":"00:00:00"}]
[{"$f":"'[2]LX02 transfert'!A74","v":0},{"$f":"'[2]LX02 transfert'!B74","v":0},{"$f":"'[2]LX02 transfert'!C74","v":0},{"$f":"'[2]LX02 transfert'!D74","v":"00:00:00"}]
[{"$f":"'[2]LX02 transfert'!A75","v":0},{"$f":"'[2]LX02 transfert'!B75","v":0},{"$f":"'[2]LX02 transfert'!C75","v":0},{"$f":"'[2]LX02 transfert'!D75","v":"00:00:00"}]
[{"$f":"'[2]LX02 transfert'!A76","v":0},{"$f":"'[2]LX02 transfert'!B76","v":0},{"$f":"'[2]LX02 transfert'!C76","v":0},{"$f":"'[2]LX02 transfert'!D76","v":"00:00:00"}]
[{"$f":"'[2]LX02 transfert'!A77","v":0},{"$f":"'[2]LX02 transfert'!B77","v":0},{"$f":"'[2]LX02 transfert'!C77","v":0},{"$f":"'[2]LX02 transfert'!D77","v":"00:00:00"}]
[{"$f":"'[2]LX02 transfert'!A78","v":0},{"$f":"'[2]LX02 transfert'!B78","v":0},{"$f":"'[2]LX02 transfert'!C78","v":0},{"$f":"'[2]LX02 transfert'!D78","v":"00:00:00"}]
[{"$f":"'[2]LX02 transfert'!A79","v":0},{"$f":"'[2]LX02 transfert'!B79","v":0},{"$f":"'[2]LX02 transfert'!C79","v":0},{"$f":"'[2]LX02 transfert'!D79","v":"00:00:00"}]
[{"$f":"'[2]LX02 transfert'!A80","v":0},{"$f":"'[2]LX02 transfert'!B80","v":0},{"$f":"'[2]LX02 transfert'!C80","v":0},{"$f":"'[2]LX02 transfert'!D80","v":"00:00:00"}]
[{"$f":"'[2]LX02 transfert'!A81","v":0},{"$f":"'[2]LX02 transfert'!B81","v":0},{"$f":"'[2]LX02 transfert'!C81","v":0},{"$f":"'[2]LX02 transfert'!D81","v":"00:00:00"}]
[{"$f":"'[2]LX02 transfert'!A82","v":0},{"$f":"'[2]LX02 transfert'!B82","v":0},{"$f":"'[2]LX02 transfert'!C82","v":0},{"$f":"'[2]LX02 transfert'!D82","v":"00:00:00"}]
[{"$f":"'[2]LX02 transfert'!A83","v":0},{"$f":"'[2]LX02 transfert'!B83","v":0},{"$f":"'[2]LX02 transfert'!C83","v":0},{"$f":"'[2]LX02 transfert'!D83","v":"00:00:00"}]
[{"$f":"'[2]LX02 transfert'!A84","v":0},{"$f":"'[2]LX02 transfert'!B84","v":0},{"$f":"'[2]LX02 transfert'!C84","v":0},{"$f":"'[2]LX02 transfert'!D84","v":"00:00:00"}]
[{"$f":"'[2]LX02 transfert'!A85","v":0},{"$f":"'[2]LX02 transfert'!B85","v":0},{"$f":"'[2]LX02 transfert'!C85","v":0},{"$f":"'[2]LX02 transfert'!D85","v":"00:00:00"}]
[{"$f":"'[2]LX02 transfert'!A86","v":0},{"$f":"'[2]LX02 transfert'!B86","v":0},{"$f":"'[2]LX02 transfert'!C86","v":0},{"$f":"'[2]LX02 transfert'!D86","v":"00:00:00"}]
[{"$f":"'[2]LX02 transfert'!A87","v":0},{"$f":"'[2]LX02 transfert'!B87","v":0},{"$f":"'[2]LX02 transfert'!C87","v":0},{"$f":"'[2]LX02 transfert'!D87","v":"00:00:00"}]
[{"$f":"'[2]LX02 transfert'!A88","v":0},{"$f":"'[2]LX02 transfert'!B88","v":0},{"$f":"'[2]LX02 transfert'!C88","v":0},{"$f":"'[2]LX02 transfert'!D88","v":"00:00:00"}]
[{"$f":"'[2]LX02 transfert'!A89","v":0},{"$f":"'[2]LX02 transfert'!B89","v":0},{"$f":"'[2]LX02 transfert'!C89","v":0},{"$f":"'[2]LX02 transfert'!D89","v":"00:00:00"}]
[{"$f":"'[2]LX02 transfert'!A90","v":0},{"$f":"'[2]LX02 transfert'!B90","v":0},{"$f":"'[2]LX02 transfert'!C90","v":0},{"$f":"'[2]LX02 transfert'!D90","v":"00:00:00"}]
[{"$f":"'[2]LX02 transfert'!A91","v":0},{"$f":"'[2]LX02 transfert'!B91","v":0},{"$f":"'[2]LX02 transfert'!C91","v":0},{"$f":"'[2]LX02 transfert'!D91","v":"00:00:00"}]
[{"$f":"'[2]LX02 transfert'!A92","v":0},{"$f":"'[2]LX02 transfert'!B92","v":0},{"$f":"'[2]LX02 transfert'!C92","v":0},{"$f":"'[2]LX02 transfert'!D92","v":"00:00:00"}]
[{"$f":"'[2]LX02 transfert'!A93","v":0},{"$f":"'[2]LX02 transfert'!B93","v":0},{"$f":"'[2]LX02 transfert'!C93","v":0},{"$f":"'[2]LX02 transfert'!D93","v":"00:00:00"}]
[{"$f":"'[2]LX02 transfert'!A94","v":0},{"$f":"'[2]LX02 transfert'!B94","v":0},{"$f":"'[2]LX02 transfert'!C94","v":0},{"$f":"'[2]LX02 transfert'!D94","v":"00:00:00"}]
[{"$f":"'[2]LX02 transfert'!A95","v":0},{"$f":"'[2]LX02 transfert'!B95","v":0},{"$f":"'[2]LX02 transfert'!C95","v":0},{"$f":"'[2]LX02 transfert'!D95","v":"00:00:00"}]
[{"$f":"'[2]LX02 transfert'!A96","v":0},{"$f":"'[2]LX02 transfert'!B96","v":0},{"$f":"'[2]LX02 transfert'!C96","v":0},{"$f":"'[2]LX02 transfert'!D96","v":"00:00:00"}]
[{"$f":"'[2]LX02 transfert'!A97","v":0},{"$f":"'[2]LX02 transfert'!B97","v":0},{"$f":"'[2]LX02 transfert'!C97","v":0},{"$f":"'[2]LX02 transfert'!D97","v":"00:00:00"}]
[{"$f":"'[2]LX02 transfert'!A98","v":0},{"$f":"'[2]LX02 transfert'!B98","v":0},{"$f":"'[2]LX02 transfert'!C98","v":0},{"$f":"'[2]LX02 transfert'!D98","v":"00:00:00"}]
[{"$f":"'[2]LX02 transfert'!A99","v":0},{"$f":"'[2]LX02 transfert'!B99","v":0},{"$f":"'[2]LX02 transfert'!C99","v":0},{"$f":"'[2]LX02 transfert'!D99","v":"00:00:00"}]
[{"$f":"'[2]LX02 transfert'!A100","v":0},{"$f":"'[2]LX02 transfert'!B100","v":0},{"$f":"'[2]LX02 transfert'!C100","v":0},{"$f":"'[2]LX02 transfert'!D100","v":"00:00:00"}]
[{"$f":"'[2]LX02 transfert'!A101","v":0},{"$f":"'[2]LX02 transfert'!B101","v":0},{"$f":"'[2]LX02 transfert'!C101","v":0},{"$f":"'[2]LX02 transfert'!D101","v":"00:00:00"}]
[{"$f":"'[2]LX02 transfert'!A102","v":0},{"$f":"'[2]LX02 transfert'!B102","v":0},{"$f":"'[2]LX02 transfert'!C102","v":0},{"$f":"'[2]LX02 transfert'!D102","v":"00:00:00"}]
[{"$f":"'[2]LX02 transfert'!A103","v":0},{"$f":"'[2]LX02 transfert'!B103","v":0},{"$f":"'[2]LX02 transfert'!C103","v":0},{"$f":"'[2]LX02 transfert'!D103","v":"00:00:00"}]
[{"$f":"'[2]LX02 transfert'!A104","v":0},{"$f":"'[2]LX02 transfert'!B104","v":0},{"$f":"'[2]LX02 transfert'!C104","v":0},{"$f":"'[2]LX02 transfert'!D104","v":"00:00:00"}]
[{"$f":"'[2]LX02 transfert'!A105","v":0},{"$f":"'[2]LX02 transfert'!B105","v":0},{"$f":"'[2]LX02 transfert'!C105","v":0},{"$f":"'[2]LX02 transfert'!D105","v":"00:00:00"}]
[{"$f":"'[2]LX02 transfert'!A106","v":0},{"$f":"'[2]LX02 transfert'!B106","v":0},{"$f":"'[2]LX02 transfert'!C106","v":0},{"$f":"'[2]LX02 transfert'!D106","v":"00:00:00"}]
[{"$f":"'[2]LX02 transfert'!A107","v":0},{"$f":"'[2]LX02 transfert'!B107","v":0},{"$f":"'[2]LX02 transfert'!C107","v":0},{"$f":"'[2]LX02 transfert'!D107","v":"00:00:00"}]
[{"$f":"'[2]LX02 transfert'!A108","v":0},{"$f":"'[2]LX02 transfert'!B108","v":0},{"$f":"'[2]LX02 transfert'!C108","v":0},{"$f":"'[2]LX02 transfert'!D108","v":"00:00:00"}]
[{"$f":"'[2]LX02 transfert'!A109","v":0},{"$f":"'[2]LX02 transfert'!B109","v":0},{"$f":"'[2]LX02 transfert'!C109","v":0},{"$f":"'[2]LX02 transfert'!D109","v":"00:00:00"}]
[{"$f":"'[2]LX02 transfert'!A110","v":0},{"$f":"'[2]LX02 transfert'!B110","v":0},{"$f":"'[2]LX02 transfert'!C110","v":0},{"$f":"'[2]LX02 transfert'!D110","v":"00:00:00"}]
[{"$f":"'[2]LX02 transfert'!A111","v":0},{"$f":"'[2]LX02 transfert'!B111","v":0},{"$f":"'[2]LX02 transfert'!C111","v":0},{"$f":"'[2]LX02 transfert'!D111","v":"00:00:00"}]
[{"$f":"'[2]LX02 transfert'!A112","v":0},{"$f":"'[2]LX02 transfert'!B112","v":0},{"$f":"'[2]LX02 transfert'!C112","v":0},{"$f":"'[2]LX02 transfert'!D112","v":"00:00:00"}]
[{"$f":"'[2]LX02 transfert'!A113","v":0},{"$f":"'[2]LX02 transfert'!B113","v":0},{"$f":"'[2]LX02 transfert'!C113","v":0},{"$f":"'[2]LX02 transfert'!D113","v":"00:00:00"}]
[{"$f":"'[2]LX02 transfert'!A114","v":0},{"$f":"'[2]LX02 transfert'!B114","v":0},{"$f":"'[2]LX02 transfert'!C114","v":0},{"$f":"'[2]LX02 transfert'!D114","v":"00:00:00"}]
[{"$f":"'[2]LX02 transfert'!A115","v":0},{"$f":"'[2]LX02 transfert'!B115","v":0},{"$f":"'[2]LX02 transfert'!C115","v":0},{"$f":"'[2]LX02 transfert'!D115","v":"00:00:00"}]
[{"$f":"'[2]LX02 transfert'!A116","v":0},{"$f":"'[2]LX02 transfert'!B116","v":0},{"$f":"'[2]LX02 transfert'!C116","v":0},{"$f":"'[2]LX02 transfert'!D116","v":"00:00:00"}]
[{"$f":"'[2]LX02 transfert'!A117","v":0},{"$f":"'[2]LX02 transfert'!B117","v":0},{"$f":"'[2]LX02 transfert'!C117","v":0},{"$f":"'[2]LX02 transfert'!D117","v":"00:00:00"}]
[{"$f":"'[2]LX02 transfert'!A118","v":0},{"$f":"'[2]LX02 transfert'!B118","v":0},{"$f":"'[2]LX02 transfert'!C118","v":0},{"$f":"'[2]LX02 transfert'!D118","v":"00:00:00"}]
[{"$f":"'[2]LX02 transfert'!A119","v":0},{"$f":"'[2]LX02 transfert'!B119","v":0},{"$f":"'[2]LX02 transfert'!C119","v":0},{"$f":"'[2]LX02 transfert'!D119","v":"00:00:00"}]
[{"$f":"'[2]LX02 transfert'!A120","v":0},{"$f":"'[2]LX02 transfert'!B120","v":0},{"$f":"'[2]LX02 transfert'!C120","v":0},{"$f":"'[2]LX02 transfert'!D120","v":"00:00:00"}]
[{"$f":"'[2]LX02 transfert'!A121","v":0},{"$f":"'[2]LX02 transfert'!B121","v":0},{"$f":"'[2]LX02 transfert'!C121","v":0},{"$f":"'[2]LX02 transfert'!D121","v":"00:00:00"}]
[{"$f":"'[2]LX02 transfert'!A122","v":0},{"$f":"'[2]LX02 transfert'!B122","v":0},{"$f":"'[2]LX02 transfert'!C122","v":0},{"$f":"'[2]LX02 transfert'!D122","v":"00:00:00"}]
[{"$f":"'[2]LX02 transfert'!A123","v":0},{"$f":"'[2]LX02 transfert'!B123","v":0},{"$f":"'[2]LX02 transfert'!C123","v":0},{"$f":"'[2]LX02 transfert'!D123","v":"00:00:00"}]
[{"$f":"'[2]LX02 transfert'!A124","v":0},{"$f":"'[2]LX02 transfert'!B124","v":0},{"$f":"'[2]LX02 transfert'!C124","v":0},{"$f":"'[2]LX02 transfert'!D124","v":"00:00:00"}]
[{"$f":"'[2]LX02 transfert'!A125","v":0},{"$f":"'[2]LX02 transfert'!B125","v":0},{"$f":"'[2]LX02 transfert'!C125","v":0},{"$f":"'[2]LX02 transfert'!D125","v":"00:00:00"}]
[{"$f":"'[2]LX02 transfert'!A126","v":0},{"$f":"'[2]LX02 transfert'!B126","v":0},{"$f":"'[2]LX02 transfert'!C126","v":0},{"$f":"'[2]LX02 transfert'!D126","v":"00:00:00"}]
[{"$f":"'[2]LX02 transfert'!A127","v":0},{"$f":"'[2]LX02 transfert'!B127","v":0},{"$f":"'[2]LX02 transfert'!C127","v":0},{"$f":"'[2]LX02 transfert'!D127","v":"00:00:00"}]
[{"$f":"'[2]LX02 transfert'!A128","v":0},{"$f":"'[2]LX02 transfert'!B128","v":0},{"$f":"'[2]LX02 transfert'!C128","v":0},{"$f":"'[2]LX02 transfert'!D128","v":"00:00:00"}]
[{"$f":"'[2]LX02 transfert'!A129","v":0},{"$f":"'[2]LX02 transfert'!B129","v":0},{"$f":"'[2]LX02 transfert'!C129","v":0},{"$f":"'[2]LX02 transfert'!D129","v":"00:00:00"}]
[{"$f":"'[2]LX02 transfert'!A130","v":0},{"$f":"'[2]LX02 transfert'!B130","v":0},{"$f":"'[2]LX02 transfert'!C130","v":0},{"$f":"'[2]LX02 transfert'!D130","v":"00:00:00"}]
[{"$f":"'[2]LX02 transfert'!A131","v":0},{"$f":"'[2]LX02 transfert'!B131","v":0},{"$f":"'[2]LX02 transfert'!C131","v":0},{"$f":"'[2]LX02 transfert'!D131","v":"00:00:00"}]
[{"$f":"'[2]LX02 transfert'!A132","v":0},{"$f":"'[2]LX02 transfert'!B132","v":0},{"$f":"'[2]LX02 transfert'!C132","v":0},{"$f":"'[2]LX02 transfert'!D132","v":"00:00:00"}]
[{"$f":"'[2]LX02 transfert'!A133","v":0},{"$f":"'[2]LX02 transfert'!B133","v":0},{"$f":"'[2]LX02 transfert'!C133","v":0},{"$f":"'[2]LX02 transfert'!D133","v":"00:00:00"}]
[{"$f":"'[2]LX02 transfert'!A134","v":0},{"$f":"'[2]LX02 transfert'!B134","v":0},{"$f":"'[2]LX02 transfert'!C134","v":0},{"$f":"'[2]LX02 transfert'!D134","v":"00:00:00"}]
[{"$f":"'[2]LX02 transfert'!A135","v":0},{"$f":"'[2]LX02 transfert'!B135","v":0},{"$f":"'[2]LX02 transfert'!C135","v":0},{"$f":"'[2]LX02 transfert'!D135","v":"00:00:00"}]
[{"$f":"'[2]LX02 transfert'!A136","v":0},{"$f":"'[2]LX02 transfert'!B136","v":0},{"$f":"'[2]LX02 transfert'!C136","v":0},{"$f":"'[2]LX02 transfert'!D136","v":"00:00:00"}]
[{"$f":"'[2]LX02 transfert'!A137","v":0},{"$f":"'[2]LX02 transfert'!B137","v":0},{"$f":"'[2]LX02 transfert'!C137","v":0},{"$f":"'[2]LX02 transfert'!D137","v":"00:00:00"}]
[{"$f":"'[2]LX02 transfert'!A138","v":0},{"$f":"'[2]LX02 transfert'!B138","v":0},{"$f":"'[2]LX02 transfert'!C138","v":0},{"$f":"'[2]LX02 transfert'!D138","v":"00:00:00"}]
[{"$f":"'[2]LX02 transfert'!A139","v":0},{"$f":"'[2]LX02 transfert'!B139","v":0},{"$f":"'[2]LX02 transfert'!C139","v":0},{"$f":"'[2]LX02 transfert'!D139","v":"00:00:00"}]
[{"$f":"'[2]LX02 transfert'!A140","v":0},{"$f":"'[2]LX02 transfert'!B140","v":0},{"$f":"'[2]LX02 transfert'!C140","v":0},{"$f":"'[2]LX02 transfert'!D140","v":"00:00:00"}]
[{"$f":"'[2]LX02 transfert'!A141","v":0},{"$f":"'[2]LX02 transfert'!B141","v":0},{"$f":"'[2]LX02 transfert'!C141","v":0},{"$f":"'[2]LX02 transfert'!D141","v":"00:00:00"}]
[{"$f":"'[2]LX02 transfert'!A142","v":0},{"$f":"'[2]LX02 transfert'!B142","v":0},{"$f":"'[2]LX02 transfert'!C142","v":0},{"$f":"'[2]LX02 transfert'!D142","v":"00:00:00"}]
[{"$f":"'[2]LX02 transfert'!A143","v":0},{"$f":"'[2]LX02 transfert'!B143","v":0},{"$f":"'[2]LX02 transfert'!C143","v":0},{"$f":"'[2]LX02 transfert'!D143","v":"00:00:00"}]
[{"$f":"'[2]LX02 transfert'!A144","v":0},{"$f":"'[2]LX02 transfert'!B144","v":0},{"$f":"'[2]LX02 transfert'!C144","v":0},{"$f":"'[2]LX02 transfert'!D144","v":"00:00:00"}]
[{"$f":"'[2]LX02 transfert'!A145","v":0},{"$f":"'[2]LX02 transfert'!B145","v":0},{"$f":"'[2]LX02 transfert'!C145","v":0},{"$f":"'[2]LX02 transfert'!D145","v":"00:00:00"}]
[{"$f":"'[2]LX02 transfert'!A146","v":0},{"$f":"'[2]LX02 transfert'!B146","v":0},{"$f":"'[2]LX02 transfert'!C146","v":0},{"$f":"'[2]LX02 transfert'!D146","v":"00:00:00"}]
[{"$f":"'[2]LX02 transfert'!A147","v":0},{"$f":"'[2]LX02 transfert'!B147","v":0},{"$f":"'[2]LX02 transfert'!C147","v":0},{"$f":"'[2]LX02 transfert'!D147","v":"00:00:00"}]
[{"$f":"'[2]LX02 transfert'!A148","v":0},{"$f":"'[2]LX02 transfert'!B148","v":0},{"$f":"'[2]LX02 transfert'!C148","v":0},{"$f":"'[2]LX02 transfert'!D148","v":"00:00:00"}]
[{"$f":"'[2]LX02 transfert'!A149","v":0},{"$f":"'[2]LX02 transfert'!B149","v":0},{"$f":"'[2]LX02 transfert'!C149","v":0},{"$f":"'[2]LX02 transfert'!D149","v":"00:00:00"}]
[{"$f":"'[2]LX02 transfert'!A150","v":0},{"$f":"'[2]LX02 transfert'!B150","v":0},{"$f":"'[2]LX02 transfert'!C150","v":0},{"$f":"'[2]LX02 transfert'!D150","v":"00:00:00"}]

{"sheet":"Code MPR","index":6,"n_rows":24,"n_cols":2,"rows_kept":24,"cut":false,"hidden":false,"merged":[]}
["Code","Clair"]
[110,"A confirmer"]
[120,"Référence sans prix"]
[130,"Nouvelle référence"]
[210,"Référence bloquée cause technique"]
[220,"Bloquée pénurie gestionnaire"]
[230,"Manque stock"]
[250,"Différé par gestionnaire"]
[260,"Attente réception"]
[280,"Attente affectation "]
[290,"En attente du traitement "]
[311,"Affectée non expédiée"]
[312,"Affectée bon complet"]
[520,"Facturée"]
[910,"Annulé par destinataire (Client)"]
[920,"Annulé par service relation clientèle (MPR)"]
[930,"Fractionnement"]
[950,"Remplacement provisoire"]
[960,"Remplacement définitif"]
[970,"Eclatement de livraison"]
[990,"Annulé-Réservé stock extérieur"]
["Transport","Colis manquant"]
["Litige","Litige MPR"]
["Annulé","Annulation informatique (Anomalie)"]

{"sheet":"Date","index":7,"n_rows":17,"n_cols":2,"rows_kept":17,"cut":false,"hidden":false,"merged":[]}
[2016]
["Jour exclus","Jour férié + ARTT année N"]
["1900-01-01",{"$f":"(DATE($A$1,3,28))","v":"2016-03-28"}]
["1900-01-07",{"$f":"(DATE($A$1,5,5))","v":"2016-05-05"}]
[null,{"$f":"(DATE($A$1,5,6))","v":"2016-05-06"}]
[null,{"$f":"(DATE($A$1,5,16))","v":"2016-05-16"}]
[null,{"$f":"(DATE($A$1,7,14))","v":"2016-07-14"}]
[null,{"$f":"(DATE($A$1,7,15))","v":"2016-07-15"}]
[null,{"$f":"(DATE($A$1,8,15))","v":"2016-08-15"}]
[null,{"$f":"(DATE($A$1,10,31))","v":"2016-10-31"}]
[null,{"$f":"(DATE($A$1,11,1))","v":"2016-11-01"}]
[null,{"$f":"(DATE($A$1,12,23))","v":"2016-12-23"}]
[null,{"$f":"(DATE($A$1,12,26))","v":"2016-12-26"}]
[null,{"$f":"(DATE($A$1,12,27))","v":"2016-12-27"}]
[null,{"$f":"(DATE($A$1,12,28))","v":"2016-12-28"}]
[null,{"$f":"(DATE($A$1,12,29))","v":"2016-12-29"}]
[null,{"$f":"(DATE($A$1,12,30))","v":"2016-12-30"}]