{"text_format":"1","workbook":"xlsx","n_sheets":8,"sheets":["Menu general","CDE client du jour","MPR suivi","MP","Relance Cergy","LX02","Code MPR","Date"],"not_rendered":{"charts":0,"images":0,"macros":1,"external_links":2,"defined_names":27,"comments":0,"pivot_tables":0},"unopened":[],"bounds":{"document_bytes":16777216,"sheet_cells":100000,"rows_first":2000,"rows_last":500,"rows_between":2000,"halvings":0,"cell_chars":16384,"cell_head_chars":4096},"cells_cut":0,"cells_raw":0,"read":"whole","date_system":"1900"}

{"sheet":"Menu general","index":0,"n_rows":10,"n_cols":6,"rows_kept":10,"cut":false,"hidden":false,"merged":[]}
[{"$f":"TODAY()","v":"2016-10-24"},null,{"$error":"#REF!"}]
["Indicateur journalier MPR"]
[]
[]
["Gestion des encours MPR","Total lignes en cours","En attente de réception MPR","Réception commande du jour","Reliquats annoncés","Total réceptiondu jour"]
["Nb de lignes de commandes",{"$f":"COUNTA('MPR suivi'!E:E)-1","v":167},{"$f":"COUNTIF('MPR suivi'!L:L,\"Différé\")","v":98},{"$f":"COUNTIF('MPR suivi'!O:O,\"Soldé\")-1","v":60},{"$f":"COUNTIF('MPR suivi'!T:T,\"Reliquat\")-1","v":16},{"$f":"D6+E6","v":76}]
[]
[]
[]
[" Statistiques MPR du mois",null,"Reliquats TCR",{"$f":"COUNTIF('MPR suivi'!K:K,\"X\")-1","v":0}]

{"sheet":"CDE client du jour","index":1,"n_rows":252,"n_cols":7,"rows_kept":252,"cut":false,"hidden":false,"merged":[]}
["242961563R",200989266,"HULEUX AURELIE",9.1300000000000008,"GOULOTTE CABLAGE HABITACLE",1,"ST"]
["242964304R",200989266,"HULEUX AURELIE",2.5299999999999998,"GOULOTTE CABLAGE HABITACLE",1,"ST"]
[8200110146,200989267,"ROUET ANDRE",16.68,"ROUE 5 1/2XJ 15 4 43",2,"ST"]
[7700801863,200989267,"ROUET ANDRE",2.73,"VALVE SOUPLE MOYENNE",20,"ST"]
[7711781027,200989268,"GUIGNOT SILVERE",21,"POLAIRE RENAULT CORPORATE XXL",1,"ST"]
[7711781026,200989268,"GUIGNOT SILVERE",63,"POLAIRE RENAULT CORPORATE XL",3,"ST"]
[7711781025,200989268,"GUIGNOT SILVERE",21,"POLAIRE RENAULT CORPORATE L",1,"ST"]
["R100582895",200989269,"BIGOT PASCALE",60.09,"CASQUETTE COTON POLYESTER NOIR VISIERE R",6,"ST"]
["R100179700",200989272,"BIGOT PASCALE",44.52,"SAC TOILE PLASTIFIEE  DIM:600 X 400 X 25",3,"ST"]
["R100138764",200989273,"BELLEMOU FARID",13.89,"JERRICAN PLASTIQUE ROUGE CAPAC.10 LITRES",2,"ST"]
["R100138766",200989273,"BELLEMOU FARID",68.150000000000006,"JERRICAN PLASTIQUE ROUGE CAPACITE 20LITR",3,"ST"]
["R100645809",200989273,"BELLEMOU FARID",35,"GANTS TRICOTE TEGERA 868 NEUF",100,"ST"]
[7711781027,200989274,"JEHANNET MICHAEL",42,"POLAIRE RENAULT CORPORATE XXL",2,"ST"]
["T511373370",200989276,"COZLER DANIEL ROGER ALBERT",6.25,"BOBINE EN OUATE DE CELLULOSE COULEUR CHA",2,"ST"]
[4820990007,200989276,"COZLER DANIEL ROGER ALBERT",14.5,"C.A. 1 300X250X200 FEFCO 0201 P.A. CLASS",50,"ST"]
["290E10279R",200989288,"MOUNIER ERIC",8.92,"CABLE EXCTN CTRLR NRJ - MOTOREDUCTEUR",1,"ST"]
["R100595274",200989289,"MELOTTE DIDIER",63.5,"RUBAN ADHESIF LARG:1MM LG:16M COULEUR JA",10,"ST"]
["T732120875",200989289,"MELOTTE DIDIER",175.53,"PLAQUE DE MOUSSE POLYURETHANE RIGIDE ENT",9,"ST"]
["T517994713",200989289,"MELOTTE DIDIER",15.83,"CONTRECOLLE BLANC       1090GR/M2 EP: 1,",1,"ST"]
["802808690R",200989291,"DECAUDAIN JEAN FRANCOIS",5.42,"ENJOLIVEUR AV CADRE PORTE AV D",1,"ST"]
{"$rows_left_out":233}
{"sheet":"MPR suivi","index":2,"n_rows":169,"n_cols":25,"rows_kept":169,"cut":false,"hidden":false,"merged":[]}
[{"$f":"CONCATENATE(C1,\"-\",D1)","v":"-"},{"$f":"G1-DATE(YEAR(G1),1,0)","v":1},null,null,null,null,"2004-01-01",null,null,{"$f":"IF(ISERROR(VLOOKUP(A1,Base_MP,6,FALSE)),\"\",\"X\")","v":"X"},{"$f":"IF(ISERROR(VLOOKUP(E1,'LX02'!$A$1:$D$150,1,FALSE)),\"\",\"X\")","v":"X"},{"$f":"IF(I1=\"\",TODAY(),\"Différé\")","v":"2016-10-24"},{"$f":"IF(ISERROR(VLOOKUP(A1,Base_MP,11,0)),H1,VLOOKUP(A1,Base_MP,11,0))","v":0},{"$f":"IF(I1=\"\",\"520\",\"\")","v":"520"},{"$f":"IF(N1=\"Litige\",\"Litige\",IF(AND(N1=\"520\",H1=M1),\"Soldé\",IF(N1=\"Annulé\",\"Annulé\",\"\")))","v":"Soldé"},{"$f":"IF(N1=\"Litige\",\"Litige\",IF(O1=\"Soldé\",1,IF(O1=520,$L1-$G1-INT(($L1-MOD($L1-JUn,7)-$G1+7)/7)-INT(($L1-MOD($L1-JDeux,7)-$G1+7)/7)-(SUMPRODUCT((_Fer2>=$G1)-(_Fer2>$L1)))+SUMPRODUCT(((WEEKDAY(_Fer2)=WEEKDAY(JUn))+(WEEKDAY(_Fer2)=WEEKDAY(JDeux)))*(_Fer2>=$L1)*(_Fer2<=$L1)),IF(N1=\"Annulé\",\"Annulé\",\"\"))))","v":1},{"$f":"IF(AND(J1=\"x\",I1=\"\"),\"351 ou litige\",IF(AND(O1=\"Soldé\",H1=M1),\"\",IF(ISERROR(VLOOKUP(N1,Code_MPR,2,FALSE)),\"351 ou Litige\",VLOOKUP(N1,Code_MPR,2,FALSE))))","v":"351 ou litige"},null,{"$f":"IF(P1=\"Annulé\",\"Annulé\",IF(P1=\"Litige\",\"Litige\",IF(P1>3,\"+ de 3 jours\",P1)))","v":1},{"$f":"IF(N1=311,\"Reliquat\",IF(O1=311,\"Reliquat\",IF(I1<>\"X\",\"CDE Jour\",\"\")))","v":"CDE Jour"},{"$f":"VLOOKUP(E1,client,3,FALSE)","v":{"$error":"#N/A"}},{"$f":"VLOOKUP(E1,client,2,FALSE)","v":{"$error":"#N/A"}},{"$f":"VLOOKUP(E1,client,6,FALSE)","v":{"$error":"#N/A"}},{"$f":"H1","v":0}]
["Controle","Quantieme","N° de commande RE03","Ligne RE03","Référence","Désignation","Date","Qté C","x","Sq","LX02","Reliquats",{"$f":"IF(ISERROR(VLOOKUP(A2,Base_MP,11,0)),H2,VLOOKUP(A2,Base_MP,11,0))","v":"Qté C"},"Motif ","Statut final MPR\nou Commentaires","Délai MPR","Motif différé MPR","Motif différé TCR","Calcul tranche délai TDB","Attendu de livraison","Nom client","Commande client","Qté  CDE Client","Qté cde frs"]
[{"$f":"CONCATENATE(C3,\"-\",D3)","v":"4700043626-320"},{"$f":"G3-DATE(YEAR(G3),1,0)","v":173},4700043626,320,7711575964,"Pack Historic 2\n7711780931","2016-06-21",1,"X",{"$f":"IF(ISERROR(VLOOKUP(A3,Base_MP,6,FALSE)),\"\",\"X\")","v":"X"},{"$f":"IF(ISERROR(VLOOKUP(E3,'LX02'!$A$1:$D$150,1,FALSE)),\"\",\"X\")","v":""},{"$f":"IF(I3=\"\",TODAY(),\"Différé\")","v":"Différé"},{"$f":"IF(ISERROR(VLOOKUP(A3,Base_MP,11,0)),H3,VLOOKUP(A3,Base_MP,11,0))","v":1},230,{"$f":"IF(N3=\"Litige\",\"Litige\",IF(AND(N3=\"520\",H3=M3),\"Soldé\",IF(N3=\"Annulé\",\"Annulé\",\"\")))","v":""},{"$f":"IF(N3=\"Litige\",\"Litige\",IF(O3=\"Soldé\",1,IF(O3=520,$L3-$G3-INT(($L3-MOD($L3-JUn,7)-$G3+7)/7)-INT(($L3-MOD($L3-JDeux,7)-$G3+7)/7)-(SUMPRODUCT((_Fer2>=$G3)-(_Fer2>$L3)))+SUMPRODUCT(((WEEKDAY(_Fer2)=WEEKDAY(JUn))+(WEEKDAY(_Fer2)=WEEKDAY(JDeux)))*(_Fer2>=$L3)*(_Fer2<=$L3)),IF(N3=\"Annulé\",\"Annulé\",\"\"))))","v":""},"Manque stock",null,{"$f":"IF(P3=\"Annulé\",\"Annulé\",IF(P3=\"Litige\",\"Litige\",IF(P3>3,\"+ de 3 jours\",P3)))","v":"+ de 3 jours"},{"$f":"IF(N3=311,\"Reliquat\",IF(O3=311,\"Reliquat\",IF(I3<>\"X\",\"CDE Jour\",\"\")))","v":""},{"$error":"#N/A"},{"$error":"#N/A"},{"$error":"#N/A"},{"$f":"H3","v":1},"mi-décembre"]
["4700043671-350",180,4700043671,350,"410114EA0A","CALIPER ASSY-BRAKE,W/O PAD LH","2016-06-28",30,"X","X",{"$f":"IF(ISERROR(VLOOKUP(E4,'LX02'!$A$1:$D$150,1,FALSE)),\"\",\"X\")","v":""},"Différé",30,230,"","","Manque stock",null,"+ de 3 jours","",{"$error":"#N/A"},{"$error":"#N/A"},{"$error":"#N/A"},30,"2016-09-30"]
["4700043822-170",207,4700043822,170,7705030156,"RACCORD 2 VOIES 20X20","2016-07-25",20,"X","X",{"$f":"IF(ISERROR(VLOOKUP(E5,'LX02'!$A$1:$D$150,1,FALSE)),\"\",\"X\")","v":""},"Différé",20,230,"","","Manque stock",null,"+ de 3 jours","",{"$error":"#N/A"},{"$error":"#N/A"},{"$error":"#N/A"},20]
["4700043829-320",208,4700043829,320,"144B05233R","POMPE EAU ADDITIONNELLE","2016-07-26",2,"X","X",{"$f":"IF(ISERROR(VLOOKUP(E6,'LX02'!$A$1:$D$150,1,FALSE)),\"\",\"X\")","v":""},"Différé",2,220,"","","Bloquée pénurie gestionnaire",null,"+ de 3 jours","","GINOUX CHRISTIAN",200984281,0.02,2]
["4700043864-310",215,4700043864,310,7711782372,"SPINBOARD ALPINE","2016-08-02",1,"X","X",{"$f":"IF(ISERROR(VLOOKUP(E7,'LX02'!$A$1:$D$150,1,FALSE)),\"\",\"X\")","v":""},"Différé",1,130,"","","Nouvelle référence",null,"+ de 3 jours","",{"$error":"#N/A"},{"$error":"#N/A"},{"$error":"#N/A"},1]
["4700043996-200",242,4700043996,200,"628908106R","EMBLEME AV","2016-08-29",2,"X","X",{"$f":"IF(ISERROR(VLOOKUP(E8,'LX02'!$A$1:$D$150,1,FALSE)),\"\",\"X\")","v":""},"Différé",2,220,"","",{"$f":"IF(AND(J8=\"x\",I8=\"\"),\"351 ou litige\",IF(AND(O8=\"Soldé\",H8=M8),\"\",IF(ISERROR(VLOOKUP(N8,Code_MPR,2,FALSE)),\"351 ou Litige\",VLOOKUP(N8,Code_MPR,2,FALSE))))","v":"Bloquée pénurie gestionnaire"},null,"+ de 3 jours","","BELLETOILE MARTIAL",200984265,2,2]
["4700044012-490",244,4700044012,490,"255545857R","TRANSMISSION ELCT RTTF CDE SOUS VLT","2016-08-31",12,null,"X",{"$f":"IF(ISERROR(VLOOKUP(E9,'LX02'!$A$1:$D$150,1,FALSE)),\"\",\"X\")","v":""},"2016-10-24",12,230,520,38,"351 ou litige",null,"+ de 3 jours","CDE Jour",{"$error":"#N/A"},{"$error":"#N/A"},{"$error":"#N/A"},12]
["4700044052-360",250,4700044052,360,7711419431,"PON\\EUSE 1 MAIN","2016-09-06",2,"X","X",{"$f":"IF(ISERROR(VLOOKUP(E10,'LX02'!$A$1:$D$150,1,FALSE)),\"\",\"X\")","v":""},"Différé",2,230,"","","Manque stock",null,"+ de 3 jours","","GILLES MARC",200984319,1,2]
["4700044063-700",251,4700044063,700,"628908106R","EMBLEME AV","2016-09-07",2,"X","X",{"$f":"IF(ISERROR(VLOOKUP(E11,'LX02'!$A$1:$D$150,1,FALSE)),\"\",\"X\")","v":""},"Différé",2,220,"","","Bloquée pénurie gestionnaire",null,"+ de 3 jours","","COTTENCIN FREDERIC",200984297,2,2]
["4700044073-200",252,4700044073,200,7701421117,"REPARATION PLASTIQUE","2016-09-08",2,"X","X",{"$f":"IF(ISERROR(VLOOKUP(E12,'LX02'!$A$1:$D$150,1,FALSE)),\"\",\"X\")","v":""},"Différé",2,230,"","","Manque stock",null,"+ de 3 jours","","SERBAN FLORIN MIHAIL",200984424,2,2]
["4700044073-230",252,4700044073,230,7701512272,"TENDEUR","2016-09-08",1,"X","X",{"$f":"IF(ISERROR(VLOOKUP(E13,'LX02'!$A$1:$D$150,1,FALSE)),\"\",\"X\")","v":""},"Différé",1,230,"","","Manque stock",null,"+ de 3 jours","","GILLES MARC",200984427,1,1]
["4700044073-380",252,4700044073,380,7711579329,"PINS ALPINE BRILLANT","2016-09-08",200,"X","X",{"$f":"IF(ISERROR(VLOOKUP(E14,'LX02'!$A$1:$D$150,1,FALSE)),\"\",\"X\")","v":""},"Différé",200,311,"","","Affectée non expédiée",null,"+ de 3 jours","Reliquat","TOURNEUR SOPHIE",200984343,200,200]
["4700044073-520",252,4700044073,520,"403006329R","ROUE 6 J 16 H2 5 50","2016-09-08",125,"X","X",{"$f":"IF(ISERROR(VLOOKUP(E15,'LX02'!$A$1:$D$150,1,FALSE)),\"\",\"X\")","v":""},"Différé",125,230,"","","Manque stock",null,"+ de 3 jours","","LEGENDRE SEBASTIEN",200984347,125,125]
["4700044091-120",256,4700044091,120,"727125064R","VITRE PARE-BRISE ACOUSTIQUE CPTR PLUIE","2016-09-12",3,"X","X",{"$f":"IF(ISERROR(VLOOKUP(E16,'LX02'!$A$1:$D$150,1,FALSE)),\"\",\"X\")","v":""},"Différé",3,230,"","","Manque stock",null,"+ de 3 jours","","GILLES MARC",200984650,2,3]
["4700044099-250",257,4700044099,250,"8200420632\n8200725767","CHAPE DEBRAYAGE DAG","2016-09-13",2,"X","X",{"$f":"IF(ISERROR(VLOOKUP(E17,'LX02'!$A$1:$D$150,1,FALSE)),\"\",\"X\")","v":""},"Différé",2,230,"","","Manque stock",null,"+ de 3 jours","","DELPUECH PATRICK JEAN ANTOINE",200984968,2,2]
["4700044099-300",257,4700044099,300,"8200517930\n8200725767","PEDALIER DEBRAYAGE CPSR DAG EQP","2016-09-13",2,"X","X",{"$f":"IF(ISERROR(VLOOKUP(E18,'LX02'!$A$1:$D$150,1,FALSE)),\"\",\"X\")","v":""},"Différé",2,230,"","","Manque stock",null,"+ de 3 jours","","DELPUECH PATRICK JEAN ANTOINE",200984968,2,2]
["4700044110-230",258,4700044110,230,8200545725,"CALE MOUSSE","2016-09-14",300,"X","X",{"$f":"IF(ISERROR(VLOOKUP(E19,'LX02'!$A$1:$D$150,1,FALSE)),\"\",\"X\")","v":""},"Différé",300,230,"","",{"$f":"IF(AND(J19=\"x\",I19=\"\"),\"351 ou litige\",IF(AND(O19=\"Soldé\",H19=M19),\"\",IF(ISERROR(VLOOKUP(N19,Code_MPR,2,FALSE)),\"351 ou Litige\",VLOOKUP(N19,Code_MPR,2,FALSE))))","v":"Manque stock"},null,"+ de 3 jours","","GILLES MARC",200985089,300,300]
["4700044119-320",259,4700044119,320,"628908106R","EMBLEME AV","2016-09-15",2,"X","X",{"$f":"IF(ISERROR(VLOOKUP(E20,'LX02'!$A$1:$D$150,1,FALSE)),\"\",\"X\")","v":""},"Différé",2,220,"","","Bloquée pénurie gestionnaire",null,"+ de 3 jours","","COTTENCIN FREDERIC",200985229,2,2]
{"$rows_left_out":150}
{"sheet":"MP","index":3,"n_rows":11051,"n_cols":11,"rows_kept":11051,"cut":false,"hidden":false,"merged":[]}
["Contrôle","LF","Suivi MPR"]
[{"$f":"CONCATENATE(D2,\"-\",E2)","v":"4700043626-320"},{"$f":"IF(J2=K2,\"X\",\"\")","v":""},{"$f":"IF(ISERROR(VLOOKUP(A2,Base_suivi_MPR,1,FALSE)),\"\",\"X\")","v":"X"},4700043626,320,7711575964,"Pack Historic 2","2016-06-21","2016-07-11",1,0]
[{"$f":"CONCATENATE(D3,\"-\",E3)","v":"4700043671-350"},"",{"$f":"IF(ISERROR(VLOOKUP(A3,Base_suivi_MPR,1,FALSE)),\"\",\"X\")","v":"X"},4700043671,350,"410114EA0A","CALIPER ASSY-BRAKE,W/O PAD LH","2016-06-28","2016-06-29",30,6]
[{"$f":"CONCATENATE(D4,\"-\",E4)","v":"4700043822-170"},"",{"$f":"IF(ISERROR(VLOOKUP(A4,Base_suivi_MPR,1,FALSE)),\"\",\"X\")","v":"X"},4700043822,170,7705030156,"RACCORD 2 VOIES 20X20","2016-07-25","2016-07-26",20,0]
["4700043829-320","","X",4700043829,320,"144B05233R","POMPE EAU ADDITIONNELLE","2016-07-26","2016-07-27",2,0]
["4700043864-310","","X",4700043864,310,7711782372,"SPINBOARD ALPINE","2016-08-02","2016-08-03",1,0]
["4700043996-200","","X",4700043996,200,"628908106R","EMBLEME AV","2016-08-29","2016-08-30",2,0]
["4700044012-490","","X",4700044012,490,"255545857R","TRANSMISSION ELCT RTTF CDE SOUS VLT","2016-08-31","2016-09-01",12,0]
["4700044052-360","","X",4700044052,360,7711419431,"PON\\EUSE 1 MAIN","2016-09-06","2016-09-07",2,0]
["4700044063-700","","X",4700044063,700,"628908106R","EMBLEME AV","2016-09-07","2016-09-08",2,0]
["4700044073-200","","X",4700044073,200,7701421117,"REPARATION PLASTIQUE","2016-09-08","2016-09-09",2,0]
["4700044073-230","","X",4700044073,230,7701512272,"TENDEUR","2016-09-08","2016-09-09",1,0]
["4700044073-380","","X",4700044073,380,7711579329,"PINS ALPINE BRILLANT","2016-09-08","2016-09-23",200,160]
["4700044073-520","","X",4700044073,520,"403006329R","ROUE 6 J 16 H2 5 50","2016-09-08","2016-09-09",125,105]
["4700044091-120","","X",4700044091,120,"727125064R","VITRE PARE-BRISE ACOUSTIQUE CPTR PLUIE","2016-09-12","2016-09-13",3,0]
["4700044099-250","","X",4700044099,250,8200725767,"PEDALIER DEBRAYAGE DAG","2016-09-13","2016-09-14",2,0]
["4700044099-300","","X",4700044099,300,8200725767,"PEDALIER DEBRAYAGE DAG","2016-09-13","2016-09-14",2,0]
["4700044110-230","","X",4700044110,230,8200545725,"CALE MOUSSE","2016-09-14","2016-09-15",300,250]
["4700044119-320","","X",4700044119,320,"628908106R","EMBLEME AV","2016-09-15","2016-09-16",2,0]
["4700044137-470","","X",4700044137,470,"628908106R","EMBLEME AV","2016-09-19","2016-09-20",2,0]
{"$rows_left_out":11032}
{"sheet":"Relance Cergy","index":4,"n_rows":93,"n_cols":8,"rows_kept":93,"cut":false,"hidden":false,"merged":[]}
[]
["Cde","Ligne","Référence","Date commande","Qté","Statut initial","Commentaire Initial MPR","Réponse MPR"]
[180,350,"410114EA0A","2016-06-28",30,230]
[207,170,7705030156,"2016-07-25",20,230]
[208,320,"144B05233R","2016-07-26",2,220]
[215,310,7711782372,"2016-08-02",1,130]
[242,200,"628908106R","2016-08-29",2,220]
[244,490,"255545857R","2016-08-31",12,230]
[250,360,7711419431,"2016-09-06",2,230]
[251,700,"628908106R","2016-09-07",2,220]
[252,200,7701421117,"2016-09-08",2,230]
[252,230,7701512272,"2016-09-08",1,230]
[252,520,"403006329R","2016-09-08",125,230]
[256,120,"727125064R","2016-09-12",3,230]
[257,250,"8200420632\n8200725767","2016-09-13",2,230]
[257,300,"8200517930\n8200725767","2016-09-13",2,230]
[258,230,8200545725,"2016-09-14",300,230]
[259,320,"628908106R","2016-09-15",2,220]
[263,470,"628908106R","2016-09-19",2,220]
[266,170,7700428589,"2016-09-22",100,230]
{"$rows_left_out":74}
{"sheet":"LX02","index":5,"n_rows":150,"n_cols":4,"rows_kept":150,"cut":false,"hidden":false,"merged":[]}
[{"$f":"'[2]LX02 transfert'!A1","v":7700777886},{"$f":"'[2]LX02 transfert'!B1","v":"RONDELLE POUR AGRAFE DE FIXATION"},{"$f":"'[2]LX02 transfert'!C1","v":8},{"$f":"'[2]LX02 transfert'!D1","v":"2007-03-27"}]
[{"$f":"'[2]LX02 transfert'!A2","v":7701207066},{"$f":"'[2]LX02 transfert'!B2","v":"PLAQUETTE DE FREIN X65 GIRLING"},{"$f":"'[2]LX02 transfert'!C2","v":5},{"$f":"'[2]LX02 transfert'!D2","v":"2007-03-27"}]
[{"$f":"'[2]LX02 transfert'!A3","v":0},{"$f":"'[2]LX02 transfert'!B3","v":0},{"$f":"'[2]LX02 transfert'!C3","v":0},{"$f":"'[2]LX02 transfert'!D3","v":"00:00:00"}]
[{"$f":"'[2]LX02 transfert'!A4","v":0},{"$f":"'[2]LX02 transfert'!B4","v":0},{"$f":"'[2]LX02 transfert'!C4","v":0},{"$f":"'[2]LX02 transfert'!D4","v":"00:00:00"}]
[{"$f":"'[2]LX02 transfert'!A5","v":0},{"$f":"'[2]LX02 transfert'!B5","v":0},{"$f":"'[2]LX02 transfert'!C5","v":0},{"$f":"'[2]LX02 transfert'!D5","v":"00:00:00"}]
[{"$f":"'[2]LX02 transfert'!A6","v":0},{"$f":"'[2]LX02 transfert'!B6","v":0},{"$f":"'[2]LX02 transfert'!C6","v":0},{"$f":"'[2]LX02 transfert'!D6","v":"00:00:00"}]
[{"$f":"'[2]LX02 transfert'!A7","v":0},{"$f":"'[2]LX02 transfert'!B7","v":0},{"$f":"'[2]LX02 transfert'!C7","v":0},{"$f":"'[2]LX02 transfert'!D7","v":"00:00:00"}]
[{"$f":"'[2]LX02 transfert'!A8","v":0},{"$f":"'[2]LX02 transfert'!B8","v":0},{"$f":"'[2]LX02 transfert'!C8","v":0},{"$f":"'[2]LX02 transfert'!D8","v":"00:00:00"}]
[{"$f":"'[2]LX02 transfert'!A9","v":0},{"$f":"'[2]LX02 transfert'!B9","v":0},{"$f":"'[2]LX02 transfert'!C9","v":0},{"$f":"'[2]LX02 transfert'!D9","v":"00:00:00"}]
[{"$f":"'[2]LX02 transfert'!A10","v":0},{"$f":"'[2]LX02 transfert'!B10","v":0},{"$f":"'[2]LX02 transfert'!C10","v":0},{"$f":"'[2]LX02 transfert'!D10","v":"00:00:00"}]
[{"$f":"'[2]LX02 transfert'!A11","v":0},{"$f":"'[2]LX02 transfert'!B11","v":0},{"$f":"'[2]LX02 transfert'!C11","v":0},{"$f":"'[2]LX02 transfert'!D11","v":"00:00:00"}]
[{"$f":"'[2]LX02 transfert'!A12","v":0},{"$f":"'[2]LX02 transfert'!B12","v":0},{"$f":"'[2]LX02 transfert'!C12","v":0},{"$f":"'[2]LX02 transfert'!D12","v":"00:00:00"}]
[{"$f":"'[2]LX02 transfert'!A13","v":0},{"$f":"'[2]LX02 transfert'!B13","v":0},{"$f":"'[2]LX02 transfert'!C13","v":0},{"$f":"'[2]LX02 transfert'!D13","v":"00:00:00"}]
[{"$f":"'[2]LX02 transfert'!A14","v":0},{"$f":"'[2]LX02 transfert'!B14","v":0},{"$f":"'[2]LX02 transfert'!C14","v":0},{"$f":"'[2]LX02 transfert'!D14","v":"00:00:00"}]
[{"$f":"'[2]LX02 transfert'!A15","v":0},{"$f":"'[2]LX02 transfert'!B15","v":0},{"$f":"'[2]LX02 transfert'!C15","v":0},{"$f":"'[2]LX02 transfert'!D15","v":"00:00:00"}]
[{"$f":"'[2]LX02 transfert'!A16","v":0},{"$f":"'[2]LX02 transfert'!B16","v":0},{"$f":"'[2]LX02 transfert'!C16","v":0},{"$f":"'[2]LX02 transfert'!D16","v":"00:00:00"}]
[{"$f":"'[2]LX02 transfert'!A17","v":0},{"$f":"'[2]LX02 transfert'!B17","v":0},{"$f":"'[2]LX02 transfert'!C17","v":0},{"$f":"'[2]LX02 transfert'!D17","v":"00:00:00"}]
[{"$f":"'[2]LX02 transfert'!A18","v":0},{"$f":"'[2]LX02 transfert'!B18","v":0},{"$f":"'[2]LX02 transfert'!C18","v":0},{"$f":"'[2]LX02 transfert'!D18","v":"00:00:00"}]
[{"$f":"'[2]LX02 transfert'!A19","v":0},{"$f":"'[2]LX02 transfert'!B19","v":0},{"$f":"'[2]LX02 transfert'!C19","v":0},{"$f":"'[2]LX02 transfert'!D19","v":"00:00:00"}]
[{"$f":"'[2]LX02 transfert'!A20","v":0},{"$f":"'[2]LX02 transfert'!B20","v":0},{"$f":"'[2]LX02 transfert'!C20","v":0},{"$f":"'[2]LX02 transfert'!D20","v":"00:00:00"}]
{"$rows_left_out":131}
{"sheet":"Code MPR","index":6,"n_rows":24,"n_cols":2,"rows_kept":24,"cut":false,"hidden":false,"merged":[]}
["Code","Clair"]
[110,"A confirmer"]
[120,"Référence sans prix"]
[130,"Nouvelle référence"]
[210,"Référence bloquée cause technique"]
[220,"Bloquée pénurie gestionnaire"]
[230,"Manque stock"]
[250,"Différé par gestionnaire"]
[260,"Attente réception"]
[280,"Attente affectation "]
[290,"En attente du traitement "]
[311,"Affectée non expédiée"]
[312,"Affectée bon complet"]
[520,"Facturée"]
[910,"Annulé par destinataire (Client)"]
[920,"Annulé par service relation clientèle (MPR)"]
[930,"Fractionnement"]
[950,"Remplacement provisoire"]
[960,"Remplacement définitif"]
[970,"Eclatement de livraison"]
{"$rows_left_out":5}
{"sheet":"Date","index":7,"n_rows":17,"n_cols":2,"rows_kept":17,"cut":false,"hidden":false,"merged":[]}
[2016]
["Jour exclus","Jour férié + ARTT année N"]
["1900-01-01",{"$f":"(DATE($A$1,3,28))","v":"2016-03-28"}]
["1900-01-07",{"$f":"(DATE($A$1,5,5))","v":"2016-05-05"}]
[null,{"$f":"(DATE($A$1,5,6))","v":"2016-05-06"}]
[null,{"$f":"(DATE($A$1,5,16))","v":"2016-05-16"}]
[null,{"$f":"(DATE($A$1,7,14))","v":"2016-07-14"}]
[null,{"$f":"(DATE($A$1,7,15))","v":"2016-07-15"}]
[null,{"$f":"(DATE($A$1,8,15))","v":"2016-08-15"}]
[null,{"$f":"(DATE($A$1,10,31))","v":"2016-10-31"}]
[null,{"$f":"(DATE($A$1,11,1))","v":"2016-11-01"}]
[null,{"$f":"(DATE($A$1,12,23))","v":"2016-12-23"}]
[null,{"$f":"(DATE($A$1,12,26))","v":"2016-12-26"}]
[null,{"$f":"(DATE($A$1,12,27))","v":"2016-12-27"}]
[null,{"$f":"(DATE($A$1,12,28))","v":"2016-12-28"}]
[null,{"$f":"(DATE($A$1,12,29))","v":"2016-12-29"}]
[null,{"$f":"(DATE($A$1,12,30))","v":"2016-12-30"}]