{"text_format":"1","workbook":"xlsx","n_sheets":7,"sheets":["SEM 33-2016","Magasins (2)","semaine impaire","semaine paire (sans samedi pm)","semaine impaire (ac samedi pm)","horaires employés","horaires employés (2)"],"not_rendered":{"charts":0,"images":0,"macros":1,"external_links":0,"defined_names":10,"comments":4,"pivot_tables":0},"unopened":[],"bounds":{"document_bytes":16777216,"sheet_cells":100000,"rows_first":2000,"rows_last":500,"rows_between":2000,"halvings":0,"cell_chars":16384,"cell_head_chars":4096},"cells_cut":0,"cells_raw":0,"read":"whole","date_system":"1900"}

{"sheet":"SEM 33-2016","index":0,"n_rows":156,"n_cols":46,"rows_kept":156,"cut":false,"hidden":true,"merged":[[24,2,24,3],[121,31,121,36],[118,31,118,36],[119,2,119,8],[119,9,119,14],[119,15,119,19],[119,20,119,25],[119,26,119,30],[119,31,119,36],[120,2,120,8],[120,9,120,14],[120,15,120,19],[120,20,120,25],[120,26,120,30],[120,31,120,36],[94,2,94,3],[95,2,95,3],[96,2,96,3],[97,2,97,3],[99,2,99,3],[113,2,113,3],[115,2,115,3],[116,2,116,3],[86,2,86,3],[148,41,149,41],[130,41,131,41],[132,41,133,41],[134,41,135,41],[136,41,137,41],[138,41,139,41],[140,41,141,41],[124,41,125,41],[126,41,127,41],[128,41,129,41],[142,41,143,41],[144,41,145,41],[142,39,143,39],[144,39,145,39],[148,40,149,40],[150,40,151,40],[123,36,123,37],[152,36,152,38],[140,38,141,38],[142,38,143,38],[144,38,145,38],[148,38,149,38],[150,38,151,38],[148,39,149,39],[134,40,135,40],[136,40,137,40],[138,40,139,40],[140,40,141,40],[142,40,143,40],[144,40,145,40],[124,40,125,40],[126,40,127,40],[128,40,129,40],[130,40,131,40],[132,40,133,40],[146,39,147,39],[123,1,123,3],[152,2,152,3],[124,39,125,39],[126,39,127,39],[128,39,129,39],[130,39,131,39],[132,39,133,39],[124,2,125,2],[126,2,127,2],[128,2,129,2],[130,2,131,2],[150,39,151,39],[124,38,125,38],[126,38,127,38],[128,38,129,38],[130,38,131,38],[132,38,133,38],[134,38,135,38],[136,38,137,38],[138,38,139,38],[134,39,135,39],[136,39,137,39],[138,39,139,39],[140,39,141,39],[94,1,96,1],[107,2,107,3],[108,2,108,3],[109,2,109,3],[110,2,110,3],[111,2,111,3],[112,2,112,3],[100,2,100,3],[102,1,102,3],[103,2,103,3],[104,2,104,3],[105,2,105,3],[106,2,106,3],[97,1,100,1],[105,1,109,1],[110,1,112,1],[87,2,87,3],[88,2,88,3],[89,2,89,3],[90,2,90,3],[91,2,91,3],[78,2,78,3],[79,2,79,3],[80,2,80,3],[82,2,82,3],[83,2,83,3],[85,1,85,3],[88,1,93,1],[93,2,93,3],[76,2,76,3],[77,2,77,3],[63,2,63,3],[65,2,65,3],[66,2,66,3],[68,1,68,3],[69,2,69,3],[70,2,70,3],[54,1,59,1],[60,1,62,1],[63,1,66,1],[71,1,76,1],[77,1,79,1],[61,2,61,3],[62,2,62,3],[72,2,72,3],[73,2,73,3],[74,2,74,3],[59,2,59,3],[60,2,60,3],[36,2,36,3],[52,2,52,3],[53,2,53,3],[48,2,48,3],[49,2,49,3],[51,1,51,3],[40,2,40,3],[42,2,42,3],[43,2,43,3],[44,2,44,3],[45,2,45,3],[46,2,46,3],[150,2,151,2],[1,1,1,3],[2,2,2,3],[3,2,3,3],[4,2,4,3],[5,2,5,3],[6,2,6,3],[7,2,7,3],[8,2,8,3],[9,2,9,3],[136,2,137,2],[138,2,139,2],[140,2,141,2],[142,2,143,2],[144,2,145,2],[148,2,149,2],[124,1,152,1],[56,2,56,3],[57,2,57,3],[10,2,10,3],[11,2,11,3],[12,2,12,3],[14,2,14,3],[15,2,15,3],[17,1,17,3],[18,2,18,3],[19,2,19,3],[20,2,20,3],[113,1,116,1],[12,1,15,1],[9,1,11,1],[4,1,8,1],[20,1,25,1],[26,1,28,1],[29,1,32,1],[37,1,42,1],[43,1,45,1],[46,1,49,1],[80,1,83,1],[37,2,37,3],[38,2,38,3],[39,2,39,3],[35,2,35,3],[54,2,54,3],[55,2,55,3],[71,2,71,3],[32,2,32,3],[34,1,34,3],[155,1,156,1],[155,2,155,6],[155,7,155,10],[155,11,155,13],[155,14,155,16],[155,21,155,23],[155,24,155,26],[155,27,155,29],[155,30,155,32],[155,33,155,36],[156,2,156,6],[156,7,156,10],[156,11,156,13],[156,14,156,16],[156,21,156,23],[156,24,156,26],[156,27,156,29],[156,30,156,32],[156,33,156,36],[155,17,155,20],[156,17,156,20],[118,1,121,1],[118,2,118,8],[118,9,118,14],[118,15,118,19],[118,20,118,25],[118,26,118,30],[121,2,121,8],[121,9,121,14],[121,15,121,19],[121,20,121,25],[121,26,121,30],[153,30,153,34],[153,36,153,38],[146,40,147,40],[146,41,147,41],[13,2,13,3],[30,2,30,3],[47,2,47,3],[64,2,64,3],[81,2,81,3],[98,2,98,3],[114,2,114,3],[146,2,147,2],[146,38,147,38],[132,2,133,2],[134,2,135,2],[21,2,21,3],[22,2,22,3],[23,2,23,3],[25,2,25,3],[26,2,26,3],[27,2,27,3],[28,2,28,3],[29,2,29,3],[31,2,31,3]]}
["SEM33/2016"]
[null,"2016-08-15",null,null,"5h30>6h","6h>6h30","6h30>7h","7h>7h30","7h30>8h","8h>8h30","8h30>9h","9h>9h30","9h30>10h","10h>10h30","10h30>11h","11h>11h30","11h30>12h","12h>12h30","12h30>13h","13h>13h30","13h30>14h","14h>14h30","14h30>15h","15h>15h30","15h30>16h","16h>16h30","16h30>17h","17h>17h30","17h30>18h","18h>18h30","18h30>19h","19h>19h30","19h30>20h","20h>20h30","20h30>21h","21h>21h30","TOTAL"]
[null,"r = rayon","Directeur",null,null,null,null,null,null,null,null,null,null,null,null,null,null,null,null,null,null,null,null,null,null,null,null,null,null,null,null,null,null,null,null,null,{"$f":"COUNTA(E3:AJ3)*0.5","v":0}]
[null,"c = caisse","Hassan",null,null,null,"r","r","r","r","r","r","r","r","r","r","r","r","r",null,null,null,null,null,null,null,null,null,null,null,null,null,null,null,null,null,{"$f":"COUNTA(E4:AJ4)*0.5","v":6.5}]
[null,"lundi","Rodrigue",null,null,null,"r","r","r","r","r","r","r","r","r","r","r","r","r",null,null,null,null,null,null,null,null,null,null,null,null,null,null,null,null,null,{"$f":"COUNTA(E5:AJ5)*0.5","v":6.5}]
[null,null,"AKUVI SYLVIA","AKUVI",null,null,null,null,null,null,null,null,null,null,null,null,null,"c","c","c","c","c","c",null,"c","c","c","c",null,"c","c","c","c","c","C",null,8,null,"SYLVIA DOIT PRENDRE SA PAUSE A 18H"]
[null,null,"MOMO","IDRISSA",null,null,null,null,null,null,null,null,null,null,null,null,null,null,null,null,null,null,null,"r","r","r","r","r","r","r","r","r","r","r","r",null,6]
[null,null,"DIARRA FATOUMATA","HANNE FATOUMATA",null,null,null,null,null,null,null,null,null,null,null,"cp","cp","cp","cp","cp","cp","cp","cp","cp","cp","cp","cp",null,null,null,null,null,null,null,null,null,6]
[null,null,"SHAM LATA",null,null,null,null,"x","x","x","x","x","x","x","x","x","x","x","x","x",null,null,null,null,null,null,null,null,null,null,null,null,null,null,null,null,6.5]
[null,null,"tacko","PHUONG LINH",null,null,null,null,null,null,null,"C","C","C","C","c","c",null,null,null,null,null,null,null,null,null,null,"C","C","C","C","c","c","c","C",null,3,null,null,"Chanez doit recuperer 3h a prendre debut mai = Ok pris le 07/05"]
[null,null,"AMINO FAISSOLATH","FASSOLATH",null,null,null,null,null,null,null,"cp","cp","cp","cp","cp","cp","cp","cp","cp","cp","cp","cp","cp","cp",null,null,null,null,null,null,null,null,null,null,null,7]
[null,null,"JEYAN",null,null,null,null,null,"r","r","r","r","r","r","r","r","r","r","r","r","r",null,null,null,null,null,null,null,null,null,null,null,null,null,null,null,6.5]
[null,null,"Katia BOUSBA",null,null,null,null,null,null,null,null,null,null,null,null,null,null,null,null,null,null,null,null,null,null," ","c","c","c","c","c","c","c","c","C",null,5]
[null,null,"Anta",null,null,null,null,null,null,null,null,"c","c","c","c","c","c","c","C","C","C","C","C","C","C",null,null,null,null,null,null,null,null,null,null,"C"]
[null,null,null,null,null,null,null,null,null,null,null,null,null,null,null,null,null,null,null,null,null,null,null,null,null,null,null,null,null,null,null,null,null,null,null,null,0]
[null,null,"TOTAL",null,{"$f":"COUNTA(E3:E15)*0.5","v":0},{"$f":"COUNTA(F3:F15)*0.5","v":0},{"$f":"COUNTA(G3:G15)*0.5","v":1},1.5,2,2,2,3.5,3.5,3.5,3.5,4,4,4,4,3,2.5,2,2,2,2.5,{"$f":"COUNTA(Z3:Z15)*0.5","v":2},{"$f":"COUNTA(AA3:AA15)*0.5","v":2},{"$f":"COUNTA(AB3:AB15)*0.5","v":2},{"$f":"COUNTA(AC3:AC15)*0.5","v":1.5},{"$f":"COUNTA(AD3:AD15)*0.5","v":2},{"$f":"COUNTA(AE3:AE15)*0.5","v":2},{"$f":"COUNTA(AF3:AF15)*0.5","v":2},{"$f":"COUNTA(AG3:AG15)*0.5","v":2},{"$f":"COUNTA(AH3:AH15)*0.5","v":2},{"$f":"COUNTA(AI3:AI15)*0.5","v":2},{"$f":"COUNTA(AJ3:AJ15)*0.5","v":0.5},{"$f":"SUM(AK3:AK15)","v":61}]
[null,null,null,null,null,null," "]
[null,"2016-08-16",null,null,"5h30>6h","6h>6h30","6h30>7h","7h>7h30","7h30>8h","8h>8h30","8h30>9h","9h>9h30","9h30>10h","10h>10h30","10h30>11h","11h>11h30","11h30>12h","12h>12h30","12h30>13h","13h>13h30","13h30>14h","14h>14h30","14h30>15h","15h>15h30","15h30>16h","16h>16h30","16h30>17h","17h>17h30","17h30>18h","18h>18h30","18h30>19h","19h>19h30","19h30>20h","20h>20h30","20h30>21h","21h>21h30","TOTAL"]
[null,"r = rayon","Directeur",null,null,null,null,null,null,null,null,null,null,null,null,null,null,null,null,null,null,null,null,null,null,null,null,null,null,null,null,null,null,null,null,null,{"$f":"COUNTA(E19:AJ19)*0.5","v":0}]
[null,"c = caisse","Hassan",null,null,null,"r","r","r","r","r","r","r","r","r","r","r","r","r",null,null,null,null,null,null,null,null,null,null,null,null,null,null,null,null,null,{"$f":"COUNTA(E20:AJ20)*0.5","v":6.5}]
[null,"mardi","Rodrigue",null,null,null,null,null,null,null,null,null,null,null,null,null,null,null,null,null,null,null,null,null,null,null,null,null,null,null,null,null,null,null,null,null,{"$f":"COUNTA(E21:AJ21)*0.5","v":0}]
[null,null,"AKUVI SYLVIA","AKUVI",null,null,null,null,null,null,null,"c","c","c","c","c",null,"c","c","c","c","c","c",null,null,null,null,null,null,null,null,null,null,null,null,null,5.5]
[null,null,"MOMO","IDRISSA",null,null,null,null,null,null,null,null,null,null,null,null,null,null,null,null,null,"r","r","r","r","r","r","r","r","r","r","r","r","r","r",null,7]
[null,null,"DIARRA FATOUMATA","HANNE FATOUMATA",null,null,null,null,null,null,null,null,null,null,null,null,"cp","cp","cp","cp","cp","cp","cp","cp","cp",null,null,"cp","cp","cp","cp","cp","cp","cp","cp",null,8.5,null,null,"Fatou partie à 12h35 le 3/05/16 = doit 7,5h à l'entp",null,null,null,"Partie sans compter son caisson"]
[null,null,"SHOP SERVICES",null,null,null,null,null,null,null,null,null,null,null,null,null,"c","c","c","c","c","c","c","C","C",null,null,"c","c","c","c","c","c","c","C","C"]
[null,null,"SHAM LATA",null,null,null,null,"r","r","r","c","r","r","r","r","r","r","r","r","r",null,null,null,null,null,null,null,null,null,null,null,null,null,null,null,null,6.5]
[null,null,"TACKO","PHUONG LINH",null,null,null,null,null,null,null,null,null,null,null,null,null,null,null,null,null,null,null,null,null,null,null,null,null,"c","c","c","c","c","c",null,3]
[null,null,"AMINO FAISSOLATH","FASSOLATH",null,null,null,null,null,null,null,null,null,null,null,null,null,null,null,null,null,null,null,null,"cp","cp","cp","cp","cp","cp","cp","cp","cp","cp","cp",null,5.5]
[null,null,"JEYAN",null,null,null,null,null,null,null,null,null,null,null,null,"r","r","r","r","r","r",null,null,null,null,null,null,null,null,"r","r","r","r","r","r",null,6]
[null,null,{"$f":"+C13","v":"Katia BOUSBA"},null,null,null,null,null,null,null,null,null,null,null,null,null,null,null,null,null,null,null,null,null,null,null,null,null,null,null,null,null,null,null,null,null,0]
[null,null,"Anta",null,null,null,null,null,null,null,null,null,null,null,null,null,null,null,null,null,null,null,null,null,"c","c","c","c","c","c","c","c","c","c","C",null,5.5]
[null,null,null,null,null,null,null,null,null,null,null,null,null,null,null,null,null,null,null,null,null,null,null,null,null,null,null,null,null,null,null,null,null,null,null,null,0]
[null,null,"TOTAL",null,{"$f":"COUNTA(E19:E32)*0.5","v":0},{"$f":"COUNTA(F19:F32)*0.5","v":0},{"$f":"COUNTA(G19:G32)*0.5","v":0.5},{"$f":"COUNTA(H19:H32)*0.5","v":1},{"$f":"COUNTA(I19:I32)*0.5","v":1},{"$f":"COUNTA(J19:J32)*0.5","v":1},{"$f":"COUNTA(K19:K32)*0.5","v":1},{"$f":"COUNTA(L19:L32)*0.5","v":1.5},{"$f":"COUNTA(M19:M32)*0.5","v":1.5},{"$f":"COUNTA(N19:N32)*0.5","v":1.5},{"$f":"COUNTA(O19:O32)*0.5","v":1.5},{"$f":"COUNTA(P19:P32)*0.5","v":2},{"$f":"COUNTA(Q19:Q32)*0.5","v":2.5},{"$f":"COUNTA(R19:R32)*0.5","v":3},{"$f":"COUNTA(S19:S32)*0.5","v":3},{"$f":"COUNTA(T19:T32)*0.5","v":2.5},{"$f":"COUNTA(U19:U32)*0.5","v":2},{"$f":"COUNTA(V19:V32)*0.5","v":2},{"$f":"COUNTA(W19:W32)*0.5","v":2},{"$f":"COUNTA(X19:X32)*0.5","v":1.5},{"$f":"COUNTA(Y19:Y32)*0.5","v":2.5},{"$f":"COUNTA(Z19:Z32)*0.5","v":1.5},{"$f":"COUNTA(AA19:AA32)*0.5","v":1.5},{"$f":"COUNTA(AB19:AB32)*0.5","v":2.5},{"$f":"COUNTA(AC19:AC32)*0.5","v":2.5},{"$f":"COUNTA(AD19:AD32)*0.5","v":3.5},{"$f":"COUNTA(AE19:AE32)*0.5","v":3.5},{"$f":"COUNTA(AF19:AF32)*0.5","v":3.5},{"$f":"COUNTA(AG19:AG32)*0.5","v":3.5},{"$f":"COUNTA(AH19:AH32)*0.5","v":3.5},{"$f":"COUNTA(AI19:AI32)*0.5","v":3.5},{"$f":"COUNTA(AJ19:AJ32)*0.5","v":0.5},{"$f":"SUM(AK19:AK32)","v":54}]
[]
[null,"2016-08-17",null,null,"5h30>6h","6h>6h30","6h30>7h","7h>7h30","7h30>8h","8h>8h30","8h30>9h","9h>9h30","9h30>10h","10h>10h30","10h30>11h","11h>11h30","11h30>12h","12h>12h30","12h30>13h","13h>13h30","13h30>14h","14h>14h30","14h30>15h","15h>15h30","15h30>16h","16h>16h30","16h30>17h","17h>17h30","17h30>18h","18h>18h30","18h30>19h","19h>19h30","19h30>20h","20h>20h30","20h30>21h","21h>21h30","TOTAL"]
[null,"r = rayon","Directeur",null,null,null,null,null,null,null,null,null,null,null,null,null,null,null,null,null,null,null,null,null,null,null,null,null,null,null,null,null,null,null,null,null,{"$f":"COUNTA(E36:AJ36)*0.5","v":0}]
[null,"c = caisse","Hassan",null,null,null,"r","r","r","r","r","r","r","r","r","r","r","r","r",null,null,null,null,null,null,null,null,null,null,null,null,null,null,null,null,null,{"$f":"COUNTA(E37:AJ37)*0.5","v":6.5},null,null,null,null,null,null,"Sylvia de 9 à 13 le 20/04 car absente le 23/04"]
[null,"Mercredi","Rodrigue",null,null,null,"r","r","r","r","r","r","r","r","r","r","r","r","r",null,null,null,null,null,null,null,null,null,null,null,null,null,null,null,null,null,{"$f":"COUNTA(E38:AJ38)*0.5","v":6.5},null,null,null,null,null,null,"doit 2h solde en semaine  17"]
[null,null,"AKUVI SYLVIA",null,null,null,null,null,null,null,null,null,null,null,null,null,null,null,null,null,null,null,null,"c","c","c","c","c",null,"c ","c","c","c","c","C",null,5.5,null,"doit prendre sa pause entre 17h et 17h30"]
[null,null,"MOMO",null,null,null,null,null,null,null,null,null,null,null,null,null,null,null,null,null,null,"r","r","r","r","r","r","r","r","r","r","r","r","r","r",null,7]
[null,null,"DIARRA FAITOUMATA","HANNE FATOUMATA",null,null,null,null,null,null,null,null,null,null,null,null,null,null,null,null,"cp","cp","cp","cp","cp","cp","cp","cp","cp","cp","cp","cp","cp","cp","cp",null,7.5,null,"doit prendre sa pause entre 16h30h et 17h"]
[null,null,null,null,null,null,null,null,null,null,null,null,null,null,null,null,null,null,null,null,"c","c","c","c","c","c","c","C","C","C","C","C","C","C","C"]
[null,null,"SHAM LATA",null,null,null,null,"r","r","r","c","r","r","r","r","r","r","r","r","r",null,null,null,null,null,null,null,null,null,null,null,null,null,null,null,null,6.5]
[null,null,"CHAFA Chanez","PHUONG LINH",null,null,null,null,null,null,null,null,null,null,null,null,null,null,null,null,null,null,null,null,null,null,null,null,null,null,null,null,null,null,null,null,0]
[null,null,"AMINO FAISSOLATH","FASSOLATH",null,null,null,null,null,null,null,"cp","cp","cp","cp","cp","cp","cp","cp","cp","cp","cp","cp",null,null,null,null,null,null,null,null,null,null,null,null,null,6]
[null,null,"JEYAN",null,null,null,null,null,null,null,null,null,null,null,null,"r","r","r","r","r","r",null,null,null,null,null,null,null,"r","r","r","r","r","r","r",null,6.5]
[null,null,{"$f":"+C30","v":"Katia BOUSBA"},null,null,null,null,null,null,null,null,null,null,null,null,"c","c","c","c","c","c",null,null,null,null,null,null,null,"c","c","c","c","c","c","c",null,6.5]
[null,null,"Anta",null,null,null,null,null,null,null,null,"c","c","c","c","c","c","c","c","c","c","c","c"]
[null,null,null,null,null,null,"r","r","r","r","r","r","r","r","r","r","r","r","r",null,null,null,null,null,null,null,null,null,null,null,null,null,null,null,null,"c"]
[null,null,"TOTAL",null,{"$f":"COUNTA(E36:E49)*0.5","v":0},{"$f":"COUNTA(F36:F49)*0.5","v":0},{"$f":"COUNTA(G36:G49)*0.5","v":1.5},{"$f":"COUNTA(H36:H49)*0.5","v":2},{"$f":"COUNTA(I36:I49)*0.5","v":2},{"$f":"COUNTA(J36:J49)*0.5","v":2},{"$f":"COUNTA(K36:K49)*0.5","v":2},{"$f":"COUNTA(L36:L49)*0.5","v":3},{"$f":"COUNTA(M36:M49)*0.5","v":3},{"$f":"COUNTA(N36:N49)*0.5","v":3},{"$f":"COUNTA(O36:O49)*0.5","v":3},{"$f":"COUNTA(P36:P49)*0.5","v":4},{"$f":"COUNTA(Q36:Q49)*0.5","v":4},{"$f":"COUNTA(R36:R49)*0.5","v":4},{"$f":"COUNTA(S36:S49)*0.5","v":4},{"$f":"COUNTA(T36:T49)*0.5","v":2.5},{"$f":"COUNTA(U36:U49)*0.5","v":3},{"$f":"COUNTA(V36:V49)*0.5","v":2.5},{"$f":"COUNTA(W36:W49)*0.5","v":2.5},{"$f":"COUNTA(X36:X49)*0.5","v":2},{"$f":"COUNTA(Y36:Y49)*0.5","v":2},{"$f":"COUNTA(Z36:Z49)*0.5","v":2},{"$f":"COUNTA(AA36:AA49)*0.5","v":2},{"$f":"COUNTA(AB36:AB49)*0.5","v":2},{"$f":"COUNTA(AC36:AC49)*0.5","v":2.5},{"$f":"COUNTA(AD36:AD49)*0.5","v":3},{"$f":"COUNTA(AE36:AE49)*0.5","v":3},{"$f":"COUNTA(AF36:AF49)*0.5","v":3},{"$f":"COUNTA(AG36:AG49)*0.5","v":3},{"$f":"COUNTA(AH36:AH49)*0.5","v":3},{"$f":"COUNTA(AI36:AI49)*0.5","v":3},{"$f":"COUNTA(AJ36:AJ49)*0.5","v":0.5},{"$f":"SUM(AK36:AK49)","v":58.5}]
[]
[null,"2016-08-18",null,null,"5h30>6h","6h>6h30","6h30>7h","7h>7h30","7h30>8h","8h>8h30","8h30>9h","9h>9h30","9h30>10h","10h>10h30","10h30>11h","11h>11h30","11h30>12h","12h>12h30","12h30>13h","13h>13h30","13h30>14h","14h>14h30","14h30>15h","15h>15h30","15h30>16h","16h>16h30","16h30>17h","17h>17h30","17h30>18h","18h>18h30","18h30>19h","19h>19h30","19h30>20h","20h>20h30","20h30>21h","21h>21h30","TOTAL"]
[null,"r = rayon","Directeur",null,null,null,null,null,null,null,null,null,null,null,null,null,null,null,null,null,null,null,null,null,null,null,null,null,null,null,null,null,null,null,null,null,{"$f":"COUNTA(E53:AJ53)*0.5","v":0}]
[null,"c = caisse","Hassan",null,null,null,"r","r","r","r","r","r","r","r","r","r","r","r","r",null,null,null,null,null,null,null,null,null,null,null,null,null,null,null,null,null,{"$f":"COUNTA(E54:AJ54)*0.5","v":6.5}]
[null,"Jeudi","Rodrigue",null,null,null,"cp","cp","cp","cp","cp","cp","cp","cp","cp","cp","cp","cp","cp",null,null,null,null,null,null,null,null,null,null,null,null,null,null,null,null,null,{"$f":"COUNTA(E55:AJ55)*0.5","v":6.5}]
[null,null,"AKUVI SYLVIA",null,null,null,null,null,null,null,null,null,null,null,null,null,null,null,null,null,null,null,null,null,null,null,null,null,null,null,null,null,null,null,null,null,0]
[null,null,"MOMO",null,null,null,null,null,null,null,null,null,null,null,null,null,null,null,null,null,null,null,null,"r","r","r","r","r","r","r","r","r","r","r","r",null,6]
[null,null,"DIARRA FATOUMATA","HANNE FATOUMATA",null,null,null,null,null,null,null,null,null,null,null,null,null,"cp","cp","cp","cp","cp","cp","cp","cp","cp","cp",null,null,null,null,null,null,null,null,null,5,null,"Fatou absente 5h le 14/04 = à récupérer pendant absence Faisso =le18/04 (+2h de 9 à 11 & le 21/04 +3h de 9h à 12h). Au 07/05 = doit 30 min a l'entp"]
[null,null,null,null,null,null,null,null,null,null,null,null,null,null,null,null,null,"c","c","c","c","c","c","c","c","c","c"]
[null,null,"SHAM LATA",null,null,null,null,"r","r","r","c","r","r","r","r","c","c","r","r","r",null,null,null,null,null,null,null,null,null,null,null,null,null,null,null,null,6.5]
[null,null,"Tacko","PHUONG LINH",null,null,null,null,null,null,null,null,null,null,null,null,null,null,null,null,null,null,null,null,null,null,null,"c","c","c","c","c","c","c","C",null,4]
[null,null,"AMINO FAISSOLATH","FASSOLATH",null,null,null,null,null,null,null,"cp","cp","cp","cp","cp","cp","cp","cp","cp","cp","cp","cp",null,null,null,null,null,null,null,null,null,null,null,null,null,6,null,null,null,null,null,null,null,null,0]
[null,null,"JEYAN",null,null,null,null,null,null,null,null,null,null,null,null,null,null,null,null,null,null,null,null,null,null,null,null,null,null,"r","r","r","r","r","r",null,3]
[null,null,{"$f":"+C47","v":"Katia BOUSBA"},null,null,null,null,null,null,null,null,null,null,null,null,null,null,null," ",null,null,null,null,null,null,"c","c","c","c","c","c","c","c","c","C",null,5]
[null,null,"Anta",null,null,null,null,null,null,null,null,"c","c","c","c","c","c","c","c","c","c","c","c",null,null,null,null,null,null,null,null,null,null,null,null,null,6]
[null,null,null,null,null,null,"r","r","r","r","r","r","r","r","r","r","r","r","r",null,null,null,null,null,null,null,null,null,null,null,null,null,null,null,null,null,6.5]
[null,null,"TOTAL",null,{"$f":"COUNTA(E53:E66)*0.5","v":0},{"$f":"COUNTA(F53:F66)*0.5","v":0},{"$f":"COUNTA(G53:G66)*0.5","v":1.5},{"$f":"COUNTA(H53:H66)*0.5","v":2},{"$f":"COUNTA(I53:I66)*0.5","v":2},{"$f":"COUNTA(J53:J66)*0.5","v":2},{"$f":"COUNTA(K53:K66)*0.5","v":2},{"$f":"COUNTA(L53:L66)*0.5","v":3},{"$f":"COUNTA(M53:M66)*0.5","v":3},{"$f":"COUNTA(N53:N66)*0.5","v":3},{"$f":"COUNTA(O53:O66)*0.5","v":3},{"$f":"COUNTA(P53:P66)*0.5","v":3},{"$f":"COUNTA(Q53:Q66)*0.5","v":3},{"$f":"COUNTA(R53:R66)*0.5","v":4},{"$f":"COUNTA(S53:S66)*0.5","v":4.5},{"$f":"COUNTA(T53:T66)*0.5","v":2.5},{"$f":"COUNTA(U53:U66)*0.5","v":2},{"$f":"COUNTA(V53:V66)*0.5","v":2},{"$f":"COUNTA(W53:W66)*0.5","v":2},{"$f":"COUNTA(X53:X66)*0.5","v":1.5},{"$f":"COUNTA(Y53:Y66)*0.5","v":1.5},{"$f":"COUNTA(Z53:Z66)*0.5","v":2},{"$f":"COUNTA(AA53:AA66)*0.5","v":2},{"$f":"COUNTA(AB53:AB66)*0.5","v":1.5},{"$f":"COUNTA(AC53:AC66)*0.5","v":1.5},{"$f":"COUNTA(AD53:AD66)*0.5","v":2},{"$f":"COUNTA(AE53:AE66)*0.5","v":2},{"$f":"COUNTA(AF53:AF66)*0.5","v":2},{"$f":"COUNTA(AG53:AG66)*0.5","v":2},{"$f":"COUNTA(AH53:AH66)*0.5","v":2},{"$f":"COUNTA(AI53:AI66)*0.5","v":2},{"$f":"COUNTA(AJ53:AJ66)*0.5","v":0},{"$f":"SUM(AK53:AK66)","v":61}]
[]
[null,"2016-08-19",null,null,"5h30>6h","6h>6h30","6h30>7h","7h>7h30","7h30>8h","8h>8h30","8h30>9h","9h>9h30","9h30>10h","10h>10h30","10h30>11h","11h>11h30","11h30>12h","12h>12h30","12h30>13h","13h>13h30","13h30>14h","14h>14h30","14h30>15h","15h>15h30","15h30>16h","16h>16h30","16h30>17h","17h>17h30","17h30>18h","18h>18h30","18h30>19h","19h>19h30","19h30>20h","20h>20h30","20h30>21h","21h>21h30","TOTAL"]
[null,"r = rayon","Directeur",null,null,null,null,null,null,null,null,null,null,null,null,null,null,null,null,null,null,null,null,null,null,null,null,null,null,null,null,null,null,null,null,null,{"$f":"COUNTA(E70:AJ70)*0.5","v":0}]
[null,"c = caisse","Hassan",null,null,null,"r","r","r","r","r","r","r","r","r","r","r","r","r",null,null,null,null,null,null,null,null,null,null,null,null,null,null,null,null,null,{"$f":"COUNTA(E71:AJ71)*0.5","v":6.5}]
[null,"Vendredi","Rodrigue",null,null,null,"cp","cp","cp","cp","cp","cp","cp","cp","cp","cp","cp","cp","cp",null,null,null,null,null,null,null,null,null,null,null,null,null,null,null,null,null,{"$f":"COUNTA(E72:AJ72)*0.5","v":6.5}]
[null,null,"AKUVI SYLVIA","AKUVI",null,null,null,null,null,null,null,"c","c","c","c","c",null,"c","c","c","c","c","c",null,null,null,null,null,null,null,null,null,null,null,null,null,5.5]
[null,null,"MOMO","IDRISSA",null,null,null,null,null,null,null,null,null,null,null,null,null,null,null,null,null,null,null,"r","r","r","r","r","r","r","r","r","r","r","r",null,6]
[null,null,"DIARRA FATOUMATA","HANNE FATOUMATA",null,null,null,null,null,null,null,null,null,null,null,null,null,null,null,null,null,null,"cp","cp","cp","cp","cp","cp","cp",null,null,"cp","cp","cp","cp",null,5.5]
[null,null,null,null,null,null,null,null,null,null,null,null,null,null,null,null,null,null,null,null,null,null,"c","c","c","c","c","c","c",null,null,"c","c","c","c"]
[null,null,"SHAM LATA",null,null,null,null,"r","r","r","r","r","r","r","r","r","r","r","r","r",null,null,null,null,null,null,null,null,null,null,null,null,null,null,null,null,6.5]
[null,null,"Tacko","PHUONG LINH",null,null,null,null,null,null,"c","c","c","c","c","c","c","c","c","c","c","c",null,null,null,null,null,null,null,null,null,null,null,null,null,null,6]
[null,null,"AMINO FAISSOLATH","FASSOLATH",null,null,null,null,null,null,null,null,null,null,null,null,null,null,null,null,null,null,null,null,null,null,"cp","cp","cp","cp","cp","cp","cp","cp","cp",null,4.5]
[null,null,"JEYAN",null,null,null,null,null,null,null,null,null,null,null,null,"r","r","r","r","r","r",null,null,null,null,null,null,"r","r","r","r","r","r","r","r",null,7]
[null,null,{"$f":"+C64","v":"Katia BOUSBA"},null,null,null,null,null,null,null,null,null,null,null,null,null,null,null,null,null,null,null,null,null,null,null,null,"c","C","C","c","c","c","c","C",null,4,null,"Pause 15 min + 15 min"]
[null,null,"Anta",null,null,null,null,null,null,null,null,null,null,null,null,null,null,null,null,null,null,null,null,null,null,null,"c","c","c","c","c","c","c","c","c",null,4.5,null,"Le 20/05, Katia doit rattraper 1 u du 18/05 = vient à 9h au lieu de 10h (restera solde 1h)"]
[null,null,null,null,null,null,null,null,null,null,null,null,null,null,null,null,null,null,null,null,null,null,null,null,null,null,null,null,null,null,null,null,null,null,null,null,0]
[null,null,"TOTAL",null,{"$f":"COUNTA(E70:E83)*0.5","v":0},{"$f":"COUNTA(F70:F83)*0.5","v":0},{"$f":"COUNTA(G70:G83)*0.5","v":1},{"$f":"COUNTA(H70:H83)*0.5","v":1.5},{"$f":"COUNTA(I70:I83)*0.5","v":1.5},{"$f":"COUNTA(J70:J83)*0.5","v":1.5},{"$f":"COUNTA(K70:K83)*0.5","v":2},{"$f":"COUNTA(L70:L83)*0.5","v":2.5},{"$f":"COUNTA(M70:M83)*0.5","v":2.5},{"$f":"COUNTA(N70:N83)*0.5","v":2.5},{"$f":"COUNTA(O70:O83)*0.5","v":2.5},{"$f":"COUNTA(P70:P83)*0.5","v":3},{"$f":"COUNTA(Q70:Q83)*0.5","v":2.5},{"$f":"COUNTA(R70:R83)*0.5","v":3},{"$f":"COUNTA(S70:S83)*0.5","v":3},{"$f":"COUNTA(T70:T83)*0.5","v":2},{"$f":"COUNTA(U70:U83)*0.5","v":1.5},{"$f":"COUNTA(V70:V83)*0.5","v":1},{"$f":"COUNTA(W70:W83)*0.5","v":1.5},{"$f":"COUNTA(X70:X83)*0.5","v":1.5},{"$f":"COUNTA(Y70:Y83)*0.5","v":1.5},{"$f":"COUNTA(Z70:Z83)*0.5","v":1.5},{"$f":"COUNTA(AA70:AA83)*0.5","v":2.5},{"$f":"COUNTA(AB70:AB83)*0.5","v":3.5},{"$f":"COUNTA(AC70:AC83)*0.5","v":3.5},{"$f":"COUNTA(AD70:AD83)*0.5","v":2.5},{"$f":"COUNTA(AE70:AE83)*0.5","v":2.5},{"$f":"COUNTA(AF70:AF83)*0.5","v":3.5},{"$f":"COUNTA(AG70:AG83)*0.5","v":3.5},{"$f":"COUNTA(AH70:AH83)*0.5","v":3.5},{"$f":"COUNTA(AI70:AI83)*0.5","v":3.5},{"$f":"COUNTA(AJ70:AJ83)*0.5","v":0},{"$f":"SUM(AK70:AK83)","v":62.5}]
[]
[null,"2016-08-20",null,null,"5h30>6h","6h>6h30","6h30>7h","7h>7h30","7h30>8h","8h>8h30","8h30>9h","9h>9h30","9h30>10h","10h>10h30","10h30>11h","11h>11h30","11h30>12h","12h>12h30","12h30>13h","13h>13h30","13h30>14h","14h>14h30","14h30>15h","15h>15h30","15h30>16h","16h>16h30","16h30>17h","17h>17h30","17h30>18h","18h>18h30","18h30>19h","19h>19h30","19h30>20h","20h>20h30","20h30>21h","21h>21h30","TOTAL"]
[null,"r = rayon","Directeur",null,null,null,null,null,null,null,null,null,null,null,null,null,null,null,null,null,null,null,null,null,null,null,null,null,null,null,null,null,null,null,null,null,{"$f":"COUNTA(E87:AJ87)*0.5","v":0}]
[null,"c = caisse","Hassan",null,null,null,"r","r","r","r","r","r","r","r","r","r","r","r","r",null,null,null,null,null,null,null,null,null,null,null,null,null,null,null,null,null,{"$f":"COUNTA(E88:AJ88)*0.5","v":6.5}]
[null,"Samedi","Rodrigue",null,null,null,null,"cp","cp","cp","cp","cp","cp","cp","cp","cp","cp","cp","cp","cp",null,null,null,null,null,null,null,null,null,null,null,null,null,null,null,null,{"$f":"COUNTA(E89:AJ89)*0.5","v":6.5}]
[null,null,"AKUVI SYLVIA","AKUVI",null,null,null,null,null,null,null,null,null,null,null,null,null,null,null,null,null,null,null,"c","c","c","c","c",null,"c","c","c","c","c","C",null,5.5]
[null,null,"MOMO","IDRISSA",null,null,null,null,null,null,null,null,null,null,null,null,null,null,null,null,null,null,null,"r","r","r","r","r","r","r","r","r","r","r","r",null,6]
[null,null,"DIARRA FATOUMATA","HANNE FATOUMATA",null,null,null,null,null,null,null,null,null,null,null,null,null,"cp","cp","cp","cp","cp","cp","cp","cp","cp",null,null,null,null,null,null,null,null,null,null,4.5,null,null,null,null,"10 min retard le 23/04 = doit prendre sa pause de 15h à 15h20"]
[]
[null,null,"SHAM LATA",null,null,null,null,"r","r","r","r","r","r","r","r","c","c","r","r","r",null,null,null,null,null,null,null,null,null,null,null,null,null,null,null,null,6.5]
[null,null,"Tacko","PHUONG LINH",null,null,null,null,null,null,null,null,null,null,null,null,null,null,null,null,null,null,null,null,null,null,null,null,null,"c","c","c","c","c","C",null,3]
[null,null,"AMINO FAISSOLATH","FASSOLATH",null,null,null,null,null,null,null,"cp","cp","cp","cp","cp","cp","cp","cp","cp","cp","cp","cp",null,null,null,null,null,null,null,null,null,null,null,null,null,6]
[null,null,"JEYAN",null,null,null,null,null,null,null,null,null,null,null,null,"r","r","r","r","r","r",null,null,null,null,null,null,null,null,"r","r","r","r","r","r",null,6]
[null,null,{"$f":"+C81","v":"Katia BOUSBA"},null,null,null,null,null,null,null,null,null,null,null,null,null,null,null,null,null,null,null,null,null,null,"c","c","c","c","c","c","c","c","c","C",null,5,null,"doit prendre sa pause de 18h à 18h20",null,null,null,null,"Le 30/04: Katia de 9h à 14h puis de 18h à 21h = 4h supp"]
[null,null,"Anta",null,null,null,null,null,null,null,null,"c","c","c","c","c","c","c","c","c","c","c","c",null,null,null,null,null,null,null,null,null,null,null,null,null,6]
[null,null,null,null,null,null,null,"r","r","r","r","r","r","r","r","r","r","r","r",null,null,null,null,null,null,null,null,null,null,null,null,null,null,null,null,null,6]
[null,null,"TOTAL",null,{"$f":"COUNTA(E87:E100)*0.5","v":0},{"$f":"COUNTA(F87:F100)*0.5","v":0},{"$f":"COUNTA(G87:G100)*0.5","v":0.5},{"$f":"COUNTA(H87:H100)*0.5","v":2},{"$f":"COUNTA(I87:I100)*0.5","v":2},{"$f":"COUNTA(J87:J100)*0.5","v":2},{"$f":"COUNTA(K87:K100)*0.5","v":2},{"$f":"COUNTA(L87:L100)*0.5","v":3},{"$f":"COUNTA(M87:M100)*0.5","v":3},{"$f":"COUNTA(N87:N100)*0.5","v":3},{"$f":"COUNTA(O87:O100)*0.5","v":3},{"$f":"COUNTA(P87:P100)*0.5","v":3.5},{"$f":"COUNTA(Q87:Q100)*0.5","v":3.5},{"$f":"COUNTA(R87:R100)*0.5","v":4},{"$f":"COUNTA(S87:S100)*0.5","v":4},{"$f":"COUNTA(T87:T100)*0.5","v":3},{"$f":"COUNTA(U87:U100)*0.5","v":2},{"$f":"COUNTA(V87:V100)*0.5","v":1.5},{"$f":"COUNTA(W87:W100)*0.5","v":1.5},{"$f":"COUNTA(X87:X100)*0.5","v":1.5},{"$f":"COUNTA(Y87:Y100)*0.5","v":1.5},{"$f":"COUNTA(Z87:Z100)*0.5","v":2},{"$f":"COUNTA(AA87:AA100)*0.5","v":1.5},{"$f":"COUNTA(AB87:AB100)*0.5","v":1.5},{"$f":"COUNTA(AC87:AC100)*0.5","v":1},{"$f":"COUNTA(AD87:AD100)*0.5","v":2.5},{"$f":"COUNTA(AE87:AE100)*0.5","v":2.5},{"$f":"COUNTA(AF87:AF100)*0.5","v":2.5},{"$f":"COUNTA(AG87:AG100)*0.5","v":2.5},{"$f":"COUNTA(AH87:AH100)*0.5","v":2.5},{"$f":"COUNTA(AI87:AI100)*0.5","v":2.5},{"$f":"COUNTA(AJ87:AJ100)*0.5","v":0},{"$f":"SUM(AK87:AK100)","v":67.5}]
[]
[null,"2016-08-21",null,null,"5h30>6h","6h>6h30","6h30>7h","7h>7h30","7h30>8h","8h>8h30","8h30>9h","9h>9h30","9h30>10h","10h>10h30","10h30>11h","11h>11h30","11h30>12h","12h>12h30","12h30>13h","13h>13h30","13h30>14h","14h>14h30","14h30>15h","15h>15h30","15h30>16h","16h>16h30","16h30>17h","17h>17h30","17h30>18h","18h>18h30","18h30>19h","19h>19h30","19h30>20h","20h>20h30","20h30>21h","21h>21h30","TOTAL"]
[null,"r = rayon","Directeur",null,"c",null,null,null,null,null,null,null,null,null,null,null,null,null,null,null,null,null,null,null,null,null,null,null,null,null,null,null,null,null,null,null,{"$f":"COUNTA(E104:AJ104)*0.5","v":0.5}]
[null,"c = caisse","Hassan",null,null,null,null,null,null,null,null,null,null,null,null,null,null,null,null,null,null,null,null,null,null,null,null,null,null,null,null,null,null,null,null,null,{"$f":"COUNTA(E105:AJ105)*0.5","v":0}]
[null,"Dimanche","Rodrigue",null,null,null,null,"cp","cp","cp","cp","cp","cp","cp","cp","cp","cp","cp","cp","cp",null,null,null,null,null,null,null,null,null,null,null,null,null,null,null,null,{"$f":"COUNTA(E106:AJ106)*0.5","v":6.5}]
[null,null,"AKUVI SYLVIA","AKUVI",null,null,null,null,null,null,null,null,null,null,null,null,null,null,null,null,null,null,null,null,null,null,null,null,null,null,null,null,null,null,null,null,0]
[null,null,"MOMO","IDRISSA",null,null,null,null,null,null,null,null,null,null,null,null,null,null,null,null,null,null,null,null,null,null,null,null,null,null,null,null,null,null,null,null,0]
[null,null,"DIARRA FATOUMATA","HANNE FATOUMATA",null,null,null,null,null,null,null,null,null,null,null,null,null,null,null,null,null,null,null,null,null,null,null,null,null,null,null,null,null,null,null,null,0]
[null,null,"SHAM LATA",null,null,null,null,null,null,null,null,null,null,null,null,null,null,null,null,null,null,null,null,null,null,null,null,null,null,null,null,null,null,null,null,null,0]
[null,null,"Tacko","PHUONG LINH",null,null,null,null,null,null,null,null,null,"c","c","c","c","c","c","C","C",null,null,null,null,null,null,null,null,null,null,null,null,null,null,null,4,null,"plus 1h tous les dimanche à la demande de Michel & Rodrigue pour contrer lidl",null,null,null,null,null,"Doit prendre sa pause de 10h30 à 10h45"]
[null,null,"AMINO FASSOLATH","FASSOLATH",null,null,null,null,null,null,null,null,null,null,null,null,null,null,null,null,null,null,null,null,null,null,null,null,null,null,null,null,null,null,null,null,0]
[null,null,"JEYAN",null,null,null,null,null,null,null,null,null,null,null,null,null,null,null,null,null,null,null,null,null,null,null,null,null,null,null,null,null,null,null,null,null,0]
[null,null,{"$f":"+C98","v":"Katia BOUSBA"},null,null,null,null,null,null,null,"C","C","C","C","C","C","C","C","C","C","C",null,null,null,null,null,null,null,null,null,null,null,null,null,null,null,5.5,null,null,null,null,null,null,null,"Doit prendre sa pause de 10h45 à 11h"]
[null,null,"Anta",null,null,null,null,null,null,null,null,null,null,null,null,null,null,null,null,null,null,null,null,null,null,null,null,null,null,null,null,null,null,null,null,null,0]
[null,null,null,null,null,null,null,null,null,null,null,null,null,null,null,null,null,null,null,null,null,null,null,null,null,null,null,null,null,null,null,null,null,null,null,null,0]
[null,null,"TOTAL",null,{"$f":"COUNTA(E104:E116)*0.5","v":0.5},{"$f":"COUNTA(F104:F116)*0.5","v":0},{"$f":"COUNTA(G104:G116)*0.5","v":0},{"$f":"COUNTA(H104:H116)*0.5","v":0.5},{"$f":"COUNTA(I104:I116)*0.5","v":0.5},{"$f":"COUNTA(J104:J116)*0.5","v":0.5},{"$f":"COUNTA(K104:K116)*0.5","v":1},{"$f":"COUNTA(L104:L116)*0.5","v":1},{"$f":"COUNTA(M104:M116)*0.5","v":1},{"$f":"COUNTA(N104:N116)*0.5","v":1.5},{"$f":"COUNTA(O104:O116)*0.5","v":1.5},{"$f":"COUNTA(P104:P116)*0.5","v":1.5},{"$f":"COUNTA(Q104:Q116)*0.5","v":1.5},{"$f":"COUNTA(R104:R116)*0.5","v":1.5},{"$f":"COUNTA(S104:S116)*0.5","v":1.5},{"$f":"COUNTA(T104:T116)*0.5","v":1.5},{"$f":"COUNTA(U104:U116)*0.5","v":1},{"$f":"COUNTA(V104:V116)*0.5","v":0},{"$f":"COUNTA(W104:W116)*0.5","v":0},{"$f":"COUNTA(X104:X116)*0.5","v":0},{"$f":"COUNTA(Y104:Y116)*0.5","v":0},{"$f":"COUNTA(Z104:Z116)*0.5","v":0},{"$f":"COUNTA(AA104:AA116)*0.5","v":0},{"$f":"COUNTA(AB104:AB116)*0.5","v":0},{"$f":"COUNTA(AC104:AC116)*0.5","v":0},{"$f":"COUNTA(AD104:AD116)*0.5","v":0},{"$f":"COUNTA(AE104:AE116)*0.5","v":0},{"$f":"COUNTA(AF104:AF116)*0.5","v":0},{"$f":"COUNTA(AG104:AG116)*0.5","v":0},{"$f":"COUNTA(AH104:AH116)*0.5","v":0},{"$f":"COUNTA(AI104:AI116)*0.5","v":0},{"$f":"COUNTA(AJ104:AJ116)*0.5","v":0},{"$f":"SUM(AK104:AK116)","v":16.5}]
[]
[null,"Signatures OBLIGATOIRES","Hassan OUAMOUH",null,null,null,null,null,null,"Rodrigue MOREIRA",null,null,null,null,null,"AKUVI SYLVIA",null,null,null,null,"MOMO",null,null,null,null,null,"DIARRA HANNE FATOUMATA",null,null,null,null,"SHAM LATA"]
[]
[null,null,{"$f":"+C111","v":"Tacko"},null,null,null,null,null,null,{"$f":"+C112","v":"AMINO FASSOLATH"}]
[]
[]
[null,"Planning",null,null,"5h30>6h","6h>6h30","6h30>7h","7h>7h30","7h30>8h","8h>8h30","8h30>9h","9h>9h30","9h30>10h","10h>10h30","10h30>11h","11h>11h30","11h30>12h","12h>12h30","12h30>13h","13h>13h30","13h30>14h","14h>14h30","14h30>15h","15h>15h30","15h30>16h","16h>16h30","16h30>17h","17h>17h30","17h30>18h","18h>18h30","18h30>19h","19h>19h30","19h30>20h","20h>20h30","20h30>21h","21h>21h30","SOUS-TOTAL",null,"TOTAL","Contrat","Différence"]
[null,"TOTAL Semaine","Directeur","R",{"$f":"IF(E3=\"r\",1,0)+IF(E19=\"r\",1,0)+IF(E36=\"r\",1,0)+IF(E53=\"r\",1,0)+IF(E70=\"r\",1,0)+IF(E87=\"r\",1,0)+IF(E104=\"r\",1,0)/2","v":0},{"$f":"IF(F3=\"r\",1,0)+IF(F19=\"r\",1,0)+IF(F36=\"r\",1,0)+IF(F53=\"r\",1,0)+IF(F70=\"r\",1,0)+IF(F87=\"r\",1,0)+IF(F104=\"r\",1,0)/2","v":0},{"$f":"(IF(G3=\"r\",1,0)+IF(G19=\"r\",1,0)+IF(G36=\"r\",1,0)+IF(G53=\"r\",1,0)+IF(G70=\"r\",1,0)+IF(G87=\"r\",1,0)+IF(G104=\"r\",1,0))/2","v":0},0,0,0,0,0,0,0,0,0,0,0,0,0,0,0,0,0,0,0,0,0,0,0,0,0,0,0,0,0,{"$f":"+SUM(G125:AI125)","v":0},"R",{"$f":"AK125+AK126","v":0},51.5,{"$f":"AM125-AN125","v":-51.5},"Directeur"]
[null,null,null,"C",{"$f":"IF(E3=\"c\",1,0)+IF(E19=\"c\",1,0)+IF(E36=\"c\",1,0)+IF(E53=\"c\",1,0)+IF(E70=\"c\",1,0)+IF(E87=\"c\",1,0)+IF(E104=\"c\",1,0)/2","v":0.5},{"$f":"IF(F3=\"c\",1,0)+IF(F19=\"c\",1,0)+IF(F36=\"c\",1,0)+IF(F53=\"c\",1,0)+IF(F70=\"c\",1,0)+IF(F87=\"c\",1,0)+IF(F104=\"c\",1,0)/2","v":0},{"$f":"(IF(G3=\"c\",1,0)+IF(G19=\"c\",1,0)+IF(G36=\"c\",1,0)+IF(G53=\"c\",1,0)+IF(G70=\"c\",1,0)+IF(G87=\"c\",1,0)+IF(G104=\"c\",1,0))/2","v":0},0,0,0,0,0,0,0,0,0,0,0,0,0,0,0,0,0,0,0,0,0,0,0,0,0,0,0,0,0,0,"C"]
[null,null,"Hassan","R",{"$f":"IF(E4=\"r\",1,0)+IF(E20=\"r\",1,0)+IF(E37=\"r\",1,0)+IF(E54=\"r\",1,0)+IF(E71=\"r\",1,0)+IF(E88=\"r\",1,0)+IF(E105=\"r\",1,0)/2","v":0},{"$f":"IF(F4=\"r\",1,0)+IF(F20=\"r\",1,0)+IF(F37=\"r\",1,0)+IF(F54=\"r\",1,0)+IF(F71=\"r\",1,0)+IF(F88=\"r\",1,0)+IF(F105=\"r\",1,0)/2","v":0},{"$f":"(IF(G4=\"r\",1,0)+IF(G20=\"r\",1,0)+IF(G37=\"r\",1,0)+IF(G54=\"r\",1,0)+IF(G71=\"r\",1,0)+IF(G88=\"r\",1,0)+IF(G105=\"r\",1,0))/2","v":3},3,3,3,3,3,3,3,3,3,3,3,3,0,0,0,0,0,0,0,0,0,0,0,0,0,0,0,0,0,39,"R",{"$f":"AK127+AK128","v":39},39,{"$f":"AM127-AN127","v":0},"Hassan"]
[null,null,"Hassan","C",{"$f":"IF(E4=\"c\",1,0)+IF(E20=\"c\",1,0)+IF(E37=\"c\",1,0)+IF(E54=\"c\",1,0)+IF(E71=\"c\",1,0)+IF(E88=\"c\",1,0)+IF(E105=\"c\",1,0)/2","v":0},{"$f":"IF(F4=\"c\",1,0)+IF(F20=\"c\",1,0)+IF(F37=\"c\",1,0)+IF(F54=\"c\",1,0)+IF(F71=\"c\",1,0)+IF(F88=\"c\",1,0)+IF(F105=\"c\",1,0)/2","v":0},{"$f":"(IF(G4=\"c\",1,0)+IF(G20=\"c\",1,0)+IF(G37=\"c\",1,0)+IF(G54=\"c\",1,0)+IF(G71=\"c\",1,0)+IF(G88=\"c\",1,0)+IF(G105=\"c\",1,0))/2","v":0},0,0,0,0,0,0,0,0,0,0,0,0,0,0,0,0,0,0,0,0,0,0,0,0,0,0,0,0,0,0,"C",null,null,null,"Hassan"]
[null,null,"Rodrigue","R",{"$f":"IF(E5=\"r\",1,0)+IF(E21=\"r\",1,0)+IF(E38=\"r\",1,0)+IF(E55=\"r\",1,0)+IF(E72=\"r\",1,0)+IF(E89=\"r\",1,0)+IF(E106=\"r\",1,0)/2","v":0},{"$f":"IF(F5=\"r\",1,0)+IF(F21=\"r\",1,0)+IF(F38=\"r\",1,0)+IF(F55=\"r\",1,0)+IF(F72=\"r\",1,0)+IF(F89=\"r\",1,0)+IF(F106=\"r\",1,0)/2","v":0},{"$f":"(IF(G5=\"r\",1,0)+IF(G21=\"r\",1,0)+IF(G38=\"r\",1,0)+IF(G55=\"r\",1,0)+IF(G72=\"r\",1,0)+IF(G89=\"r\",1,0)+IF(G106=\"r\",1,0))/2","v":1},1,1,1,1,1,1,1,1,1,1,1,1,0,0,0,0,0,0,0,0,0,0,0,0,0,0,0,0,0,13,"R",{"$f":"AK129+AK130","v":13},39,{"$f":"AM129-AN129","v":-26},"Rodrigue"]
[null,null,"Rodrigue","C",{"$f":"IF(E5=\"c\",1,0)+IF(E21=\"c\",1,0)+IF(E38=\"c\",1,0)+IF(E55=\"c\",1,0)+IF(E72=\"c\",1,0)+IF(E89=\"c\",1,0)+IF(E106=\"c\",1,0)/2","v":0},{"$f":"IF(F5=\"c\",1,0)+IF(F21=\"c\",1,0)+IF(F38=\"c\",1,0)+IF(F55=\"c\",1,0)+IF(F72=\"c\",1,0)+IF(F89=\"c\",1,0)+IF(F106=\"c\",1,0)/2","v":0},{"$f":"(IF(G5=\"c\",1,0)+IF(G21=\"c\",1,0)+IF(G38=\"c\",1,0)+IF(G55=\"c\",1,0)+IF(G72=\"c\",1,0)+IF(G89=\"c\",1,0)+IF(G106=\"c\",1,0))/2","v":0},0,0,0,0,0,0,0,0,0,0,0,0,0,0,0,0,0,0,0,0,0,0,0,0,0,0,0,0,0,0,"C",null,null,null,"Rodrigue"]
[null,null,{"$f":"+C107","v":"AKUVI SYLVIA"},"R",{"$f":"IF(E6=\"r\",1,0)+IF(E22=\"r\",1,0)+IF(E39=\"r\",1,0)+IF(E56=\"r\",1,0)+IF(E73=\"r\",1,0)+IF(E90=\"r\",1,0)+IF(E107=\"r\",1,0)/2","v":0},{"$f":"IF(F6=\"r\",1,0)+IF(F22=\"r\",1,0)+IF(F39=\"r\",1,0)+IF(F56=\"r\",1,0)+IF(F73=\"r\",1,0)+IF(F90=\"r\",1,0)+IF(F107=\"r\",1,0)/2","v":0},{"$f":"(IF(G6=\"r\",1,0)+IF(G22=\"r\",1,0)+IF(G39=\"r\",1,0)+IF(G56=\"r\",1,0)+IF(G73=\"r\",1,0)+IF(G90=\"r\",1,0)+IF(G107=\"r\",1,0))/2","v":0},0,0,0,0,0,0,0,0,0,0,0,0,0,0,0,0,0,0,0,0,0,0,0,0,0,0,0,0,0,0,"R",{"$f":"AK131+AK132","v":29.5},30,{"$f":"AM131-AN131","v":-0.5},{"$f":"+C131","v":"AKUVI SYLVIA"}]
[null,null,"ELS 1","C",{"$f":"IF(E6=\"c\",1,0)+IF(E22=\"c\",1,0)+IF(E39=\"c\",1,0)+IF(E56=\"c\",1,0)+IF(E73=\"c\",1,0)+IF(E90=\"c\",1,0)+IF(E107=\"c\",1,0)","v":0},{"$f":"IF(F6=\"c\",1,0)+IF(F22=\"c\",1,0)+IF(F39=\"c\",1,0)+IF(F56=\"c\",1,0)+IF(F73=\"c\",1,0)+IF(F90=\"c\",1,0)+IF(F107=\"c\",1,0)","v":0},{"$f":"(IF(G6=\"c\",1,0)+IF(G22=\"c\",1,0)+IF(G39=\"c\",1,0)+IF(G56=\"c\",1,0)+IF(G73=\"c\",1,0)+IF(G90=\"c\",1,0)+IF(G107=\"c\",1,0))/2","v":0},0,0,0,0,1,1,1,1,1,0,1.5,1.5,1.5,1.5,1.5,1.5,1,1.5,1.5,1.5,1.5,0,1,1.5,1.5,1.5,1.5,1.5,0,29.5,"C",null,null,null,"ELS 1"]
[null,null,{"$f":"+C108","v":"MOMO"},"R",{"$f":"IF(E7=\"r\",1,0)+IF(E23=\"r\",1,0)+IF(E40=\"r\",1,0)+IF(E57=\"r\",1,0)+IF(E74=\"r\",1,0)+IF(E91=\"r\",1,0)+IF(E108=\"r\",1,0)/2","v":0},{"$f":"IF(F7=\"r\",1,0)+IF(F23=\"r\",1,0)+IF(F40=\"r\",1,0)+IF(F57=\"r\",1,0)+IF(F74=\"r\",1,0)+IF(F91=\"r\",1,0)+IF(F108=\"r\",1,0)/2","v":0},{"$f":"(IF(G7=\"r\",1,0)+IF(G23=\"r\",1,0)+IF(G40=\"r\",1,0)+IF(G57=\"r\",1,0)+IF(G74=\"r\",1,0)+IF(G91=\"r\",1,0)+IF(G108=\"r\",1,0))/2","v":0},0,0,0,0,0,0,0,0,0,0,0,0,0,0,1,1,3,3,3,3,3,3,3,3,3,3,3,3,0,38,"R",{"$f":"AK133+AK134","v":38},35,{"$f":"AM133-AN133","v":3},{"$f":"+C133","v":"MOMO"}]
[null,null,"ELS 2","C",{"$f":"IF(E7=\"c\",1,0)+IF(E23=\"c\",1,0)+IF(E40=\"c\",1,0)+IF(E57=\"c\",1,0)+IF(E74=\"c\",1,0)+IF(E91=\"c\",1,0)+IF(E108=\"c\",1,0)/2","v":0},{"$f":"IF(F7=\"c\",1,0)+IF(F23=\"c\",1,0)+IF(F40=\"c\",1,0)+IF(F57=\"c\",1,0)+IF(F74=\"c\",1,0)+IF(F91=\"c\",1,0)+IF(F108=\"c\",1,0)/2","v":0},{"$f":"(IF(G7=\"c\",1,0)+IF(G23=\"c\",1,0)+IF(G40=\"c\",1,0)+IF(G57=\"c\",1,0)+IF(G74=\"c\",1,0)+IF(G91=\"c\",1,0)+IF(G108=\"c\",1,0))/2","v":0},0,0,0,0,0,0,0,0,0,0,0,0,0,0,0,0,0,0,0,0,0,0,0,0,0,0,0,0,0,0,"C",null,null,null,"ELS 2"]
[null,null,{"$f":"+C109","v":"DIARRA FATOUMATA"},"R",{"$f":"IF(E8=\"r\",1,0)+IF(E24=\"r\",1,0)+IF(E41=\"r\",1,0)+IF(E58=\"r\",1,0)+IF(E75=\"r\",1,0)+IF(E92=\"r\",1,0)+IF(E109=\"r\",1,0)/2","v":0},{"$f":"IF(F8=\"r\",1,0)+IF(F24=\"r\",1,0)+IF(F41=\"r\",1,0)+IF(F58=\"r\",1,0)+IF(F75=\"r\",1,0)+IF(F92=\"r\",1,0)+IF(F109=\"r\",1,0)/2","v":0},{"$f":"(IF(G8=\"r\",1,0)+IF(G24=\"r\",1,0)+IF(G41=\"r\",1,0)+IF(G58=\"r\",1,0)+IF(G75=\"r\",1,0)+IF(G92=\"r\",1,0)+IF(G109=\"r\",1,0))/2","v":0},0,0,0,0,0,0,0,0,0,0,0,0,0,0,0,0,0,0,0,0,0,0,0,0,0,0,0,0,0,0,"R",{"$f":"AK135+AK136","v":0},35,{"$f":"AM135-AN135","v":-35},{"$f":"+C135","v":"DIARRA FATOUMATA"}]
[null,null,"ELS 3","C",{"$f":"IF(E8=\"c\",1,0)+IF(E24=\"c\",1,0)+IF(E41=\"c\",1,0)+IF(E58=\"c\",1,0)+IF(E75=\"c\",1,0)+IF(E92=\"c\",1,0)+IF(E109=\"c\",1,0)/2","v":0},{"$f":"IF(F8=\"c\",1,0)+IF(F24=\"c\",1,0)+IF(F41=\"c\",1,0)+IF(F58=\"c\",1,0)+IF(F75=\"c\",1,0)+IF(F92=\"c\",1,0)+IF(F109=\"c\",1,0)/2","v":0},{"$f":"(IF(G8=\"c\",1,0)+IF(G24=\"c\",1,0)+IF(G41=\"c\",1,0)+IF(G58=\"c\",1,0)+IF(G75=\"c\",1,0)+IF(G92=\"c\",1,0)+IF(G109=\"c\",1,0))/2","v":0},0,0,0,0,0,0,0,0,0,0,0,0,0,0,0,0,0,0,0,0,0,0,0,0,0,0,0,0,0,0,"C",null,null,null,"ELS 3"]
[null,null,{"$f":"+C110","v":"SHAM LATA"},"R",{"$f":"IF(E9=\"r\",1,0)+IF(E26=\"r\",1,0)+IF(E43=\"r\",1,0)+IF(E60=\"r\",1,0)+IF(E77=\"r\",1,0)+IF(E94=\"r\",1,0)+IF(E110=\"r\",1,0)/2","v":0},{"$f":"IF(F9=\"r\",1,0)+IF(F26=\"r\",1,0)+IF(F43=\"r\",1,0)+IF(F60=\"r\",1,0)+IF(F77=\"r\",1,0)+IF(F94=\"r\",1,0)+IF(F110=\"r\",1,0)/2","v":0},{"$f":"(IF(G9=\"r\",1,0)+IF(G26=\"r\",1,0)+IF(G43=\"r\",1,0)+IF(G60=\"r\",1,0)+IF(G77=\"r\",1,0)+IF(G94=\"r\",1,0)+IF(G110=\"r\",1,0))/2","v":0},2.5,2.5,2.5,1,2.5,2.5,2.5,2.5,1.5,1.5,2.5,2.5,2.5,0,0,0,0,0,0,0,0,0,0,0,0,0,0,0,0,29,"R",{"$f":"AK137+AK138","v":32.5},39,{"$f":"AM137-AN137","v":-6.5},{"$f":"+C137","v":"SHAM LATA"}]
[null,null,"ELS 4","C",{"$f":"IF(E9=\"c\",1,0)+IF(E26=\"c\",1,0)+IF(E43=\"c\",1,0)+IF(E60=\"c\",1,0)+IF(E77=\"c\",1,0)+IF(E94=\"c\",1,0)+IF(E110=\"c\",1,0)/2","v":0},{"$f":"IF(F9=\"c\",1,0)+IF(F26=\"c\",1,0)+IF(F43=\"c\",1,0)+IF(F60=\"c\",1,0)+IF(F77=\"c\",1,0)+IF(F94=\"c\",1,0)+IF(F110=\"c\",1,0)/2","v":0},{"$f":"(IF(G9=\"c\",1,0)+IF(G26=\"c\",1,0)+IF(G43=\"c\",1,0)+IF(G60=\"c\",1,0)+IF(G77=\"c\",1,0)+IF(G94=\"c\",1,0)+IF(G110=\"c\",1,0))/2","v":0},0,0,0,1.5,0,0,0,0,1,1,0,0,0,0,0,0,0,0,0,0,0,0,0,0,0,0,0,0,0,3.5,"C",null,null,null,"ELS 4"]
[null,null,{"$f":"+C111","v":"Tacko"},"R",{"$f":"IF(E10=\"r\",1,0)+IF(E27=\"r\",1,0)+IF(E44=\"r\",1,0)+IF(E61=\"r\",1,0)+IF(E78=\"r\",1,0)+IF(E95=\"r\",1,0)+IF(E111=\"r\",1,0)/2","v":0},{"$f":"IF(F10=\"r\",1,0)+IF(F27=\"r\",1,0)+IF(F44=\"r\",1,0)+IF(F61=\"r\",1,0)+IF(F78=\"r\",1,0)+IF(F95=\"r\",1,0)+IF(F111=\"r\",1,0)/2","v":0},{"$f":"(IF(G10=\"r\",1,0)+IF(G27=\"r\",1,0)+IF(G44=\"r\",1,0)+IF(G61=\"r\",1,0)+IF(G78=\"r\",1,0)+IF(G95=\"r\",1,0)+IF(G111=\"r\",1,0))/2","v":0},0,0,0,0,0,0,0,0,0,0,0,0,0,0,0,0,0,0,0,0,{"$f":"(IF(AB10=\"r\",1,0)+IF(#REF!=\"r\",1,0)+IF(AB44=\"r\",1,0)+IF(AB61=\"r\",1,0)+IF(AB78=\"r\",1,0)+IF(AB95=\"r\",1,0)+IF(AB111=\"r\",1,0))/2","v":{"$error":"#REF!"}},{"$f":"(IF(AC10=\"r\",1,0)+IF(#REF!=\"r\",1,0)+IF(AC44=\"r\",1,0)+IF(AC61=\"r\",1,0)+IF(AC78=\"r\",1,0)+IF(AC95=\"r\",1,0)+IF(AC111=\"r\",1,0))/2","v":{"$error":"#REF!"}},{"$f":"(IF(#REF!=\"r\",1,0)+IF(#REF!=\"r\",1,0)+IF(AD44=\"r\",1,0)+IF(AD61=\"r\",1,0)+IF(AD78=\"r\",1,0)+IF(AD95=\"r\",1,0)+IF(AD111=\"r\",1,0))/2","v":{"$error":"#REF!"}},{"$f":"(IF(#REF!=\"r\",1,0)+IF(#REF!=\"r\",1,0)+IF(AE44=\"r\",1,0)+IF(AE61=\"r\",1,0)+IF(AE78=\"r\",1,0)+IF(AE95=\"r\",1,0)+IF(AE111=\"r\",1,0))/2","v":{"$error":"#REF!"}},{"$f":"(IF(#REF!=\"r\",1,0)+IF(#REF!=\"r\",1,0)+IF(AF44=\"r\",1,0)+IF(AF61=\"r\",1,0)+IF(AF78=\"r\",1,0)+IF(AF95=\"r\",1,0)+IF(AF111=\"r\",1,0))/2","v":{"$error":"#REF!"}},{"$f":"(IF(#REF!=\"r\",1,0)+IF(#REF!=\"r\",1,0)+IF(AG44=\"r\",1,0)+IF(AG61=\"r\",1,0)+IF(AG78=\"r\",1,0)+IF(AG95=\"r\",1,0)+IF(AG111=\"r\",1,0))/2","v":{"$error":"#REF!"}},{"$f":"(IF(#REF!=\"r\",1,0)+IF(#REF!=\"r\",1,0)+IF(AH44=\"r\",1,0)+IF(AH61=\"r\",1,0)+IF(AH78=\"r\",1,0)+IF(AH95=\"r\",1,0)+IF(AH111=\"r\",1,0))/2","v":{"$error":"#REF!"}},{"$f":"(IF(#REF!=\"r\",1,0)+IF(#REF!=\"r\",1,0)+IF(AI44=\"r\",1,0)+IF(AI61=\"r\",1,0)+IF(AI78=\"r\",1,0)+IF(AI95=\"r\",1,0)+IF(AI111=\"r\",1,0))/2","v":{"$error":"#REF!"}},{"$f":"(IF(#REF!=\"r\",1,0)+IF(AJ27=\"r\",1,0)+IF(AJ44=\"r\",1,0)+IF(AJ61=\"r\",1,0)+IF(AJ78=\"r\",1,0)+IF(AJ95=\"r\",1,0)+IF(AJ111=\"r\",1,0))/2","v":{"$error":"#REF!"}},{"$error":"#REF!"},"R",{"$f":"AK139+AK140","v":{"$error":"#REF!"}},15,{"$f":"AM139-AN139","v":{"$error":"#REF!"}},{"$f":"+C139","v":"Tacko"}]
[null,null,"ELS 5","C",{"$f":"IF(E10=\"C\",1,0)+IF(E27=\"C\",1,0)+IF(E44=\"C\",1,0)+IF(E61=\"C\",1,0)+IF(E78=\"C\",1,0)+IF(E95=\"C\",1,0)+IF(E111=\"C\",1,0)/2","v":0},{"$f":"IF(F10=\"C\",1,0)+IF(F27=\"C\",1,0)+IF(F44=\"C\",1,0)+IF(F61=\"C\",1,0)+IF(F78=\"C\",1,0)+IF(F95=\"C\",1,0)+IF(F111=\"C\",1,0)/2","v":0},{"$f":"(IF(G10=\"C\",1,0)+IF(G27=\"C\",1,0)+IF(G44=\"C\",1,0)+IF(G61=\"C\",1,0)+IF(G78=\"C\",1,0)+IF(G95=\"C\",1,0)+IF(G111=\"C\",1,0))/2","v":0},0,0,0,0.5,1,1,1.5,1.5,1.5,1.5,1,1,1,1,0.5,0,0,0,0,0,{"$f":"(IF(AB10=\"C\",1,0)+IF(#REF!=\"C\",1,0)+IF(AB44=\"C\",1,0)+IF(AB61=\"C\",1,0)+IF(AB78=\"C\",1,0)+IF(AB95=\"C\",1,0)+IF(AB111=\"C\",1,0))/2","v":{"$error":"#REF!"}},{"$f":"(IF(AC10=\"C\",1,0)+IF(#REF!=\"C\",1,0)+IF(AC44=\"C\",1,0)+IF(AC61=\"C\",1,0)+IF(AC78=\"C\",1,0)+IF(AC95=\"C\",1,0)+IF(AC111=\"C\",1,0))/2","v":{"$error":"#REF!"}},{"$f":"(IF(#REF!=\"C\",1,0)+IF(#REF!=\"C\",1,0)+IF(AD44=\"C\",1,0)+IF(AD61=\"C\",1,0)+IF(AD78=\"C\",1,0)+IF(AD95=\"C\",1,0)+IF(AD111=\"C\",1,0))/2","v":{"$error":"#REF!"}},{"$f":"(IF(#REF!=\"C\",1,0)+IF(#REF!=\"C\",1,0)+IF(AE44=\"C\",1,0)+IF(AE61=\"C\",1,0)+IF(AE78=\"C\",1,0)+IF(AE95=\"C\",1,0)+IF(AE111=\"C\",1,0))/2","v":{"$error":"#REF!"}},{"$f":"(IF(#REF!=\"C\",1,0)+IF(#REF!=\"C\",1,0)+IF(AF44=\"C\",1,0)+IF(AF61=\"C\",1,0)+IF(AF78=\"C\",1,0)+IF(AF95=\"C\",1,0)+IF(AF111=\"C\",1,0))/2","v":{"$error":"#REF!"}},{"$f":"(IF(#REF!=\"C\",1,0)+IF(#REF!=\"C\",1,0)+IF(AG44=\"C\",1,0)+IF(AG61=\"C\",1,0)+IF(AG78=\"C\",1,0)+IF(AG95=\"C\",1,0)+IF(AG111=\"C\",1,0))/2","v":{"$error":"#REF!"}},{"$f":"(IF(#REF!=\"C\",1,0)+IF(#REF!=\"C\",1,0)+IF(AH44=\"C\",1,0)+IF(AH61=\"C\",1,0)+IF(AH78=\"C\",1,0)+IF(AH95=\"C\",1,0)+IF(AH111=\"C\",1,0))/2","v":{"$error":"#REF!"}},{"$f":"(IF(#REF!=\"C\",1,0)+IF(#REF!=\"C\",1,0)+IF(AI44=\"C\",1,0)+IF(AI61=\"C\",1,0)+IF(AI78=\"C\",1,0)+IF(AI95=\"C\",1,0)+IF(AI111=\"C\",1,0))/2","v":{"$error":"#REF!"}},{"$f":"(IF(#REF!=\"C\",1,0)+IF(AJ27=\"C\",1,0)+IF(AJ44=\"C\",1,0)+IF(AJ61=\"C\",1,0)+IF(AJ78=\"C\",1,0)+IF(AJ95=\"C\",1,0)+IF(AJ111=\"C\",1,0))/2","v":{"$error":"#REF!"}},{"$error":"#REF!"},"C",null,null,null,"ELS 5"]
[null,null,{"$f":"+C112","v":"AMINO FASSOLATH"},"R",{"$f":"IF(E11=\"r\",1,0)+IF(E28=\"r\",1,0)+IF(E45=\"r\",1,0)+IF(E62=\"r\",1,0)+IF(E79=\"r\",1,0)+IF(E96=\"r\",1,0)+IF(E112=\"r\",1,0)/2","v":0},{"$f":"IF(F11=\"r\",1,0)+IF(F28=\"r\",1,0)+IF(F45=\"r\",1,0)+IF(F62=\"r\",1,0)+IF(F79=\"r\",1,0)+IF(F96=\"r\",1,0)+IF(F112=\"r\",1,0)/2","v":0},{"$f":"(IF(G11=\"r\",1,0)+IF(G28=\"r\",1,0)+IF(G45=\"r\",1,0)+IF(G62=\"r\",1,0)+IF(G79=\"r\",1,0)+IF(G96=\"r\",1,0)+IF(G112=\"r\",1,0))/2","v":0},0,0,0,0,0,0,0,0,0,0,0,{"$f":"(IF(S11=\"r\",1,0)+IF(S28=\"r\",1,0)+IF(S45=\"r\",1,0)+IF(#REF!=\"r\",1,0)+IF(S79=\"r\",1,0)+IF(S96=\"r\",1,0)+IF(S112=\"r\",1,0))/2","v":{"$error":"#REF!"}},{"$f":"(IF(T11=\"r\",1,0)+IF(T28=\"r\",1,0)+IF(T45=\"r\",1,0)+IF(T62=\"r\",1,0)+IF(T79=\"r\",1,0)+IF(T96=\"r\",1,0)+IF(T112=\"r\",1,0))/2","v":0},{"$f":"(IF(U11=\"r\",1,0)+IF(U28=\"r\",1,0)+IF(U45=\"r\",1,0)+IF(U62=\"r\",1,0)+IF(U79=\"r\",1,0)+IF(U96=\"r\",1,0)+IF(U112=\"r\",1,0))/2","v":0},{"$f":"(IF(V11=\"r\",1,0)+IF(V28=\"r\",1,0)+IF(#REF!=\"r\",1,0)+IF(V62=\"r\",1,0)+IF(V79=\"r\",1,0)+IF(V96=\"r\",1,0)+IF(V112=\"r\",1,0))/2","v":{"$error":"#REF!"}},{"$f":"(IF(W11=\"r\",1,0)+IF(W28=\"r\",1,0)+IF(W45=\"r\",1,0)+IF(W62=\"r\",1,0)+IF(W79=\"r\",1,0)+IF(W96=\"r\",1,0)+IF(W112=\"r\",1,0))/2","v":0},{"$f":"(IF(X11=\"r\",1,0)+IF(X28=\"r\",1,0)+IF(V45=\"r\",1,0)+IF(S62=\"r\",1,0)+IF(X79=\"r\",1,0)+IF(X96=\"r\",1,0)+IF(X112=\"r\",1,0))/2","v":0},{"$f":"(IF(Y11=\"r\",1,0)+IF(Y28=\"r\",1,0)+IF(Y45=\"r\",1,0)+IF(Y62=\"r\",1,0)+IF(Y79=\"r\",1,0)+IF(Y96=\"r\",1,0)+IF(Y112=\"r\",1,0))/2","v":0},0,0,0,0,0,0,0,0,0,0,0,{"$error":"#REF!"},"R",{"$f":"AK141+AK142","v":{"$error":"#REF!"}},30,{"$f":"AM141-AN141","v":{"$error":"#REF!"}},{"$f":"+C141","v":"AMINO FASSOLATH"}]
[null,null,"ELS 6","C",{"$f":"IF(E11=\"c\",1,0)+IF(E28=\"c\",1,0)+IF(E45=\"c\",1,0)+IF(E62=\"c\",1,0)+IF(E79=\"c\",1,0)+IF(E96=\"c\",1,0)+IF(E112=\"c\",1,0)/2","v":0},{"$f":"IF(F11=\"c\",1,0)+IF(F28=\"c\",1,0)+IF(F45=\"c\",1,0)+IF(F62=\"c\",1,0)+IF(F79=\"c\",1,0)+IF(F96=\"c\",1,0)+IF(F112=\"c\",1,0)/2","v":0},{"$f":"(IF(G11=\"c\",1,0)+IF(G28=\"c\",1,0)+IF(G45=\"c\",1,0)+IF(G62=\"c\",1,0)+IF(G79=\"c\",1,0)+IF(G96=\"c\",1,0)+IF(G112=\"c\",1,0))/2","v":0},0,0,0,0,0,0,0,0,0,0,0,{"$f":"(IF(S11=\"c\",1,0)+IF(S28=\"c\",1,0)+IF(S45=\"c\",1,0)+IF(#REF!=\"c\",1,0)+IF(S79=\"c\",1,0)+IF(S96=\"c\",1,0)+IF(S112=\"c\",1,0))/2","v":{"$error":"#REF!"}},{"$f":"(IF(T11=\"c\",1,0)+IF(T28=\"c\",1,0)+IF(T45=\"c\",1,0)+IF(T62=\"c\",1,0)+IF(T79=\"c\",1,0)+IF(T96=\"c\",1,0)+IF(T112=\"c\",1,0))/2","v":0},{"$f":"(IF(U11=\"c\",1,0)+IF(U28=\"c\",1,0)+IF(U45=\"c\",1,0)+IF(U62=\"c\",1,0)+IF(U79=\"c\",1,0)+IF(U96=\"c\",1,0)+IF(U112=\"c\",1,0))/2","v":0},{"$f":"(IF(V11=\"c\",1,0)+IF(V28=\"c\",1,0)+IF(#REF!=\"c\",1,0)+IF(V62=\"c\",1,0)+IF(V79=\"c\",1,0)+IF(V96=\"c\",1,0)+IF(V112=\"c\",1,0))/2","v":{"$error":"#REF!"}},{"$f":"(IF(W11=\"c\",1,0)+IF(W28=\"c\",1,0)+IF(W45=\"c\",1,0)+IF(W62=\"c\",1,0)+IF(W79=\"c\",1,0)+IF(W96=\"c\",1,0)+IF(W112=\"c\",1,0))/2","v":0},{"$f":"(IF(X11=\"c\",1,0)+IF(X28=\"c\",1,0)+IF(V45=\"c\",1,0)+IF(S62=\"c\",1,0)+IF(X79=\"c\",1,0)+IF(X96=\"c\",1,0)+IF(X112=\"c\",1,0))/2","v":0},{"$f":"(IF(Y11=\"c\",1,0)+IF(Y28=\"c\",1,0)+IF(Y45=\"c\",1,0)+IF(Y62=\"c\",1,0)+IF(Y79=\"c\",1,0)+IF(Y96=\"c\",1,0)+IF(Y112=\"c\",1,0))/2","v":0},0,0,0,0,0,0,0,0,0,0,0,{"$error":"#REF!"},"C",null,null,null,"ELS 6"]
[null,null,"PATHMAJEYANTH","R",{"$f":"IF(E12=\"r\",1,0)+IF(E29=\"r\",1,0)+IF(E46=\"r\",1,0)+IF(E63=\"r\",1,0)+IF(E80=\"r\",1,0)+IF(E97=\"r\",1,0)+IF(E113=\"r\",1,0)/2","v":0},{"$f":"IF(F12=\"r\",1,0)+IF(F29=\"r\",1,0)+IF(F46=\"r\",1,0)+IF(F63=\"r\",1,0)+IF(F80=\"r\",1,0)+IF(F97=\"r\",1,0)+IF(F113=\"r\",1,0)/2","v":0},{"$f":"(IF(G12=\"r\",1,0)+IF(G29=\"r\",1,0)+IF(G46=\"r\",1,0)+IF(G63=\"r\",1,0)+IF(G80=\"r\",1,0)+IF(G97=\"r\",1,0)+IF(G113=\"r\",1,0))/2","v":0},0,0.5,0.5,0.5,0.5,0.5,0.5,0.5,2.5,2.5,2.5,2.5,2.5,2.5,0,0,0,0,0,0,0.5,1,2.5,2.5,2.5,2.5,2.5,2.5,0,35,"R",{"$f":"AK143+AK144","v":35},36.5,{"$f":"AM143-AN143","v":-1.5},"Youcef OULD KADI"]
[null,null,"ELS 7","C",{"$f":"IF(E12=\"c\",1,0)+IF(E29=\"c\",1,0)+IF(E46=\"c\",1,0)+IF(E63=\"c\",1,0)+IF(E80=\"c\",1,0)+IF(E97=\"c\",1,0)+IF(E113=\"c\",1,0)/2","v":0},{"$f":"IF(F12=\"c\",1,0)+IF(F29=\"c\",1,0)+IF(F46=\"c\",1,0)+IF(F63=\"c\",1,0)+IF(F80=\"c\",1,0)+IF(F97=\"c\",1,0)+IF(F113=\"c\",1,0)/2","v":0},{"$f":"(IF(G12=\"c\",1,0)+IF(G29=\"c\",1,0)+IF(G46=\"c\",1,0)+IF(G63=\"c\",1,0)+IF(G80=\"c\",1,0)+IF(G97=\"c\",1,0)+IF(G113=\"c\",1,0))/2","v":0},0,0,0,0,0,0,0,0,0,0,0,0,0,0,0,0,0,0,0,0,0,0,0,0,0,0,0,0,0,0,"C",null,null,null,"ELS 7"]
[null,null,{"$f":"+C114","v":"Katia BOUSBA"},"R",{"$f":"IF(E13=\"r\",1,0)+IF(E30=\"r\",1,0)+IF(E47=\"r\",1,0)+IF(E64=\"r\",1,0)+IF(E81=\"r\",1,0)+IF(E98=\"r\",1,0)+IF(E114=\"r\",1,0)/2","v":0},{"$f":"IF(F13=\"r\",1,0)+IF(F30=\"r\",1,0)+IF(F47=\"r\",1,0)+IF(F64=\"r\",1,0)+IF(F81=\"r\",1,0)+IF(F98=\"r\",1,0)+IF(F114=\"r\",1,0)/2","v":0},{"$f":"(IF(G13=\"r\",1,0)+IF(G30=\"r\",1,0)+IF(G47=\"r\",1,0)+IF(G64=\"r\",1,0)+IF(G81=\"r\",1,0)+IF(G98=\"r\",1,0)+IF(G114=\"r\",1,0))/2","v":0},0,0,0,0,0,0,{"$f":"(IF(N13=\"r\",1,0)+IF(N30=\"r\",1,0)+IF(#REF!=\"r\",1,0)+IF(N64=\"r\",1,0)+IF(#REF!=\"r\",1,0)+IF(N98=\"r\",1,0)+IF(N114=\"r\",1,0))/2","v":{"$error":"#REF!"}},{"$f":"(IF(O13=\"r\",1,0)+IF(O30=\"r\",1,0)+IF(#REF!=\"r\",1,0)+IF(O64=\"r\",1,0)+IF(#REF!=\"r\",1,0)+IF(O98=\"r\",1,0)+IF(O114=\"r\",1,0))/2","v":{"$error":"#REF!"}},{"$f":"(IF(P13=\"r\",1,0)+IF(P30=\"r\",1,0)+IF(#REF!=\"r\",1,0)+IF(P64=\"r\",1,0)+IF(#REF!=\"r\",1,0)+IF(P98=\"r\",1,0)+IF(P114=\"r\",1,0))/2","v":{"$error":"#REF!"}},{"$f":"(IF(Q13=\"r\",1,0)+IF(Q30=\"r\",1,0)+IF(#REF!=\"r\",1,0)+IF(Q64=\"r\",1,0)+IF(#REF!=\"r\",1,0)+IF(Q98=\"r\",1,0)+IF(Q114=\"r\",1,0))/2","v":{"$error":"#REF!"}},{"$f":"(IF(R13=\"r\",1,0)+IF(R30=\"r\",1,0)+IF(#REF!=\"r\",1,0)+IF(R64=\"r\",1,0)+IF(#REF!=\"r\",1,0)+IF(R98=\"r\",1,0)+IF(R114=\"r\",1,0))/2","v":{"$error":"#REF!"}},{"$f":"(IF(S13=\"r\",1,0)+IF(S30=\"r\",1,0)+IF(#REF!=\"r\",1,0)+IF(S64=\"r\",1,0)+IF(#REF!=\"r\",1,0)+IF(S98=\"r\",1,0)+IF(S114=\"r\",1,0))/2","v":{"$error":"#REF!"}},{"$f":"(IF(T13=\"r\",1,0)+IF(T30=\"r\",1,0)+IF(#REF!=\"r\",1,0)+IF(T64=\"r\",1,0)+IF(#REF!=\"r\",1,0)+IF(T98=\"r\",1,0)+IF(T114=\"r\",1,0))/2","v":{"$error":"#REF!"}},{"$f":"(IF(U13=\"r\",1,0)+IF(U30=\"r\",1,0)+IF(#REF!=\"r\",1,0)+IF(U64=\"r\",1,0)+IF(#REF!=\"r\",1,0)+IF(U98=\"r\",1,0)+IF(U114=\"r\",1,0))/2","v":{"$error":"#REF!"}},{"$f":"(IF(V13=\"r\",1,0)+IF(V30=\"r\",1,0)+IF(#REF!=\"r\",1,0)+IF(V64=\"r\",1,0)+IF(V81=\"r\",1,0)+IF(V98=\"r\",1,0)+IF(V114=\"r\",1,0))/2","v":{"$error":"#REF!"}},{"$f":"(IF(W13=\"r\",1,0)+IF(W30=\"r\",1,0)+IF(#REF!=\"r\",1,0)+IF(W64=\"r\",1,0)+IF(W81=\"r\",1,0)+IF(W98=\"r\",1,0)+IF(W114=\"r\",1,0))/2","v":{"$error":"#REF!"}},{"$f":"(IF(X13=\"r\",1,0)+IF(X30=\"r\",1,0)+IF(#REF!=\"r\",1,0)+IF(X64=\"r\",1,0)+IF(X81=\"r\",1,0)+IF(X98=\"r\",1,0)+IF(X114=\"r\",1,0))/2","v":{"$error":"#REF!"}},{"$f":"(IF(Y13=\"r\",1,0)+IF(Y30=\"r\",1,0)+IF(#REF!=\"r\",1,0)+IF(Y64=\"r\",1,0)+IF(Y81=\"r\",1,0)+IF(Y98=\"r\",1,0)+IF(Y114=\"r\",1,0))/2","v":{"$error":"#REF!"}},{"$f":"(IF(Z13=\"r\",1,0)+IF(Z30=\"r\",1,0)+IF(#REF!=\"r\",1,0)+IF(Z64=\"r\",1,0)+IF(Z81=\"r\",1,0)+IF(Z98=\"r\",1,0)+IF(Z114=\"r\",1,0))/2","v":{"$error":"#REF!"}},{"$f":"(IF(AA13=\"r\",1,0)+IF(AA30=\"r\",1,0)+IF(#REF!=\"r\",1,0)+IF(AA64=\"r\",1,0)+IF(AA81=\"r\",1,0)+IF(AA98=\"r\",1,0)+IF(AA114=\"r\",1,0))/2","v":{"$error":"#REF!"}},{"$f":"(IF(#REF!=\"r\",1,0)+IF(#REF!=\"r\",1,0)+IF(#REF!=\"r\",1,0)+IF(AB30=\"r\",1,0)+IF(AB81=\"r\",1,0)+IF(AB98=\"r\",1,0)+IF(AB114=\"r\",1,0))/2","v":{"$error":"#REF!"}},{"$f":"(IF(#REF!=\"r\",1,0)+IF(#REF!=\"r\",1,0)+IF(#REF!=\"r\",1,0)+IF(AC30=\"r\",1,0)+IF(AC81=\"r\",1,0)+IF(AC98=\"r\",1,0)+IF(AC114=\"r\",1,0))/2","v":{"$error":"#REF!"}},{"$f":"(IF(AD10=\"r\",1,0)+IF(#REF!=\"r\",1,0)+IF(#REF!=\"r\",1,0)+IF(AD30=\"r\",1,0)+IF(AD81=\"r\",1,0)+IF(AD98=\"r\",1,0)+IF(AD114=\"r\",1,0))/2","v":{"$error":"#REF!"}},{"$f":"(IF(AE10=\"r\",1,0)+IF(#REF!=\"r\",1,0)+IF(#REF!=\"r\",1,0)+IF(AE30=\"r\",1,0)+IF(AE81=\"r\",1,0)+IF(AE98=\"r\",1,0)+IF(AE114=\"r\",1,0))/2","v":{"$error":"#REF!"}},{"$f":"(IF(AF10=\"r\",1,0)+IF(#REF!=\"r\",1,0)+IF(#REF!=\"r\",1,0)+IF(AF30=\"r\",1,0)+IF(AF81=\"r\",1,0)+IF(AF98=\"r\",1,0)+IF(AF114=\"r\",1,0))/2","v":{"$error":"#REF!"}},{"$f":"(IF(AG10=\"r\",1,0)+IF(#REF!=\"r\",1,0)+IF(#REF!=\"r\",1,0)+IF(AG30=\"r\",1,0)+IF(AG81=\"r\",1,0)+IF(AG98=\"r\",1,0)+IF(AG114=\"r\",1,0))/2","v":{"$error":"#REF!"}},{"$f":"(IF(AH10=\"r\",1,0)+IF(#REF!=\"r\",1,0)+IF(#REF!=\"r\",1,0)+IF(AH30=\"r\",1,0)+IF(AH81=\"r\",1,0)+IF(AH98=\"r\",1,0)+IF(AH114=\"r\",1,0))/2","v":{"$error":"#REF!"}},{"$f":"(IF(AI10=\"r\",1,0)+IF(#REF!=\"r\",1,0)+IF(#REF!=\"r\",1,0)+IF(AI30=\"r\",1,0)+IF(AI81=\"r\",1,0)+IF(AI98=\"r\",1,0)+IF(AI114=\"r\",1,0))/2","v":{"$error":"#REF!"}},{"$f":"(IF(AJ10=\"r\",1,0)+IF(AJ30=\"r\",1,0)+IF(AJ47=\"r\",1,0)+IF(AJ64=\"r\",1,0)+IF(AJ81=\"r\",1,0)+IF(AJ98=\"r\",1,0)+IF(AJ114=\"r\",1,0))/2","v":0},{"$error":"#REF!"},"R",{"$f":"AK145+AK146","v":{"$error":"#REF!"}},20,{"$f":"AM145-AN145","v":{"$error":"#REF!"}},{"$f":"+C145","v":"Katia BOUSBA"}]
[null,null,"ELS 8","C",{"$f":"IF(E13=\"c\",1,0)+IF(E30=\"c\",1,0)+IF(E47=\"c\",1,0)+IF(E64=\"c\",1,0)+IF(E81=\"c\",1,0)+IF(E98=\"c\",1,0)+IF(E114=\"c\",1,0)/2","v":0},{"$f":"IF(F13=\"c\",1,0)+IF(F30=\"c\",1,0)+IF(F47=\"c\",1,0)+IF(F64=\"c\",1,0)+IF(F81=\"c\",1,0)+IF(F98=\"c\",1,0)+IF(F114=\"c\",1,0)/2","v":0},{"$f":"(IF(G13=\"c\",1,0)+IF(G30=\"c\",1,0)+IF(G47=\"c\",1,0)+IF(G64=\"c\",1,0)+IF(G81=\"c\",1,0)+IF(G98=\"c\",1,0)+IF(G114=\"c\",1,0))/2","v":0},0,0,0,0.5,0.5,0.5,{"$f":"(IF(N13=\"c\",1,0)+IF(N30=\"c\",1,0)+IF(#REF!=\"c\",1,0)+IF(N64=\"c\",1,0)+IF(#REF!=\"c\",1,0)+IF(N98=\"c\",1,0)+IF(N114=\"c\",1,0))/2","v":{"$error":"#REF!"}},{"$f":"(IF(O13=\"c\",1,0)+IF(O30=\"c\",1,0)+IF(#REF!=\"c\",1,0)+IF(O64=\"c\",1,0)+IF(#REF!=\"c\",1,0)+IF(O98=\"c\",1,0)+IF(O114=\"c\",1,0))/2","v":{"$error":"#REF!"}},{"$f":"(IF(P13=\"c\",1,0)+IF(P30=\"c\",1,0)+IF(#REF!=\"c\",1,0)+IF(P64=\"c\",1,0)+IF(#REF!=\"c\",1,0)+IF(P98=\"c\",1,0)+IF(P114=\"c\",1,0))/2","v":{"$error":"#REF!"}},{"$f":"(IF(Q13=\"c\",1,0)+IF(Q30=\"c\",1,0)+IF(#REF!=\"c\",1,0)+IF(Q64=\"c\",1,0)+IF(#REF!=\"c\",1,0)+IF(Q98=\"c\",1,0)+IF(Q114=\"c\",1,0))/2","v":{"$error":"#REF!"}},{"$f":"(IF(R13=\"c\",1,0)+IF(R30=\"c\",1,0)+IF(#REF!=\"c\",1,0)+IF(R64=\"c\",1,0)+IF(#REF!=\"c\",1,0)+IF(R98=\"c\",1,0)+IF(R114=\"c\",1,0))/2","v":{"$error":"#REF!"}},{"$f":"(IF(S13=\"c\",1,0)+IF(S30=\"c\",1,0)+IF(#REF!=\"c\",1,0)+IF(S64=\"c\",1,0)+IF(#REF!=\"c\",1,0)+IF(S98=\"c\",1,0)+IF(S114=\"c\",1,0))/2","v":{"$error":"#REF!"}},{"$f":"(IF(T13=\"c\",1,0)+IF(T30=\"c\",1,0)+IF(#REF!=\"c\",1,0)+IF(T64=\"c\",1,0)+IF(#REF!=\"c\",1,0)+IF(T98=\"c\",1,0)+IF(T114=\"c\",1,0))/2","v":{"$error":"#REF!"}},{"$f":"(IF(U13=\"c\",1,0)+IF(U30=\"c\",1,0)+IF(#REF!=\"c\",1,0)+IF(U64=\"c\",1,0)+IF(#REF!=\"c\",1,0)+IF(U98=\"c\",1,0)+IF(U114=\"c\",1,0))/2","v":{"$error":"#REF!"}},{"$f":"(IF(V13=\"c\",1,0)+IF(V30=\"c\",1,0)+IF(#REF!=\"c\",1,0)+IF(V64=\"c\",1,0)+IF(V81=\"c\",1,0)+IF(V98=\"c\",1,0)+IF(V114=\"c\",1,0))/2","v":{"$error":"#REF!"}},{"$f":"(IF(W13=\"c\",1,0)+IF(W30=\"c\",1,0)+IF(#REF!=\"c\",1,0)+IF(W64=\"c\",1,0)+IF(W81=\"c\",1,0)+IF(W98=\"c\",1,0)+IF(W114=\"c\",1,0))/2","v":{"$error":"#REF!"}},{"$f":"(IF(X13=\"c\",1,0)+IF(X30=\"c\",1,0)+IF(#REF!=\"c\",1,0)+IF(X64=\"c\",1,0)+IF(X81=\"c\",1,0)+IF(X98=\"c\",1,0)+IF(X114=\"c\",1,0))/2","v":{"$error":"#REF!"}},{"$f":"(IF(Y13=\"c\",1,0)+IF(Y30=\"c\",1,0)+IF(#REF!=\"c\",1,0)+IF(Y64=\"c\",1,0)+IF(Y81=\"c\",1,0)+IF(Y98=\"c\",1,0)+IF(Y114=\"c\",1,0))/2","v":{"$error":"#REF!"}},{"$f":"(IF(Z13=\"c\",1,0)+IF(Z30=\"c\",1,0)+IF(#REF!=\"c\",1,0)+IF(Z64=\"c\",1,0)+IF(Z81=\"c\",1,0)+IF(Z98=\"c\",1,0)+IF(Z114=\"c\",1,0))/2","v":{"$error":"#REF!"}},{"$f":"(IF(AA13=\"c\",1,0)+IF(AA30=\"c\",1,0)+IF(#REF!=\"c\",1,0)+IF(AA64=\"c\",1,0)+IF(AA81=\"c\",1,0)+IF(AA98=\"c\",1,0)+IF(AA114=\"c\",1,0))/2","v":{"$error":"#REF!"}},{"$f":"(IF(#REF!=\"c\",1,0)+IF(#REF!=\"c\",1,0)+IF(#REF!=\"c\",1,0)+IF(AB30=\"c\",1,0)+IF(AB81=\"c\",1,0)+IF(AB98=\"c\",1,0)+IF(AB114=\"c\",1,0))/2","v":{"$error":"#REF!"}},{"$f":"(IF(#REF!=\"c\",1,0)+IF(#REF!=\"c\",1,0)+IF(#REF!=\"c\",1,0)+IF(AC30=\"c\",1,0)+IF(AC81=\"c\",1,0)+IF(AC98=\"c\",1,0)+IF(AC114=\"c\",1,0))/2","v":{"$error":"#REF!"}},{"$f":"(IF(AD10=\"c\",1,0)+IF(#REF!=\"c\",1,0)+IF(#REF!=\"c\",1,0)+IF(AD30=\"c\",1,0)+IF(AD81=\"c\",1,0)+IF(AD98=\"c\",1,0)+IF(AD114=\"c\",1,0))/2","v":{"$error":"#REF!"}},{"$f":"(IF(AE10=\"c\",1,0)+IF(#REF!=\"c\",1,0)+IF(#REF!=\"c\",1,0)+IF(AE30=\"c\",1,0)+IF(AE81=\"c\",1,0)+IF(AE98=\"c\",1,0)+IF(AE114=\"c\",1,0))/2","v":{"$error":"#REF!"}},{"$f":"(IF(AF10=\"c\",1,0)+IF(#REF!=\"c\",1,0)+IF(#REF!=\"c\",1,0)+IF(AF30=\"c\",1,0)+IF(AF81=\"c\",1,0)+IF(AF98=\"c\",1,0)+IF(AF114=\"c\",1,0))/2","v":{"$error":"#REF!"}},{"$f":"(IF(AG10=\"c\",1,0)+IF(#REF!=\"c\",1,0)+IF(#REF!=\"c\",1,0)+IF(AG30=\"c\",1,0)+IF(AG81=\"c\",1,0)+IF(AG98=\"c\",1,0)+IF(AG114=\"c\",1,0))/2","v":{"$error":"#REF!"}},{"$f":"(IF(AH10=\"c\",1,0)+IF(#REF!=\"c\",1,0)+IF(#REF!=\"c\",1,0)+IF(AH30=\"c\",1,0)+IF(AH81=\"c\",1,0)+IF(AH98=\"c\",1,0)+IF(AH114=\"c\",1,0))/2","v":{"$error":"#REF!"}},{"$f":"(IF(AI10=\"c\",1,0)+IF(#REF!=\"c\",1,0)+IF(#REF!=\"c\",1,0)+IF(AI30=\"c\",1,0)+IF(AI81=\"c\",1,0)+IF(AI98=\"c\",1,0)+IF(AI114=\"c\",1,0))/2","v":{"$error":"#REF!"}},{"$f":"(IF(AJ10=\"c\",1,0)+IF(AJ30=\"c\",1,0)+IF(AJ47=\"c\",1,0)+IF(AJ64=\"c\",1,0)+IF(AJ81=\"c\",1,0)+IF(AJ98=\"c\",1,0)+IF(AJ114=\"c\",1,0))/2","v":0},{"$error":"#REF!"},"C",null,36.75,null,"ELS 8"]
[null,null,"Anta","R",null,null,{"$f":"(IF(G14=\"r\",1,0)+IF(G31=\"r\",1,0)+IF(G48=\"r\",1,0)+IF(G65=\"r\",1,0)+IF(G82=\"r\",1,0)+IF(G99=\"r\",1,0)+IF(G115=\"r\",1,0))/2","v":0},0,0,0,0,0,0,{"$f":"(IF(N14=\"r\",1,0)+IF(N31=\"r\",1,0)+IF(#REF!=\"r\",1,0)+IF(N65=\"r\",1,0)+IF(N81=\"r\",1,0)+IF(N99=\"r\",1,0)+IF(N115=\"r\",1,0))/2","v":{"$error":"#REF!"}},{"$f":"(IF(O14=\"r\",1,0)+IF(O31=\"r\",1,0)+IF(#REF!=\"r\",1,0)+IF(O65=\"r\",1,0)+IF(O81=\"r\",1,0)+IF(O99=\"r\",1,0)+IF(O115=\"r\",1,0))/2","v":{"$error":"#REF!"}},{"$f":"(IF(P14=\"r\",1,0)+IF(P31=\"r\",1,0)+IF(#REF!=\"r\",1,0)+IF(P65=\"r\",1,0)+IF(P81=\"r\",1,0)+IF(N47=\"r\",1,0)+IF(P115=\"r\",1,0))/2","v":{"$error":"#REF!"}},{"$f":"(IF(Q14=\"r\",1,0)+IF(Q31=\"r\",1,0)+IF(#REF!=\"r\",1,0)+IF(Q65=\"r\",1,0)+IF(Q81=\"r\",1,0)+IF(O47=\"r\",1,0)+IF(Q115=\"r\",1,0))/2","v":{"$error":"#REF!"}},{"$f":"(IF(R14=\"r\",1,0)+IF(R31=\"r\",1,0)+IF(#REF!=\"r\",1,0)+IF(R65=\"r\",1,0)+IF(R81=\"r\",1,0)+IF(P47=\"r\",1,0)+IF(R115=\"r\",1,0))/2","v":{"$error":"#REF!"}},{"$f":"(IF(S14=\"r\",1,0)+IF(S31=\"r\",1,0)+IF(#REF!=\"r\",1,0)+IF(S65=\"r\",1,0)+IF(S81=\"r\",1,0)+IF(Q47=\"r\",1,0)+IF(S115=\"r\",1,0))/2","v":{"$error":"#REF!"}},{"$f":"(IF(T14=\"r\",1,0)+IF(T31=\"r\",1,0)+IF(#REF!=\"r\",1,0)+IF(T65=\"r\",1,0)+IF(T81=\"r\",1,0)+IF(R47=\"r\",1,0)+IF(T115=\"r\",1,0))/2","v":{"$error":"#REF!"}},{"$f":"(IF(U14=\"r\",1,0)+IF(U31=\"r\",1,0)+IF(#REF!=\"r\",1,0)+IF(U65=\"r\",1,0)+IF(U81=\"r\",1,0)+IF(S47=\"r\",1,0)+IF(U115=\"r\",1,0))/2","v":{"$error":"#REF!"}},{"$f":"(IF(AB13=\"r\",1,0)+IF(V31=\"r\",1,0)+IF(V47=\"r\",1,0)+IF(V65=\"r\",1,0)+IF(V82=\"r\",1,0)+IF(T47=\"r\",1,0)+IF(V115=\"r\",1,0))/2","v":0},{"$f":"(IF(#REF!=\"r\",1,0)+IF(W31=\"r\",1,0)+IF(W47=\"r\",1,0)+IF(W65=\"r\",1,0)+IF(W82=\"r\",1,0)+IF(U47=\"r\",1,0)+IF(W115=\"r\",1,0))/2","v":{"$error":"#REF!"}},{"$f":"(IF(#REF!=\"r\",1,0)+IF(X31=\"r\",1,0)+IF(X47=\"r\",1,0)+IF(X65=\"r\",1,0)+IF(#REF!=\"r\",1,0)+IF(X99=\"r\",1,0)+IF(X115=\"r\",1,0))/2","v":{"$error":"#REF!"}},{"$f":"(IF(#REF!=\"r\",1,0)+IF(Y31=\"r\",1,0)+IF(Y47=\"r\",1,0)+IF(Y65=\"r\",1,0)+IF(X82=\"r\",1,0)+IF(Y99=\"r\",1,0)+IF(Y115=\"r\",1,0))/2","v":{"$error":"#REF!"}},{"$f":"(IF(#REF!=\"r\",1,0)+IF(Z31=\"r\",1,0)+IF(Z47=\"r\",1,0)+IF(Z65=\"r\",1,0)+IF(Z82=\"r\",1,0)+IF(Z99=\"r\",1,0)+IF(Z115=\"r\",1,0))/2","v":{"$error":"#REF!"}},{"$f":"(IF(#REF!=\"r\",1,0)+IF(AA31=\"r\",1,0)+IF(AA47=\"r\",1,0)+IF(AA65=\"r\",1,0)+IF(AA82=\"r\",1,0)+IF(AA99=\"r\",1,0)+IF(AA115=\"r\",1,0))/2","v":{"$error":"#REF!"}},{"$f":"(IF(#REF!=\"r\",1,0)+IF(AB31=\"r\",1,0)+IF(AB47=\"r\",1,0)+IF(AB65=\"r\",1,0)+IF(AB82=\"r\",1,0)+IF(AB99=\"r\",1,0)+IF(AB115=\"r\",1,0))/2","v":{"$error":"#REF!"}},{"$f":"(IF(AC13=\"r\",1,0)+IF(AC31=\"r\",1,0)+IF(AC47=\"r\",1,0)+IF(AC65=\"r\",1,0)+IF(AC82=\"r\",1,0)+IF(AC99=\"r\",1,0)+IF(AC115=\"r\",1,0))/2","v":0},0,0,0,0,0,0,null,{"$error":"#REF!"},"R",{"$f":"AK147+AK148","v":{"$error":"#REF!"}},0,{"$f":"AM147-AN147","v":{"$error":"#REF!"}},"Sofia MAICHE"]
[null,null,"ELS 8","C",null,null,{"$f":"(IF(G14=\"c\",1,0)+IF(G31=\"c\",1,0)+IF(G48=\"c\",1,0)+IF(G65=\"c\",1,0)+IF(G82=\"c\",1,0)+IF(G99=\"c\",1,0)+IF(G115=\"c\",1,0))/2","v":0},0,0,0,0,2,2,{"$f":"(IF(N14=\"c\",1,0)+IF(N31=\"c\",1,0)+IF(#REF!=\"c\",1,0)+IF(N65=\"c\",1,0)+IF(N81=\"c\",1,0)+IF(N99=\"c\",1,0)+IF(N115=\"c\",1,0))/2","v":{"$error":"#REF!"}},{"$f":"(IF(O14=\"c\",1,0)+IF(O31=\"c\",1,0)+IF(#REF!=\"c\",1,0)+IF(O65=\"c\",1,0)+IF(O81=\"c\",1,0)+IF(O99=\"c\",1,0)+IF(O115=\"c\",1,0))/2","v":{"$error":"#REF!"}},{"$f":"(IF(P14=\"c\",1,0)+IF(P31=\"c\",1,0)+IF(#REF!=\"c\",1,0)+IF(P65=\"c\",1,0)+IF(P81=\"c\",1,0)+IF(N47=\"c\",1,0)+IF(P115=\"c\",1,0))/2","v":{"$error":"#REF!"}},{"$f":"(IF(Q14=\"c\",1,0)+IF(Q31=\"c\",1,0)+IF(#REF!=\"c\",1,0)+IF(Q65=\"c\",1,0)+IF(Q81=\"c\",1,0)+IF(O47=\"c\",1,0)+IF(Q115=\"c\",1,0))/2","v":{"$error":"#REF!"}},{"$f":"(IF(R14=\"c\",1,0)+IF(R31=\"c\",1,0)+IF(#REF!=\"c\",1,0)+IF(R65=\"c\",1,0)+IF(R81=\"c\",1,0)+IF(P47=\"c\",1,0)+IF(R115=\"c\",1,0))/2","v":{"$error":"#REF!"}},{"$f":"(IF(S14=\"c\",1,0)+IF(S31=\"c\",1,0)+IF(#REF!=\"c\",1,0)+IF(S65=\"c\",1,0)+IF(S81=\"c\",1,0)+IF(Q47=\"c\",1,0)+IF(S115=\"c\",1,0))/2","v":{"$error":"#REF!"}},{"$f":"(IF(T14=\"c\",1,0)+IF(T31=\"c\",1,0)+IF(#REF!=\"c\",1,0)+IF(T65=\"c\",1,0)+IF(T81=\"c\",1,0)+IF(R47=\"c\",1,0)+IF(T115=\"c\",1,0))/2","v":{"$error":"#REF!"}},{"$f":"(IF(U14=\"c\",1,0)+IF(U31=\"c\",1,0)+IF(#REF!=\"c\",1,0)+IF(U65=\"c\",1,0)+IF(U81=\"c\",1,0)+IF(S47=\"c\",1,0)+IF(U115=\"c\",1,0))/2","v":{"$error":"#REF!"}},{"$f":"(IF(AB13=\"c\",1,0)+IF(V31=\"c\",1,0)+IF(V47=\"c\",1,0)+IF(V65=\"c\",1,0)+IF(V82=\"c\",1,0)+IF(T47=\"c\",1,0)+IF(V115=\"c\",1,0))/2","v":1.5},{"$f":"(IF(#REF!=\"c\",1,0)+IF(W31=\"c\",1,0)+IF(W47=\"c\",1,0)+IF(W65=\"c\",1,0)+IF(W82=\"c\",1,0)+IF(U47=\"c\",1,0)+IF(W115=\"c\",1,0))/2","v":{"$error":"#REF!"}},{"$f":"(IF(#REF!=\"c\",1,0)+IF(X31=\"c\",1,0)+IF(X47=\"c\",1,0)+IF(X65=\"c\",1,0)+IF(#REF!=\"c\",1,0)+IF(X99=\"c\",1,0)+IF(X115=\"c\",1,0))/2","v":{"$error":"#REF!"}},{"$f":"(IF(#REF!=\"c\",1,0)+IF(Y31=\"c\",1,0)+IF(Y47=\"c\",1,0)+IF(Y65=\"c\",1,0)+IF(X82=\"c\",1,0)+IF(Y99=\"c\",1,0)+IF(Y115=\"c\",1,0))/2","v":{"$error":"#REF!"}},{"$f":"(IF(#REF!=\"c\",1,0)+IF(Z31=\"c\",1,0)+IF(Z47=\"c\",1,0)+IF(Z65=\"c\",1,0)+IF(Z82=\"c\",1,0)+IF(Z99=\"c\",1,0)+IF(Z115=\"c\",1,0))/2","v":{"$error":"#REF!"}},{"$f":"(IF(#REF!=\"c\",1,0)+IF(AA31=\"c\",1,0)+IF(AA47=\"c\",1,0)+IF(AA65=\"c\",1,0)+IF(AA82=\"c\",1,0)+IF(AA99=\"c\",1,0)+IF(AA115=\"c\",1,0))/2","v":{"$error":"#REF!"}},{"$f":"(IF(#REF!=\"c\",1,0)+IF(AB31=\"c\",1,0)+IF(AB47=\"c\",1,0)+IF(AB65=\"c\",1,0)+IF(AB82=\"c\",1,0)+IF(AB99=\"c\",1,0)+IF(AB115=\"c\",1,0))/2","v":{"$error":"#REF!"}},{"$f":"(IF(AC13=\"c\",1,0)+IF(AC31=\"c\",1,0)+IF(AC47=\"c\",1,0)+IF(AC65=\"c\",1,0)+IF(AC82=\"c\",1,0)+IF(AC99=\"c\",1,0)+IF(AC115=\"c\",1,0))/2","v":2},2,2,2,2,2,2,null,{"$error":"#REF!"},"C",null,36.75,null,"ELS 8"]
[null,null,null,"R",{"$f":"IF(E15=\"r\",1,0)+IF(E32=\"r\",1,0)+IF(E49=\"r\",1,0)+IF(E66=\"r\",1,0)+IF(E83=\"r\",1,0)+IF(E100=\"r\",1,0)+IF(E116=\"r\",1,0)/2","v":0},{"$f":"IF(F15=\"r\",1,0)+IF(F32=\"r\",1,0)+IF(F49=\"r\",1,0)+IF(F66=\"r\",1,0)+IF(F83=\"r\",1,0)+IF(F100=\"r\",1,0)+IF(F116=\"r\",1,0)/2","v":0},{"$f":"(IF(G15=\"r\",1,0)+IF(G32=\"r\",1,0)+IF(G49=\"r\",1,0)+IF(G66=\"r\",1,0)+IF(G83=\"r\",1,0)+IF(G100=\"r\",1,0)+IF(G116=\"r\",1,0))/2","v":1},1.5,1.5,1.5,1.5,1.5,1.5,1.5,1.5,1.5,1.5,1.5,1.5,0,0,0,0,0,0,0,0,0,0,0,0,0,0,0,0,0,19,"R",{"$f":"AK149+AK150","v":19},35,{"$f":"AM149-AN149","v":-16},"Elyess CHELBI"]
[null,null,null,"C",{"$f":"IF(E15=\"c\",1,0)+IF(E32=\"c\",1,0)+IF(E49=\"c\",1,0)+IF(E66=\"c\",1,0)+IF(E83=\"c\",1,0)+IF(E100=\"c\",1,0)+IF(E116=\"c\",1,0)/2","v":0},{"$f":"IF(F15=\"c\",1,0)+IF(F32=\"c\",1,0)+IF(F49=\"c\",1,0)+IF(F66=\"c\",1,0)+IF(F83=\"c\",1,0)+IF(F100=\"c\",1,0)+IF(F116=\"c\",1,0)/2","v":0},{"$f":"(IF(G15=\"c\",1,0)+IF(G32=\"c\",1,0)+IF(G49=\"c\",1,0)+IF(G66=\"c\",1,0)+IF(G83=\"c\",1,0)+IF(G100=\"c\",1,0)+IF(G116=\"c\",1,0))/2","v":0},0,0,0,0,0,0,0,0,0,0,0,0,0,0,0,0,0,0,0,0,0,0,0,0,0,0,0,0,0.5,0,"C",null,32,null,"ELS 9"]
[null,null,"SOUS-TOTAL","R",{"$f":"E125+E127+E129+E131+E133+E135+E137+E139+E141+E143+E145+E149","v":0},{"$f":"F125+F127+F129+F131+F133+F135+F137+F139+F141+F143+F145+F149","v":0},{"$f":"G125+G127+G129+G131+G133+G135+G137+G139+G141+G143+G145+G149+G147","v":5},{"$f":"H125+H127+H129+H131+H133+H135+H137+H139+H141+H143+H145+H149+H147","v":8},8.5,8.5,7,8.5,8.5,{"$error":"#REF!"},{"$error":"#REF!"},{"$error":"#REF!"},{"$error":"#REF!"},{"$error":"#REF!"},{"$error":"#REF!"},{"$error":"#REF!"},{"$f":"U125+U127+U129+U131+U133+U135+U137+U139+U141+U143+U145+U149+U147","v":{"$error":"#REF!"}},{"$error":"#REF!"},{"$error":"#REF!"},{"$error":"#REF!"},{"$error":"#REF!"},{"$error":"#REF!"},{"$error":"#REF!"},{"$f":"AB125+AB127+AB129+AB131+AB133+AB135+AB137+AB139+AB141+AB143+AB145+AB149+AB147","v":{"$error":"#REF!"}},{"$error":"#REF!"},{"$error":"#REF!"},{"$error":"#REF!"},{"$error":"#REF!"},{"$error":"#REF!"},{"$f":"AH125+AH127+AH129+AH131+AH133+AH135+AH137+AH139+AH141+AH143+AH145+AH149+AH147","v":{"$error":"#REF!"}},{"$f":"AI125+AI127+AI129+AI131+AI133+AI135+AI137+AI139+AI141+AI143+AI145+AI149+AI147","v":{"$error":"#REF!"}},{"$error":"#REF!"},{"$f":"+SUM(G151:AI151)","v":{"$error":"#REF!"}},"R",{"$f":"AK151+AK152","v":{"$error":"#REF!"}},{"$f":"AN125+AN127+AN129+AN131+AN133+AN135+AN137+AN139+AN141+AN143+AN145+AN149+AN147","v":405},{"$f":"AM151-AN151","v":{"$error":"#REF!"}}]
[null,null,"ELS 9","C",{"$f":"E126+E128+E130+E132+E134+E136+E138+E140+E142+E144+E146+E150","v":0.5},0,{"$f":"G126+G128+G130+G132+G134+G136+G138+G140+G142+G144+G146+G150+G148","v":0},0,0,0,2.5,4.5,4.5,{"$error":"#REF!"},{"$error":"#REF!"},{"$error":"#REF!"},{"$error":"#REF!"},{"$error":"#REF!"},{"$error":"#REF!"},{"$f":"T126+T128+T130+T132+T134+T136+T138+T140+T142+T144+T146+T150+T148","v":{"$error":"#REF!"}},{"$error":"#REF!"},{"$error":"#REF!"},{"$error":"#REF!"},{"$error":"#REF!"},{"$error":"#REF!"},{"$error":"#REF!"},{"$error":"#REF!"},{"$error":"#REF!"},{"$error":"#REF!"},{"$error":"#REF!"},{"$error":"#REF!"},{"$error":"#REF!"},{"$error":"#REF!"},{"$error":"#REF!"},{"$error":"#REF!"},{"$error":"#REF!"},{"$f":"+SUM(G152:AI152)","v":{"$error":"#REF!"}},"C"]
[null,null,"TOTAL",null,{"$f":"+E151+E152","v":0.5},{"$f":"+F151+F152","v":0},{"$f":"+G151+G152","v":5},8,8.5,8.5,9.5,13,13,{"$error":"#REF!"},{"$error":"#REF!"},{"$error":"#REF!"},{"$error":"#REF!"},{"$error":"#REF!"},{"$f":"+S151+S152","v":{"$error":"#REF!"}},{"$error":"#REF!"},{"$error":"#REF!"},{"$error":"#REF!"},{"$error":"#REF!"},{"$error":"#REF!"},{"$error":"#REF!"},{"$error":"#REF!"},{"$error":"#REF!"},{"$error":"#REF!"},{"$error":"#REF!"},{"$error":"#REF!"},{"$error":"#REF!"},{"$error":"#REF!"},{"$error":"#REF!"},{"$f":"+AH151+AH152","v":{"$error":"#REF!"}},{"$error":"#REF!"},{"$error":"#REF!"},{"$f":"SUM(AM125:AM150)","v":{"$error":"#REF!"}},null,null,{"$f":"+AN151","v":405},{"$f":"AK153-AN153","v":{"$error":"#REF!"}}]
[null,null,null,null,null,null,null,null,null,null,null,null,null,null,null,null,null,null,null,null,null,null,null,null,null,null,null,null,null,null,"Equivalent ETP (Dir. Inclus) =",null,null,null,null,null,{"$f":"+AK153/36.75","v":{"$error":"#REF!"}}]
[null,null,null,null,null,null,null,null,null,null,null,null,null,null,null,null,null,null,null,null,null,null,null,null,null,null,null,null,null,null,null,null,null,null,null,null,null,null,null,{"$f":"+AN153-30","v":375}]
[null,"Signatures OBLIGATOIRES","Hassan OUAMOUH",null,null,null,null,"Rodrigue MOREIRA",null,null,null,"AKUVI SYLVIA",null,null,"DIALO IDRISSA",null,null,"DIARRA HANNE FATOUMATA",null,null,null,"SHAM LATA",null,null,"PHUONG LINH",null,null,"AMINO FASSOLATH",null,null,"Youcef OULD KADI",null,null,"Emmanuel YAMB KAMEN"]

{"sheet":"Magasins (2)","index":1,"n_rows":151,"n_cols":41,"rows_kept":151,"cut":false,"hidden":true,"merged":[[1,1,1,3],[2,2,2,3],[3,2,3,3],[4,1,8,1],[4,2,4,3],[5,2,5,3],[6,2,6,3],[7,2,7,3],[8,2,8,3],[9,1,11,1],[9,2,9,3],[10,2,10,3],[11,2,11,3],[12,1,15,1],[12,2,12,3],[13,2,13,3],[14,2,14,3],[15,2,15,3],[17,1,17,3],[18,2,18,3],[19,2,19,3],[20,1,24,1],[20,2,20,3],[21,2,21,3],[22,2,22,3],[23,2,23,3],[24,2,24,3],[25,1,27,1],[25,2,25,3],[26,2,26,3],[27,2,27,3],[28,1,31,1],[28,2,28,3],[29,2,29,3],[30,2,30,3],[31,2,31,3],[33,1,33,3],[34,2,34,3],[35,2,35,3],[36,1,40,1],[36,2,36,3],[37,2,37,3],[38,2,38,3],[39,2,39,3],[40,2,40,3],[41,1,43,1],[41,2,41,3],[42,2,42,3],[43,2,43,3],[44,1,47,1],[44,2,44,3],[45,2,45,3],[46,2,46,3],[47,2,47,3],[49,1,49,3],[50,2,50,3],[51,2,51,3],[52,1,56,1],[52,2,52,3],[53,2,53,3],[54,2,54,3],[55,2,55,3],[56,2,56,3],[57,1,59,1],[57,2,57,3],[58,2,58,3],[59,2,59,3],[60,1,63,1],[60,2,60,3],[61,2,61,3],[62,2,62,3],[63,2,63,3],[65,1,65,3],[66,2,66,3],[67,2,67,3],[68,1,72,1],[68,2,68,3],[69,2,69,3],[70,2,70,3],[71,2,71,3],[72,2,72,3],[73,1,75,1],[73,2,73,3],[74,2,74,3],[75,2,75,3],[76,1,79,1],[76,2,76,3],[77,2,77,3],[78,2,78,3],[79,2,79,3],[81,1,81,3],[82,2,82,3],[83,2,83,3],[84,1,88,1],[84,2,84,3],[85,2,85,3],[86,2,86,3],[87,2,87,3],[88,2,88,3],[89,1,91,1],[89,2,89,3],[90,2,90,3],[91,2,91,3],[92,1,95,1],[92,2,92,3],[93,2,93,3],[94,2,94,3],[95,2,95,3],[97,1,97,3],[98,2,98,3],[99,2,99,3],[100,1,104,1],[100,2,100,3],[101,2,101,3],[102,2,102,3],[103,2,103,3],[104,2,104,3],[105,1,107,1],[105,2,105,3],[106,2,106,3],[107,2,107,3],[108,1,111,1],[108,2,108,3],[109,2,109,3],[110,2,110,3],[111,2,111,3],[113,1,116,1],[113,2,113,8],[113,9,113,14],[113,15,113,19],[113,20,113,25],[113,26,113,30],[115,2,115,8],[115,9,115,14],[115,15,115,19],[115,20,115,25],[115,26,115,30],[115,31,115,35],[116,2,116,8],[116,9,116,14],[116,15,116,19],[116,20,116,25],[116,26,116,30],[116,31,116,35],[113,31,113,35],[114,2,114,8],[114,9,114,14],[114,15,114,19],[114,20,114,25],[114,26,114,30],[114,31,114,35],[118,1,118,3],[118,35,118,36],[119,1,147,1],[119,2,120,2],[119,37,120,37],[119,38,120,38],[123,2,124,2],[123,37,124,37],[123,38,124,38],[127,2,128,2],[127,37,128,37],[127,38,128,38],[133,2,134,2],[133,37,134,37],[133,38,134,38],[147,2,147,3],[147,35,147,37],[123,39,124,39],[123,40,124,40],[125,2,126,2],[125,37,126,37],[125,38,126,38],[125,39,126,39],[125,40,126,40],[119,39,120,39],[119,40,120,40],[121,2,122,2],[121,37,122,37],[121,38,122,38],[121,39,122,39],[121,40,122,40],[127,39,128,39],[127,40,128,40],[129,2,130,2],[129,37,130,37],[129,38,130,38],[129,39,130,39],[129,40,130,40],[131,2,132,2],[131,37,132,37],[131,38,132,38],[131,39,132,39],[131,40,132,40],[133,39,134,39],[133,40,134,40],[135,2,136,2],[135,37,136,37],[135,38,136,38],[135,39,136,39],[135,40,136,40],[137,2,138,2],[137,37,138,37],[137,38,138,38],[137,39,138,39],[137,40,138,40],[143,39,144,39],[143,40,144,40],[145,2,146,2],[145,37,146,37],[145,38,146,38],[145,39,146,39],[139,2,140,2],[139,37,140,37],[139,38,140,38],[139,39,140,39],[139,40,140,40],[141,2,142,2],[141,37,142,37],[141,38,142,38],[141,39,142,39],[141,40,142,40],[143,2,144,2],[143,37,144,37],[143,38,144,38],[148,30,148,34],[148,35,148,37],[151,21,151,23],[151,24,151,26],[151,27,151,29],[151,30,151,32],[151,33,151,35],[150,21,150,23],[150,24,150,26],[150,27,150,29],[150,30,150,32],[150,33,150,35],[150,1,151,1],[150,2,150,6],[150,7,150,10],[150,11,150,13],[150,14,150,16],[150,17,150,20],[151,2,151,6],[151,7,151,10],[151,11,151,13],[151,14,151,16],[151,17,151,20]]}
[]
[null,null,null,null,"5h30>6h","6h>6h30","6h30>7h","7h>7h30","7h30>8h","8h>8h30","8h30>9h","9h>9h30","9h30>10h","10h>10h30","10h30>11h","11h>11h30","11h30>12h","12h>12h30","12h30>13h","13h>13h30","13h30>14h","14h>14h30","14h30>15h","15h>15h30","15h30>16h","16h>16h30","16h30>17h","17h>17h30","17h30>18h","18h>18h30","18h30>19h","19h>19h30","19h30>20h","20h>20h30","20h30>21h","TOTAL"]
[null,"r = rayon"]
[null,"c = caisse"]
[null,"lundi"]
[]
[]
[]
[null,null,"Katia Bousba",null,null,null,null,null,null,null,null,null,null,null,null,null,null,null,null,null,null,null,null,null,null,"c","c","c","c","c","c","c","c","c","C",5]
[]
[]
[]
[]
[]
[]
[null,null,"TOTAL",null,{"$f":"COUNTA(E3:E15)*0.5","v":0},{"$f":"COUNTA(F3:F15)*0.5","v":0},{"$f":"COUNTA(G3:G15)*0.5","v":0},0,0,0,0,0,0,0,0,0,0,0,0,0,0,0,0,0,0,{"$f":"COUNTA(Z3:Z15)*0.5","v":0.5},{"$f":"COUNTA(AA3:AA15)*0.5","v":0.5},0.5,0.5,0.5,0.5,0.5,0.5,0.5,0.5,{"$f":"SUM(AJ3:AJ15)","v":5}]
[null,null,null,null,null,null," "]
[null,"2015-03-31",null,null,"5h30>6h","6h>6h30","6h30>7h","7h>7h30","7h30>8h","8h>8h30","8h30>9h","9h>9h30","9h30>10h","10h>10h30","10h30>11h","11h>11h30","11h30>12h","12h>12h30","12h30>13h","13h>13h30","13h30>14h","14h>14h30","14h30>15h","15h>15h30","15h30>16h","16h>16h30","16h30>17h","17h>17h30","17h30>18h","18h>18h30","18h30>19h","19h>19h30","19h30>20h","20h>20h30","20h30>21h","TOTAL"]
[null,"r = rayon"]
[null,"c = caisse"]
[null,"mardi"]
[]
[]
[]
[null,null,"Katia Bousba"]
[]
[]
[]
[]
[]
[]
[null,null,"TOTAL",null,{"$f":"COUNTA(E19:E31)*0.5","v":0},{"$f":"COUNTA(F19:F31)*0.5","v":0},{"$f":"COUNTA(G19:G31)*0.5","v":0},0,0,0,0,0,0,0,0,0,0,0,0,0,0,0,0,0,0,{"$f":"COUNTA(Z19:Z31)*0.5","v":0},{"$f":"COUNTA(AA19:AA31)*0.5","v":0},0,0,0,0,0,0,0,0,{"$f":"SUM(AJ19:AJ31)","v":0}]
[]
[null,"2015-04-01",null,null,"5h30>6h","6h>6h30","6h30>7h","7h>7h30","7h30>8h","8h>8h30","8h30>9h","9h>9h30","9h30>10h","10h>10h30","10h30>11h","11h>11h30","11h30>12h","12h>12h30","12h30>13h","13h>13h30","13h30>14h","14h>14h30","14h30>15h","15h>15h30","15h30>16h","16h>16h30","16h30>17h","17h>17h30","17h30>18h","18h>18h30","18h30>19h","19h>19h30","19h30>20h","20h>20h30","20h30>21h","TOTAL"]
[null,"r = rayon"]
[null,"c = caisse"]
[null,"Mercredi"]
[]
[]
[]
[null,null,"Katia Bousba",null,null,null,null,null,null,null,null,null,null,null,null,"c","c","c","c","c","c",null,null,null,null,null,null,null,"c","c","c","c","c","c","c",6.5]
[]
[]
[]
[]
[]
[]
[null,null,"TOTAL",null,{"$f":"COUNTA(E35:E47)*0.5","v":0},{"$f":"COUNTA(F35:F47)*0.5","v":0},{"$f":"COUNTA(G35:G47)*0.5","v":0},0,0,0,0,0,0,0,0,0.5,0.5,0.5,0.5,0.5,0.5,0,0,0,0,{"$f":"COUNTA(Z35:Z47)*0.5","v":0},{"$f":"COUNTA(AA35:AA47)*0.5","v":0},0,0.5,0.5,0.5,0.5,0.5,0.5,0.5,{"$f":"SUM(AJ35:AJ47)","v":6.5}]
[]
[null,"2015-04-02",null,null,"5h30>6h","6h>6h30","6h30>7h","7h>7h30","7h30>8h","8h>8h30","8h30>9h","9h>9h30","9h30>10h","10h>10h30","10h30>11h","11h>11h30","11h30>12h","12h>12h30","12h30>13h","13h>13h30","13h30>14h","14h>14h30","14h30>15h","15h>15h30","15h30>16h","16h>16h30","16h30>17h","17h>17h30","17h30>18h","18h>18h30","18h30>19h","19h>19h30","19h30>20h","20h>20h30","20h30>21h","TOTAL"]
[null,"r = rayon"]
[null,"c = caisse"]
[null,"Jeudi"]
[]
[]
[]
[null,null,"Katia Bousba",null,null,null,null,null,null,null,null,null,null,null,null,null,null,null,null,null,null,null,null,null,null,"c","c","c","c","c","c","c","c","c","C",5]
[]
[]
[]
[]
[]
[]
[null,null,"TOTAL",null,{"$f":"COUNTA(E51:E63)*0.5","v":0},{"$f":"COUNTA(F51:F63)*0.5","v":0},{"$f":"COUNTA(G51:G63)*0.5","v":0},0,0,0,0,0,0,0,0,0,0,0,0,0,0,0,0,0,0,{"$f":"COUNTA(Z51:Z63)*0.5","v":0.5},{"$f":"COUNTA(AA51:AA63)*0.5","v":0.5},0.5,0.5,0.5,0.5,0.5,0.5,0.5,0.5,{"$f":"SUM(AJ51:AJ63)","v":5}]
[]
[null,"2015-04-03",null,null,"5h30>6h","6h>6h30","6h30>7h","7h>7h30","7h30>8h","8h>8h30","8h30>9h","9h>9h30","9h30>10h","10h>10h30","10h30>11h","11h>11h30","11h30>12h","12h>12h30","12h30>13h","13h>13h30","13h30>14h","14h>14h30","14h30>15h","15h>15h30","15h30>16h","16h>16h30","16h30>17h","17h>17h30","17h30>18h","18h>18h30","18h30>19h","19h>19h30","19h30>20h","20h>20h30","20h30>21h","TOTAL"]
[null,"r = rayon"]
[null,"c = caisse"]
[null,"Vendredi"]
[]
[]
[]
[null,null,"Katia Bousba",null,null,null,null,null,null,null,null,null,null,null,null,"c","c","c","c","C","C","C","C",null,null,null,null,"c","C","C","c","c","c","c","C",8]
[]
[]
[]
[]
[]
[]
[null,null,"TOTAL",null,{"$f":"COUNTA(E67:E79)*0.5","v":0},{"$f":"COUNTA(F67:F79)*0.5","v":0},{"$f":"COUNTA(G67:G79)*0.5","v":0},0,0,0,0,0,0,0,0,0.5,0.5,0.5,0.5,0.5,0.5,0.5,0.5,0,0,{"$f":"COUNTA(Z67:Z79)*0.5","v":0},{"$f":"COUNTA(AA67:AA79)*0.5","v":0},0.5,0.5,0.5,0.5,0.5,0.5,0.5,0.5,{"$f":"SUM(AJ67:AJ79)","v":8}]
[]
[null,"2015-04-04",null,null,"5h30>6h","6h>6h30","6h30>7h","7h>7h30","7h30>8h","8h>8h30","8h30>9h","9h>9h30","9h30>10h","10h>10h30","10h30>11h","11h>11h30","11h30>12h","12h>12h30","12h30>13h","13h>13h30","13h30>14h","14h>14h30","14h30>15h","15h>15h30","15h30>16h","16h>16h30","16h30>17h","17h>17h30","17h30>18h","18h>18h30","18h30>19h","19h>19h30","19h30>20h","20h>20h30","20h30>21h","TOTAL"]
[null,"r = rayon"]
[null,"c = caisse"]
[null,"Samedi"]
[]
[]
[]
[null,null,"Katia Bousba",null,null,null,null,null,null,null,null,null,null,null,null,null,null,null,null,null,null,null,null,null,null,"c","c","c","c","c","c","c","c","c","C",5]
[]
[]
[]
[]
[]
[]
[null,null,"TOTAL",null,{"$f":"COUNTA(E83:E95)*0.5","v":0},{"$f":"COUNTA(F83:F95)*0.5","v":0},{"$f":"COUNTA(G83:G95)*0.5","v":0},0,0,0,0,0,0,0,0,0,0,0,0,0,0,0,0,0,0,{"$f":"COUNTA(Z83:Z95)*0.5","v":0.5},{"$f":"COUNTA(AA83:AA95)*0.5","v":0.5},0.5,0.5,0.5,0.5,0.5,0.5,0.5,0.5,{"$f":"SUM(AJ83:AJ95)","v":5}]
[]
[null,"2015-04-05",null,null,"5h30>6h","6h>6h30","6h30>7h","7h>7h30","7h30>8h","8h>8h30","8h30>9h","9h>9h30","9h30>10h","10h>10h30","10h30>11h","11h>11h30","11h30>12h","12h>12h30","12h30>13h","13h>13h30","13h30>14h","14h>14h30","14h30>15h","15h>15h30","15h30>16h","16h>16h30","16h30>17h","17h>17h30","17h30>18h","18h>18h30","18h30>19h","19h>19h30","19h30>20h","20h>20h30","20h30>21h","TOTAL"]
[null,"r = rayon",null,null,"c"]
[null,"c = caisse"]
[null,"Dimanche"]
[]
[]
[]
[null,null,"Katia Bousba",null,null,null,null,null,null,null,"C","C","C","C","C","C","C","C","C","C","C",null,null,null,null,null,null,null,null,null,null,null,null,null,null,5.5]
[]
[]
[]
[]
[]
[]
[null,null,"TOTAL",null,{"$f":"COUNTA(E99:E111)*0.5","v":0.5},{"$f":"COUNTA(F99:F111)*0.5","v":0},{"$f":"COUNTA(G99:G111)*0.5","v":0},0,0,0,0.5,0.5,0.5,0.5,0.5,0.5,0.5,0.5,0.5,0.5,0.5,0,0,0,0,{"$f":"COUNTA(Z99:Z111)*0.5","v":0},{"$f":"COUNTA(AA99:AA111)*0.5","v":0},0,0,0,0,0,0,0,0]
[]
[null,"Signatures OBLIGATOIRES","Hassan OUAMOUH",null,null,null,null,null,null,"Rodrigue MOREIRA",null,null,null,null,null,"AKUVI SYLVIA",null,null,null,null,"MOMO",null,null,null,null,null,"DIARRA HANNE FATOUMATA",null,null,null,null,"SHAM LATA"]
[]
[null,null,{"$f":"+C106","v":0},null,null,null,null,null,null,{"$f":"+C107","v":0},null,null,null,null,null,"Youcef OULD KADI",null,null,null,null,null,null,null,null,null,null,null,null,null,null,null,"Elyess CHELBI"]
[]
[]
[null,"Planning",null,null,"5h30>6h","6h>6h30","6h30>7h","7h>7h30","7h30>8h","8h>8h30","8h30>9h","9h>9h30","9h30>10h","10h>10h30","10h30>11h","11h>11h30","11h30>12h","12h>12h30","12h30>13h","13h>13h30","13h30>14h","14h>14h30","14h30>15h","15h>15h30","15h30>16h","16h>16h30","16h30>17h","17h>17h30","17h30>18h","18h>18h30","18h30>19h","19h>19h30","19h30>20h","20h>20h30","20h30>21h","SOUS-TOTAL",null,"TOTAL","Contrat","Différence"]
[null,"TOTAL Semaine","Directeur","R",{"$f":"IF(E3=\"r\",1,0)+IF(E19=\"r\",1,0)+IF(E35=\"r\",1,0)+IF(E51=\"r\",1,0)+IF(E67=\"r\",1,0)+IF(E83=\"r\",1,0)+IF(E99=\"r\",1,0)/2","v":0},{"$f":"IF(F3=\"r\",1,0)+IF(F19=\"r\",1,0)+IF(F35=\"r\",1,0)+IF(F51=\"r\",1,0)+IF(F67=\"r\",1,0)+IF(F83=\"r\",1,0)+IF(F99=\"r\",1,0)/2","v":0},{"$f":"(IF(G3=\"r\",1,0)+IF(G19=\"r\",1,0)+IF(G35=\"r\",1,0)+IF(G51=\"r\",1,0)+IF(G67=\"r\",1,0)+IF(G83=\"r\",1,0)+IF(G99=\"r\",1,0))/2","v":0},{"$f":"(IF(H3=\"r\",1,0)+IF(H19=\"r\",1,0)+IF(H35=\"r\",1,0)+IF(H51=\"r\",1,0)+IF(H67=\"r\",1,0)+IF(H83=\"r\",1,0)+IF(H99=\"r\",1,0))/2","v":0},0,0,0,0,0,0,0,0,0,0,0,0,0,0,0,0,0,0,0,0,0,0,0,0,0,0,0,{"$f":"+SUM(G120:AI120)","v":0},"R",{"$f":"AJ120+AJ121","v":0},51.5,{"$f":"AL120-AM120","v":-51.5},"Directeur"]
[null,null,null,"C",{"$f":"IF(E3=\"c\",1,0)+IF(E19=\"c\",1,0)+IF(E35=\"c\",1,0)+IF(E51=\"c\",1,0)+IF(E67=\"c\",1,0)+IF(E83=\"c\",1,0)+IF(E99=\"c\",1,0)/2","v":0.5},{"$f":"IF(F3=\"c\",1,0)+IF(F19=\"c\",1,0)+IF(F35=\"c\",1,0)+IF(F51=\"c\",1,0)+IF(F67=\"c\",1,0)+IF(F83=\"c\",1,0)+IF(F99=\"c\",1,0)/2","v":0},{"$f":"(IF(G3=\"c\",1,0)+IF(G19=\"c\",1,0)+IF(G35=\"c\",1,0)+IF(G51=\"c\",1,0)+IF(G67=\"c\",1,0)+IF(G83=\"c\",1,0)+IF(G99=\"c\",1,0))/2","v":0},{"$f":"(IF(H3=\"c\",1,0)+IF(H19=\"c\",1,0)+IF(H35=\"c\",1,0)+IF(H51=\"c\",1,0)+IF(H67=\"c\",1,0)+IF(H83=\"c\",1,0)+IF(H99=\"c\",1,0))/2","v":0},0,0,0,0,0,0,0,0,0,0,0,0,0,0,0,0,0,0,0,0,0,0,0,0,0,0,0,0,"C"]
[null,null,"Hassan","R",{"$f":"IF(E4=\"r\",1,0)+IF(E20=\"r\",1,0)+IF(E36=\"r\",1,0)+IF(E52=\"r\",1,0)+IF(E68=\"r\",1,0)+IF(E84=\"r\",1,0)+IF(E100=\"r\",1,0)/2","v":0},{"$f":"IF(F4=\"r\",1,0)+IF(F20=\"r\",1,0)+IF(F36=\"r\",1,0)+IF(F52=\"r\",1,0)+IF(F68=\"r\",1,0)+IF(F84=\"r\",1,0)+IF(F100=\"r\",1,0)/2","v":0},{"$f":"(IF(G4=\"r\",1,0)+IF(G20=\"r\",1,0)+IF(G36=\"r\",1,0)+IF(G52=\"r\",1,0)+IF(G68=\"r\",1,0)+IF(G84=\"r\",1,0)+IF(G100=\"r\",1,0))/2","v":0},{"$f":"(IF(H4=\"r\",1,0)+IF(H20=\"r\",1,0)+IF(H36=\"r\",1,0)+IF(H52=\"r\",1,0)+IF(H68=\"r\",1,0)+IF(H84=\"r\",1,0)+IF(H100=\"r\",1,0))/2","v":0},0,0,0,0,0,0,0,0,0,0,0,0,0,0,0,0,0,0,0,0,0,0,0,0,0,0,0,0,"R",{"$f":"AJ122+AJ123","v":0},39,{"$f":"AL122-AM122","v":-39},"Hassan"]
[null,null,"Hassan","C",{"$f":"IF(E4=\"c\",1,0)+IF(E20=\"c\",1,0)+IF(E36=\"c\",1,0)+IF(E52=\"c\",1,0)+IF(E68=\"c\",1,0)+IF(E84=\"c\",1,0)+IF(E100=\"c\",1,0)/2","v":0},{"$f":"IF(F4=\"c\",1,0)+IF(F20=\"c\",1,0)+IF(F36=\"c\",1,0)+IF(F52=\"c\",1,0)+IF(F68=\"c\",1,0)+IF(F84=\"c\",1,0)+IF(F100=\"c\",1,0)/2","v":0},{"$f":"(IF(G4=\"c\",1,0)+IF(G20=\"c\",1,0)+IF(G36=\"c\",1,0)+IF(G52=\"c\",1,0)+IF(G68=\"c\",1,0)+IF(G84=\"c\",1,0)+IF(G100=\"c\",1,0))/2","v":0},{"$f":"(IF(H4=\"c\",1,0)+IF(H20=\"c\",1,0)+IF(H36=\"c\",1,0)+IF(H52=\"c\",1,0)+IF(H68=\"c\",1,0)+IF(H84=\"c\",1,0)+IF(H100=\"c\",1,0))/2","v":0},0,0,0,0,0,0,0,0,0,0,0,0,0,0,0,0,0,0,0,0,0,0,0,0,0,0,0,0,"C",null,null,null,"Hassan"]
[null,null,"Rodrigue","R",{"$f":"IF(E5=\"r\",1,0)+IF(E21=\"r\",1,0)+IF(E37=\"r\",1,0)+IF(E53=\"r\",1,0)+IF(E69=\"r\",1,0)+IF(E85=\"r\",1,0)+IF(E101=\"r\",1,0)/2","v":0},{"$f":"IF(F5=\"r\",1,0)+IF(F21=\"r\",1,0)+IF(F37=\"r\",1,0)+IF(F53=\"r\",1,0)+IF(F69=\"r\",1,0)+IF(F85=\"r\",1,0)+IF(F101=\"r\",1,0)/2","v":0},{"$f":"(IF(G5=\"r\",1,0)+IF(G21=\"r\",1,0)+IF(G37=\"r\",1,0)+IF(G53=\"r\",1,0)+IF(G69=\"r\",1,0)+IF(G85=\"r\",1,0)+IF(G101=\"r\",1,0))/2","v":0},{"$f":"(IF(H5=\"r\",1,0)+IF(H21=\"r\",1,0)+IF(H37=\"r\",1,0)+IF(H53=\"r\",1,0)+IF(H69=\"r\",1,0)+IF(H85=\"r\",1,0)+IF(H101=\"r\",1,0))/2","v":0},0,0,0,0,0,0,0,0,0,0,0,0,0,0,0,0,0,0,0,0,0,0,0,0,0,0,0,0,"R",{"$f":"AJ124+AJ125","v":0},39,{"$f":"AL124-AM124","v":-39},"Rodrigue"]
[null,null,"Rodrigue","C",{"$f":"IF(E5=\"c\",1,0)+IF(E21=\"c\",1,0)+IF(E37=\"c\",1,0)+IF(E53=\"c\",1,0)+IF(E69=\"c\",1,0)+IF(E85=\"c\",1,0)+IF(E101=\"c\",1,0)/2","v":0},{"$f":"IF(F5=\"c\",1,0)+IF(F21=\"c\",1,0)+IF(F37=\"c\",1,0)+IF(F53=\"c\",1,0)+IF(F69=\"c\",1,0)+IF(F85=\"c\",1,0)+IF(F101=\"c\",1,0)/2","v":0},{"$f":"(IF(G5=\"c\",1,0)+IF(G21=\"c\",1,0)+IF(G37=\"c\",1,0)+IF(G53=\"c\",1,0)+IF(G69=\"c\",1,0)+IF(G85=\"c\",1,0)+IF(G101=\"c\",1,0))/2","v":0},{"$f":"(IF(H5=\"c\",1,0)+IF(H21=\"c\",1,0)+IF(H37=\"c\",1,0)+IF(H53=\"c\",1,0)+IF(H69=\"c\",1,0)+IF(H85=\"c\",1,0)+IF(H101=\"c\",1,0))/2","v":0},0,0,0,0,0,0,0,0,0,0,0,0,0,0,0,0,0,0,0,0,0,0,0,0,0,0,0,0,"C",null,null,null,"Rodrigue"]
[null,null,{"$f":"+C102","v":0},"R",{"$f":"IF(E6=\"r\",1,0)+IF(E22=\"r\",1,0)+IF(E38=\"r\",1,0)+IF(E54=\"r\",1,0)+IF(E70=\"r\",1,0)+IF(E86=\"r\",1,0)+IF(E102=\"r\",1,0)/2","v":0},{"$f":"IF(F6=\"r\",1,0)+IF(F22=\"r\",1,0)+IF(F38=\"r\",1,0)+IF(F54=\"r\",1,0)+IF(F70=\"r\",1,0)+IF(F86=\"r\",1,0)+IF(F102=\"r\",1,0)/2","v":0},{"$f":"(IF(G6=\"r\",1,0)+IF(G22=\"r\",1,0)+IF(G38=\"r\",1,0)+IF(G54=\"r\",1,0)+IF(G70=\"r\",1,0)+IF(G86=\"r\",1,0)+IF(G102=\"r\",1,0))/2","v":0},{"$f":"(IF(H6=\"r\",1,0)+IF(H22=\"r\",1,0)+IF(H38=\"r\",1,0)+IF(H54=\"r\",1,0)+IF(H70=\"r\",1,0)+IF(H86=\"r\",1,0)+IF(H102=\"r\",1,0))/2","v":0},0,0,0,0,0,0,0,0,0,0,0,0,0,0,0,0,0,0,0,0,0,0,0,0,0,0,0,0,"R",{"$f":"AJ126+AJ127","v":0},30,{"$f":"AL126-AM126","v":-30},{"$f":"+C126","v":0}]
[null,null,"ELS 1","C",{"$f":"IF(E6=\"c\",1,0)+IF(E22=\"c\",1,0)+IF(E38=\"c\",1,0)+IF(E54=\"c\",1,0)+IF(E70=\"c\",1,0)+IF(E86=\"c\",1,0)+IF(E102=\"c\",1,0)","v":0},{"$f":"IF(F6=\"c\",1,0)+IF(F22=\"c\",1,0)+IF(F38=\"c\",1,0)+IF(F54=\"c\",1,0)+IF(F70=\"c\",1,0)+IF(F86=\"c\",1,0)+IF(F102=\"c\",1,0)","v":0},{"$f":"(IF(G6=\"c\",1,0)+IF(G22=\"c\",1,0)+IF(G38=\"c\",1,0)+IF(G54=\"c\",1,0)+IF(G70=\"c\",1,0)+IF(G86=\"c\",1,0)+IF(G102=\"c\",1,0))/2","v":0},{"$f":"(IF(H6=\"c\",1,0)+IF(H22=\"c\",1,0)+IF(H38=\"c\",1,0)+IF(H54=\"c\",1,0)+IF(H70=\"c\",1,0)+IF(H86=\"c\",1,0)+IF(H102=\"c\",1,0))/2","v":0},0,0,0,0,0,0,0,0,0,0,0,0,0,0,0,0,0,0,0,0,0,0,0,0,0,0,0,0,"C",null,null,null,"ELS 1"]
[null,null,{"$f":"+C103","v":0},"R",{"$f":"IF(E7=\"r\",1,0)+IF(E23=\"r\",1,0)+IF(E39=\"r\",1,0)+IF(E55=\"r\",1,0)+IF(E71=\"r\",1,0)+IF(E87=\"r\",1,0)+IF(E103=\"r\",1,0)/2","v":0},{"$f":"IF(F7=\"r\",1,0)+IF(F23=\"r\",1,0)+IF(F39=\"r\",1,0)+IF(F55=\"r\",1,0)+IF(F71=\"r\",1,0)+IF(F87=\"r\",1,0)+IF(F103=\"r\",1,0)/2","v":0},{"$f":"(IF(G7=\"r\",1,0)+IF(G23=\"r\",1,0)+IF(G39=\"r\",1,0)+IF(G55=\"r\",1,0)+IF(G71=\"r\",1,0)+IF(G87=\"r\",1,0)+IF(G103=\"r\",1,0))/2","v":0},{"$f":"(IF(H7=\"r\",1,0)+IF(H23=\"r\",1,0)+IF(H39=\"r\",1,0)+IF(H55=\"r\",1,0)+IF(H71=\"r\",1,0)+IF(H87=\"r\",1,0)+IF(H103=\"r\",1,0))/2","v":0},0,0,0,0,0,0,0,0,0,0,0,0,0,0,0,0,0,0,0,0,0,0,0,0,0,0,0,0,"R",{"$f":"AJ128+AJ129","v":0},35,{"$f":"AL128-AM128","v":-35},{"$f":"+C128","v":0}]
[null,null,"ELS 2","C",{"$f":"IF(E7=\"c\",1,0)+IF(E23=\"c\",1,0)+IF(E39=\"c\",1,0)+IF(E55=\"c\",1,0)+IF(E71=\"c\",1,0)+IF(E87=\"c\",1,0)+IF(E103=\"c\",1,0)/2","v":0},{"$f":"IF(F7=\"c\",1,0)+IF(F23=\"c\",1,0)+IF(F39=\"c\",1,0)+IF(F55=\"c\",1,0)+IF(F71=\"c\",1,0)+IF(F87=\"c\",1,0)+IF(F103=\"c\",1,0)/2","v":0},{"$f":"(IF(G7=\"c\",1,0)+IF(G23=\"c\",1,0)+IF(G39=\"c\",1,0)+IF(G55=\"c\",1,0)+IF(G71=\"c\",1,0)+IF(G87=\"c\",1,0)+IF(G103=\"c\",1,0))/2","v":0},{"$f":"(IF(H7=\"c\",1,0)+IF(H23=\"c\",1,0)+IF(H39=\"c\",1,0)+IF(H55=\"c\",1,0)+IF(H71=\"c\",1,0)+IF(H87=\"c\",1,0)+IF(H103=\"c\",1,0))/2","v":0},0,0,0,0,0,0,0,0,0,0,0,0,0,0,0,0,0,0,0,0,0,0,0,0,0,0,0,0,"C",null,null,null,"ELS 2"]
[null,null,{"$f":"+C104","v":0},"R",{"$f":"IF(E8=\"r\",1,0)+IF(E24=\"r\",1,0)+IF(E40=\"r\",1,0)+IF(E56=\"r\",1,0)+IF(E72=\"r\",1,0)+IF(E88=\"r\",1,0)+IF(E104=\"r\",1,0)/2","v":0},{"$f":"IF(F8=\"r\",1,0)+IF(F24=\"r\",1,0)+IF(F40=\"r\",1,0)+IF(F56=\"r\",1,0)+IF(F72=\"r\",1,0)+IF(F88=\"r\",1,0)+IF(F104=\"r\",1,0)/2","v":0},{"$f":"(IF(G8=\"r\",1,0)+IF(G24=\"r\",1,0)+IF(G40=\"r\",1,0)+IF(G56=\"r\",1,0)+IF(G72=\"r\",1,0)+IF(G88=\"r\",1,0)+IF(G104=\"r\",1,0))/2","v":0},{"$f":"(IF(H8=\"r\",1,0)+IF(H24=\"r\",1,0)+IF(H40=\"r\",1,0)+IF(H56=\"r\",1,0)+IF(H72=\"r\",1,0)+IF(H88=\"r\",1,0)+IF(H104=\"r\",1,0))/2","v":0},0,0,0,0,0,0,0,0,0,0,0,0,0,0,0,0,0,0,0,0,0,0,0,0,0,0,0,0,"R",{"$f":"AJ130+AJ131","v":0},35,{"$f":"AL130-AM130","v":-35},{"$f":"+C130","v":0}]
[null,null,"ELS 3","C",{"$f":"IF(E8=\"c\",1,0)+IF(E24=\"c\",1,0)+IF(E40=\"c\",1,0)+IF(E56=\"c\",1,0)+IF(E72=\"c\",1,0)+IF(E88=\"c\",1,0)+IF(E104=\"c\",1,0)/2","v":0},{"$f":"IF(F8=\"c\",1,0)+IF(F24=\"c\",1,0)+IF(F40=\"c\",1,0)+IF(F56=\"c\",1,0)+IF(F72=\"c\",1,0)+IF(F88=\"c\",1,0)+IF(F104=\"c\",1,0)/2","v":0},{"$f":"(IF(G8=\"c\",1,0)+IF(G24=\"c\",1,0)+IF(G40=\"c\",1,0)+IF(G56=\"c\",1,0)+IF(G72=\"c\",1,0)+IF(G88=\"c\",1,0)+IF(G104=\"c\",1,0))/2","v":0},{"$f":"(IF(H8=\"c\",1,0)+IF(H24=\"c\",1,0)+IF(H40=\"c\",1,0)+IF(H56=\"c\",1,0)+IF(H72=\"c\",1,0)+IF(H88=\"c\",1,0)+IF(H104=\"c\",1,0))/2","v":0},0,0,0,0,0,0,0,0,0,0,0,0,0,0,0,0,0,0,0,0,0,0,0,0,0,0,0,0,"C",null,null,null,"ELS 3"]
[null,null,{"$f":"+C105","v":"Katia Bousba"},"R",{"$f":"IF(E9=\"r\",1,0)+IF(E25=\"r\",1,0)+IF(E41=\"r\",1,0)+IF(E57=\"r\",1,0)+IF(E73=\"r\",1,0)+IF(E89=\"r\",1,0)+IF(E105=\"r\",1,0)/2","v":0},{"$f":"IF(F9=\"r\",1,0)+IF(F25=\"r\",1,0)+IF(F41=\"r\",1,0)+IF(F57=\"r\",1,0)+IF(F73=\"r\",1,0)+IF(F89=\"r\",1,0)+IF(F105=\"r\",1,0)/2","v":0},{"$f":"(IF(G9=\"r\",1,0)+IF(G25=\"r\",1,0)+IF(G41=\"r\",1,0)+IF(G57=\"r\",1,0)+IF(G73=\"r\",1,0)+IF(G89=\"r\",1,0)+IF(G105=\"r\",1,0))/2","v":0},{"$f":"(IF(H9=\"r\",1,0)+IF(H25=\"r\",1,0)+IF(H41=\"r\",1,0)+IF(H57=\"r\",1,0)+IF(H73=\"r\",1,0)+IF(H89=\"r\",1,0)+IF(H105=\"r\",1,0))/2","v":0},0,0,0,0,0,0,0,0,0,0,0,0,0,0,0,0,0,0,0,0,0,0,0,0,0,0,0,0,"R",{"$f":"AJ132+AJ133","v":35},39,{"$f":"AL132-AM132","v":-4},{"$f":"+C132","v":"Katia Bousba"}]
[null,null,"ELS 4","C",{"$f":"IF(E9=\"c\",1,0)+IF(E25=\"c\",1,0)+IF(E41=\"c\",1,0)+IF(E57=\"c\",1,0)+IF(E73=\"c\",1,0)+IF(E89=\"c\",1,0)+IF(E105=\"c\",1,0)/2","v":0},{"$f":"IF(F9=\"c\",1,0)+IF(F25=\"c\",1,0)+IF(F41=\"c\",1,0)+IF(F57=\"c\",1,0)+IF(F73=\"c\",1,0)+IF(F89=\"c\",1,0)+IF(F105=\"c\",1,0)/2","v":0},{"$f":"(IF(G9=\"c\",1,0)+IF(G25=\"c\",1,0)+IF(G41=\"c\",1,0)+IF(G57=\"c\",1,0)+IF(G73=\"c\",1,0)+IF(G89=\"c\",1,0)+IF(G105=\"c\",1,0))/2","v":0},{"$f":"(IF(H9=\"c\",1,0)+IF(H25=\"c\",1,0)+IF(H41=\"c\",1,0)+IF(H57=\"c\",1,0)+IF(H73=\"c\",1,0)+IF(H89=\"c\",1,0)+IF(H105=\"c\",1,0))/2","v":0},0,0,0.5,0.5,0.5,0.5,0.5,1.5,1.5,1.5,1.5,1.5,1.5,0.5,0.5,0,0,1.5,1.5,2,2.5,2.5,2.5,2.5,2.5,2.5,2.5,35,"C",null,null,null,"ELS 4"]
[null,null,{"$f":"+C106","v":0},"R",{"$f":"IF(E10=\"r\",1,0)+IF(E26=\"r\",1,0)+IF(E42=\"r\",1,0)+IF(E58=\"r\",1,0)+IF(E74=\"r\",1,0)+IF(E90=\"r\",1,0)+IF(E106=\"r\",1,0)/2","v":0},{"$f":"IF(F10=\"r\",1,0)+IF(F26=\"r\",1,0)+IF(F42=\"r\",1,0)+IF(F58=\"r\",1,0)+IF(F74=\"r\",1,0)+IF(F90=\"r\",1,0)+IF(F106=\"r\",1,0)/2","v":0},{"$f":"(IF(G10=\"r\",1,0)+IF(G26=\"r\",1,0)+IF(G42=\"r\",1,0)+IF(G58=\"r\",1,0)+IF(G74=\"r\",1,0)+IF(G90=\"r\",1,0)+IF(G106=\"r\",1,0))/2","v":0},{"$f":"(IF(H10=\"r\",1,0)+IF(H26=\"r\",1,0)+IF(H42=\"r\",1,0)+IF(H58=\"r\",1,0)+IF(H74=\"r\",1,0)+IF(H90=\"r\",1,0)+IF(H106=\"r\",1,0))/2","v":0},0,0,0,0,0,0,0,0,0,0,0,0,0,0,0,0,0,0,0,{"$f":"(IF(AB10=\"r\",1,0)+IF(#REF!=\"r\",1,0)+IF(AB42=\"r\",1,0)+IF(AB58=\"r\",1,0)+IF(AB74=\"r\",1,0)+IF(AB90=\"r\",1,0)+IF(AB106=\"r\",1,0))/2","v":{"$error":"#REF!"}},{"$f":"(IF(AC10=\"r\",1,0)+IF(#REF!=\"r\",1,0)+IF(AC42=\"r\",1,0)+IF(AC58=\"r\",1,0)+IF(AC74=\"r\",1,0)+IF(AC90=\"r\",1,0)+IF(AC106=\"r\",1,0))/2","v":{"$error":"#REF!"}},{"$f":"(IF(#REF!=\"r\",1,0)+IF(#REF!=\"r\",1,0)+IF(AD42=\"r\",1,0)+IF(AD58=\"r\",1,0)+IF(AD74=\"r\",1,0)+IF(AD90=\"r\",1,0)+IF(AD106=\"r\",1,0))/2","v":{"$error":"#REF!"}},{"$f":"(IF(#REF!=\"r\",1,0)+IF(#REF!=\"r\",1,0)+IF(AE42=\"r\",1,0)+IF(AE58=\"r\",1,0)+IF(AE74=\"r\",1,0)+IF(AE90=\"r\",1,0)+IF(AE106=\"r\",1,0))/2","v":{"$error":"#REF!"}},{"$f":"(IF(#REF!=\"r\",1,0)+IF(#REF!=\"r\",1,0)+IF(AF42=\"r\",1,0)+IF(AF58=\"r\",1,0)+IF(AF74=\"r\",1,0)+IF(AF90=\"r\",1,0)+IF(AF106=\"r\",1,0))/2","v":{"$error":"#REF!"}},{"$f":"(IF(#REF!=\"r\",1,0)+IF(#REF!=\"r\",1,0)+IF(AG42=\"r\",1,0)+IF(AG58=\"r\",1,0)+IF(AG74=\"r\",1,0)+IF(AG90=\"r\",1,0)+IF(AG106=\"r\",1,0))/2","v":{"$error":"#REF!"}},{"$f":"(IF(#REF!=\"r\",1,0)+IF(#REF!=\"r\",1,0)+IF(AH42=\"r\",1,0)+IF(AH58=\"r\",1,0)+IF(AH74=\"r\",1,0)+IF(AH90=\"r\",1,0)+IF(AH106=\"r\",1,0))/2","v":{"$error":"#REF!"}},{"$f":"(IF(#REF!=\"r\",1,0)+IF(#REF!=\"r\",1,0)+IF(AI42=\"r\",1,0)+IF(AI58=\"r\",1,0)+IF(AI74=\"r\",1,0)+IF(AI90=\"r\",1,0)+IF(AI106=\"r\",1,0))/2","v":{"$error":"#REF!"}},{"$error":"#REF!"},"R",{"$f":"AJ134+AJ135","v":{"$error":"#REF!"}},15,{"$f":"AL134-AM134","v":{"$error":"#REF!"}},{"$f":"+C134","v":0}]
[null,null,"ELS 5","C",{"$f":"IF(E10=\"C\",1,0)+IF(E26=\"C\",1,0)+IF(E42=\"C\",1,0)+IF(E58=\"C\",1,0)+IF(E74=\"C\",1,0)+IF(E90=\"C\",1,0)+IF(E106=\"C\",1,0)/2","v":0},{"$f":"IF(F10=\"C\",1,0)+IF(F26=\"C\",1,0)+IF(F42=\"C\",1,0)+IF(F58=\"C\",1,0)+IF(F74=\"C\",1,0)+IF(F90=\"C\",1,0)+IF(F106=\"C\",1,0)/2","v":0},{"$f":"(IF(G10=\"C\",1,0)+IF(G26=\"C\",1,0)+IF(G42=\"C\",1,0)+IF(G58=\"C\",1,0)+IF(G74=\"C\",1,0)+IF(G90=\"C\",1,0)+IF(G106=\"C\",1,0))/2","v":0},{"$f":"(IF(H10=\"C\",1,0)+IF(H26=\"C\",1,0)+IF(H42=\"C\",1,0)+IF(H58=\"C\",1,0)+IF(H74=\"C\",1,0)+IF(H90=\"C\",1,0)+IF(H106=\"C\",1,0))/2","v":0},0,0,0,0,0,0,0,0,0,0,0,0,0,0,0,0,0,0,0,{"$f":"(IF(AB10=\"C\",1,0)+IF(#REF!=\"C\",1,0)+IF(AB42=\"C\",1,0)+IF(AB58=\"C\",1,0)+IF(AB74=\"C\",1,0)+IF(AB90=\"C\",1,0)+IF(AB106=\"C\",1,0))/2","v":{"$error":"#REF!"}},{"$f":"(IF(AC10=\"C\",1,0)+IF(#REF!=\"C\",1,0)+IF(AC42=\"C\",1,0)+IF(AC58=\"C\",1,0)+IF(AC74=\"C\",1,0)+IF(AC90=\"C\",1,0)+IF(AC106=\"C\",1,0))/2","v":{"$error":"#REF!"}},{"$f":"(IF(#REF!=\"C\",1,0)+IF(#REF!=\"C\",1,0)+IF(AD42=\"C\",1,0)+IF(AD58=\"C\",1,0)+IF(AD74=\"C\",1,0)+IF(AD90=\"C\",1,0)+IF(AD106=\"C\",1,0))/2","v":{"$error":"#REF!"}},{"$f":"(IF(#REF!=\"C\",1,0)+IF(#REF!=\"C\",1,0)+IF(AE42=\"C\",1,0)+IF(AE58=\"C\",1,0)+IF(AE74=\"C\",1,0)+IF(AE90=\"C\",1,0)+IF(AE106=\"C\",1,0))/2","v":{"$error":"#REF!"}},{"$f":"(IF(#REF!=\"C\",1,0)+IF(#REF!=\"C\",1,0)+IF(AF42=\"C\",1,0)+IF(AF58=\"C\",1,0)+IF(AF74=\"C\",1,0)+IF(AF90=\"C\",1,0)+IF(AF106=\"C\",1,0))/2","v":{"$error":"#REF!"}},{"$f":"(IF(#REF!=\"C\",1,0)+IF(#REF!=\"C\",1,0)+IF(AG42=\"C\",1,0)+IF(AG58=\"C\",1,0)+IF(AG74=\"C\",1,0)+IF(AG90=\"C\",1,0)+IF(AG106=\"C\",1,0))/2","v":{"$error":"#REF!"}},{"$f":"(IF(#REF!=\"C\",1,0)+IF(#REF!=\"C\",1,0)+IF(AH42=\"C\",1,0)+IF(AH58=\"C\",1,0)+IF(AH74=\"C\",1,0)+IF(AH90=\"C\",1,0)+IF(AH106=\"C\",1,0))/2","v":{"$error":"#REF!"}},{"$f":"(IF(#REF!=\"C\",1,0)+IF(#REF!=\"C\",1,0)+IF(AI42=\"C\",1,0)+IF(AI58=\"C\",1,0)+IF(AI74=\"C\",1,0)+IF(AI90=\"C\",1,0)+IF(AI106=\"C\",1,0))/2","v":{"$error":"#REF!"}},{"$error":"#REF!"},"C",null,null,null,"ELS 5"]
[null,null,{"$f":"+C107","v":0},"R",{"$f":"IF(E11=\"r\",1,0)+IF(E27=\"r\",1,0)+IF(E43=\"r\",1,0)+IF(E59=\"r\",1,0)+IF(E75=\"r\",1,0)+IF(E91=\"r\",1,0)+IF(E107=\"r\",1,0)/2","v":0},{"$f":"IF(F11=\"r\",1,0)+IF(F27=\"r\",1,0)+IF(F43=\"r\",1,0)+IF(F59=\"r\",1,0)+IF(F75=\"r\",1,0)+IF(F91=\"r\",1,0)+IF(F107=\"r\",1,0)/2","v":0},{"$f":"(IF(G11=\"r\",1,0)+IF(G27=\"r\",1,0)+IF(G43=\"r\",1,0)+IF(G59=\"r\",1,0)+IF(G75=\"r\",1,0)+IF(G91=\"r\",1,0)+IF(G107=\"r\",1,0))/2","v":0},{"$f":"(IF(H11=\"r\",1,0)+IF(H27=\"r\",1,0)+IF(H43=\"r\",1,0)+IF(H59=\"r\",1,0)+IF(H75=\"r\",1,0)+IF(H91=\"r\",1,0)+IF(H107=\"r\",1,0))/2","v":0},0,0,0,0,0,0,0,0,0,0,{"$f":"(IF(S11=\"r\",1,0)+IF(S27=\"r\",1,0)+IF(S43=\"r\",1,0)+IF(#REF!=\"r\",1,0)+IF(S75=\"r\",1,0)+IF(S91=\"r\",1,0)+IF(S107=\"r\",1,0))/2","v":{"$error":"#REF!"}},0,0,{"$f":"(IF(V11=\"r\",1,0)+IF(V27=\"r\",1,0)+IF(#REF!=\"r\",1,0)+IF(V59=\"r\",1,0)+IF(V75=\"r\",1,0)+IF(V91=\"r\",1,0)+IF(V107=\"r\",1,0))/2","v":{"$error":"#REF!"}},0,{"$f":"(IF(X11=\"r\",1,0)+IF(X27=\"r\",1,0)+IF(V43=\"r\",1,0)+IF(S59=\"r\",1,0)+IF(X75=\"r\",1,0)+IF(X91=\"r\",1,0)+IF(X107=\"r\",1,0))/2","v":0},0,0,0,0,0,0,0,0,0,0,0,{"$error":"#REF!"},"R",{"$f":"AJ136+AJ137","v":{"$error":"#REF!"}},30,{"$f":"AL136-AM136","v":{"$error":"#REF!"}},{"$f":"+C136","v":0}]
[null,null,"ELS 6","C",{"$f":"IF(E11=\"c\",1,0)+IF(E27=\"c\",1,0)+IF(E43=\"c\",1,0)+IF(E59=\"c\",1,0)+IF(E75=\"c\",1,0)+IF(E91=\"c\",1,0)+IF(E107=\"c\",1,0)/2","v":0},{"$f":"IF(F11=\"c\",1,0)+IF(F27=\"c\",1,0)+IF(F43=\"c\",1,0)+IF(F59=\"c\",1,0)+IF(F75=\"c\",1,0)+IF(F91=\"c\",1,0)+IF(F107=\"c\",1,0)/2","v":0},{"$f":"(IF(G11=\"c\",1,0)+IF(G27=\"c\",1,0)+IF(G43=\"c\",1,0)+IF(G59=\"c\",1,0)+IF(G75=\"c\",1,0)+IF(G91=\"c\",1,0)+IF(G107=\"c\",1,0))/2","v":0},{"$f":"(IF(H11=\"c\",1,0)+IF(H27=\"c\",1,0)+IF(H43=\"c\",1,0)+IF(H59=\"c\",1,0)+IF(H75=\"c\",1,0)+IF(H91=\"c\",1,0)+IF(H107=\"c\",1,0))/2","v":0},0,0,{"$f":"(IF(K11=\"c\",1,0)+IF(K27=\"c\",1,0)+IF(K43=\"c\",1,0)+IF(K59=\"c\",1,0)+IF(K75=\"c\",1,0)+IF(K91=\"c\",1,0)+IF(K107=\"c\",1,0))/2","v":0},0,0,0,0,0,0,0,{"$f":"(IF(S11=\"c\",1,0)+IF(S27=\"c\",1,0)+IF(S43=\"c\",1,0)+IF(#REF!=\"c\",1,0)+IF(S75=\"c\",1,0)+IF(S91=\"c\",1,0)+IF(S107=\"c\",1,0))/2","v":{"$error":"#REF!"}},0,0,{"$f":"(IF(V11=\"c\",1,0)+IF(V27=\"c\",1,0)+IF(#REF!=\"c\",1,0)+IF(V59=\"c\",1,0)+IF(V75=\"c\",1,0)+IF(V91=\"c\",1,0)+IF(V107=\"c\",1,0))/2","v":{"$error":"#REF!"}},0,{"$f":"(IF(X11=\"c\",1,0)+IF(X27=\"c\",1,0)+IF(V43=\"c\",1,0)+IF(S59=\"c\",1,0)+IF(X75=\"c\",1,0)+IF(X91=\"c\",1,0)+IF(X107=\"c\",1,0))/2","v":0},0,0,0,0,0,0,0,0,0,0,0,{"$error":"#REF!"},"C",null,null,null,"ELS 6"]
[null,null,"PATHMAJEYANTH","R",{"$f":"IF(E12=\"r\",1,0)+IF(E28=\"r\",1,0)+IF(E44=\"r\",1,0)+IF(E60=\"r\",1,0)+IF(E76=\"r\",1,0)+IF(E92=\"r\",1,0)+IF(E108=\"r\",1,0)/2","v":0},{"$f":"IF(F12=\"r\",1,0)+IF(F28=\"r\",1,0)+IF(F44=\"r\",1,0)+IF(F60=\"r\",1,0)+IF(F76=\"r\",1,0)+IF(F92=\"r\",1,0)+IF(F108=\"r\",1,0)/2","v":0},{"$f":"(IF(G12=\"r\",1,0)+IF(G28=\"r\",1,0)+IF(G44=\"r\",1,0)+IF(G60=\"r\",1,0)+IF(G76=\"r\",1,0)+IF(G92=\"r\",1,0)+IF(G108=\"r\",1,0))/2","v":0},{"$f":"(IF(H12=\"r\",1,0)+IF(H28=\"r\",1,0)+IF(H44=\"r\",1,0)+IF(H60=\"r\",1,0)+IF(H76=\"r\",1,0)+IF(H92=\"r\",1,0)+IF(H108=\"r\",1,0))/2","v":0},0,0,0,0,0,0,0,0,0,0,0,0,0,0,0,0,0,0,0,0,0,0,0,0,0,0,0,0,"R",{"$f":"AJ138+AJ139","v":0},36.5,{"$f":"AL138-AM138","v":-36.5},"Youcef OULD KADI"]
[null,null,"ELS 7","C",{"$f":"IF(E12=\"c\",1,0)+IF(E28=\"c\",1,0)+IF(E44=\"c\",1,0)+IF(E60=\"c\",1,0)+IF(E76=\"c\",1,0)+IF(E92=\"c\",1,0)+IF(E108=\"c\",1,0)/2","v":0},{"$f":"IF(F12=\"c\",1,0)+IF(F28=\"c\",1,0)+IF(F44=\"c\",1,0)+IF(F60=\"c\",1,0)+IF(F76=\"c\",1,0)+IF(F92=\"c\",1,0)+IF(F108=\"c\",1,0)/2","v":0},{"$f":"(IF(G12=\"c\",1,0)+IF(G28=\"c\",1,0)+IF(G44=\"c\",1,0)+IF(G60=\"c\",1,0)+IF(G76=\"c\",1,0)+IF(G92=\"c\",1,0)+IF(G108=\"c\",1,0))/2","v":0},{"$f":"(IF(H12=\"c\",1,0)+IF(H28=\"c\",1,0)+IF(H44=\"c\",1,0)+IF(H60=\"c\",1,0)+IF(H76=\"c\",1,0)+IF(H92=\"c\",1,0)+IF(H108=\"c\",1,0))/2","v":0},0,0,0,0,0,0,0,0,0,0,0,0,0,0,0,0,0,0,0,0,0,0,0,0,0,0,0,0,"C",null,null,null,"ELS 7"]
[null,null,{"$f":"+C109","v":0},"R",{"$f":"IF(E13=\"r\",1,0)+IF(E29=\"r\",1,0)+IF(E45=\"r\",1,0)+IF(E61=\"r\",1,0)+IF(E77=\"r\",1,0)+IF(E93=\"r\",1,0)+IF(E109=\"r\",1,0)/2","v":0},{"$f":"IF(F13=\"r\",1,0)+IF(F29=\"r\",1,0)+IF(F45=\"r\",1,0)+IF(F61=\"r\",1,0)+IF(F77=\"r\",1,0)+IF(F93=\"r\",1,0)+IF(F109=\"r\",1,0)/2","v":0},{"$f":"(IF(G13=\"r\",1,0)+IF(G29=\"r\",1,0)+IF(G45=\"r\",1,0)+IF(G61=\"r\",1,0)+IF(G77=\"r\",1,0)+IF(G93=\"r\",1,0)+IF(G109=\"r\",1,0))/2","v":0},{"$f":"(IF(H13=\"r\",1,0)+IF(H29=\"r\",1,0)+IF(H45=\"r\",1,0)+IF(H61=\"r\",1,0)+IF(H77=\"r\",1,0)+IF(H93=\"r\",1,0)+IF(H109=\"r\",1,0))/2","v":0},0,0,0,0,0,0,0,0,0,0,0,0,0,0,0,0,0,0,0,{"$f":"(IF(AB13=\"r\",1,0)+IF(#REF!=\"r\",1,0)+IF(AB45=\"r\",1,0)+IF(AB29=\"r\",1,0)+IF(AB77=\"r\",1,0)+IF(AB93=\"r\",1,0)+IF(AB109=\"r\",1,0))/2","v":{"$error":"#REF!"}},{"$f":"(IF(AC13=\"r\",1,0)+IF(#REF!=\"r\",1,0)+IF(AC45=\"r\",1,0)+IF(AC29=\"r\",1,0)+IF(AC77=\"r\",1,0)+IF(AC93=\"r\",1,0)+IF(AC109=\"r\",1,0))/2","v":{"$error":"#REF!"}},{"$f":"(IF(AD10=\"r\",1,0)+IF(#REF!=\"r\",1,0)+IF(AD45=\"r\",1,0)+IF(AD29=\"r\",1,0)+IF(AD77=\"r\",1,0)+IF(AD93=\"r\",1,0)+IF(AD109=\"r\",1,0))/2","v":{"$error":"#REF!"}},{"$f":"(IF(AE10=\"r\",1,0)+IF(#REF!=\"r\",1,0)+IF(AE45=\"r\",1,0)+IF(AE29=\"r\",1,0)+IF(AE77=\"r\",1,0)+IF(AE93=\"r\",1,0)+IF(AE109=\"r\",1,0))/2","v":{"$error":"#REF!"}},{"$f":"(IF(AF10=\"r\",1,0)+IF(#REF!=\"r\",1,0)+IF(AF45=\"r\",1,0)+IF(AF29=\"r\",1,0)+IF(AF77=\"r\",1,0)+IF(AF93=\"r\",1,0)+IF(AF109=\"r\",1,0))/2","v":{"$error":"#REF!"}},{"$f":"(IF(AG10=\"r\",1,0)+IF(#REF!=\"r\",1,0)+IF(AG45=\"r\",1,0)+IF(AG29=\"r\",1,0)+IF(AG77=\"r\",1,0)+IF(AG93=\"r\",1,0)+IF(AG109=\"r\",1,0))/2","v":{"$error":"#REF!"}},{"$f":"(IF(AH10=\"r\",1,0)+IF(#REF!=\"r\",1,0)+IF(AH45=\"r\",1,0)+IF(AH29=\"r\",1,0)+IF(AH77=\"r\",1,0)+IF(AH93=\"r\",1,0)+IF(AH109=\"r\",1,0))/2","v":{"$error":"#REF!"}},{"$f":"(IF(AI10=\"r\",1,0)+IF(#REF!=\"r\",1,0)+IF(AI45=\"r\",1,0)+IF(AI29=\"r\",1,0)+IF(AI77=\"r\",1,0)+IF(AI93=\"r\",1,0)+IF(AI109=\"r\",1,0))/2","v":{"$error":"#REF!"}},{"$error":"#REF!"},"R",{"$f":"AJ140+AJ141","v":{"$error":"#REF!"}},20,{"$f":"AL140-AM140","v":{"$error":"#REF!"}},{"$f":"+C140","v":0}]
[null,null,"ELS 8","C",{"$f":"IF(E13=\"c\",1,0)+IF(E29=\"c\",1,0)+IF(E45=\"c\",1,0)+IF(E61=\"c\",1,0)+IF(E77=\"c\",1,0)+IF(E93=\"c\",1,0)+IF(E109=\"c\",1,0)/2","v":0},{"$f":"IF(F13=\"c\",1,0)+IF(F29=\"c\",1,0)+IF(F45=\"c\",1,0)+IF(F61=\"c\",1,0)+IF(F77=\"c\",1,0)+IF(F93=\"c\",1,0)+IF(F109=\"c\",1,0)/2","v":0},{"$f":"(IF(G13=\"c\",1,0)+IF(G29=\"c\",1,0)+IF(G45=\"c\",1,0)+IF(G61=\"c\",1,0)+IF(G77=\"c\",1,0)+IF(G93=\"c\",1,0)+IF(G109=\"c\",1,0))/2","v":0},{"$f":"(IF(H13=\"c\",1,0)+IF(H29=\"c\",1,0)+IF(H45=\"c\",1,0)+IF(H61=\"c\",1,0)+IF(H77=\"c\",1,0)+IF(H93=\"c\",1,0)+IF(H109=\"c\",1,0))/2","v":0},0,0,0,0,0,0,0,0,0,0,0,0,0,0,0,0,0,0,0,{"$f":"(IF(AB13=\"c\",1,0)+IF(#REF!=\"c\",1,0)+IF(AB45=\"c\",1,0)+IF(AB29=\"c\",1,0)+IF(AB77=\"c\",1,0)+IF(AB93=\"c\",1,0)+IF(AB109=\"c\",1,0))/2","v":{"$error":"#REF!"}},{"$f":"(IF(AC13=\"c\",1,0)+IF(#REF!=\"c\",1,0)+IF(AC45=\"c\",1,0)+IF(AC29=\"c\",1,0)+IF(AC77=\"c\",1,0)+IF(AC93=\"c\",1,0)+IF(AC109=\"c\",1,0))/2","v":{"$error":"#REF!"}},{"$f":"(IF(AD10=\"c\",1,0)+IF(#REF!=\"c\",1,0)+IF(AD45=\"c\",1,0)+IF(AD29=\"c\",1,0)+IF(AD77=\"c\",1,0)+IF(AD93=\"c\",1,0)+IF(AD109=\"c\",1,0))/2","v":{"$error":"#REF!"}},{"$f":"(IF(AE10=\"c\",1,0)+IF(#REF!=\"c\",1,0)+IF(AE45=\"c\",1,0)+IF(AE29=\"c\",1,0)+IF(AE77=\"c\",1,0)+IF(AE93=\"c\",1,0)+IF(AE109=\"c\",1,0))/2","v":{"$error":"#REF!"}},{"$f":"(IF(AF10=\"c\",1,0)+IF(#REF!=\"c\",1,0)+IF(AF45=\"c\",1,0)+IF(AF29=\"c\",1,0)+IF(AF77=\"c\",1,0)+IF(AF93=\"c\",1,0)+IF(AF109=\"c\",1,0))/2","v":{"$error":"#REF!"}},{"$f":"(IF(AG10=\"c\",1,0)+IF(#REF!=\"c\",1,0)+IF(AG45=\"c\",1,0)+IF(AG29=\"c\",1,0)+IF(AG77=\"c\",1,0)+IF(AG93=\"c\",1,0)+IF(AG109=\"c\",1,0))/2","v":{"$error":"#REF!"}},{"$f":"(IF(AH10=\"c\",1,0)+IF(#REF!=\"c\",1,0)+IF(AH45=\"c\",1,0)+IF(AH29=\"c\",1,0)+IF(AH77=\"c\",1,0)+IF(AH93=\"c\",1,0)+IF(AH109=\"c\",1,0))/2","v":{"$error":"#REF!"}},{"$f":"(IF(AI10=\"c\",1,0)+IF(#REF!=\"c\",1,0)+IF(AI45=\"c\",1,0)+IF(AI29=\"c\",1,0)+IF(AI77=\"c\",1,0)+IF(AI93=\"c\",1,0)+IF(AI109=\"c\",1,0))/2","v":{"$error":"#REF!"}},{"$error":"#REF!"},"C",null,36.75,null,"ELS 8"]
[null,null,"Sofia MAICHE","R",null,null,{"$f":"(IF(G14=\"r\",1,0)+IF(G30=\"r\",1,0)+IF(G46=\"r\",1,0)+IF(G62=\"r\",1,0)+IF(G78=\"r\",1,0)+IF(G94=\"r\",1,0)+IF(G110=\"r\",1,0))/2","v":0},{"$f":"(IF(H14=\"r\",1,0)+IF(H30=\"r\",1,0)+IF(H46=\"r\",1,0)+IF(H62=\"r\",1,0)+IF(H78=\"r\",1,0)+IF(H94=\"r\",1,0)+IF(H110=\"r\",1,0))/2","v":0},0,0,0,0,0,0,0,0,0,0,0,0,0,0,0,{"$f":"(IF(X14=\"r\",1,0)+IF(X30=\"r\",1,0)+IF(X46=\"r\",1,0)+IF(X62=\"r\",1,0)+IF(#REF!=\"r\",1,0)+IF(X94=\"r\",1,0)+IF(X110=\"r\",1,0))/2","v":{"$error":"#REF!"}},{"$f":"(IF(Y14=\"r\",1,0)+IF(Y30=\"r\",1,0)+IF(Y46=\"r\",1,0)+IF(Y62=\"r\",1,0)+IF(X78=\"r\",1,0)+IF(Y94=\"r\",1,0)+IF(Y110=\"r\",1,0))/2","v":0},0,0,0,0,0,0,0,0,0,0,{"$error":"#REF!"},"R",{"$f":"AJ142+AJ143","v":{"$error":"#REF!"}},0,{"$f":"AL142-AM142","v":{"$error":"#REF!"}},"Sofia MAICHE"]
[null,null,"ELS 8","C",null,null,{"$f":"(IF(G14=\"c\",1,0)+IF(G30=\"c\",1,0)+IF(G46=\"c\",1,0)+IF(G62=\"c\",1,0)+IF(G78=\"c\",1,0)+IF(G94=\"c\",1,0)+IF(G110=\"c\",1,0))/2","v":0},{"$f":"(IF(H14=\"c\",1,0)+IF(H30=\"c\",1,0)+IF(H46=\"c\",1,0)+IF(H62=\"c\",1,0)+IF(H78=\"c\",1,0)+IF(H94=\"c\",1,0)+IF(H110=\"c\",1,0))/2","v":0},0,0,0,0,0,0,0,0,0,0,0,0,0,0,0,{"$f":"(IF(X14=\"c\",1,0)+IF(X30=\"c\",1,0)+IF(X46=\"c\",1,0)+IF(X62=\"c\",1,0)+IF(#REF!=\"c\",1,0)+IF(X94=\"c\",1,0)+IF(X110=\"c\",1,0))/2","v":{"$error":"#REF!"}},{"$f":"(IF(Y14=\"c\",1,0)+IF(Y30=\"c\",1,0)+IF(Y46=\"c\",1,0)+IF(Y62=\"c\",1,0)+IF(X78=\"c\",1,0)+IF(Y94=\"c\",1,0)+IF(Y110=\"c\",1,0))/2","v":0},0,0,0,0,0,0,0,0,0,0,{"$error":"#REF!"},"C",null,36.75,null,"ELS 8"]
[null,null,"Elyess CHELBI","R",{"$f":"IF(E15=\"r\",1,0)+IF(E31=\"r\",1,0)+IF(E47=\"r\",1,0)+IF(E63=\"r\",1,0)+IF(E79=\"r\",1,0)+IF(E95=\"r\",1,0)+IF(E111=\"r\",1,0)/2","v":0},{"$f":"IF(F15=\"r\",1,0)+IF(F31=\"r\",1,0)+IF(F47=\"r\",1,0)+IF(F63=\"r\",1,0)+IF(F79=\"r\",1,0)+IF(F95=\"r\",1,0)+IF(F111=\"r\",1,0)/2","v":0},{"$f":"(IF(G15=\"r\",1,0)+IF(G31=\"r\",1,0)+IF(G47=\"r\",1,0)+IF(G63=\"r\",1,0)+IF(G79=\"r\",1,0)+IF(G95=\"r\",1,0)+IF(G111=\"r\",1,0))/2","v":0},{"$f":"(IF(H15=\"r\",1,0)+IF(H31=\"r\",1,0)+IF(H47=\"r\",1,0)+IF(H63=\"r\",1,0)+IF(H79=\"r\",1,0)+IF(H95=\"r\",1,0)+IF(H111=\"r\",1,0))/2","v":0},0,0,0,0,0,0,0,0,0,0,0,0,0,0,0,0,0,0,0,0,0,0,0,0,0,0,0,0,"R",{"$f":"AJ144+AJ145","v":0},35,{"$f":"AL144-AM144","v":-35},"Elyess CHELBI"]
[null,null,"ELS 8","C",{"$f":"IF(E15=\"c\",1,0)+IF(E31=\"c\",1,0)+IF(E47=\"c\",1,0)+IF(E63=\"c\",1,0)+IF(E79=\"c\",1,0)+IF(E95=\"c\",1,0)+IF(E111=\"c\",1,0)/2","v":0},{"$f":"IF(F15=\"c\",1,0)+IF(F31=\"c\",1,0)+IF(F47=\"c\",1,0)+IF(F63=\"c\",1,0)+IF(F79=\"c\",1,0)+IF(F95=\"c\",1,0)+IF(F111=\"c\",1,0)/2","v":0},{"$f":"(IF(G15=\"c\",1,0)+IF(G31=\"c\",1,0)+IF(G47=\"c\",1,0)+IF(G63=\"c\",1,0)+IF(G79=\"c\",1,0)+IF(G95=\"c\",1,0)+IF(G111=\"c\",1,0))/2","v":0},{"$f":"(IF(H15=\"c\",1,0)+IF(H31=\"c\",1,0)+IF(H47=\"c\",1,0)+IF(H63=\"c\",1,0)+IF(H79=\"c\",1,0)+IF(H95=\"c\",1,0)+IF(H111=\"c\",1,0))/2","v":0},0,0,0,0,0,0,0,0,0,0,0,0,0,0,0,0,0,0,0,0,0,0,0,0,0,0,0,0,"C",null,32,null,"ELS 9"]
[null,null,"SOUS-TOTAL","R",{"$f":"E120+E122+E124+E126+E128+E130+E132+E134+E136+E138+E140+E144","v":0},{"$f":"F120+F122+F124+F126+F128+F130+F132+F134+F136+F138+F140+F144","v":0},{"$f":"G120+G122+G124+G126+G128+G130+G132+G134+G136+G138+G140+G144+G142","v":0},{"$f":"H120+H122+H124+H126+H128+H130+H132+H134+H136+H138+H140+H144+H142","v":0},0,0,0,0,0,0,0,0,0,0,{"$error":"#REF!"},0,{"$f":"U120+U122+U124+U126+U128+U130+U132+U134+U136+U138+U140+U144+U142","v":0},{"$error":"#REF!"},0,{"$error":"#REF!"},0,0,0,{"$f":"AB120+AB122+AB124+AB126+AB128+AB130+AB132+AB134+AB136+AB138+AB140+AB144+AB142","v":{"$error":"#REF!"}},{"$error":"#REF!"},{"$error":"#REF!"},{"$error":"#REF!"},{"$error":"#REF!"},{"$error":"#REF!"},{"$f":"AH120+AH122+AH124+AH126+AH128+AH130+AH132+AH134+AH136+AH138+AH140+AH144+AH142","v":{"$error":"#REF!"}},{"$f":"AI120+AI122+AI124+AI126+AI128+AI130+AI132+AI134+AI136+AI138+AI140+AI144+AI142","v":{"$error":"#REF!"}},{"$f":"+SUM(G146:AI146)","v":{"$error":"#REF!"}},"R",{"$f":"AJ146+AJ147","v":{"$error":"#REF!"}},{"$f":"AM120+AM122+AM124+AM126+AM128+AM130+AM132+AM134+AM136+AM138+AM140+AM144+AM142","v":405},{"$f":"AL146-AM146","v":{"$error":"#REF!"}}]
[null,null,"ELS 9","C",{"$f":"E121+E123+E125+E127+E129+E131+E133+E135+E137+E139+E141+E145","v":0.5},0,{"$f":"G121+G123+G125+G127+G129+G131+G133+G135+G137+G139+G141+G145+G143","v":0},0,0,0,0.5,0.5,0.5,0.5,0.5,1.5,1.5,1.5,{"$error":"#REF!"},{"$f":"T121+T123+T125+T127+T129+T131+T133+T135+T137+T139+T141+T145+T143","v":1.5},1.5,{"$error":"#REF!"},0.5,{"$error":"#REF!"},0,1.5,1.5,{"$error":"#REF!"},{"$error":"#REF!"},{"$error":"#REF!"},{"$error":"#REF!"},{"$error":"#REF!"},{"$error":"#REF!"},{"$error":"#REF!"},{"$error":"#REF!"},{"$f":"+SUM(G147:AI147)","v":{"$error":"#REF!"}},"C"]
[null,null,"TOTAL",null,{"$f":"+E146+E147","v":0.5},{"$f":"+F146+F147","v":0},{"$f":"+G146+G147","v":0},0,0,0,0.5,0.5,0.5,0.5,0.5,1.5,1.5,1.5,{"$f":"+S146+S147","v":{"$error":"#REF!"}},1.5,1.5,{"$error":"#REF!"},0.5,{"$error":"#REF!"},0,1.5,1.5,{"$error":"#REF!"},{"$error":"#REF!"},{"$error":"#REF!"},{"$error":"#REF!"},{"$error":"#REF!"},{"$error":"#REF!"},{"$f":"+AH146+AH147","v":{"$error":"#REF!"}},{"$error":"#REF!"},{"$f":"SUM(AL120:AL145)","v":{"$error":"#REF!"}},null,null,{"$f":"+AM146","v":405},{"$f":"AJ148-AM148","v":{"$error":"#REF!"}}]
[null,null,null,null,null,null,null,null,null,null,null,null,null,null,null,null,null,null,null,null,null,null,null,null,null,null,null,null,null,null,"Equivalent ETP (Dir. Inclus) =",null,null,null,null,{"$f":"+AJ148/36.75","v":{"$error":"#REF!"}}]
[null,null,null,null,null,null,null,null,null,null,null,null,null,null,null,null,null,null,null,null,null,null,null,null,null,null,null,null,null,null,null,null,null,null,null,null,null,null,{"$f":"+AM148-30","v":375}]
[null,"Signatures OBLIGATOIRES","Hassan OUAMOUH",null,null,null,null,"Rodrigue MOREIRA",null,null,null,"AKUVI SYLVIA",null,null,"DIALO IDRISSA",null,null,"DIARRA HANNE FATOUMATA",null,null,null,"SHAM LATA",null,null,"PHUONG LINH",null,null,"AMINO FASSOLATH",null,null,"Youcef OULD KADI",null,null,"Emmanuel YAMB KAMEN"]

{"sheet":"semaine impaire","index":2,"n_rows":160,"n_cols":57,"rows_kept":160,"cut":false,"hidden":true,"merged":[[24,2,24,3],[25,2,25,3],[28,2,28,3],[47,1,48,1],[46,2,46,3],[48,2,48,3],[26,2,26,3],[33,2,33,3],[29,2,29,3],[41,2,41,3],[27,2,27,3],[30,1,33,1],[32,2,32,3],[10,1,12,1],[10,2,10,3],[11,2,11,3],[12,2,12,3],[13,1,16,1],[13,2,13,3],[14,2,14,3],[16,2,16,3],[15,2,15,3],[1,1,1,3],[2,2,2,3],[3,2,3,3],[4,1,9,1],[4,2,4,3],[5,2,5,3],[6,2,6,3],[8,2,8,3],[9,2,9,3],[7,2,7,3],[18,1,18,3],[49,1,50,1],[49,2,49,3],[50,2,50,3],[35,1,35,3],[36,2,36,3],[37,2,37,3],[38,1,46,1],[38,2,38,3],[47,2,47,3],[39,2,39,3],[42,2,42,3],[44,2,44,3],[40,2,40,3],[43,2,43,3],[45,2,45,3],[30,2,30,3],[31,2,31,3],[19,2,19,3],[20,2,20,3],[21,1,25,1],[21,2,21,3],[22,2,22,3],[23,2,23,3],[62,1,65,1],[62,2,62,3],[64,2,64,3],[65,2,65,3],[66,1,67,1],[66,2,66,3],[67,2,67,3],[52,1,52,3],[53,2,53,3],[54,2,54,3],[56,1,61,1],[56,2,56,3],[58,2,58,3],[59,2,59,3],[60,2,60,3],[61,2,61,3],[55,2,55,3],[63,2,63,3],[57,2,57,3],[81,1,82,1],[80,2,80,3],[82,2,82,3],[83,1,84,1],[83,2,83,3],[69,1,69,3],[70,2,70,3],[71,2,71,3],[73,1,80,1],[73,2,73,3],[76,2,76,3],[77,2,77,3],[78,2,78,3],[72,2,72,3],[75,2,75,3],[74,2,74,3],[84,2,84,3],[79,2,79,3],[81,2,81,3],[98,1,99,1],[98,2,98,3],[99,2,99,3],[100,1,101,1],[100,2,100,3],[101,2,101,3],[86,1,86,3],[87,2,87,3],[88,2,88,3],[89,1,97,1],[89,2,89,3],[90,2,90,3],[92,2,92,3],[95,2,95,3],[97,2,97,3],[94,2,94,3],[93,2,93,3],[91,2,91,3],[96,2,96,3],[115,1,116,1],[115,2,115,3],[116,2,116,3],[117,1,118,1],[117,2,117,3],[118,2,118,3],[103,1,103,3],[104,2,104,3],[105,2,105,3],[106,1,114,1],[106,2,106,3],[109,2,109,3],[112,2,112,3],[113,2,113,3],[114,2,114,3],[108,2,108,3],[107,2,107,3],[110,2,110,3],[111,2,111,3],[120,1,123,1],[120,2,120,6],[120,8,120,13],[120,14,120,19],[120,20,120,24],[122,2,122,6],[122,8,122,13],[122,14,122,19],[122,20,122,24],[123,2,123,6],[123,8,123,13],[123,14,123,19],[123,20,123,24],[121,2,121,6],[121,8,121,13],[121,14,121,19],[121,20,121,24],[132,2,133,2],[128,2,129,2],[125,1,125,3],[126,1,156,1],[126,2,127,2],[130,2,131,2],[134,2,135,2],[140,2,141,2],[156,2,156,3],[154,2,155,2],[146,2,147,2],[148,2,149,2],[150,2,151,2],[152,2,153,2],[142,2,143,2],[144,2,145,2],[136,2,137,2],[138,2,139,2],[157,25,157,26],[160,21,160,22],[160,23,160,24],[159,21,159,22],[159,23,159,24],[159,1,160,1],[159,2,159,4],[159,5,159,9],[159,10,159,12],[159,13,159,15],[159,16,159,20],[160,2,160,4],[160,5,160,9],[160,10,160,12],[160,13,160,15],[160,16,160,20],[152,56,153,56],[154,56,155,56],[134,56,135,56],[132,56,133,56],[130,56,131,56],[128,56,129,56],[126,56,127,56],[144,56,145,56],[142,56,143,56],[140,56,141,56],[138,56,139,56],[136,56,137,56],[150,56,151,56],[148,56,149,56],[146,56,147,56]]}
[]
[null,"LUNDI",null,null,"7h-7h15","7h15-7h30","7h30-7h45","7h45-8h","8h-8h15","8h15-8h30","8h30-8h45","8h45-9h","9h-9h15","9h15-9H30","9h30-9H45","9h45-10H","10h-10H15","10h15-10H30","10h30-10h45","10h45-11H","11h-11H15","11h15-11H30","11h30-11H45","11h45-12H","12h-12H15","12h15-12H30","12h30-12H45","12h45-13H","13h-13H15","13h15-13H30","13h30-13H45","13H45-14H","14H-14H15","14h15-14H30","14h30-14H45","14H45-15H","15H-15H15","15h15-15h30","15h30-15h45","15h45-16h","16h-16h15","16h15-16h30","16h30-16h45","16h45-17h","17h-17h15","17h15-17h30","17h30-17h45","17h45-18h","18h-18h15","18h15-18h30","18h30-18h45","18h45-19h","19h-19h15","19h15-19h30","19h30-19h45","total"]
[null,"r = rayon","Angélique",null,null,null,null,null,null,null,null,null,null,null,null,null,null,null,null,null,null,null,null,null,null,null,null,null,null,null,null,null,null,null,null,null,null,null,null,null,null,null,null,null,null,null,null,null,null,null,null,null,null,null,null,{"$f":"COUNTA(E3:BC3)*0.5","v":0}]
[null,"c = caisse","Danielle",null,null,null,null,null,null,null,null,null,null,null,null,null,null,null,null,null,null,null,null,null,null,null,null,null,"c","c","c","c","c","c","c","c","c","c","c","c","c","c","c","c","c","c","c","c","c","c","c","c","c","c","c",{"$f":"COUNTA(E4:BC4)*0.25","v":6.75}]
[null,"lundi","Sylvina","AKUVI",null,null,"c","c","c","c","c","c","c","c","c","c","c","c","c","c","c","c","c","c","c","c","c","c","c","c","c","c",null,null,null,null,null,null,null,null,null,null,null,null,null,null,null,null,null,null,null,null,null,null,null,{"$f":"COUNTA(E5:BC5)*0.25","v":6.5}]
[null,null,"Laura","AKUVI",null,null,"c","c","c","c","c","c","c","c","c","c","c","c","c","c","c","c","c","c","c","c","c","c","c","c","c","c",null,null,null,null,null,null,null,null,null,null,null,null,null,null,null,null,null,null,null,null,null,null,null,{"$f":"COUNTA(E6:BC6)*0.25","v":6.5}]
[null,null,"Sabrina","IDRISSA",null,null,null,null,null,null,null,null,null,null,null,null,null,null,null,null,null,null,null,null,null,null,null,null,null,null,null,null,null,null,null,null,null,null,"c","c","c","c","c","c","c","c","c","c","c","c","c","c","c","c","c",{"$f":"COUNTA(E7:BC7)*0.25","v":4.25}]
[null,null,"Brigitte",null,null,null,null,null,null,null,null,null,"c","c","c","c","c","c","c","c","c","c","c","c","c","c","c","c","c","c",null,null,null,null,null,null,null,null,null,null,null,null,null,null,null,null,null,null,null,null,null,null,null,null,null,4.5]
[null,null,"Pauline","HANNE FATOUMATA",null,null,null,null,null,null,null,null,null,null,null,null,null,null,null,null,null,null,null,null,null,null,null,null,null,null,null,null,null,null,null,null,null,null,null,null,null,null,null,null,null,null,null,null,null,null,null,null,null,null,null,0]
[null,null,"Tristan",null,null,null,null,null,null,null,null,null,null,null,null,null,null,null,null,null,null,null,null,null,null,null,null,null,null,null,null,null,null,null,null,null,null,null,null,null,null,null,null,null,null,null,null,null,null,null,null,null,null,null,null,0]
[null,null,"Valentin",null,null,null,null,null,null,null,null,null,null,null,null,null,null,null,null,null,null,null,null,null,null,null,null,null,null,null,null,null,null,null,null,null,null,null,null,null,null,null,null,null,null,null,null,null,null,null,null,null,null,null,null,0]
[null,null,"Guénael","FASSOLATH",null,null,null,null,null,null,null,null,null,null,null,null,null,null,null,null,null,null,null,null,null,null,null,null,null,null,null,null,null,null,null,null,null,null,null,null,null,null,null,null,null,null,null,null,null,null,null,null,null,null,null,0]
[null,null,"Marie",null,null,null,null,null,null,null,null,null,null,null,null,null,null,null,null,null,null,null,null,null,null,null,null,null,null,null,null,null,null,null,null,null,null,null,null,null,null,null,null,null,null,null,null,null,null,null,null,null,null,null,null,0]
[null,null,"Valérie",null,null,null,null,null,"c","c","c","c","c","c","c","c","c","c","c","c","c","c","c","c",null,null,null,null,null,null,null,null,"c","c","c","c","c","c","c","c","c","c","c","c","c","c","c","c","c","c","c","c","c","c","c",9.75]
[null,null,"Nathalie",null,null,null,null,null,null,null,null,null,null,null,null,null,null,null,null,null,null,null,null,null,null,null,null,null,null,null,null,null,null,null,null,null,null,null,null,null,null,null,null,null,null,null,null,null,null,null,null,null,null,null,null,0]
[null,null,"Ophélie",null,null,null,null,null,null,null,null,null,null,null,null,null,null,null,null,null,null,null,null,null,null,null,null,null,null,null,null,null,null,null,null,null,null,null,null,null,null,null,null,null,null,null,null,null,null,null,null,null,null,null,null,0]
[null,null,"TOTAL",null,{"$f":"COUNTA(E3:E15)*0.25","v":0},{"$f":"COUNTA(F3:F15)*0.25","v":0},0.5,0.5,0.75,0.75,0.75,0.75,1,1,1,1,1,1,1,1,1,1,1,1,0.75,0.75,0.75,0.75,1,1,0.75,0.75,0.5,0.5,0.5,0.5,0.5,0.5,0.75,0.75,0.75,0.75,0.75,0.75,0.75,0.75,0.75,0.75,0.75,0.75,0.75,0.75,0.75,0.75,0.75,{"$f":"SUM(E17:BC17)","v":38.25}]
[null,null,null,null," "]
[null,"MARDI",null,null,"7h-7h15","7h15-7h30","7h30-7h45","7h45-8h","8h-8h15","8h15-8h30","8h30-8h45","8h45-9h","9h-9h15","9h15-9H30","9h30-9H45","9h45-10H","10h-10H15","10h15-10H30","10h30-10h45","10h45-11H","11h-11H15","11h15-11H30","11h30-11H45","11h45-12H","12h-12H15","12h15-12H30","12h30-12H45","12h45-13H","13h-13H15","13h15-13H30","13h30-13H45","13H45-14H","14H-14H15","14h15-14H30","14h30-14H45","14H45-15H","15H-15H15","15h15-15h30","15h30-15h45","15h45-16h","16h-16h15","16h15-16h30","16h30-16h45","16h45-17h","17h-17h15","17h15-17h30","17h30-17h45","17h45-18h","18h-18h15","18h15-18h30","18h30-18h45","18h45-19h","19h-19h15","19h15-19h30","19h30-19h45","total"]
[null,"r = rayon","Angélique",null,null,null,null,null,null,null,null,null,"c","c","c","c","c","c","c","c","c","c","c","c","c","c","c","c","c","c","c","c","c","c","c","c",null,null,null,null,null,null,null,null,null,null,null,null,null,null,null,null,null,null,null,{"$f":"COUNTA(E20:BC20)*0.25","v":6}]
[null,"c = caisse","Danielle",null,null,null,null,null,null,null,null,null,"c","c","c","c","c","c","c","c","c","c","c","c","c","c","c","c","c","c","c","c",null,null,null,null,null,null,null,null,null,null,null,null,null,null,null,null,null,null,null,null,null,null,null,5]
[null,"mardi","Sylvina","AKUVI",null,null,"c","c","c","c","c","c","c","c","c","c","c","c","c","c","c","c","c","c","c","c","c","c","c","c","c",null,null,null,null,null,null,null,null,null,null,null,null,null,null,null,null,null,null,null,null,null,null,null,null,6.25]
[null,null,"Laura","AKUVI",null,null,null,null,null,null,null,null,null,null,null,null,null,null,null,null,null,null,null,null,null,null,null,null,null,null,null,null,null,null,null,null,"c","c","c","c","c","c","c","c","c","c","c","c","c","c","c","c",null,null,null,4]
[null,null,"Sabrina","IDRISSA",null,null,null,null,null,null,null,null,null,null,null,null,null,null,null,null,null,null,null,null,null,null,null,null,null,null,null,null,null,null,null,null,"c","c","c","c","c","c","c","c","c","c","c","c","c","c","c","c","c","c","c",4.75]
[null,null,"Brigitte",null,null,null,null,null,null,null,null,null,"c","c","c","c","c","c","c","c","c","c","c","c","c",null,null,null,null,null,null,null,null,null,null,null,null,null,null,null,"c","c","c","c","c","c","c","c","c","c","c","c","c","c",null,6.75]
[null,null,"Pauline","HANNE FATOUMATA",null,null,null,null,null,null,null,null,null,null,null,null,null,null,null,null,null,null,null,null,null,null,null,null,null,null,null,null,null,null,null,null,null,null,null,null,null,null,null,null,null,null,null,null,null,null,null,null,null,null,null,0]
[null,null,"Tristan",null,null,null,null,null,null,null,null,null,null,null,null,null,null,null,null,null,null,null,null,null,null,null,null,null,null,null,null,null,null,null,null,null,null,null,null,null,null,null,null,null,null,null,null,null,null,null,null,null,null,null,null,0]
[null,null,"Valentin",null,null,null,null,null,null,null,null,null,null,null,null,null,null,null,null,null,null,null,null,null,null,null,null,null,null,null,null,null,null,null,null,null,null,null,null,null,null,null,null,null,null,null,null,null,null,null,null,null,null,null,null,0]
[null,null,"Guénael","FASSOLATH",null,null,null,null,null,null,null,null,null,null,null,null,null,null,null,null,null,null,null,null,null,null,null,null,null,null,null,null,null,null,null,null,null,null,null,null,null,null,null,null,null,null,null,null,null,null,null,null,null,null,null,0]
[null,null,"Marie",null,null,null,null,null,null,null,null,null,null,null,null,null,null,null,null,null,null,null,null,null,null,null,null,null,null,null,null,null,null,null,null,null,null,null,null,null,null,null,null,null,null,null,null,null,null,null,null,null,null,null,null,0]
[null,null,"Valérie",null,null,null,null,null,"c","c","c","c","c","c","c","c","c","c","c","c","c","c","c","c","c","c","c","c",null,null,null,null,null,null,null,null,null,null,null,null,null,null,null,null,null,null,null,null,null,null,null,null,null,null,null,5]
[null,null,"Nathalie",null,null,null,null,null,null,null,null,null,null,null,null,null,null,null,null,null,null,null,null,null,null,null,null,"c","c","c","c","c","c","c","c","c","c","c","c","c","c","c","c","c","c","c","c","c","c","c","c","c","c","c","c",7]
[null,null,"Ophélie",null,null,null,null,null,null,null,null,null,null,null,null,null,null,null,null,null,null,null,null,null,null,null,null,null,null,null,null,null,null,null,null,null,null,null,null,null,null,null,null,null,null,null,null,null,null,null,null,null,null,null,null,0]
[null,null,"TOTAL",null,{"$f":"COUNTA(E20:E33)*0.25","v":0},{"$f":"COUNTA(F20:F33)*0.25","v":0},0.25,0.25,0.5,0.5,0.5,0.5,1.25,1.25,1.25,1.25,1.25,1.25,1.25,1.25,1.25,1.25,1.25,1.25,1.25,1,1,1.25,1,1,1,0.75,0.5,0.5,0.5,0.5,0.75,0.75,0.75,0.75,1,1,1,1,1,1,1,1,1,1,1,1,0.75,0.75,0.5,{"$f":"SUM(E34:BC34)","v":44.75}]
[]
[null,"MERCREDI",null,null,"7h-7h15","7h15-7h30","7h30-7h45","7h45-8h","8h-8h15","8h15-8h30","8h30-8h45","8h45-9h","9h-9h15","9h15-9H30","9h30-9H45","9h45-10H","10h-10H15","10h15-10H30","10h30-10h45","10h45-11H","11h-11H15","11h15-11H30","11h30-11H45","11h45-12H","12h-12H15","12h15-12H30","12h30-12H45","12h45-13H","13h-13H15","13h15-13H30","13h30-13H45","13H45-14H","14H-14H15","14h15-14H30","14h30-14H45","14H45-15H","15H-15H15","15h15-15h30","15h30-15h45","15h45-16h","16h-16h15","16h15-16h30","16h30-16h45","16h45-17h","17h-17h15","17h15-17h30","17h30-17h45","17h45-18h","18h-18h15","18h15-18h30","18h30-18h45","18h45-19h","19h-19h15","19h15-19h30","19h30-19h45","total"]
[null,"r = rayon","Angélique",null,null,null,null,null,null,null,null,null,null,null,null,null,null,null,null,null,null,null,null,null,null,null,null,null,null,null,null,null,null,null,null,null,null,null,null,null,null,null,null,null,null,null,null,null,null,null,null,null,null,null,null,{"$f":"COUNTA(E37:BC37)*0.25","v":0}]
[null,"c = caisse","Danielle",null,null,null,null,null,null,null,null,null,"c","c","c","c","c","c","c","c","c","c","c","c","c","c",null,null,null,null,null,null,"c","c","c","c","c","c","c","c","c","c","c","c","c","c","c","c","c","c","c","c","c","c","c",9.25]
[null,"Mercredi","Sylvina","AKUVI",null,null,"c","c","c","c","c","c","c","c","c","c","c","c","c","c","c","c","c","c","c","c","c","c","c","c","c","c",null,null,null,null,null,null,null,null,null,null,null,null,null,null,null,null,null,null,null,null,null,null,null,6.5]
[null,null,"Laura","AKUVI",null,null,null,null,null,null,null,null,"c","c","c","c","c","c","c","c","c","c","c","c",null,null,null,null,null,null,null,null,null,null,null,null,"c","c","c","c","c","c","c","c","c","c","c","c","c","c","c","c",null,null,null,7]
[null,null,"Sabrina","IDRISSA",null,null,null,null,null,null,null,null,null,null,null,null,null,null,null,null,null,null,null,null,null,null,null,null,null,null,null,null,null,null,null,null,null,null,null,null,null,null,null,null,null,null,null,null,null,null,null,null,null,null,null,0]
[null,null,"Brigitte",null,null,null,null,null,null,null,null,null,"c","c","c","c","c","c","c","c","c","c","c","c","c","c","c","c","c","c","c","c",null,null,null,null,null,null,null,null,"c","c","c","c","c","c","c","c","c","c","c","c","c","c","c",8.75]
[null,null,"Pauline","HANNE FATOUMATA",null,null,null,null,null,null,null,null,null,null,null,null,null,null,null,null,null,null,null,null,null,null,null,null,null,null,null,null,null,null,null,null,null,null,null,null,null,null,null,null,null,null,null,null,null,null,null,null,null,null,null,0]
[null,null,"Tristan",null,null,null,null,null,null,null,null,null,null,null,null,null,null,null,null,null,null,null,null,null,null,null,null,null,null,null,null,null,null,null,null,null,null,null,null,null,null,null,null,null,null,null,null,null,null,null,null,null,null,null,null,0]
[null,null,"Valentin",null,null,null,null,null,null,null,null,null,null,null,null,null,null,null,null,null,null,null,null,null,null,null,null,null,null,null,null,null,null,null,null,null,null,null,null,null,null,null,null,null,null,null,null,null,null,null,null,null,null,null,null,0]
[null,null,"Guénael","FASSOLATH",null,null,null,null,null,null,null,null,null,null,null,null,null,null,null,null,null,null,null,null,null,null,null,null,null,null,null,null,null,null,null,null,null,null,null,null,null,null,null,null,null,null,null,null,null,null,null,null,null,null,null,0]
[null,null,"Marie",null,null,null,null,null,null,null,null,null,null,null,null,null,null,null,null,null,null,null,null,null,null,null,null,null,null,null,null,null,null,null,null,null,null,null,null,null,null,null,null,null,null,null,null,null,null,null,null,null,null,null,null,0]
[null,null,"Valérie",null,null,null,null,null,"c","c","c","c","c","c","c","c","c","c","c","c","c","c","c","c","c","c","c","c",null,null,null,null,null,null,null,null,null,null,null,null,null,null,null,null,null,null,null,null,null,null,null,null,null,null,null,5]
[null,null,"Nathalie",null,null,null,null,null,null,null,null,null,null,null,null,null,null,null,null,null,null,null,null,null,null,null,null,"c","c","c","c","c","c","c","c","c","c","c","c","c","c","c","c","c","c","c","c","c","c","c","c","c","c","c","c",7]
[null,null,"Ophélie",null,null,null,null,null,null,null,null,null,null,null,null,null,null,null,null,null,null,null,null,null,null,null,null,null,null,null,null,null,null,null,null,null,null,null,null,null,null,null,null,null,null,null,null,null,null,null,null,null,null,null,null,0]
[null,null,"TOTAL",null,{"$f":"COUNTA(E37:E50)*0.25","v":0},{"$f":"COUNTA(F37:F50)*0.25","v":0},0.25,0.25,0.5,0.5,0.5,0.5,1.25,1.25,1.25,1.25,1.25,1.25,1.25,1.25,1.25,1.25,1.25,1.25,1,1,0.75,1,0.75,0.75,0.75,0.75,0.5,0.5,0.5,0.5,0.75,0.75,0.75,0.75,1,1,1,1,1,1,1,1,1,1,1,1,0.75,0.75,0.75,{"$f":"SUM(E51:BC51)","v":43.5}]
[]
[null,"JEUDI",null,null,"7h-7h15","7h15-7h30","7h30-7h45","7h45-8h","8h-8h15","8h15-8h30","8h30-8h45","8h45-9h","9h-9h15","9h15-9H30","9h30-9H45","9h45-10H","10h-10H15","10h15-10H30","10h30-10h45","10h45-11H","11h-11H15","11h15-11H30","11h30-11H45","11h45-12H","12h-12H15","12h15-12H30","12h30-12H45","12h45-13H","13h-13H15","13h15-13H30","13h30-13H45","13H45-14H","14H-14H15","14h15-14H30","14h30-14H45","14H45-15H","15H-15H15","15h15-15h30","15h30-15h45","15h45-16h","16h-16h15","16h15-16h30","16h30-16h45","16h45-17h","17h-17h15","17h15-17h30","17h30-17h45","17h45-18h","18h-18h15","18h15-18h30","18h30-18h45","18h45-19h","19h-19h15","19h15-19h30","19h30-19h45","total"]
[null,"r = rayon","Angélique",null,null,null,null,null,null,null,null,null,null,null,null,null,null,null,null,null,null,null,null,null,null,null,null,null,"c","c","c","c","c","c","c","c","c","c","c","c","c","c","c","c","c","c","c","c","c","c","c","c","c","c","c",{"$f":"COUNTA(E54:BC54)*0.25","v":6.75}]
[null,"c = caisse","Danielle",null,null,null,null,null,null,null,null,null,"C","C","C","C","C","C","C","C","C","C","C","C","C","C","C","C","C","C","C","C",null,null,null,null,null,null,null,null,null,null,null,null,null,null,null,null,null,null,null,null,null,null,null,5]
[null,null,"Sylvina","AKUVI",null,null,"c","c","c","c","c","c","c","c","c","c","c","c","c","c","c","C","C","C","C","C","C","C",null,null,null,null,null,null,null,null,null,null,null,null,null,null,null,null,null,null,null,null,null,null,null,null,null,null,null,5.5]
[null,"Jeudi","Laura","AKUVI",null,null,"C","C","C","C","C","C","C","c","c","c","c","c","c","c","c","C","C","C","c","c",null,null,null,null,null,null,null,null,null,null,"C","c","c","c","c","c","c","c","c","c","c","c","c","c","c","c","c","c","c",9.75]
[null,null,"Sabrina","IDRISSA",null,null,null,null,null,null,null,null,null,null,"C","C","C","C","C","C","C","C","C","C",null,null,null,null,null,null,null,null,"C","C","C","C","C","C","C","C","C","C","C","C","C","C","C","C","C","C","C","C","C","C","C",8.25]
[null,null,"Brigitte",null,null,null,null,null,null,null,null,null,null,null,null,null,null,null,null,null,null,null,null,null,null,null,null,null,null,null,null,null,null,null,null,null,null,null,null,null,null,null,null,null,null,null,null,null,null,null,null,null,null,null,null,0]
[null,null,"Pauline","HANNE FATOUMATA",null,null,null,null,null,null,null,null,null,null,null,null,null,null,null,null,null,null,null,null,null,null,null,null,null,null,null,null,null,null,null,null,null,null,null,null,null,null,null,null,null,null,null,null,null,null,null,null,null,null,null,0]
[null,null,"Tristan",null,null,null,null,null,null,null,null,null,null,null,null,null,null,null,null,null,null,null,null,null,null,null,null,null,null,null,null,null,null,null,null,null,null,null,null,null,null,null,null,null,null,null,null,null,null,null,null,null,null,null,null,0]
[null,null,"Valentin",null,null,null,null,null,null,null,null,null,null,null,null,null,null,null,null,null,null,null,null,null,null,null,null,null,null,null,null,null,null,null,null,null,null,null,null,null,null,null,null,null,null,null,null,null,null,null,null,null,null,null,null,0]
[null,null,"Guénael","FASSOLATH",null,null,null,null,null,null,null,null,null,null,null,null,null,null,null,null,null,null,null,null,null,null,null,null,null,null,null,null,null,null,null,null,null,null,null,null,null,null,null,null,null,null,null,null,null,null,null,null,null,null,null,0]
[null,null,"Marie",null,null,null,null,null,null,null,null,null,null,null,null,null,null,null,null,null,null,null,null,null,null,null,null,null,null,null,null,null,null,null,null,null,null,null,null,null,null,null,null,null,null,null,null,null,null,null,null,null,null,null,null,0]
[null,null,"Valérie",null,null,null,null,null,null,null,null,null,null,null,null,null,null,null,null,null,null,null,null,null,null,null,null,null,null,null,null,null,null,null,null,null,null,null,null,null,null,null,null,null,null,null,null,null,null,null,null,null,null,null,null,0]
[null,null,"Nathalie",null,null,null,null,null,"C","C","C","C","C","C","C","C","C","C","C","C","C","C","C","C",null,null,null,null,null,null,null,null,"C","C","C","C","C","C","C","C","C","C","C","C","C","C","C","C","C","C","C","C","C","C","C",9.75]
[null,null,"Ophélie",null,null,null,null,null,null,null,null,null,null,null,null,null,null,null,null,null,null,null,null,null,null,null,null,null,null,null,null,null,null,null,null,null,null,null,null,null,null,null,null,null,null,null,null,null,null,null,null,null,null,null,null,0]
[null,null,"TOTAL",null,{"$f":"COUNTA(E54:E67)*0.25","v":0},{"$f":"COUNTA(F54:F67)*0.25","v":0},0.5,0.5,0.75,0.75,0.75,0.75,1,1,1.25,1.25,1.25,1.25,1.25,1.25,1.25,1.25,1.25,1.25,0.75,0.75,0.5,0.5,0.5,0.5,0.5,0.5,0.75,0.75,0.75,0.75,1,1,1,1,1,1,1,1,1,1,1,1,1,1,1,1,1,1,1,{"$f":"SUM(E68:BC68)","v":45}]
[]
[null,"VENDREDI",null,null,"7h-7h15","7h15-7h30","7h30-7h45","7h45-8h","8h-8h15","8h15-8h30","8h30-8h45","8h45-9h","9h-9h15","9h15-9H30","9h30-9H45","9h45-10H","10h-10H15","10h15-10H30","10h30-10h45","10h45-11H","11h-11H15","11h15-11H30","11h30-11H45","11h45-12H","12h-12H15","12h15-12H30","12h30-12H45","12h45-13H","13h-13H15","13h15-13H30","13h30-13H45","13H45-14H","14H-14H15","14h15-14H30","14h30-14H45","14H45-15H","15H-15H15","15h15-15h30","15h30-15h45","15h45-16h","16h-16h15","16h15-16h30","16h30-16h45","16h45-17h","17h-17h15","17h15-17h30","17h30-17h45","17h45-18h","18h-18h15","18h15-18h30","18h30-18h45","18h45-19h","19h-19h15","19h15-19h30","19h30-19h45","total"]
[null,"r = rayon","Angélique",null,null,null,null,null,null,null,null,null,"c","c","c","c","C","C","C","C","C","c","c","c",null,null,null,null,null,null,null,null,"c","c","c","c","c","c","c","c","c","c","c","c","c","c","c","c","c","c","c","c","c","c","c",{"$f":"COUNTA(E71:BC71)*0.25","v":8.75}]
[null,"c = caisse","Danielle",null,null,null,null,null,null,null,null,null,null,null,null,null,null,null,null,null,null,null,null,null,null,null,null,null,null,null,null,null,"c","c","c","c","c","c","c","c","c","c","c","c","c","c","c","c","c","c","c","c","c","c","c",{"$f":"COUNTA(E72:BC72)*0.25","v":5.75}]
[null,null,"Sylvina","AKUVI",null,null,"c","c","c","c","c","c","c","c","c","c","c","c","c","c","c","C","C","C","C","C","C","C","C","C","C","C",null,null,null,null,null,null,null,null,null,null,null,null,null,null,null,null,null,null,null,null,null,null,null,6.5]
[null,"Vendredi","Laura","AKUVI",null,null,null,null,null,null,null,null,"c","C","C","C","C","C","C","C","C","C","C","C","c","c","c","c","c","c","c","c",null,null,null,null,null,null,null,null,null,null,null,null,null,null,null,null,null,null,null,null,null,null,null,5]
[null,null,"Sabrina","IDRISSA",null,null,null,null,null,null,null,null,"C","C","C","C","C","C","C","C","C","C","C","C","C","C",null,null,null,null,null,null,null,null,null,null,"C","C","C","C","C","C","C","C","C","C","C","C","C","C","C","C","C","C","C",8.25]
[null,null,"Brigitte",null,null,null,null,null,null,null,null,null,null,null,null,null,null,null,null,null,null,null,null,null,null,null,null,null,null,null,null,null,null,null,null,null,null,"c","c","c","c","c","c","c","c","c","c","c","c","c","c","c","c","c","c",4.5]
[null,null,"Pauline","HANNE FATOUMATA",null,null,null,null,null,null,null,null,null,null,null,null,null,null,null,null,null,null,null,null,null,null,null,null,null,null,null,null,null,null,null,null,null,null,null,null,null,null,null,null,null,null,null,null,null,null,null,null,null,null,null,0]
[null,null,"Tristan",null,null,null,null,null,null,null,null,null,null,null,null,null,null,null,null,null,null,null,null,null,null,null,null,null,null,null,null,null,null,null,null,null,null,null,null,null,null,null,null,null,null,null,null,null,null,null,null,null,null,null,null,0]
[null,null,"Valentin",null,null,null,null,null,null,null,null,null,null,null,null,null,null,null,null,null,null,null,null,null,null,null,null,null,null,null,null,null,null,null,null,null,null,null,null,null,null,null,null,null,null,null,null,null,null,null,null,null,null,null,null,0]
[null,null,"Guénael","FASSOLATH",null,null,null,null,null,null,null,null,null,null,null,null,null,null,null,null,null,null,null,null,null,null,null,null,null,null,null,null,null,null,null,null,null,null,null,null,null,null,null,null,null,null,null,null,null,null,null,null,null,null,null,0]
[null,null,"Marie",null,null,null,null,null,null,null,null,null,null,null,null,null,null,null,null,null,null,null,null,null,null,null,null,null,null,null,null,null,null,null,null,null,null,null,null,null,null,null,null,null,null,null,null,null,null,null,null,null,null,null,null,0]
[null,null,"Valérie",null,null,null,null,null,null,null,null,null,null,null,null,null,null,null,null,null,null,null,null,null,null,null,null,null,null,null,null,null,"C","C","C","C","C","C","C","C","C","C","C","C","C","C","C","C","C","C","C","C","C","C","C",5.75]
[null,null,"Nathalie",null,null,null,null,null,"C","C","C","C","C","C","C","C","C","C","C","C","C","C","c","c","c","c","c","c","c","c","c","c","c",null,null,null,null,null,null,null,null,null,null,null,null,null,null,null,null,null,null,null,null,null,null,6.25]
[null,null,"Ophélie",null,null,null,null,null,null,null,null,null,null,null,null,null,null,null,null,null,null,null,null,null,null,null,null,null,null,null,null,null,null,null,null,null,null,null,null,null,null,null,null,null,null,null,null,null,null,null,null,null,null,null,null,0]
[null,null,"TOTAL",null,{"$f":"COUNTA(E71:E84)*0.25","v":0},{"$f":"COUNTA(F71:F84)*0.25","v":0},0.25,0.25,0.5,0.5,0.5,0.5,1.25,1.25,1.25,1.25,1.25,1.25,1.25,1.25,1.25,1.25,1.25,1.25,1,1,0.75,0.75,0.75,0.75,0.75,0.75,1,0.75,0.75,0.75,1,1.25,1.25,1.25,1.25,1.25,1.25,1.25,1.25,1.25,1.25,1.25,1.25,1.25,1.25,1.25,1.25,1.25,1.25,{"$f":"SUM(E85:BC85)","v":50.75}]
[]
[null,"SAMEDI",null,null,"7h-7h15","7h15-7h30","7h30-7h45","7h45-8h","8h-8h15","8h15-8h30","8h30-8h45","8h45-9h","9h-9h15","9h15-9H30","9h30-9H45","9h45-10H","10h-10H15","10h15-10H30","10h30-10h45","10h45-11H","11h-11H15","11h15-11H30","11h30-11H45","11h45-12H","12h-12H15","12h15-12H30","12h30-12H45","12h45-13H","13h-13H15","13h15-13H30","13h30-13H45","13H45-14H","14H-14H15","14h15-14H30","14h30-14H45","14H45-15H","15H-15H15","15h15-15h30","15h30-15h45","15h45-16h","16h-16h15","16h15-16h30","16h30-16h45","16h45-17h","17h-17h15","17h15-17h30","17h30-17h45","17h45-18h","18h-18h15","18h15-18h30","18h30-18h45","18h45-19h","19h-19h15","19h15-19h30","19h30-19h45","total"]
[null,"r = rayon","Angélique",null,null,null,null,null,null,null,null,null,"C","C","c","c","c","C","C","C","C","C","C","C","C","C",null,null,null,null,null,null,null,null,null,null,null,null,null,null,null,null,null,null,null,null,null,null,null,null,null,null,null,null,null,{"$f":"COUNTA(E88:BC88)*0.25","v":3.5}]
[null,"c = caisse","Danielle",null,null,null,null,null,null,null,null,null,"c","c","c","c","C","C","C","C","C","C","C","c","c","c","c","c","c","c","c","C",null,null,null,null,null,null,null,null,null,null,null,null,null,null,null,null,null,null,null,null,null,null,null,{"$f":"COUNTA(E89:BC89)*0.25","v":5}]
[null,"Samedi","Sylvina","AKUVI",null,null,"c","c","c","c","c","c","c","c","c","c","c","c","c","c","c","C","C","C","C","C","C","C",null,null,null,null,null,null,null,null,null,null,null,null,null,null,null,null,null,null,null,null,null,null,null,null,null,null,null,5.5]
[null,null,"Laura","AKUVI",null,null,null,null,null,null,null,null,"c","c","c","c","c","c","c","C","C","C","C","C","C","C","C","C","C","C",null,null,null,null,null,null,null,null,null,null,null,null,null,null,null,null,null,null,null,null,null,null,null,null,null,4.5]
[null,null,"Sabrina","IDRISSA",null,null,null,null,null,null,null,null,null,null,"c","c","c","c","c","C","C","C","C","C","C","C","C","C","C","C","C","C",null,null,null,null,null,null,null,null,null,null,null,null,null,null,null,null,null,null,null,null,null,null,null,4.5]
[null,null,"Brigitte",null,null,null,null,null,null,null,null,null,"C","c","c","c","C","C","C","C","C","C","C","C","C","C","C","C","C","C",null,null,null,null,null,null,null,null,"c","c","c","c","c","c","c","c","c","c","c","c","c","c","c","c",null,8.5]
[null,null,"Pauline","HANNE FATOUMATA",null,null,null,null,null,null,null,null,"C","C","C","C","C","C","C","C","C","c","c","c",null,null,null,null,null,null,null,null,null,null,null,"C","c","c","c","c","c","c","c","c","c","c","c","c","c","c","c","c","c","c","c",8]
[null,null,"Tristan",null,null,null,null,null,null,null,null,null,null,null,null,null,null,null,null,null,null,null,null,null,null,null,null,null,null,null,null,null,null,null,null,null,null,null,null,null,null,null,null,null,null,null,null,null,null,null,null,null,null,null,null,0]
[null,null,"Valentin",null,null,null,null,null,null,null,null,null,null,null,null,null,null,null,null,null,null,null,null,null,null,null,null,null,null,null,null,null,null,null,null,null,null,null,"c","c","c","c","c","c","c","c","c","c","c","c","c","c","c","c","c",4.25]
[null,null,"Guénael","FASSOLATH",null,null,null,null,null,null,null,null,null,null,null,null,null,null,null,null,null,null,null,null,null,null,null,null,null,null,null,null,null,null,null,null,null,null,null,"c","c","c","c","c","c","c","c","c","c","c","c","c","c","c","c",4]
[null,null,"Marie",null,null,null,null,null,null,null,null,null,null,null,null,null,null,null,null,null,null,null,null,null,null,null,null,null,null,null,"c","c","c","c","c","c","c","c","c","c","c","c","c","c","c","c","c","c","c","c","c","c","c","c","c",6.25]
[null,null,"Valérie",null,null,null,null,null,null,null,null,null,null,null,null,null,null,null,null,null,null,null,null,null,null,null,null,null,null,null,null,null,"C","C","C","C","C","C","C","C","C","C","C","C","C","C","C","C","C","C","C","C","C","C","C",5.75]
[null,null,"Nathalie",null,null,null,"C","C","C","C","C","C","C","C","C","C","C","C","C","C","C","c","c","c","c","c","c","c","c","c","c","c","c",null,null,null,null,null,null,null,null,null,null,null,null,null,null,null,null,null,null,null,null,null,null,6.75]
[null,null,"Ophélie",null,null,null,null,null,null,null,null,null,null,null,null,null,null,null,null,null,null,null,null,null,null,null,null,null,null,null,null,"C","C","C","C","C","C","C","C","C","C","C","C","C","C","C","C","C","C","C","C","C","C","C","C",6]
[null,null,"TOTAL",null,{"$f":"COUNTA(E88:E101)*0.25","v":0},{"$f":"COUNTA(F88:F101)*0.25","v":0},0.5,0.5,0.5,0.5,0.5,0.5,1.75,1.75,2,2,2,2,2,2,2,2,2,2,1.75,1.75,1.5,1.5,1.25,1.25,1,1.25,1,0.75,0.75,1,1,1,1.5,1.75,1.75,1.75,1.75,1.75,1.75,1.75,1.75,1.75,1.75,1.75,1.75,1.75,1.75,1.75,1.5,{"$f":"SUM(BD88:BD101)","v":72.5}]
[]
[null,"Dimanche",null,null,"7h-7h15","7h15-7h30","7h30-7h45","7h45-8h","8h-8h15","8h15-8h30","8h30-8h45","8h45-9h","9h-9h15","9h15-9H30","9h30-9H45","9h45-10H","10h-10H15","10h15-10H30","10h30-10h45","10h45-11H","11h-11H15","11h15-11H30","11h30-11H45","11h45-12H","12h-12H15","12h15-12H30","12h30-12H45","12h45-13H","13h-13H15","13h15-13H30","13h30-13H45","13H45-14H","14H-14H15","14h15-14H30","14h30-14H45","14H45-15H","15H-15H15","15h15-15h30","15h30-15h45","15h45-16h","16h-16h15","16h15-16h30","16h30-16h45","16h45-17h","17h-17h15","17h15-17h30","17h30-17h45","17h45-18h","18h-18h15","18h15-18h30","18h30-18h45","18h45-19h","19h-19h15","19h15-19h30","19h30-19h45","total"]
[null,"r = rayon","Angélique",null,null,null,null,null,null,null,null,null,null,null,null,null,null,null,null,null,null,null,null,null,null,null,null,null,null,null,null,null,null,null,null,null,null,null,null,null,null,null,null,null,null,null,null,null,null,null,null,null,null,null,null,{"$f":"COUNTA(E105:BC105)*0.25","v":0}]
[null,"c = caisse","Danielle",null,null,null,null,null,null,null,null,null,null,null,null,null,null,null,null,null,null,null,null,null,null,null,null,null,null,null,null,null,null,null,null,null,null,null,null,null,null,null,null,null,null,null,null,null,null,null,null,null,null,null,null,{"$f":"COUNTA(E106:BC106)*0.25","v":0}]
[null,"Dimanche","Sylvina","AKUVI",null,null,null,null,null,null,null,null,null,null,null,null,null,null,null,null,null,null,null,null,null,null,null,null,null,null,null,null,null,null,null,null,null,null,null,null,null,null,null,null,null,null,null,null,null,null,null,null,null,null,null,0]
[null,null,"Laura","AKUVI",null,null,null,null,null,null,null,null,null,null,null,null,null,null,null,null,null,null,null,null,null,null,null,null,null,null,null,null,null,null,null,null,null,null,null,null,null,null,null,null,null,null,null,null,null,null,null,null,null,null,null,0]
[null,null,"Sabrina","IDRISSA",null,null,null,null,null,null,null,null,null,null,null,null,null,null,null,null,null,null,null,null,null,null,null,null,null,null,null,null,null,null,null,null,null,null,null,null,null,null,null,null,null,null,null,null,null,null,null,null,null,null,null,0]
[null,null,"Brigitte",null,null,null,null,null,null,null,null,null,"C","C","C","C","C","C","C","C","C","C","C","C","C","C","C","C",null,null,null,null,null,null,null,null,null,null,null,null,null,null,null,null,null,null,null,null,null,null,null,null,null,null,null,4]
[null,null,"Pauline","HANNE FATOUMATA",null,null,null,null,null,null,null,null,"c","c","c","c","c","c","c","c","c","c","c","c","c","c","c","c",null,null,null,null,null,null,null,null,null,null,null,null,null,null,null,null,null,null,null,null,null,null,null,null,null,null,null,4]
[null,null,"Tristan",null,null,null,null,null,null,null,null,null,null,null,null,null,null,null,null,null,null,null,null,null,null,null,null,null,null,null,null,null,null,null,null,null,null,null,null,null,null,null,null,null,null,null,null,null,null,null,null,null,null,null,null,0]
[null,null,"Valentin",null,null,"R","R","R","R","R","R","R","R","R","c","c","c","c","c","C","C","C","C","C","C","C","C","C",null,null,null,null,null,null,null,null,null,null,null,null,null,null,null,null,null,null,null,null,null,null,null,null,null,null,null,5.75]
[null,null,"Guénael","FASSOLATH","R","R","R","R","R","R","R","R","R","R","R","R","c","c","c","C","C","C","C","C","C","C","C","C",null,null,null,null,null,null,null,null,null,null,null,null,null,null,null,null,null,null,null,null,null,null,null,null,null,null,null,6]
[null,null,"Marie",null,null,null,null,null,null,null,null,null,null,"c","c","c","c","c","c","c","c","c","c","c","c","c","c","c",null,null,null,null,null,null,null,null,null,null,null,null,null,null,null,null,null,null,null,null,null,null,null,null,null,null,null,3.75]
[null,null,"Valérie",null,null,null,"C","C","C","C","C","C","C","C","C","C","C","C","C","C","C","C","C","C","C","C","C","C",null,null,null,null,null,null,null,null,null,null,null,null,null,null,null,null,null,null,null,null,null,null,null,null,null,null,null,5.5]
[null,null,"Nathalie",null,null,null,null,null,null,null,null,null,null,null,null,null,null,null,null,null,null,null,null,null,null,null,null,null,null,null,null,null,null,null,null,null,null,null,null,null,null,null,null,null,null,null,null,null,null,null,null,null,null,null,null,0]
[null,null,"Ophélie",null,null,null,null,null,null,null,null,null,"C","C","C","C","C","C","C","C","C","C","C","C","C","C","C","C",null,null,null,null,null,null,null,null,null,null,null,null,null,null,null,null,null,null,null,null,null,null,null,null,null,null,null,4]
[null,null,"TOTAL",null,{"$f":"COUNTA(E105:E118)*0.25","v":0.25},{"$f":"COUNTA(F105:F118)*0.25","v":0.5},0.75,0.75,0.75,0.75,0.75,0.75,1.5,1.75,1.75,1.75,1.75,1.75,1.75,1.75,1.75,1.75,1.75,1.75,1.75,1.75,1.75,1.75,0,0,0,0,0,0,0,0,0,0,0,0,0,0,0,0,0,0,0,0,0,0,0,0,0,0,0,{"$f":"SUM(E119:BC119)","v":33}]
[]
[null,"Signatures OBLIGATOIRES"]
[]
[]
[]
[]
[null,"Planning",null,null,"7h-7h15","7h15-7h30","7h30-7h45","7h45-8h","8h-8h15","8h15-8h30","8h30-8h45","8h45-9h","9h-9h15","9h15-9H30","9h30-9H45","9h45-10H","10h-10H15","10h15-10H30","10h30-10h45","10h45-11H","11h-11H15","11h15-11H30","11h30-11H45","11h45-12H","12h-12H15","12h15-12H30","12h30-12H45","12h45-13H","13h-13H15","13h15-13H30","13h30-13H45","13H45-14H","14H-14H15","14h15-14H30","14h30-14H45","14H45-15H","15H-15H15","15h15-15h30","15h30-15h45","15h45-16h","16h-16h15","16h15-16h30","16h30-16h45","16h45-17h","17h-17h15","17h15-17h30","17h30-17h45","17h45-18h","18h-18h15","18h15-18h30","18h30-18h45","18h45-19h","19h-19h15","19h15-19h30","19h30-19h45"]
[null,"TOTAL Semaine",{"$f":"+C105","v":"Angélique"},"R",{"$f":"(IF(E3=\"r\",1,0)+IF(E20=\"r\",1,0)+IF(E37=\"r\",1,0)+IF(E54=\"r\",1,0)+IF(E71=\"r\",1,0)+IF(E88=\"r\",1,0)+IF(E105=\"r\",1,0))/4","v":0},{"$f":"(IF(F3=\"r\",1,0)+IF(F20=\"r\",1,0)+IF(F37=\"r\",1,0)+IF(F54=\"r\",1,0)+IF(F71=\"r\",1,0)+IF(F88=\"r\",1,0)+IF(F105=\"r\",1,0))/4","v":0},0,0,0,0,0,0,0,0,0,0,0,0,0,0,0,0,0,0,0,0,0,0,0,0,0,0,0,0,0,0,0,0,0,0,0,0,0,0,0,0,0,0,0,0,0,0,0,0,0,{"$f":"SUM(E131:BC131)","v":0},{"$f":"SUM(BD127+BD128)","v":25}]
[null,null,null,"C",{"$f":"(IF(E3=\"c\",1,0)+IF(E20=\"c\",1,0)+IF(E37=\"c\",1,0)+IF(E54=\"c\",1,0)+IF(E71=\"c\",1,0)+IF(E88=\"c\",1,0)+IF(E105=\"c\",1,0))/4","v":0},{"$f":"(IF(F3=\"c\",1,0)+IF(F20=\"c\",1,0)+IF(F37=\"c\",1,0)+IF(F54=\"c\",1,0)+IF(F71=\"c\",1,0)+IF(F88=\"c\",1,0)+IF(F105=\"c\",1,0))/4","v":0},0,0,0,0,0,0,0.75,0.75,0.75,0.75,0.75,0.75,0.75,0.75,0.75,0.75,0.75,0.75,0.5,0.5,0.25,0.25,0.5,0.5,0.5,0.5,0.75,0.75,0.75,0.75,0.5,0.5,0.5,0.5,0.5,0.5,0.5,0.5,0.5,0.5,0.5,0.5,0.5,0.5,0.5,0.5,0.5,0.5,0.5,{"$f":"SUM(E128:BC128)","v":25}]
[null,null,{"$f":"+C106","v":"Danielle"},"R",{"$f":"(IF(E4=\"r\",1,0)+IF(E21=\"r\",1,0)+IF(E38=\"r\",1,0)+IF(E55=\"r\",1,0)+IF(E72=\"r\",1,0)+IF(E89=\"r\",1,0)+IF(E106=\"r\",1,0))/4","v":0},{"$f":"(IF(F4=\"r\",1,0)+IF(F21=\"r\",1,0)+IF(F38=\"r\",1,0)+IF(F55=\"r\",1,0)+IF(F72=\"r\",1,0)+IF(F89=\"r\",1,0)+IF(F106=\"r\",1,0))/4","v":0},0,0,0,0,0,0,0,0,0,0,0,0,0,0,0,0,0,0,0,0,0,0,0,0,0,0,0,0,0,0,0,0,0,0,0,0,0,0,0,0,0,0,0,0,0,0,0,0,0,0,{"$f":"SUM(BD129+BD130)","v":36.75}]
[null,null,null,"C",{"$f":"(IF(E4=\"c\",1,0)+IF(E21=\"c\",1,0)+IF(E38=\"c\",1,0)+IF(E55=\"c\",1,0)+IF(E72=\"c\",1,0)+IF(E89=\"c\",1,0)+IF(E106=\"c\",1,0))/4","v":0},{"$f":"(IF(F4=\"c\",1,0)+IF(F21=\"c\",1,0)+IF(F38=\"c\",1,0)+IF(F55=\"c\",1,0)+IF(F72=\"c\",1,0)+IF(F89=\"c\",1,0)+IF(F106=\"c\",1,0))/4","v":0},0,0,0,0,0,0,1,1,1,1,1,1,1,1,1,1,1,1,1,1,0.75,0.75,1,1,1,1,0.75,0.75,0.75,0.75,0.75,0.75,0.75,0.75,0.75,0.75,0.75,0.75,0.75,0.75,0.75,0.75,0.75,0.75,0.75,0.75,0.75,0.75,0.75,36.75]
[null,null,{"$f":"+C107","v":"Sylvina"},"R",{"$f":"(IF(E5=\"r\",1,0)+IF(E22=\"r\",1,0)+IF(E39=\"r\",1,0)+IF(E56=\"r\",1,0)+IF(E73=\"r\",1,0)+IF(E90=\"r\",1,0)+IF(E107=\"r\",1,0))/4","v":0},{"$f":"(IF(F5=\"r\",1,0)+IF(F22=\"r\",1,0)+IF(F39=\"r\",1,0)+IF(F56=\"r\",1,0)+IF(F73=\"r\",1,0)+IF(F90=\"r\",1,0)+IF(F107=\"r\",1,0))/4","v":0},0,0,0,0,0,0,0,0,0,0,0,0,0,0,0,0,0,0,0,0,0,0,0,0,0,0,0,0,0,0,0,0,0,0,0,0,0,0,0,0,0,0,0,0,0,0,0,0,0,0,{"$f":"SUM(BD131+BD132)","v":36.75}]
[null,null,null,"C",{"$f":"(IF(E5=\"c\",1,0)+IF(E22=\"c\",1,0)+IF(E49=\"c\",1,0)+IF(E56=\"c\",1,0)+IF(E73=\"c\",1,0)+IF(E90=\"c\",1,0)+IF(E107=\"c\",1,0))/4","v":0},{"$f":"(IF(F6=\"c\",1,0)+IF(F23=\"c\",1,0)+IF(F40=\"c\",1,0)+IF(F57=\"c\",1,0)+IF(F74=\"c\",1,0)+IF(F91=\"c\",1,0)+IF(F108=\"c\",1,0))/4","v":0},0.5,0.5,0.5,0.5,0.5,0.5,1.25,1.25,1.25,1.25,1.25,1.25,1.25,1.25,1.25,1.25,1.25,1.25,1,1,0.75,0.75,0.75,0.75,0.5,0.5,0,0,0,0,0.75,0.75,0.75,0.75,0.75,0.75,0.75,0.75,0.75,0.75,0.75,0.75,0.75,0.75,0.75,0.75,0.25,0.25,0.25,36.75]
[null,null,{"$f":"+C108","v":"Laura"},"R",{"$f":"(IF(E6=\"r\",1,0)+IF(E23=\"r\",1,0)+IF(E40=\"r\",1,0)+IF(E57=\"r\",1,0)+IF(E74=\"r\",1,0)+IF(E91=\"r\",1,0)+IF(E108=\"r\",1,0))/4","v":0},{"$f":"(IF(F6=\"r\",1,0)+IF(F23=\"r\",1,0)+IF(F40=\"r\",1,0)+IF(F57=\"r\",1,0)+IF(F74=\"r\",1,0)+IF(F91=\"r\",1,0)+IF(F108=\"r\",1,0))/4","v":0},0,0,0,0,0,0,0,0,0,0,0,0,0,0,0,0,0,0,0,0,0,0,0,0,0,0,0,0,0,0,0,0,0,0,0,0,0,0,0,0,0,0,0,0,0,0,0,0,0,0,{"$f":"SUM(BD133+BD134)","v":36.75}]
[null,null,null,"C",{"$f":"(IF(E6=\"c\",1,0)+IF(E23=\"c\",1,0)+IF(E40=\"c\",1,0)+IF(E57=\"c\",1,0)+IF(E74=\"c\",1,0)+IF(E91=\"c\",1,0)+IF(E108=\"c\",1,0))/4","v":0},{"$f":"(IF(F6=\"c\",1,0)+IF(F23=\"c\",1,0)+IF(F40=\"c\",1,0)+IF(F57=\"c\",1,0)+IF(F74=\"c\",1,0)+IF(F91=\"c\",1,0)+IF(F108=\"c\",1,0))/4","v":0},0.5,0.5,0.5,0.5,0.5,0.5,1.25,1.25,1.25,1.25,1.25,1.25,1.25,1.25,1.25,1.25,1.25,1.25,1,1,0.75,0.75,0.75,0.75,0.5,0.5,0,0,0,0,0.75,0.75,0.75,0.75,0.75,0.75,0.75,0.75,0.75,0.75,0.75,0.75,0.75,0.75,0.75,0.75,0.25,0.25,0.25,36.75]
[null,null,{"$f":"+C109","v":"Sabrina"},"R",{"$f":"(IF(E7=\"r\",1,0)+IF(E24=\"r\",1,0)+IF(E41=\"r\",1,0)+IF(E58=\"r\",1,0)+IF(E75=\"r\",1,0)+IF(E92=\"r\",1,0)+IF(E109=\"r\",1,0))/4","v":0},{"$f":"(IF(F7=\"r\",1,0)+IF(F24=\"r\",1,0)+IF(F41=\"r\",1,0)+IF(F58=\"r\",1,0)+IF(F75=\"r\",1,0)+IF(F92=\"r\",1,0)+IF(F109=\"r\",1,0))/4","v":0},0,0,0,0,0,0,0,0,0,0,0,0,0,0,0,0,0,0,0,0,0,0,0,0,0,0,0,0,0,0,0,0,0,0,0,0,0,0,0,0,0,0,0,0,0,0,0,0,0,0,{"$f":"SUM(BD135+BD136)","v":30}]
[null,null,null,"C",{"$f":"(IF(E7=\"c\",1,0)+IF(E24=\"c\",1,0)+IF(E41=\"c\",1,0)+IF(E58=\"c\",1,0)+IF(E75=\"c\",1,0)+IF(E92=\"c\",1,0)+IF(E109=\"c\",1,0))/4","v":0},{"$f":"(IF(F7=\"c\",1,0)+IF(F24=\"c\",1,0)+IF(F41=\"c\",1,0)+IF(F58=\"c\",1,0)+IF(F75=\"c\",1,0)+IF(F92=\"c\",1,0)+IF(F109=\"c\",1,0))/4","v":0},0,0,0,0,0,0,0.25,0.25,0.75,0.75,0.75,0.75,0.75,0.75,0.75,0.75,0.75,0.75,0.5,0.5,0.25,0.25,0.25,0.25,0.25,0.25,0.25,0.25,0.25,0.25,0.75,0.75,1,1,1,1,1,1,1,1,1,1,1,1,1,1,1,1,1,30]
[null,null,{"$f":"+C110","v":"Brigitte"},"R",{"$f":"(IF(E8=\"r\",1,0)+IF(E25=\"r\",1,0)+IF(E42=\"r\",1,0)+IF(E59=\"r\",1,0)+IF(E76=\"r\",1,0)+IF(E93=\"r\",1,0)+IF(E110=\"r\",1,0))/4","v":0},{"$f":"(IF(F8=\"r\",1,0)+IF(F25=\"r\",1,0)+IF(F42=\"r\",1,0)+IF(F59=\"r\",1,0)+IF(F76=\"r\",1,0)+IF(F93=\"r\",1,0)+IF(F110=\"r\",1,0))/4","v":0},0,0,0,0,0,0,0,0,0,0,0,0,0,0,0,0,0,0,0,0,0,0,0,0,0,0,0,0,0,0,0,0,0,0,0,0,0,0,0,0,0,0,0,0,0,0,0,0,0,0,{"$f":"SUM(BD137+BD138)","v":37}]
[null,null,null,"C",{"$f":"(IF(E8=\"c\",1,0)+IF(E25=\"c\",1,0)+IF(E42=\"c\",1,0)+IF(E59=\"c\",1,0)+IF(E76=\"c\",1,0)+IF(E93=\"c\",1,0)+IF(E110=\"c\",1,0))/4","v":0},{"$f":"(IF(F8=\"c\",1,0)+IF(F25=\"c\",1,0)+IF(F42=\"c\",1,0)+IF(F59=\"c\",1,0)+IF(F76=\"c\",1,0)+IF(F93=\"c\",1,0)+IF(F110=\"c\",1,0))/4","v":0},0,0,0,0,0,0,1.25,1.25,1.25,1.25,1.25,1.25,1.25,1.25,1.25,1.25,1.25,1.25,1.25,1,1,1,0.75,0.75,0.25,0.25,0,0,0,0,0,0.25,0.5,0.5,1,1,1,1,1,1,1,1,1,1,1,1,1,1,0.5,37]
[null,null,{"$f":"+C111","v":"Pauline"},"R",{"$f":"(IF(E9=\"r\",1,0)+IF(E26=\"r\",1,0)+IF(E43=\"r\",1,0)+IF(E60=\"r\",1,0)+IF(E77=\"r\",1,0)+IF(E94=\"r\",1,0)+IF(E111=\"r\",1,0))/4","v":0},{"$f":"(IF(F9=\"r\",1,0)+IF(F26=\"r\",1,0)+IF(F43=\"r\",1,0)+IF(F60=\"r\",1,0)+IF(F77=\"r\",1,0)+IF(F94=\"r\",1,0)+IF(F111=\"r\",1,0))/4","v":0},0,0,0,0,0,0,0,0,0,0,0,0,0,0,0,0,0,0,0,0,0,0,0,0,0,0,0,0,0,0,0,0,0,0,0,0,0,0,0,0,0,0,0,0,0,0,0,0,0,0,{"$f":"SUM(BD139+BD140)","v":12}]
[null,null,null,"C",{"$f":"(IF(E9=\"c\",1,0)+IF(E26=\"c\",1,0)+IF(E43=\"c\",1,0)+IF(E60=\"c\",1,0)+IF(E77=\"c\",1,0)+IF(E94=\"c\",1,0)+IF(E111=\"c\",1,0))/4","v":0},{"$f":"(IF(F9=\"c\",1,0)+IF(F26=\"c\",1,0)+IF(F43=\"c\",1,0)+IF(F60=\"c\",1,0)+IF(F77=\"c\",1,0)+IF(F94=\"c\",1,0)+IF(F111=\"c\",1,0))/4","v":0},0,0,0,0,0,0,0.5,0.5,0.5,0.5,0.5,0.5,0.5,0.5,0.5,0.5,0.5,0.5,0.25,0.25,0.25,0.25,0,0,0,0,0,0,0,0.25,0.25,0.25,0.25,0.25,0.25,0.25,0.25,0.25,0.25,0.25,0.25,0.25,0.25,0.25,0.25,0.25,0.25,0.25,0.25,12]
[null,null,{"$f":"+C112","v":"Tristan"},"R",{"$f":"(IF(E10=\"c\",1,0)+IF(E27=\"c\",1,0)+IF(E44=\"c\",1,0)+IF(E61=\"c\",1,0)+IF(E78=\"c\",1,0)+IF(E95=\"c\",1,0)+IF(E112=\"c\",1,0))/4","v":0},{"$f":"(IF(F10=\"c\",1,0)+IF(F27=\"c\",1,0)+IF(F44=\"c\",1,0)+IF(F61=\"c\",1,0)+IF(F78=\"c\",1,0)+IF(F95=\"c\",1,0)+IF(F112=\"c\",1,0))/4","v":0},0,0,0,0,0,0,0,0,0,0,0,0,0,0,0,0,0,0,0,0,0,0,0,0,0,0,0,0,0,0,0,0,0,0,0,0,0,0,0,0,0,0,0,0,0,0,0,0,0,0,{"$f":"SUM(BD141+BD142)","v":0}]
[null,null,null,"C",{"$f":"(IF(E10=\"c\",1,0)+IF(E27=\"c\",1,0)+IF(E44=\"c\",1,0)+IF(E61=\"c\",1,0)+IF(E78=\"c\",1,0)+IF(E95=\"c\",1,0)+IF(E112=\"c\",1,0))/4","v":0},{"$f":"(IF(F10=\"c\",1,0)+IF(F27=\"c\",1,0)+IF(F44=\"c\",1,0)+IF(F61=\"c\",1,0)+IF(F78=\"c\",1,0)+IF(F95=\"c\",1,0)+IF(F112=\"c\",1,0))/4","v":0},0,0,0,0,0,0,0,0,0,0,0,0,0,0,0,0,0,0,0,0,0,0,0,0,0,0,0,0,0,0,0,0,0,0,0,0,0,0,0,0,0,0,0,0,0,0,0,0,0,0]
[null,null,{"$f":"+C113","v":"Valentin"},"R",{"$f":"(IF(E11=\"r\",1,0)+IF(E28=\"r\",1,0)+IF(E45=\"r\",1,0)+IF(E62=\"r\",1,0)+IF(E79=\"r\",1,0)+IF(E96=\"r\",1,0)+IF(E113=\"r\",1,0))/4","v":0},{"$f":"(IF(F11=\"r\",1,0)+IF(F28=\"r\",1,0)+IF(F45=\"r\",1,0)+IF(F62=\"r\",1,0)+IF(F79=\"r\",1,0)+IF(F96=\"r\",1,0)+IF(F113=\"r\",1,0))/4","v":0.25},0.25,0.25,0.25,0.25,0.25,0.25,0.25,0.25,0,0,0,0,0,0,0,0,0,0,0,0,0,0,0,0,0,0,0,0,0,0,0,0,0,0,0,0,0,0,0,0,0,0,0,0,0,0,0,0,0,2.25,{"$f":"SUM(BD143+BD144)","v":10}]
[null,null,null,"C",{"$f":"(IF(E11=\"c\",1,0)+IF(E28=\"c\",1,0)+IF(E45=\"c\",1,0)+IF(E62=\"c\",1,0)+IF(E79=\"c\",1,0)+IF(E96=\"c\",1,0)+IF(E113=\"c\",1,0))/4","v":0},{"$f":"(IF(F11=\"c\",1,0)+IF(F28=\"c\",1,0)+IF(F45=\"c\",1,0)+IF(F62=\"c\",1,0)+IF(F79=\"c\",1,0)+IF(F96=\"c\",1,0)+IF(F113=\"c\",1,0))/4","v":0},0,0,0,0,0,0,0,0,0.25,0.25,0.25,0.25,0.25,0.25,0.25,0.25,0.25,0.25,0.25,0.25,0.25,0.25,0,0,0,0,0,0,0,0,0,0,0.25,0.25,0.25,0.25,0.25,0.25,0.25,0.25,0.25,0.25,0.25,0.25,0.25,0.25,0.25,0.25,0.25,7.75]
[null,null,{"$f":"+C114","v":"Guénael"},"R",{"$f":"(IF(E12=\"r\",1,0)+IF(E29=\"r\",1,0)+IF(E46=\"r\",1,0)+IF(E63=\"r\",1,0)+IF(E80=\"r\",1,0)+IF(E97=\"r\",1,0)+IF(E114=\"r\",1,0))/4","v":0.25},{"$f":"(IF(F12=\"r\",1,0)+IF(F29=\"r\",1,0)+IF(F46=\"r\",1,0)+IF(F63=\"r\",1,0)+IF(F80=\"r\",1,0)+IF(F97=\"r\",1,0)+IF(F114=\"r\",1,0))/4","v":0.25},0.25,0.25,0.25,0.25,0.25,0.25,0.25,0.25,0.25,0.25,0,0,0,0,0,0,0,0,0,0,0,0,0,0,0,0,0,0,0,0,0,0,0,0,0,0,0,0,0,0,0,0,0,0,0,0,0,0,0,3,{"$f":"SUM(BD145+BD146)","v":10}]
[null,null,null,"C",{"$f":"(IF(E12=\"c\",1,0)+IF(E29=\"c\",1,0)+IF(E46=\"c\",1,0)+IF(E63=\"c\",1,0)+IF(E80=\"c\",1,0)+IF(E97=\"c\",1,0)+IF(E114=\"c\",1,0))/4","v":0},{"$f":"(IF(F12=\"c\",1,0)+IF(F29=\"c\",1,0)+IF(F46=\"c\",1,0)+IF(F63=\"c\",1,0)+IF(F80=\"c\",1,0)+IF(F97=\"c\",1,0)+IF(F114=\"c\",1,0))/4","v":0},0,0,0,0,0,0,0,0,0,0,0.25,0.25,0.25,0.25,0.25,0.25,0.25,0.25,0.25,0.25,0.25,0.25,0,0,0,0,0,0,0,0,0,0,0,0.25,0.25,0.25,0.25,0.25,0.25,0.25,0.25,0.25,0.25,0.25,0.25,0.25,0.25,0.25,0.25,7]
[null,null,{"$f":"+C115","v":"Marie"},"R",{"$f":"(IF(E13=\"r\",1,0)+IF(E30=\"r\",1,0)+IF(E47=\"r\",1,0)+IF(E64=\"r\",1,0)+IF(E81=\"r\",1,0)+IF(E98=\"r\",1,0)+IF(E115=\"r\",1,0))/4","v":0},{"$f":"(IF(F13=\"r\",1,0)+IF(F30=\"r\",1,0)+IF(F47=\"r\",1,0)+IF(F64=\"r\",1,0)+IF(F81=\"r\",1,0)+IF(F98=\"r\",1,0)+IF(F115=\"r\",1,0))/4","v":0},0,0,0,0,0,0,0,0,0,0,0,0,0,0,0,0,0,0,0,0,0,0,0,0,0,0,0,0,0,0,0,0,0,0,0,0,0,0,0,0,0,0,0,0,0,0,0,0,0,0,{"$f":"SUM(BD147+BD148)","v":10}]
[null,null,null,"C",{"$f":"(IF(E13=\"c\",1,0)+IF(E30=\"c\",1,0)+IF(E47=\"c\",1,0)+IF(E64=\"c\",1,0)+IF(E81=\"c\",1,0)+IF(E98=\"c\",1,0)+IF(E115=\"c\",1,0))/4","v":0},{"$f":"(IF(F13=\"c\",1,0)+IF(F30=\"c\",1,0)+IF(F47=\"c\",1,0)+IF(F64=\"c\",1,0)+IF(F81=\"c\",1,0)+IF(F98=\"c\",1,0)+IF(F115=\"c\",1,0))/4","v":0},0,0,0,0,0,0,0,0.25,0.25,0.25,0.25,0.25,0.25,0.25,0.25,0.25,0.25,0.25,0.25,0.25,0.25,0.25,0,0,0.25,0.25,0.25,0.25,0.25,0.25,0.25,0.25,0.25,0.25,0.25,0.25,0.25,0.25,0.25,0.25,0.25,0.25,0.25,0.25,0.25,0.25,0.25,0.25,0.25,10]
[null,null,{"$f":"+C116","v":"Valérie"},"R",{"$f":"(IF(E14=\"r\",1,0)+IF(E31=\"r\",1,0)+IF(E48=\"r\",1,0)+IF(E65=\"r\",1,0)+IF(E82=\"r\",1,0)+IF(E99=\"r\",1,0)+IF(E116=\"r\",1,0))/4","v":0},{"$f":"(IF(F14=\"r\",1,0)+IF(F31=\"r\",1,0)+IF(F48=\"r\",1,0)+IF(F65=\"r\",1,0)+IF(F82=\"r\",1,0)+IF(F99=\"r\",1,0)+IF(F116=\"r\",1,0))/4","v":0},0,0,0,0,0,0,0,0,0,0,0,0,0,0,0,0,0,0,0,0,0,0,0,0,0,0,0,0,0,0,0,0,0,0,0,0,0,0,0,0,0,0,0,0,0,0,0,0,0,0,{"$f":"SUM(BD149+BD150)","v":36.75}]
[null,null,null,"C",{"$f":"(IF(E14=\"c\",1,0)+IF(E31=\"c\",1,0)+IF(E48=\"c\",1,0)+IF(E65=\"c\",1,0)+IF(E82=\"c\",1,0)+IF(E99=\"c\",1,0)+IF(E116=\"c\",1,0))/4","v":0},{"$f":"(IF(F14=\"c\",1,0)+IF(F31=\"c\",1,0)+IF(F48=\"c\",1,0)+IF(F65=\"c\",1,0)+IF(F82=\"c\",1,0)+IF(F99=\"c\",1,0)+IF(F116=\"c\",1,0))/4","v":0},0.25,0.25,1,1,1,1,1,1,1,1,1,1,1,1,1,1,1,1,0.75,0.75,0.75,0.75,0,0,0,0,0.75,0.75,0.75,0.75,0.75,0.75,0.75,0.75,0.75,0.75,0.75,0.75,0.75,0.75,0.75,0.75,0.75,0.75,0.75,0.75,0.75,0.75,0.75,36.75]
[null,null,{"$f":"+C117","v":"Nathalie"},"R",{"$f":"(IF(E15=\"r\",1,0)+IF(E32=\"r\",1,0)+IF(E49=\"r\",1,0)+IF(E66=\"r\",1,0)+IF(E83=\"r\",1,0)+IF(E100=\"r\",1,0)+IF(E117=\"r\",1,0))/4","v":0},{"$f":"(IF(F15=\"r\",1,0)+IF(F32=\"r\",1,0)+IF(F49=\"r\",1,0)+IF(F66=\"r\",1,0)+IF(F83=\"r\",1,0)+IF(F100=\"r\",1,0)+IF(F117=\"r\",1,0))/4","v":0},0,0,0,0,0,0,0,0,0,0,0,0,0,0,0,0,0,0,0,0,0,0,0,0,0,0,0,0,0,0,0,0,0,0,0,0,0,0,0,0,0,0,0,0,0,0,0,0,0,0,{"$f":"SUM(BD151+BD152)","v":36.75}]
[null,null,null,"C",{"$f":"(IF(E15=\"c\",1,0)+IF(E32=\"c\",1,0)+IF(E49=\"c\",1,0)+IF(E66=\"c\",1,0)+IF(E83=\"c\",1,0)+IF(E100=\"c\",1,0)+IF(E117=\"c\",1,0))/4","v":0},{"$f":"(IF(F15=\"c\",1,0)+IF(F32=\"c\",1,0)+IF(F49=\"c\",1,0)+IF(F66=\"c\",1,0)+IF(F83=\"c\",1,0)+IF(F100=\"c\",1,0)+IF(F117=\"c\",1,0))/4","v":0},0.25,0.25,0.75,0.75,0.75,0.75,0.75,0.75,0.75,0.75,0.75,0.75,0.75,0.75,0.75,0.75,0.75,0.75,0.5,0.5,0.5,1,1,1,1,1,1.25,0.75,0.75,0.75,0.75,0.75,0.75,0.75,0.75,0.75,0.75,0.75,0.75,0.75,0.75,0.75,0.75,0.75,0.75,0.75,0.75,0.75,0.75,36.75]
[null,null,{"$f":"+C118","v":"Ophélie"},"R",{"$f":"(IF(E16=\"r\",1,0)+IF(E33=\"r\",1,0)+IF(E50=\"r\",1,0)+IF(E67=\"r\",1,0)+IF(E84=\"r\",1,0)+IF(E101=\"r\",1,0)+IF(E118=\"r\",1,0))/4","v":0},{"$f":"(IF(F16=\"r\",1,0)+IF(F33=\"r\",1,0)+IF(F50=\"r\",1,0)+IF(F67=\"r\",1,0)+IF(F84=\"r\",1,0)+IF(F101=\"r\",1,0)+IF(F118=\"r\",1,0))/4","v":0},0,0,0,0,0,0,0,0,0,0,0,0,0,0,0,0,0,0,0,0,0,0,0,0,0,0,0,0,0,0,0,0,0,0,0,0,0,0,0,0,0,0,0,0,0,0,0,0,0,0,10]
[null,null,null,"C",{"$f":"(IF(E16=\"c\",1,0)+IF(E33=\"c\",1,0)+IF(E50=\"c\",1,0)+IF(E67=\"c\",1,0)+IF(E84=\"c\",1,0)+IF(E101=\"c\",1,0)+IF(E118=\"c\",1,0))/4","v":0},{"$f":"(IF(F16=\"c\",1,0)+IF(F33=\"c\",1,0)+IF(F50=\"c\",1,0)+IF(F67=\"c\",1,0)+IF(F84=\"c\",1,0)+IF(F101=\"c\",1,0)+IF(F118=\"c\",1,0))/4","v":0},0,0,0,0,0,0,0.25,0.25,0.25,0.25,0.25,0.25,0.25,0.25,0.25,0.25,0.25,0.25,0.25,0.25,0.25,0.25,0,0,0,0.25,0.25,0.25,0.25,0.25,0.25,0.25,0.25,0.25,0.25,0.25,0.25,0.25,0.25,0.25,0.25,0.25,0.25,0.25,0.25,0.25,0.25,0.25,0.25,10]
[null,null,"SOUS-TOTAL","R",{"$f":"E127+E129+E131+E133+E135+E137+E139+E141+E143+E145+E147+E151+E153","v":0.25},{"$f":"F127+F129+F131+F133+F135+F137+F139+F141+F143+F145+F147+F151+F153","v":0.5},0.5,0.5,0.5,0.5,0.5,0.5,0.5,0.5,0.25,0.25,0,0,0,0,0,0,0,0,0,0,0,0,0,0,0,0,0,0,0,0,0,0,0,0,0,0,0,0,0,0,0,0,0,0,0,0,0,0,0,5.25,327.75]
[null,null,"ELS 9","C",{"$f":"E128+E130+E132+E134+E136+E138+E140+E142+E144+E146+E148+E152+E150+E154","v":0},{"$f":"F128+F130+F132+F134+F136+F138+F140+F142+F144+F146+F148+F152+F150+F154","v":0},1.5,1.5,2.75,2.75,2.75,2.75,8.25,8.5,9.25,9.25,9.5,9.5,9.5,9.5,9.5,9.5,9.5,9.5,7.75,7.5,6.25,6.75,5,5,4.25,4.5,4.25,3.75,3.75,4,5.75,6,6.75,7,7.5,7.5,7.5,7.5,7.5,7.5,7.5,7.5,7.5,7.5,7.5,7.5,6.5,6.5,6,322.5]
[null,null,"TOTAL",null,{"$f":"+E155+E156","v":0.25},{"$f":"+F155+F156","v":0.5},2,2,3.25,3.25,3.25,3.25,8.75,9,9.5,9.5,9.5,9.5,9.5,9.5,9.5,9.5,9.5,9.5,7.75,7.5,6.25,6.75,5,5,4.25,4.5,4.25,3.75,3.75,4,5.75,6,6.75,7,7.5,7.5,7.5,7.5,7.5,7.5,7.5,7.5,7.5,7.5,7.5,7.5,6.5,6.5,6,327.75,327.75]
[]
[]
[null,"Signatures OBLIGATOIRES"]

{"sheet":"semaine paire (sans samedi pm)","index":3,"n_rows":160,"n_cols":58,"rows_kept":160,"cut":false,"hidden":false,"merged":[[1,1,1,3],[2,2,2,3],[3,2,3,3],[4,2,4,3],[6,2,6,3],[7,2,7,3],[8,2,8,3],[9,2,9,3],[5,2,5,3],[10,1,12,1],[10,2,10,3],[11,2,11,3],[12,2,12,3],[13,1,16,1],[13,2,13,3],[14,2,14,3],[15,2,15,3],[16,2,16,3],[18,1,18,3],[19,2,19,3],[20,2,20,3],[21,2,21,3],[22,2,22,3],[23,2,23,3],[24,2,24,3],[25,2,25,3],[26,2,26,3],[27,2,27,3],[28,2,28,3],[29,2,29,3],[30,1,33,1],[30,2,30,3],[31,2,31,3],[32,2,32,3],[33,2,33,3],[35,1,35,3],[27,1,29,1],[36,2,36,3],[37,2,37,3],[38,2,38,3],[39,2,39,3],[40,2,40,3],[41,2,41,3],[42,2,42,3],[43,2,43,3],[49,1,50,1],[49,2,49,3],[50,2,50,3],[52,1,52,3],[53,2,53,3],[54,2,54,3],[44,2,44,3],[45,2,45,3],[46,2,46,3],[47,1,48,1],[47,2,47,3],[48,2,48,3],[62,2,62,3],[63,2,63,3],[64,2,64,3],[65,2,65,3],[66,1,67,1],[66,2,66,3],[67,2,67,3],[55,2,55,3],[56,2,56,3],[57,2,57,3],[58,2,58,3],[59,2,59,3],[60,2,60,3],[61,2,61,3],[69,1,69,3],[70,2,70,3],[71,2,71,3],[72,2,72,3],[73,2,73,3],[74,2,74,3],[75,2,75,3],[76,2,76,3],[77,2,77,3],[83,1,84,1],[83,2,83,3],[84,2,84,3],[86,1,86,3],[87,2,87,3],[88,2,88,3],[78,2,78,3],[79,2,79,3],[80,2,80,3],[81,1,82,1],[81,2,81,3],[82,2,82,3],[98,1,99,1],[98,2,98,3],[99,2,99,3],[100,1,101,1],[100,2,100,3],[101,2,101,3],[89,2,89,3],[90,2,90,3],[91,2,91,3],[92,2,92,3],[93,2,93,3],[94,2,94,3],[95,2,95,3],[96,2,96,3],[97,2,97,3],[103,1,103,3],[104,2,104,3],[105,2,105,3],[106,2,106,3],[107,2,107,3],[108,2,108,3],[109,2,109,3],[110,2,110,3],[111,2,111,3],[117,1,118,1],[117,2,117,3],[118,2,118,3],[120,1,123,1],[120,2,120,8],[120,10,120,15],[122,2,122,8],[122,10,122,15],[112,2,112,3],[113,2,113,3],[114,2,114,3],[115,1,116,1],[115,2,115,3],[116,2,116,3],[122,16,122,21],[122,22,122,26],[123,2,123,8],[123,10,123,15],[123,16,123,21],[123,22,123,26],[120,16,120,21],[120,22,120,26],[121,2,121,8],[121,10,121,15],[121,16,121,21],[121,22,121,26],[134,2,135,2],[134,57,135,57],[136,2,137,2],[136,57,137,57],[138,57,139,57],[125,1,125,3],[126,1,156,1],[126,2,127,2],[126,57,127,57],[128,57,129,57],[130,2,131,2],[130,57,131,57],[132,2,133,2],[132,57,133,57],[146,2,147,2],[146,57,147,57],[148,2,149,2],[148,57,149,57],[150,2,151,2],[150,57,151,57],[140,2,141,2],[144,2,145,2],[140,57,141,57],[144,57,145,57],[159,1,160,1],[159,2,159,6],[159,7,159,11],[159,12,159,14],[159,15,159,17],[159,18,159,22],[152,2,153,2],[152,57,153,57],[154,2,155,2],[154,57,155,57],[156,2,156,3],[157,27,157,28],[159,23,159,24],[159,25,159,26],[160,2,160,6],[160,7,160,11],[160,12,160,14],[160,15,160,17],[160,18,160,22],[160,23,160,24],[160,25,160,26]]}
[]
[null,"LUNDI",null,null,"6h30-6h45","6h45-7h","7h-7h15","7h15-7h30","7h30-7h45","7h45-8h","8h-8h15","8h15-8h30","8h30-8h45","8h45-9h","9h-9h15","9h15-9H30","9h30-9H45","9h45-10H","10h-10H15","10h15-10H30","10h30-10h45","10h45-11H","11h-11H15","11h15-11H30","11h30-11H45","11h45-12H","12h-12H15","12h15-12H30","12h30-12H45","12h45-13H","13h-13H15","13h15-13H30","13h30-13H45","13H45-14H","14H-14H15","14h15-14H30","14h30-14H45","14H45-15H","15H-15H15","15h15-15h30","15h30-15h45","15h45-16h","16h-16h15","16h15-16h30","16h30-16h45","16h45-17h","17h-17h15","17h15-17h30","17h30-17h45","17h45-18H","18h-18h15","18h15-18h30","18h30-18h45","18h45-19h","19h-19h15","19h15-19h30","total"]
[null,"sec","Aurore",null,null,null,"S","S","S","S","S","S","S","S","S","S","S","S","S","S","S","S","S","S","S","S","S","S","S","S",null,null,null,null,null,null,null,null,null,null,null,null,null,null,null,null,null,null,null,null,null,null,null,null,null,null,{"$f":"COUNTA(E3:BD3)*0.25","v":6}]
[null,"frais","Bertrand",null,null,null,null,null,null,null,null,null,null,null,null,null,"S","S","S","S","S","S","S","S","S","S","S","S","S","S","S","S","S","S",null,null,null,null,null,null,null,null,null,null,null,null,null,null,null,null,null,null,null,null,null,null,4.5]
[null,"LIQUIDE","Corinne",null,null,null,"S","S","S","S","S","S","S","S","S","S","S","S","S","S","S","S","S","S","S","S","S","S","S","S","S","S",null,null,null,null,null,null,null,null,null,null,null,null,null,null,null,null,null,null,null,null,null,null,null,null,6.5]
[null,null,"Laura",null,"S","S","S","S","S","S","S","S","S","S","S","S","S","S","S","S","S","S","S","S","S","S","S","S",null,null,null,null,null,null,null,null,"S","S","S","S","S","S","S","S","S","S","S","S","S","S",null,null,null,null,null,null,{"$f":"COUNTA(E6:BD6)*0.25","v":9.5}]
[null,"DPH","Ghislaine",null,"DPH","DPH","DPH","DPH","DPH","DPH","DPH","DPH","DPH","DPH","DPH","DPH","DPH","DPH","DPH","DPH","DPH","DPH","DPH","DPH","DPH","DPH","DPH","DPH",null,null,null,null,null,null,null,null,null,null,null,null,null,null,null,null,null,null,null,null,null,null,null,null,null,null,null,null,6]
[null,null,"Thibaut",null,"L","L","L","L","L","L","L","L","L","L","L","L","L","L","L","L","L","L","L","L","L","L","L","L","L","L",null,null,null,null,null,null,null,null,null,null,null,null,null,null,null,null,null,null,null,null,null,null,null,null,null,null,6.5]
[null,null,"Said",null,null,null,"L","L","L","L","L","L","L","L","L","L","L","L","L","L","L","L","L","L","L","L","L","L","L","L","L","L",null,null,null,null,null,null,null,null,null,null,null,null,null,null,null,null,null,null,null,null,null,null,null,null,6.5]
[null,null,"Assiya",null,"F","F","F","F","F","F","F","F","F","F","F","F","F","F","F","F","F","F","F","F","F","F","F","F","F",null,null,null,null,null,null,null,null,null,null,null,null,null,null,null,null,null,null,null,null,null,null,null,null,null,null,null,6.25]
[null,null,"Francoise",null,null,"F","F","F","F","F","F","F","F","F","F","F","F","F","F","F","F","F","F","F","F","F","F","F","F","F",null,null,null,null,null,null,null,null,null,null,null,null,null,null,null,null,null,null,null,null,null,null,null,null,null,null,6.25]
[null,null,"Vanessa",null,null,null,null,null,null,null,null,null,null,null,null,null,"D/MG","D/MG","D/MG","D/MG","D/MG","D/MG","D/MG","D/MG","D/MG","D/MG","D/MG","D/MG","D/MG","D/MG","D/MG","D/MG","D/MG","D/MG",null,null,null,null,null,null,null,null,null,null,null,null,null,null,null,null,null,null,null,null,null,null,4.5]
[null,null,null,null,null,null,null,null,null,null,null,null,null,null,null,null,null,null,null,null,null,null,null,null,null,null,null,null,null,null,null,null,null,null,null,null,null,null,null,null,null,null,null,null,null,null,null,null,null,null,null,null,null,null,null,null,0]
[null,null,null,null,null,null,null,null,null,null,null,null,null,null,null,null,null,null,null,null,null,null,null,null,null,null,null,null,null,null,null,null,null,null,null,null,null,null,null,null,null,null,null,null,null,null,null,null,null,null,null,null,null,null,null,null,0]
[null,null,null,null,null,null,null,null,null,null,null,null,null,null,null,null,null,null,null,null,null,null,null,null,null,null,null,null,null,null,null,null,null,null,null,null,null,null,null,null,null,null,null,null,null,null,null,null,null,null,null,null,null,null,null,null,0]
[null,null,null,null,null,null,null,null,null,null,null,null,null,null,null,null,null,null,null,null,null,null,null,null,null,null,null,null,null,null,null,null,null,null,null,null,null,null,null,null,null,null,null,null,null,null,null,null,null,null,null,null,null,null,null,null,0]
[null,null,"TOTAL",null,{"$f":"COUNTA(E3:E15)*0.25","v":1},1.25,{"$f":"COUNTA(G3:G15)*0.25","v":2},{"$f":"COUNTA(H3:H15)*0.25","v":2},2,2,2,2,2,2,2,2,2.5,2.5,2.5,2.5,2.5,2.5,2.5,2.5,2.5,2.5,2.5,2.5,2,1.75,1,1,0.5,0.5,0,0,0.25,0.25,0.25,0.25,0.25,0.25,0.25,0.25,0.25,0.25,0.25,0.25,0.25,0.25,0,0,0,0,0,0,{"$f":"SUM(E17:BD17)","v":62.5}]
[null,null,null,null,null,null," "]
[null,"MARDI",null,null,"6h30-6h45","6h45-7h","7h-7h15","7h15-7h30","7h30-7h45","7h45-8h","8h-8h15","8h15-8h30","8h30-8h45","8h45-9h","9h-9h15","9h15-9H30","9h30-9H45","9h45-10H","10h-10H15","10h15-10H30","10h30-10h45","10h45-11H","11h-11H15","11h15-11H30","11h30-11H45","11h45-12H","12h-12H15","12h15-12H30","12h30-12H45","12h45-13H","13h-13H15","13h15-13H30","13h30-13H45","13H45-14H","14H-14H15","14h15-14H30","14h30-14H45","14H45-15H","15H-15H15","15h15-15h30","15h30-15h45","15h45-16h","16h-16h15","16h15-16h30","16h30-16h45","16h45-17h","17h-17h15","17h15-17h30","17h30-17h45","17h45-18h","18h-18h15","18h15-18h30","18h30-18h45","18h45-19h","19h-19h15","19h15-19h30","total"]
[null,"sec","Aurore",null,null,null,"S","S","S","S","S","S","S","S","S","S","S","S","S","S","S","S","S","S","S","S",null,null,null,null,null,null,null,null,null,null,null,null,null,null,null,null,null,null,null,null,null,null,null,null,null,null,null,null,null,null,{"$f":"COUNTA(E20:BD20)*0.25","v":5}]
[null,"frais","Bertrand",null,null,null,null,null,null,null,null,null,null,null,null,null,null,null,null,null,null,null,null,null,null,null,null,null,null,null,null,null,null,null,null,null,null,null,null,null,null,null,null,null,null,null,null,null,null,null,null,null,null,null,null,null,0]
[null,"LIQUIDE","Corinne",null,null,null,"S","S","S","S","S","S","S","S","S","S","S","S","S","S","S","S","S","S","S","S","S","S",null,null,null,null,null,null,null,null,"S","S","S","S","S","S","S","S","S","S","S","S","S","S",null,null,null,null,null,null,9]
[null,"DPH","Laura",null,"S","S","S","S","S","S","S","S","S","S","S","S","S","S","S","S","S","S","S","S","S","S","S","S",null,null,null,null,null,null,null,null,null,null,null,null,null,null,null,null,null,null,null,null,null,null,null,null,null,null,null,null,6]
[null,null,"Ghislaine",null,"DPH","DPH","DPH","DPH","DPH","DPH","DPH","DPH","DPH","DPH","DPH","DPH","DPH","DPH","DPH","DPH","DPH","DPH","DPH","DPH","DPH","DPH","DPH","DPH",null,null,null,null,null,null,null,null,null,null,null,null,null,null,null,null,null,null,null,null,null,null,null,null,null,null,null,null,6]
[null,null,"Thibaut",null,"L","L","L","L","L","L","L","L","L","L","L","L","L","L","L","L","L","L","L","L","L","L",null,null,null,null,null,null,null,null,null,null,null,null,null,null,null,null,null,null,null,null,null,null,null,null,null,null,null,null,null,null,5.5]
[null,null,"Said",null,null,null,"L","L","L","L","L","L","L","L","L","L","L","L","L","L","L","L","L","L","L","L","L","L","L","L",null,null,null,null,null,null,null,null,null,null,null,null,null,null,null,null,null,null,null,null,null,null,null,null,null,null,6]
[null,null,"Assiya",null,"F","F","F","F","F","F","F","F","F","F","F","F","F","F","F","F","F","F","F","F","F","F",null,null,null,null,null,null,null,null,null,null,null,null,null,null,null,null,null,null,null,null,null,null,null,null,null,null,null,null,null,null,5.5]
[null,null,"Francoise",null,null,"F","F","F","F","F","F","F","F","F","F","F","F","F","F","F","F","F","F","F","F","F","F","F",null,null,null,null,null,null,null,null,null,null,null,null,null,null,null,null,null,null,null,null,null,null,null,null,null,null,null,null,5.75]
[null,null,"Vanessa",null,null,null,null,null,"D/MG","D/MG","D/MG","D/MG","D/MG","D/MG","D/MG","D/MG","D/MG","D/MG","D/MG","D/MG","D/MG","D/MG","D/MG","D/MG","D/MG","D/MG","D/MG","D/MG",null,null,null,null,null,null,null,null,"D/MG","D/MG","D/MG","D/MG","D/MG","D/MG","D/MG","D/MG","D/MG","D/MG","D/MG","D/MG","D/MG",null,null,null,null,null,null,null,8.25]
[null,null,null,null,null,null,null,null,null,null,null,null,null,null,null,null,null,null,null,null,null,null,null,null,null,null,null,null,null,null,null,null,null,null,null,null,null,null,null,null,null,null,null,null,null,null,null,null,null,null,null,null,null,null,null,null,0]
[null,null,null,null,null,null,null,null,null,null,null,null,null,null,null,null,null,null,null,null,null,null,null,null,null,null,null,null,null,null,null,null,null,null,null,null,null,null,null,null,null,null,null,null,null,null,null,null,null,null,null,null,null,null,null,null,0]
[null,null,null,null,null,null,null,null,null,null,null,null,null,null,null,null,null,null,null,null,null,null,null,null,null,null,null,null,null,null,null,null,null,null,null,null,null,null,null,null,null,null,null,null,null,null,null,null,null,null,null,null,null,null,null,null,0]
[null,null,null,null,null,null,null,null,null,null,null,null,null,null,null,null,null,null,null,null,null,null,null,null,null,null,null,null,null,null,null,null,null,null,null,null,null,null,null,null,null,null,null,null,null,null,null,null,null,null,null,null,null,null,null,null,0]
[null,null,"TOTAL",null,{"$f":"COUNTA(E20:E33)*0.25","v":1},1.25,{"$f":"COUNTA(G20:G33)*0.25","v":2},{"$f":"COUNTA(H20:H33)*0.25","v":2},2.25,2.25,2.25,2.25,2.25,2.25,2.25,2.25,2.25,2.25,2.25,2.25,2.25,2.25,2.25,2.25,2.25,2.25,1.5,1.5,0.25,0.25,0,0,0,0,0,0,0.5,0.5,0.5,0.5,0.5,0.5,0.5,0.5,0.5,0.5,0.5,0.5,0.5,0.25,0,0,0,0,0,0,{"$f":"SUM(E34:BD34)","v":57}]
[]
[null,"MERCREDI",null,null,"6h30-6h45","6h45-7h","7h-7h15","7h15-7h30","7h30-7h45","7h45-8h","8h-8h15","8h15-8h30","8h30-8h45","8h45-9h","9h-9h15","9h15-9H30","9h30-9H45","9h45-10H","10h-10H15","10h15-10H30","10h30-10h45","10h45-11H","11h-11H15","11h15-11H30","11h30-11H45","11h45-12H","12h-12H15","12h15-12H30","12h30-12H45","12h45-13H","13h-13H15","13h15-13H30","13h30-13H45","13H45-14H","14H-14H15","14h15-14H30","14h30-14H45","14H45-15H","15H-15H15","15h15-15h30","15h30-15h45","15h45-16h","16h-16h15","16h15-16h30","16h30-16h45","16h45-17h","17h-17h15","17h15-17h30","17h30-17h45","17h45-18h","18h-18h15","18h15-18h30","18h30-18h45","18h45-19h","19h-19h15","19h15-19h30","total"]
[null,"sec","Aurore",null,null,null,"S","S","S","S","S","S","S","S","S","S","S","S",null,null,null,null,null,null,null,null,null,null,null,null,null,null,null,null,null,null,null,null,null,null,null,null,null,null,null,null,null,null,null,null,null,null,null,null,null,null,{"$f":"COUNTA(G37:BD37)*0.25","v":3}]
[null,"frais","Bertrand",null,null,null,null,null,null,null,null,null,null,null,null,null,null,null,null,null,null,null,null,null,null,null,null,null,null,null,null,null,null,null,"S","S","S","S","S","S","S","S","S","S","S","S","S","S",null,null,null,null,null,null,null,null,{"$f":"COUNTA(E38:BD38)*0.25","v":3.5}]
[null,"LIQUIDE","Corinne",null,null,null,null,null,"S","S","S","S","S","S","S","S","S","S","S","S","S","S","S","S","S","S",null,null,null,null,null,null,null,null,null,null,null,null,null,null,null,null,null,null,null,null,null,null,null,null,null,null,null,null,null,null,{"$f":"COUNTA(G39:BD39)*0.25","v":4.5}]
[null,"DPH","Laura",null,null,null,null,null,"S","S","S","S","S","S","S","S","S","S","S","S","S","S","S","S","S","S","S",null,null,null,null,null,null,null,null,null,null,null,null,null,null,null,null,null,null,null,null,null,null,null,null,null,null,null,null,null,{"$f":"COUNTA(E40:BD40)*0.25","v":4.75}]
[null,null,"Ghislaine",null,null,null,null,null,"DPH","DPH","DPH","DPH","DPH","DPH","DPH","DPH","DPH","DPH","DPH","DPH","DPH","DPH","DPH","DPH","DPH","DPH","DPH",null,null,null,null,null,null,null,null,null,null,null,null,null,null,null,null,null,null,null,null,null,null,null,null,null,null,null,null,null,{"$f":"COUNTA(G41:BD41)*0.25","v":4.75}]
[null,null,"Thibaut",null,null,null,null,null,"L","L","L","L","L","L","L","L","L","L","L","L","L","L","L","L","L","L",null,null,null,null,null,null,null,null,null,null,null,null,null,null,null,null,null,null,null,null,null,null,null,null,null,null,null,null,null,null,4.5]
[null,null,"Said",null,null,null,"L","L","L","L","L","L","L","L","L","L","L","L","L","L","L","L","L","L","L","L","L","L",null,null,null,null,null,null,null,null,null,null,null,null,null,null,null,null,null,null,null,null,null,null,null,null,null,null,null,null,5.5]
[null,null,"Assiya",null,"F","F","F","F","F","F","F","F","F","F","F","F","F","F","F","F","F","F","F","F",null,null,null,null,null,null,null,null,null,null,null,null,null,null,null,null,null,null,null,null,null,null,null,null,null,null,null,null,null,null,null,null,4.5]
[null,null,"Francoise",null,null,"F","F","F","F","F","F","F","F","F","F","F","F","F","F","F","F","F","F",null,null,null,null,null,null,null,null,null,null,null,null,null,null,null,null,null,null,null,null,null,null,null,null,null,null,null,null,null,null,null,null,null,4.25]
[null,null,"Vanessa",null,null,null,null,null,null,null,null,null,null,null,null,null,null,null,null,null,null,null,null,null,null,null,null,null,null,null,null,null,null,null,null,null,null,null,null,null,null,null,null,null,null,null,null,null,null,null,null,null,null,null,null,null,0]
[null,null,null,null,null,null,null,null,null,null,null,null,null,null,null,null,null,null,null,null,null,null,null,null,null,null,null,null,null,null,null,null,null,null,null,null,null,null,null,null,null,null,null,null,null,null,null,null,null,null,null,null,null,null,null,null,0]
[null,null,null,null,null,null,null,null,null,null,null,null,null,null,null,null,null,null,null,null,null,null,null,null,null,null,null,null,null,null,null,null,null,null,null,null,null,null,null,null,null,null,null,null,null,null,null,null,null,null,null,null,null,null,null,null,0]
[null,null,null,null,null,null,null,null,null,null,null,null,null,null,null,null,null,null,null,null,null,null,null,null,null,null,null,null,null,null,null,null,null,null,null,null,null,null,null,null,null,null,null,null,null,null,null,null,null,null,null,null,null,null,null,null,0]
[null,null,null,null,null,null,null,null,null,null,null,null,null,null,null,null,null,null,null,null,null,null,null,null,null,null,null,null,null,null,null,null,null,null,null,null,null,null,null,null,null,null,null,null,null,null,null,null,null,null,null,null,null,null,null,null,0]
[null,null,"TOTAL",null,{"$f":"COUNTA(E37:E50)*0.25","v":0.25},0.5,{"$f":"COUNTA(G37:G50)*0.25","v":1},{"$f":"COUNTA(H37:H50)*0.25","v":1},2,2,2,2,2,2,2,2,2,2,1.75,1.75,1.75,1.75,1.75,1.5,1.25,1.25,0.75,0.25,0,0,0,0,0,0,0.25,0.25,0.25,0.25,0.25,0.25,0.25,0.25,0.25,0.25,0.25,0.25,0.25,0.25,0,0,0,0,0,0,0,0,{"$f":"SUM(E51:BD51)","v":40}]
[]
[null,"JEUDI",null,null,"6h30-6h45","6h45-7h","7h-7h15","7h15-7h30","7h30-7h45","7h45-8h","8h-8h15","8h15-8h30","8h30-8h45","8h45-9h","9h-9h15","9h15-9H30","9h30-9H45","9h45-10H","10h-10H15","10h15-10H30","10h30-10h45","10h45-11H","11h-11H15","11h15-11H30","11h30-11H45","11h45-12H","12h-12H15","12h15-12H30","12h30-12H45","12h45-13H","13h-13H15","13h15-13H30","13h30-13H45","13H45-14H","14H-14H15","14h15-14H30","14h30-14H45","14H45-15H","15H-15H15","15h15-15h30","15h30-15h45","15h45-16h","16h-16h15","16h15-16h30","16h30-16h45","16h45-17h","17h-17h15","17h15-17h30","17h30-17h45","17h45-18h","18h-18h15","18h15-18h30","18h30-18h45","18h45-19h","19h-19h15","19h15-19h30","total"]
[null,"sec","Aurore",null,null,null,"S","S","S","S","S","S","S","S","S","S","S","S","S","S","S","S","S","S","S","S","S","S","S","S",null,null,null,null,null,null,null,null,null,null,null,null,null,null,null,null,null,null,null,null,null,null,null,null,null,null,{"$f":"COUNTA(E54:BD54)*0.25","v":6}]
[null,"frais","Bertrand",null,null,null,null,null,null,null,null,null,null,null,null,null,"S","S","S","S","S","S","S","S","S","S","S","S","S","S","S","S","S","S",null,null,null,null,null,null,null,null,null,null,null,null,null,null,null,null,null,null,null,null,null,null,{"$f":"COUNTA(G55:BD55)*0.25","v":4.5}]
[null,"LIQUIDE","Corinne",null,null,null,"S","S","S","S","S","S","S","S","S","S","S","S","S","S","S","S","S","S","S","S","S","S","S","S","S","S",null,null,null,null,null,null,null,null,null,null,null,null,null,null,null,null,null,null,null,null,null,null,null,null,6.5]
[null,"DPH","Laura",null,"S","S","S","S","S","S","S","S","S","S","S","S","S","S","S","S","S","S","S","S","S","S","S","S","S","S",null,null,null,null,null,null,null,null,null,null,null,null,null,null,null,null,null,null,null,null,null,null,null,null,null,null,{"$f":"COUNTA(E57:BD57)*0.25","v":6.5}]
[null,null,"Ghislaine",null,"DPH","DPH","DPH","DPH","DPH","DPH","DPH","DPH","DPH","DPH","DPH","DPH","DPH","DPH","DPH","DPH","DPH","DPH","DPH","DPH","DPH","DPH",null,null,null,null,null,null,null,null,"DPH","DPH","DPH","DPH","DPH","DPH","DPH","DPH","DPH","DPH","DPH","DPH","DPH","DPH","DPH","DPH",null,null,null,null,null,null,{"$f":"COUNTA(E58:BD58)*0.25","v":9.5}]
[null,null,"Thibaut",null,"L","L","L","L","L","L","L","L","L","L","L","L","L","L","L","L","L","L","L","L","L","L","L","L","L",null,null,null,null,null,null,null,null,null,null,null,null,null,null,null,null,null,null,null,null,null,null,null,null,null,null,null,6.25]
[null,null,"Said",null,null,null,"L","L","L","L","L","L","L","L","L","L","L","L","L","L","L","L","L","L","L","L","L","L","L","L","L","L","L","L",null,null,null,null,null,null,null,null,null,null,null,null,null,null,null,null,null,null,null,null,null,null,7]
[null,null,"Assiya",null,"F","F","F","F","F","F","F","F","F","F","F","F","F","F","F","F","F","F","F","F","F","F","F","F","F","F",null,null,null,null,null,null,null,null,null,null,null,null,null,null,null,null,null,null,null,null,null,null,null,null,null,null,6.5]
[null,null,"Francoise",null,null,"F","F","F","F","F","F","F","F","F","F","F","F","F","F","F","F","F","F","F","F","F","F","F","F",null,null,null,null,null,null,null,null,null,null,null,null,null,null,null,null,null,null,null,null,null,null,null,null,null,null,null,6]
[null,null,"Vanessa",null,null,null,null,null,null,null,null,null,null,null,null,null,"D/MG","D/MG","D/MG","D/MG","D/MG","D/MG","D/MG","D/MG","D/MG","D/MG","D/MG","D/MG",null,null,null,null,null,null,null,null,"D/MG","D/MG","D/MG","D/MG","D/MG","D/MG","D/MG","D/MG","D/MG","D/MG","D/MG","D/MG",null,null,null,null,null,null,null,null,6]
[null,null,null,null,null,null,null,null,null,null,null,null,null,null,null,null,null,null,null,null,null,null,null,null,null,null,null,null,null,null,null,null,null,null,null,null,null,null,null,null,null,null,null,null,null,null,null,null,null,null,null,null,null,null,null,null,0]
[null,null,null,null,null,null,null,null,null,null,null,null,null,null,null,null,null,null,null,null,null,null,null,null,null,null,null,null,null,null,null,null,null,null,null,null,null,null,null,null,null,null,null,null,null,null,null,null,null,null,null,null,null,null,null,null,0]
[null,null,null,null,null,null,null,null,null,null,null,null,null,null,null,null,null,null,null,null,null,null,null,null,null,null,null,null,null,null,null,null,null,null,null,null,null,null,null,null,null,null,null,null,null,null,null,null,null,null,null,null,null,null,null,null,0]
[null,null,null,null,null,null,null,null,null,null,null,null,null,null,null,null,null,null,null,null,null,null,null,null,null,null,null,null,null,null,null,null,null,null,null,null,null,null,null,null,null,null,null,null,null,null,null,null,null,null,null,null,null,null,null,null,0]
[null,null,"TOTAL",null,{"$f":"COUNTA(E54:E67)*0.25","v":1},1.25,{"$f":"COUNTA(G54:G67)*0.25","v":2},{"$f":"COUNTA(H54:H67)*0.25","v":2},2,2,2,2,2,2,2,2,2.5,2.5,2.5,2.5,2.5,2.5,2.5,2.5,2.5,2.5,2.25,2.25,2,1.5,0.75,0.75,0.5,0.5,0.25,0.25,0.5,0.5,0.5,0.5,0.5,0.5,0.5,0.5,0.5,0.5,0.5,0.5,0.25,0.25,0,0,0,0,0,0,{"$f":"SUM(E68:BD68)","v":64.75}]
[]
[null,"VENDREDI",null,null,"6h30-6h45","6h45-7h","7h-7h15","7h15-7h30","7h30-7h45","7h45-8h","8h-8h15","8h15-8h30","8h30-8h45","8h45-9h","9h-9h15","9h15-9H30","9h30-9H45","9h45-10H","10h-10H15","10h15-10H30","10h30-10h45","10h45-11H","11h-11H15","11h15-11H30","11h30-11H45","11h45-12H","12h-12H15","12h15-12H30","12h30-12H45","12h45-13H","13h-13H15","13h15-13H30","13h30-13H45","13H45-14H","14H-14H15","14h15-14H30","14h30-14H45","14H45-15H","15H-15H15","15h15-15h30","15h30-15h45","15h45-16h","16h-16h15","16h15-16h30","16h30-16h45","16h45-17h","17h-17h15","17h15-17h30","17h30-17h45","17h45-18h","18h-18h15","18h15-18h30","18h30-18h45","18h45-19h","19h-19h15","19h15-19h30","total"]
[null,"sec","Aurore",null,null,null,"S","S","S","S","S","S","S","S","S","S","S","S","S","S","S","S","S","S","S","S",null,null,null,null,null,null,null,null,null,null,null,null,null,null,null,null,null,null,null,null,null,null,null,null,null,null,null,null,null,null,{"$f":"COUNTA(E71:BD71)*0.25","v":5}]
[null,"frais","Bertrand",null,null,null,null,null,null,null,null,null,null,null,null,null,null,null,null,null,null,null,null,null,null,null,null,null,null,null,"S","S","S","S","S","S","S","S","S","S","S","S","S","S","S","S","S","S",null,null,null,null,null,null,null,null,{"$f":"COUNTA(G72:BD72)*0.25","v":4.5}]
[null,"LIQUIDE","Corinne",null,null,null,null,null,"S","S","S","S","S","S","S","S","S","S","S","S","S","S","S","S","S","S","S",null,null,null,null,null,null,null,null,null,null,null,null,null,null,null,null,null,null,null,null,null,null,null,null,null,null,null,null,null,{"$f":"COUNTA(G73:BD73)*0.25","v":4.75}]
[null,"DPH","Laura",null,null,null,null,null,"S","S","S","S","S","S","S","S","S","S","S","S","S","S","S","S","S","S",null,null,null,null,null,null,null,null,null,null,null,null,null,null,null,null,null,null,null,null,null,null,null,null,null,null,null,null,null,null,{"$f":"COUNTA(E74:BD74)*0.25","v":4.5}]
[null,null,"Ghislaine",null,null,null,null,null,"DPH","DPH","DPH","DPH","DPH","DPH","DPH","DPH","DPH","DPH","DPH","DPH","DPH","DPH","DPH","DPH","DPH","DPH","DPH","DPH",null,null,null,null,null,null,null,null,null,null,null,null,null,null,null,null,null,null,null,null,null,null,null,null,null,null,null,null,{"$f":"COUNTA(G75:BD75)*0.25","v":5}]
[null,null,"Thibaut",null,null,null,null,null,"L","L","L","L","L","L","L","L","L","L","L","L","L","L","l","l",null,null,null,null,null,null,null,null,null,null,"L","L","L","L","L","L","L","L","L","L","L","L","L","L","L","L",null,null,null,null,null,null,8]
[null,null,"Said",null,null,null,"L","L","L","L","L","L","L","L","L","L","L","L","L","L","L","L","L","L","L","L","L","L","L","L","L",null,null,null,null,null,null,null,null,null,null,null,null,null,null,null,null,null,null,null,null,null,null,null,null,null,6.25]
[null,null,"Assiya",null,"F","F","F","F","F","F","F","F","F","F","F","F","F","F","F","F","F","F",null,null,null,null,null,null,null,null,null,null,null,null,"F","F","F","F","F","F","F","F","F","F","F","F",null,null,null,null,null,null,null,null,null,null,7]
[null,null,"Francoise",null,null,"F","F","F","F","F","F","F","F","F","F","F","F","F","F","F","F","F","F","F","F","F",null,null,null,null,null,null,null,null,"F","F","F","F","F","F","F","F","F","F","F","F",null,null,null,null,null,null,null,null,null,null,8]
[null,null,"Vanessa",null,null,null,null,null,null,null,null,null,null,null,null,null,"D/MG","D/MG","D/MG","D/MG","D/MG","D/MG","D/MG","D/MG","D/MG","D/MG","D/MG","D/MG","D/MG","D/MG","D/MG","D/MG","D/MG","D/MG","D/MG","D/MG","D/MG","D/MG","D/MG",null,null,null,null,null,null,null,null,null,null,null,null,null,null,null,null,null,5.75]
[null,null,null,null,null,null,null,null,null,null,null,null,null,null,null,null,null,null,null,null,null,null,null,null,null,null,null,null,null,null,null,null,null,null,null,null,null,null,null,null,null,null,null,null,null,null,null,null,null,null,null,null,null,null,null,null,0]
[null,null,null,null,null,null,null,null,null,null,null,null,null,null,null,null,null,null,null,null,null,null,null,null,null,null,null,null,null,null,null,null,null,null,null,null,null,null,null,null,null,null,null,null,null,null,null,null,null,null,null,null,null,null,null,null,0]
[null,null,null,null,null,null,null,null,null,null,null,null,null,null,null,null,null,null,null,null,null,null,null,null,null,null,null,null,null,null,null,null,null,null,null,null,null,null,null,null,null,null,null,null,null,null,null,null,null,null,null,null,null,null,null,null,0]
[null,null,null,null,null,null,null,null,null,null,null,null,null,null,null,null,null,null,null,null,null,null,null,null,null,null,null,null,null,null,null,null,null,null,null,null,null,null,null,null,null,null,null,null,null,null,null,null,null,null,null,null,null,null,null,null,0]
[null,null,"TOTAL",null,{"$f":"COUNTA(E71:E84)*0.25","v":0.25},0.5,{"$f":"COUNTA(G71:G84)*0.25","v":1},{"$f":"COUNTA(H71:H84)*0.25","v":1},2,2,2,2,2,2,2,2,2.25,2.25,2.25,2.25,2.25,2.25,2,2,1.75,1.75,1,0.75,0.5,0.5,0.75,0.5,0.5,0.5,1.25,1.25,1.25,1.25,1.25,1,1,1,1,1,1,1,0.5,0.5,0.25,0.25,0,0,0,0,0,0,{"$f":"SUM(E85:BD85)","v":59.5}]
[]
[null,"SAMEDI",null,null,"6h30-6h45","6h45-7h","7h-7h15","7h15-7h30","7h30-7h45","7h45-8h","8h-8h15","8h15-8h30","8h30-8h45","8h45-9h","9h-9h15","9h15-9H30","9h30-9H45","9h45-10H","10h-10H15","10h15-10H30","10h30-10h45","10h45-11H","11h-11H15","11h15-11H30","11h30-11H45","11h45-12H","12h-12H15","12h15-12H30","12h30-12H45","12h45-13H","13h-13H15","13h15-13H30","13h30-13H45","13H45-14H","14H-14H15","14h15-14H30","14h30-14H45","14H45-15H","15H-15H15","15h15-15h30","15h30-15h45","15h45-16h","16h-16h15","16h15-16h30","16h30-16h45","16h45-17h","17h-17h15","17h15-17h30","17h30-17h45","17h45-18h","18h-18h15","18h15-18h30","18h30-18h45","18h45-19h","19h-19h15","19h15-19h30","total"]
[null,"sec","Aurore",null,null,null,"S","S","S","S","S","S","S","S","S","S","S","S","S","S","S","S","S","S","S","S",null,null,null,null,null,null,null,null,null,null,null,null,"B","B","B","B","B","B","B","B","B","B","B","B",null,null,null,null,null,null,{"$f":"COUNTA(E88:BD88)*0.25","v":8}]
[null,"frais","Bertrand",null,null,null,null,null,null,null,null,null,null,null,null,null,"S","S","S","S","S","S","S","S","S","S","S","S",null,null,null,null,null,null,null,null,null,null,null,null,null,null,null,null,null,null,null,null,null,null,null,null,null,null,null,null,3]
[null,"LIQUIDE","Corinne",null,null,null,"S","S","S","S","S","S","S","S","S","S","S","S","S","S","S","S","S","S","S","S","S","S",null,null,null,null,null,null,null,null,null,null,null,null,null,null,null,null,null,null,null,null,null,null,null,null,null,null,null,null,5.5]
[null,"DPH","Laura",null,null,null,"S","S","S","S","S","S","S","S","S","S","S","S","S","S","S","S","S","S","S","S","S","S",null,null,null,null,null,null,null,null,null,null,null,null,null,null,null,null,null,null,null,null,null,null,null,null,null,null,null,null,5.5]
[null,null,"Ghislaine",null,null,null,"DPH","DPH","DPH","DPH","DPH","DPH","DPH","DPH","DPH","DPH","DPH","DPH","DPH","DPH","DPH","DPH","DPH","DPH","DPH","DPH","DPH","DPH",null,null,null,null,null,null,null,null,null,null,null,null,null,null,null,null,null,null,null,null,null,null,null,null,null,null,null,null,5.5]
[null,null,"Thibaut",null,null,null,"L","L","L","L","L","L","L","L","L","L","L","L","L","L","L","L","L","L","L","L","L","L","L","L",null,null,null,null,null,null,null,null,null,null,null,null,null,null,null,null,null,null,null,null,null,null,null,null,null,null,6]
[null,null,"Said",null,null,null,"L","L","L","L","L","L","L","L","L","L","L","L","L","L","L","L","L","L","L","L","L","L",null,null,null,null,null,null,null,null,null,null,null,null,null,null,null,null,null,null,null,null,null,null,null,null,null,null,null,null,5.5]
[null,null,"Assiya",null,"F","F","F","F","F","F","F","F","F","F","F","F","F","F","F","F","F","F","F","F","F","F","F","F",null,null,null,null,null,null,null,null,null,null,null,null,null,null,null,null,null,null,null,null,null,null,null,null,null,null,null,null,6]
[null,null,"Francoise",null,"F","F","F","F","F","F","F","F","F","F","F","F","F","F","F","F","F","F","F","F","F","F","F","F",null,null,null,null,null,null,null,null,null,null,null,null,null,null,null,null,null,null,null,null,null,null,null,null,null,null,null,null,6]
[null,null,"Vanessa",null,null,null,null,null,null,null,null,null,null,null,null,null,"D/MG","D/MG","D/MG","D/MG","D/MG","D/MG","D/MG","D/MG","D/MG","D/MG","D/MG","D/MG","D/MG","D/MG",null,null,null,null,null,null,null,null,null,null,null,null,null,null,null,null,null,null,null,null,null,null,null,null,null,null,3.5]
[null,null,null,null,null,null,null,null,null,null,null,null,null,null,null,null,null,null,null,null,null,null,null,null,null,null,null,null,null,null,null,null,null,null,null,null,null,null,null,null,null,null,null,null,null,null,null,null,null,null,null,null,null,null,null,null,0]
[null,null,null,null,null,null,null,null,null,null,null,null,null,null,null,null,null,null,null,null,null,null,null,null,null,null,null,null,null,null,null,null,null,null,null,null,null,null,null,null,null,null,null,null,null,null,null,null,null,null,null,null,null,null,null,null,0]
[null,null,null,null,null,null,null,null,null,null,null,null,null,null,null,null,null,null,null,null,null,null,null,null,null,null,null,null,null,null,null,null,null,null,null,null,null,null,null,null,null,null,null,null,null,null,null,null,null,null,null,null,null,null,null,null,0]
[null,null,null,null,null,null,null,null,null,null,null,null,null,null,null,null,null,null,null,null,null,null,null,null,null,null,null,null,null,null,null,null,null,null,null,null,null,null,null,null,null,null,null,null,null,null,null,null,null,null,null,null,null,null,null,null,0]
[null,null,"TOTAL",null,{"$f":"COUNTA(E88:E101)*0.25","v":0.5},0.5,{"$f":"COUNTA(G88:G101)*0.25","v":2},{"$f":"COUNTA(H88:H101)*0.25","v":2},2,2,2,2,2,2,2,2,2.5,2.5,2.5,2.5,2.5,2.5,2.5,2.5,2.5,2.5,2.25,2.25,0.5,0.5,0,0,0,0,0,0,0,0,0.25,0.25,0.25,0.25,0.25,0.25,0.25,0.25,0.25,0.25,0.25,0.25,0,0,0,0,0,0,{"$f":"SUM(BE88:BE101)","v":54.5}]
[]
[null,"Dimanche",null,null,"6h30-6h45","6h45-7h","7h-7h15","7h15-7h30","7h30-7h45","7h45-8h","8h-8h15","8h15-8h30","8h30-8h45","8h45-9h","9h-9h15","9h15-9H30","9h30-9H45","9h45-10H","10h-10H15","10h15-10H30","10h30-10h45","10h45-11H","11h-11H15","11h15-11H30","11h30-11H45","11h45-12H","12h-12H15","12h15-12H30","12h30-12H45","12h45-13H","13h-13H15","13h15-13H30","13h30-13H45","13H45-14H","14H-14H15","14h15-14H30","14h30-14H45","14H45-15H","15H-15H15","15h15-15h30","15h30-15h45","15h45-16h","16h-16h15","16h15-16h30","16h30-16h45","16h45-17h","17h-17h15","17h15-17h30","17h30-17h45","17h45-18h","18h-18h15","18h15-18h30","18h30-18h45","18h45-19h","19h-19h15","19h15-19h30","total"]
[null,"sec","Aurore",null,null,null,null,null,null,null,null,null,null,null,null,null,null,null,null,null,null,null,null,null,null,null,null,null,null,null,null,null,null,null,null,null,null,null,null,null,null,null,null,null,null,null,null,null,null,null,null,null,null,null,null,null,{"$f":"COUNTA(G105:BD105)*0.25","v":0}]
[null,"frais","Bertrand",null,null,null,null,null,null,null,null,null,null,null,null,null,null,null,null,null,null,null,null,null,null,null,null,null,null,null,null,null,null,null,null,null,null,null,null,null,null,null,null,null,null,null,null,null,null,null,null,null,null,null,null,null,0]
[null,"LIQUIDE","Corinne",null,null,null,null,null,null,null,null,null,null,null,null,null,null,null,null,null,null,null,null,null,null,null,null,null,null,null,null,null,null,null,null,null,null,null,null,null,null,null,null,null,null,null,null,null,null,null,null,null,null,null,null,null,0]
[null,"DPH","Laura",null,null,null,null,null,null,null,null,null,null,null,null,null,null,null,null,null,null,null,null,null,null,null,null,null,null,null,null,null,null,null,null,null,null,null,null,null,null,null,null,null,null,null,null,null,null,null,null,null,null,null,null,null,0]
[null,null,"Ghislaine",null,null,null,null,null,null,null,null,null,null,null,null,null,null,null,null,null,null,null,null,null,null,null,null,null,null,null,null,null,null,null,null,null,null,null,null,null,null,null,null,null,null,null,null,null,null,null,null,null,null,null,null,null,0]
[null,null,"Thibaut",null,null,null,null,null,null,null,null,null,null,null,null,null,null,null,null,null,null,null,null,null,null,null,null,null,null,null,null,null,null,null,null,null,null,null,null,null,null,null,null,null,null,null,null,null,null,null,null,null,null,null,null,null,0]
[null,null,"Said",null,null,null,null,null,null,null,null,null,null,null,null,null,null,null,null,null,null,null,null,null,null,null,null,null,null,null,null,null,null,null,null,null,null,null,null,null,null,null,null,null,null,null,null,null,null,null,null,null,null,null,null,null,0]
[null,null,"Assiya",null,null,null,null,null,null,null,null,null,null,null,null,null,null,null,null,null,null,null,null,null,null,null,null,null,null,null,null,null,null,null,null,null,null,null,null,null,null,null,null,null,null,null,null,null,null,null,null,null,null,null,null,null,0]
[null,null,"Francoise",null,null,null,null,null,null,null,null,null,null,null,null,null,null,null,null,null,null,null,null,null,null,null,null,null,null,null,null,null,null,null,null,null,null,null,null,null,null,null,null,null,null,null,null,null,null,null,null,null,null,null,null,null,0]
[null,null,"Vanessa",null,null,null,null,null,null,null,null,null,null,null,null,null,null,null,null,null,null,null,null,null,null,null,null,null,null,null,null,null,null,null,null,null,null,null,null,null,null,null,null,null,null,null,null,null,null,null,null,null,null,null,null,null,0]
[null,null,null,null,null,null,null,null,null,null,null,null,null,null,null,null,null,null,null,null,null,null,null,null,null,null,null,null,null,null,null,null,null,null,null,null,null,null,null,null,null,null,null,null,null,null,null,null,null,null,null,null,null,null,null,null,0]
[null,null,null,null,null,null,null,null,null,null,null,null,null,null,null,null,null,null,null,null,null,null,null,null,null,null,null,null,null,null,null,null,null,null,null,null,null,null,null,null,null,null,null,null,null,null,null,null,null,null,null,null,null,null,null,null,0]
[null,null,null,null,null,null,null,null,null,null,null,null,null,null,null,null,null,null,null,null,null,null,null,null,null,null,null,null,null,null,null,null,null,null,null,null,null,null,null,null,null,null,null,null,null,null,null,null,null,null,null,null,null,null,null,null,0]
[null,null,null,null,null,null,null,null,null,null,null,null,null,null,null,null,null,null,null,null,null,null,null,null,null,null,null,null,null,null,null,null,null,null,null,null,null,null,null,null,null,null,null,null,null,null,null,null,null,null,null,null,null,null,null,null,0]
[null,null,"TOTAL",null,null,null,{"$f":"COUNTA(G105:G118)*0.25","v":0},{"$f":"COUNTA(H105:H118)*0.25","v":0},0,0,0,0,0,0,0,0,0,0,0,0,0,0,0,0,0,0,0,0,0,0,0,0,0,0,0,0,0,0,0,0,0,0,0,0,0,0,0,0,0,0,0,0,0,0,0,0,{"$f":"SUM(G119:BD119)","v":0}]
[]
[null,"Signatures OBLIGATOIRES"]
[]
[]
[]
[]
[null,"Planning",null,null,"6h30-6h45","6h45-7h","7h-7h15","7h15-7h30","7h30-7h45","7h45-8h","8h-8h15","8h15-8h30","8h30-8h45","8h45-9h","9h-9h15","9h15-9H30","9h30-9H45","9h45-10H","10h-10H15","10h15-10H30","10h30-10h45","10h45-11H","11h-11H15","11h15-11H30","11h30-11H45","11h45-12H","12h-12H15","12h15-12H30","12h30-12H45","12h45-13H","13h-13H15","13h15-13H30","13h30-13H45","13H45-14H","14H-14H15","14h15-14H30","14h30-14H45","14H45-15H","15H-15H15","15h15-15h30","15h30-15h45","15h45-16h","16h-16h15","16h15-16h30","16h30-16h45","16h45-17h","17h-17h15","17h15-17h30","17h30-17h45","17h45-18h","18h-18h15","18h15-18h30","18h30-18h45","18h45-19h","19h-19h15","19h15-19h30"]
[null,"TOTAL Semaine",{"$f":"+C105","v":"Aurore"},"S",{"$f":"(IF(E3=\"S\",1,0)+IF(E20=\"S\",1,0)+IF(E37=\"S\",1,0)+IF(E54=\"S\",1,0)+IF(E71=\"S\",1,0)+IF(E88=\"S\",1,0)+IF(E105=\"S\",1,0))/4","v":0},{"$f":"(IF(F3=\"S\",1,0)+IF(F20=\"S\",1,0)+IF(F37=\"S\",1,0)+IF(F54=\"S\",1,0)+IF(F71=\"S\",1,0)+IF(F88=\"S\",1,0)+IF(F105=\"S\",1,0))/4","v":0},1.5,1.5,1.5,1.5,1.5,1.5,1.5,1.5,1.5,1.5,1.5,1.5,1.25,1.25,1.25,1.25,1.25,1.25,1.25,1.25,0.5,0.5,0.5,0.5,0,0,0,0,0,0,0,0,0,0,0,0,0,0,0,0,0,0,0,0,0,0,0,0,0,0,{"$f":"SUM(E127:BD127)","v":30},{"$f":"SUM(BE127+BE128)","v":30}]
[null,null,null,null,{"$f":"(IF(E3=\"c\",1,0)+IF(E20=\"c\",1,0)+IF(E37=\"c\",1,0)+IF(E54=\"c\",1,0)+IF(E71=\"c\",1,0)+IF(E88=\"c\",1,0)+IF(E105=\"c\",1,0))/4","v":0},0,0,0,0,0,0,0,0,0,0,0,0,0,0,0,0,0,0,0,0,0,0,0,0,0,0,0,0,0,0,0,{"$f":"(IF(AK3=\"c\",1,0)+IF(AK20=\"c\",1,0)+IF(AK37=\"c\",1,0)+IF(AK54=\"c\",1,0)+IF(AK71=\"c\",1,0)+IF(AK88=\"c\",1,0)+IF(AK105=\"c\",1,0))/4","v":0},0,0,0,0,0,0,0,0,0,0,0,0,0,0,0,0,0,0,0,{"$f":"SUM(G128:BD128)","v":0}]
[null,null,{"$f":"+C106","v":"Bertrand"},"B",{"$f":"(IF(E4=\"B\",1,0)+IF(E21=\"B\",1,0)+IF(E38=\"B\",1,0)+IF(E55=\"B\",1,0)+IF(E72=\"B\",1,0)+IF(E89=\"B\",1,0)+IF(E106=\"B\",1,0))/4","v":0},0,0,0,0,0,0,0,0,0,0,0,0,0,0,0,0,0,0,0,0,0,0,0,0,0,0,0,0,0,0,0,{"$f":"(IF(AK4=\"B\",1,0)+IF(AK21=\"B\",1,0)+IF(AK38=\"B\",1,0)+IF(AK55=\"B\",1,0)+IF(AK72=\"B\",1,0)+IF(AK89=\"B\",1,0)+IF(AK106=\"B\",1,0))/4","v":0},0,0,0,0,0,0,0,0,0,0,0,0,0,0,0,0,0,0,0,{"$f":"SUM(E129:BD129)","v":0},{"$f":"SUM(BE129+BE130)","v":20}]
[null,null,{"$f":"+C4","v":"Bertrand"},"S",{"$f":"(IF(E4=\"S\",1,0)+IF(E21=\"S\",1,0)+IF(E38=\"S\",1,0)+IF(E55=\"S\",1,0)+IF(E72=\"S\",1,0)+IF(E89=\"S\",1,0)+IF(E106=\"S\",1,0))/4","v":0},{"$f":"(IF(F4=\"S\",1,0)+IF(F21=\"S\",1,0)+IF(F38=\"S\",1,0)+IF(F55=\"S\",1,0)+IF(F72=\"S\",1,0)+IF(F89=\"S\",1,0)+IF(F106=\"S\",1,0))/4","v":0},0,0,0,0,0,0,0,0,0,0,0.75,0.75,0.75,0.75,0.75,0.75,0.75,0.75,0.75,0.75,0.75,0.75,0.5,0.5,0.75,0.75,0.75,0.75,0.5,0.5,0.5,0.5,0.5,0.5,0.5,0.5,0.5,0.5,0.5,0.5,0.5,0.5,0,0,0,0,0,0,0,0,{"$f":"SUM(G130:BD130)","v":20}]
[null,null,{"$f":"+C5","v":"Corinne"},"M",{"$f":"(IF(E4=\"M\",1,0)+IF(E21=\"M\",1,0)+IF(E38=\"M\",1,0)+IF(E55=\"M\",1,0)+IF(E72=\"M\",1,0)+IF(E89=\"M\",1,0)+IF(E106=\"M\",1,0))/4","v":0},0,0,0,0,0,0,0,0,0,0,0,0,0,0,0,0,0,0,0,0,0,0,0,0,0,0,0,0,0,0,0,{"$f":"(IF(AK4=\"M\",1,0)+IF(AK21=\"M\",1,0)+IF(AK38=\"M\",1,0)+IF(AK55=\"M\",1,0)+IF(AK72=\"M\",1,0)+IF(AK89=\"M\",1,0)+IF(AK106=\"M\",1,0))/4","v":0},0,0,0,0,0,0,0,0,0,0,0,0,0,0,0,0,0,0,0,{"$f":"SUM(G131:BD131)","v":0},{"$f":"SUM(BE131+BE132)","v":36.75}]
[null,null,null,"S",{"$f":"(IF(E5=\"S\",1,0)+IF(E22=\"S\",1,0)+IF(E39=\"S\",1,0)+IF(E56=\"S\",1,0)+IF(E73=\"S\",1,0)+IF(E90=\"S\",1,0)+IF(E107=\"S\",1,0))/4","v":0},{"$f":"(IF(F5=\"S\",1,0)+IF(F22=\"S\",1,0)+IF(F39=\"S\",1,0)+IF(F56=\"S\",1,0)+IF(F73=\"S\",1,0)+IF(F90=\"S\",1,0)+IF(F107=\"S\",1,0))/4","v":0},1,1,1.5,1.5,1.5,1.5,1.5,1.5,1.5,1.5,1.5,1.5,1.5,1.5,1.5,1.5,1.5,1.5,1.5,1.5,1.25,1,0.5,0.5,0.5,0.5,0,0,0,0,0.25,0.25,0.25,0.25,0.25,0.25,0.25,0.25,0.25,0.25,0.25,0.25,0.25,0.25,0,0,0,0,0,0,{"$f":"SUM(G132:BD132)","v":36.75}]
[null,null,{"$f":"+C6","v":"Laura"},null,{"$f":"(IF(E7=\"r\",1,0)+IF(E23=\"r\",1,0)+IF(E40=\"r\",1,0)+IF(E57=\"r\",1,0)+IF(E74=\"r\",1,0)+IF(E91=\"r\",1,0)+IF(E108=\"r\",1,0))/4","v":0},0,0,0,0,0,0,0,0,0,0,0,0,0,0,0,0,0,0,0,0,0,0,0,0,0,0,0,0,0,0,0,{"$f":"(IF(AK7=\"r\",1,0)+IF(AK23=\"r\",1,0)+IF(AK40=\"r\",1,0)+IF(AK57=\"r\",1,0)+IF(AK74=\"r\",1,0)+IF(AK91=\"r\",1,0)+IF(AK108=\"r\",1,0))/4","v":0},0,0,0,0,0,0,0,0,0,0,0,0,0,0,0,0,0,0,0,{"$f":"SUM(G133:BD133)","v":0},{"$f":"SUM(BE133+BE134)","v":36.75}]
[null,null,null,"S",{"$f":"(IF(E6=\"S\",1,0)+IF(E23=\"S\",1,0)+IF(E40=\"S\",1,0)+IF(E57=\"S\",1,0)+IF(E74=\"S\",1,0)+IF(E91=\"S\",1,0)+IF(E108=\"S\",1,0))/4","v":0.75},{"$f":"(IF(F6=\"S\",1,0)+IF(F23=\"S\",1,0)+IF(F40=\"S\",1,0)+IF(F57=\"S\",1,0)+IF(F74=\"S\",1,0)+IF(F91=\"S\",1,0)+IF(F108=\"S\",1,0))/4","v":0.75},1,1,1.5,1.5,1.5,1.5,1.5,1.5,1.5,1.5,1.5,1.5,1.5,1.5,1.5,1.5,1.5,1.5,1.5,1.5,1.25,1,0.25,0.25,0,0,0,0,0,0,0.25,0.25,0.25,0.25,0.25,0.25,0.25,0.25,0.25,0.25,0.25,0.25,0.25,0.25,0,0,0,0,0,0,{"$f":"SUM(E134:BD134)","v":36.75}]
[null,null,{"$f":"+C7","v":"Ghislaine"},null,{"$f":"(IF(#REF!=\"r\",1,0)+IF(E24=\"r\",1,0)+IF(E41=\"r\",1,0)+IF(E58=\"r\",1,0)+IF(E75=\"r\",1,0)+IF(E92=\"r\",1,0)+IF(E109=\"r\",1,0))/4","v":{"$error":"#REF!"}},{"$f":"(IF(#REF!=\"r\",1,0)+IF(F24=\"r\",1,0)+IF(F41=\"r\",1,0)+IF(F58=\"r\",1,0)+IF(F75=\"r\",1,0)+IF(F92=\"r\",1,0)+IF(F109=\"r\",1,0))/4","v":{"$error":"#REF!"}},{"$f":"(IF(#REF!=\"r\",1,0)+IF(G24=\"r\",1,0)+IF(G41=\"r\",1,0)+IF(G58=\"r\",1,0)+IF(G75=\"r\",1,0)+IF(G92=\"r\",1,0)+IF(G109=\"r\",1,0))/4","v":{"$error":"#REF!"}},{"$f":"(IF(#REF!=\"r\",1,0)+IF(H24=\"r\",1,0)+IF(H41=\"r\",1,0)+IF(H58=\"r\",1,0)+IF(H75=\"r\",1,0)+IF(H92=\"r\",1,0)+IF(H109=\"r\",1,0))/4","v":{"$error":"#REF!"}},{"$f":"(IF(#REF!=\"r\",1,0)+IF(I24=\"r\",1,0)+IF(I41=\"r\",1,0)+IF(I58=\"r\",1,0)+IF(I75=\"r\",1,0)+IF(I92=\"r\",1,0)+IF(I109=\"r\",1,0))/4","v":{"$error":"#REF!"}},{"$f":"(IF(#REF!=\"r\",1,0)+IF(J24=\"r\",1,0)+IF(J41=\"r\",1,0)+IF(J58=\"r\",1,0)+IF(J75=\"r\",1,0)+IF(J92=\"r\",1,0)+IF(J109=\"r\",1,0))/4","v":{"$error":"#REF!"}},{"$f":"(IF(#REF!=\"r\",1,0)+IF(K24=\"r\",1,0)+IF(K41=\"r\",1,0)+IF(K58=\"r\",1,0)+IF(K75=\"r\",1,0)+IF(K92=\"r\",1,0)+IF(K109=\"r\",1,0))/4","v":{"$error":"#REF!"}},{"$f":"(IF(#REF!=\"r\",1,0)+IF(L24=\"r\",1,0)+IF(L41=\"r\",1,0)+IF(L58=\"r\",1,0)+IF(L75=\"r\",1,0)+IF(L92=\"r\",1,0)+IF(L109=\"r\",1,0))/4","v":{"$error":"#REF!"}},{"$f":"(IF(#REF!=\"r\",1,0)+IF(M24=\"r\",1,0)+IF(M41=\"r\",1,0)+IF(M58=\"r\",1,0)+IF(M75=\"r\",1,0)+IF(M92=\"r\",1,0)+IF(M109=\"r\",1,0))/4","v":{"$error":"#REF!"}},{"$f":"(IF(#REF!=\"r\",1,0)+IF(N24=\"r\",1,0)+IF(N41=\"r\",1,0)+IF(N58=\"r\",1,0)+IF(N75=\"r\",1,0)+IF(N92=\"r\",1,0)+IF(N109=\"r\",1,0))/4","v":{"$error":"#REF!"}},{"$f":"(IF(#REF!=\"r\",1,0)+IF(O24=\"r\",1,0)+IF(O41=\"r\",1,0)+IF(O58=\"r\",1,0)+IF(O75=\"r\",1,0)+IF(O92=\"r\",1,0)+IF(O109=\"r\",1,0))/4","v":{"$error":"#REF!"}},{"$f":"(IF(#REF!=\"r\",1,0)+IF(P24=\"r\",1,0)+IF(P41=\"r\",1,0)+IF(P58=\"r\",1,0)+IF(P75=\"r\",1,0)+IF(P92=\"r\",1,0)+IF(P109=\"r\",1,0))/4","v":{"$error":"#REF!"}},{"$f":"(IF(#REF!=\"r\",1,0)+IF(Q24=\"r\",1,0)+IF(Q41=\"r\",1,0)+IF(Q58=\"r\",1,0)+IF(Q75=\"r\",1,0)+IF(Q92=\"r\",1,0)+IF(Q109=\"r\",1,0))/4","v":{"$error":"#REF!"}},{"$f":"(IF(#REF!=\"r\",1,0)+IF(R24=\"r\",1,0)+IF(R41=\"r\",1,0)+IF(R58=\"r\",1,0)+IF(R75=\"r\",1,0)+IF(R92=\"r\",1,0)+IF(R109=\"r\",1,0))/4","v":{"$error":"#REF!"}},{"$f":"(IF(#REF!=\"r\",1,0)+IF(S24=\"r\",1,0)+IF(S41=\"r\",1,0)+IF(S58=\"r\",1,0)+IF(S75=\"r\",1,0)+IF(S92=\"r\",1,0)+IF(S109=\"r\",1,0))/4","v":{"$error":"#REF!"}},{"$f":"(IF(#REF!=\"r\",1,0)+IF(T24=\"r\",1,0)+IF(T41=\"r\",1,0)+IF(T58=\"r\",1,0)+IF(T75=\"r\",1,0)+IF(T92=\"r\",1,0)+IF(T109=\"r\",1,0))/4","v":{"$error":"#REF!"}},{"$f":"(IF(#REF!=\"r\",1,0)+IF(U24=\"r\",1,0)+IF(U41=\"r\",1,0)+IF(U58=\"r\",1,0)+IF(U75=\"r\",1,0)+IF(U92=\"r\",1,0)+IF(U109=\"r\",1,0))/4","v":{"$error":"#REF!"}},{"$f":"(IF(#REF!=\"r\",1,0)+IF(V24=\"r\",1,0)+IF(V41=\"r\",1,0)+IF(V58=\"r\",1,0)+IF(V75=\"r\",1,0)+IF(V92=\"r\",1,0)+IF(V109=\"r\",1,0))/4","v":{"$error":"#REF!"}},{"$f":"(IF(#REF!=\"r\",1,0)+IF(W24=\"r\",1,0)+IF(W41=\"r\",1,0)+IF(W58=\"r\",1,0)+IF(W75=\"r\",1,0)+IF(W92=\"r\",1,0)+IF(W109=\"r\",1,0))/4","v":{"$error":"#REF!"}},{"$f":"(IF(#REF!=\"r\",1,0)+IF(X24=\"r\",1,0)+IF(X41=\"r\",1,0)+IF(X58=\"r\",1,0)+IF(X75=\"r\",1,0)+IF(X92=\"r\",1,0)+IF(X109=\"r\",1,0))/4","v":{"$error":"#REF!"}},{"$f":"(IF(#REF!=\"r\",1,0)+IF(Y24=\"r\",1,0)+IF(Y41=\"r\",1,0)+IF(Y58=\"r\",1,0)+IF(Y75=\"r\",1,0)+IF(Y92=\"r\",1,0)+IF(Y109=\"r\",1,0))/4","v":{"$error":"#REF!"}},{"$f":"(IF(#REF!=\"r\",1,0)+IF(Z24=\"r\",1,0)+IF(Z41=\"r\",1,0)+IF(Z58=\"r\",1,0)+IF(Z75=\"r\",1,0)+IF(Z92=\"r\",1,0)+IF(Z109=\"r\",1,0))/4","v":{"$error":"#REF!"}},{"$f":"(IF(#REF!=\"r\",1,0)+IF(AA24=\"r\",1,0)+IF(AA41=\"r\",1,0)+IF(AA58=\"r\",1,0)+IF(AA75=\"r\",1,0)+IF(AA92=\"r\",1,0)+IF(AA109=\"r\",1,0))/4","v":{"$error":"#REF!"}},{"$f":"(IF(#REF!=\"r\",1,0)+IF(AB24=\"r\",1,0)+IF(AB41=\"r\",1,0)+IF(AB58=\"r\",1,0)+IF(AB75=\"r\",1,0)+IF(AB92=\"r\",1,0)+IF(AB109=\"r\",1,0))/4","v":{"$error":"#REF!"}},{"$f":"(IF(#REF!=\"r\",1,0)+IF(AC24=\"r\",1,0)+IF(AC41=\"r\",1,0)+IF(AC58=\"r\",1,0)+IF(AC75=\"r\",1,0)+IF(AC92=\"r\",1,0)+IF(AC109=\"r\",1,0))/4","v":{"$error":"#REF!"}},{"$f":"(IF(#REF!=\"r\",1,0)+IF(AD24=\"r\",1,0)+IF(AD41=\"r\",1,0)+IF(AD58=\"r\",1,0)+IF(AD75=\"r\",1,0)+IF(AD92=\"r\",1,0)+IF(AD109=\"r\",1,0))/4","v":{"$error":"#REF!"}},{"$f":"(IF(#REF!=\"r\",1,0)+IF(AE24=\"r\",1,0)+IF(AE41=\"r\",1,0)+IF(AE58=\"r\",1,0)+IF(AE75=\"r\",1,0)+IF(AE92=\"r\",1,0)+IF(AE109=\"r\",1,0))/4","v":{"$error":"#REF!"}},{"$f":"(IF(#REF!=\"r\",1,0)+IF(AF24=\"r\",1,0)+IF(AF41=\"r\",1,0)+IF(AF58=\"r\",1,0)+IF(AF75=\"r\",1,0)+IF(AF92=\"r\",1,0)+IF(AF109=\"r\",1,0))/4","v":{"$error":"#REF!"}},{"$f":"(IF(#REF!=\"r\",1,0)+IF(AG24=\"r\",1,0)+IF(AG41=\"r\",1,0)+IF(AG58=\"r\",1,0)+IF(AG75=\"r\",1,0)+IF(AG92=\"r\",1,0)+IF(AG109=\"r\",1,0))/4","v":{"$error":"#REF!"}},{"$f":"(IF(#REF!=\"r\",1,0)+IF(AH24=\"r\",1,0)+IF(AH41=\"r\",1,0)+IF(AH58=\"r\",1,0)+IF(AH75=\"r\",1,0)+IF(AH92=\"r\",1,0)+IF(AH109=\"r\",1,0))/4","v":{"$error":"#REF!"}},{"$f":"(IF(#REF!=\"r\",1,0)+IF(AI24=\"r\",1,0)+IF(AI41=\"r\",1,0)+IF(AI58=\"r\",1,0)+IF(AI75=\"r\",1,0)+IF(AI92=\"r\",1,0)+IF(AI109=\"r\",1,0))/4","v":{"$error":"#REF!"}},{"$f":"(IF(#REF!=\"r\",1,0)+IF(AJ24=\"r\",1,0)+IF(AJ41=\"r\",1,0)+IF(AJ58=\"r\",1,0)+IF(AJ75=\"r\",1,0)+IF(AJ92=\"r\",1,0)+IF(AJ109=\"r\",1,0))/4","v":{"$error":"#REF!"}},{"$f":"(IF(#REF!=\"r\",1,0)+IF(AK24=\"r\",1,0)+IF(AK41=\"r\",1,0)+IF(AK58=\"r\",1,0)+IF(AK75=\"r\",1,0)+IF(AK92=\"r\",1,0)+IF(AK109=\"r\",1,0))/4","v":{"$error":"#REF!"}},{"$f":"(IF(#REF!=\"r\",1,0)+IF(AL24=\"r\",1,0)+IF(AL41=\"r\",1,0)+IF(AL58=\"r\",1,0)+IF(AL75=\"r\",1,0)+IF(AL92=\"r\",1,0)+IF(AL109=\"r\",1,0))/4","v":{"$error":"#REF!"}},{"$f":"(IF(#REF!=\"r\",1,0)+IF(AM24=\"r\",1,0)+IF(AM41=\"r\",1,0)+IF(AM58=\"r\",1,0)+IF(AM75=\"r\",1,0)+IF(AM92=\"r\",1,0)+IF(AM109=\"r\",1,0))/4","v":{"$error":"#REF!"}},{"$f":"(IF(#REF!=\"r\",1,0)+IF(AN24=\"r\",1,0)+IF(AN41=\"r\",1,0)+IF(AN58=\"r\",1,0)+IF(AN75=\"r\",1,0)+IF(AN92=\"r\",1,0)+IF(AN109=\"r\",1,0))/4","v":{"$error":"#REF!"}},{"$f":"(IF(#REF!=\"r\",1,0)+IF(AO24=\"r\",1,0)+IF(AO41=\"r\",1,0)+IF(AO58=\"r\",1,0)+IF(AO75=\"r\",1,0)+IF(AO92=\"r\",1,0)+IF(AO109=\"r\",1,0))/4","v":{"$error":"#REF!"}},{"$f":"(IF(#REF!=\"r\",1,0)+IF(AP24=\"r\",1,0)+IF(AP41=\"r\",1,0)+IF(AP58=\"r\",1,0)+IF(AP75=\"r\",1,0)+IF(AP92=\"r\",1,0)+IF(AP109=\"r\",1,0))/4","v":{"$error":"#REF!"}},{"$f":"(IF(#REF!=\"r\",1,0)+IF(AQ24=\"r\",1,0)+IF(AQ41=\"r\",1,0)+IF(AQ58=\"r\",1,0)+IF(AQ75=\"r\",1,0)+IF(AQ92=\"r\",1,0)+IF(AQ109=\"r\",1,0))/4","v":{"$error":"#REF!"}},{"$f":"(IF(#REF!=\"r\",1,0)+IF(AR24=\"r\",1,0)+IF(AR41=\"r\",1,0)+IF(AR58=\"r\",1,0)+IF(AR75=\"r\",1,0)+IF(AR92=\"r\",1,0)+IF(AR109=\"r\",1,0))/4","v":{"$error":"#REF!"}},{"$f":"(IF(#REF!=\"r\",1,0)+IF(AS24=\"r\",1,0)+IF(AS41=\"r\",1,0)+IF(AS58=\"r\",1,0)+IF(AS75=\"r\",1,0)+IF(AS92=\"r\",1,0)+IF(AS109=\"r\",1,0))/4","v":{"$error":"#REF!"}},{"$f":"(IF(#REF!=\"r\",1,0)+IF(AT24=\"r\",1,0)+IF(AT41=\"r\",1,0)+IF(AT58=\"r\",1,0)+IF(AT75=\"r\",1,0)+IF(AT92=\"r\",1,0)+IF(AT109=\"r\",1,0))/4","v":{"$error":"#REF!"}},{"$f":"(IF(#REF!=\"r\",1,0)+IF(AU24=\"r\",1,0)+IF(AU41=\"r\",1,0)+IF(AU58=\"r\",1,0)+IF(AU75=\"r\",1,0)+IF(AU92=\"r\",1,0)+IF(AU109=\"r\",1,0))/4","v":{"$error":"#REF!"}},{"$f":"(IF(#REF!=\"r\",1,0)+IF(AV24=\"r\",1,0)+IF(AV41=\"r\",1,0)+IF(AV58=\"r\",1,0)+IF(AV75=\"r\",1,0)+IF(AV92=\"r\",1,0)+IF(AV109=\"r\",1,0))/4","v":{"$error":"#REF!"}},{"$f":"(IF(#REF!=\"r\",1,0)+IF(AW24=\"r\",1,0)+IF(AW41=\"r\",1,0)+IF(AW58=\"r\",1,0)+IF(AW75=\"r\",1,0)+IF(AW92=\"r\",1,0)+IF(AW109=\"r\",1,0))/4","v":{"$error":"#REF!"}},{"$f":"(IF(#REF!=\"r\",1,0)+IF(AX24=\"r\",1,0)+IF(AX41=\"r\",1,0)+IF(AX58=\"r\",1,0)+IF(AX75=\"r\",1,0)+IF(AX92=\"r\",1,0)+IF(AX109=\"r\",1,0))/4","v":{"$error":"#REF!"}},{"$f":"(IF(#REF!=\"r\",1,0)+IF(AY24=\"r\",1,0)+IF(AY41=\"r\",1,0)+IF(AY58=\"r\",1,0)+IF(AY75=\"r\",1,0)+IF(AY92=\"r\",1,0)+IF(AY109=\"r\",1,0))/4","v":{"$error":"#REF!"}},{"$f":"(IF(#REF!=\"r\",1,0)+IF(AZ24=\"r\",1,0)+IF(AZ41=\"r\",1,0)+IF(AZ58=\"r\",1,0)+IF(AZ75=\"r\",1,0)+IF(AZ92=\"r\",1,0)+IF(AZ109=\"r\",1,0))/4","v":{"$error":"#REF!"}},{"$f":"(IF(#REF!=\"r\",1,0)+IF(BA24=\"r\",1,0)+IF(BA41=\"r\",1,0)+IF(BA58=\"r\",1,0)+IF(BA75=\"r\",1,0)+IF(BA92=\"r\",1,0)+IF(BA109=\"r\",1,0))/4","v":{"$error":"#REF!"}},{"$f":"(IF(#REF!=\"r\",1,0)+IF(BB24=\"r\",1,0)+IF(BB41=\"r\",1,0)+IF(BB58=\"r\",1,0)+IF(BB75=\"r\",1,0)+IF(BB92=\"r\",1,0)+IF(BB109=\"r\",1,0))/4","v":{"$error":"#REF!"}},{"$f":"(IF(#REF!=\"r\",1,0)+IF(BC24=\"r\",1,0)+IF(BC41=\"r\",1,0)+IF(BC58=\"r\",1,0)+IF(BC75=\"r\",1,0)+IF(BC92=\"r\",1,0)+IF(BC109=\"r\",1,0))/4","v":{"$error":"#REF!"}},{"$f":"(IF(#REF!=\"r\",1,0)+IF(BD24=\"r\",1,0)+IF(BD41=\"r\",1,0)+IF(BD58=\"r\",1,0)+IF(BD75=\"r\",1,0)+IF(BD92=\"r\",1,0)+IF(BD109=\"r\",1,0))/4","v":{"$error":"#REF!"}},{"$f":"SUM(E135:BD135)","v":{"$error":"#REF!"}},{"$f":"SUM(BE135+BE136)","v":{"$error":"#REF!"}}]
[null,null,null,"DPH",{"$f":"(IF(E7=\"DPH\",1,0)+IF(E24=\"DPH\",1,0)+IF(E41=\"DPH\",1,0)+IF(E58=\"DPH\",1,0)+IF(E75=\"DPH\",1,0)+IF(E92=\"DPH\",1,0)+IF(E109=\"DPH\",1,0))/4","v":0.75},{"$f":"(IF(F7=\"DPH\",1,0)+IF(F24=\"DPH\",1,0)+IF(F41=\"DPH\",1,0)+IF(F58=\"DPH\",1,0)+IF(F75=\"DPH\",1,0)+IF(F92=\"DPH\",1,0)+IF(F109=\"DPH\",1,0))/4","v":0.75},1,1,1.5,1.5,1.5,1.5,1.5,1.5,1.5,1.5,1.5,1.5,1.5,1.5,1.5,1.5,1.5,1.5,1.5,1.5,1.25,1,0,0,0,0,0,0,0.25,0.25,0.25,0.25,0.25,0.25,0.25,0.25,0.25,0.25,0.25,0.25,0.25,0.25,0.25,0.25,0,0,0,0,0,0,36.75]
[null,null,{"$f":"+C8","v":"Thibaut"},null,{"$f":"(IF(E8=\"r\",1,0)+IF(E25=\"r\",1,0)+IF(E42=\"r\",1,0)+IF(E59=\"r\",1,0)+IF(E76=\"r\",1,0)+IF(E93=\"r\",1,0)+IF(E110=\"r\",1,0))/4","v":0},0,{"$f":"(IF(G8=\"r\",1,0)+IF(G25=\"r\",1,0)+IF(G42=\"r\",1,0)+IF(G59=\"r\",1,0)+IF(G76=\"r\",1,0)+IF(G93=\"r\",1,0)+IF(G110=\"r\",1,0))/4","v":0},{"$f":"(IF(H8=\"r\",1,0)+IF(H25=\"r\",1,0)+IF(H42=\"r\",1,0)+IF(H59=\"r\",1,0)+IF(H76=\"r\",1,0)+IF(H93=\"r\",1,0)+IF(H110=\"r\",1,0))/4","v":0},0,0,0,0,0,0,0,0,0,0,0,0,0,0,0,0,0,0,0,0,0,0,0,0,0,0,0,0,0,0,0,0,0,0,0,0,0,0,0,0,0,0,0,0,0,0,0,0,0,{"$f":"SUM(BE137+BE138)","v":36.75}]
[null,null,null,"L",{"$f":"(IF(E8=\"L\",1,0)+IF(E25=\"L\",1,0)+IF(E42=\"L\",1,0)+IF(E59=\"L\",1,0)+IF(E76=\"L\",1,0)+IF(E93=\"L\",1,0)+IF(E110=\"L\",1,0))/4","v":0.75},{"$f":"(IF(F8=\"L\",1,0)+IF(F25=\"L\",1,0)+IF(F42=\"L\",1,0)+IF(F59=\"L\",1,0)+IF(F76=\"L\",1,0)+IF(F93=\"L\",1,0)+IF(F110=\"L\",1,0))/4","v":0.75},1,1,1.5,1.5,1.5,1.5,1.5,1.5,1.5,1.5,1.5,1.5,1.5,1.5,1.5,1.5,1.5,1.5,1.25,1.25,0.75,0.75,0.75,0.5,0,0,0,0,0.25,0.25,0.25,0.25,0.25,0.25,0.25,0.25,0.25,0.25,0.25,0.25,0.25,0.25,0.25,0.25,0,0,0,0,0,0,36.75]
[null,null,{"$f":"+C9","v":"Said"},"L",{"$f":"(IF(E9=\"BCH\",1,0)+IF(E26=\"BCH\",1,0)+IF(E43=\"BCH\",1,0)+IF(E60=\"BCH\",1,0)+IF(E77=\"BCH\",1,0)+IF(E94=\"BCH\",1,0)+IF(E111=\"BCH\",1,0))/4","v":0},{"$f":"(IF(F9=\"l\",1,0)+IF(F26=\"l\",1,0)+IF(F43=\"l\",1,0)+IF(F60=\"l\",1,0)+IF(F77=\"l\",1,0)+IF(F94=\"l\",1,0)+IF(F111=\"l\",1,0))/4","v":0},{"$f":"(IF(G9=\"l\",1,0)+IF(G26=\"l\",1,0)+IF(G43=\"l\",1,0)+IF(G60=\"l\",1,0)+IF(G77=\"l\",1,0)+IF(G94=\"l\",1,0)+IF(G111=\"l\",1,0))/4","v":1.5},1.5,1.5,1.5,1.5,1.5,1.5,1.5,1.5,1.5,1.5,1.5,1.5,1.5,1.5,1.5,1.5,1.5,1.5,1.5,1.5,1.5,1,1,0.75,0.5,0.25,0.25,0,0,0,0,0,0,0,0,0,0,0,0,0,0,0,0,0,0,0,0,0,0,36.75,{"$f":"SUM(BE139+BE140)","v":36.75}]
[null,null,null,"BCH",{"$f":"(IF(E9=\"c\",1,0)+IF(E26=\"c\",1,0)+IF(E43=\"c\",1,0)+IF(E60=\"c\",1,0)+IF(E77=\"c\",1,0)+IF(E94=\"c\",1,0)+IF(E111=\"c\",1,0))/4","v":0},0,{"$f":"(IF(G9=\"c\",1,0)+IF(G26=\"c\",1,0)+IF(G43=\"c\",1,0)+IF(G60=\"c\",1,0)+IF(G77=\"c\",1,0)+IF(G94=\"c\",1,0)+IF(G111=\"c\",1,0))/4","v":0},{"$f":"(IF(H9=\"c\",1,0)+IF(H26=\"c\",1,0)+IF(H43=\"c\",1,0)+IF(H60=\"c\",1,0)+IF(H77=\"c\",1,0)+IF(H94=\"c\",1,0)+IF(H111=\"c\",1,0))/4","v":0},0,0,0,0,0,0,0,0,0,0,0,0,0,0,0,0,0,0,0,0,0,0,0,0,0,0,0,0,0,0,0,0,0,0,0,0,0,0,0,0,0,0,0,0,0,0,0,0,0]
[null,null,{"$f":"+C10","v":"Assiya"},"F",{"$f":"(IF(E10=\"F\",1,0)+IF(E27=\"F\",1,0)+IF(E44=\"F\",1,0)+IF(E61=\"F\",1,0)+IF(E78=\"F\",1,0)+IF(E95=\"F\",1,0)+IF(E112=\"F\",1,0))/4","v":1.5},{"$f":"(IF(F10=\"F\",1,0)+IF(F27=\"F\",1,0)+IF(F44=\"F\",1,0)+IF(F61=\"F\",1,0)+IF(F78=\"F\",1,0)+IF(F95=\"F\",1,0)+IF(F112=\"F\",1,0))/4","v":1.5},1.5,1.5,1.5,1.5,1.5,1.5,1.5,1.5,1.5,1.5,1.5,1.5,1.5,1.5,1.5,1.5,1.25,1.25,1,1,0.75,0.75,0.5,0.25,0,0,0,0,0.25,0.25,0.25,0.25,0.25,0.25,0.25,0.25,0.25,0.25,0.25,0.25,0,0,0,0,0,0,0,0,0,0,{"$f":"SUM(E141:BD141)","v":36.75},{"$f":"SUM(BE141+BE142)","v":36.75}]
[null,null,null,"BCH",{"$f":"(IF(E10=\"c\",1,0)+IF(E27=\"c\",1,0)+IF(E44=\"c\",1,0)+IF(E61=\"c\",1,0)+IF(E78=\"c\",1,0)+IF(E95=\"c\",1,0)+IF(E112=\"c\",1,0))/4","v":0},0,{"$f":"(IF(G10=\"c\",1,0)+IF(G27=\"c\",1,0)+IF(G44=\"c\",1,0)+IF(G61=\"c\",1,0)+IF(G78=\"c\",1,0)+IF(G95=\"c\",1,0)+IF(G112=\"c\",1,0))/4","v":0},{"$f":"(IF(H10=\"c\",1,0)+IF(H27=\"c\",1,0)+IF(H44=\"c\",1,0)+IF(H61=\"c\",1,0)+IF(H78=\"c\",1,0)+IF(H95=\"c\",1,0)+IF(H112=\"c\",1,0))/4","v":0},0,0,0,0,0,0,0,0,0,0,0,0,0,0,0,0,0,0,0,0,0,0,0,0,0,0,0,0,0,0,0,0,0,0,0,0,0,0,0,0,0,0,0,0,0,0,0,0,0]
[null,null,{"$f":"+C11","v":"Francoise"},"F",{"$f":"(IF(E11=\"F\",1,0)+IF(E28=\"F\",1,0)+IF(E45=\"F\",1,0)+IF(E62=\"F\",1,0)+IF(E79=\"F\",1,0)+IF(E96=\"F\",1,0)+IF(E113=\"F\",1,0))/4","v":0.25},{"$f":"(IF(F11=\"F\",1,0)+IF(F28=\"F\",1,0)+IF(F45=\"F\",1,0)+IF(F62=\"F\",1,0)+IF(F79=\"F\",1,0)+IF(F96=\"F\",1,0)+IF(F113=\"F\",1,0))/4","v":1.5},1.5,1.5,1.5,1.5,1.5,1.5,1.5,1.5,1.5,1.5,1.5,1.5,1.5,1.5,1.5,1.5,1.5,1.25,1.25,1.25,1,1,0.5,0.25,0,0,0,0,0.25,0.25,0.25,0.25,0.25,0.25,0.25,0.25,0.25,0.25,0.25,0.25,0,0,0,0,0,0,0,0,0,0,36.75,{"$f":"SUM(BE143+BE144)","v":64.75}]
[null,null,{"$f":"+C12","v":"Vanessa"},"D/MG",{"$f":"(IF(E12=\"D/MG\",1,0)+IF(E29=\"D/MG\",1,0)+IF(E46=\"D/MG\",1,0)+IF(E63=\"D/MG\",1,0)+IF(E80=\"D/MG\",1,0)+IF(E97=\"D/MG\",1,0)+IF(E114=\"D/MG\",1,0))/4","v":0},{"$f":"(IF(F12=\"D/MG\",1,0)+IF(F29=\"D/MG\",1,0)+IF(F46=\"D/MG\",1,0)+IF(F63=\"D/MG\",1,0)+IF(F80=\"D/MG\",1,0)+IF(F97=\"D/MG\",1,0)+IF(F114=\"D/MG\",1,0))/4","v":0},0,0,0.25,0.25,0.25,0.25,0.25,0.25,0.25,0.25,1.25,1.25,1.25,1.25,1.25,1.25,1.25,1.25,1.25,1.25,1.25,1.25,0.75,0.75,0.5,0.5,0.5,0.5,0.25,0.25,0.75,0.75,0.75,0.5,0.5,0.5,0.5,0.5,0.5,0.5,0.5,0.5,0.25,0,0,0,0,0,0,0,{"$f":"+SUM(E144:BD144)","v":28}]
[null,null,{"$f":"+C19","v":0},"R",null,null,{"$f":"(IF(G12=\"r\",1,0)+IF(G29=\"r\",1,0)+IF(G46=\"r\",1,0)+IF(G63=\"r\",1,0)+IF(G80=\"r\",1,0)+IF(G97=\"r\",1,0)+IF(G114=\"r\",1,0))/4","v":0},{"$f":"(IF(H12=\"r\",1,0)+IF(H29=\"r\",1,0)+IF(H46=\"r\",1,0)+IF(H63=\"r\",1,0)+IF(H80=\"r\",1,0)+IF(H97=\"r\",1,0)+IF(H114=\"r\",1,0))/4","v":0},0,0,0,0,0,0,0,0,0,0,0,0,0,0,0,0,0,0,0,0,0,0,0,0,0,0,0,0,0,0,0,0,0,0,0,0,0,0,0,0,0,0,0,0,0,0,0,0,0,{"$f":"SUM(BE145+BE146)","v":0}]
[null,null,null,"C",null,null,{"$f":"(IF(G12=\"c\",1,0)+IF(G29=\"c\",1,0)+IF(G46=\"c\",1,0)+IF(G63=\"c\",1,0)+IF(G80=\"c\",1,0)+IF(G97=\"c\",1,0)+IF(G114=\"c\",1,0))/4","v":0},{"$f":"(IF(H12=\"c\",1,0)+IF(H29=\"c\",1,0)+IF(H46=\"c\",1,0)+IF(H63=\"c\",1,0)+IF(H80=\"c\",1,0)+IF(H97=\"c\",1,0)+IF(H114=\"c\",1,0))/4","v":0},0,0,0,0,0,0,0,0,0,0,0,0,0,0,0,0,0,0,0,0,0,0,0,0,0,0,0,0,0,0,0,0,0,0,0,0,0,0,0,0,0,0,0,0,0,0,0,0,0]
[null,null,{"$f":"+C21","v":"Bertrand"},"R",null,null,{"$f":"(IF(G13=\"r\",1,0)+IF(G30=\"r\",1,0)+IF(G47=\"r\",1,0)+IF(G64=\"r\",1,0)+IF(G81=\"r\",1,0)+IF(G98=\"r\",1,0)+IF(G115=\"r\",1,0))/4","v":0},{"$f":"(IF(H13=\"r\",1,0)+IF(H30=\"r\",1,0)+IF(H47=\"r\",1,0)+IF(H64=\"r\",1,0)+IF(H81=\"r\",1,0)+IF(H98=\"r\",1,0)+IF(H115=\"r\",1,0))/4","v":0},0,0,0,0,0,0,0,0,0,0,0,0,0,0,0,0,0,0,0,0,0,0,0,0,0,0,0,0,0,0,0,0,0,0,0,0,0,0,0,0,0,0,0,0,0,0,0,0,0,{"$f":"SUM(BE147+BE148)","v":0}]
[null,null,null,"C",null,null,{"$f":"(IF(G13=\"c\",1,0)+IF(G30=\"c\",1,0)+IF(G47=\"c\",1,0)+IF(G64=\"c\",1,0)+IF(G81=\"c\",1,0)+IF(G98=\"c\",1,0)+IF(G115=\"c\",1,0))/4","v":0},{"$f":"(IF(H13=\"c\",1,0)+IF(H30=\"c\",1,0)+IF(H47=\"c\",1,0)+IF(H64=\"c\",1,0)+IF(H81=\"c\",1,0)+IF(H98=\"c\",1,0)+IF(H115=\"c\",1,0))/4","v":0},0,0,0,0,0,0,0,0,0,0,0,0,0,0,0,0,0,0,0,0,0,0,0,0,0,0,0,0,0,0,0,0,0,0,0,0,0,0,0,0,0,0,0,0,0,0,0,0,0]
[null,null,{"$f":"+C116","v":0},"R",null,null,{"$f":"(IF(G14=\"r\",1,0)+IF(G31=\"r\",1,0)+IF(G48=\"r\",1,0)+IF(G65=\"r\",1,0)+IF(G82=\"r\",1,0)+IF(G99=\"r\",1,0)+IF(G116=\"r\",1,0))/4","v":0},{"$f":"(IF(H14=\"r\",1,0)+IF(H31=\"r\",1,0)+IF(H48=\"r\",1,0)+IF(H65=\"r\",1,0)+IF(H82=\"r\",1,0)+IF(H99=\"r\",1,0)+IF(H116=\"r\",1,0))/4","v":0},0,0,0,0,0,0,0,0,0,0,0,0,0,0,0,0,0,0,0,0,0,0,0,0,0,0,0,0,0,0,0,0,0,0,0,0,0,0,0,0,0,0,0,0,0,0,0,0,0,{"$f":"SUM(BE149+BE150)","v":0}]
[null,null,null,"C",null,null,{"$f":"(IF(G14=\"c\",1,0)+IF(G31=\"c\",1,0)+IF(G48=\"c\",1,0)+IF(G65=\"c\",1,0)+IF(G82=\"c\",1,0)+IF(G99=\"c\",1,0)+IF(G116=\"c\",1,0))/4","v":0},{"$f":"(IF(H14=\"c\",1,0)+IF(H31=\"c\",1,0)+IF(H48=\"c\",1,0)+IF(H65=\"c\",1,0)+IF(H82=\"c\",1,0)+IF(H99=\"c\",1,0)+IF(H116=\"c\",1,0))/4","v":0},0,0,0,0,0,0,0,0,0,0,0,0,0,0,0,0,0,0,0,0,0,0,0,0,0,0,0,0,0,0,0,0,0,0,0,0,0,0,0,0,0,0,0,0,0,0,0,0,0]
[null,null,{"$f":"+C117","v":0},"R",null,null,{"$f":"(IF(G15=\"r\",1,0)+IF(G32=\"r\",1,0)+IF(G49=\"r\",1,0)+IF(G66=\"r\",1,0)+IF(G83=\"r\",1,0)+IF(G100=\"r\",1,0)+IF(G117=\"r\",1,0))/4","v":0},{"$f":"(IF(H15=\"r\",1,0)+IF(H32=\"r\",1,0)+IF(H49=\"r\",1,0)+IF(H66=\"r\",1,0)+IF(H83=\"r\",1,0)+IF(H100=\"r\",1,0)+IF(H117=\"r\",1,0))/4","v":0},0,0,0,0,0,0,0,0,0,0,0,0,0,0,0,0,0,0,0,0,0,0,0,0,0,0,0,0,0,0,0,0,0,0,0,0,0,0,0,0,0,0,0,0,0,0,0,0,0,{"$f":"SUM(BE151+BE152)","v":0}]
[null,null,null,"C",null,null,{"$f":"(IF(G15=\"c\",1,0)+IF(G32=\"c\",1,0)+IF(G49=\"c\",1,0)+IF(G66=\"c\",1,0)+IF(G83=\"c\",1,0)+IF(G100=\"c\",1,0)+IF(G117=\"c\",1,0))/4","v":0},{"$f":"(IF(H15=\"c\",1,0)+IF(H32=\"c\",1,0)+IF(H49=\"c\",1,0)+IF(H66=\"c\",1,0)+IF(H83=\"c\",1,0)+IF(H100=\"c\",1,0)+IF(H117=\"c\",1,0))/4","v":0},0,0,0,0,0,0,0,0,0,0,0,0,0,0,0,0,0,0,0,0,0,0,0,0,0,0,0,0,0,0,0,0,0,0,0,0,0,0,0,0,0,0,0,0,0,0,0,0,0]
[null,null,{"$f":"+C118","v":0},"R",null,null,{"$f":"(IF(G16=\"r\",1,0)+IF(G33=\"r\",1,0)+IF(G50=\"r\",1,0)+IF(G67=\"r\",1,0)+IF(G84=\"r\",1,0)+IF(G101=\"r\",1,0)+IF(G118=\"r\",1,0))/4","v":0},{"$f":"(IF(H16=\"r\",1,0)+IF(H33=\"r\",1,0)+IF(H50=\"r\",1,0)+IF(H67=\"r\",1,0)+IF(H84=\"r\",1,0)+IF(H101=\"r\",1,0)+IF(H118=\"r\",1,0))/4","v":0},0,0,0,0,0,0,0,0,0,0,0,0,0,0,0,0,0,0,0,0,0,0,0,0,0,0,0,0,0,0,0,0,0,0,0,0,0,0,0,0,0,0,0,0,0,0,0,0,0,0]
[null,null,null,"C",null,null,{"$f":"(IF(G16=\"c\",1,0)+IF(G33=\"c\",1,0)+IF(G50=\"c\",1,0)+IF(G67=\"c\",1,0)+IF(G84=\"c\",1,0)+IF(G101=\"c\",1,0)+IF(G118=\"c\",1,0))/4","v":0},{"$f":"(IF(H16=\"c\",1,0)+IF(H33=\"c\",1,0)+IF(H50=\"c\",1,0)+IF(H67=\"c\",1,0)+IF(H84=\"c\",1,0)+IF(H101=\"c\",1,0)+IF(H118=\"c\",1,0))/4","v":0},0,0,0,0,0,0,0,0,0,0,0,0,0,0,0,0,0,0,0,0,0,0,0,0,0,0,0,0,0,0,0,0,0,0,0,0,0,0,0,0,0,0,0,0,0,0,0,0,0]
[null,null,"SOUS-TOTAL","R",null,null,{"$f":"G127+G129+G131+G133+G135+G137+G139+G141+G143+G145+G147+G151+G153","v":{"$error":"#REF!"}},{"$f":"H127+H129+H131+H133+H135+H137+H139+H141+H143+H145+H147+H151+H153","v":{"$error":"#REF!"}},{"$error":"#REF!"},{"$error":"#REF!"},{"$error":"#REF!"},{"$error":"#REF!"},{"$error":"#REF!"},{"$error":"#REF!"},{"$error":"#REF!"},{"$error":"#REF!"},{"$error":"#REF!"},{"$error":"#REF!"},{"$error":"#REF!"},{"$error":"#REF!"},{"$error":"#REF!"},{"$error":"#REF!"},{"$error":"#REF!"},{"$error":"#REF!"},{"$error":"#REF!"},{"$error":"#REF!"},{"$error":"#REF!"},{"$error":"#REF!"},{"$error":"#REF!"},{"$error":"#REF!"},{"$error":"#REF!"},{"$error":"#REF!"},{"$error":"#REF!"},{"$error":"#REF!"},{"$error":"#REF!"},{"$error":"#REF!"},{"$error":"#REF!"},{"$error":"#REF!"},{"$error":"#REF!"},{"$error":"#REF!"},{"$error":"#REF!"},{"$error":"#REF!"},{"$error":"#REF!"},{"$error":"#REF!"},{"$error":"#REF!"},{"$error":"#REF!"},{"$error":"#REF!"},{"$error":"#REF!"},{"$error":"#REF!"},{"$error":"#REF!"},{"$error":"#REF!"},{"$error":"#REF!"},{"$error":"#REF!"},{"$error":"#REF!"},{"$error":"#REF!"},{"$error":"#REF!"},{"$error":"#REF!"},{"$error":"#REF!"}]
[null,null,null,"C",null,null,{"$f":"G128+G130+G132+G134+G136+G138+G140+G142+G144+G146+G148+G152+G150+G154","v":4},{"$f":"H128+H130+H132+H134+H136+H138+H140+H142+H144+H146+H148+H152+H150+H154","v":4},6.25,6.25,6.25,6.25,6.25,6.25,6.25,6.25,8,8,8,8,8,8,8,8,7.75,7.75,6.5,5.75,2.75,2.5,1.75,1.75,1.25,1.25,1.25,1.25,2.25,2.25,2.25,2,2,2,2,2,2,2,2,2,1.25,1,0,0,0,0,0,0,190.5]
[null,null,"TOTAL",null,{"$f":"SUM(E127:E147)","v":{"$error":"#REF!"}},{"$f":"+F155+F156","v":0},{"$f":"SUM(G127:G144)","v":{"$error":"#REF!"}},{"$f":"+H155+H156","v":{"$error":"#REF!"}},{"$f":"+I155+I156","v":{"$error":"#REF!"}},{"$f":"+J155+J156","v":{"$error":"#REF!"}},{"$f":"+K155+K156","v":{"$error":"#REF!"}},{"$error":"#REF!"},{"$error":"#REF!"},{"$error":"#REF!"},{"$error":"#REF!"},{"$error":"#REF!"},{"$error":"#REF!"},{"$error":"#REF!"},{"$error":"#REF!"},{"$error":"#REF!"},{"$error":"#REF!"},{"$error":"#REF!"},{"$error":"#REF!"},{"$error":"#REF!"},{"$error":"#REF!"},{"$error":"#REF!"},{"$error":"#REF!"},{"$error":"#REF!"},{"$error":"#REF!"},{"$error":"#REF!"},{"$error":"#REF!"},{"$error":"#REF!"},{"$error":"#REF!"},{"$error":"#REF!"},{"$error":"#REF!"},{"$error":"#REF!"},{"$error":"#REF!"},{"$error":"#REF!"},{"$error":"#REF!"},{"$error":"#REF!"},{"$error":"#REF!"},{"$error":"#REF!"},{"$error":"#REF!"},{"$error":"#REF!"},{"$error":"#REF!"},{"$error":"#REF!"},{"$error":"#REF!"},{"$error":"#REF!"},{"$error":"#REF!"},{"$error":"#REF!"},{"$error":"#REF!"},{"$error":"#REF!"},{"$error":"#REF!"},{"$error":"#REF!"},{"$error":"#REF!"},{"$error":"#REF!"},{"$f":"SUM(G157:BD157)","v":{"$error":"#REF!"}},{"$error":"#REF!"}]
[]
[]
[null,null,null,null,null,null,null,null,null,null,null,null,null,null,null,null,null,null,null,null,null,null,null,null,null,null,null,null,null,null,null,null,null,null,null,null,null,null,null,null,null,{"$f":"6.5+5.5+6.5+7.75+6.5+6.5","v":39.25}]

{"sheet":"semaine impaire (ac samedi pm)","index":4,"n_rows":160,"n_cols":58,"rows_kept":160,"cut":false,"hidden":false,"merged":[[1,1,1,3],[2,2,2,3],[3,2,3,3],[4,2,4,3],[5,2,5,3],[6,2,6,3],[7,2,7,3],[8,2,8,3],[9,2,9,3],[52,1,52,3],[10,1,12,1],[10,2,10,3],[11,2,11,3],[12,2,12,3],[35,1,35,3],[36,2,36,3],[37,2,37,3],[26,2,26,3],[27,2,27,3],[28,2,28,3],[29,2,29,3],[30,1,33,1],[30,2,30,3],[31,2,31,3],[32,2,32,3],[33,2,33,3],[16,2,16,3],[18,1,18,3],[19,2,19,3],[20,2,20,3],[21,2,21,3],[22,2,22,3],[23,2,23,3],[92,2,92,3],[93,2,93,3],[94,2,94,3],[73,2,73,3],[74,2,74,3],[75,2,75,3],[76,2,76,3],[77,2,77,3],[78,2,78,3],[79,2,79,3],[80,2,80,3],[83,1,84,1],[83,2,83,3],[84,2,84,3],[86,1,86,3],[87,2,87,3],[88,2,88,3],[89,2,89,3],[90,2,90,3],[91,2,91,3],[120,16,120,21],[120,22,120,26],[121,16,121,21],[121,22,121,26],[122,16,122,21],[122,22,122,26],[106,2,106,3],[107,2,107,3],[108,2,108,3],[109,2,109,3],[110,2,110,3],[111,2,111,3],[112,2,112,3],[113,2,113,3],[114,2,114,3],[25,2,25,3],[13,1,16,1],[13,2,13,3],[14,2,14,3],[15,2,15,3],[48,2,48,3],[49,1,50,1],[49,2,49,3],[50,2,50,3],[27,1,29,1],[47,1,48,1],[47,2,47,3],[38,2,38,3],[39,2,39,3],[40,2,40,3],[41,2,41,3],[42,2,42,3],[43,2,43,3],[44,2,44,3],[45,2,45,3],[46,2,46,3],[24,2,24,3],[53,2,53,3],[54,2,54,3],[55,2,55,3],[56,2,56,3],[57,2,57,3],[58,2,58,3],[59,2,59,3],[60,2,60,3],[81,1,82,1],[81,2,81,3],[82,2,82,3],[69,1,69,3],[70,2,70,3],[71,2,71,3],[66,1,67,1],[66,2,66,3],[67,2,67,3],[72,2,72,3],[62,2,62,3],[63,2,63,3],[64,2,64,3],[65,2,65,3],[61,2,61,3],[95,2,95,3],[96,2,96,3],[97,2,97,3],[115,1,116,1],[115,2,115,3],[116,2,116,3],[117,1,118,1],[117,2,117,3],[118,2,118,3],[103,1,103,3],[104,2,104,3],[105,2,105,3],[98,1,99,1],[98,2,98,3],[99,2,99,3],[100,1,101,1],[100,2,100,3],[101,2,101,3],[120,1,123,1],[120,2,120,8],[120,10,120,15],[121,2,121,8],[121,10,121,15],[122,2,122,8],[122,10,122,15],[123,2,123,8],[123,10,123,15],[123,16,123,21],[123,22,123,26],[125,1,125,3],[126,1,156,1],[126,2,127,2],[126,57,127,57],[128,57,129,57],[130,2,131,2],[130,57,131,57],[132,2,133,2],[132,57,133,57],[134,2,135,2],[134,57,135,57],[136,2,137,2],[136,57,137,57],[138,57,139,57],[140,2,141,2],[140,57,141,57],[144,2,145,2],[144,57,145,57],[146,57,147,57],[148,2,149,2],[148,57,149,57],[150,2,151,2],[150,57,151,57],[152,2,153,2],[152,57,153,57],[154,2,155,2],[154,57,155,57],[146,2,147,2],[156,2,156,3],[157,27,157,28],[159,1,160,1],[159,2,159,6],[159,7,159,11],[159,12,159,14],[159,15,159,17],[159,18,159,22],[159,23,159,24],[159,25,159,26],[160,2,160,6],[160,7,160,11],[160,12,160,14],[160,15,160,17],[160,18,160,22],[160,23,160,24],[160,25,160,26]]}
[]
[null,"LUNDI",null,null,"6h30-6h45","6h45-7h","7h-7h15","7h15-7h30","7h30-7h45","7h45-8h","8h-8h15","8h15-8h30","8h30-8h45","8h45-9h","9h-9h15","9h15-9H30","9h30-9H45","9h45-10H","10h-10H15","10h15-10H30","10h30-10h45","10h45-11H","11h-11H15","11h15-11H30","11h30-11H45","11h45-12H","12h-12H15","12h15-12H30","12h30-12H45","12h45-13H","13h-13H15","13h15-13H30","13h30-13H45","13H45-14H","14H-14H15","14h15-14H30","14h30-14H45","14H45-15H","15H-15H15","15h15-15h30","15h30-15h45","15h45-16h","16h-16h15","16h15-16h30","16h30-16h45","16h45-17h","17h-17h15","17h15-17h30","17h30-17h45","17h45-18h","18h-18h15","18h15-18h30","18h30-18h45","18h45-19h","19h-19h15","19h15-19h30","total"]
[null,"sec","Aurore",null,null,null,"S","S","S","S","S","S","S","S","S","S","S","S","S","S","S","S","S","S","S","S","S","S","S","S",null,null,null,null,null,null,null,null,null,null,null,null,null,null,null,null,null,null,null,null,null,null,null,null,null,null,{"$f":"COUNTA(E3:BD3)*0.25","v":6}]
[null,"frais","Bertrand",null,null,null,null,null,null,null,null,null,null,null,null,null,"S","S","S","S","S","S","S","S","S","S","S","S","S","S","S","S","S","S",null,null,null,null,null,null,null,null,null,null,null,null,null,null,null,null,null,null,null,null,null,null,4.5]
[null,"LIQUIDE","Corinne",null,null,null,"S","S","S","S","S","S","S","S","S","S","S","S","S","S","S","S","S","S","S","S","S","S","S","S","S","S",null,null,null,null,null,null,null,null,null,null,null,null,null,null,null,null,null,null,null,null,null,null,null,null,6.5]
[null,null,"Laura",null,"S","S","S","S","S","S","S","S","S","S","S","S","S","S","S","S","S","S","S","S","S","S","S","S",null,null,null,null,null,null,null,null,"S","S","S","S","S","S","S","S","S","S","S","S","S","S",null,null,null,null,null,null,9.5]
[null,"DPH","Ghislaine",null,"DPH","DPH","DPH","DPH","DPH","DPH","DPH","DPH","DPH","DPH","DPH","DPH","DPH","DPH","DPH","DPH","DPH","DPH","DPH","DPH","DPH","DPH","DPH","DPH",null,null,null,null,null,null,null,null,null,null,null,null,null,null,null,null,null,null,null,null,null,null,null,null,null,null,null,null,6]
[null,null,"Thibaut",null,"L","L","L","L","L","L","L","L","L","L","L","L","L","L","L","L","L","L","L","L","L","L","L","L","L","L",null,null,null,null,null,null,null,null,null,null,null,null,null,null,null,null,null,null,null,null,null,null,null,null,null,null,6.5]
[null,null,"Said",null,null,null,"L","L","L","L","L","L","L","L","L","L","L","L","L","L","L","L","L","L","L","L","L","L","L","L","L","L",null,null,null,null,null,null,null,null,null,null,null,null,null,null,null,null,null,null,null,null,null,null,null,null,6.5]
[null,null,"Assiya",null,"F","F","F","F","F","F","F","F","F","F","F","F","F","F","F","F","F","F","F","F","F","F","F","F","F",null,null,null,null,null,null,null,null,null,null,null,null,null,null,null,null,null,null,null,null,null,null,null,null,null,null,null,6.25]
[null,null,"Francoise",null,null,"F","F","F","F","F","F","F","F","F","F","F","F","F","F","F","F","F","F","F","F","F","F","F","F",null,null,null,null,null,null,null,null,null,null,null,null,null,null,null,null,null,null,null,null,null,null,null,null,null,null,null,6]
[null,null,"Vanessa",null,null,null,null,null,null,null,null,null,null,null,null,null,"D/MG","D/MG","D/MG","D/MG","D/MG","D/MG","D/MG","D/MG","D/MG","D/MG","D/MG","D/MG","D/MG","D/MG","D/MG","D/MG","D/MG","D/MG",null,null,null,null,null,null,null,null,null,null,null,null,null,null,null,null,null,null,null,null,null,null,4.5]
[null,null,null,null,null,null,null,null,null,null,null,null,null,null,null,null,null,null,null,null,null,null,null,null,null,null,null,null,null,null,null,null,null,null,null,null,null,null,null,null,null,null,null,null,null,null,null,null,null,null,null,null,null,null,null,null,0]
[null,null,null,null,null,null,null,null,null,null,null,null,null,null,null,null,null,null,null,null,null,null,null,null,null,null,null,null,null,null,null,null,null,null,null,null,null,null,null,null,null,null,null,null,null,null,null,null,null,null,null,null,null,null,null,null,0]
[null,null,null,null,null,null,null,null,null,null,null,null,null,null,null,null,null,null,null,null,null,null,null,null,null,null,null,null,null,null,null,null,null,null,null,null,null,null,null,null,null,null,null,null,null,null,null,null,null,null,null,null,null,null,null,null,0]
[null,null,null,null,null,null,null,null,null,null,null,null,null,null,null,null,null,null,null,null,null,null,null,null,null,null,null,null,null,null,null,null,null,null,null,null,null,null,null,null,null,null,null,null,null,null,null,null,null,null,null,null,null,null,null,null,0]
[null,null,"TOTAL",null,{"$f":"COUNTA(E3:E15)*0.25","v":1},1.25,{"$f":"COUNTA(G3:G15)*0.25","v":2},{"$f":"COUNTA(H3:H15)*0.25","v":2},2,2,2,2,2,2,2,2,2.5,2.5,2.5,2.5,2.5,2.5,2.5,2.5,2.5,2.5,2.5,2.5,2,1.5,1,1,0.5,0.5,0,0,0.25,0.25,0.25,0.25,0.25,0.25,0.25,0.25,0.25,0.25,0.25,0.25,0.25,0.25,0,0,0,0,0,0,{"$f":"SUM(E17:BD17)","v":62.25}]
[null,null,null,null,null,null," "]
[null,"MARDI",null,null,"6h30-6h45","6h45-7h","7h-7h15","7h15-7h30","7h30-7h45","7h45-8h","8h-8h15","8h15-8h30","8h30-8h45","8h45-9h","9h-9h15","9h15-9H30","9h30-9H45","9h45-10H","10h-10H15","10h15-10H30","10h30-10h45","10h45-11H","11h-11H15","11h15-11H30","11h30-11H45","11h45-12H","12h-12H15","12h15-12H30","12h30-12H45","12h45-13H","13h-13H15","13h15-13H30","13h30-13H45","13H45-14H","14H-14H15","14h15-14H30","14h30-14H45","14H45-15H","15H-15H15","15h15-15h30","15h30-15h45","15h45-16h","16h-16h15","16h15-16h30","16h30-16h45","16h45-17h","17h-17h15","17h15-17h30","17h30-17h45","17h45-18h","18h-18h15","18h15-18h30","18h30-18h45","18h45-19h","19h-19h15","19h15-19h30","total"]
[null,"sec","Aurore",null,null,null,"S","S","S","S","S","S","S","S","S","S","S","S","S","S","S","S","S","S","S","S",null,null,null,null,null,null,null,null,null,null,null,null,null,null,null,null,null,null,null,null,null,null,null,null,null,null,null,null,null,null,{"$f":"COUNTA(E20:BD20)*0.25","v":5}]
[null,"frais","Bertrand",null,null,null,null,null,null,null,null,null,null,null,null,null,null,null,null,null,null,null,null,null,null,null,null,null,null,null,null,null,null,null,null,null,null,null,null,null,null,null,null,null,null,null,null,null,null,null,null,null,null,null,null,null,0]
[null,"LIQUIDE","Corinne",null,null,null,"S","S","S","S","S","S","S","S","S","S","S","S","S","S","S","S","S","S","S","S","S","S",null,null,null,null,null,null,null,null,"S","S","S","S","S","S","S","S","S","S","S","S","S","S",null,null,null,null,null,null,9]
[null,"DPH","Laura",null,"S","S","S","S","S","S","S","S","S","S","S","S","S","S","S","S","S","S","S","S","S","S","S","S",null,null,null,null,null,null,null,null,null,null,null,null,null,null,null,null,null,null,null,null,null,null,null,null,null,null,null,null,6]
[null,null,"Ghislaine",null,null,null,null,null,"DPH","DPH","DPH","DPH","DPH","DPH","DPH","DPH","DPH","DPH","DPH","DPH","DPH","DPH","DPH","DPH","DPH","DPH","DPH","DPH",null,null,null,null,null,null,null,null,null,null,null,null,null,null,null,null,null,null,null,null,null,null,null,null,null,null,null,null,5]
[null,null,"Thibaut",null,"L","L","L","L","L","L","L","L","L","L","L","L","L","L","L","L","L","L","L","L","L","L",null,null,null,null,null,null,null,null,null,null,null,null,null,null,null,null,null,null,null,null,null,null,null,null,null,null,null,null,null,null,5.5]
[null,null,"Said",null,null,null,"L","L","L","L","L","L","L","L","L","L","L","L","L","L","L","L","L","L","L","L","L","L","L","L",null,null,null,null,null,null,null,null,null,null,null,null,null,null,null,null,null,null,null,null,null,null,null,null,null,null,6]
[null,null,"Assiya",null,"F","F","F","F","F","F","F","F","F","F","F","F","F","F","F","F","F","F","F","F","F","F","F",null,null,null,null,null,null,null,null,null,null,null,null,null,null,null,null,null,null,null,null,null,null,null,null,null,null,null,null,null,5.75]
[null,null,"Francoise",null,null,"F","F","F","F","F","F","F","F","F","F","F","F","F","F","F","F","F","F","F","F","F","F","F",null,null,null,null,null,null,null,null,null,null,null,null,null,null,null,null,null,null,null,null,null,null,null,null,null,null,null,null,5.75]
[null,null,"Vanessa",null,null,null,null,null,"D/MG","D/MG","D/MG","D/MG","D/MG","D/MG","D/MG","D/MG","D/MG","D/MG","D/MG","D/MG","D/MG","D/MG","D/MG","D/MG","D/MG","D/MG","D/MG","D/MG",null,null,null,null,null,null,null,null,"D/MG","D/MG","D/MG","D/MG","D/MG","D/MG","D/MG","D/MG","D/MG","D/MG","D/MG","D/MG","D/MG",null,null,null,null,null,null,null,8.25]
[null,null,null,null,null,null,null,null,null,null,null,null,null,null,null,null,null,null,null,null,null,null,null,null,null,null,null,null,null,null,null,null,null,null,null,null,null,null,null,null,null,null,null,null,null,null,null,null,null,null,null,null,null,null,null,null,0]
[null,null,null,null,null,null,null,null,null,null,null,null,null,null,null,null,null,null,null,null,null,null,null,null,null,null,null,null,null,null,null,null,null,null,null,null,null,null,null,null,null,null,null,null,null,null,null,null,null,null,null,null,null,null,null,null,0]
[null,null,null,null,null,null,null,null,null,null,null,null,null,null,null,null,null,null,null,null,null,null,null,null,null,null,null,null,null,null,null,null,null,null,null,null,null,null,null,null,null,null,null,null,null,null,null,null,null,null,null,null,null,null,null,null,0]
[null,null,null,null,null,null,null,null,null,null,null,null,null,null,null,null,null,null,null,null,null,null,null,null,null,null,null,null,null,null,null,null,null,null,null,null,null,null,null,null,null,null,null,null,null,null,null,null,null,null,null,null,null,null,null,null,0]
[null,null,"TOTAL",null,{"$f":"COUNTA(E20:E33)*0.25","v":0.75},1,{"$f":"COUNTA(G20:G33)*0.25","v":1.75},{"$f":"COUNTA(H20:H33)*0.25","v":1.75},2.25,2.25,2.25,2.25,2.25,2.25,2.25,2.25,2.25,2.25,2.25,2.25,2.25,2.25,2.25,2.25,2.25,2.25,1.75,1.5,0.25,0.25,0,0,0,0,0,0,0.5,0.5,0.5,0.5,0.5,0.5,0.5,0.5,0.5,0.5,0.5,0.5,0.5,0.25,0,0,0,0,0,0,{"$f":"SUM(E34:BD34)","v":56.25}]
[]
[null,"MERCREDI",null,null,"6h30-6h45","6h45-7h","7h-7h15","7h15-7h30","7h30-7h45","7h45-8h","8h-8h15","8h15-8h30","8h30-8h45","8h45-9h","9h-9h15","9h15-9H30","9h30-9H45","9h45-10H","10h-10H15","10h15-10H30","10h30-10h45","10h45-11H","11h-11H15","11h15-11H30","11h30-11H45","11h45-12H","12h-12H15","12h15-12H30","12h30-12H45","12h45-13H","13h-13H15","13h15-13H30","13h30-13H45","13H45-14H","14H-14H15","14h15-14H30","14h30-14H45","14H45-15H","15H-15H15","15h15-15h30","15h30-15h45","15h45-16h","16h-16h15","16h15-16h30","16h30-16h45","16h45-17h","17h-17h15","17h15-17h30","17h30-17h45","17h45-18h","18h-18h15","18h15-18h30","18h30-18h45","18h45-19h","19h-19h15","19h15-19h30","total"]
[null,"sec","Aurore",null,null,null,"S","S","S","S","S","S","S","S","S","S","S","S",null,null,null,null,null,null,null,null,null,null,null,null,null,null,null,null,null,null,null,null,null,null,null,null,null,null,null,null,null,null,null,null,null,null,null,null,null,null,{"$f":"COUNTA(G37:BD37)*0.25","v":3}]
[null,"frais","Bertrand",null,null,null,null,null,null,null,null,null,null,null,null,null,null,null,null,null,null,null,null,null,null,null,null,null,null,null,null,null,null,null,"S","S","S","S","S","S","S","S","S","S","S","S","S","S",null,null,null,null,null,null,null,null,{"$f":"COUNTA(E38:BD38)*0.25","v":3.5}]
[null,"LIQUIDE","Corinne",null,null,null,null,null,"S","S","S","S","S","S","S","S","S","S","S","S","S","S","S","S","S","S",null,null,null,null,null,null,null,null,null,null,null,null,null,null,null,null,null,null,null,null,null,null,null,null,null,null,null,null,null,null,{"$f":"COUNTA(G39:BD39)*0.25","v":4.5}]
[null,"DPH","Laura",null,null,null,null,null,"S","S","S","S","S","S","S","S","S","S","S","S","S","S","S","S","S","S","S",null,null,null,null,null,null,null,null,null,null,null,null,null,null,null,null,null,null,null,null,null,null,null,null,null,null,null,null,null,{"$f":"COUNTA(E40:BD40)*0.25","v":4.75}]
[null,null,"Ghislaine",null,null,null,null,null,"DPH","DPH","DPH","DPH","DPH","DPH","DPH","DPH","DPH","DPH","DPH","DPH","DPH","DPH","DPH","DPH","DPH","DPH","DPH",null,null,null,null,null,null,null,null,null,null,null,null,null,null,null,null,null,null,null,null,null,null,null,null,null,null,null,null,null,{"$f":"COUNTA(G41:BD41)*0.25","v":4.75}]
[null,null,"Thibaut",null,null,null,null,null,"L","L","L","L","L","L","L","L","L","L","L","L","L","L","L","L","L","L",null,null,null,null,null,null,null,null,null,null,null,null,null,null,null,null,null,null,null,null,null,null,null,null,null,null,null,null,null,null,4.5]
[null,null,"Said",null,null,null,"L","L","L","L","L","L","L","L","L","L","L","L","L","L","L","L","L","L","L","L","L","L",null,null,null,null,null,null,null,null,null,null,null,null,null,null,null,null,null,null,null,null,null,null,null,null,null,null,null,null,5.5]
[null,null,"Assiya",null,"F","F","F","F","F","F","F","F","F","F","F","F","F","F","F","F","F","F","F","F",null,null,null,null,null,null,null,null,null,null,null,null,null,null,null,null,null,null,null,null,null,null,null,null,null,null,null,null,null,null,null,null,4.5]
[null,null,"Francoise",null,null,"F","F","F","F","F","F","F","F","F","F","F","F","F","F","F","F","F","F",null,null,null,null,null,null,null,null,null,null,null,null,null,null,null,null,null,null,null,null,null,null,null,null,null,null,null,null,null,null,null,null,null,4.25]
[null,null,"Vanessa",null,null,null,null,null,null,null,null,null,null,null,null,null,null,null,null,null,null,null,null,null,null,null,null,null,null,null,null,null,null,null,null,null,null,null,null,null,null,null,null,null,null,null,null,null,null,null,null,null,null,null,null,null,0]
[null,null,null,null,null,null,null,null,null,null,null,null,null,null,null,null,null,null,null,null,null,null,null,null,null,null,null,null,null,null,null,null,null,null,null,null,null,null,null,null,null,null,null,null,null,null,null,null,null,null,null,null,null,null,null,null,0]
[null,null,null,null,null,null,null,null,null,null,null,null,null,null,null,null,null,null,null,null,null,null,null,null,null,null,null,null,null,null,null,null,null,null,null,null,null,null,null,null,null,null,null,null,null,null,null,null,null,null,null,null,null,null,null,null,0]
[null,null,null,null,null,null,null,null,null,null,null,null,null,null,null,null,null,null,null,null,null,null,null,null,null,null,null,null,null,null,null,null,null,null,null,null,null,null,null,null,null,null,null,null,null,null,null,null,null,null,null,null,null,null,null,null,0]
[null,null,null,null,null,null,null,null,null,null,null,null,null,null,null,null,null,null,null,null,null,null,null,null,null,null,null,null,null,null,null,null,null,null,null,null,null,null,null,null,null,null,null,null,null,null,null,null,null,null,null,null,null,null,null,null,0]
[null,null,"TOTAL",null,{"$f":"COUNTA(E37:E50)*0.25","v":0.25},0.5,{"$f":"COUNTA(G37:G50)*0.25","v":1},{"$f":"COUNTA(H37:H50)*0.25","v":1},2,2,2,2,2,2,2,2,2,2,1.75,1.75,1.75,1.75,1.75,1.5,1.25,1.25,0.75,0.25,0,0,0,0,0,0,0.25,0.25,0.25,0.25,0.25,0.25,0.25,0.25,0.25,0.25,0.25,0.25,0.25,0.25,0,0,0,0,0,0,0,0,{"$f":"SUM(E51:BD51)","v":40}]
[]
[null,"JEUDI",null,null,"6h30-6h45","6h45-7h","7h-7h15","7h15-7h30","7h30-7h45","7h45-8h","8h-8h15","8h15-8h30","8h30-8h45","8h45-9h","9h-9h15","9h15-9H30","9h30-9H45","9h45-10H","10h-10H15","10h15-10H30","10h30-10h45","10h45-11H","11h-11H15","11h15-11H30","11h30-11H45","11h45-12H","12h-12H15","12h15-12H30","12h30-12H45","12h45-13H","13h-13H15","13h15-13H30","13h30-13H45","13H45-14H","14H-14H15","14h15-14H30","14h30-14H45","14H45-15H","15H-15H15","15h15-15h30","15h30-15h45","15h45-16h","16h-16h15","16h15-16h30","16h30-16h45","16h45-17h","17h-17h15","17h15-17h30","17h30-17h45","17h45-18h","18h-18h15","18h15-18h30","18h30-18h45","18h45-19h","19h-19h15","19h15-19h30","total"]
[null,"sec","Aurore",null,null,null,"S","S","S","S","S","S","S","S","S","S","S","S","S","S","S","S","S","S","S","S","S","S","S","S",null,null,null,null,null,null,null,null,null,null,null,null,null,null,null,null,null,null,null,null,null,null,null,null,null,null,{"$f":"COUNTA(E54:BD54)*0.25","v":6}]
[null,"frais","Bertrand",null,null,null,null,null,null,null,null,null,null,null,null,null,"S","S","S","S","S","S","S","S","S","S","S","S","S","S","S","S","S","S",null,null,null,null,null,null,null,null,null,null,null,null,null,null,null,null,null,null,null,null,null,null,{"$f":"COUNTA(G55:BD55)*0.25","v":4.5}]
[null,"LIQUIDE","Corinne",null,null,null,"S","S","S","S","S","S","S","S","S","S","S","S","S","S","S","S","S","S","S","S","S","S","S","S","S","S",null,null,null,null,null,null,null,null,null,null,null,null,null,null,null,null,null,null,null,null,null,null,null,null,6.5]
[null,"DPH","Laura",null,"S","S","S","S","S","S","S","S","S","S","S","S","S","S","S","S","S","S","S","S","S","S","S","S","S","S",null,null,null,null,null,null,null,null,null,null,null,null,null,null,null,null,null,null,null,null,null,null,null,null,null,null,{"$f":"COUNTA(E57:BD57)*0.25","v":6.5}]
[null,null,"Ghislaine",null,"DPH","DPH","DPH","DPH","DPH","DPH","DPH","DPH","DPH","DPH","DPH","DPH","DPH","DPH","DPH","DPH","DPH","DPH","DPH","DPH","DPH","DPH",null,null,null,null,null,null,null,null,"DPH","DPH","DPH","DPH","DPH","DPH","DPH","DPH","DPH","DPH","DPH","DPH","DPH",null,null,null,null,null,null,null,null,null,{"$f":"COUNTA(E58:BD58)*0.25","v":8.75}]
[null,null,"Thibaut",null,"L","L","L","L","L","L","L","L","L","L","L","L","L","L","L","L","L","L","L","L","L","L","L","L","L",null,null,null,null,null,null,null,null,null,null,null,null,null,null,null,null,null,null,null,null,null,null,null,null,null,null,null,6.25]
[null,null,"Said",null,null,null,"L","L","L","L","L","L","L","L","L","L","L","L","L","L","L","L","L","L","L","L","L","L","L","L","L","L","L","L",null,null,null,null,null,null,null,null,null,null,null,null,null,null,null,null,null,null,null,null,null,null,7]
[null,null,"Assiya",null,"F","F","F","F","F","F","F","F","F","F","F","F","F","F","F","F","F","F","F","F","F","F","F","F","F","F",null,null,null,null,null,null,null,null,null,null,null,null,null,null,null,null,null,null,null,null,null,null,null,null,null,null,6.5]
[null,null,"Francoise",null,null,"F","F","F","F","F","F","F","F","F","F","F","F","F","F","F","F","F","F","F","F","F","F","F","F",null,null,null,null,null,null,null,null,null,null,null,null,null,null,null,null,null,null,null,null,null,null,null,null,null,null,null,6]
[null,null,"Vanessa",null,null,null,null,null,null,null,null,null,null,null,null,null,"D/MG","D/MG","D/MG","D/MG","D/MG","D/MG","D/MG","D/MG","D/MG","D/MG","D/MG","D/MG",null,null,null,null,null,null,null,null,"D/MG","D/MG","D/MG","D/MG","D/MG","D/MG","D/MG","D/MG","D/MG","D/MG","D/MG","D/MG",null,null,null,null,null,null,null,null,6]
[null,null,null,null,null,null,null,null,null,null,null,null,null,null,null,null,null,null,null,null,null,null,null,null,null,null,null,null,null,null,null,null,null,null,null,null,null,null,null,null,null,null,null,null,null,null,null,null,null,null,null,null,null,null,null,null,0]
[null,null,null,null,null,null,null,null,null,null,null,null,null,null,null,null,null,null,null,null,null,null,null,null,null,null,null,null,null,null,null,null,null,null,null,null,null,null,null,null,null,null,null,null,null,null,null,null,null,null,null,null,null,null,null,null,0]
[null,null,null,null,null,null,null,null,null,null,null,null,null,null,null,null,null,null,null,null,null,null,null,null,null,null,null,null,null,null,null,null,null,null,null,null,null,null,null,null,null,null,null,null,null,null,null,null,null,null,null,null,null,null,null,null,0]
[null,null,null,null,null,null,null,null,null,null,null,null,null,null,null,null,null,null,null,null,null,null,null,null,null,null,null,null,null,null,null,null,null,null,null,null,null,null,null,null,null,null,null,null,null,null,null,null,null,null,null,null,null,null,null,null,0]
[null,null,"TOTAL",null,{"$f":"COUNTA(E54:E67)*0.25","v":1},1.25,{"$f":"COUNTA(G54:G67)*0.25","v":2},{"$f":"COUNTA(H54:H67)*0.25","v":2},2,2,2,2,2,2,2,2,2.5,2.5,2.5,2.5,2.5,2.5,2.5,2.5,2.5,2.5,2.25,2.25,2,1.5,0.75,0.75,0.5,0.5,0.25,0.25,0.5,0.5,0.5,0.5,0.5,0.5,0.5,0.5,0.5,0.5,0.5,0.25,0,0,0,0,0,0,0,0,{"$f":"SUM(E68:BD68)","v":64}]
[]
[null,"VENDREDI",null,null,"6h30-6h45","6h45-7h","7h-7h15","7h15-7h30","7h30-7h45","7h45-8h","8h-8h15","8h15-8h30","8h30-8h45","8h45-9h","9h-9h15","9h15-9H30","9h30-9H45","9h45-10H","10h-10H15","10h15-10H30","10h30-10h45","10h45-11H","11h-11H15","11h15-11H30","11h30-11H45","11h45-12H","12h-12H15","12h15-12H30","12h30-12H45","12h45-13H","13h-13H15","13h15-13H30","13h30-13H45","13H45-14H","14H-14H15","14h15-14H30","14h30-14H45","14H45-15H","15H-15H15","15h15-15h30","15h30-15h45","15h45-16h","16h-16h15","16h15-16h30","16h30-16h45","16h45-17h","17h-17h15","17h15-17h30","17h30-17h45","17h45-18h","18h-18h15","18h15-18h30","18h30-18h45","18h45-19h","19h-19h15","19h15-19h30","total"]
[null,"sec","Aurore",null,null,null,"S","S","S","S","S","S","S","S","S","S","S","S","S","S","S","S","S","S","S","S",null,null,null,null,null,null,null,null,null,null,null,null,null,null,null,null,null,null,null,null,null,null,null,null,null,null,null,null,null,null,{"$f":"COUNTA(E71:BD71)*0.25","v":5}]
[null,"frais","Bertrand",null,null,null,null,null,null,null,null,null,null,null,null,null,null,null,null,null,null,null,null,null,null,null,null,null,null,null,"S","S","S","S","S","S","S","S","S","S","S","S","S","S","S","S","S","S",null,null,null,null,null,null,null,null,{"$f":"COUNTA(G72:BD72)*0.25","v":4.5}]
[null,"LIQUIDE","Corinne",null,null,null,null,null,"S","S","S","S","S","S","S","S","S","S","S","S","S","S","S","S","S","S","S",null,null,null,null,null,null,null,null,null,null,null,null,null,null,null,null,null,null,null,null,null,null,null,null,null,null,null,null,null,{"$f":"COUNTA(G73:BD73)*0.25","v":4.75}]
[null,"DPH","Laura",null,null,null,null,null,"S","S","S","S","S","S","S","S","S","S","S","S","S","S","S","S","S","S",null,null,null,null,null,null,null,null,null,null,null,null,null,null,null,null,null,null,null,null,null,null,null,null,null,null,null,null,null,null,{"$f":"COUNTA(E74:BD74)*0.25","v":4.5}]
[null,null,"Ghislaine",null,null,null,null,null,"DPH","DPH","DPH","DPH","DPH","DPH","DPH","DPH","DPH","DPH","DPH","DPH","DPH","DPH","DPH","DPH","DPH","DPH","DPH","DPH",null,null,null,null,null,null,null,null,null,null,null,null,null,null,null,null,null,null,null,null,null,null,null,null,null,null,null,null,{"$f":"COUNTA(G75:BD75)*0.25","v":5}]
[null,null,"Thibaut",null,null,null,null,null,"L","L","L","L","L","L","L","L","L","L","L","L","L","L","l","l",null,null,null,null,null,null,null,null,null,null,"L","L","L","L","L","L","L","L","L","L","L","L","L","L","L","L",null,null,null,null,null,null,8]
[null,null,"Said",null,null,null,"L","L","L","L","L","L","L","L","L","L","L","L","L","L","L","L","L","L","L","L","L","L","L","L","L",null,null,null,null,null,null,null,null,null,null,null,null,null,null,null,null,null,null,null,null,null,null,null,null,null,6.25]
[null,null,"Assiya",null,"F","F","F","F","F","F","F","F","F","F","F","F","F","F","F","F","F","F",null,null,null,null,null,null,null,null,null,null,null,null,null,null,null,null,null,null,null,null,null,null,null,null,null,null,null,null,null,null,null,null,null,null,4]
[null,null,"Francoise",null,null,"F","F","F","F","F","F","F","F","F","F","F","F","F","F","F","F","F","F","F","F","F","F",null,null,null,null,null,null,null,null,null,null,null,null,null,null,null,null,null,null,null,null,null,null,null,null,null,null,null,null,null,5.25]
[null,null,"Vanessa",null,null,null,null,null,null,null,null,null,null,null,null,null,"D/MG","D/MG","D/MG","D/MG","D/MG","D/MG","D/MG","D/MG","D/MG","D/MG","D/MG","D/MG","D/MG","D/MG","D/MG","D/MG","D/MG","D/MG","D/MG","D/MG","D/MG","D/MG","D/MG",null,null,null,null,null,null,null,null,null,null,null,null,null,null,null,null,null,5.75]
[null,null,null,null,null,null,null,null,null,null,null,null,null,null,null,null,null,null,null,null,null,null,null,null,null,null,null,null,null,null,null,null,null,null,null,null,null,null,null,null,null,null,null,null,null,null,null,null,null,null,null,null,null,null,null,null,0]
[null,null,null,null,null,null,null,null,null,null,null,null,null,null,null,null,null,null,null,null,null,null,null,null,null,null,null,null,null,null,null,null,null,null,null,null,null,null,null,null,null,null,null,null,null,null,null,null,null,null,null,null,null,null,null,null,0]
[null,null,null,null,null,null,null,null,null,null,null,null,null,null,null,null,null,null,null,null,null,null,null,null,null,null,null,null,null,null,null,null,null,null,null,null,null,null,null,null,null,null,null,null,null,null,null,null,null,null,null,null,null,null,null,null,0]
[null,null,null,null,null,null,null,null,null,null,null,null,null,null,null,null,null,null,null,null,null,null,null,null,null,null,null,null,null,null,null,null,null,null,null,null,null,null,null,null,null,null,null,null,null,null,null,null,null,null,null,null,null,null,null,null,0]
[null,null,"TOTAL",null,{"$f":"COUNTA(E71:E84)*0.25","v":0.25},0.5,{"$f":"COUNTA(G71:G84)*0.25","v":1},{"$f":"COUNTA(H71:H84)*0.25","v":1},2,2,2,2,2,2,2,2,2.25,2.25,2.25,2.25,2.25,2.25,2,2,1.75,1.75,1.25,0.75,0.5,0.5,0.75,0.5,0.5,0.5,0.75,0.75,0.75,0.75,0.75,0.5,0.5,0.5,0.5,0.5,0.5,0.5,0.5,0.5,0.25,0.25,0,0,0,0,0,0,{"$f":"SUM(E85:BD85)","v":53.75}]
[]
[null,"SAMEDI",null,null,"6h30-6h45","6h45-7h","7h-7h15","7h15-7h30","7h30-7h45","7h45-8h","8h-8h15","8h15-8h30","8h30-8h45","8h45-9h","9h-9h15","9h15-9H30","9h30-9H45","9h45-10H","10h-10H15","10h15-10H30","10h30-10h45","10h45-11H","11h-11H15","11h15-11H30","11h30-11H45","11h45-12H","12h-12H15","12h15-12H30","12h30-12H45","12h45-13H","13h-13H15","13h15-13H30","13h30-13H45","13H45-14H","14H-14H15","14h15-14H30","14h30-14H45","14H45-15H","15H-15H15","15h15-15h30","15h30-15h45","15h45-16h","16h-16h15","16h15-16h30","16h30-16h45","16h45-17h","17h-17h15","17h15-17h30","17h30-17h45","17h45-18h","18h-18h15","18h15-18h30","18h30-18h45","18h45-19h","19h-19h15","19h15-19h30","total"]
[null,"sec","Aurore",null,null,null,null,null,null,null,null,null,null,null,null,null,null,null,null,null,null,null,null,null,null,null,null,null,null,null,null,null,null,null,"S","S","S","S","S","S","S","S","S","S","S","S","S","S","S","S","S","S","S","S",null,null,{"$f":"COUNTA(E88:BD88)*0.25","v":5}]
[null,"frais","Bertrand",null,null,null,null,null,null,null,null,null,null,null,null,null,"S","S","S","S","S","S","S","S","S","S","S","S",null,null,null,null,null,null,null,null,null,null,null,null,null,null,null,null,null,null,null,null,null,null,null,null,null,null,null,null,3]
[null,"LIQUIDE","Corinne",null,null,null,null,null,null,null,null,null,null,null,null,null,null,null,null,null,null,null,null,null,null,null,null,null,null,null,null,null,"s","s","s","s","s","s","s","s","s","s","s","s","s","s","s","s","s","s","s","s","s","s",null,null,5.5]
[null,"DPH","Laura",null,null,null,null,null,null,null,null,null,null,null,null,null,null,null,null,null,null,null,null,null,null,null,null,null,null,null,null,null,"s","s","s","s","s","s","s","s","s","s","s","s","s","s","s","s","s","s","s","s","s","s",null,null,5.5]
[null,null,"Ghislaine",null,null,null,null,null,null,null,null,null,"DPH","DPH","DPH","DPH","DPH","DPH","DPH","DPH","DPH","DPH","DPH","DPH",null,null,null,null,null,null,null,null,"dph","dph","dph","dph","dph","dph","dph","dph","dph","dph","dph","dph","dph","dph","dph","dph","dph",null,null,null,null,null,null,null,7.25]
[null,null,"Thibaut",null,null,null,null,null,null,null,null,null,null,null,null,null,null,null,null,null,null,null,null,null,null,null,null,null,null,null,"L","L","L","L","L","L","L","L","L","L","L","L","L","L","L","L","L","L","L","L","L","L","L","L",null,null,6]
[null,null,"Said",null,null,null,null,null,null,null,null,null,null,null,null,null,null,null,null,null,null,null,null,null,null,null,null,null,null,null,null,null,"L","L","L","L","L","L","L","L","L","L","L","L","L","L","L","L","L","L","L","L","L","L",null,null,5.5]
[null,null,"Assiya",null,"F","F","F","F","F","F","F","F","F","F","F","F","F","F","F","F","F","F","F","F","F",null,null,null,null,null,null,null,null,null,"F","F","F","F","F","F","F","F","F","F","F","F","F","F",null,null,null,null,null,null,null,null,8.75]
[null,null,"Francoise",null,"F","F","F","F","F","F","F","F","F","F","F","F","F","F","F","F","F","F","F","F","F","F",null,null,null,null,null,null,null,null,"F","F","F","F","F","F","F","F","F","F","F","F","F","F",null,null,null,null,null,null,null,null,9]
[null,null,"Vanessa",null,null,null,null,null,null,null,null,null,null,null,null,null,"D/MG","D/MG","D/MG","D/MG","D/MG","D/MG","D/MG","D/MG","D/MG","D/MG","D/MG","D/MG","D/MG","D/MG",null,null,null,null,null,null,null,null,null,null,null,null,null,null,null,null,null,null,null,null,null,null,null,null,null,null,3.5]
[null,null,null,null,null,null,null,null,null,null,null,null,null,null,null,null,null,null,null,null,null,null,null,null,null,null,null,null,null,null,null,null,null,null,null,null,null,null,null,null,null,null,null,null,null,null,null,null,null,null,null,null,null,null,null,null,0]
[null,null,null,null,null,null,null,null,null,null,null,null,null,null,null,null,null,null,null,null,null,null,null,null,null,null,null,null,null,null,null,null,null,null,null,null,null,null,null,null,null,null,null,null,null,null,null,null,null,null,null,null,null,null,null,null,0]
[null,null,null,null,null,null,null,null,null,null,null,null,null,null,null,null,null,null,null,null,null,null,null,null,null,null,null,null,null,null,null,null,null,null,null,null,null,null,null,null,null,null,null,null,null,null,null,null,null,null,null,null,null,null,null,null,0]
[null,null,null,null,null,null,null,null,null,null,null,null,null,null,null,null,null,null,null,null,null,null,null,null,null,null,null,null,null,null,null,null,null,null,null,null,null,null,null,null,null,null,null,null,null,null,null,null,null,null,null,null,null,null,null,null,0]
[null,null,"TOTAL",null,{"$f":"COUNTA(E88:E101)*0.25","v":0.5},0.5,{"$f":"COUNTA(G88:G101)*0.25","v":0.5},{"$f":"COUNTA(H88:H101)*0.25","v":0.5},0.5,0.5,0.5,0.5,0.75,0.75,0.75,0.75,1.25,1.25,1.25,1.25,1.25,1.25,1.25,1.25,1,0.75,0.5,0.5,0.25,0.25,0.25,0.25,1.25,1.25,2,2,2,2,2,2,2,2,2,2,2,2,2,2,1.5,1.25,1.25,1.25,1.25,1.25,0,0,{"$f":"SUM(BE88:BE101)","v":59}]
[]
[null,"Dimanche",null,null,"6h30-6h45","6h45-7h","7h-7h15","7h15-7h30","7h30-7h45","7h45-8h","8h-8h15","8h15-8h30","8h30-8h45","8h45-9h","9h-9h15","9h15-9H30","9h30-9H45","9h45-10H","10h-10H15","10h15-10H30","10h30-10h45","10h45-11H","11h-11H15","11h15-11H30","11h30-11H45","11h45-12H","12h-12H15","12h15-12H30","12h30-12H45","12h45-13H","13h-13H15","13h15-13H30","13h30-13H45","13H45-14H","14H-14H15","14h15-14H30","14h30-14H45","14H45-15H","15H-15H15","15h15-15h30","15h30-15h45","15h45-16h","16h-16h15","16h15-16h30","16h30-16h45","16h45-17h","17h-17h15","17h15-17h30","17h30-17h45","17h45-18h","18h-18h15","18h15-18h30","18h30-18h45","18h45-19h","19h-19h15","19h15-19h30","total"]
[null,"sec","Aurore",null,null,null,null,null,null,null,null,null,null,null,null,null,null,null,null,null,null,null,null,null,null,null,null,null,null,null,null,null,null,null,null,null,null,null,null,null,null,null,null,null,null,null,null,null,null,null,null,null,null,null,null,null,{"$f":"COUNTA(G105:BD105)*0.25","v":0}]
[null,"frais","Bertrand",null,null,null,null,null,null,null,null,null,null,null,null,null,null,null,null,null,null,null,null,null,null,null,null,null,null,null,null,null,null,null,null,null,null,null,null,null,null,null,null,null,null,null,null,null,null,null,null,null,null,null,null,null,0]
[null,"LIQUIDE","Corinne",null,null,null,null,null,null,null,null,null,null,null,null,null,null,null,null,null,null,null,null,null,null,null,null,null,null,null,null,null,null,null,null,null,null,null,null,null,null,null,null,null,null,null,null,null,null,null,null,null,null,null,null,null,0]
[null,"DPH","Laura",null,null,null,null,null,null,null,null,null,null,null,null,null,null,null,null,null,null,null,null,null,null,null,null,null,null,null,null,null,null,null,null,null,null,null,null,null,null,null,null,null,null,null,null,null,null,null,null,null,null,null,null,null,0]
[null,null,"Ghislaine",null,null,null,null,null,null,null,null,null,null,null,null,null,null,null,null,null,null,null,null,null,null,null,null,null,null,null,null,null,null,null,null,null,null,null,null,null,null,null,null,null,null,null,null,null,null,null,null,null,null,null,null,null,0]
[null,null,"Thibaut",null,null,null,null,null,null,null,null,null,null,null,null,null,null,null,null,null,null,null,null,null,null,null,null,null,null,null,null,null,null,null,null,null,null,null,null,null,null,null,null,null,null,null,null,null,null,null,null,null,null,null,null,null,0]
[null,null,"Said",null,null,null,null,null,null,null,null,null,null,null,null,null,null,null,null,null,null,null,null,null,null,null,null,null,null,null,null,null,null,null,null,null,null,null,null,null,null,null,null,null,null,null,null,null,null,null,null,null,null,null,null,null,0]
[null,null,"Assiya",null,null,null,null,null,null,null,null,null,null,null,null,null,null,null,null,null,null,null,null,null,null,null,null,null,null,null,null,null,null,null,null,null,null,null,null,null,null,null,null,null,null,null,null,null,null,null,null,null,null,null,null,null,0]
[null,null,"Francoise",null,null,null,null,null,null,null,null,null,null,null,null,null,null,null,null,null,null,null,null,null,null,null,null,null,null,null,null,null,null,null,null,null,null,null,null,null,null,null,null,null,null,null,null,null,null,null,null,null,null,null,null,null,0]
[null,null,"Vanessa",null,null,null,null,null,null,null,null,null,null,null,null,null,null,null,null,null,null,null,null,null,null,null,null,null,null,null,null,null,null,null,null,null,null,null,null,null,null,null,null,null,null,null,null,null,null,null,null,null,null,null,null,null,0]
[null,null,null,null,null,null,null,null,null,null,null,null,null,null,null,null,null,null,null,null,null,null,null,null,null,null,null,null,null,null,null,null,null,null,null,null,null,null,null,null,null,null,null,null,null,null,null,null,null,null,null,null,null,null,null,null,0]
[null,null,null,null,null,null,null,null,null,null,null,null,null,null,null,null,null,null,null,null,null,null,null,null,null,null,null,null,null,null,null,null,null,null,null,null,null,null,null,null,null,null,null,null,null,null,null,null,null,null,null,null,null,null,null,null,0]
[null,null,null,null,null,null,null,null,null,null,null,null,null,null,null,null,null,null,null,null,null,null,null,null,null,null,null,null,null,null,null,null,null,null,null,null,null,null,null,null,null,null,null,null,null,null,null,null,null,null,null,null,null,null,null,null,0]
[null,null,null,null,null,null,null,null,null,null,null,null,null,null,null,null,null,null,null,null,null,null,null,null,null,null,null,null,null,null,null,null,null,null,null,null,null,null,null,null,null,null,null,null,null,null,null,null,null,null,null,null,null,null,null,null,0]
[null,null,"TOTAL",null,null,null,{"$f":"COUNTA(G105:G118)*0.25","v":0},{"$f":"COUNTA(H105:H118)*0.25","v":0},0,0,0,0,0,0,0,0,0,0,0,0,0,0,0,0,0,0,0,0,0,0,0,0,0,0,0,0,0,0,0,0,0,0,0,0,0,0,0,0,0,0,0,0,0,0,0,0,{"$f":"SUM(G119:BD119)","v":0}]
[]
[null,"Signatures OBLIGATOIRES"]
[]
[]
[]
[]
[null,"Planning",null,null,"6h30-6h45","6h45-7h","7h-7h15","7h15-7h30","7h30-7h45","7h45-8h","8h-8h15","8h15-8h30","8h30-8h45","8h45-9h","9h-9h15","9h15-9H30","9h30-9H45","9h45-10H","10h-10H15","10h15-10H30","10h30-10h45","10h45-11H","11h-11H15","11h15-11H30","11h30-11H45","11h45-12H","12h-12H15","12h15-12H30","12h30-12H45","12h45-13H","13h-13H15","13h15-13H30","13h30-13H45","13H45-14H","14H-14H15","14h15-14H30","14h30-14H45","14H45-15H","15H-15H15","15h15-15h30","15h30-15h45","15h45-16h","16h-16h15","16h15-16h30","16h30-16h45","16h45-17h","17h-17h15","17h15-17h30","17h30-17h45","17h45-18h","18h-18h15","18h15-18h30","18h30-18h45","18h45-19h","19h-19h15","19h15-19h30"]
[null,"TOTAL Semaine",{"$f":"+C105","v":"Aurore"},"S",{"$f":"(IF(E3=\"S\",1,0)+IF(E20=\"S\",1,0)+IF(E37=\"S\",1,0)+IF(E54=\"S\",1,0)+IF(E71=\"S\",1,0)+IF(E88=\"S\",1,0)+IF(E105=\"S\",1,0))/4","v":0},{"$f":"(IF(F3=\"S\",1,0)+IF(F20=\"S\",1,0)+IF(F37=\"S\",1,0)+IF(F54=\"S\",1,0)+IF(F71=\"S\",1,0)+IF(F88=\"S\",1,0)+IF(F105=\"S\",1,0))/4","v":0},1.25,1.25,1.25,1.25,1.25,1.25,1.25,1.25,1.25,1.25,1.25,1.25,1,1,1,1,1,1,1,1,0.5,0.5,0.5,0.5,0,0,0,0,0.25,0.25,0.25,0.25,0.25,0.25,0.25,0.25,0.25,0.25,0.25,0.25,0.25,0.25,0.25,0.25,0.25,0.25,0.25,0.25,0,0,{"$f":"SUM(E127:BD127)","v":30},{"$f":"SUM(BE127+BE128)","v":30}]
[null,null,null,null,{"$f":"(IF(E3=\"c\",1,0)+IF(E20=\"c\",1,0)+IF(E37=\"c\",1,0)+IF(E54=\"c\",1,0)+IF(E71=\"c\",1,0)+IF(E88=\"c\",1,0)+IF(E105=\"c\",1,0))/4","v":0},0,0,0,0,0,0,0,0,0,0,0,0,0,0,0,0,0,0,0,0,0,0,0,0,0,0,0,0,0,0,0,{"$f":"(IF(AK3=\"c\",1,0)+IF(AK20=\"c\",1,0)+IF(AK37=\"c\",1,0)+IF(AK54=\"c\",1,0)+IF(AK71=\"c\",1,0)+IF(AK88=\"c\",1,0)+IF(AK105=\"c\",1,0))/4","v":0},0,0,0,0,0,0,0,0,0,0,0,0,0,0,0,0,0,0,0,{"$f":"SUM(G128:BD128)","v":0}]
[null,null,{"$f":"+C106","v":"Bertrand"},"B",{"$f":"(IF(E4=\"B\",1,0)+IF(E21=\"B\",1,0)+IF(E38=\"B\",1,0)+IF(E55=\"B\",1,0)+IF(E72=\"B\",1,0)+IF(E89=\"B\",1,0)+IF(E106=\"B\",1,0))/4","v":0},0,0,0,0,0,0,0,0,0,0,0,0,0,0,0,0,0,0,0,0,0,0,0,0,0,0,0,0,0,0,0,{"$f":"(IF(AK4=\"B\",1,0)+IF(AK21=\"B\",1,0)+IF(AK38=\"B\",1,0)+IF(AK55=\"B\",1,0)+IF(AK72=\"B\",1,0)+IF(AK89=\"B\",1,0)+IF(AK106=\"B\",1,0))/4","v":0},0,0,0,0,0,0,0,0,0,0,0,0,0,0,0,0,0,0,0,{"$f":"SUM(E129:BD129)","v":0},{"$f":"SUM(BE129+BE130)","v":20}]
[null,null,{"$f":"+C4","v":"Bertrand"},"S",{"$f":"(IF(E4=\"S\",1,0)+IF(E21=\"S\",1,0)+IF(E38=\"S\",1,0)+IF(E55=\"S\",1,0)+IF(E72=\"S\",1,0)+IF(E89=\"S\",1,0)+IF(E106=\"S\",1,0))/4","v":0},{"$f":"(IF(F4=\"S\",1,0)+IF(F21=\"S\",1,0)+IF(F38=\"S\",1,0)+IF(F55=\"S\",1,0)+IF(F72=\"S\",1,0)+IF(F89=\"S\",1,0)+IF(F106=\"S\",1,0))/4","v":0},0,0,0,0,0,0,0,0,0,0,0.75,0.75,0.75,0.75,0.75,0.75,0.75,0.75,0.75,0.75,0.75,0.75,0.5,0.5,0.75,0.75,0.75,0.75,0.5,0.5,0.5,0.5,0.5,0.5,0.5,0.5,0.5,0.5,0.5,0.5,0.5,0.5,0,0,0,0,0,0,0,0,{"$f":"SUM(G130:BD130)","v":20}]
[null,null,{"$f":"+C5","v":"Corinne"},"M",{"$f":"(IF(E4=\"M\",1,0)+IF(E21=\"M\",1,0)+IF(E38=\"M\",1,0)+IF(E55=\"M\",1,0)+IF(E72=\"M\",1,0)+IF(E89=\"M\",1,0)+IF(E106=\"M\",1,0))/4","v":0},0,0,0,0,0,0,0,0,0,0,0,0,0,0,0,0,0,0,0,0,0,0,0,0,0,0,0,0,0,0,0,{"$f":"(IF(AK4=\"M\",1,0)+IF(AK21=\"M\",1,0)+IF(AK38=\"M\",1,0)+IF(AK55=\"M\",1,0)+IF(AK72=\"M\",1,0)+IF(AK89=\"M\",1,0)+IF(AK106=\"M\",1,0))/4","v":0},0,0,0,0,0,0,0,0,0,0,0,0,0,0,0,0,0,0,0,{"$f":"SUM(G131:BD131)","v":0},{"$f":"SUM(BE131+BE132)","v":36.75}]
[null,null,null,"S",{"$f":"(IF(E5=\"S\",1,0)+IF(E22=\"S\",1,0)+IF(E39=\"S\",1,0)+IF(E56=\"S\",1,0)+IF(E73=\"S\",1,0)+IF(E90=\"S\",1,0)+IF(E107=\"S\",1,0))/4","v":0},{"$f":"(IF(F5=\"S\",1,0)+IF(F22=\"S\",1,0)+IF(F39=\"S\",1,0)+IF(F56=\"S\",1,0)+IF(F73=\"S\",1,0)+IF(F90=\"S\",1,0)+IF(F107=\"S\",1,0))/4","v":0},0.75,0.75,1.25,1.25,1.25,1.25,1.25,1.25,1.25,1.25,1.25,1.25,1.25,1.25,1.25,1.25,1.25,1.25,1.25,1.25,1,0.75,0.5,0.5,0.5,0.5,0.25,0.25,0.25,0.25,0.5,0.5,0.5,0.5,0.5,0.5,0.5,0.5,0.5,0.5,0.5,0.5,0.5,0.5,0.25,0.25,0.25,0.25,0,0,{"$f":"SUM(E132:BD132)","v":36.75}]
[null,null,{"$f":"+C6","v":"Laura"},null,{"$f":"(IF(E7=\"r\",1,0)+IF(E23=\"r\",1,0)+IF(E40=\"r\",1,0)+IF(E57=\"r\",1,0)+IF(E74=\"r\",1,0)+IF(E91=\"r\",1,0)+IF(E108=\"r\",1,0))/4","v":0},0,0,0,0,0,0,0,0,0,0,0,0,0,0,0,0,0,0,0,0,0,0,0,0,0,0,0,0,0,0,0,{"$f":"(IF(AK7=\"r\",1,0)+IF(AK23=\"r\",1,0)+IF(AK40=\"r\",1,0)+IF(AK57=\"r\",1,0)+IF(AK74=\"r\",1,0)+IF(AK91=\"r\",1,0)+IF(AK108=\"r\",1,0))/4","v":0},0,0,0,0,0,0,0,0,0,0,0,0,0,0,0,0,0,0,0,{"$f":"SUM(G133:BD133)","v":0},{"$f":"SUM(BE133+BE134)","v":36.75}]
[null,null,null,"S",{"$f":"(IF(E6=\"S\",1,0)+IF(E23=\"S\",1,0)+IF(E40=\"S\",1,0)+IF(E57=\"S\",1,0)+IF(E74=\"S\",1,0)+IF(E91=\"S\",1,0)+IF(E108=\"S\",1,0))/4","v":0.75},{"$f":"(IF(F6=\"S\",1,0)+IF(F23=\"S\",1,0)+IF(F40=\"S\",1,0)+IF(F57=\"S\",1,0)+IF(F74=\"S\",1,0)+IF(F91=\"S\",1,0)+IF(F108=\"S\",1,0))/4","v":0.75},0.75,0.75,1.25,1.25,1.25,1.25,1.25,1.25,1.25,1.25,1.25,1.25,1.25,1.25,1.25,1.25,1.25,1.25,1.25,1.25,1,0.75,0.25,0.25,0,0,0.25,0.25,0.25,0.25,0.5,0.5,0.5,0.5,0.5,0.5,0.5,0.5,0.5,0.5,0.5,0.5,0.5,0.5,0.25,0.25,0.25,0.25,0,0,{"$f":"SUM(E134:BD134)","v":36.75}]
[null,null,{"$f":"+C7","v":"Ghislaine"},null,{"$f":"(IF(#REF!=\"r\",1,0)+IF(E24=\"r\",1,0)+IF(E41=\"r\",1,0)+IF(E58=\"r\",1,0)+IF(E75=\"r\",1,0)+IF(E92=\"r\",1,0)+IF(E109=\"r\",1,0))/4","v":{"$error":"#REF!"}},{"$f":"(IF(#REF!=\"r\",1,0)+IF(F24=\"r\",1,0)+IF(F41=\"r\",1,0)+IF(F58=\"r\",1,0)+IF(F75=\"r\",1,0)+IF(F92=\"r\",1,0)+IF(F109=\"r\",1,0))/4","v":{"$error":"#REF!"}},{"$f":"(IF(#REF!=\"r\",1,0)+IF(G24=\"r\",1,0)+IF(G41=\"r\",1,0)+IF(G58=\"r\",1,0)+IF(G75=\"r\",1,0)+IF(G92=\"r\",1,0)+IF(G109=\"r\",1,0))/4","v":{"$error":"#REF!"}},{"$f":"(IF(#REF!=\"r\",1,0)+IF(H24=\"r\",1,0)+IF(H41=\"r\",1,0)+IF(H58=\"r\",1,0)+IF(H75=\"r\",1,0)+IF(H92=\"r\",1,0)+IF(H109=\"r\",1,0))/4","v":{"$error":"#REF!"}},{"$f":"(IF(#REF!=\"r\",1,0)+IF(I24=\"r\",1,0)+IF(I41=\"r\",1,0)+IF(I58=\"r\",1,0)+IF(I75=\"r\",1,0)+IF(I92=\"r\",1,0)+IF(I109=\"r\",1,0))/4","v":{"$error":"#REF!"}},{"$f":"(IF(#REF!=\"r\",1,0)+IF(J24=\"r\",1,0)+IF(J41=\"r\",1,0)+IF(J58=\"r\",1,0)+IF(J75=\"r\",1,0)+IF(J92=\"r\",1,0)+IF(J109=\"r\",1,0))/4","v":{"$error":"#REF!"}},{"$f":"(IF(#REF!=\"r\",1,0)+IF(K24=\"r\",1,0)+IF(K41=\"r\",1,0)+IF(K58=\"r\",1,0)+IF(K75=\"r\",1,0)+IF(K92=\"r\",1,0)+IF(K109=\"r\",1,0))/4","v":{"$error":"#REF!"}},{"$f":"(IF(#REF!=\"r\",1,0)+IF(L24=\"r\",1,0)+IF(L41=\"r\",1,0)+IF(L58=\"r\",1,0)+IF(L75=\"r\",1,0)+IF(L92=\"r\",1,0)+IF(L109=\"r\",1,0))/4","v":{"$error":"#REF!"}},{"$f":"(IF(#REF!=\"r\",1,0)+IF(M24=\"r\",1,0)+IF(M41=\"r\",1,0)+IF(M58=\"r\",1,0)+IF(M75=\"r\",1,0)+IF(M92=\"r\",1,0)+IF(M109=\"r\",1,0))/4","v":{"$error":"#REF!"}},{"$f":"(IF(#REF!=\"r\",1,0)+IF(N24=\"r\",1,0)+IF(N41=\"r\",1,0)+IF(N58=\"r\",1,0)+IF(N75=\"r\",1,0)+IF(N92=\"r\",1,0)+IF(N109=\"r\",1,0))/4","v":{"$error":"#REF!"}},{"$f":"(IF(#REF!=\"r\",1,0)+IF(O24=\"r\",1,0)+IF(O41=\"r\",1,0)+IF(O58=\"r\",1,0)+IF(O75=\"r\",1,0)+IF(O92=\"r\",1,0)+IF(O109=\"r\",1,0))/4","v":{"$error":"#REF!"}},{"$f":"(IF(#REF!=\"r\",1,0)+IF(P24=\"r\",1,0)+IF(P41=\"r\",1,0)+IF(P58=\"r\",1,0)+IF(P75=\"r\",1,0)+IF(P92=\"r\",1,0)+IF(P109=\"r\",1,0))/4","v":{"$error":"#REF!"}},{"$f":"(IF(#REF!=\"r\",1,0)+IF(Q24=\"r\",1,0)+IF(Q41=\"r\",1,0)+IF(Q58=\"r\",1,0)+IF(Q75=\"r\",1,0)+IF(Q92=\"r\",1,0)+IF(Q109=\"r\",1,0))/4","v":{"$error":"#REF!"}},{"$f":"(IF(#REF!=\"r\",1,0)+IF(R24=\"r\",1,0)+IF(R41=\"r\",1,0)+IF(R58=\"r\",1,0)+IF(R75=\"r\",1,0)+IF(R92=\"r\",1,0)+IF(R109=\"r\",1,0))/4","v":{"$error":"#REF!"}},{"$f":"(IF(#REF!=\"r\",1,0)+IF(S24=\"r\",1,0)+IF(S41=\"r\",1,0)+IF(S58=\"r\",1,0)+IF(S75=\"r\",1,0)+IF(S92=\"r\",1,0)+IF(S109=\"r\",1,0))/4","v":{"$error":"#REF!"}},{"$f":"(IF(#REF!=\"r\",1,0)+IF(T24=\"r\",1,0)+IF(T41=\"r\",1,0)+IF(T58=\"r\",1,0)+IF(T75=\"r\",1,0)+IF(T92=\"r\",1,0)+IF(T109=\"r\",1,0))/4","v":{"$error":"#REF!"}},{"$f":"(IF(#REF!=\"r\",1,0)+IF(U24=\"r\",1,0)+IF(U41=\"r\",1,0)+IF(U58=\"r\",1,0)+IF(U75=\"r\",1,0)+IF(U92=\"r\",1,0)+IF(U109=\"r\",1,0))/4","v":{"$error":"#REF!"}},{"$f":"(IF(#REF!=\"r\",1,0)+IF(V24=\"r\",1,0)+IF(V41=\"r\",1,0)+IF(V58=\"r\",1,0)+IF(V75=\"r\",1,0)+IF(V92=\"r\",1,0)+IF(V109=\"r\",1,0))/4","v":{"$error":"#REF!"}},{"$f":"(IF(#REF!=\"r\",1,0)+IF(W24=\"r\",1,0)+IF(W41=\"r\",1,0)+IF(W58=\"r\",1,0)+IF(W75=\"r\",1,0)+IF(W92=\"r\",1,0)+IF(W109=\"r\",1,0))/4","v":{"$error":"#REF!"}},{"$f":"(IF(#REF!=\"r\",1,0)+IF(X24=\"r\",1,0)+IF(X41=\"r\",1,0)+IF(X58=\"r\",1,0)+IF(X75=\"r\",1,0)+IF(X92=\"r\",1,0)+IF(X109=\"r\",1,0))/4","v":{"$error":"#REF!"}},{"$f":"(IF(#REF!=\"r\",1,0)+IF(Y24=\"r\",1,0)+IF(Y41=\"r\",1,0)+IF(Y58=\"r\",1,0)+IF(Y75=\"r\",1,0)+IF(Y92=\"r\",1,0)+IF(Y109=\"r\",1,0))/4","v":{"$error":"#REF!"}},{"$f":"(IF(#REF!=\"r\",1,0)+IF(Z24=\"r\",1,0)+IF(Z41=\"r\",1,0)+IF(Z58=\"r\",1,0)+IF(Z75=\"r\",1,0)+IF(Z92=\"r\",1,0)+IF(Z109=\"r\",1,0))/4","v":{"$error":"#REF!"}},{"$f":"(IF(#REF!=\"r\",1,0)+IF(AA24=\"r\",1,0)+IF(AA41=\"r\",1,0)+IF(AA58=\"r\",1,0)+IF(AA75=\"r\",1,0)+IF(AA92=\"r\",1,0)+IF(AA109=\"r\",1,0))/4","v":{"$error":"#REF!"}},{"$f":"(IF(#REF!=\"r\",1,0)+IF(AB24=\"r\",1,0)+IF(AB41=\"r\",1,0)+IF(AB58=\"r\",1,0)+IF(AB75=\"r\",1,0)+IF(AB92=\"r\",1,0)+IF(AB109=\"r\",1,0))/4","v":{"$error":"#REF!"}},{"$f":"(IF(#REF!=\"r\",1,0)+IF(AC24=\"r\",1,0)+IF(AC41=\"r\",1,0)+IF(AC58=\"r\",1,0)+IF(AC75=\"r\",1,0)+IF(AC92=\"r\",1,0)+IF(AC109=\"r\",1,0))/4","v":{"$error":"#REF!"}},{"$f":"(IF(#REF!=\"r\",1,0)+IF(AD24=\"r\",1,0)+IF(AD41=\"r\",1,0)+IF(AD58=\"r\",1,0)+IF(AD75=\"r\",1,0)+IF(AD92=\"r\",1,0)+IF(AD109=\"r\",1,0))/4","v":{"$error":"#REF!"}},{"$f":"(IF(#REF!=\"r\",1,0)+IF(AE24=\"r\",1,0)+IF(AE41=\"r\",1,0)+IF(AE58=\"r\",1,0)+IF(AE75=\"r\",1,0)+IF(AE92=\"r\",1,0)+IF(AE109=\"r\",1,0))/4","v":{"$error":"#REF!"}},{"$f":"(IF(#REF!=\"r\",1,0)+IF(AF24=\"r\",1,0)+IF(AF41=\"r\",1,0)+IF(AF58=\"r\",1,0)+IF(AF75=\"r\",1,0)+IF(AF92=\"r\",1,0)+IF(AF109=\"r\",1,0))/4","v":{"$error":"#REF!"}},{"$f":"(IF(#REF!=\"r\",1,0)+IF(AG24=\"r\",1,0)+IF(AG41=\"r\",1,0)+IF(AG58=\"r\",1,0)+IF(AG75=\"r\",1,0)+IF(AG92=\"r\",1,0)+IF(AG109=\"r\",1,0))/4","v":{"$error":"#REF!"}},{"$f":"(IF(#REF!=\"r\",1,0)+IF(AH24=\"r\",1,0)+IF(AH41=\"r\",1,0)+IF(AH58=\"r\",1,0)+IF(AH75=\"r\",1,0)+IF(AH92=\"r\",1,0)+IF(AH109=\"r\",1,0))/4","v":{"$error":"#REF!"}},{"$f":"(IF(#REF!=\"r\",1,0)+IF(AI24=\"r\",1,0)+IF(AI41=\"r\",1,0)+IF(AI58=\"r\",1,0)+IF(AI75=\"r\",1,0)+IF(AI92=\"r\",1,0)+IF(AI109=\"r\",1,0))/4","v":{"$error":"#REF!"}},{"$f":"(IF(#REF!=\"r\",1,0)+IF(AJ24=\"r\",1,0)+IF(AJ41=\"r\",1,0)+IF(AJ58=\"r\",1,0)+IF(AJ75=\"r\",1,0)+IF(AJ92=\"r\",1,0)+IF(AJ109=\"r\",1,0))/4","v":{"$error":"#REF!"}},{"$f":"(IF(#REF!=\"r\",1,0)+IF(AK24=\"r\",1,0)+IF(AK41=\"r\",1,0)+IF(AK58=\"r\",1,0)+IF(AK75=\"r\",1,0)+IF(AK92=\"r\",1,0)+IF(AK109=\"r\",1,0))/4","v":{"$error":"#REF!"}},{"$f":"(IF(#REF!=\"r\",1,0)+IF(AL24=\"r\",1,0)+IF(AL41=\"r\",1,0)+IF(AL58=\"r\",1,0)+IF(AL75=\"r\",1,0)+IF(AL92=\"r\",1,0)+IF(AL109=\"r\",1,0))/4","v":{"$error":"#REF!"}},{"$f":"(IF(#REF!=\"r\",1,0)+IF(AM24=\"r\",1,0)+IF(AM41=\"r\",1,0)+IF(AM58=\"r\",1,0)+IF(AM75=\"r\",1,0)+IF(AM92=\"r\",1,0)+IF(AM109=\"r\",1,0))/4","v":{"$error":"#REF!"}},{"$f":"(IF(#REF!=\"r\",1,0)+IF(AN24=\"r\",1,0)+IF(AN41=\"r\",1,0)+IF(AN58=\"r\",1,0)+IF(AN75=\"r\",1,0)+IF(AN92=\"r\",1,0)+IF(AN109=\"r\",1,0))/4","v":{"$error":"#REF!"}},{"$f":"(IF(#REF!=\"r\",1,0)+IF(AO24=\"r\",1,0)+IF(AO41=\"r\",1,0)+IF(AO58=\"r\",1,0)+IF(AO75=\"r\",1,0)+IF(AO92=\"r\",1,0)+IF(AO109=\"r\",1,0))/4","v":{"$error":"#REF!"}},{"$f":"(IF(#REF!=\"r\",1,0)+IF(AP24=\"r\",1,0)+IF(AP41=\"r\",1,0)+IF(AP58=\"r\",1,0)+IF(AP75=\"r\",1,0)+IF(AP92=\"r\",1,0)+IF(AP109=\"r\",1,0))/4","v":{"$error":"#REF!"}},{"$f":"(IF(#REF!=\"r\",1,0)+IF(AQ24=\"r\",1,0)+IF(AQ41=\"r\",1,0)+IF(AQ58=\"r\",1,0)+IF(AQ75=\"r\",1,0)+IF(AQ92=\"r\",1,0)+IF(AQ109=\"r\",1,0))/4","v":{"$error":"#REF!"}},{"$f":"(IF(#REF!=\"r\",1,0)+IF(AR24=\"r\",1,0)+IF(AR41=\"r\",1,0)+IF(AR58=\"r\",1,0)+IF(AR75=\"r\",1,0)+IF(AR92=\"r\",1,0)+IF(AR109=\"r\",1,0))/4","v":{"$error":"#REF!"}},{"$f":"(IF(#REF!=\"r\",1,0)+IF(AS24=\"r\",1,0)+IF(AS41=\"r\",1,0)+IF(AS58=\"r\",1,0)+IF(AS75=\"r\",1,0)+IF(AS92=\"r\",1,0)+IF(AS109=\"r\",1,0))/4","v":{"$error":"#REF!"}},{"$f":"(IF(#REF!=\"r\",1,0)+IF(AT24=\"r\",1,0)+IF(AT41=\"r\",1,0)+IF(AT58=\"r\",1,0)+IF(AT75=\"r\",1,0)+IF(AT92=\"r\",1,0)+IF(AT109=\"r\",1,0))/4","v":{"$error":"#REF!"}},{"$f":"(IF(#REF!=\"r\",1,0)+IF(AU24=\"r\",1,0)+IF(AU41=\"r\",1,0)+IF(AU58=\"r\",1,0)+IF(AU75=\"r\",1,0)+IF(AU92=\"r\",1,0)+IF(AU109=\"r\",1,0))/4","v":{"$error":"#REF!"}},{"$f":"(IF(#REF!=\"r\",1,0)+IF(AV24=\"r\",1,0)+IF(AV41=\"r\",1,0)+IF(AV58=\"r\",1,0)+IF(AV75=\"r\",1,0)+IF(AV92=\"r\",1,0)+IF(AV109=\"r\",1,0))/4","v":{"$error":"#REF!"}},{"$f":"(IF(#REF!=\"r\",1,0)+IF(AW24=\"r\",1,0)+IF(AW41=\"r\",1,0)+IF(AW58=\"r\",1,0)+IF(AW75=\"r\",1,0)+IF(AW92=\"r\",1,0)+IF(AW109=\"r\",1,0))/4","v":{"$error":"#REF!"}},{"$f":"(IF(#REF!=\"r\",1,0)+IF(AX24=\"r\",1,0)+IF(AX41=\"r\",1,0)+IF(AX58=\"r\",1,0)+IF(AX75=\"r\",1,0)+IF(AX92=\"r\",1,0)+IF(AX109=\"r\",1,0))/4","v":{"$error":"#REF!"}},{"$f":"(IF(#REF!=\"r\",1,0)+IF(AY24=\"r\",1,0)+IF(AY41=\"r\",1,0)+IF(AY58=\"r\",1,0)+IF(AY75=\"r\",1,0)+IF(AY92=\"r\",1,0)+IF(AY109=\"r\",1,0))/4","v":{"$error":"#REF!"}},{"$f":"(IF(#REF!=\"r\",1,0)+IF(AZ24=\"r\",1,0)+IF(AZ41=\"r\",1,0)+IF(AZ58=\"r\",1,0)+IF(AZ75=\"r\",1,0)+IF(AZ92=\"r\",1,0)+IF(AZ109=\"r\",1,0))/4","v":{"$error":"#REF!"}},{"$f":"(IF(#REF!=\"r\",1,0)+IF(BA24=\"r\",1,0)+IF(BA41=\"r\",1,0)+IF(BA58=\"r\",1,0)+IF(BA75=\"r\",1,0)+IF(BA92=\"r\",1,0)+IF(BA109=\"r\",1,0))/4","v":{"$error":"#REF!"}},{"$f":"(IF(#REF!=\"r\",1,0)+IF(BB24=\"r\",1,0)+IF(BB41=\"r\",1,0)+IF(BB58=\"r\",1,0)+IF(BB75=\"r\",1,0)+IF(BB92=\"r\",1,0)+IF(BB109=\"r\",1,0))/4","v":{"$error":"#REF!"}},{"$f":"(IF(#REF!=\"r\",1,0)+IF(BC24=\"r\",1,0)+IF(BC41=\"r\",1,0)+IF(BC58=\"r\",1,0)+IF(BC75=\"r\",1,0)+IF(BC92=\"r\",1,0)+IF(BC109=\"r\",1,0))/4","v":{"$error":"#REF!"}},{"$f":"(IF(#REF!=\"r\",1,0)+IF(BD24=\"r\",1,0)+IF(BD41=\"r\",1,0)+IF(BD58=\"r\",1,0)+IF(BD75=\"r\",1,0)+IF(BD92=\"r\",1,0)+IF(BD109=\"r\",1,0))/4","v":{"$error":"#REF!"}},{"$f":"SUM(E135:BD135)","v":{"$error":"#REF!"}},{"$f":"SUM(BE135+BE136)","v":{"$error":"#REF!"}}]
[null,null,null,"DPH",{"$f":"(IF(E7=\"DPH\",1,0)+IF(E24=\"DPH\",1,0)+IF(E41=\"DPH\",1,0)+IF(E58=\"DPH\",1,0)+IF(E75=\"DPH\",1,0)+IF(E92=\"DPH\",1,0)+IF(E109=\"DPH\",1,0))/4","v":0.5},{"$f":"(IF(F7=\"DPH\",1,0)+IF(F24=\"DPH\",1,0)+IF(F41=\"DPH\",1,0)+IF(F58=\"DPH\",1,0)+IF(F75=\"DPH\",1,0)+IF(F92=\"DPH\",1,0)+IF(F109=\"DPH\",1,0))/4","v":0.5},0.5,0.5,1.25,1.25,1.25,1.25,1.5,1.5,1.5,1.5,1.5,1.5,1.5,1.5,1.5,1.5,1.5,1.5,1.25,1.25,1,0.75,0,0,0,0,0.25,0.25,0.5,0.5,0.5,0.5,0.5,0.5,0.5,0.5,0.5,0.5,0.5,0.5,0.5,0.25,0.25,0,0,0,0,0,0,0,{"$f":"SUM(E136:BD136)","v":36.75}]
[null,null,{"$f":"+C8","v":"Thibaut"},null,{"$f":"(IF(E8=\"r\",1,0)+IF(E25=\"r\",1,0)+IF(E42=\"r\",1,0)+IF(E59=\"r\",1,0)+IF(E76=\"r\",1,0)+IF(E93=\"r\",1,0)+IF(E110=\"r\",1,0))/4","v":0},0,{"$f":"(IF(G8=\"r\",1,0)+IF(G25=\"r\",1,0)+IF(G42=\"r\",1,0)+IF(G59=\"r\",1,0)+IF(G76=\"r\",1,0)+IF(G93=\"r\",1,0)+IF(G110=\"r\",1,0))/4","v":0},{"$f":"(IF(H8=\"r\",1,0)+IF(H25=\"r\",1,0)+IF(H42=\"r\",1,0)+IF(H59=\"r\",1,0)+IF(H76=\"r\",1,0)+IF(H93=\"r\",1,0)+IF(H110=\"r\",1,0))/4","v":0},0,0,0,0,0,0,0,0,0,0,0,0,0,0,0,0,0,0,0,0,0,0,0,0,0,0,0,0,0,0,0,0,0,0,0,0,0,0,0,0,0,0,0,0,0,0,0,0,0,{"$f":"SUM(BE137+BE138)","v":36.75}]
[null,null,null,"L",{"$f":"(IF(E8=\"L\",1,0)+IF(E25=\"L\",1,0)+IF(E42=\"L\",1,0)+IF(E59=\"L\",1,0)+IF(E76=\"L\",1,0)+IF(E93=\"L\",1,0)+IF(E110=\"L\",1,0))/4","v":0.75},{"$f":"(IF(F8=\"L\",1,0)+IF(F25=\"L\",1,0)+IF(F42=\"L\",1,0)+IF(F59=\"L\",1,0)+IF(F76=\"L\",1,0)+IF(F93=\"L\",1,0)+IF(F110=\"L\",1,0))/4","v":0.75},0.75,0.75,1.25,1.25,1.25,1.25,1.25,1.25,1.25,1.25,1.25,1.25,1.25,1.25,1.25,1.25,1.25,1.25,1,1,0.5,0.5,0.5,0.25,0.25,0.25,0.25,0.25,0.5,0.5,0.5,0.5,0.5,0.5,0.5,0.5,0.5,0.5,0.5,0.5,0.5,0.5,0.5,0.5,0.25,0.25,0.25,0.25,0,0,36.75]
[null,null,{"$f":"+C9","v":"Said"},"L",{"$f":"(IF(E9=\"BCH\",1,0)+IF(E26=\"BCH\",1,0)+IF(E43=\"BCH\",1,0)+IF(E60=\"BCH\",1,0)+IF(E77=\"BCH\",1,0)+IF(E94=\"BCH\",1,0)+IF(E111=\"BCH\",1,0))/4","v":0},{"$f":"(IF(F9=\"l\",1,0)+IF(F26=\"l\",1,0)+IF(F43=\"l\",1,0)+IF(F60=\"l\",1,0)+IF(F77=\"l\",1,0)+IF(F94=\"l\",1,0)+IF(F111=\"l\",1,0))/4","v":0},{"$f":"(IF(G9=\"l\",1,0)+IF(G26=\"l\",1,0)+IF(G43=\"l\",1,0)+IF(G60=\"l\",1,0)+IF(G77=\"l\",1,0)+IF(G94=\"l\",1,0)+IF(G111=\"l\",1,0))/4","v":1.25},1.25,1.25,1.25,1.25,1.25,1.25,1.25,1.25,1.25,1.25,1.25,1.25,1.25,1.25,1.25,1.25,1.25,1.25,1.25,1.25,1.25,1,1,0.75,0.5,0.5,0.5,0.25,0.25,0.25,0.25,0.25,0.25,0.25,0.25,0.25,0.25,0.25,0.25,0.25,0.25,0.25,0.25,0.25,0.25,0.25,0.25,0,0,36.75,{"$f":"SUM(BE139+BE140)","v":36.75}]
[null,null,null,"BCH",{"$f":"(IF(E9=\"c\",1,0)+IF(E26=\"c\",1,0)+IF(E43=\"c\",1,0)+IF(E60=\"c\",1,0)+IF(E77=\"c\",1,0)+IF(E94=\"c\",1,0)+IF(E111=\"c\",1,0))/4","v":0},0,{"$f":"(IF(G9=\"c\",1,0)+IF(G26=\"c\",1,0)+IF(G43=\"c\",1,0)+IF(G60=\"c\",1,0)+IF(G77=\"c\",1,0)+IF(G94=\"c\",1,0)+IF(G111=\"c\",1,0))/4","v":0},{"$f":"(IF(H9=\"c\",1,0)+IF(H26=\"c\",1,0)+IF(H43=\"c\",1,0)+IF(H60=\"c\",1,0)+IF(H77=\"c\",1,0)+IF(H94=\"c\",1,0)+IF(H111=\"c\",1,0))/4","v":0},0,0,0,0,0,0,0,0,0,0,0,0,0,0,0,0,0,0,0,0,0,0,0,0,0,0,0,0,0,0,0,0,0,0,0,0,0,0,0,0,0,0,0,0,0,0,0,0,0]
[null,null,{"$f":"+C10","v":"Assiya"},"F",{"$f":"(IF(E10=\"F\",1,0)+IF(E27=\"F\",1,0)+IF(E44=\"F\",1,0)+IF(E61=\"F\",1,0)+IF(E78=\"F\",1,0)+IF(E95=\"F\",1,0)+IF(E112=\"F\",1,0))/4","v":1.5},{"$f":"(IF(F10=\"F\",1,0)+IF(F27=\"F\",1,0)+IF(F44=\"F\",1,0)+IF(F61=\"F\",1,0)+IF(F78=\"F\",1,0)+IF(F95=\"F\",1,0)+IF(F112=\"F\",1,0))/4","v":1.5},1.5,1.5,1.5,1.5,1.5,1.5,1.5,1.5,1.5,1.5,1.5,1.5,1.5,1.5,1.5,1.5,1.25,1.25,1,0.75,0.75,0.5,0.5,0.25,0,0,0,0,0.25,0.25,0.25,0.25,0.25,0.25,0.25,0.25,0.25,0.25,0.25,0.25,0.25,0.25,0,0,0,0,0,0,0,0,{"$f":"SUM(E141:BD141)","v":36.75},{"$f":"SUM(BE141+BE142)","v":36.75}]
[null,null,null,"BCH",{"$f":"(IF(E10=\"c\",1,0)+IF(E27=\"c\",1,0)+IF(E44=\"c\",1,0)+IF(E61=\"c\",1,0)+IF(E78=\"c\",1,0)+IF(E95=\"c\",1,0)+IF(E112=\"c\",1,0))/4","v":0},0,{"$f":"(IF(G10=\"c\",1,0)+IF(G27=\"c\",1,0)+IF(G44=\"c\",1,0)+IF(G61=\"c\",1,0)+IF(G78=\"c\",1,0)+IF(G95=\"c\",1,0)+IF(G112=\"c\",1,0))/4","v":0},{"$f":"(IF(H10=\"c\",1,0)+IF(H27=\"c\",1,0)+IF(H44=\"c\",1,0)+IF(H61=\"c\",1,0)+IF(H78=\"c\",1,0)+IF(H95=\"c\",1,0)+IF(H112=\"c\",1,0))/4","v":0},0,0,0,0,0,0,0,0,0,0,0,0,0,0,0,0,0,0,0,0,0,0,0,0,0,0,0,0,0,0,0,0,0,0,0,0,0,0,0,0,0,0,0,0,0,0,0,0,0]
[null,null,{"$f":"+C11","v":"Francoise"},"F",{"$f":"(IF(E11=\"F\",1,0)+IF(E28=\"F\",1,0)+IF(E45=\"F\",1,0)+IF(E62=\"F\",1,0)+IF(E79=\"F\",1,0)+IF(E96=\"F\",1,0)+IF(E113=\"F\",1,0))/4","v":0.25},{"$f":"(IF(F11=\"F\",1,0)+IF(F28=\"F\",1,0)+IF(F45=\"F\",1,0)+IF(F62=\"F\",1,0)+IF(F79=\"F\",1,0)+IF(F96=\"F\",1,0)+IF(F113=\"F\",1,0))/4","v":1.5},1.5,1.5,1.5,1.5,1.5,1.5,1.5,1.5,1.5,1.5,1.5,1.5,1.5,1.5,1.5,1.5,1.5,1.25,1.25,1.25,1,0.75,0.5,0,0,0,0,0,0.25,0.25,0.25,0.25,0.25,0.25,0.25,0.25,0.25,0.25,0.25,0.25,0.25,0.25,0,0,0,0,0,0,0,0,36.75,{"$f":"SUM(BE143+BE144)","v":64.75}]
[null,null,{"$f":"+C12","v":"Vanessa"},"D/MG",{"$f":"(IF(E12=\"D/MG\",1,0)+IF(E29=\"D/MG\",1,0)+IF(E46=\"D/MG\",1,0)+IF(E63=\"D/MG\",1,0)+IF(E80=\"D/MG\",1,0)+IF(E97=\"D/MG\",1,0)+IF(E114=\"D/MG\",1,0))/4","v":0},{"$f":"(IF(F12=\"D/MG\",1,0)+IF(F29=\"D/MG\",1,0)+IF(F46=\"D/MG\",1,0)+IF(F63=\"D/MG\",1,0)+IF(F80=\"D/MG\",1,0)+IF(F97=\"D/MG\",1,0)+IF(F114=\"D/MG\",1,0))/4","v":0},0,0,0.25,0.25,0.25,0.25,0.25,0.25,0.25,0.25,1.25,1.25,1.25,1.25,1.25,1.25,1.25,1.25,1.25,1.25,1.25,1.25,0.75,0.75,0.5,0.5,0.5,0.5,0.25,0.25,0.75,0.75,0.75,0.5,0.5,0.5,0.5,0.5,0.5,0.5,0.5,0.5,0.25,0,0,0,0,0,0,0,{"$f":"+SUM(E144:BD144)","v":28}]
[null,null,{"$f":"+C19","v":0},"R",null,null,{"$f":"(IF(G12=\"r\",1,0)+IF(G29=\"r\",1,0)+IF(G46=\"r\",1,0)+IF(G63=\"r\",1,0)+IF(G80=\"r\",1,0)+IF(G97=\"r\",1,0)+IF(G114=\"r\",1,0))/4","v":0},{"$f":"(IF(H12=\"r\",1,0)+IF(H29=\"r\",1,0)+IF(H46=\"r\",1,0)+IF(H63=\"r\",1,0)+IF(H80=\"r\",1,0)+IF(H97=\"r\",1,0)+IF(H114=\"r\",1,0))/4","v":0},0,0,0,0,0,0,0,0,0,0,0,0,0,0,0,0,0,0,0,0,0,0,0,0,0,0,0,0,0,0,0,0,0,0,0,0,0,0,0,0,0,0,0,0,0,0,0,0,0,{"$f":"SUM(BE145+BE146)","v":0}]
[null,null,null,"C",null,null,{"$f":"(IF(G12=\"c\",1,0)+IF(G29=\"c\",1,0)+IF(G46=\"c\",1,0)+IF(G63=\"c\",1,0)+IF(G80=\"c\",1,0)+IF(G97=\"c\",1,0)+IF(G114=\"c\",1,0))/4","v":0},{"$f":"(IF(H12=\"c\",1,0)+IF(H29=\"c\",1,0)+IF(H46=\"c\",1,0)+IF(H63=\"c\",1,0)+IF(H80=\"c\",1,0)+IF(H97=\"c\",1,0)+IF(H114=\"c\",1,0))/4","v":0},0,0,0,0,0,0,0,0,0,0,0,0,0,0,0,0,0,0,0,0,0,0,0,0,0,0,0,0,0,0,0,0,0,0,0,0,0,0,0,0,0,0,0,0,0,0,0,0,0]
[null,null,{"$f":"+C21","v":"Bertrand"},"R",null,null,{"$f":"(IF(G13=\"r\",1,0)+IF(G30=\"r\",1,0)+IF(G47=\"r\",1,0)+IF(G64=\"r\",1,0)+IF(G81=\"r\",1,0)+IF(G98=\"r\",1,0)+IF(G115=\"r\",1,0))/4","v":0},{"$f":"(IF(H13=\"r\",1,0)+IF(H30=\"r\",1,0)+IF(H47=\"r\",1,0)+IF(H64=\"r\",1,0)+IF(H81=\"r\",1,0)+IF(H98=\"r\",1,0)+IF(H115=\"r\",1,0))/4","v":0},0,0,0,0,0,0,0,0,0,0,0,0,0,0,0,0,0,0,0,0,0,0,0,0,0,0,0,0,0,0,0,0,0,0,0,0,0,0,0,0,0,0,0,0,0,0,0,0,0,{"$f":"SUM(BE147+BE148)","v":0}]
[null,null,null,"C",null,null,{"$f":"(IF(G13=\"c\",1,0)+IF(G30=\"c\",1,0)+IF(G47=\"c\",1,0)+IF(G64=\"c\",1,0)+IF(G81=\"c\",1,0)+IF(G98=\"c\",1,0)+IF(G115=\"c\",1,0))/4","v":0},{"$f":"(IF(H13=\"c\",1,0)+IF(H30=\"c\",1,0)+IF(H47=\"c\",1,0)+IF(H64=\"c\",1,0)+IF(H81=\"c\",1,0)+IF(H98=\"c\",1,0)+IF(H115=\"c\",1,0))/4","v":0},0,0,0,0,0,0,0,0,0,0,0,0,0,0,0,0,0,0,0,0,0,0,0,0,0,0,0,0,0,0,0,0,0,0,0,0,0,0,0,0,0,0,0,0,0,0,0,0,0]
[null,null,{"$f":"+C116","v":0},"R",null,null,{"$f":"(IF(G14=\"r\",1,0)+IF(G31=\"r\",1,0)+IF(G48=\"r\",1,0)+IF(G65=\"r\",1,0)+IF(G82=\"r\",1,0)+IF(G99=\"r\",1,0)+IF(G116=\"r\",1,0))/4","v":0},{"$f":"(IF(H14=\"r\",1,0)+IF(H31=\"r\",1,0)+IF(H48=\"r\",1,0)+IF(H65=\"r\",1,0)+IF(H82=\"r\",1,0)+IF(H99=\"r\",1,0)+IF(H116=\"r\",1,0))/4","v":0},0,0,0,0,0,0,0,0,0,0,0,0,0,0,0,0,0,0,0,0,0,0,0,0,0,0,0,0,0,0,0,0,0,0,0,0,0,0,0,0,0,0,0,0,0,0,0,0,0,{"$f":"SUM(BE149+BE150)","v":0}]
[null,null,null,"C",null,null,{"$f":"(IF(G14=\"c\",1,0)+IF(G31=\"c\",1,0)+IF(G48=\"c\",1,0)+IF(G65=\"c\",1,0)+IF(G82=\"c\",1,0)+IF(G99=\"c\",1,0)+IF(G116=\"c\",1,0))/4","v":0},{"$f":"(IF(H14=\"c\",1,0)+IF(H31=\"c\",1,0)+IF(H48=\"c\",1,0)+IF(H65=\"c\",1,0)+IF(H82=\"c\",1,0)+IF(H99=\"c\",1,0)+IF(H116=\"c\",1,0))/4","v":0},0,0,0,0,0,0,0,0,0,0,0,0,0,0,0,0,0,0,0,0,0,0,0,0,0,0,0,0,0,0,0,0,0,0,0,0,0,0,0,0,0,0,0,0,0,0,0,0,0]
[null,null,{"$f":"+C117","v":0},"R",null,null,{"$f":"(IF(G15=\"r\",1,0)+IF(G32=\"r\",1,0)+IF(G49=\"r\",1,0)+IF(G66=\"r\",1,0)+IF(G83=\"r\",1,0)+IF(G100=\"r\",1,0)+IF(G117=\"r\",1,0))/4","v":0},{"$f":"(IF(H15=\"r\",1,0)+IF(H32=\"r\",1,0)+IF(H49=\"r\",1,0)+IF(H66=\"r\",1,0)+IF(H83=\"r\",1,0)+IF(H100=\"r\",1,0)+IF(H117=\"r\",1,0))/4","v":0},0,0,0,0,0,0,0,0,0,0,0,0,0,0,0,0,0,0,0,0,0,0,0,0,0,0,0,0,0,0,0,0,0,0,0,0,0,0,0,0,0,0,0,0,0,0,0,0,0,{"$f":"SUM(BE151+BE152)","v":0}]
[null,null,null,"C",null,null,{"$f":"(IF(G15=\"c\",1,0)+IF(G32=\"c\",1,0)+IF(G49=\"c\",1,0)+IF(G66=\"c\",1,0)+IF(G83=\"c\",1,0)+IF(G100=\"c\",1,0)+IF(G117=\"c\",1,0))/4","v":0},{"$f":"(IF(H15=\"c\",1,0)+IF(H32=\"c\",1,0)+IF(H49=\"c\",1,0)+IF(H66=\"c\",1,0)+IF(H83=\"c\",1,0)+IF(H100=\"c\",1,0)+IF(H117=\"c\",1,0))/4","v":0},0,0,0,0,0,0,0,0,0,0,0,0,0,0,0,0,0,0,0,0,0,0,0,0,0,0,0,0,0,0,0,0,0,0,0,0,0,0,0,0,0,0,0,0,0,0,0,0,0]
[null,null,{"$f":"+C118","v":0},"R",null,null,{"$f":"(IF(G16=\"r\",1,0)+IF(G33=\"r\",1,0)+IF(G50=\"r\",1,0)+IF(G67=\"r\",1,0)+IF(G84=\"r\",1,0)+IF(G101=\"r\",1,0)+IF(G118=\"r\",1,0))/4","v":0},{"$f":"(IF(H16=\"r\",1,0)+IF(H33=\"r\",1,0)+IF(H50=\"r\",1,0)+IF(H67=\"r\",1,0)+IF(H84=\"r\",1,0)+IF(H101=\"r\",1,0)+IF(H118=\"r\",1,0))/4","v":0},0,0,0,0,0,0,0,0,0,0,0,0,0,0,0,0,0,0,0,0,0,0,0,0,0,0,0,0,0,0,0,0,0,0,0,0,0,0,0,0,0,0,0,0,0,0,0,0,0,0]
[null,null,null,"C",null,null,{"$f":"(IF(G16=\"c\",1,0)+IF(G33=\"c\",1,0)+IF(G50=\"c\",1,0)+IF(G67=\"c\",1,0)+IF(G84=\"c\",1,0)+IF(G101=\"c\",1,0)+IF(G118=\"c\",1,0))/4","v":0},{"$f":"(IF(H16=\"c\",1,0)+IF(H33=\"c\",1,0)+IF(H50=\"c\",1,0)+IF(H67=\"c\",1,0)+IF(H84=\"c\",1,0)+IF(H101=\"c\",1,0)+IF(H118=\"c\",1,0))/4","v":0},0,0,0,0,0,0,0,0,0,0,0,0,0,0,0,0,0,0,0,0,0,0,0,0,0,0,0,0,0,0,0,0,0,0,0,0,0,0,0,0,0,0,0,0,0,0,0,0,0]
[null,null,"SOUS-TOTAL","R",null,null,{"$f":"G127+G129+G131+G133+G135+G137+G139+G141+G143+G145+G147+G151+G153","v":{"$error":"#REF!"}},{"$f":"H127+H129+H131+H133+H135+H137+H139+H141+H143+H145+H147+H151+H153","v":{"$error":"#REF!"}},{"$error":"#REF!"},{"$error":"#REF!"},{"$error":"#REF!"},{"$error":"#REF!"},{"$error":"#REF!"},{"$error":"#REF!"},{"$error":"#REF!"},{"$error":"#REF!"},{"$error":"#REF!"},{"$error":"#REF!"},{"$error":"#REF!"},{"$error":"#REF!"},{"$error":"#REF!"},{"$error":"#REF!"},{"$error":"#REF!"},{"$error":"#REF!"},{"$error":"#REF!"},{"$error":"#REF!"},{"$error":"#REF!"},{"$error":"#REF!"},{"$error":"#REF!"},{"$error":"#REF!"},{"$error":"#REF!"},{"$error":"#REF!"},{"$error":"#REF!"},{"$error":"#REF!"},{"$error":"#REF!"},{"$error":"#REF!"},{"$error":"#REF!"},{"$error":"#REF!"},{"$error":"#REF!"},{"$error":"#REF!"},{"$error":"#REF!"},{"$error":"#REF!"},{"$error":"#REF!"},{"$error":"#REF!"},{"$error":"#REF!"},{"$error":"#REF!"},{"$error":"#REF!"},{"$error":"#REF!"},{"$error":"#REF!"},{"$error":"#REF!"},{"$error":"#REF!"},{"$error":"#REF!"},{"$error":"#REF!"},{"$error":"#REF!"},{"$error":"#REF!"},{"$error":"#REF!"},{"$error":"#REF!"},{"$error":"#REF!"}]
[null,null,null,"C",null,null,{"$f":"G128+G130+G132+G134+G136+G138+G140+G142+G144+G146+G148+G152+G150+G154","v":2.75},{"$f":"H128+H130+H132+H134+H136+H138+H140+H142+H144+H146+H148+H152+H150+H154","v":2.75},5.25,5.25,5.25,5.25,5.5,5.5,5.5,5.5,7.25,7.25,7.25,7.25,7.25,7.25,7.25,7.25,6.75,6.75,5.5,4.75,2.5,2.25,2,2,2.25,2.25,2.25,2.25,3.25,3.25,3.25,3,3,3,3,3,3,3,3,2.75,2,1.5,0.75,0.75,0.75,0.75,0,0,191]
[null,null,"TOTAL",null,{"$f":"SUM(E127:E147)","v":{"$error":"#REF!"}},{"$f":"+F155+F156","v":0},{"$f":"SUM(G127:G144)","v":{"$error":"#REF!"}},{"$f":"+H155+H156","v":{"$error":"#REF!"}},{"$error":"#REF!"},{"$error":"#REF!"},{"$error":"#REF!"},{"$error":"#REF!"},{"$error":"#REF!"},{"$error":"#REF!"},{"$error":"#REF!"},{"$error":"#REF!"},{"$error":"#REF!"},{"$error":"#REF!"},{"$error":"#REF!"},{"$error":"#REF!"},{"$error":"#REF!"},{"$error":"#REF!"},{"$error":"#REF!"},{"$error":"#REF!"},{"$error":"#REF!"},{"$error":"#REF!"},{"$error":"#REF!"},{"$error":"#REF!"},{"$error":"#REF!"},{"$error":"#REF!"},{"$error":"#REF!"},{"$error":"#REF!"},{"$error":"#REF!"},{"$error":"#REF!"},{"$error":"#REF!"},{"$error":"#REF!"},{"$error":"#REF!"},{"$error":"#REF!"},{"$error":"#REF!"},{"$error":"#REF!"},{"$error":"#REF!"},{"$error":"#REF!"},{"$error":"#REF!"},{"$error":"#REF!"},{"$error":"#REF!"},{"$error":"#REF!"},{"$error":"#REF!"},{"$error":"#REF!"},{"$error":"#REF!"},{"$error":"#REF!"},{"$error":"#REF!"},{"$error":"#REF!"},{"$error":"#REF!"},{"$error":"#REF!"},{"$error":"#REF!"},{"$error":"#REF!"},{"$f":"SUM(G157:BD157)","v":{"$error":"#REF!"}},{"$error":"#REF!"}]
[]
[]
[null,null,null,null,null,null,null,null,null,null,null,null,null,null,null,null,null,null,null,null,null,null,null,null,null,null,null,null,null,null,null,null,null,null,null,null,null,null,null,null,null,{"$f":"6.5+5.5+6.5+7.75+6.5+6.5","v":39.25}]

{"sheet":"horaires employés","index":5,"n_rows":26,"n_cols":36,"rows_kept":26,"cut":false,"hidden":false,"merged":[]}
[null,"Horaires employés semaine paire (sans samedi pm)"]
[null,"LUNDI",null,null,null,null,"MARDI",null,null,null,null,"MERCREDI",null,null,null,null,"JEUDI",null,null,null,null,"VENDREDI",null,null,null,null,"SAMEDI",null,null,null,null,"DIMANCHE"]
["Assiya",{"$f":"IFERROR(HLOOKUP(\"z^z\",OFFSET('semaine paire (sans samedi pm)'!$B$1, MATCH($A3,OFFSET('semaine paire (sans samedi pm)'!$B$1,MATCH(B$2,'semaine paire (sans samedi pm)'!$B$1:$B$120,0)-1,1,12,1),0)-1+MATCH(B$2,'semaine paire (sans samedi pm)'!$B$1:$B$120,0)-1,3,1,52),1,1),\"\")","v":"F"},{"$f":"IFERROR(OFFSET('semaine paire (sans samedi pm)'!$D$2,,MATCH(B3,OFFSET('semaine paire (sans samedi pm)'!$B$1, MATCH($A3,OFFSET('semaine paire (sans samedi pm)'!$B$1,MATCH(B$2,'semaine paire (sans samedi pm)'!$B$1:$B$120,0)-1,1,12,1),0)-1+MATCH(B$2,'semaine paire (sans samedi pm)'!$B$1:$B$120,0)-1,3,1,52),0)),\"\")","v":"6h30-6h45"},{"$f":"IF(C3<>\"\",VALUE(SUBSTITUTE(LEFT(C3,FIND(\"-\",C3)-1),\"h\",\":\")),\"\")","v":"06:30:00"},{"$f":"IFERROR(OFFSET('semaine paire (sans samedi pm)'!$D$2,,MATCH(\"z^z\",OFFSET('semaine paire (sans samedi pm)'!$B$1, MATCH($A3,OFFSET('semaine paire (sans samedi pm)'!$B$1,MATCH(B$2,'semaine paire (sans samedi pm)'!$B$1:$B$120,0)-1,1,12,1),0)-1+MATCH(B$2,'semaine paire (sans samedi pm)'!$B$1:$B$120,0)-1,3,1,52), 1)),\"\")","v":"12h30-12H45"},{"$f":"IF(E3<>\"\",VALUE(SUBSTITUTE(MID(E3,FIND(\"-\",E3)+1,10),\"H\",\":\")),\"\")","v":"12:45:00"},{"$f":"IFERROR(HLOOKUP(\"z^z\",OFFSET('semaine paire (sans samedi pm)'!$B$1, MATCH($A3,OFFSET('semaine paire (sans samedi pm)'!$B$1,MATCH(G$2,'semaine paire (sans samedi pm)'!$B$1:$B$120,0)-1,1,12,1),0)-1+MATCH(G$2,'semaine paire (sans samedi pm)'!$B$1:$B$120,0)-1,3,1,52),1,1),\"\")","v":"F"},{"$f":"IFERROR(OFFSET('semaine paire (sans samedi pm)'!$D$2,,MATCH(G3,OFFSET('semaine paire (sans samedi pm)'!$B$1, MATCH($A3,OFFSET('semaine paire (sans samedi pm)'!$B$1,MATCH(G$2,'semaine paire (sans samedi pm)'!$B$1:$B$120,0)-1,1,12,1),0)-1+MATCH(G$2,'semaine paire (sans samedi pm)'!$B$1:$B$120,0)-1,3,1,52),0)),\"\")","v":"6h30-6h45"},{"$f":"IF(H3<>\"\",LEFT(H3,FIND(\"-\",H3)-1),\"\")","v":"6h30"},{"$f":"IFERROR(OFFSET('semaine paire (sans samedi pm)'!$D$2,,MATCH(\"z^z\",OFFSET('semaine paire (sans samedi pm)'!$B$1, MATCH($A3,OFFSET('semaine paire (sans samedi pm)'!$B$1,MATCH(G$2,'semaine paire (sans samedi pm)'!$B$1:$B$120,0)-1,1,12,1),0)-1+MATCH(G$2,'semaine paire (sans samedi pm)'!$B$1:$B$120,0)-1,3,1,52), 1)),\"\")","v":"11h45-12H"},{"$f":"IF(J3<>\"\",MID(J3,FIND(\"-\",J3)+1,10),\"\")","v":"12H"},{"$f":"IFERROR(HLOOKUP(\"z^z\",OFFSET('semaine paire (sans samedi pm)'!$B$1, MATCH($A3,OFFSET('semaine paire (sans samedi pm)'!$B$1,MATCH(L$2,'semaine paire (sans samedi pm)'!$B$1:$B$120,0)-1,1,12,1),0)-1+MATCH(L$2,'semaine paire (sans samedi pm)'!$B$1:$B$120,0)-1,3,1,52),1,1),\"\")","v":"F"},{"$f":"IFERROR(OFFSET('semaine paire (sans samedi pm)'!$D$2,,MATCH(L3,OFFSET('semaine paire (sans samedi pm)'!$B$1, MATCH($A3,OFFSET('semaine paire (sans samedi pm)'!$B$1,MATCH(L$2,'semaine paire (sans samedi pm)'!$B$1:$B$120,0)-1,1,12,1),0)-1+MATCH(L$2,'semaine paire (sans samedi pm)'!$B$1:$B$120,0)-1,3,1,52),0)),\"\")","v":"6h30-6h45"},{"$f":"IF(M3<>\"\",LEFT(M3,FIND(\"-\",M3)-1),\"\")","v":"6h30"},{"$f":"IFERROR(OFFSET('semaine paire (sans samedi pm)'!$D$2,,MATCH(\"z^z\",OFFSET('semaine paire (sans samedi pm)'!$B$1, MATCH($A3,OFFSET('semaine paire (sans samedi pm)'!$B$1,MATCH(L$2,'semaine paire (sans samedi pm)'!$B$1:$B$120,0)-1,1,12,1),0)-1+MATCH(L$2,'semaine paire (sans samedi pm)'!$B$1:$B$120,0)-1,3,1,52), 1)),\"\")","v":"11h15-11H30"},{"$f":"IF(O3<>\"\",MID(O3,FIND(\"-\",O3)+1,10),\"\")","v":"11H30"},{"$f":"IFERROR(HLOOKUP(\"z^z\",OFFSET('semaine paire (sans samedi pm)'!$B$1, MATCH($A3,OFFSET('semaine paire (sans samedi pm)'!$B$1,MATCH(Q$2,'semaine paire (sans samedi pm)'!$B$1:$B$120,0)-1,1,12,1),0)-1+MATCH(Q$2,'semaine paire (sans samedi pm)'!$B$1:$B$120,0)-1,3,1,52),1,1),\"\")","v":"F"},{"$f":"IFERROR(OFFSET('semaine paire (sans samedi pm)'!$D$2,,MATCH(Q3,OFFSET('semaine paire (sans samedi pm)'!$B$1, MATCH($A3,OFFSET('semaine paire (sans samedi pm)'!$B$1,MATCH(Q$2,'semaine paire (sans samedi pm)'!$B$1:$B$120,0)-1,1,12,1),0)-1+MATCH(Q$2,'semaine paire (sans samedi pm)'!$B$1:$B$120,0)-1,3,1,52),0)),\"\")","v":"6h30-6h45"},{"$f":"IF(R3<>\"\",LEFT(R3,FIND(\"-\",R3)-1),\"\")","v":"6h30"},{"$f":"IFERROR(OFFSET('semaine paire (sans samedi pm)'!$D$2,,MATCH(\"z^z\",OFFSET('semaine paire (sans samedi pm)'!$B$1, MATCH($A3,OFFSET('semaine paire (sans samedi pm)'!$B$1,MATCH(Q$2,'semaine paire (sans samedi pm)'!$B$1:$B$120,0)-1,1,12,1),0)-1+MATCH(Q$2,'semaine paire (sans samedi pm)'!$B$1:$B$120,0)-1,3,1,52), 1)),\"\")","v":"12h45-13H"},{"$f":"IF(T3<>\"\",MID(T3,FIND(\"-\",T3)+1,10),\"\")","v":"13H"},{"$f":"IFERROR(HLOOKUP(\"z^z\",OFFSET('semaine paire (sans samedi pm)'!$B$1, MATCH($A3,OFFSET('semaine paire (sans samedi pm)'!$B$1,MATCH(V$2,'semaine paire (sans samedi pm)'!$B$1:$B$120,0)-1,1,12,1),0)-1+MATCH(V$2,'semaine paire (sans samedi pm)'!$B$1:$B$120,0)-1,3,1,52),1,1),\"\")","v":"F"},{"$f":"IFERROR(OFFSET('semaine paire (sans samedi pm)'!$D$2,,MATCH(V3,OFFSET('semaine paire (sans samedi pm)'!$B$1, MATCH($A3,OFFSET('semaine paire (sans samedi pm)'!$B$1,MATCH(V$2,'semaine paire (sans samedi pm)'!$B$1:$B$120,0)-1,1,12,1),0)-1+MATCH(V$2,'semaine paire (sans samedi pm)'!$B$1:$B$120,0)-1,3,1,52),0)),\"\")","v":"6h30-6h45"},{"$f":"IF(W3<>\"\",LEFT(W3,FIND(\"-\",W3)-1),\"\")","v":"6h30"},{"$f":"IFERROR(OFFSET('semaine paire (sans samedi pm)'!$D$2,,MATCH(\"z^z\",OFFSET('semaine paire (sans samedi pm)'!$B$1, MATCH($A3,OFFSET('semaine paire (sans samedi pm)'!$B$1,MATCH(V$2,'semaine paire (sans samedi pm)'!$B$1:$B$120,0)-1,1,12,1),0)-1+MATCH(V$2,'semaine paire (sans samedi pm)'!$B$1:$B$120,0)-1,3,1,52), 1)),\"\")","v":"16h45-17h"},{"$f":"IF(Y3<>\"\",MID(Y3,FIND(\"-\",Y3)+1,10),\"\")","v":"17h"},{"$f":"IFERROR(HLOOKUP(\"z^z\",OFFSET('semaine paire (sans samedi pm)'!$B$1, MATCH($A3,OFFSET('semaine paire (sans samedi pm)'!$B$1,MATCH(AA$2,'semaine paire (sans samedi pm)'!$B$1:$B$120,0)-1,1,12,1),0)-1+MATCH(AA$2,'semaine paire (sans samedi pm)'!$B$1:$B$120,0)-1,3,1,52),1,1),\"\")","v":"F"},{"$f":"IFERROR(OFFSET('semaine paire (sans samedi pm)'!$D$2,,MATCH(AA3,OFFSET('semaine paire (sans samedi pm)'!$B$1, MATCH($A3,OFFSET('semaine paire (sans samedi pm)'!$B$1,MATCH(AA$2,'semaine paire (sans samedi pm)'!$B$1:$B$120,0)-1,1,12,1),0)-1+MATCH(AA$2,'semaine paire (sans samedi pm)'!$B$1:$B$120,0)-1,3,1,52),0)),\"\")","v":"6h30-6h45"},{"$f":"IF(AB3<>\"\",LEFT(AB3,FIND(\"-\",AB3)-1),\"\")","v":"6h30"},{"$f":"IFERROR(OFFSET('semaine paire (sans samedi pm)'!$D$2,,MATCH(\"z^z\",OFFSET('semaine paire (sans samedi pm)'!$B$1, MATCH($A3,OFFSET('semaine paire (sans samedi pm)'!$B$1,MATCH(AA$2,'semaine paire (sans samedi pm)'!$B$1:$B$120,0)-1,1,12,1),0)-1+MATCH(AA$2,'semaine paire (sans samedi pm)'!$B$1:$B$120,0)-1,3,1,52), 1)),\"\")","v":"12h15-12H30"},{"$f":"IF(AD3<>\"\",MID(AD3,FIND(\"-\",AD3)+1,10),\"\")","v":"12H30"},{"$f":"IFERROR(HLOOKUP(\"z^z\",OFFSET('semaine paire (sans samedi pm)'!$B$1, MATCH($A3,OFFSET('semaine paire (sans samedi pm)'!$B$1,MATCH(AF$2,'semaine paire (sans samedi pm)'!$B$1:$B$120,0)-1,1,12,1),0)-1+MATCH(AF$2,'semaine paire (sans samedi pm)'!$B$1:$B$120,0)-1,3,1,52),1,1),\"\")","v":""},{"$f":"IFERROR(OFFSET('semaine paire (sans samedi pm)'!$D$2,,MATCH(AF3,OFFSET('semaine paire (sans samedi pm)'!$B$1, MATCH($A3,OFFSET('semaine paire (sans samedi pm)'!$B$1,MATCH(AF$2,'semaine paire (sans samedi pm)'!$B$1:$B$120,0)-1,1,12,1),0)-1+MATCH(AF$2,'semaine paire (sans samedi pm)'!$B$1:$B$120,0)-1,3,1,52),0)),\"\")","v":""},{"$f":"IF(AG3<>\"\",LEFT(AG3,FIND(\"-\",AG3)-1),\"\")","v":""},{"$f":"IFERROR(OFFSET('semaine paire (sans samedi pm)'!$D$2,,MATCH(\"z^z\",OFFSET('semaine paire (sans samedi pm)'!$B$1, MATCH($A3,OFFSET('semaine paire (sans samedi pm)'!$B$1,MATCH(AF$2,'semaine paire (sans samedi pm)'!$B$1:$B$120,0)-1,1,12,1),0)-1+MATCH(AF$2,'semaine paire (sans samedi pm)'!$B$1:$B$120,0)-1,3,1,52), 1)),\"\")","v":""},{"$f":"IF(AI3<>\"\",MID(AI3,FIND(\"-\",AI3)+1,10),\"\")","v":""}]
["Aurore",{"$f":"IFERROR(HLOOKUP(\"z^z\",OFFSET('semaine paire (sans samedi pm)'!$B$1, MATCH($A4,OFFSET('semaine paire (sans samedi pm)'!$B$1,MATCH(B$2,'semaine paire (sans samedi pm)'!$B$1:$B$120,0)-1,1,12,1),0)-1+MATCH(B$2,'semaine paire (sans samedi pm)'!$B$1:$B$120,0)-1,3,1,52),1,1),\"\")","v":"S"},{"$f":"IFERROR(OFFSET('semaine paire (sans samedi pm)'!$D$2,,MATCH(B4,OFFSET('semaine paire (sans samedi pm)'!$B$1, MATCH($A4,OFFSET('semaine paire (sans samedi pm)'!$B$1,MATCH(B$2,'semaine paire (sans samedi pm)'!$B$1:$B$120,0)-1,1,12,1),0)-1+MATCH(B$2,'semaine paire (sans samedi pm)'!$B$1:$B$120,0)-1,3,1,52),0)),\"\")","v":"7h-7h15"},{"$f":"IF(C4<>\"\",VALUE(SUBSTITUTE(LEFT(C4,FIND(\"-\",C4)-1),\"h\",\":\")),\"\")","v":"07:00:00"},{"$f":"IFERROR(OFFSET('semaine paire (sans samedi pm)'!$D$2,,MATCH(\"z^z\",OFFSET('semaine paire (sans samedi pm)'!$B$1, MATCH($A4,OFFSET('semaine paire (sans samedi pm)'!$B$1,MATCH(B$2,'semaine paire (sans samedi pm)'!$B$1:$B$120,0)-1,1,12,1),0)-1+MATCH(B$2,'semaine paire (sans samedi pm)'!$B$1:$B$120,0)-1,3,1,52), 1)),\"\")","v":"12h45-13H"},{"$f":"IF(E4<>\"\",VALUE(SUBSTITUTE(MID(E4,FIND(\"-\",E4)+1,10),\"H\",\":\")),\"\")","v":"13:00:00"},{"$f":"IFERROR(HLOOKUP(\"z^z\",OFFSET('semaine paire (sans samedi pm)'!$B$1, MATCH($A4,OFFSET('semaine paire (sans samedi pm)'!$B$1,MATCH(G$2,'semaine paire (sans samedi pm)'!$B$1:$B$120,0)-1,1,12,1),0)-1+MATCH(G$2,'semaine paire (sans samedi pm)'!$B$1:$B$120,0)-1,3,1,52),1,1),\"\")","v":"S"},{"$f":"IFERROR(OFFSET('semaine paire (sans samedi pm)'!$D$2,,MATCH(G4,OFFSET('semaine paire (sans samedi pm)'!$B$1, MATCH($A4,OFFSET('semaine paire (sans samedi pm)'!$B$1,MATCH(G$2,'semaine paire (sans samedi pm)'!$B$1:$B$120,0)-1,1,12,1),0)-1+MATCH(G$2,'semaine paire (sans samedi pm)'!$B$1:$B$120,0)-1,3,1,52),0)),\"\")","v":"7h-7h15"},{"$f":"IF(H4<>\"\",LEFT(H4,FIND(\"-\",H4)-1),\"\")","v":"7h"},{"$f":"IFERROR(OFFSET('semaine paire (sans samedi pm)'!$D$2,,MATCH(\"z^z\",OFFSET('semaine paire (sans samedi pm)'!$B$1, MATCH($A4,OFFSET('semaine paire (sans samedi pm)'!$B$1,MATCH(G$2,'semaine paire (sans samedi pm)'!$B$1:$B$120,0)-1,1,12,1),0)-1+MATCH(G$2,'semaine paire (sans samedi pm)'!$B$1:$B$120,0)-1,3,1,52), 1)),\"\")","v":"11h45-12H"},{"$f":"IF(J4<>\"\",MID(J4,FIND(\"-\",J4)+1,10),\"\")","v":"12H"},{"$f":"IFERROR(HLOOKUP(\"z^z\",OFFSET('semaine paire (sans samedi pm)'!$B$1, MATCH($A4,OFFSET('semaine paire (sans samedi pm)'!$B$1,MATCH(L$2,'semaine paire (sans samedi pm)'!$B$1:$B$120,0)-1,1,12,1),0)-1+MATCH(L$2,'semaine paire (sans samedi pm)'!$B$1:$B$120,0)-1,3,1,52),1,1),\"\")","v":"S"},{"$f":"IFERROR(OFFSET('semaine paire (sans samedi pm)'!$D$2,,MATCH(L4,OFFSET('semaine paire (sans samedi pm)'!$B$1, MATCH($A4,OFFSET('semaine paire (sans samedi pm)'!$B$1,MATCH(L$2,'semaine paire (sans samedi pm)'!$B$1:$B$120,0)-1,1,12,1),0)-1+MATCH(L$2,'semaine paire (sans samedi pm)'!$B$1:$B$120,0)-1,3,1,52),0)),\"\")","v":"7h-7h15"},{"$f":"IF(M4<>\"\",LEFT(M4,FIND(\"-\",M4)-1),\"\")","v":"7h"},{"$f":"IFERROR(OFFSET('semaine paire (sans samedi pm)'!$D$2,,MATCH(\"z^z\",OFFSET('semaine paire (sans samedi pm)'!$B$1, MATCH($A4,OFFSET('semaine paire (sans samedi pm)'!$B$1,MATCH(L$2,'semaine paire (sans samedi pm)'!$B$1:$B$120,0)-1,1,12,1),0)-1+MATCH(L$2,'semaine paire (sans samedi pm)'!$B$1:$B$120,0)-1,3,1,52), 1)),\"\")","v":"9h45-10H"},{"$f":"IF(O4<>\"\",MID(O4,FIND(\"-\",O4)+1,10),\"\")","v":"10H"},{"$f":"IFERROR(HLOOKUP(\"z^z\",OFFSET('semaine paire (sans samedi pm)'!$B$1, MATCH($A4,OFFSET('semaine paire (sans samedi pm)'!$B$1,MATCH(Q$2,'semaine paire (sans samedi pm)'!$B$1:$B$120,0)-1,1,12,1),0)-1+MATCH(Q$2,'semaine paire (sans samedi pm)'!$B$1:$B$120,0)-1,3,1,52),1,1),\"\")","v":"S"},{"$f":"IFERROR(OFFSET('semaine paire (sans samedi pm)'!$D$2,,MATCH(Q4,OFFSET('semaine paire (sans samedi pm)'!$B$1, MATCH($A4,OFFSET('semaine paire (sans samedi pm)'!$B$1,MATCH(Q$2,'semaine paire (sans samedi pm)'!$B$1:$B$120,0)-1,1,12,1),0)-1+MATCH(Q$2,'semaine paire (sans samedi pm)'!$B$1:$B$120,0)-1,3,1,52),0)),\"\")","v":"7h-7h15"},{"$f":"IF(R4<>\"\",LEFT(R4,FIND(\"-\",R4)-1),\"\")","v":"7h"},{"$f":"IFERROR(OFFSET('semaine paire (sans samedi pm)'!$D$2,,MATCH(\"z^z\",OFFSET('semaine paire (sans samedi pm)'!$B$1, MATCH($A4,OFFSET('semaine paire (sans samedi pm)'!$B$1,MATCH(Q$2,'semaine paire (sans samedi pm)'!$B$1:$B$120,0)-1,1,12,1),0)-1+MATCH(Q$2,'semaine paire (sans samedi pm)'!$B$1:$B$120,0)-1,3,1,52), 1)),\"\")","v":"12h45-13H"},{"$f":"IF(T4<>\"\",MID(T4,FIND(\"-\",T4)+1,10),\"\")","v":"13H"},{"$f":"IFERROR(HLOOKUP(\"z^z\",OFFSET('semaine paire (sans samedi pm)'!$B$1, MATCH($A4,OFFSET('semaine paire (sans samedi pm)'!$B$1,MATCH(V$2,'semaine paire (sans samedi pm)'!$B$1:$B$120,0)-1,1,12,1),0)-1+MATCH(V$2,'semaine paire (sans samedi pm)'!$B$1:$B$120,0)-1,3,1,52),1,1),\"\")","v":"S"},{"$f":"IFERROR(OFFSET('semaine paire (sans samedi pm)'!$D$2,,MATCH(V4,OFFSET('semaine paire (sans samedi pm)'!$B$1, MATCH($A4,OFFSET('semaine paire (sans samedi pm)'!$B$1,MATCH(V$2,'semaine paire (sans samedi pm)'!$B$1:$B$120,0)-1,1,12,1),0)-1+MATCH(V$2,'semaine paire (sans samedi pm)'!$B$1:$B$120,0)-1,3,1,52),0)),\"\")","v":"7h-7h15"},{"$f":"IF(W4<>\"\",LEFT(W4,FIND(\"-\",W4)-1),\"\")","v":"7h"},{"$f":"IFERROR(OFFSET('semaine paire (sans samedi pm)'!$D$2,,MATCH(\"z^z\",OFFSET('semaine paire (sans samedi pm)'!$B$1, MATCH($A4,OFFSET('semaine paire (sans samedi pm)'!$B$1,MATCH(V$2,'semaine paire (sans samedi pm)'!$B$1:$B$120,0)-1,1,12,1),0)-1+MATCH(V$2,'semaine paire (sans samedi pm)'!$B$1:$B$120,0)-1,3,1,52), 1)),\"\")","v":"11h45-12H"},{"$f":"IF(Y4<>\"\",MID(Y4,FIND(\"-\",Y4)+1,10),\"\")","v":"12H"},{"$f":"IFERROR(HLOOKUP(\"z^z\",OFFSET('semaine paire (sans samedi pm)'!$B$1, MATCH($A4,OFFSET('semaine paire (sans samedi pm)'!$B$1,MATCH(AA$2,'semaine paire (sans samedi pm)'!$B$1:$B$120,0)-1,1,12,1),0)-1+MATCH(AA$2,'semaine paire (sans samedi pm)'!$B$1:$B$120,0)-1,3,1,52),1,1),\"\")","v":"B"},{"$f":"IFERROR(OFFSET('semaine paire (sans samedi pm)'!$D$2,,MATCH(AA4,OFFSET('semaine paire (sans samedi pm)'!$B$1, MATCH($A4,OFFSET('semaine paire (sans samedi pm)'!$B$1,MATCH(AA$2,'semaine paire (sans samedi pm)'!$B$1:$B$120,0)-1,1,12,1),0)-1+MATCH(AA$2,'semaine paire (sans samedi pm)'!$B$1:$B$120,0)-1,3,1,52),0)),\"\")","v":"15H-15H15"},{"$f":"IF(AB4<>\"\",LEFT(AB4,FIND(\"-\",AB4)-1),\"\")","v":"15H"},{"$f":"IFERROR(OFFSET('semaine paire (sans samedi pm)'!$D$2,,MATCH(\"z^z\",OFFSET('semaine paire (sans samedi pm)'!$B$1, MATCH($A4,OFFSET('semaine paire (sans samedi pm)'!$B$1,MATCH(AA$2,'semaine paire (sans samedi pm)'!$B$1:$B$120,0)-1,1,12,1),0)-1+MATCH(AA$2,'semaine paire (sans samedi pm)'!$B$1:$B$120,0)-1,3,1,52), 1)),\"\")","v":"17h45-18H"},{"$f":"IF(AD4<>\"\",MID(AD4,FIND(\"-\",AD4)+1,10),\"\")","v":"18H"},{"$f":"IFERROR(HLOOKUP(\"z^z\",OFFSET('semaine paire (sans samedi pm)'!$B$1, MATCH($A4,OFFSET('semaine paire (sans samedi pm)'!$B$1,MATCH(AF$2,'semaine paire (sans samedi pm)'!$B$1:$B$120,0)-1,1,12,1),0)-1+MATCH(AF$2,'semaine paire (sans samedi pm)'!$B$1:$B$120,0)-1,3,1,52),1,1),\"\")","v":""},{"$f":"IFERROR(OFFSET('semaine paire (sans samedi pm)'!$D$2,,MATCH(AF4,OFFSET('semaine paire (sans samedi pm)'!$B$1, MATCH($A4,OFFSET('semaine paire (sans samedi pm)'!$B$1,MATCH(AF$2,'semaine paire (sans samedi pm)'!$B$1:$B$120,0)-1,1,12,1),0)-1+MATCH(AF$2,'semaine paire (sans samedi pm)'!$B$1:$B$120,0)-1,3,1,52),0)),\"\")","v":""},{"$f":"IF(AG4<>\"\",LEFT(AG4,FIND(\"-\",AG4)-1),\"\")","v":""},{"$f":"IFERROR(OFFSET('semaine paire (sans samedi pm)'!$D$2,,MATCH(\"z^z\",OFFSET('semaine paire (sans samedi pm)'!$B$1, MATCH($A4,OFFSET('semaine paire (sans samedi pm)'!$B$1,MATCH(AF$2,'semaine paire (sans samedi pm)'!$B$1:$B$120,0)-1,1,12,1),0)-1+MATCH(AF$2,'semaine paire (sans samedi pm)'!$B$1:$B$120,0)-1,3,1,52), 1)),\"\")","v":""},{"$f":"IF(AI4<>\"\",MID(AI4,FIND(\"-\",AI4)+1,10),\"\")","v":""}]
["Bertrand",{"$f":"IFERROR(HLOOKUP(\"z^z\",OFFSET('semaine paire (sans samedi pm)'!$B$1, MATCH($A5,OFFSET('semaine paire (sans samedi pm)'!$B$1,MATCH(B$2,'semaine paire (sans samedi pm)'!$B$1:$B$120,0)-1,1,12,1),0)-1+MATCH(B$2,'semaine paire (sans samedi pm)'!$B$1:$B$120,0)-1,3,1,52),1,1),\"\")","v":"S"},{"$f":"IFERROR(OFFSET('semaine paire (sans samedi pm)'!$D$2,,MATCH(B5,OFFSET('semaine paire (sans samedi pm)'!$B$1, MATCH($A5,OFFSET('semaine paire (sans samedi pm)'!$B$1,MATCH(B$2,'semaine paire (sans samedi pm)'!$B$1:$B$120,0)-1,1,12,1),0)-1+MATCH(B$2,'semaine paire (sans samedi pm)'!$B$1:$B$120,0)-1,3,1,52),0)),\"\")","v":"9h30-9H45"},"09:30:00",{"$f":"IFERROR(OFFSET('semaine paire (sans samedi pm)'!$D$2,,MATCH(\"z^z\",OFFSET('semaine paire (sans samedi pm)'!$B$1, MATCH($A5,OFFSET('semaine paire (sans samedi pm)'!$B$1,MATCH(B$2,'semaine paire (sans samedi pm)'!$B$1:$B$120,0)-1,1,12,1),0)-1+MATCH(B$2,'semaine paire (sans samedi pm)'!$B$1:$B$120,0)-1,3,1,52), 1)),\"\")","v":"13H45-14H"},"14:00:00",{"$f":"IFERROR(HLOOKUP(\"z^z\",OFFSET('semaine paire (sans samedi pm)'!$B$1, MATCH($A5,OFFSET('semaine paire (sans samedi pm)'!$B$1,MATCH(G$2,'semaine paire (sans samedi pm)'!$B$1:$B$120,0)-1,1,12,1),0)-1+MATCH(G$2,'semaine paire (sans samedi pm)'!$B$1:$B$120,0)-1,3,1,52),1,1),\"\")","v":""},{"$f":"IFERROR(OFFSET('semaine paire (sans samedi pm)'!$D$2,,MATCH(G5,OFFSET('semaine paire (sans samedi pm)'!$B$1, MATCH($A5,OFFSET('semaine paire (sans samedi pm)'!$B$1,MATCH(G$2,'semaine paire (sans samedi pm)'!$B$1:$B$120,0)-1,1,12,1),0)-1+MATCH(G$2,'semaine paire (sans samedi pm)'!$B$1:$B$120,0)-1,3,1,52),0)),\"\")","v":""},"",{"$f":"IFERROR(OFFSET('semaine paire (sans samedi pm)'!$D$2,,MATCH(\"z^z\",OFFSET('semaine paire (sans samedi pm)'!$B$1, MATCH($A5,OFFSET('semaine paire (sans samedi pm)'!$B$1,MATCH(G$2,'semaine paire (sans samedi pm)'!$B$1:$B$120,0)-1,1,12,1),0)-1+MATCH(G$2,'semaine paire (sans samedi pm)'!$B$1:$B$120,0)-1,3,1,52), 1)),\"\")","v":""},"",{"$f":"IFERROR(HLOOKUP(\"z^z\",OFFSET('semaine paire (sans samedi pm)'!$B$1, MATCH($A5,OFFSET('semaine paire (sans samedi pm)'!$B$1,MATCH(L$2,'semaine paire (sans samedi pm)'!$B$1:$B$120,0)-1,1,12,1),0)-1+MATCH(L$2,'semaine paire (sans samedi pm)'!$B$1:$B$120,0)-1,3,1,52),1,1),\"\")","v":"S"},{"$f":"IFERROR(OFFSET('semaine paire (sans samedi pm)'!$D$2,,MATCH(L5,OFFSET('semaine paire (sans samedi pm)'!$B$1, MATCH($A5,OFFSET('semaine paire (sans samedi pm)'!$B$1,MATCH(L$2,'semaine paire (sans samedi pm)'!$B$1:$B$120,0)-1,1,12,1),0)-1+MATCH(L$2,'semaine paire (sans samedi pm)'!$B$1:$B$120,0)-1,3,1,52),0)),\"\")","v":"14H-14H15"},"14H",{"$f":"IFERROR(OFFSET('semaine paire (sans samedi pm)'!$D$2,,MATCH(\"z^z\",OFFSET('semaine paire (sans samedi pm)'!$B$1, MATCH($A5,OFFSET('semaine paire (sans samedi pm)'!$B$1,MATCH(L$2,'semaine paire (sans samedi pm)'!$B$1:$B$120,0)-1,1,12,1),0)-1+MATCH(L$2,'semaine paire (sans samedi pm)'!$B$1:$B$120,0)-1,3,1,52), 1)),\"\")","v":"17h15-17h30"},"17h30",{"$f":"IFERROR(HLOOKUP(\"z^z\",OFFSET('semaine paire (sans samedi pm)'!$B$1, MATCH($A5,OFFSET('semaine paire (sans samedi pm)'!$B$1,MATCH(Q$2,'semaine paire (sans samedi pm)'!$B$1:$B$120,0)-1,1,12,1),0)-1+MATCH(Q$2,'semaine paire (sans samedi pm)'!$B$1:$B$120,0)-1,3,1,52),1,1),\"\")","v":"S"},{"$f":"IFERROR(OFFSET('semaine paire (sans samedi pm)'!$D$2,,MATCH(Q5,OFFSET('semaine paire (sans samedi pm)'!$B$1, MATCH($A5,OFFSET('semaine paire (sans samedi pm)'!$B$1,MATCH(Q$2,'semaine paire (sans samedi pm)'!$B$1:$B$120,0)-1,1,12,1),0)-1+MATCH(Q$2,'semaine paire (sans samedi pm)'!$B$1:$B$120,0)-1,3,1,52),0)),\"\")","v":"9h30-9H45"},"9h30",{"$f":"IFERROR(OFFSET('semaine paire (sans samedi pm)'!$D$2,,MATCH(\"z^z\",OFFSET('semaine paire (sans samedi pm)'!$B$1, MATCH($A5,OFFSET('semaine paire (sans samedi pm)'!$B$1,MATCH(Q$2,'semaine paire (sans samedi pm)'!$B$1:$B$120,0)-1,1,12,1),0)-1+MATCH(Q$2,'semaine paire (sans samedi pm)'!$B$1:$B$120,0)-1,3,1,52), 1)),\"\")","v":"13H45-14H"},"14H",{"$f":"IFERROR(HLOOKUP(\"z^z\",OFFSET('semaine paire (sans samedi pm)'!$B$1, MATCH($A5,OFFSET('semaine paire (sans samedi pm)'!$B$1,MATCH(V$2,'semaine paire (sans samedi pm)'!$B$1:$B$120,0)-1,1,12,1),0)-1+MATCH(V$2,'semaine paire (sans samedi pm)'!$B$1:$B$120,0)-1,3,1,52),1,1),\"\")","v":"S"},{"$f":"IFERROR(OFFSET('semaine paire (sans samedi pm)'!$D$2,,MATCH(V5,OFFSET('semaine paire (sans samedi pm)'!$B$1, MATCH($A5,OFFSET('semaine paire (sans samedi pm)'!$B$1,MATCH(V$2,'semaine paire (sans samedi pm)'!$B$1:$B$120,0)-1,1,12,1),0)-1+MATCH(V$2,'semaine paire (sans samedi pm)'!$B$1:$B$120,0)-1,3,1,52),0)),\"\")","v":"13h-13H15"},"13h",{"$f":"IFERROR(OFFSET('semaine paire (sans samedi pm)'!$D$2,,MATCH(\"z^z\",OFFSET('semaine paire (sans samedi pm)'!$B$1, MATCH($A5,OFFSET('semaine paire (sans samedi pm)'!$B$1,MATCH(V$2,'semaine paire (sans samedi pm)'!$B$1:$B$120,0)-1,1,12,1),0)-1+MATCH(V$2,'semaine paire (sans samedi pm)'!$B$1:$B$120,0)-1,3,1,52), 1)),\"\")","v":"17h15-17h30"},"17h30",{"$f":"IFERROR(HLOOKUP(\"z^z\",OFFSET('semaine paire (sans samedi pm)'!$B$1, MATCH($A5,OFFSET('semaine paire (sans samedi pm)'!$B$1,MATCH(AA$2,'semaine paire (sans samedi pm)'!$B$1:$B$120,0)-1,1,12,1),0)-1+MATCH(AA$2,'semaine paire (sans samedi pm)'!$B$1:$B$120,0)-1,3,1,52),1,1),\"\")","v":"S"},{"$f":"IFERROR(OFFSET('semaine paire (sans samedi pm)'!$D$2,,MATCH(AA5,OFFSET('semaine paire (sans samedi pm)'!$B$1, MATCH($A5,OFFSET('semaine paire (sans samedi pm)'!$B$1,MATCH(AA$2,'semaine paire (sans samedi pm)'!$B$1:$B$120,0)-1,1,12,1),0)-1+MATCH(AA$2,'semaine paire (sans samedi pm)'!$B$1:$B$120,0)-1,3,1,52),0)),\"\")","v":"9h30-9H45"},"9h30",{"$f":"IFERROR(OFFSET('semaine paire (sans samedi pm)'!$D$2,,MATCH(\"z^z\",OFFSET('semaine paire (sans samedi pm)'!$B$1, MATCH($A5,OFFSET('semaine paire (sans samedi pm)'!$B$1,MATCH(AA$2,'semaine paire (sans samedi pm)'!$B$1:$B$120,0)-1,1,12,1),0)-1+MATCH(AA$2,'semaine paire (sans samedi pm)'!$B$1:$B$120,0)-1,3,1,52), 1)),\"\")","v":"12h15-12H30"},"12H30",{"$f":"IFERROR(HLOOKUP(\"z^z\",OFFSET('semaine paire (sans samedi pm)'!$B$1, MATCH($A5,OFFSET('semaine paire (sans samedi pm)'!$B$1,MATCH(AF$2,'semaine paire (sans samedi pm)'!$B$1:$B$120,0)-1,1,12,1),0)-1+MATCH(AF$2,'semaine paire (sans samedi pm)'!$B$1:$B$120,0)-1,3,1,52),1,1),\"\")","v":""},{"$f":"IFERROR(OFFSET('semaine paire (sans samedi pm)'!$D$2,,MATCH(AF5,OFFSET('semaine paire (sans samedi pm)'!$B$1, MATCH($A5,OFFSET('semaine paire (sans samedi pm)'!$B$1,MATCH(AF$2,'semaine paire (sans samedi pm)'!$B$1:$B$120,0)-1,1,12,1),0)-1+MATCH(AF$2,'semaine paire (sans samedi pm)'!$B$1:$B$120,0)-1,3,1,52),0)),\"\")","v":""},"",{"$f":"IFERROR(OFFSET('semaine paire (sans samedi pm)'!$D$2,,MATCH(\"z^z\",OFFSET('semaine paire (sans samedi pm)'!$B$1, MATCH($A5,OFFSET('semaine paire (sans samedi pm)'!$B$1,MATCH(AF$2,'semaine paire (sans samedi pm)'!$B$1:$B$120,0)-1,1,12,1),0)-1+MATCH(AF$2,'semaine paire (sans samedi pm)'!$B$1:$B$120,0)-1,3,1,52), 1)),\"\")","v":""},""]
["Corinne",{"$f":"IFERROR(HLOOKUP(\"z^z\",OFFSET('semaine paire (sans samedi pm)'!$B$1, MATCH($A6,OFFSET('semaine paire (sans samedi pm)'!$B$1,MATCH(B$2,'semaine paire (sans samedi pm)'!$B$1:$B$120,0)-1,1,12,1),0)-1+MATCH(B$2,'semaine paire (sans samedi pm)'!$B$1:$B$120,0)-1,3,1,52),1,1),\"\")","v":"S"},{"$f":"IFERROR(OFFSET('semaine paire (sans samedi pm)'!$D$2,,MATCH(B6,OFFSET('semaine paire (sans samedi pm)'!$B$1, MATCH($A6,OFFSET('semaine paire (sans samedi pm)'!$B$1,MATCH(B$2,'semaine paire (sans samedi pm)'!$B$1:$B$120,0)-1,1,12,1),0)-1+MATCH(B$2,'semaine paire (sans samedi pm)'!$B$1:$B$120,0)-1,3,1,52),0)),\"\")","v":"7h-7h15"},"07:00:00",{"$f":"IFERROR(OFFSET('semaine paire (sans samedi pm)'!$D$2,,MATCH(\"z^z\",OFFSET('semaine paire (sans samedi pm)'!$B$1, MATCH($A6,OFFSET('semaine paire (sans samedi pm)'!$B$1,MATCH(B$2,'semaine paire (sans samedi pm)'!$B$1:$B$120,0)-1,1,12,1),0)-1+MATCH(B$2,'semaine paire (sans samedi pm)'!$B$1:$B$120,0)-1,3,1,52), 1)),\"\")","v":"13h15-13H30"},"13:30:00",{"$f":"IFERROR(HLOOKUP(\"z^z\",OFFSET('semaine paire (sans samedi pm)'!$B$1, MATCH($A6,OFFSET('semaine paire (sans samedi pm)'!$B$1,MATCH(G$2,'semaine paire (sans samedi pm)'!$B$1:$B$120,0)-1,1,12,1),0)-1+MATCH(G$2,'semaine paire (sans samedi pm)'!$B$1:$B$120,0)-1,3,1,52),1,1),\"\")","v":"S"},{"$f":"IFERROR(OFFSET('semaine paire (sans samedi pm)'!$D$2,,MATCH(G6,OFFSET('semaine paire (sans samedi pm)'!$B$1, MATCH($A6,OFFSET('semaine paire (sans samedi pm)'!$B$1,MATCH(G$2,'semaine paire (sans samedi pm)'!$B$1:$B$120,0)-1,1,12,1),0)-1+MATCH(G$2,'semaine paire (sans samedi pm)'!$B$1:$B$120,0)-1,3,1,52),0)),\"\")","v":"7h-7h15"},"7h",{"$f":"IFERROR(OFFSET('semaine paire (sans samedi pm)'!$D$2,,MATCH(\"z^z\",OFFSET('semaine paire (sans samedi pm)'!$B$1, MATCH($A6,OFFSET('semaine paire (sans samedi pm)'!$B$1,MATCH(G$2,'semaine paire (sans samedi pm)'!$B$1:$B$120,0)-1,1,12,1),0)-1+MATCH(G$2,'semaine paire (sans samedi pm)'!$B$1:$B$120,0)-1,3,1,52), 1)),\"\")","v":"17h45-18H"},"18H",{"$f":"IFERROR(HLOOKUP(\"z^z\",OFFSET('semaine paire (sans samedi pm)'!$B$1, MATCH($A6,OFFSET('semaine paire (sans samedi pm)'!$B$1,MATCH(L$2,'semaine paire (sans samedi pm)'!$B$1:$B$120,0)-1,1,12,1),0)-1+MATCH(L$2,'semaine paire (sans samedi pm)'!$B$1:$B$120,0)-1,3,1,52),1,1),\"\")","v":"S"},{"$f":"IFERROR(OFFSET('semaine paire (sans samedi pm)'!$D$2,,MATCH(L6,OFFSET('semaine paire (sans samedi pm)'!$B$1, MATCH($A6,OFFSET('semaine paire (sans samedi pm)'!$B$1,MATCH(L$2,'semaine paire (sans samedi pm)'!$B$1:$B$120,0)-1,1,12,1),0)-1+MATCH(L$2,'semaine paire (sans samedi pm)'!$B$1:$B$120,0)-1,3,1,52),0)),\"\")","v":"7h30-7h45"},"7h30",{"$f":"IFERROR(OFFSET('semaine paire (sans samedi pm)'!$D$2,,MATCH(\"z^z\",OFFSET('semaine paire (sans samedi pm)'!$B$1, MATCH($A6,OFFSET('semaine paire (sans samedi pm)'!$B$1,MATCH(L$2,'semaine paire (sans samedi pm)'!$B$1:$B$120,0)-1,1,12,1),0)-1+MATCH(L$2,'semaine paire (sans samedi pm)'!$B$1:$B$120,0)-1,3,1,52), 1)),\"\")","v":"11h45-12H"},"12H",{"$f":"IFERROR(HLOOKUP(\"z^z\",OFFSET('semaine paire (sans samedi pm)'!$B$1, MATCH($A6,OFFSET('semaine paire (sans samedi pm)'!$B$1,MATCH(Q$2,'semaine paire (sans samedi pm)'!$B$1:$B$120,0)-1,1,12,1),0)-1+MATCH(Q$2,'semaine paire (sans samedi pm)'!$B$1:$B$120,0)-1,3,1,52),1,1),\"\")","v":"S"},{"$f":"IFERROR(OFFSET('semaine paire (sans samedi pm)'!$D$2,,MATCH(Q6,OFFSET('semaine paire (sans samedi pm)'!$B$1, MATCH($A6,OFFSET('semaine paire (sans samedi pm)'!$B$1,MATCH(Q$2,'semaine paire (sans samedi pm)'!$B$1:$B$120,0)-1,1,12,1),0)-1+MATCH(Q$2,'semaine paire (sans samedi pm)'!$B$1:$B$120,0)-1,3,1,52),0)),\"\")","v":"7h-7h15"},"7h",{"$f":"IFERROR(OFFSET('semaine paire (sans samedi pm)'!$D$2,,MATCH(\"z^z\",OFFSET('semaine paire (sans samedi pm)'!$B$1, MATCH($A6,OFFSET('semaine paire (sans samedi pm)'!$B$1,MATCH(Q$2,'semaine paire (sans samedi pm)'!$B$1:$B$120,0)-1,1,12,1),0)-1+MATCH(Q$2,'semaine paire (sans samedi pm)'!$B$1:$B$120,0)-1,3,1,52), 1)),\"\")","v":"13h15-13H30"},"13H30",{"$f":"IFERROR(HLOOKUP(\"z^z\",OFFSET('semaine paire (sans samedi pm)'!$B$1, MATCH($A6,OFFSET('semaine paire (sans samedi pm)'!$B$1,MATCH(V$2,'semaine paire (sans samedi pm)'!$B$1:$B$120,0)-1,1,12,1),0)-1+MATCH(V$2,'semaine paire (sans samedi pm)'!$B$1:$B$120,0)-1,3,1,52),1,1),\"\")","v":"S"},{"$f":"IFERROR(OFFSET('semaine paire (sans samedi pm)'!$D$2,,MATCH(V6,OFFSET('semaine paire (sans samedi pm)'!$B$1, MATCH($A6,OFFSET('semaine paire (sans samedi pm)'!$B$1,MATCH(V$2,'semaine paire (sans samedi pm)'!$B$1:$B$120,0)-1,1,12,1),0)-1+MATCH(V$2,'semaine paire (sans samedi pm)'!$B$1:$B$120,0)-1,3,1,52),0)),\"\")","v":"7h30-7h45"},"7h30",{"$f":"IFERROR(OFFSET('semaine paire (sans samedi pm)'!$D$2,,MATCH(\"z^z\",OFFSET('semaine paire (sans samedi pm)'!$B$1, MATCH($A6,OFFSET('semaine paire (sans samedi pm)'!$B$1,MATCH(V$2,'semaine paire (sans samedi pm)'!$B$1:$B$120,0)-1,1,12,1),0)-1+MATCH(V$2,'semaine paire (sans samedi pm)'!$B$1:$B$120,0)-1,3,1,52), 1)),\"\")","v":"12h-12H15"},"12H15",{"$f":"IFERROR(HLOOKUP(\"z^z\",OFFSET('semaine paire (sans samedi pm)'!$B$1, MATCH($A6,OFFSET('semaine paire (sans samedi pm)'!$B$1,MATCH(AA$2,'semaine paire (sans samedi pm)'!$B$1:$B$120,0)-1,1,12,1),0)-1+MATCH(AA$2,'semaine paire (sans samedi pm)'!$B$1:$B$120,0)-1,3,1,52),1,1),\"\")","v":"S"},{"$f":"IFERROR(OFFSET('semaine paire (sans samedi pm)'!$D$2,,MATCH(AA6,OFFSET('semaine paire (sans samedi pm)'!$B$1, MATCH($A6,OFFSET('semaine paire (sans samedi pm)'!$B$1,MATCH(AA$2,'semaine paire (sans samedi pm)'!$B$1:$B$120,0)-1,1,12,1),0)-1+MATCH(AA$2,'semaine paire (sans samedi pm)'!$B$1:$B$120,0)-1,3,1,52),0)),\"\")","v":"7h-7h15"},"7h",{"$f":"IFERROR(OFFSET('semaine paire (sans samedi pm)'!$D$2,,MATCH(\"z^z\",OFFSET('semaine paire (sans samedi pm)'!$B$1, MATCH($A6,OFFSET('semaine paire (sans samedi pm)'!$B$1,MATCH(AA$2,'semaine paire (sans samedi pm)'!$B$1:$B$120,0)-1,1,12,1),0)-1+MATCH(AA$2,'semaine paire (sans samedi pm)'!$B$1:$B$120,0)-1,3,1,52), 1)),\"\")","v":"12h15-12H30"},"12H30",{"$f":"IFERROR(HLOOKUP(\"z^z\",OFFSET('semaine paire (sans samedi pm)'!$B$1, MATCH($A6,OFFSET('semaine paire (sans samedi pm)'!$B$1,MATCH(AF$2,'semaine paire (sans samedi pm)'!$B$1:$B$120,0)-1,1,12,1),0)-1+MATCH(AF$2,'semaine paire (sans samedi pm)'!$B$1:$B$120,0)-1,3,1,52),1,1),\"\")","v":""},{"$f":"IFERROR(OFFSET('semaine paire (sans samedi pm)'!$D$2,,MATCH(AF6,OFFSET('semaine paire (sans samedi pm)'!$B$1, MATCH($A6,OFFSET('semaine paire (sans samedi pm)'!$B$1,MATCH(AF$2,'semaine paire (sans samedi pm)'!$B$1:$B$120,0)-1,1,12,1),0)-1+MATCH(AF$2,'semaine paire (sans samedi pm)'!$B$1:$B$120,0)-1,3,1,52),0)),\"\")","v":""},"",{"$f":"IFERROR(OFFSET('semaine paire (sans samedi pm)'!$D$2,,MATCH(\"z^z\",OFFSET('semaine paire (sans samedi pm)'!$B$1, MATCH($A6,OFFSET('semaine paire (sans samedi pm)'!$B$1,MATCH(AF$2,'semaine paire (sans samedi pm)'!$B$1:$B$120,0)-1,1,12,1),0)-1+MATCH(AF$2,'semaine paire (sans samedi pm)'!$B$1:$B$120,0)-1,3,1,52), 1)),\"\")","v":""},""]
["Francoise",{"$f":"IFERROR(HLOOKUP(\"z^z\",OFFSET('semaine paire (sans samedi pm)'!$B$1, MATCH($A7,OFFSET('semaine paire (sans samedi pm)'!$B$1,MATCH(B$2,'semaine paire (sans samedi pm)'!$B$1:$B$120,0)-1,1,12,1),0)-1+MATCH(B$2,'semaine paire (sans samedi pm)'!$B$1:$B$120,0)-1,3,1,52),1,1),\"\")","v":"F"},{"$f":"IFERROR(OFFSET('semaine paire (sans samedi pm)'!$D$2,,MATCH(B7,OFFSET('semaine paire (sans samedi pm)'!$B$1, MATCH($A7,OFFSET('semaine paire (sans samedi pm)'!$B$1,MATCH(B$2,'semaine paire (sans samedi pm)'!$B$1:$B$120,0)-1,1,12,1),0)-1+MATCH(B$2,'semaine paire (sans samedi pm)'!$B$1:$B$120,0)-1,3,1,52),0)),\"\")","v":"6h45-7h"},"06:45:00",{"$f":"IFERROR(OFFSET('semaine paire (sans samedi pm)'!$D$2,,MATCH(\"z^z\",OFFSET('semaine paire (sans samedi pm)'!$B$1, MATCH($A7,OFFSET('semaine paire (sans samedi pm)'!$B$1,MATCH(B$2,'semaine paire (sans samedi pm)'!$B$1:$B$120,0)-1,1,12,1),0)-1+MATCH(B$2,'semaine paire (sans samedi pm)'!$B$1:$B$120,0)-1,3,1,52), 1)),\"\")","v":"12h45-13H"},"13:00:00",{"$f":"IFERROR(HLOOKUP(\"z^z\",OFFSET('semaine paire (sans samedi pm)'!$B$1, MATCH($A7,OFFSET('semaine paire (sans samedi pm)'!$B$1,MATCH(G$2,'semaine paire (sans samedi pm)'!$B$1:$B$120,0)-1,1,12,1),0)-1+MATCH(G$2,'semaine paire (sans samedi pm)'!$B$1:$B$120,0)-1,3,1,52),1,1),\"\")","v":"F"},{"$f":"IFERROR(OFFSET('semaine paire (sans samedi pm)'!$D$2,,MATCH(G7,OFFSET('semaine paire (sans samedi pm)'!$B$1, MATCH($A7,OFFSET('semaine paire (sans samedi pm)'!$B$1,MATCH(G$2,'semaine paire (sans samedi pm)'!$B$1:$B$120,0)-1,1,12,1),0)-1+MATCH(G$2,'semaine paire (sans samedi pm)'!$B$1:$B$120,0)-1,3,1,52),0)),\"\")","v":"6h45-7h"},"6h45",{"$f":"IFERROR(OFFSET('semaine paire (sans samedi pm)'!$D$2,,MATCH(\"z^z\",OFFSET('semaine paire (sans samedi pm)'!$B$1, MATCH($A7,OFFSET('semaine paire (sans samedi pm)'!$B$1,MATCH(G$2,'semaine paire (sans samedi pm)'!$B$1:$B$120,0)-1,1,12,1),0)-1+MATCH(G$2,'semaine paire (sans samedi pm)'!$B$1:$B$120,0)-1,3,1,52), 1)),\"\")","v":"12h15-12H30"},"12H30",{"$f":"IFERROR(HLOOKUP(\"z^z\",OFFSET('semaine paire (sans samedi pm)'!$B$1, MATCH($A7,OFFSET('semaine paire (sans samedi pm)'!$B$1,MATCH(L$2,'semaine paire (sans samedi pm)'!$B$1:$B$120,0)-1,1,12,1),0)-1+MATCH(L$2,'semaine paire (sans samedi pm)'!$B$1:$B$120,0)-1,3,1,52),1,1),\"\")","v":"F"},{"$f":"IFERROR(OFFSET('semaine paire (sans samedi pm)'!$D$2,,MATCH(L7,OFFSET('semaine paire (sans samedi pm)'!$B$1, MATCH($A7,OFFSET('semaine paire (sans samedi pm)'!$B$1,MATCH(L$2,'semaine paire (sans samedi pm)'!$B$1:$B$120,0)-1,1,12,1),0)-1+MATCH(L$2,'semaine paire (sans samedi pm)'!$B$1:$B$120,0)-1,3,1,52),0)),\"\")","v":"6h45-7h"},"6h45",{"$f":"IFERROR(OFFSET('semaine paire (sans samedi pm)'!$D$2,,MATCH(\"z^z\",OFFSET('semaine paire (sans samedi pm)'!$B$1, MATCH($A7,OFFSET('semaine paire (sans samedi pm)'!$B$1,MATCH(L$2,'semaine paire (sans samedi pm)'!$B$1:$B$120,0)-1,1,12,1),0)-1+MATCH(L$2,'semaine paire (sans samedi pm)'!$B$1:$B$120,0)-1,3,1,52), 1)),\"\")","v":"11h-11H15"},"11H15",{"$f":"IFERROR(HLOOKUP(\"z^z\",OFFSET('semaine paire (sans samedi pm)'!$B$1, MATCH($A7,OFFSET('semaine paire (sans samedi pm)'!$B$1,MATCH(Q$2,'semaine paire (sans samedi pm)'!$B$1:$B$120,0)-1,1,12,1),0)-1+MATCH(Q$2,'semaine paire (sans samedi pm)'!$B$1:$B$120,0)-1,3,1,52),1,1),\"\")","v":"F"},{"$f":"IFERROR(OFFSET('semaine paire (sans samedi pm)'!$D$2,,MATCH(Q7,OFFSET('semaine paire (sans samedi pm)'!$B$1, MATCH($A7,OFFSET('semaine paire (sans samedi pm)'!$B$1,MATCH(Q$2,'semaine paire (sans samedi pm)'!$B$1:$B$120,0)-1,1,12,1),0)-1+MATCH(Q$2,'semaine paire (sans samedi pm)'!$B$1:$B$120,0)-1,3,1,52),0)),\"\")","v":"6h45-7h"},"6h45",{"$f":"IFERROR(OFFSET('semaine paire (sans samedi pm)'!$D$2,,MATCH(\"z^z\",OFFSET('semaine paire (sans samedi pm)'!$B$1, MATCH($A7,OFFSET('semaine paire (sans samedi pm)'!$B$1,MATCH(Q$2,'semaine paire (sans samedi pm)'!$B$1:$B$120,0)-1,1,12,1),0)-1+MATCH(Q$2,'semaine paire (sans samedi pm)'!$B$1:$B$120,0)-1,3,1,52), 1)),\"\")","v":"12h30-12H45"},"12H45",{"$f":"IFERROR(HLOOKUP(\"z^z\",OFFSET('semaine paire (sans samedi pm)'!$B$1, MATCH($A7,OFFSET('semaine paire (sans samedi pm)'!$B$1,MATCH(V$2,'semaine paire (sans samedi pm)'!$B$1:$B$120,0)-1,1,12,1),0)-1+MATCH(V$2,'semaine paire (sans samedi pm)'!$B$1:$B$120,0)-1,3,1,52),1,1),\"\")","v":"F"},{"$f":"IFERROR(OFFSET('semaine paire (sans samedi pm)'!$D$2,,MATCH(V7,OFFSET('semaine paire (sans samedi pm)'!$B$1, MATCH($A7,OFFSET('semaine paire (sans samedi pm)'!$B$1,MATCH(V$2,'semaine paire (sans samedi pm)'!$B$1:$B$120,0)-1,1,12,1),0)-1+MATCH(V$2,'semaine paire (sans samedi pm)'!$B$1:$B$120,0)-1,3,1,52),0)),\"\")","v":"6h45-7h"},"6h45",{"$f":"IFERROR(OFFSET('semaine paire (sans samedi pm)'!$D$2,,MATCH(\"z^z\",OFFSET('semaine paire (sans samedi pm)'!$B$1, MATCH($A7,OFFSET('semaine paire (sans samedi pm)'!$B$1,MATCH(V$2,'semaine paire (sans samedi pm)'!$B$1:$B$120,0)-1,1,12,1),0)-1+MATCH(V$2,'semaine paire (sans samedi pm)'!$B$1:$B$120,0)-1,3,1,52), 1)),\"\")","v":"16h45-17h"},"17h",{"$f":"IFERROR(HLOOKUP(\"z^z\",OFFSET('semaine paire (sans samedi pm)'!$B$1, MATCH($A7,OFFSET('semaine paire (sans samedi pm)'!$B$1,MATCH(AA$2,'semaine paire (sans samedi pm)'!$B$1:$B$120,0)-1,1,12,1),0)-1+MATCH(AA$2,'semaine paire (sans samedi pm)'!$B$1:$B$120,0)-1,3,1,52),1,1),\"\")","v":"F"},{"$f":"IFERROR(OFFSET('semaine paire (sans samedi pm)'!$D$2,,MATCH(AA7,OFFSET('semaine paire (sans samedi pm)'!$B$1, MATCH($A7,OFFSET('semaine paire (sans samedi pm)'!$B$1,MATCH(AA$2,'semaine paire (sans samedi pm)'!$B$1:$B$120,0)-1,1,12,1),0)-1+MATCH(AA$2,'semaine paire (sans samedi pm)'!$B$1:$B$120,0)-1,3,1,52),0)),\"\")","v":"6h30-6h45"},"6h30",{"$f":"IFERROR(OFFSET('semaine paire (sans samedi pm)'!$D$2,,MATCH(\"z^z\",OFFSET('semaine paire (sans samedi pm)'!$B$1, MATCH($A7,OFFSET('semaine paire (sans samedi pm)'!$B$1,MATCH(AA$2,'semaine paire (sans samedi pm)'!$B$1:$B$120,0)-1,1,12,1),0)-1+MATCH(AA$2,'semaine paire (sans samedi pm)'!$B$1:$B$120,0)-1,3,1,52), 1)),\"\")","v":"12h15-12H30"},"12H30",{"$f":"IFERROR(HLOOKUP(\"z^z\",OFFSET('semaine paire (sans samedi pm)'!$B$1, MATCH($A7,OFFSET('semaine paire (sans samedi pm)'!$B$1,MATCH(AF$2,'semaine paire (sans samedi pm)'!$B$1:$B$120,0)-1,1,12,1),0)-1+MATCH(AF$2,'semaine paire (sans samedi pm)'!$B$1:$B$120,0)-1,3,1,52),1,1),\"\")","v":""},{"$f":"IFERROR(OFFSET('semaine paire (sans samedi pm)'!$D$2,,MATCH(AF7,OFFSET('semaine paire (sans samedi pm)'!$B$1, MATCH($A7,OFFSET('semaine paire (sans samedi pm)'!$B$1,MATCH(AF$2,'semaine paire (sans samedi pm)'!$B$1:$B$120,0)-1,1,12,1),0)-1+MATCH(AF$2,'semaine paire (sans samedi pm)'!$B$1:$B$120,0)-1,3,1,52),0)),\"\")","v":""},"",{"$f":"IFERROR(OFFSET('semaine paire (sans samedi pm)'!$D$2,,MATCH(\"z^z\",OFFSET('semaine paire (sans samedi pm)'!$B$1, MATCH($A7,OFFSET('semaine paire (sans samedi pm)'!$B$1,MATCH(AF$2,'semaine paire (sans samedi pm)'!$B$1:$B$120,0)-1,1,12,1),0)-1+MATCH(AF$2,'semaine paire (sans samedi pm)'!$B$1:$B$120,0)-1,3,1,52), 1)),\"\")","v":""},""]
["Ghislaine",{"$f":"IFERROR(HLOOKUP(\"z^z\",OFFSET('semaine paire (sans samedi pm)'!$B$1, MATCH($A8,OFFSET('semaine paire (sans samedi pm)'!$B$1,MATCH(B$2,'semaine paire (sans samedi pm)'!$B$1:$B$120,0)-1,1,12,1),0)-1+MATCH(B$2,'semaine paire (sans samedi pm)'!$B$1:$B$120,0)-1,3,1,52),1,1),\"\")","v":"DPH"},{"$f":"IFERROR(OFFSET('semaine paire (sans samedi pm)'!$D$2,,MATCH(B8,OFFSET('semaine paire (sans samedi pm)'!$B$1, MATCH($A8,OFFSET('semaine paire (sans samedi pm)'!$B$1,MATCH(B$2,'semaine paire (sans samedi pm)'!$B$1:$B$120,0)-1,1,12,1),0)-1+MATCH(B$2,'semaine paire (sans samedi pm)'!$B$1:$B$120,0)-1,3,1,52),0)),\"\")","v":"6h30-6h45"},"06:30:00",{"$f":"IFERROR(OFFSET('semaine paire (sans samedi pm)'!$D$2,,MATCH(\"z^z\",OFFSET('semaine paire (sans samedi pm)'!$B$1, MATCH($A8,OFFSET('semaine paire (sans samedi pm)'!$B$1,MATCH(B$2,'semaine paire (sans samedi pm)'!$B$1:$B$120,0)-1,1,12,1),0)-1+MATCH(B$2,'semaine paire (sans samedi pm)'!$B$1:$B$120,0)-1,3,1,52), 1)),\"\")","v":"12h15-12H30"},"12:30:00",{"$f":"IFERROR(HLOOKUP(\"z^z\",OFFSET('semaine paire (sans samedi pm)'!$B$1, MATCH($A8,OFFSET('semaine paire (sans samedi pm)'!$B$1,MATCH(G$2,'semaine paire (sans samedi pm)'!$B$1:$B$120,0)-1,1,12,1),0)-1+MATCH(G$2,'semaine paire (sans samedi pm)'!$B$1:$B$120,0)-1,3,1,52),1,1),\"\")","v":"DPH"},{"$f":"IFERROR(OFFSET('semaine paire (sans samedi pm)'!$D$2,,MATCH(G8,OFFSET('semaine paire (sans samedi pm)'!$B$1, MATCH($A8,OFFSET('semaine paire (sans samedi pm)'!$B$1,MATCH(G$2,'semaine paire (sans samedi pm)'!$B$1:$B$120,0)-1,1,12,1),0)-1+MATCH(G$2,'semaine paire (sans samedi pm)'!$B$1:$B$120,0)-1,3,1,52),0)),\"\")","v":"6h30-6h45"},"6h30",{"$f":"IFERROR(OFFSET('semaine paire (sans samedi pm)'!$D$2,,MATCH(\"z^z\",OFFSET('semaine paire (sans samedi pm)'!$B$1, MATCH($A8,OFFSET('semaine paire (sans samedi pm)'!$B$1,MATCH(G$2,'semaine paire (sans samedi pm)'!$B$1:$B$120,0)-1,1,12,1),0)-1+MATCH(G$2,'semaine paire (sans samedi pm)'!$B$1:$B$120,0)-1,3,1,52), 1)),\"\")","v":"12h15-12H30"},"12H30",{"$f":"IFERROR(HLOOKUP(\"z^z\",OFFSET('semaine paire (sans samedi pm)'!$B$1, MATCH($A8,OFFSET('semaine paire (sans samedi pm)'!$B$1,MATCH(L$2,'semaine paire (sans samedi pm)'!$B$1:$B$120,0)-1,1,12,1),0)-1+MATCH(L$2,'semaine paire (sans samedi pm)'!$B$1:$B$120,0)-1,3,1,52),1,1),\"\")","v":"DPH"},{"$f":"IFERROR(OFFSET('semaine paire (sans samedi pm)'!$D$2,,MATCH(L8,OFFSET('semaine paire (sans samedi pm)'!$B$1, MATCH($A8,OFFSET('semaine paire (sans samedi pm)'!$B$1,MATCH(L$2,'semaine paire (sans samedi pm)'!$B$1:$B$120,0)-1,1,12,1),0)-1+MATCH(L$2,'semaine paire (sans samedi pm)'!$B$1:$B$120,0)-1,3,1,52),0)),\"\")","v":"7h30-7h45"},"7h30",{"$f":"IFERROR(OFFSET('semaine paire (sans samedi pm)'!$D$2,,MATCH(\"z^z\",OFFSET('semaine paire (sans samedi pm)'!$B$1, MATCH($A8,OFFSET('semaine paire (sans samedi pm)'!$B$1,MATCH(L$2,'semaine paire (sans samedi pm)'!$B$1:$B$120,0)-1,1,12,1),0)-1+MATCH(L$2,'semaine paire (sans samedi pm)'!$B$1:$B$120,0)-1,3,1,52), 1)),\"\")","v":"12h-12H15"},"12H15",{"$f":"IFERROR(HLOOKUP(\"z^z\",OFFSET('semaine paire (sans samedi pm)'!$B$1, MATCH($A8,OFFSET('semaine paire (sans samedi pm)'!$B$1,MATCH(Q$2,'semaine paire (sans samedi pm)'!$B$1:$B$120,0)-1,1,12,1),0)-1+MATCH(Q$2,'semaine paire (sans samedi pm)'!$B$1:$B$120,0)-1,3,1,52),1,1),\"\")","v":"DPH"},{"$f":"IFERROR(OFFSET('semaine paire (sans samedi pm)'!$D$2,,MATCH(Q8,OFFSET('semaine paire (sans samedi pm)'!$B$1, MATCH($A8,OFFSET('semaine paire (sans samedi pm)'!$B$1,MATCH(Q$2,'semaine paire (sans samedi pm)'!$B$1:$B$120,0)-1,1,12,1),0)-1+MATCH(Q$2,'semaine paire (sans samedi pm)'!$B$1:$B$120,0)-1,3,1,52),0)),\"\")","v":"6h30-6h45"},"6h30",{"$f":"IFERROR(OFFSET('semaine paire (sans samedi pm)'!$D$2,,MATCH(\"z^z\",OFFSET('semaine paire (sans samedi pm)'!$B$1, MATCH($A8,OFFSET('semaine paire (sans samedi pm)'!$B$1,MATCH(Q$2,'semaine paire (sans samedi pm)'!$B$1:$B$120,0)-1,1,12,1),0)-1+MATCH(Q$2,'semaine paire (sans samedi pm)'!$B$1:$B$120,0)-1,3,1,52), 1)),\"\")","v":"17h45-18H"},"18H",{"$f":"IFERROR(HLOOKUP(\"z^z\",OFFSET('semaine paire (sans samedi pm)'!$B$1, MATCH($A8,OFFSET('semaine paire (sans samedi pm)'!$B$1,MATCH(V$2,'semaine paire (sans samedi pm)'!$B$1:$B$120,0)-1,1,12,1),0)-1+MATCH(V$2,'semaine paire (sans samedi pm)'!$B$1:$B$120,0)-1,3,1,52),1,1),\"\")","v":"DPH"},{"$f":"IFERROR(OFFSET('semaine paire (sans samedi pm)'!$D$2,,MATCH(V8,OFFSET('semaine paire (sans samedi pm)'!$B$1, MATCH($A8,OFFSET('semaine paire (sans samedi pm)'!$B$1,MATCH(V$2,'semaine paire (sans samedi pm)'!$B$1:$B$120,0)-1,1,12,1),0)-1+MATCH(V$2,'semaine paire (sans samedi pm)'!$B$1:$B$120,0)-1,3,1,52),0)),\"\")","v":"7h30-7h45"},"7h30",{"$f":"IFERROR(OFFSET('semaine paire (sans samedi pm)'!$D$2,,MATCH(\"z^z\",OFFSET('semaine paire (sans samedi pm)'!$B$1, MATCH($A8,OFFSET('semaine paire (sans samedi pm)'!$B$1,MATCH(V$2,'semaine paire (sans samedi pm)'!$B$1:$B$120,0)-1,1,12,1),0)-1+MATCH(V$2,'semaine paire (sans samedi pm)'!$B$1:$B$120,0)-1,3,1,52), 1)),\"\")","v":"12h15-12H30"},"12H30",{"$f":"IFERROR(HLOOKUP(\"z^z\",OFFSET('semaine paire (sans samedi pm)'!$B$1, MATCH($A8,OFFSET('semaine paire (sans samedi pm)'!$B$1,MATCH(AA$2,'semaine paire (sans samedi pm)'!$B$1:$B$120,0)-1,1,12,1),0)-1+MATCH(AA$2,'semaine paire (sans samedi pm)'!$B$1:$B$120,0)-1,3,1,52),1,1),\"\")","v":"DPH"},{"$f":"IFERROR(OFFSET('semaine paire (sans samedi pm)'!$D$2,,MATCH(AA8,OFFSET('semaine paire (sans samedi pm)'!$B$1, MATCH($A8,OFFSET('semaine paire (sans samedi pm)'!$B$1,MATCH(AA$2,'semaine paire (sans samedi pm)'!$B$1:$B$120,0)-1,1,12,1),0)-1+MATCH(AA$2,'semaine paire (sans samedi pm)'!$B$1:$B$120,0)-1,3,1,52),0)),\"\")","v":"7h-7h15"},"7h",{"$f":"IFERROR(OFFSET('semaine paire (sans samedi pm)'!$D$2,,MATCH(\"z^z\",OFFSET('semaine paire (sans samedi pm)'!$B$1, MATCH($A8,OFFSET('semaine paire (sans samedi pm)'!$B$1,MATCH(AA$2,'semaine paire (sans samedi pm)'!$B$1:$B$120,0)-1,1,12,1),0)-1+MATCH(AA$2,'semaine paire (sans samedi pm)'!$B$1:$B$120,0)-1,3,1,52), 1)),\"\")","v":"12h15-12H30"},"12H30",{"$f":"IFERROR(HLOOKUP(\"z^z\",OFFSET('semaine paire (sans samedi pm)'!$B$1, MATCH($A8,OFFSET('semaine paire (sans samedi pm)'!$B$1,MATCH(AF$2,'semaine paire (sans samedi pm)'!$B$1:$B$120,0)-1,1,12,1),0)-1+MATCH(AF$2,'semaine paire (sans samedi pm)'!$B$1:$B$120,0)-1,3,1,52),1,1),\"\")","v":""},{"$f":"IFERROR(OFFSET('semaine paire (sans samedi pm)'!$D$2,,MATCH(AF8,OFFSET('semaine paire (sans samedi pm)'!$B$1, MATCH($A8,OFFSET('semaine paire (sans samedi pm)'!$B$1,MATCH(AF$2,'semaine paire (sans samedi pm)'!$B$1:$B$120,0)-1,1,12,1),0)-1+MATCH(AF$2,'semaine paire (sans samedi pm)'!$B$1:$B$120,0)-1,3,1,52),0)),\"\")","v":""},"",{"$f":"IFERROR(OFFSET('semaine paire (sans samedi pm)'!$D$2,,MATCH(\"z^z\",OFFSET('semaine paire (sans samedi pm)'!$B$1, MATCH($A8,OFFSET('semaine paire (sans samedi pm)'!$B$1,MATCH(AF$2,'semaine paire (sans samedi pm)'!$B$1:$B$120,0)-1,1,12,1),0)-1+MATCH(AF$2,'semaine paire (sans samedi pm)'!$B$1:$B$120,0)-1,3,1,52), 1)),\"\")","v":""},""]
["Laura",{"$f":"IFERROR(HLOOKUP(\"z^z\",OFFSET('semaine paire (sans samedi pm)'!$B$1, MATCH($A9,OFFSET('semaine paire (sans samedi pm)'!$B$1,MATCH(B$2,'semaine paire (sans samedi pm)'!$B$1:$B$120,0)-1,1,12,1),0)-1+MATCH(B$2,'semaine paire (sans samedi pm)'!$B$1:$B$120,0)-1,3,1,52),1,1),\"\")","v":"S"},{"$f":"IFERROR(OFFSET('semaine paire (sans samedi pm)'!$D$2,,MATCH(B9,OFFSET('semaine paire (sans samedi pm)'!$B$1, MATCH($A9,OFFSET('semaine paire (sans samedi pm)'!$B$1,MATCH(B$2,'semaine paire (sans samedi pm)'!$B$1:$B$120,0)-1,1,12,1),0)-1+MATCH(B$2,'semaine paire (sans samedi pm)'!$B$1:$B$120,0)-1,3,1,52),0)),\"\")","v":"6h30-6h45"},"06:30:00",{"$f":"IFERROR(OFFSET('semaine paire (sans samedi pm)'!$D$2,,MATCH(\"z^z\",OFFSET('semaine paire (sans samedi pm)'!$B$1, MATCH($A9,OFFSET('semaine paire (sans samedi pm)'!$B$1,MATCH(B$2,'semaine paire (sans samedi pm)'!$B$1:$B$120,0)-1,1,12,1),0)-1+MATCH(B$2,'semaine paire (sans samedi pm)'!$B$1:$B$120,0)-1,3,1,52), 1)),\"\")","v":"17h45-18H"},"18:00:00",{"$f":"IFERROR(HLOOKUP(\"z^z\",OFFSET('semaine paire (sans samedi pm)'!$B$1, MATCH($A9,OFFSET('semaine paire (sans samedi pm)'!$B$1,MATCH(G$2,'semaine paire (sans samedi pm)'!$B$1:$B$120,0)-1,1,12,1),0)-1+MATCH(G$2,'semaine paire (sans samedi pm)'!$B$1:$B$120,0)-1,3,1,52),1,1),\"\")","v":"S"},{"$f":"IFERROR(OFFSET('semaine paire (sans samedi pm)'!$D$2,,MATCH(G9,OFFSET('semaine paire (sans samedi pm)'!$B$1, MATCH($A9,OFFSET('semaine paire (sans samedi pm)'!$B$1,MATCH(G$2,'semaine paire (sans samedi pm)'!$B$1:$B$120,0)-1,1,12,1),0)-1+MATCH(G$2,'semaine paire (sans samedi pm)'!$B$1:$B$120,0)-1,3,1,52),0)),\"\")","v":"6h30-6h45"},"6h30",{"$f":"IFERROR(OFFSET('semaine paire (sans samedi pm)'!$D$2,,MATCH(\"z^z\",OFFSET('semaine paire (sans samedi pm)'!$B$1, MATCH($A9,OFFSET('semaine paire (sans samedi pm)'!$B$1,MATCH(G$2,'semaine paire (sans samedi pm)'!$B$1:$B$120,0)-1,1,12,1),0)-1+MATCH(G$2,'semaine paire (sans samedi pm)'!$B$1:$B$120,0)-1,3,1,52), 1)),\"\")","v":"12h15-12H30"},"12H30",{"$f":"IFERROR(HLOOKUP(\"z^z\",OFFSET('semaine paire (sans samedi pm)'!$B$1, MATCH($A9,OFFSET('semaine paire (sans samedi pm)'!$B$1,MATCH(L$2,'semaine paire (sans samedi pm)'!$B$1:$B$120,0)-1,1,12,1),0)-1+MATCH(L$2,'semaine paire (sans samedi pm)'!$B$1:$B$120,0)-1,3,1,52),1,1),\"\")","v":"S"},{"$f":"IFERROR(OFFSET('semaine paire (sans samedi pm)'!$D$2,,MATCH(L9,OFFSET('semaine paire (sans samedi pm)'!$B$1, MATCH($A9,OFFSET('semaine paire (sans samedi pm)'!$B$1,MATCH(L$2,'semaine paire (sans samedi pm)'!$B$1:$B$120,0)-1,1,12,1),0)-1+MATCH(L$2,'semaine paire (sans samedi pm)'!$B$1:$B$120,0)-1,3,1,52),0)),\"\")","v":"7h30-7h45"},"7h30",{"$f":"IFERROR(OFFSET('semaine paire (sans samedi pm)'!$D$2,,MATCH(\"z^z\",OFFSET('semaine paire (sans samedi pm)'!$B$1, MATCH($A9,OFFSET('semaine paire (sans samedi pm)'!$B$1,MATCH(L$2,'semaine paire (sans samedi pm)'!$B$1:$B$120,0)-1,1,12,1),0)-1+MATCH(L$2,'semaine paire (sans samedi pm)'!$B$1:$B$120,0)-1,3,1,52), 1)),\"\")","v":"12h-12H15"},"12H15",{"$f":"IFERROR(HLOOKUP(\"z^z\",OFFSET('semaine paire (sans samedi pm)'!$B$1, MATCH($A9,OFFSET('semaine paire (sans samedi pm)'!$B$1,MATCH(Q$2,'semaine paire (sans samedi pm)'!$B$1:$B$120,0)-1,1,12,1),0)-1+MATCH(Q$2,'semaine paire (sans samedi pm)'!$B$1:$B$120,0)-1,3,1,52),1,1),\"\")","v":"S"},{"$f":"IFERROR(OFFSET('semaine paire (sans samedi pm)'!$D$2,,MATCH(Q9,OFFSET('semaine paire (sans samedi pm)'!$B$1, MATCH($A9,OFFSET('semaine paire (sans samedi pm)'!$B$1,MATCH(Q$2,'semaine paire (sans samedi pm)'!$B$1:$B$120,0)-1,1,12,1),0)-1+MATCH(Q$2,'semaine paire (sans samedi pm)'!$B$1:$B$120,0)-1,3,1,52),0)),\"\")","v":"6h30-6h45"},"6h30",{"$f":"IFERROR(OFFSET('semaine paire (sans samedi pm)'!$D$2,,MATCH(\"z^z\",OFFSET('semaine paire (sans samedi pm)'!$B$1, MATCH($A9,OFFSET('semaine paire (sans samedi pm)'!$B$1,MATCH(Q$2,'semaine paire (sans samedi pm)'!$B$1:$B$120,0)-1,1,12,1),0)-1+MATCH(Q$2,'semaine paire (sans samedi pm)'!$B$1:$B$120,0)-1,3,1,52), 1)),\"\")","v":"12h45-13H"},"13H",{"$f":"IFERROR(HLOOKUP(\"z^z\",OFFSET('semaine paire (sans samedi pm)'!$B$1, MATCH($A9,OFFSET('semaine paire (sans samedi pm)'!$B$1,MATCH(V$2,'semaine paire (sans samedi pm)'!$B$1:$B$120,0)-1,1,12,1),0)-1+MATCH(V$2,'semaine paire (sans samedi pm)'!$B$1:$B$120,0)-1,3,1,52),1,1),\"\")","v":"S"},{"$f":"IFERROR(OFFSET('semaine paire (sans samedi pm)'!$D$2,,MATCH(V9,OFFSET('semaine paire (sans samedi pm)'!$B$1, MATCH($A9,OFFSET('semaine paire (sans samedi pm)'!$B$1,MATCH(V$2,'semaine paire (sans samedi pm)'!$B$1:$B$120,0)-1,1,12,1),0)-1+MATCH(V$2,'semaine paire (sans samedi pm)'!$B$1:$B$120,0)-1,3,1,52),0)),\"\")","v":"7h30-7h45"},"7h30",{"$f":"IFERROR(OFFSET('semaine paire (sans samedi pm)'!$D$2,,MATCH(\"z^z\",OFFSET('semaine paire (sans samedi pm)'!$B$1, MATCH($A9,OFFSET('semaine paire (sans samedi pm)'!$B$1,MATCH(V$2,'semaine paire (sans samedi pm)'!$B$1:$B$120,0)-1,1,12,1),0)-1+MATCH(V$2,'semaine paire (sans samedi pm)'!$B$1:$B$120,0)-1,3,1,52), 1)),\"\")","v":"11h45-12H"},"12H",{"$f":"IFERROR(HLOOKUP(\"z^z\",OFFSET('semaine paire (sans samedi pm)'!$B$1, MATCH($A9,OFFSET('semaine paire (sans samedi pm)'!$B$1,MATCH(AA$2,'semaine paire (sans samedi pm)'!$B$1:$B$120,0)-1,1,12,1),0)-1+MATCH(AA$2,'semaine paire (sans samedi pm)'!$B$1:$B$120,0)-1,3,1,52),1,1),\"\")","v":"S"},{"$f":"IFERROR(OFFSET('semaine paire (sans samedi pm)'!$D$2,,MATCH(AA9,OFFSET('semaine paire (sans samedi pm)'!$B$1, MATCH($A9,OFFSET('semaine paire (sans samedi pm)'!$B$1,MATCH(AA$2,'semaine paire (sans samedi pm)'!$B$1:$B$120,0)-1,1,12,1),0)-1+MATCH(AA$2,'semaine paire (sans samedi pm)'!$B$1:$B$120,0)-1,3,1,52),0)),\"\")","v":"7h-7h15"},"7h",{"$f":"IFERROR(OFFSET('semaine paire (sans samedi pm)'!$D$2,,MATCH(\"z^z\",OFFSET('semaine paire (sans samedi pm)'!$B$1, MATCH($A9,OFFSET('semaine paire (sans samedi pm)'!$B$1,MATCH(AA$2,'semaine paire (sans samedi pm)'!$B$1:$B$120,0)-1,1,12,1),0)-1+MATCH(AA$2,'semaine paire (sans samedi pm)'!$B$1:$B$120,0)-1,3,1,52), 1)),\"\")","v":"12h15-12H30"},"12H30",{"$f":"IFERROR(HLOOKUP(\"z^z\",OFFSET('semaine paire (sans samedi pm)'!$B$1, MATCH($A9,OFFSET('semaine paire (sans samedi pm)'!$B$1,MATCH(AF$2,'semaine paire (sans samedi pm)'!$B$1:$B$120,0)-1,1,12,1),0)-1+MATCH(AF$2,'semaine paire (sans samedi pm)'!$B$1:$B$120,0)-1,3,1,52),1,1),\"\")","v":""},{"$f":"IFERROR(OFFSET('semaine paire (sans samedi pm)'!$D$2,,MATCH(AF9,OFFSET('semaine paire (sans samedi pm)'!$B$1, MATCH($A9,OFFSET('semaine paire (sans samedi pm)'!$B$1,MATCH(AF$2,'semaine paire (sans samedi pm)'!$B$1:$B$120,0)-1,1,12,1),0)-1+MATCH(AF$2,'semaine paire (sans samedi pm)'!$B$1:$B$120,0)-1,3,1,52),0)),\"\")","v":""},"",{"$f":"IFERROR(OFFSET('semaine paire (sans samedi pm)'!$D$2,,MATCH(\"z^z\",OFFSET('semaine paire (sans samedi pm)'!$B$1, MATCH($A9,OFFSET('semaine paire (sans samedi pm)'!$B$1,MATCH(AF$2,'semaine paire (sans samedi pm)'!$B$1:$B$120,0)-1,1,12,1),0)-1+MATCH(AF$2,'semaine paire (sans samedi pm)'!$B$1:$B$120,0)-1,3,1,52), 1)),\"\")","v":""},""]
["Said",{"$f":"IFERROR(HLOOKUP(\"z^z\",OFFSET('semaine paire (sans samedi pm)'!$B$1, MATCH($A10,OFFSET('semaine paire (sans samedi pm)'!$B$1,MATCH(B$2,'semaine paire (sans samedi pm)'!$B$1:$B$120,0)-1,1,12,1),0)-1+MATCH(B$2,'semaine paire (sans samedi pm)'!$B$1:$B$120,0)-1,3,1,52),1,1),\"\")","v":"L"},{"$f":"IFERROR(OFFSET('semaine paire (sans samedi pm)'!$D$2,,MATCH(B10,OFFSET('semaine paire (sans samedi pm)'!$B$1, MATCH($A10,OFFSET('semaine paire (sans samedi pm)'!$B$1,MATCH(B$2,'semaine paire (sans samedi pm)'!$B$1:$B$120,0)-1,1,12,1),0)-1+MATCH(B$2,'semaine paire (sans samedi pm)'!$B$1:$B$120,0)-1,3,1,52),0)),\"\")","v":"7h-7h15"},"07:00:00",{"$f":"IFERROR(OFFSET('semaine paire (sans samedi pm)'!$D$2,,MATCH(\"z^z\",OFFSET('semaine paire (sans samedi pm)'!$B$1, MATCH($A10,OFFSET('semaine paire (sans samedi pm)'!$B$1,MATCH(B$2,'semaine paire (sans samedi pm)'!$B$1:$B$120,0)-1,1,12,1),0)-1+MATCH(B$2,'semaine paire (sans samedi pm)'!$B$1:$B$120,0)-1,3,1,52), 1)),\"\")","v":"13h15-13H30"},"13:30:00",{"$f":"IFERROR(HLOOKUP(\"z^z\",OFFSET('semaine paire (sans samedi pm)'!$B$1, MATCH($A10,OFFSET('semaine paire (sans samedi pm)'!$B$1,MATCH(G$2,'semaine paire (sans samedi pm)'!$B$1:$B$120,0)-1,1,12,1),0)-1+MATCH(G$2,'semaine paire (sans samedi pm)'!$B$1:$B$120,0)-1,3,1,52),1,1),\"\")","v":"L"},{"$f":"IFERROR(OFFSET('semaine paire (sans samedi pm)'!$D$2,,MATCH(G10,OFFSET('semaine paire (sans samedi pm)'!$B$1, MATCH($A10,OFFSET('semaine paire (sans samedi pm)'!$B$1,MATCH(G$2,'semaine paire (sans samedi pm)'!$B$1:$B$120,0)-1,1,12,1),0)-1+MATCH(G$2,'semaine paire (sans samedi pm)'!$B$1:$B$120,0)-1,3,1,52),0)),\"\")","v":"7h-7h15"},"7h",{"$f":"IFERROR(OFFSET('semaine paire (sans samedi pm)'!$D$2,,MATCH(\"z^z\",OFFSET('semaine paire (sans samedi pm)'!$B$1, MATCH($A10,OFFSET('semaine paire (sans samedi pm)'!$B$1,MATCH(G$2,'semaine paire (sans samedi pm)'!$B$1:$B$120,0)-1,1,12,1),0)-1+MATCH(G$2,'semaine paire (sans samedi pm)'!$B$1:$B$120,0)-1,3,1,52), 1)),\"\")","v":"12h45-13H"},"13H",{"$f":"IFERROR(HLOOKUP(\"z^z\",OFFSET('semaine paire (sans samedi pm)'!$B$1, MATCH($A10,OFFSET('semaine paire (sans samedi pm)'!$B$1,MATCH(L$2,'semaine paire (sans samedi pm)'!$B$1:$B$120,0)-1,1,12,1),0)-1+MATCH(L$2,'semaine paire (sans samedi pm)'!$B$1:$B$120,0)-1,3,1,52),1,1),\"\")","v":"L"},{"$f":"IFERROR(OFFSET('semaine paire (sans samedi pm)'!$D$2,,MATCH(L10,OFFSET('semaine paire (sans samedi pm)'!$B$1, MATCH($A10,OFFSET('semaine paire (sans samedi pm)'!$B$1,MATCH(L$2,'semaine paire (sans samedi pm)'!$B$1:$B$120,0)-1,1,12,1),0)-1+MATCH(L$2,'semaine paire (sans samedi pm)'!$B$1:$B$120,0)-1,3,1,52),0)),\"\")","v":"7h-7h15"},"7h",{"$f":"IFERROR(OFFSET('semaine paire (sans samedi pm)'!$D$2,,MATCH(\"z^z\",OFFSET('semaine paire (sans samedi pm)'!$B$1, MATCH($A10,OFFSET('semaine paire (sans samedi pm)'!$B$1,MATCH(L$2,'semaine paire (sans samedi pm)'!$B$1:$B$120,0)-1,1,12,1),0)-1+MATCH(L$2,'semaine paire (sans samedi pm)'!$B$1:$B$120,0)-1,3,1,52), 1)),\"\")","v":"12h15-12H30"},"12H30",{"$f":"IFERROR(HLOOKUP(\"z^z\",OFFSET('semaine paire (sans samedi pm)'!$B$1, MATCH($A10,OFFSET('semaine paire (sans samedi pm)'!$B$1,MATCH(Q$2,'semaine paire (sans samedi pm)'!$B$1:$B$120,0)-1,1,12,1),0)-1+MATCH(Q$2,'semaine paire (sans samedi pm)'!$B$1:$B$120,0)-1,3,1,52),1,1),\"\")","v":"L"},{"$f":"IFERROR(OFFSET('semaine paire (sans samedi pm)'!$D$2,,MATCH(Q10,OFFSET('semaine paire (sans samedi pm)'!$B$1, MATCH($A10,OFFSET('semaine paire (sans samedi pm)'!$B$1,MATCH(Q$2,'semaine paire (sans samedi pm)'!$B$1:$B$120,0)-1,1,12,1),0)-1+MATCH(Q$2,'semaine paire (sans samedi pm)'!$B$1:$B$120,0)-1,3,1,52),0)),\"\")","v":"7h-7h15"},"7h",{"$f":"IFERROR(OFFSET('semaine paire (sans samedi pm)'!$D$2,,MATCH(\"z^z\",OFFSET('semaine paire (sans samedi pm)'!$B$1, MATCH($A10,OFFSET('semaine paire (sans samedi pm)'!$B$1,MATCH(Q$2,'semaine paire (sans samedi pm)'!$B$1:$B$120,0)-1,1,12,1),0)-1+MATCH(Q$2,'semaine paire (sans samedi pm)'!$B$1:$B$120,0)-1,3,1,52), 1)),\"\")","v":"13H45-14H"},"14H",{"$f":"IFERROR(HLOOKUP(\"z^z\",OFFSET('semaine paire (sans samedi pm)'!$B$1, MATCH($A10,OFFSET('semaine paire (sans samedi pm)'!$B$1,MATCH(V$2,'semaine paire (sans samedi pm)'!$B$1:$B$120,0)-1,1,12,1),0)-1+MATCH(V$2,'semaine paire (sans samedi pm)'!$B$1:$B$120,0)-1,3,1,52),1,1),\"\")","v":"L"},{"$f":"IFERROR(OFFSET('semaine paire (sans samedi pm)'!$D$2,,MATCH(V10,OFFSET('semaine paire (sans samedi pm)'!$B$1, MATCH($A10,OFFSET('semaine paire (sans samedi pm)'!$B$1,MATCH(V$2,'semaine paire (sans samedi pm)'!$B$1:$B$120,0)-1,1,12,1),0)-1+MATCH(V$2,'semaine paire (sans samedi pm)'!$B$1:$B$120,0)-1,3,1,52),0)),\"\")","v":"7h-7h15"},"7h",{"$f":"IFERROR(OFFSET('semaine paire (sans samedi pm)'!$D$2,,MATCH(\"z^z\",OFFSET('semaine paire (sans samedi pm)'!$B$1, MATCH($A10,OFFSET('semaine paire (sans samedi pm)'!$B$1,MATCH(V$2,'semaine paire (sans samedi pm)'!$B$1:$B$120,0)-1,1,12,1),0)-1+MATCH(V$2,'semaine paire (sans samedi pm)'!$B$1:$B$120,0)-1,3,1,52), 1)),\"\")","v":"13h-13H15"},"13H15",{"$f":"IFERROR(HLOOKUP(\"z^z\",OFFSET('semaine paire (sans samedi pm)'!$B$1, MATCH($A10,OFFSET('semaine paire (sans samedi pm)'!$B$1,MATCH(AA$2,'semaine paire (sans samedi pm)'!$B$1:$B$120,0)-1,1,12,1),0)-1+MATCH(AA$2,'semaine paire (sans samedi pm)'!$B$1:$B$120,0)-1,3,1,52),1,1),\"\")","v":"L"},{"$f":"IFERROR(OFFSET('semaine paire (sans samedi pm)'!$D$2,,MATCH(AA10,OFFSET('semaine paire (sans samedi pm)'!$B$1, MATCH($A10,OFFSET('semaine paire (sans samedi pm)'!$B$1,MATCH(AA$2,'semaine paire (sans samedi pm)'!$B$1:$B$120,0)-1,1,12,1),0)-1+MATCH(AA$2,'semaine paire (sans samedi pm)'!$B$1:$B$120,0)-1,3,1,52),0)),\"\")","v":"7h-7h15"},"7h",{"$f":"IFERROR(OFFSET('semaine paire (sans samedi pm)'!$D$2,,MATCH(\"z^z\",OFFSET('semaine paire (sans samedi pm)'!$B$1, MATCH($A10,OFFSET('semaine paire (sans samedi pm)'!$B$1,MATCH(AA$2,'semaine paire (sans samedi pm)'!$B$1:$B$120,0)-1,1,12,1),0)-1+MATCH(AA$2,'semaine paire (sans samedi pm)'!$B$1:$B$120,0)-1,3,1,52), 1)),\"\")","v":"12h15-12H30"},"12H30",{"$f":"IFERROR(HLOOKUP(\"z^z\",OFFSET('semaine paire (sans samedi pm)'!$B$1, MATCH($A10,OFFSET('semaine paire (sans samedi pm)'!$B$1,MATCH(AF$2,'semaine paire (sans samedi pm)'!$B$1:$B$120,0)-1,1,12,1),0)-1+MATCH(AF$2,'semaine paire (sans samedi pm)'!$B$1:$B$120,0)-1,3,1,52),1,1),\"\")","v":""},{"$f":"IFERROR(OFFSET('semaine paire (sans samedi pm)'!$D$2,,MATCH(AF10,OFFSET('semaine paire (sans samedi pm)'!$B$1, MATCH($A10,OFFSET('semaine paire (sans samedi pm)'!$B$1,MATCH(AF$2,'semaine paire (sans samedi pm)'!$B$1:$B$120,0)-1,1,12,1),0)-1+MATCH(AF$2,'semaine paire (sans samedi pm)'!$B$1:$B$120,0)-1,3,1,52),0)),\"\")","v":""},"",{"$f":"IFERROR(OFFSET('semaine paire (sans samedi pm)'!$D$2,,MATCH(\"z^z\",OFFSET('semaine paire (sans samedi pm)'!$B$1, MATCH($A10,OFFSET('semaine paire (sans samedi pm)'!$B$1,MATCH(AF$2,'semaine paire (sans samedi pm)'!$B$1:$B$120,0)-1,1,12,1),0)-1+MATCH(AF$2,'semaine paire (sans samedi pm)'!$B$1:$B$120,0)-1,3,1,52), 1)),\"\")","v":""},""]
["Thibaut",{"$f":"IFERROR(HLOOKUP(\"z^z\",OFFSET('semaine paire (sans samedi pm)'!$B$1, MATCH($A11,OFFSET('semaine paire (sans samedi pm)'!$B$1,MATCH(B$2,'semaine paire (sans samedi pm)'!$B$1:$B$120,0)-1,1,12,1),0)-1+MATCH(B$2,'semaine paire (sans samedi pm)'!$B$1:$B$120,0)-1,3,1,52),1,1),\"\")","v":"L"},{"$f":"IFERROR(OFFSET('semaine paire (sans samedi pm)'!$D$2,,MATCH(B11,OFFSET('semaine paire (sans samedi pm)'!$B$1, MATCH($A11,OFFSET('semaine paire (sans samedi pm)'!$B$1,MATCH(B$2,'semaine paire (sans samedi pm)'!$B$1:$B$120,0)-1,1,12,1),0)-1+MATCH(B$2,'semaine paire (sans samedi pm)'!$B$1:$B$120,0)-1,3,1,52),0)),\"\")","v":"6h30-6h45"},"06:30:00",{"$f":"IFERROR(OFFSET('semaine paire (sans samedi pm)'!$D$2,,MATCH(\"z^z\",OFFSET('semaine paire (sans samedi pm)'!$B$1, MATCH($A11,OFFSET('semaine paire (sans samedi pm)'!$B$1,MATCH(B$2,'semaine paire (sans samedi pm)'!$B$1:$B$120,0)-1,1,12,1),0)-1+MATCH(B$2,'semaine paire (sans samedi pm)'!$B$1:$B$120,0)-1,3,1,52), 1)),\"\")","v":"12h45-13H"},"13:00:00",{"$f":"IFERROR(HLOOKUP(\"z^z\",OFFSET('semaine paire (sans samedi pm)'!$B$1, MATCH($A11,OFFSET('semaine paire (sans samedi pm)'!$B$1,MATCH(G$2,'semaine paire (sans samedi pm)'!$B$1:$B$120,0)-1,1,12,1),0)-1+MATCH(G$2,'semaine paire (sans samedi pm)'!$B$1:$B$120,0)-1,3,1,52),1,1),\"\")","v":"L"},{"$f":"IFERROR(OFFSET('semaine paire (sans samedi pm)'!$D$2,,MATCH(G11,OFFSET('semaine paire (sans samedi pm)'!$B$1, MATCH($A11,OFFSET('semaine paire (sans samedi pm)'!$B$1,MATCH(G$2,'semaine paire (sans samedi pm)'!$B$1:$B$120,0)-1,1,12,1),0)-1+MATCH(G$2,'semaine paire (sans samedi pm)'!$B$1:$B$120,0)-1,3,1,52),0)),\"\")","v":"6h30-6h45"},"6h30",{"$f":"IFERROR(OFFSET('semaine paire (sans samedi pm)'!$D$2,,MATCH(\"z^z\",OFFSET('semaine paire (sans samedi pm)'!$B$1, MATCH($A11,OFFSET('semaine paire (sans samedi pm)'!$B$1,MATCH(G$2,'semaine paire (sans samedi pm)'!$B$1:$B$120,0)-1,1,12,1),0)-1+MATCH(G$2,'semaine paire (sans samedi pm)'!$B$1:$B$120,0)-1,3,1,52), 1)),\"\")","v":"11h45-12H"},"12H",{"$f":"IFERROR(HLOOKUP(\"z^z\",OFFSET('semaine paire (sans samedi pm)'!$B$1, MATCH($A11,OFFSET('semaine paire (sans samedi pm)'!$B$1,MATCH(L$2,'semaine paire (sans samedi pm)'!$B$1:$B$120,0)-1,1,12,1),0)-1+MATCH(L$2,'semaine paire (sans samedi pm)'!$B$1:$B$120,0)-1,3,1,52),1,1),\"\")","v":"L"},{"$f":"IFERROR(OFFSET('semaine paire (sans samedi pm)'!$D$2,,MATCH(L11,OFFSET('semaine paire (sans samedi pm)'!$B$1, MATCH($A11,OFFSET('semaine paire (sans samedi pm)'!$B$1,MATCH(L$2,'semaine paire (sans samedi pm)'!$B$1:$B$120,0)-1,1,12,1),0)-1+MATCH(L$2,'semaine paire (sans samedi pm)'!$B$1:$B$120,0)-1,3,1,52),0)),\"\")","v":"7h30-7h45"},"7h30",{"$f":"IFERROR(OFFSET('semaine paire (sans samedi pm)'!$D$2,,MATCH(\"z^z\",OFFSET('semaine paire (sans samedi pm)'!$B$1, MATCH($A11,OFFSET('semaine paire (sans samedi pm)'!$B$1,MATCH(L$2,'semaine paire (sans samedi pm)'!$B$1:$B$120,0)-1,1,12,1),0)-1+MATCH(L$2,'semaine paire (sans samedi pm)'!$B$1:$B$120,0)-1,3,1,52), 1)),\"\")","v":"11h45-12H"},"12H",{"$f":"IFERROR(HLOOKUP(\"z^z\",OFFSET('semaine paire (sans samedi pm)'!$B$1, MATCH($A11,OFFSET('semaine paire (sans samedi pm)'!$B$1,MATCH(Q$2,'semaine paire (sans samedi pm)'!$B$1:$B$120,0)-1,1,12,1),0)-1+MATCH(Q$2,'semaine paire (sans samedi pm)'!$B$1:$B$120,0)-1,3,1,52),1,1),\"\")","v":"L"},{"$f":"IFERROR(OFFSET('semaine paire (sans samedi pm)'!$D$2,,MATCH(Q11,OFFSET('semaine paire (sans samedi pm)'!$B$1, MATCH($A11,OFFSET('semaine paire (sans samedi pm)'!$B$1,MATCH(Q$2,'semaine paire (sans samedi pm)'!$B$1:$B$120,0)-1,1,12,1),0)-1+MATCH(Q$2,'semaine paire (sans samedi pm)'!$B$1:$B$120,0)-1,3,1,52),0)),\"\")","v":"6h30-6h45"},"6h30",{"$f":"IFERROR(OFFSET('semaine paire (sans samedi pm)'!$D$2,,MATCH(\"z^z\",OFFSET('semaine paire (sans samedi pm)'!$B$1, MATCH($A11,OFFSET('semaine paire (sans samedi pm)'!$B$1,MATCH(Q$2,'semaine paire (sans samedi pm)'!$B$1:$B$120,0)-1,1,12,1),0)-1+MATCH(Q$2,'semaine paire (sans samedi pm)'!$B$1:$B$120,0)-1,3,1,52), 1)),\"\")","v":"12h30-12H45"},"12H45",{"$f":"IFERROR(HLOOKUP(\"z^z\",OFFSET('semaine paire (sans samedi pm)'!$B$1, MATCH($A11,OFFSET('semaine paire (sans samedi pm)'!$B$1,MATCH(V$2,'semaine paire (sans samedi pm)'!$B$1:$B$120,0)-1,1,12,1),0)-1+MATCH(V$2,'semaine paire (sans samedi pm)'!$B$1:$B$120,0)-1,3,1,52),1,1),\"\")","v":"L"},{"$f":"IFERROR(OFFSET('semaine paire (sans samedi pm)'!$D$2,,MATCH(V11,OFFSET('semaine paire (sans samedi pm)'!$B$1, MATCH($A11,OFFSET('semaine paire (sans samedi pm)'!$B$1,MATCH(V$2,'semaine paire (sans samedi pm)'!$B$1:$B$120,0)-1,1,12,1),0)-1+MATCH(V$2,'semaine paire (sans samedi pm)'!$B$1:$B$120,0)-1,3,1,52),0)),\"\")","v":"7h30-7h45"},"7h30",{"$f":"IFERROR(OFFSET('semaine paire (sans samedi pm)'!$D$2,,MATCH(\"z^z\",OFFSET('semaine paire (sans samedi pm)'!$B$1, MATCH($A11,OFFSET('semaine paire (sans samedi pm)'!$B$1,MATCH(V$2,'semaine paire (sans samedi pm)'!$B$1:$B$120,0)-1,1,12,1),0)-1+MATCH(V$2,'semaine paire (sans samedi pm)'!$B$1:$B$120,0)-1,3,1,52), 1)),\"\")","v":"17h45-18H"},"18H",{"$f":"IFERROR(HLOOKUP(\"z^z\",OFFSET('semaine paire (sans samedi pm)'!$B$1, MATCH($A11,OFFSET('semaine paire (sans samedi pm)'!$B$1,MATCH(AA$2,'semaine paire (sans samedi pm)'!$B$1:$B$120,0)-1,1,12,1),0)-1+MATCH(AA$2,'semaine paire (sans samedi pm)'!$B$1:$B$120,0)-1,3,1,52),1,1),\"\")","v":"L"},{"$f":"IFERROR(OFFSET('semaine paire (sans samedi pm)'!$D$2,,MATCH(AA11,OFFSET('semaine paire (sans samedi pm)'!$B$1, MATCH($A11,OFFSET('semaine paire (sans samedi pm)'!$B$1,MATCH(AA$2,'semaine paire (sans samedi pm)'!$B$1:$B$120,0)-1,1,12,1),0)-1+MATCH(AA$2,'semaine paire (sans samedi pm)'!$B$1:$B$120,0)-1,3,1,52),0)),\"\")","v":"7h-7h15"},"7h",{"$f":"IFERROR(OFFSET('semaine paire (sans samedi pm)'!$D$2,,MATCH(\"z^z\",OFFSET('semaine paire (sans samedi pm)'!$B$1, MATCH($A11,OFFSET('semaine paire (sans samedi pm)'!$B$1,MATCH(AA$2,'semaine paire (sans samedi pm)'!$B$1:$B$120,0)-1,1,12,1),0)-1+MATCH(AA$2,'semaine paire (sans samedi pm)'!$B$1:$B$120,0)-1,3,1,52), 1)),\"\")","v":"12h45-13H"},"13H",{"$f":"IFERROR(HLOOKUP(\"z^z\",OFFSET('semaine paire (sans samedi pm)'!$B$1, MATCH($A11,OFFSET('semaine paire (sans samedi pm)'!$B$1,MATCH(AF$2,'semaine paire (sans samedi pm)'!$B$1:$B$120,0)-1,1,12,1),0)-1+MATCH(AF$2,'semaine paire (sans samedi pm)'!$B$1:$B$120,0)-1,3,1,52),1,1),\"\")","v":""},{"$f":"IFERROR(OFFSET('semaine paire (sans samedi pm)'!$D$2,,MATCH(AF11,OFFSET('semaine paire (sans samedi pm)'!$B$1, MATCH($A11,OFFSET('semaine paire (sans samedi pm)'!$B$1,MATCH(AF$2,'semaine paire (sans samedi pm)'!$B$1:$B$120,0)-1,1,12,1),0)-1+MATCH(AF$2,'semaine paire (sans samedi pm)'!$B$1:$B$120,0)-1,3,1,52),0)),\"\")","v":""},"",{"$f":"IFERROR(OFFSET('semaine paire (sans samedi pm)'!$D$2,,MATCH(\"z^z\",OFFSET('semaine paire (sans samedi pm)'!$B$1, MATCH($A11,OFFSET('semaine paire (sans samedi pm)'!$B$1,MATCH(AF$2,'semaine paire (sans samedi pm)'!$B$1:$B$120,0)-1,1,12,1),0)-1+MATCH(AF$2,'semaine paire (sans samedi pm)'!$B$1:$B$120,0)-1,3,1,52), 1)),\"\")","v":""},""]
["Vanessa",{"$f":"IFERROR(HLOOKUP(\"z^z\",OFFSET('semaine paire (sans samedi pm)'!$B$1, MATCH($A12,OFFSET('semaine paire (sans samedi pm)'!$B$1,MATCH(B$2,'semaine paire (sans samedi pm)'!$B$1:$B$120,0)-1,1,12,1),0)-1+MATCH(B$2,'semaine paire (sans samedi pm)'!$B$1:$B$120,0)-1,3,1,52),1,1),\"\")","v":"D/MG"},{"$f":"IFERROR(OFFSET('semaine paire (sans samedi pm)'!$D$2,,MATCH(B12,OFFSET('semaine paire (sans samedi pm)'!$B$1, MATCH($A12,OFFSET('semaine paire (sans samedi pm)'!$B$1,MATCH(B$2,'semaine paire (sans samedi pm)'!$B$1:$B$120,0)-1,1,12,1),0)-1+MATCH(B$2,'semaine paire (sans samedi pm)'!$B$1:$B$120,0)-1,3,1,52),0)),\"\")","v":"9h30-9H45"},"09:30:00",{"$f":"IFERROR(OFFSET('semaine paire (sans samedi pm)'!$D$2,,MATCH(\"z^z\",OFFSET('semaine paire (sans samedi pm)'!$B$1, MATCH($A12,OFFSET('semaine paire (sans samedi pm)'!$B$1,MATCH(B$2,'semaine paire (sans samedi pm)'!$B$1:$B$120,0)-1,1,12,1),0)-1+MATCH(B$2,'semaine paire (sans samedi pm)'!$B$1:$B$120,0)-1,3,1,52), 1)),\"\")","v":"13H45-14H"},"14:00:00",{"$f":"IFERROR(HLOOKUP(\"z^z\",OFFSET('semaine paire (sans samedi pm)'!$B$1, MATCH($A12,OFFSET('semaine paire (sans samedi pm)'!$B$1,MATCH(G$2,'semaine paire (sans samedi pm)'!$B$1:$B$120,0)-1,1,12,1),0)-1+MATCH(G$2,'semaine paire (sans samedi pm)'!$B$1:$B$120,0)-1,3,1,52),1,1),\"\")","v":"D/MG"},{"$f":"IFERROR(OFFSET('semaine paire (sans samedi pm)'!$D$2,,MATCH(G12,OFFSET('semaine paire (sans samedi pm)'!$B$1, MATCH($A12,OFFSET('semaine paire (sans samedi pm)'!$B$1,MATCH(G$2,'semaine paire (sans samedi pm)'!$B$1:$B$120,0)-1,1,12,1),0)-1+MATCH(G$2,'semaine paire (sans samedi pm)'!$B$1:$B$120,0)-1,3,1,52),0)),\"\")","v":"7h30-7h45"},"7h30",{"$f":"IFERROR(OFFSET('semaine paire (sans samedi pm)'!$D$2,,MATCH(\"z^z\",OFFSET('semaine paire (sans samedi pm)'!$B$1, MATCH($A12,OFFSET('semaine paire (sans samedi pm)'!$B$1,MATCH(G$2,'semaine paire (sans samedi pm)'!$B$1:$B$120,0)-1,1,12,1),0)-1+MATCH(G$2,'semaine paire (sans samedi pm)'!$B$1:$B$120,0)-1,3,1,52), 1)),\"\")","v":"17h30-17h45"},"17h45",{"$f":"IFERROR(HLOOKUP(\"z^z\",OFFSET('semaine paire (sans samedi pm)'!$B$1, MATCH($A12,OFFSET('semaine paire (sans samedi pm)'!$B$1,MATCH(L$2,'semaine paire (sans samedi pm)'!$B$1:$B$120,0)-1,1,12,1),0)-1+MATCH(L$2,'semaine paire (sans samedi pm)'!$B$1:$B$120,0)-1,3,1,52),1,1),\"\")","v":""},{"$f":"IFERROR(OFFSET('semaine paire (sans samedi pm)'!$D$2,,MATCH(L12,OFFSET('semaine paire (sans samedi pm)'!$B$1, MATCH($A12,OFFSET('semaine paire (sans samedi pm)'!$B$1,MATCH(L$2,'semaine paire (sans samedi pm)'!$B$1:$B$120,0)-1,1,12,1),0)-1+MATCH(L$2,'semaine paire (sans samedi pm)'!$B$1:$B$120,0)-1,3,1,52),0)),\"\")","v":""},"",{"$f":"IFERROR(OFFSET('semaine paire (sans samedi pm)'!$D$2,,MATCH(\"z^z\",OFFSET('semaine paire (sans samedi pm)'!$B$1, MATCH($A12,OFFSET('semaine paire (sans samedi pm)'!$B$1,MATCH(L$2,'semaine paire (sans samedi pm)'!$B$1:$B$120,0)-1,1,12,1),0)-1+MATCH(L$2,'semaine paire (sans samedi pm)'!$B$1:$B$120,0)-1,3,1,52), 1)),\"\")","v":""},"",{"$f":"IFERROR(HLOOKUP(\"z^z\",OFFSET('semaine paire (sans samedi pm)'!$B$1, MATCH($A12,OFFSET('semaine paire (sans samedi pm)'!$B$1,MATCH(Q$2,'semaine paire (sans samedi pm)'!$B$1:$B$120,0)-1,1,12,1),0)-1+MATCH(Q$2,'semaine paire (sans samedi pm)'!$B$1:$B$120,0)-1,3,1,52),1,1),\"\")","v":"D/MG"},{"$f":"IFERROR(OFFSET('semaine paire (sans samedi pm)'!$D$2,,MATCH(Q12,OFFSET('semaine paire (sans samedi pm)'!$B$1, MATCH($A12,OFFSET('semaine paire (sans samedi pm)'!$B$1,MATCH(Q$2,'semaine paire (sans samedi pm)'!$B$1:$B$120,0)-1,1,12,1),0)-1+MATCH(Q$2,'semaine paire (sans samedi pm)'!$B$1:$B$120,0)-1,3,1,52),0)),\"\")","v":"9h30-9H45"},"9h30",{"$f":"IFERROR(OFFSET('semaine paire (sans samedi pm)'!$D$2,,MATCH(\"z^z\",OFFSET('semaine paire (sans samedi pm)'!$B$1, MATCH($A12,OFFSET('semaine paire (sans samedi pm)'!$B$1,MATCH(Q$2,'semaine paire (sans samedi pm)'!$B$1:$B$120,0)-1,1,12,1),0)-1+MATCH(Q$2,'semaine paire (sans samedi pm)'!$B$1:$B$120,0)-1,3,1,52), 1)),\"\")","v":"17h15-17h30"},"17h30",{"$f":"IFERROR(HLOOKUP(\"z^z\",OFFSET('semaine paire (sans samedi pm)'!$B$1, MATCH($A12,OFFSET('semaine paire (sans samedi pm)'!$B$1,MATCH(V$2,'semaine paire (sans samedi pm)'!$B$1:$B$120,0)-1,1,12,1),0)-1+MATCH(V$2,'semaine paire (sans samedi pm)'!$B$1:$B$120,0)-1,3,1,52),1,1),\"\")","v":"D/MG"},{"$f":"IFERROR(OFFSET('semaine paire (sans samedi pm)'!$D$2,,MATCH(V12,OFFSET('semaine paire (sans samedi pm)'!$B$1, MATCH($A12,OFFSET('semaine paire (sans samedi pm)'!$B$1,MATCH(V$2,'semaine paire (sans samedi pm)'!$B$1:$B$120,0)-1,1,12,1),0)-1+MATCH(V$2,'semaine paire (sans samedi pm)'!$B$1:$B$120,0)-1,3,1,52),0)),\"\")","v":"9h30-9H45"},"9h30",{"$f":"IFERROR(OFFSET('semaine paire (sans samedi pm)'!$D$2,,MATCH(\"z^z\",OFFSET('semaine paire (sans samedi pm)'!$B$1, MATCH($A12,OFFSET('semaine paire (sans samedi pm)'!$B$1,MATCH(V$2,'semaine paire (sans samedi pm)'!$B$1:$B$120,0)-1,1,12,1),0)-1+MATCH(V$2,'semaine paire (sans samedi pm)'!$B$1:$B$120,0)-1,3,1,52), 1)),\"\")","v":"15H-15H15"},"15H15",{"$f":"IFERROR(HLOOKUP(\"z^z\",OFFSET('semaine paire (sans samedi pm)'!$B$1, MATCH($A12,OFFSET('semaine paire (sans samedi pm)'!$B$1,MATCH(AA$2,'semaine paire (sans samedi pm)'!$B$1:$B$120,0)-1,1,12,1),0)-1+MATCH(AA$2,'semaine paire (sans samedi pm)'!$B$1:$B$120,0)-1,3,1,52),1,1),\"\")","v":"D/MG"},{"$f":"IFERROR(OFFSET('semaine paire (sans samedi pm)'!$D$2,,MATCH(AA12,OFFSET('semaine paire (sans samedi pm)'!$B$1, MATCH($A12,OFFSET('semaine paire (sans samedi pm)'!$B$1,MATCH(AA$2,'semaine paire (sans samedi pm)'!$B$1:$B$120,0)-1,1,12,1),0)-1+MATCH(AA$2,'semaine paire (sans samedi pm)'!$B$1:$B$120,0)-1,3,1,52),0)),\"\")","v":"9h30-9H45"},"9h30",{"$f":"IFERROR(OFFSET('semaine paire (sans samedi pm)'!$D$2,,MATCH(\"z^z\",OFFSET('semaine paire (sans samedi pm)'!$B$1, MATCH($A12,OFFSET('semaine paire (sans samedi pm)'!$B$1,MATCH(AA$2,'semaine paire (sans samedi pm)'!$B$1:$B$120,0)-1,1,12,1),0)-1+MATCH(AA$2,'semaine paire (sans samedi pm)'!$B$1:$B$120,0)-1,3,1,52), 1)),\"\")","v":"12h45-13H"},"13H",{"$f":"IFERROR(HLOOKUP(\"z^z\",OFFSET('semaine paire (sans samedi pm)'!$B$1, MATCH($A12,OFFSET('semaine paire (sans samedi pm)'!$B$1,MATCH(AF$2,'semaine paire (sans samedi pm)'!$B$1:$B$120,0)-1,1,12,1),0)-1+MATCH(AF$2,'semaine paire (sans samedi pm)'!$B$1:$B$120,0)-1,3,1,52),1,1),\"\")","v":""},{"$f":"IFERROR(OFFSET('semaine paire (sans samedi pm)'!$D$2,,MATCH(AF12,OFFSET('semaine paire (sans samedi pm)'!$B$1, MATCH($A12,OFFSET('semaine paire (sans samedi pm)'!$B$1,MATCH(AF$2,'semaine paire (sans samedi pm)'!$B$1:$B$120,0)-1,1,12,1),0)-1+MATCH(AF$2,'semaine paire (sans samedi pm)'!$B$1:$B$120,0)-1,3,1,52),0)),\"\")","v":""},"",{"$f":"IFERROR(OFFSET('semaine paire (sans samedi pm)'!$D$2,,MATCH(\"z^z\",OFFSET('semaine paire (sans samedi pm)'!$B$1, MATCH($A12,OFFSET('semaine paire (sans samedi pm)'!$B$1,MATCH(AF$2,'semaine paire (sans samedi pm)'!$B$1:$B$120,0)-1,1,12,1),0)-1+MATCH(AF$2,'semaine paire (sans samedi pm)'!$B$1:$B$120,0)-1,3,1,52), 1)),\"\")","v":""},""]
[]
[]
[null,"Horaires employés semaine impaire (avec samedi pm)"]
[null,"LUNDI",null,null,null,null,"MARDI",null,null,null,null,"MERCREDI",null,null,null,null,"JEUDI",null,null,null,null,"VENDREDI",null,null,null,null,"SAMEDI",null,null,null,null,"DIMANCHE"]
["Assiya",{"$f":"IFERROR(HLOOKUP(\"z^z\",OFFSET('semaine impaire (ac samedi pm)'!$B$1, MATCH($A17,OFFSET('semaine impaire (ac samedi pm)'!$B$1,MATCH(B$2,'semaine impaire (ac samedi pm)'!$B$1:$B$120,0)-1,1,12,1),0)-1+MATCH(B$2,'semaine impaire (ac samedi pm)'!$B$1:$B$120,0)-1,3,1,52),1,1),\"\")","v":"F"},{"$f":"IFERROR(OFFSET('semaine impaire (ac samedi pm)'!$D$2,,MATCH(B17,OFFSET('semaine impaire (ac samedi pm)'!$B$1, MATCH($A17,OFFSET('semaine impaire (ac samedi pm)'!$B$1,MATCH(B$2,'semaine impaire (ac samedi pm)'!$B$1:$B$120,0)-1,1,12,1),0)-1+MATCH(B$2,'semaine impaire (ac samedi pm)'!$B$1:$B$120,0)-1,3,1,52),0)),\"\")","v":"6h30-6h45"},{"$f":"IF(C17<>\"\",LEFT(C17,FIND(\"-\",C17)-1),\"\")","v":"6h30"},{"$f":"IFERROR(OFFSET('semaine impaire (ac samedi pm)'!$D$2,,MATCH(\"z^z\",OFFSET('semaine impaire (ac samedi pm)'!$B$1, MATCH($A17,OFFSET('semaine impaire (ac samedi pm)'!$B$1,MATCH(B$2,'semaine impaire (ac samedi pm)'!$B$1:$B$120,0)-1,1,12,1),0)-1+MATCH(B$2,'semaine impaire (ac samedi pm)'!$B$1:$B$120,0)-1,3,1,52), 1)),\"\")","v":"12h30-12H45"},{"$f":"IF(E17<>\"\",MID(E17,FIND(\"-\",E17)+1,10),\"\")","v":"12H45"},{"$f":"IFERROR(HLOOKUP(\"z^z\",OFFSET('semaine impaire (ac samedi pm)'!$B$1, MATCH($A17,OFFSET('semaine impaire (ac samedi pm)'!$B$1,MATCH(G$2,'semaine impaire (ac samedi pm)'!$B$1:$B$120,0)-1,1,12,1),0)-1+MATCH(G$2,'semaine impaire (ac samedi pm)'!$B$1:$B$120,0)-1,3,1,52),1,1),\"\")","v":"F"},{"$f":"IFERROR(OFFSET('semaine impaire (ac samedi pm)'!$D$2,,MATCH(G17,OFFSET('semaine impaire (ac samedi pm)'!$B$1, MATCH($A17,OFFSET('semaine impaire (ac samedi pm)'!$B$1,MATCH(G$2,'semaine impaire (ac samedi pm)'!$B$1:$B$120,0)-1,1,12,1),0)-1+MATCH(G$2,'semaine impaire (ac samedi pm)'!$B$1:$B$120,0)-1,3,1,52),0)),\"\")","v":"6h30-6h45"},{"$f":"IF(H17<>\"\",LEFT(H17,FIND(\"-\",H17)-1),\"\")","v":"6h30"},{"$f":"IFERROR(OFFSET('semaine impaire (ac samedi pm)'!$D$2,,MATCH(\"z^z\",OFFSET('semaine impaire (ac samedi pm)'!$B$1, MATCH($A17,OFFSET('semaine impaire (ac samedi pm)'!$B$1,MATCH(G$2,'semaine impaire (ac samedi pm)'!$B$1:$B$120,0)-1,1,12,1),0)-1+MATCH(G$2,'semaine impaire (ac samedi pm)'!$B$1:$B$120,0)-1,3,1,52), 1)),\"\")","v":"12h-12H15"},{"$f":"IF(J17<>\"\",MID(J17,FIND(\"-\",J17)+1,10),\"\")","v":"12H15"},{"$f":"IFERROR(HLOOKUP(\"z^z\",OFFSET('semaine impaire (ac samedi pm)'!$B$1, MATCH($A17,OFFSET('semaine impaire (ac samedi pm)'!$B$1,MATCH(L$2,'semaine impaire (ac samedi pm)'!$B$1:$B$120,0)-1,1,12,1),0)-1+MATCH(L$2,'semaine impaire (ac samedi pm)'!$B$1:$B$120,0)-1,3,1,52),1,1),\"\")","v":"F"},{"$f":"IFERROR(OFFSET('semaine impaire (ac samedi pm)'!$D$2,,MATCH(L17,OFFSET('semaine impaire (ac samedi pm)'!$B$1, MATCH($A17,OFFSET('semaine impaire (ac samedi pm)'!$B$1,MATCH(L$2,'semaine impaire (ac samedi pm)'!$B$1:$B$120,0)-1,1,12,1),0)-1+MATCH(L$2,'semaine impaire (ac samedi pm)'!$B$1:$B$120,0)-1,3,1,52),0)),\"\")","v":"6h30-6h45"},{"$f":"IF(M17<>\"\",LEFT(M17,FIND(\"-\",M17)-1),\"\")","v":"6h30"},{"$f":"IFERROR(OFFSET('semaine impaire (ac samedi pm)'!$D$2,,MATCH(\"z^z\",OFFSET('semaine impaire (ac samedi pm)'!$B$1, MATCH($A17,OFFSET('semaine impaire (ac samedi pm)'!$B$1,MATCH(L$2,'semaine impaire (ac samedi pm)'!$B$1:$B$120,0)-1,1,12,1),0)-1+MATCH(L$2,'semaine impaire (ac samedi pm)'!$B$1:$B$120,0)-1,3,1,52), 1)),\"\")","v":"11h15-11H30"},{"$f":"IF(O17<>\"\",MID(O17,FIND(\"-\",O17)+1,10),\"\")","v":"11H30"},{"$f":"IFERROR(HLOOKUP(\"z^z\",OFFSET('semaine impaire (ac samedi pm)'!$B$1, MATCH($A17,OFFSET('semaine impaire (ac samedi pm)'!$B$1,MATCH(Q$2,'semaine impaire (ac samedi pm)'!$B$1:$B$120,0)-1,1,12,1),0)-1+MATCH(Q$2,'semaine impaire (ac samedi pm)'!$B$1:$B$120,0)-1,3,1,52),1,1),\"\")","v":"F"},{"$f":"IFERROR(OFFSET('semaine impaire (ac samedi pm)'!$D$2,,MATCH(Q17,OFFSET('semaine impaire (ac samedi pm)'!$B$1, MATCH($A17,OFFSET('semaine impaire (ac samedi pm)'!$B$1,MATCH(Q$2,'semaine impaire (ac samedi pm)'!$B$1:$B$120,0)-1,1,12,1),0)-1+MATCH(Q$2,'semaine impaire (ac samedi pm)'!$B$1:$B$120,0)-1,3,1,52),0)),\"\")","v":"6h30-6h45"},{"$f":"IF(R17<>\"\",LEFT(R17,FIND(\"-\",R17)-1),\"\")","v":"6h30"},{"$f":"IFERROR(OFFSET('semaine impaire (ac samedi pm)'!$D$2,,MATCH(\"z^z\",OFFSET('semaine impaire (ac samedi pm)'!$B$1, MATCH($A17,OFFSET('semaine impaire (ac samedi pm)'!$B$1,MATCH(Q$2,'semaine impaire (ac samedi pm)'!$B$1:$B$120,0)-1,1,12,1),0)-1+MATCH(Q$2,'semaine impaire (ac samedi pm)'!$B$1:$B$120,0)-1,3,1,52), 1)),\"\")","v":"12h45-13H"},{"$f":"IF(T17<>\"\",MID(T17,FIND(\"-\",T17)+1,10),\"\")","v":"13H"},{"$f":"IFERROR(HLOOKUP(\"z^z\",OFFSET('semaine impaire (ac samedi pm)'!$B$1, MATCH($A17,OFFSET('semaine impaire (ac samedi pm)'!$B$1,MATCH(V$2,'semaine impaire (ac samedi pm)'!$B$1:$B$120,0)-1,1,12,1),0)-1+MATCH(V$2,'semaine impaire (ac samedi pm)'!$B$1:$B$120,0)-1,3,1,52),1,1),\"\")","v":"F"},{"$f":"IFERROR(OFFSET('semaine impaire (ac samedi pm)'!$D$2,,MATCH(V17,OFFSET('semaine impaire (ac samedi pm)'!$B$1, MATCH($A17,OFFSET('semaine impaire (ac samedi pm)'!$B$1,MATCH(V$2,'semaine impaire (ac samedi pm)'!$B$1:$B$120,0)-1,1,12,1),0)-1+MATCH(V$2,'semaine impaire (ac samedi pm)'!$B$1:$B$120,0)-1,3,1,52),0)),\"\")","v":"6h30-6h45"},{"$f":"IF(W17<>\"\",LEFT(W17,FIND(\"-\",W17)-1),\"\")","v":"6h30"},{"$f":"IFERROR(OFFSET('semaine impaire (ac samedi pm)'!$D$2,,MATCH(\"z^z\",OFFSET('semaine impaire (ac samedi pm)'!$B$1, MATCH($A17,OFFSET('semaine impaire (ac samedi pm)'!$B$1,MATCH(V$2,'semaine impaire (ac samedi pm)'!$B$1:$B$120,0)-1,1,12,1),0)-1+MATCH(V$2,'semaine impaire (ac samedi pm)'!$B$1:$B$120,0)-1,3,1,52), 1)),\"\")","v":"10h45-11H"},{"$f":"IF(Y17<>\"\",MID(Y17,FIND(\"-\",Y17)+1,10),\"\")","v":"11H"},{"$f":"IFERROR(HLOOKUP(\"z^z\",OFFSET('semaine impaire (ac samedi pm)'!$B$1, MATCH($A17,OFFSET('semaine impaire (ac samedi pm)'!$B$1,MATCH(AA$2,'semaine impaire (ac samedi pm)'!$B$1:$B$120,0)-1,1,12,1),0)-1+MATCH(AA$2,'semaine impaire (ac samedi pm)'!$B$1:$B$120,0)-1,3,1,52),1,1),\"\")","v":"F"},{"$f":"IFERROR(OFFSET('semaine impaire (ac samedi pm)'!$D$2,,MATCH(AA17,OFFSET('semaine impaire (ac samedi pm)'!$B$1, MATCH($A17,OFFSET('semaine impaire (ac samedi pm)'!$B$1,MATCH(AA$2,'semaine impaire (ac samedi pm)'!$B$1:$B$120,0)-1,1,12,1),0)-1+MATCH(AA$2,'semaine impaire (ac samedi pm)'!$B$1:$B$120,0)-1,3,1,52),0)),\"\")","v":"6h30-6h45"},{"$f":"IF(AB17<>\"\",LEFT(AB17,FIND(\"-\",AB17)-1),\"\")","v":"6h30"},{"$f":"IFERROR(OFFSET('semaine impaire (ac samedi pm)'!$D$2,,MATCH(\"z^z\",OFFSET('semaine impaire (ac samedi pm)'!$B$1, MATCH($A17,OFFSET('semaine impaire (ac samedi pm)'!$B$1,MATCH(AA$2,'semaine impaire (ac samedi pm)'!$B$1:$B$120,0)-1,1,12,1),0)-1+MATCH(AA$2,'semaine impaire (ac samedi pm)'!$B$1:$B$120,0)-1,3,1,52), 1)),\"\")","v":"17h15-17h30"},{"$f":"IF(AD17<>\"\",MID(AD17,FIND(\"-\",AD17)+1,10),\"\")","v":"17h30"},{"$f":"IFERROR(HLOOKUP(\"z^z\",OFFSET('semaine impaire (ac samedi pm)'!$B$1, MATCH($A17,OFFSET('semaine impaire (ac samedi pm)'!$B$1,MATCH(AF$2,'semaine impaire (ac samedi pm)'!$B$1:$B$120,0)-1,1,12,1),0)-1+MATCH(AF$2,'semaine impaire (ac samedi pm)'!$B$1:$B$120,0)-1,3,1,52),1,1),\"\")","v":""},{"$f":"IFERROR(OFFSET('semaine impaire (ac samedi pm)'!$D$2,,MATCH(AF17,OFFSET('semaine impaire (ac samedi pm)'!$B$1, MATCH($A17,OFFSET('semaine impaire (ac samedi pm)'!$B$1,MATCH(AF$2,'semaine impaire (ac samedi pm)'!$B$1:$B$120,0)-1,1,12,1),0)-1+MATCH(AF$2,'semaine impaire (ac samedi pm)'!$B$1:$B$120,0)-1,3,1,52),0)),\"\")","v":""},{"$f":"IF(AG17<>\"\",LEFT(AG17,FIND(\"-\",AG17)-1),\"\")","v":""},{"$f":"IFERROR(OFFSET('semaine impaire (ac samedi pm)'!$D$2,,MATCH(\"z^z\",OFFSET('semaine impaire (ac samedi pm)'!$B$1, MATCH($A17,OFFSET('semaine impaire (ac samedi pm)'!$B$1,MATCH(AF$2,'semaine impaire (ac samedi pm)'!$B$1:$B$120,0)-1,1,12,1),0)-1+MATCH(AF$2,'semaine impaire (ac samedi pm)'!$B$1:$B$120,0)-1,3,1,52), 1)),\"\")","v":""},{"$f":"IF(AI17<>\"\",MID(AI17,FIND(\"-\",AI17)+1,10),\"\")","v":""}]
["Aurore",{"$f":"IFERROR(HLOOKUP(\"z^z\",OFFSET('semaine impaire (ac samedi pm)'!$B$1, MATCH($A18,OFFSET('semaine impaire (ac samedi pm)'!$B$1,MATCH(B$2,'semaine impaire (ac samedi pm)'!$B$1:$B$120,0)-1,1,12,1),0)-1+MATCH(B$2,'semaine impaire (ac samedi pm)'!$B$1:$B$120,0)-1,3,1,52),1,1),\"\")","v":"S"},{"$f":"IFERROR(OFFSET('semaine impaire (ac samedi pm)'!$D$2,,MATCH(B18,OFFSET('semaine impaire (ac samedi pm)'!$B$1, MATCH($A18,OFFSET('semaine impaire (ac samedi pm)'!$B$1,MATCH(B$2,'semaine impaire (ac samedi pm)'!$B$1:$B$120,0)-1,1,12,1),0)-1+MATCH(B$2,'semaine impaire (ac samedi pm)'!$B$1:$B$120,0)-1,3,1,52),0)),\"\")","v":"7h-7h15"},{"$f":"IF(C18<>\"\",LEFT(C18,FIND(\"-\",C18)-1),\"\")","v":"7h"},{"$f":"IFERROR(OFFSET('semaine impaire (ac samedi pm)'!$D$2,,MATCH(\"z^z\",OFFSET('semaine impaire (ac samedi pm)'!$B$1, MATCH($A18,OFFSET('semaine impaire (ac samedi pm)'!$B$1,MATCH(B$2,'semaine impaire (ac samedi pm)'!$B$1:$B$120,0)-1,1,12,1),0)-1+MATCH(B$2,'semaine impaire (ac samedi pm)'!$B$1:$B$120,0)-1,3,1,52), 1)),\"\")","v":"12h45-13H"},{"$f":"IF(E18<>\"\",MID(E18,FIND(\"-\",E18)+1,10),\"\")","v":"13H"},{"$f":"IFERROR(HLOOKUP(\"z^z\",OFFSET('semaine impaire (ac samedi pm)'!$B$1, MATCH($A18,OFFSET('semaine impaire (ac samedi pm)'!$B$1,MATCH(G$2,'semaine impaire (ac samedi pm)'!$B$1:$B$120,0)-1,1,12,1),0)-1+MATCH(G$2,'semaine impaire (ac samedi pm)'!$B$1:$B$120,0)-1,3,1,52),1,1),\"\")","v":"S"},{"$f":"IFERROR(OFFSET('semaine impaire (ac samedi pm)'!$D$2,,MATCH(G18,OFFSET('semaine impaire (ac samedi pm)'!$B$1, MATCH($A18,OFFSET('semaine impaire (ac samedi pm)'!$B$1,MATCH(G$2,'semaine impaire (ac samedi pm)'!$B$1:$B$120,0)-1,1,12,1),0)-1+MATCH(G$2,'semaine impaire (ac samedi pm)'!$B$1:$B$120,0)-1,3,1,52),0)),\"\")","v":"7h-7h15"},{"$f":"IF(H18<>\"\",LEFT(H18,FIND(\"-\",H18)-1),\"\")","v":"7h"},{"$f":"IFERROR(OFFSET('semaine impaire (ac samedi pm)'!$D$2,,MATCH(\"z^z\",OFFSET('semaine impaire (ac samedi pm)'!$B$1, MATCH($A18,OFFSET('semaine impaire (ac samedi pm)'!$B$1,MATCH(G$2,'semaine impaire (ac samedi pm)'!$B$1:$B$120,0)-1,1,12,1),0)-1+MATCH(G$2,'semaine impaire (ac samedi pm)'!$B$1:$B$120,0)-1,3,1,52), 1)),\"\")","v":"11h45-12H"},{"$f":"IF(J18<>\"\",MID(J18,FIND(\"-\",J18)+1,10),\"\")","v":"12H"},{"$f":"IFERROR(HLOOKUP(\"z^z\",OFFSET('semaine impaire (ac samedi pm)'!$B$1, MATCH($A18,OFFSET('semaine impaire (ac samedi pm)'!$B$1,MATCH(L$2,'semaine impaire (ac samedi pm)'!$B$1:$B$120,0)-1,1,12,1),0)-1+MATCH(L$2,'semaine impaire (ac samedi pm)'!$B$1:$B$120,0)-1,3,1,52),1,1),\"\")","v":"S"},{"$f":"IFERROR(OFFSET('semaine impaire (ac samedi pm)'!$D$2,,MATCH(L18,OFFSET('semaine impaire (ac samedi pm)'!$B$1, MATCH($A18,OFFSET('semaine impaire (ac samedi pm)'!$B$1,MATCH(L$2,'semaine impaire (ac samedi pm)'!$B$1:$B$120,0)-1,1,12,1),0)-1+MATCH(L$2,'semaine impaire (ac samedi pm)'!$B$1:$B$120,0)-1,3,1,52),0)),\"\")","v":"7h-7h15"},{"$f":"IF(M18<>\"\",LEFT(M18,FIND(\"-\",M18)-1),\"\")","v":"7h"},{"$f":"IFERROR(OFFSET('semaine impaire (ac samedi pm)'!$D$2,,MATCH(\"z^z\",OFFSET('semaine impaire (ac samedi pm)'!$B$1, MATCH($A18,OFFSET('semaine impaire (ac samedi pm)'!$B$1,MATCH(L$2,'semaine impaire (ac samedi pm)'!$B$1:$B$120,0)-1,1,12,1),0)-1+MATCH(L$2,'semaine impaire (ac samedi pm)'!$B$1:$B$120,0)-1,3,1,52), 1)),\"\")","v":"9h45-10H"},{"$f":"IF(O18<>\"\",MID(O18,FIND(\"-\",O18)+1,10),\"\")","v":"10H"},{"$f":"IFERROR(HLOOKUP(\"z^z\",OFFSET('semaine impaire (ac samedi pm)'!$B$1, MATCH($A18,OFFSET('semaine impaire (ac samedi pm)'!$B$1,MATCH(Q$2,'semaine impaire (ac samedi pm)'!$B$1:$B$120,0)-1,1,12,1),0)-1+MATCH(Q$2,'semaine impaire (ac samedi pm)'!$B$1:$B$120,0)-1,3,1,52),1,1),\"\")","v":"S"},{"$f":"IFERROR(OFFSET('semaine impaire (ac samedi pm)'!$D$2,,MATCH(Q18,OFFSET('semaine impaire (ac samedi pm)'!$B$1, MATCH($A18,OFFSET('semaine impaire (ac samedi pm)'!$B$1,MATCH(Q$2,'semaine impaire (ac samedi pm)'!$B$1:$B$120,0)-1,1,12,1),0)-1+MATCH(Q$2,'semaine impaire (ac samedi pm)'!$B$1:$B$120,0)-1,3,1,52),0)),\"\")","v":"7h-7h15"},{"$f":"IF(R18<>\"\",LEFT(R18,FIND(\"-\",R18)-1),\"\")","v":"7h"},{"$f":"IFERROR(OFFSET('semaine impaire (ac samedi pm)'!$D$2,,MATCH(\"z^z\",OFFSET('semaine impaire (ac samedi pm)'!$B$1, MATCH($A18,OFFSET('semaine impaire (ac samedi pm)'!$B$1,MATCH(Q$2,'semaine impaire (ac samedi pm)'!$B$1:$B$120,0)-1,1,12,1),0)-1+MATCH(Q$2,'semaine impaire (ac samedi pm)'!$B$1:$B$120,0)-1,3,1,52), 1)),\"\")","v":"12h45-13H"},{"$f":"IF(T18<>\"\",MID(T18,FIND(\"-\",T18)+1,10),\"\")","v":"13H"},{"$f":"IFERROR(HLOOKUP(\"z^z\",OFFSET('semaine impaire (ac samedi pm)'!$B$1, MATCH($A18,OFFSET('semaine impaire (ac samedi pm)'!$B$1,MATCH(V$2,'semaine impaire (ac samedi pm)'!$B$1:$B$120,0)-1,1,12,1),0)-1+MATCH(V$2,'semaine impaire (ac samedi pm)'!$B$1:$B$120,0)-1,3,1,52),1,1),\"\")","v":"S"},{"$f":"IFERROR(OFFSET('semaine impaire (ac samedi pm)'!$D$2,,MATCH(V18,OFFSET('semaine impaire (ac samedi pm)'!$B$1, MATCH($A18,OFFSET('semaine impaire (ac samedi pm)'!$B$1,MATCH(V$2,'semaine impaire (ac samedi pm)'!$B$1:$B$120,0)-1,1,12,1),0)-1+MATCH(V$2,'semaine impaire (ac samedi pm)'!$B$1:$B$120,0)-1,3,1,52),0)),\"\")","v":"7h-7h15"},{"$f":"IF(W18<>\"\",LEFT(W18,FIND(\"-\",W18)-1),\"\")","v":"7h"},{"$f":"IFERROR(OFFSET('semaine impaire (ac samedi pm)'!$D$2,,MATCH(\"z^z\",OFFSET('semaine impaire (ac samedi pm)'!$B$1, MATCH($A18,OFFSET('semaine impaire (ac samedi pm)'!$B$1,MATCH(V$2,'semaine impaire (ac samedi pm)'!$B$1:$B$120,0)-1,1,12,1),0)-1+MATCH(V$2,'semaine impaire (ac samedi pm)'!$B$1:$B$120,0)-1,3,1,52), 1)),\"\")","v":"11h45-12H"},{"$f":"IF(Y18<>\"\",MID(Y18,FIND(\"-\",Y18)+1,10),\"\")","v":"12H"},{"$f":"IFERROR(HLOOKUP(\"z^z\",OFFSET('semaine impaire (ac samedi pm)'!$B$1, MATCH($A18,OFFSET('semaine impaire (ac samedi pm)'!$B$1,MATCH(AA$2,'semaine impaire (ac samedi pm)'!$B$1:$B$120,0)-1,1,12,1),0)-1+MATCH(AA$2,'semaine impaire (ac samedi pm)'!$B$1:$B$120,0)-1,3,1,52),1,1),\"\")","v":"S"},{"$f":"IFERROR(OFFSET('semaine impaire (ac samedi pm)'!$D$2,,MATCH(AA18,OFFSET('semaine impaire (ac samedi pm)'!$B$1, MATCH($A18,OFFSET('semaine impaire (ac samedi pm)'!$B$1,MATCH(AA$2,'semaine impaire (ac samedi pm)'!$B$1:$B$120,0)-1,1,12,1),0)-1+MATCH(AA$2,'semaine impaire (ac samedi pm)'!$B$1:$B$120,0)-1,3,1,52),0)),\"\")","v":"14H-14H15"},{"$f":"IF(AB18<>\"\",LEFT(AB18,FIND(\"-\",AB18)-1),\"\")","v":"14H"},{"$f":"IFERROR(OFFSET('semaine impaire (ac samedi pm)'!$D$2,,MATCH(\"z^z\",OFFSET('semaine impaire (ac samedi pm)'!$B$1, MATCH($A18,OFFSET('semaine impaire (ac samedi pm)'!$B$1,MATCH(AA$2,'semaine impaire (ac samedi pm)'!$B$1:$B$120,0)-1,1,12,1),0)-1+MATCH(AA$2,'semaine impaire (ac samedi pm)'!$B$1:$B$120,0)-1,3,1,52), 1)),\"\")","v":"18h45-19h"},{"$f":"IF(AD18<>\"\",MID(AD18,FIND(\"-\",AD18)+1,10),\"\")","v":"19h"},{"$f":"IFERROR(HLOOKUP(\"z^z\",OFFSET('semaine impaire (ac samedi pm)'!$B$1, MATCH($A18,OFFSET('semaine impaire (ac samedi pm)'!$B$1,MATCH(AF$2,'semaine impaire (ac samedi pm)'!$B$1:$B$120,0)-1,1,12,1),0)-1+MATCH(AF$2,'semaine impaire (ac samedi pm)'!$B$1:$B$120,0)-1,3,1,52),1,1),\"\")","v":""},{"$f":"IFERROR(OFFSET('semaine impaire (ac samedi pm)'!$D$2,,MATCH(AF18,OFFSET('semaine impaire (ac samedi pm)'!$B$1, MATCH($A18,OFFSET('semaine impaire (ac samedi pm)'!$B$1,MATCH(AF$2,'semaine impaire (ac samedi pm)'!$B$1:$B$120,0)-1,1,12,1),0)-1+MATCH(AF$2,'semaine impaire (ac samedi pm)'!$B$1:$B$120,0)-1,3,1,52),0)),\"\")","v":""},{"$f":"IF(AG18<>\"\",LEFT(AG18,FIND(\"-\",AG18)-1),\"\")","v":""},{"$f":"IFERROR(OFFSET('semaine impaire (ac samedi pm)'!$D$2,,MATCH(\"z^z\",OFFSET('semaine impaire (ac samedi pm)'!$B$1, MATCH($A18,OFFSET('semaine impaire (ac samedi pm)'!$B$1,MATCH(AF$2,'semaine impaire (ac samedi pm)'!$B$1:$B$120,0)-1,1,12,1),0)-1+MATCH(AF$2,'semaine impaire (ac samedi pm)'!$B$1:$B$120,0)-1,3,1,52), 1)),\"\")","v":""},{"$f":"IF(AI18<>\"\",MID(AI18,FIND(\"-\",AI18)+1,10),\"\")","v":""}]
["Bertrand",{"$f":"IFERROR(HLOOKUP(\"z^z\",OFFSET('semaine impaire (ac samedi pm)'!$B$1, MATCH($A19,OFFSET('semaine impaire (ac samedi pm)'!$B$1,MATCH(B$2,'semaine impaire (ac samedi pm)'!$B$1:$B$120,0)-1,1,12,1),0)-1+MATCH(B$2,'semaine impaire (ac samedi pm)'!$B$1:$B$120,0)-1,3,1,52),1,1),\"\")","v":"S"},{"$f":"IFERROR(OFFSET('semaine impaire (ac samedi pm)'!$D$2,,MATCH(B19,OFFSET('semaine impaire (ac samedi pm)'!$B$1, MATCH($A19,OFFSET('semaine impaire (ac samedi pm)'!$B$1,MATCH(B$2,'semaine impaire (ac samedi pm)'!$B$1:$B$120,0)-1,1,12,1),0)-1+MATCH(B$2,'semaine impaire (ac samedi pm)'!$B$1:$B$120,0)-1,3,1,52),0)),\"\")","v":"9h30-9H45"},"9h30",{"$f":"IFERROR(OFFSET('semaine impaire (ac samedi pm)'!$D$2,,MATCH(\"z^z\",OFFSET('semaine impaire (ac samedi pm)'!$B$1, MATCH($A19,OFFSET('semaine impaire (ac samedi pm)'!$B$1,MATCH(B$2,'semaine impaire (ac samedi pm)'!$B$1:$B$120,0)-1,1,12,1),0)-1+MATCH(B$2,'semaine impaire (ac samedi pm)'!$B$1:$B$120,0)-1,3,1,52), 1)),\"\")","v":"13H45-14H"},"14H",{"$f":"IFERROR(HLOOKUP(\"z^z\",OFFSET('semaine impaire (ac samedi pm)'!$B$1, MATCH($A19,OFFSET('semaine impaire (ac samedi pm)'!$B$1,MATCH(G$2,'semaine impaire (ac samedi pm)'!$B$1:$B$120,0)-1,1,12,1),0)-1+MATCH(G$2,'semaine impaire (ac samedi pm)'!$B$1:$B$120,0)-1,3,1,52),1,1),\"\")","v":""},{"$f":"IFERROR(OFFSET('semaine impaire (ac samedi pm)'!$D$2,,MATCH(G19,OFFSET('semaine impaire (ac samedi pm)'!$B$1, MATCH($A19,OFFSET('semaine impaire (ac samedi pm)'!$B$1,MATCH(G$2,'semaine impaire (ac samedi pm)'!$B$1:$B$120,0)-1,1,12,1),0)-1+MATCH(G$2,'semaine impaire (ac samedi pm)'!$B$1:$B$120,0)-1,3,1,52),0)),\"\")","v":""},"",{"$f":"IFERROR(OFFSET('semaine impaire (ac samedi pm)'!$D$2,,MATCH(\"z^z\",OFFSET('semaine impaire (ac samedi pm)'!$B$1, MATCH($A19,OFFSET('semaine impaire (ac samedi pm)'!$B$1,MATCH(G$2,'semaine impaire (ac samedi pm)'!$B$1:$B$120,0)-1,1,12,1),0)-1+MATCH(G$2,'semaine impaire (ac samedi pm)'!$B$1:$B$120,0)-1,3,1,52), 1)),\"\")","v":""},"",{"$f":"IFERROR(HLOOKUP(\"z^z\",OFFSET('semaine impaire (ac samedi pm)'!$B$1, MATCH($A19,OFFSET('semaine impaire (ac samedi pm)'!$B$1,MATCH(L$2,'semaine impaire (ac samedi pm)'!$B$1:$B$120,0)-1,1,12,1),0)-1+MATCH(L$2,'semaine impaire (ac samedi pm)'!$B$1:$B$120,0)-1,3,1,52),1,1),\"\")","v":"S"},{"$f":"IFERROR(OFFSET('semaine impaire (ac samedi pm)'!$D$2,,MATCH(L19,OFFSET('semaine impaire (ac samedi pm)'!$B$1, MATCH($A19,OFFSET('semaine impaire (ac samedi pm)'!$B$1,MATCH(L$2,'semaine impaire (ac samedi pm)'!$B$1:$B$120,0)-1,1,12,1),0)-1+MATCH(L$2,'semaine impaire (ac samedi pm)'!$B$1:$B$120,0)-1,3,1,52),0)),\"\")","v":"14H-14H15"},"14H",{"$f":"IFERROR(OFFSET('semaine impaire (ac samedi pm)'!$D$2,,MATCH(\"z^z\",OFFSET('semaine impaire (ac samedi pm)'!$B$1, MATCH($A19,OFFSET('semaine impaire (ac samedi pm)'!$B$1,MATCH(L$2,'semaine impaire (ac samedi pm)'!$B$1:$B$120,0)-1,1,12,1),0)-1+MATCH(L$2,'semaine impaire (ac samedi pm)'!$B$1:$B$120,0)-1,3,1,52), 1)),\"\")","v":"17h15-17h30"},"17h30",{"$f":"IFERROR(HLOOKUP(\"z^z\",OFFSET('semaine impaire (ac samedi pm)'!$B$1, MATCH($A19,OFFSET('semaine impaire (ac samedi pm)'!$B$1,MATCH(Q$2,'semaine impaire (ac samedi pm)'!$B$1:$B$120,0)-1,1,12,1),0)-1+MATCH(Q$2,'semaine impaire (ac samedi pm)'!$B$1:$B$120,0)-1,3,1,52),1,1),\"\")","v":"S"},{"$f":"IFERROR(OFFSET('semaine impaire (ac samedi pm)'!$D$2,,MATCH(Q19,OFFSET('semaine impaire (ac samedi pm)'!$B$1, MATCH($A19,OFFSET('semaine impaire (ac samedi pm)'!$B$1,MATCH(Q$2,'semaine impaire (ac samedi pm)'!$B$1:$B$120,0)-1,1,12,1),0)-1+MATCH(Q$2,'semaine impaire (ac samedi pm)'!$B$1:$B$120,0)-1,3,1,52),0)),\"\")","v":"9h30-9H45"},"9h30",{"$f":"IFERROR(OFFSET('semaine impaire (ac samedi pm)'!$D$2,,MATCH(\"z^z\",OFFSET('semaine impaire (ac samedi pm)'!$B$1, MATCH($A19,OFFSET('semaine impaire (ac samedi pm)'!$B$1,MATCH(Q$2,'semaine impaire (ac samedi pm)'!$B$1:$B$120,0)-1,1,12,1),0)-1+MATCH(Q$2,'semaine impaire (ac samedi pm)'!$B$1:$B$120,0)-1,3,1,52), 1)),\"\")","v":"13H45-14H"},"14H",{"$f":"IFERROR(HLOOKUP(\"z^z\",OFFSET('semaine impaire (ac samedi pm)'!$B$1, MATCH($A19,OFFSET('semaine impaire (ac samedi pm)'!$B$1,MATCH(V$2,'semaine impaire (ac samedi pm)'!$B$1:$B$120,0)-1,1,12,1),0)-1+MATCH(V$2,'semaine impaire (ac samedi pm)'!$B$1:$B$120,0)-1,3,1,52),1,1),\"\")","v":"S"},{"$f":"IFERROR(OFFSET('semaine impaire (ac samedi pm)'!$D$2,,MATCH(V19,OFFSET('semaine impaire (ac samedi pm)'!$B$1, MATCH($A19,OFFSET('semaine impaire (ac samedi pm)'!$B$1,MATCH(V$2,'semaine impaire (ac samedi pm)'!$B$1:$B$120,0)-1,1,12,1),0)-1+MATCH(V$2,'semaine impaire (ac samedi pm)'!$B$1:$B$120,0)-1,3,1,52),0)),\"\")","v":"13h-13H15"},"13h",{"$f":"IFERROR(OFFSET('semaine impaire (ac samedi pm)'!$D$2,,MATCH(\"z^z\",OFFSET('semaine impaire (ac samedi pm)'!$B$1, MATCH($A19,OFFSET('semaine impaire (ac samedi pm)'!$B$1,MATCH(V$2,'semaine impaire (ac samedi pm)'!$B$1:$B$120,0)-1,1,12,1),0)-1+MATCH(V$2,'semaine impaire (ac samedi pm)'!$B$1:$B$120,0)-1,3,1,52), 1)),\"\")","v":"17h15-17h30"},"17h30",{"$f":"IFERROR(HLOOKUP(\"z^z\",OFFSET('semaine impaire (ac samedi pm)'!$B$1, MATCH($A19,OFFSET('semaine impaire (ac samedi pm)'!$B$1,MATCH(AA$2,'semaine impaire (ac samedi pm)'!$B$1:$B$120,0)-1,1,12,1),0)-1+MATCH(AA$2,'semaine impaire (ac samedi pm)'!$B$1:$B$120,0)-1,3,1,52),1,1),\"\")","v":"S"},{"$f":"IFERROR(OFFSET('semaine impaire (ac samedi pm)'!$D$2,,MATCH(AA19,OFFSET('semaine impaire (ac samedi pm)'!$B$1, MATCH($A19,OFFSET('semaine impaire (ac samedi pm)'!$B$1,MATCH(AA$2,'semaine impaire (ac samedi pm)'!$B$1:$B$120,0)-1,1,12,1),0)-1+MATCH(AA$2,'semaine impaire (ac samedi pm)'!$B$1:$B$120,0)-1,3,1,52),0)),\"\")","v":"9h30-9H45"},"9h30",{"$f":"IFERROR(OFFSET('semaine impaire (ac samedi pm)'!$D$2,,MATCH(\"z^z\",OFFSET('semaine impaire (ac samedi pm)'!$B$1, MATCH($A19,OFFSET('semaine impaire (ac samedi pm)'!$B$1,MATCH(AA$2,'semaine impaire (ac samedi pm)'!$B$1:$B$120,0)-1,1,12,1),0)-1+MATCH(AA$2,'semaine impaire (ac samedi pm)'!$B$1:$B$120,0)-1,3,1,52), 1)),\"\")","v":"12h15-12H30"},"12H30",{"$f":"IFERROR(HLOOKUP(\"z^z\",OFFSET('semaine impaire (ac samedi pm)'!$B$1, MATCH($A19,OFFSET('semaine impaire (ac samedi pm)'!$B$1,MATCH(AF$2,'semaine impaire (ac samedi pm)'!$B$1:$B$120,0)-1,1,12,1),0)-1+MATCH(AF$2,'semaine impaire (ac samedi pm)'!$B$1:$B$120,0)-1,3,1,52),1,1),\"\")","v":""},{"$f":"IFERROR(OFFSET('semaine impaire (ac samedi pm)'!$D$2,,MATCH(AF19,OFFSET('semaine impaire (ac samedi pm)'!$B$1, MATCH($A19,OFFSET('semaine impaire (ac samedi pm)'!$B$1,MATCH(AF$2,'semaine impaire (ac samedi pm)'!$B$1:$B$120,0)-1,1,12,1),0)-1+MATCH(AF$2,'semaine impaire (ac samedi pm)'!$B$1:$B$120,0)-1,3,1,52),0)),\"\")","v":""},"",{"$f":"IFERROR(OFFSET('semaine impaire (ac samedi pm)'!$D$2,,MATCH(\"z^z\",OFFSET('semaine impaire (ac samedi pm)'!$B$1, MATCH($A19,OFFSET('semaine impaire (ac samedi pm)'!$B$1,MATCH(AF$2,'semaine impaire (ac samedi pm)'!$B$1:$B$120,0)-1,1,12,1),0)-1+MATCH(AF$2,'semaine impaire (ac samedi pm)'!$B$1:$B$120,0)-1,3,1,52), 1)),\"\")","v":""},""]
["Corinne",{"$f":"IFERROR(HLOOKUP(\"z^z\",OFFSET('semaine impaire (ac samedi pm)'!$B$1, MATCH($A20,OFFSET('semaine impaire (ac samedi pm)'!$B$1,MATCH(B$2,'semaine impaire (ac samedi pm)'!$B$1:$B$120,0)-1,1,12,1),0)-1+MATCH(B$2,'semaine impaire (ac samedi pm)'!$B$1:$B$120,0)-1,3,1,52),1,1),\"\")","v":"S"},{"$f":"IFERROR(OFFSET('semaine impaire (ac samedi pm)'!$D$2,,MATCH(B20,OFFSET('semaine impaire (ac samedi pm)'!$B$1, MATCH($A20,OFFSET('semaine impaire (ac samedi pm)'!$B$1,MATCH(B$2,'semaine impaire (ac samedi pm)'!$B$1:$B$120,0)-1,1,12,1),0)-1+MATCH(B$2,'semaine impaire (ac samedi pm)'!$B$1:$B$120,0)-1,3,1,52),0)),\"\")","v":"7h-7h15"},"7h",{"$f":"IFERROR(OFFSET('semaine impaire (ac samedi pm)'!$D$2,,MATCH(\"z^z\",OFFSET('semaine impaire (ac samedi pm)'!$B$1, MATCH($A20,OFFSET('semaine impaire (ac samedi pm)'!$B$1,MATCH(B$2,'semaine impaire (ac samedi pm)'!$B$1:$B$120,0)-1,1,12,1),0)-1+MATCH(B$2,'semaine impaire (ac samedi pm)'!$B$1:$B$120,0)-1,3,1,52), 1)),\"\")","v":"13h15-13H30"},"13H30",{"$f":"IFERROR(HLOOKUP(\"z^z\",OFFSET('semaine impaire (ac samedi pm)'!$B$1, MATCH($A20,OFFSET('semaine impaire (ac samedi pm)'!$B$1,MATCH(G$2,'semaine impaire (ac samedi pm)'!$B$1:$B$120,0)-1,1,12,1),0)-1+MATCH(G$2,'semaine impaire (ac samedi pm)'!$B$1:$B$120,0)-1,3,1,52),1,1),\"\")","v":"S"},{"$f":"IFERROR(OFFSET('semaine impaire (ac samedi pm)'!$D$2,,MATCH(G20,OFFSET('semaine impaire (ac samedi pm)'!$B$1, MATCH($A20,OFFSET('semaine impaire (ac samedi pm)'!$B$1,MATCH(G$2,'semaine impaire (ac samedi pm)'!$B$1:$B$120,0)-1,1,12,1),0)-1+MATCH(G$2,'semaine impaire (ac samedi pm)'!$B$1:$B$120,0)-1,3,1,52),0)),\"\")","v":"7h-7h15"},"7h",{"$f":"IFERROR(OFFSET('semaine impaire (ac samedi pm)'!$D$2,,MATCH(\"z^z\",OFFSET('semaine impaire (ac samedi pm)'!$B$1, MATCH($A20,OFFSET('semaine impaire (ac samedi pm)'!$B$1,MATCH(G$2,'semaine impaire (ac samedi pm)'!$B$1:$B$120,0)-1,1,12,1),0)-1+MATCH(G$2,'semaine impaire (ac samedi pm)'!$B$1:$B$120,0)-1,3,1,52), 1)),\"\")","v":"17h45-18h"},"18h",{"$f":"IFERROR(HLOOKUP(\"z^z\",OFFSET('semaine impaire (ac samedi pm)'!$B$1, MATCH($A20,OFFSET('semaine impaire (ac samedi pm)'!$B$1,MATCH(L$2,'semaine impaire (ac samedi pm)'!$B$1:$B$120,0)-1,1,12,1),0)-1+MATCH(L$2,'semaine impaire (ac samedi pm)'!$B$1:$B$120,0)-1,3,1,52),1,1),\"\")","v":"S"},{"$f":"IFERROR(OFFSET('semaine impaire (ac samedi pm)'!$D$2,,MATCH(L20,OFFSET('semaine impaire (ac samedi pm)'!$B$1, MATCH($A20,OFFSET('semaine impaire (ac samedi pm)'!$B$1,MATCH(L$2,'semaine impaire (ac samedi pm)'!$B$1:$B$120,0)-1,1,12,1),0)-1+MATCH(L$2,'semaine impaire (ac samedi pm)'!$B$1:$B$120,0)-1,3,1,52),0)),\"\")","v":"7h30-7h45"},"7h30",{"$f":"IFERROR(OFFSET('semaine impaire (ac samedi pm)'!$D$2,,MATCH(\"z^z\",OFFSET('semaine impaire (ac samedi pm)'!$B$1, MATCH($A20,OFFSET('semaine impaire (ac samedi pm)'!$B$1,MATCH(L$2,'semaine impaire (ac samedi pm)'!$B$1:$B$120,0)-1,1,12,1),0)-1+MATCH(L$2,'semaine impaire (ac samedi pm)'!$B$1:$B$120,0)-1,3,1,52), 1)),\"\")","v":"11h45-12H"},"12H",{"$f":"IFERROR(HLOOKUP(\"z^z\",OFFSET('semaine impaire (ac samedi pm)'!$B$1, MATCH($A20,OFFSET('semaine impaire (ac samedi pm)'!$B$1,MATCH(Q$2,'semaine impaire (ac samedi pm)'!$B$1:$B$120,0)-1,1,12,1),0)-1+MATCH(Q$2,'semaine impaire (ac samedi pm)'!$B$1:$B$120,0)-1,3,1,52),1,1),\"\")","v":"S"},{"$f":"IFERROR(OFFSET('semaine impaire (ac samedi pm)'!$D$2,,MATCH(Q20,OFFSET('semaine impaire (ac samedi pm)'!$B$1, MATCH($A20,OFFSET('semaine impaire (ac samedi pm)'!$B$1,MATCH(Q$2,'semaine impaire (ac samedi pm)'!$B$1:$B$120,0)-1,1,12,1),0)-1+MATCH(Q$2,'semaine impaire (ac samedi pm)'!$B$1:$B$120,0)-1,3,1,52),0)),\"\")","v":"7h-7h15"},"7h",{"$f":"IFERROR(OFFSET('semaine impaire (ac samedi pm)'!$D$2,,MATCH(\"z^z\",OFFSET('semaine impaire (ac samedi pm)'!$B$1, MATCH($A20,OFFSET('semaine impaire (ac samedi pm)'!$B$1,MATCH(Q$2,'semaine impaire (ac samedi pm)'!$B$1:$B$120,0)-1,1,12,1),0)-1+MATCH(Q$2,'semaine impaire (ac samedi pm)'!$B$1:$B$120,0)-1,3,1,52), 1)),\"\")","v":"13h15-13H30"},"13H30",{"$f":"IFERROR(HLOOKUP(\"z^z\",OFFSET('semaine impaire (ac samedi pm)'!$B$1, MATCH($A20,OFFSET('semaine impaire (ac samedi pm)'!$B$1,MATCH(V$2,'semaine impaire (ac samedi pm)'!$B$1:$B$120,0)-1,1,12,1),0)-1+MATCH(V$2,'semaine impaire (ac samedi pm)'!$B$1:$B$120,0)-1,3,1,52),1,1),\"\")","v":"S"},{"$f":"IFERROR(OFFSET('semaine impaire (ac samedi pm)'!$D$2,,MATCH(V20,OFFSET('semaine impaire (ac samedi pm)'!$B$1, MATCH($A20,OFFSET('semaine impaire (ac samedi pm)'!$B$1,MATCH(V$2,'semaine impaire (ac samedi pm)'!$B$1:$B$120,0)-1,1,12,1),0)-1+MATCH(V$2,'semaine impaire (ac samedi pm)'!$B$1:$B$120,0)-1,3,1,52),0)),\"\")","v":"7h30-7h45"},"7h30",{"$f":"IFERROR(OFFSET('semaine impaire (ac samedi pm)'!$D$2,,MATCH(\"z^z\",OFFSET('semaine impaire (ac samedi pm)'!$B$1, MATCH($A20,OFFSET('semaine impaire (ac samedi pm)'!$B$1,MATCH(V$2,'semaine impaire (ac samedi pm)'!$B$1:$B$120,0)-1,1,12,1),0)-1+MATCH(V$2,'semaine impaire (ac samedi pm)'!$B$1:$B$120,0)-1,3,1,52), 1)),\"\")","v":"12h-12H15"},"12H15",{"$f":"IFERROR(HLOOKUP(\"z^z\",OFFSET('semaine impaire (ac samedi pm)'!$B$1, MATCH($A20,OFFSET('semaine impaire (ac samedi pm)'!$B$1,MATCH(AA$2,'semaine impaire (ac samedi pm)'!$B$1:$B$120,0)-1,1,12,1),0)-1+MATCH(AA$2,'semaine impaire (ac samedi pm)'!$B$1:$B$120,0)-1,3,1,52),1,1),\"\")","v":"s"},{"$f":"IFERROR(OFFSET('semaine impaire (ac samedi pm)'!$D$2,,MATCH(AA20,OFFSET('semaine impaire (ac samedi pm)'!$B$1, MATCH($A20,OFFSET('semaine impaire (ac samedi pm)'!$B$1,MATCH(AA$2,'semaine impaire (ac samedi pm)'!$B$1:$B$120,0)-1,1,12,1),0)-1+MATCH(AA$2,'semaine impaire (ac samedi pm)'!$B$1:$B$120,0)-1,3,1,52),0)),\"\")","v":"13h30-13H45"},"13h30",{"$f":"IFERROR(OFFSET('semaine impaire (ac samedi pm)'!$D$2,,MATCH(\"z^z\",OFFSET('semaine impaire (ac samedi pm)'!$B$1, MATCH($A20,OFFSET('semaine impaire (ac samedi pm)'!$B$1,MATCH(AA$2,'semaine impaire (ac samedi pm)'!$B$1:$B$120,0)-1,1,12,1),0)-1+MATCH(AA$2,'semaine impaire (ac samedi pm)'!$B$1:$B$120,0)-1,3,1,52), 1)),\"\")","v":"18h45-19h"},"19h",{"$f":"IFERROR(HLOOKUP(\"z^z\",OFFSET('semaine impaire (ac samedi pm)'!$B$1, MATCH($A20,OFFSET('semaine impaire (ac samedi pm)'!$B$1,MATCH(AF$2,'semaine impaire (ac samedi pm)'!$B$1:$B$120,0)-1,1,12,1),0)-1+MATCH(AF$2,'semaine impaire (ac samedi pm)'!$B$1:$B$120,0)-1,3,1,52),1,1),\"\")","v":""},{"$f":"IFERROR(OFFSET('semaine impaire (ac samedi pm)'!$D$2,,MATCH(AF20,OFFSET('semaine impaire (ac samedi pm)'!$B$1, MATCH($A20,OFFSET('semaine impaire (ac samedi pm)'!$B$1,MATCH(AF$2,'semaine impaire (ac samedi pm)'!$B$1:$B$120,0)-1,1,12,1),0)-1+MATCH(AF$2,'semaine impaire (ac samedi pm)'!$B$1:$B$120,0)-1,3,1,52),0)),\"\")","v":""},"",{"$f":"IFERROR(OFFSET('semaine impaire (ac samedi pm)'!$D$2,,MATCH(\"z^z\",OFFSET('semaine impaire (ac samedi pm)'!$B$1, MATCH($A20,OFFSET('semaine impaire (ac samedi pm)'!$B$1,MATCH(AF$2,'semaine impaire (ac samedi pm)'!$B$1:$B$120,0)-1,1,12,1),0)-1+MATCH(AF$2,'semaine impaire (ac samedi pm)'!$B$1:$B$120,0)-1,3,1,52), 1)),\"\")","v":""},""]
["Francoise",{"$f":"IFERROR(HLOOKUP(\"z^z\",OFFSET('semaine impaire (ac samedi pm)'!$B$1, MATCH($A21,OFFSET('semaine impaire (ac samedi pm)'!$B$1,MATCH(B$2,'semaine impaire (ac samedi pm)'!$B$1:$B$120,0)-1,1,12,1),0)-1+MATCH(B$2,'semaine impaire (ac samedi pm)'!$B$1:$B$120,0)-1,3,1,52),1,1),\"\")","v":"F"},{"$f":"IFERROR(OFFSET('semaine impaire (ac samedi pm)'!$D$2,,MATCH(B21,OFFSET('semaine impaire (ac samedi pm)'!$B$1, MATCH($A21,OFFSET('semaine impaire (ac samedi pm)'!$B$1,MATCH(B$2,'semaine impaire (ac samedi pm)'!$B$1:$B$120,0)-1,1,12,1),0)-1+MATCH(B$2,'semaine impaire (ac samedi pm)'!$B$1:$B$120,0)-1,3,1,52),0)),\"\")","v":"6h45-7h"},"6h45",{"$f":"IFERROR(OFFSET('semaine impaire (ac samedi pm)'!$D$2,,MATCH(\"z^z\",OFFSET('semaine impaire (ac samedi pm)'!$B$1, MATCH($A21,OFFSET('semaine impaire (ac samedi pm)'!$B$1,MATCH(B$2,'semaine impaire (ac samedi pm)'!$B$1:$B$120,0)-1,1,12,1),0)-1+MATCH(B$2,'semaine impaire (ac samedi pm)'!$B$1:$B$120,0)-1,3,1,52), 1)),\"\")","v":"12h30-12H45"},"12H45",{"$f":"IFERROR(HLOOKUP(\"z^z\",OFFSET('semaine impaire (ac samedi pm)'!$B$1, MATCH($A21,OFFSET('semaine impaire (ac samedi pm)'!$B$1,MATCH(G$2,'semaine impaire (ac samedi pm)'!$B$1:$B$120,0)-1,1,12,1),0)-1+MATCH(G$2,'semaine impaire (ac samedi pm)'!$B$1:$B$120,0)-1,3,1,52),1,1),\"\")","v":"F"},{"$f":"IFERROR(OFFSET('semaine impaire (ac samedi pm)'!$D$2,,MATCH(G21,OFFSET('semaine impaire (ac samedi pm)'!$B$1, MATCH($A21,OFFSET('semaine impaire (ac samedi pm)'!$B$1,MATCH(G$2,'semaine impaire (ac samedi pm)'!$B$1:$B$120,0)-1,1,12,1),0)-1+MATCH(G$2,'semaine impaire (ac samedi pm)'!$B$1:$B$120,0)-1,3,1,52),0)),\"\")","v":"6h45-7h"},"6h45",{"$f":"IFERROR(OFFSET('semaine impaire (ac samedi pm)'!$D$2,,MATCH(\"z^z\",OFFSET('semaine impaire (ac samedi pm)'!$B$1, MATCH($A21,OFFSET('semaine impaire (ac samedi pm)'!$B$1,MATCH(G$2,'semaine impaire (ac samedi pm)'!$B$1:$B$120,0)-1,1,12,1),0)-1+MATCH(G$2,'semaine impaire (ac samedi pm)'!$B$1:$B$120,0)-1,3,1,52), 1)),\"\")","v":"12h15-12H30"},"12H30",{"$f":"IFERROR(HLOOKUP(\"z^z\",OFFSET('semaine impaire (ac samedi pm)'!$B$1, MATCH($A21,OFFSET('semaine impaire (ac samedi pm)'!$B$1,MATCH(L$2,'semaine impaire (ac samedi pm)'!$B$1:$B$120,0)-1,1,12,1),0)-1+MATCH(L$2,'semaine impaire (ac samedi pm)'!$B$1:$B$120,0)-1,3,1,52),1,1),\"\")","v":"F"},{"$f":"IFERROR(OFFSET('semaine impaire (ac samedi pm)'!$D$2,,MATCH(L21,OFFSET('semaine impaire (ac samedi pm)'!$B$1, MATCH($A21,OFFSET('semaine impaire (ac samedi pm)'!$B$1,MATCH(L$2,'semaine impaire (ac samedi pm)'!$B$1:$B$120,0)-1,1,12,1),0)-1+MATCH(L$2,'semaine impaire (ac samedi pm)'!$B$1:$B$120,0)-1,3,1,52),0)),\"\")","v":"6h45-7h"},"6h45",{"$f":"IFERROR(OFFSET('semaine impaire (ac samedi pm)'!$D$2,,MATCH(\"z^z\",OFFSET('semaine impaire (ac samedi pm)'!$B$1, MATCH($A21,OFFSET('semaine impaire (ac samedi pm)'!$B$1,MATCH(L$2,'semaine impaire (ac samedi pm)'!$B$1:$B$120,0)-1,1,12,1),0)-1+MATCH(L$2,'semaine impaire (ac samedi pm)'!$B$1:$B$120,0)-1,3,1,52), 1)),\"\")","v":"11h-11H15"},"11H15",{"$f":"IFERROR(HLOOKUP(\"z^z\",OFFSET('semaine impaire (ac samedi pm)'!$B$1, MATCH($A21,OFFSET('semaine impaire (ac samedi pm)'!$B$1,MATCH(Q$2,'semaine impaire (ac samedi pm)'!$B$1:$B$120,0)-1,1,12,1),0)-1+MATCH(Q$2,'semaine impaire (ac samedi pm)'!$B$1:$B$120,0)-1,3,1,52),1,1),\"\")","v":"F"},{"$f":"IFERROR(OFFSET('semaine impaire (ac samedi pm)'!$D$2,,MATCH(Q21,OFFSET('semaine impaire (ac samedi pm)'!$B$1, MATCH($A21,OFFSET('semaine impaire (ac samedi pm)'!$B$1,MATCH(Q$2,'semaine impaire (ac samedi pm)'!$B$1:$B$120,0)-1,1,12,1),0)-1+MATCH(Q$2,'semaine impaire (ac samedi pm)'!$B$1:$B$120,0)-1,3,1,52),0)),\"\")","v":"6h45-7h"},"6h45",{"$f":"IFERROR(OFFSET('semaine impaire (ac samedi pm)'!$D$2,,MATCH(\"z^z\",OFFSET('semaine impaire (ac samedi pm)'!$B$1, MATCH($A21,OFFSET('semaine impaire (ac samedi pm)'!$B$1,MATCH(Q$2,'semaine impaire (ac samedi pm)'!$B$1:$B$120,0)-1,1,12,1),0)-1+MATCH(Q$2,'semaine impaire (ac samedi pm)'!$B$1:$B$120,0)-1,3,1,52), 1)),\"\")","v":"12h30-12H45"},"12H45",{"$f":"IFERROR(HLOOKUP(\"z^z\",OFFSET('semaine impaire (ac samedi pm)'!$B$1, MATCH($A21,OFFSET('semaine impaire (ac samedi pm)'!$B$1,MATCH(V$2,'semaine impaire (ac samedi pm)'!$B$1:$B$120,0)-1,1,12,1),0)-1+MATCH(V$2,'semaine impaire (ac samedi pm)'!$B$1:$B$120,0)-1,3,1,52),1,1),\"\")","v":"F"},{"$f":"IFERROR(OFFSET('semaine impaire (ac samedi pm)'!$D$2,,MATCH(V21,OFFSET('semaine impaire (ac samedi pm)'!$B$1, MATCH($A21,OFFSET('semaine impaire (ac samedi pm)'!$B$1,MATCH(V$2,'semaine impaire (ac samedi pm)'!$B$1:$B$120,0)-1,1,12,1),0)-1+MATCH(V$2,'semaine impaire (ac samedi pm)'!$B$1:$B$120,0)-1,3,1,52),0)),\"\")","v":"6h45-7h"},"6h45",{"$f":"IFERROR(OFFSET('semaine impaire (ac samedi pm)'!$D$2,,MATCH(\"z^z\",OFFSET('semaine impaire (ac samedi pm)'!$B$1, MATCH($A21,OFFSET('semaine impaire (ac samedi pm)'!$B$1,MATCH(V$2,'semaine impaire (ac samedi pm)'!$B$1:$B$120,0)-1,1,12,1),0)-1+MATCH(V$2,'semaine impaire (ac samedi pm)'!$B$1:$B$120,0)-1,3,1,52), 1)),\"\")","v":"12h-12H15"},"12H15",{"$f":"IFERROR(HLOOKUP(\"z^z\",OFFSET('semaine impaire (ac samedi pm)'!$B$1, MATCH($A21,OFFSET('semaine impaire (ac samedi pm)'!$B$1,MATCH(AA$2,'semaine impaire (ac samedi pm)'!$B$1:$B$120,0)-1,1,12,1),0)-1+MATCH(AA$2,'semaine impaire (ac samedi pm)'!$B$1:$B$120,0)-1,3,1,52),1,1),\"\")","v":"F"},{"$f":"IFERROR(OFFSET('semaine impaire (ac samedi pm)'!$D$2,,MATCH(AA21,OFFSET('semaine impaire (ac samedi pm)'!$B$1, MATCH($A21,OFFSET('semaine impaire (ac samedi pm)'!$B$1,MATCH(AA$2,'semaine impaire (ac samedi pm)'!$B$1:$B$120,0)-1,1,12,1),0)-1+MATCH(AA$2,'semaine impaire (ac samedi pm)'!$B$1:$B$120,0)-1,3,1,52),0)),\"\")","v":"6h30-6h45"},"6h30",{"$f":"IFERROR(OFFSET('semaine impaire (ac samedi pm)'!$D$2,,MATCH(\"z^z\",OFFSET('semaine impaire (ac samedi pm)'!$B$1, MATCH($A21,OFFSET('semaine impaire (ac samedi pm)'!$B$1,MATCH(AA$2,'semaine impaire (ac samedi pm)'!$B$1:$B$120,0)-1,1,12,1),0)-1+MATCH(AA$2,'semaine impaire (ac samedi pm)'!$B$1:$B$120,0)-1,3,1,52), 1)),\"\")","v":"17h15-17h30"},"17h30",{"$f":"IFERROR(HLOOKUP(\"z^z\",OFFSET('semaine impaire (ac samedi pm)'!$B$1, MATCH($A21,OFFSET('semaine impaire (ac samedi pm)'!$B$1,MATCH(AF$2,'semaine impaire (ac samedi pm)'!$B$1:$B$120,0)-1,1,12,1),0)-1+MATCH(AF$2,'semaine impaire (ac samedi pm)'!$B$1:$B$120,0)-1,3,1,52),1,1),\"\")","v":""},{"$f":"IFERROR(OFFSET('semaine impaire (ac samedi pm)'!$D$2,,MATCH(AF21,OFFSET('semaine impaire (ac samedi pm)'!$B$1, MATCH($A21,OFFSET('semaine impaire (ac samedi pm)'!$B$1,MATCH(AF$2,'semaine impaire (ac samedi pm)'!$B$1:$B$120,0)-1,1,12,1),0)-1+MATCH(AF$2,'semaine impaire (ac samedi pm)'!$B$1:$B$120,0)-1,3,1,52),0)),\"\")","v":""},"",{"$f":"IFERROR(OFFSET('semaine impaire (ac samedi pm)'!$D$2,,MATCH(\"z^z\",OFFSET('semaine impaire (ac samedi pm)'!$B$1, MATCH($A21,OFFSET('semaine impaire (ac samedi pm)'!$B$1,MATCH(AF$2,'semaine impaire (ac samedi pm)'!$B$1:$B$120,0)-1,1,12,1),0)-1+MATCH(AF$2,'semaine impaire (ac samedi pm)'!$B$1:$B$120,0)-1,3,1,52), 1)),\"\")","v":""},""]
["Ghislaine",{"$f":"IFERROR(HLOOKUP(\"z^z\",OFFSET('semaine impaire (ac samedi pm)'!$B$1, MATCH($A22,OFFSET('semaine impaire (ac samedi pm)'!$B$1,MATCH(B$2,'semaine impaire (ac samedi pm)'!$B$1:$B$120,0)-1,1,12,1),0)-1+MATCH(B$2,'semaine impaire (ac samedi pm)'!$B$1:$B$120,0)-1,3,1,52),1,1),\"\")","v":"DPH"},{"$f":"IFERROR(OFFSET('semaine impaire (ac samedi pm)'!$D$2,,MATCH(B22,OFFSET('semaine impaire (ac samedi pm)'!$B$1, MATCH($A22,OFFSET('semaine impaire (ac samedi pm)'!$B$1,MATCH(B$2,'semaine impaire (ac samedi pm)'!$B$1:$B$120,0)-1,1,12,1),0)-1+MATCH(B$2,'semaine impaire (ac samedi pm)'!$B$1:$B$120,0)-1,3,1,52),0)),\"\")","v":"6h30-6h45"},"6h30",{"$f":"IFERROR(OFFSET('semaine impaire (ac samedi pm)'!$D$2,,MATCH(\"z^z\",OFFSET('semaine impaire (ac samedi pm)'!$B$1, MATCH($A22,OFFSET('semaine impaire (ac samedi pm)'!$B$1,MATCH(B$2,'semaine impaire (ac samedi pm)'!$B$1:$B$120,0)-1,1,12,1),0)-1+MATCH(B$2,'semaine impaire (ac samedi pm)'!$B$1:$B$120,0)-1,3,1,52), 1)),\"\")","v":"12h15-12H30"},"12H30",{"$f":"IFERROR(HLOOKUP(\"z^z\",OFFSET('semaine impaire (ac samedi pm)'!$B$1, MATCH($A22,OFFSET('semaine impaire (ac samedi pm)'!$B$1,MATCH(G$2,'semaine impaire (ac samedi pm)'!$B$1:$B$120,0)-1,1,12,1),0)-1+MATCH(G$2,'semaine impaire (ac samedi pm)'!$B$1:$B$120,0)-1,3,1,52),1,1),\"\")","v":"DPH"},{"$f":"IFERROR(OFFSET('semaine impaire (ac samedi pm)'!$D$2,,MATCH(G22,OFFSET('semaine impaire (ac samedi pm)'!$B$1, MATCH($A22,OFFSET('semaine impaire (ac samedi pm)'!$B$1,MATCH(G$2,'semaine impaire (ac samedi pm)'!$B$1:$B$120,0)-1,1,12,1),0)-1+MATCH(G$2,'semaine impaire (ac samedi pm)'!$B$1:$B$120,0)-1,3,1,52),0)),\"\")","v":"7h30-7h45"},"7h30",{"$f":"IFERROR(OFFSET('semaine impaire (ac samedi pm)'!$D$2,,MATCH(\"z^z\",OFFSET('semaine impaire (ac samedi pm)'!$B$1, MATCH($A22,OFFSET('semaine impaire (ac samedi pm)'!$B$1,MATCH(G$2,'semaine impaire (ac samedi pm)'!$B$1:$B$120,0)-1,1,12,1),0)-1+MATCH(G$2,'semaine impaire (ac samedi pm)'!$B$1:$B$120,0)-1,3,1,52), 1)),\"\")","v":"12h15-12H30"},"12H30",{"$f":"IFERROR(HLOOKUP(\"z^z\",OFFSET('semaine impaire (ac samedi pm)'!$B$1, MATCH($A22,OFFSET('semaine impaire (ac samedi pm)'!$B$1,MATCH(L$2,'semaine impaire (ac samedi pm)'!$B$1:$B$120,0)-1,1,12,1),0)-1+MATCH(L$2,'semaine impaire (ac samedi pm)'!$B$1:$B$120,0)-1,3,1,52),1,1),\"\")","v":"DPH"},{"$f":"IFERROR(OFFSET('semaine impaire (ac samedi pm)'!$D$2,,MATCH(L22,OFFSET('semaine impaire (ac samedi pm)'!$B$1, MATCH($A22,OFFSET('semaine impaire (ac samedi pm)'!$B$1,MATCH(L$2,'semaine impaire (ac samedi pm)'!$B$1:$B$120,0)-1,1,12,1),0)-1+MATCH(L$2,'semaine impaire (ac samedi pm)'!$B$1:$B$120,0)-1,3,1,52),0)),\"\")","v":"7h30-7h45"},"7h30",{"$f":"IFERROR(OFFSET('semaine impaire (ac samedi pm)'!$D$2,,MATCH(\"z^z\",OFFSET('semaine impaire (ac samedi pm)'!$B$1, MATCH($A22,OFFSET('semaine impaire (ac samedi pm)'!$B$1,MATCH(L$2,'semaine impaire (ac samedi pm)'!$B$1:$B$120,0)-1,1,12,1),0)-1+MATCH(L$2,'semaine impaire (ac samedi pm)'!$B$1:$B$120,0)-1,3,1,52), 1)),\"\")","v":"12h-12H15"},"12H15",{"$f":"IFERROR(HLOOKUP(\"z^z\",OFFSET('semaine impaire (ac samedi pm)'!$B$1, MATCH($A22,OFFSET('semaine impaire (ac samedi pm)'!$B$1,MATCH(Q$2,'semaine impaire (ac samedi pm)'!$B$1:$B$120,0)-1,1,12,1),0)-1+MATCH(Q$2,'semaine impaire (ac samedi pm)'!$B$1:$B$120,0)-1,3,1,52),1,1),\"\")","v":"DPH"},{"$f":"IFERROR(OFFSET('semaine impaire (ac samedi pm)'!$D$2,,MATCH(Q22,OFFSET('semaine impaire (ac samedi pm)'!$B$1, MATCH($A22,OFFSET('semaine impaire (ac samedi pm)'!$B$1,MATCH(Q$2,'semaine impaire (ac samedi pm)'!$B$1:$B$120,0)-1,1,12,1),0)-1+MATCH(Q$2,'semaine impaire (ac samedi pm)'!$B$1:$B$120,0)-1,3,1,52),0)),\"\")","v":"6h30-6h45"},"6h30",{"$f":"IFERROR(OFFSET('semaine impaire (ac samedi pm)'!$D$2,,MATCH(\"z^z\",OFFSET('semaine impaire (ac samedi pm)'!$B$1, MATCH($A22,OFFSET('semaine impaire (ac samedi pm)'!$B$1,MATCH(Q$2,'semaine impaire (ac samedi pm)'!$B$1:$B$120,0)-1,1,12,1),0)-1+MATCH(Q$2,'semaine impaire (ac samedi pm)'!$B$1:$B$120,0)-1,3,1,52), 1)),\"\")","v":"17h-17h15"},"17h15",{"$f":"IFERROR(HLOOKUP(\"z^z\",OFFSET('semaine impaire (ac samedi pm)'!$B$1, MATCH($A22,OFFSET('semaine impaire (ac samedi pm)'!$B$1,MATCH(V$2,'semaine impaire (ac samedi pm)'!$B$1:$B$120,0)-1,1,12,1),0)-1+MATCH(V$2,'semaine impaire (ac samedi pm)'!$B$1:$B$120,0)-1,3,1,52),1,1),\"\")","v":"DPH"},{"$f":"IFERROR(OFFSET('semaine impaire (ac samedi pm)'!$D$2,,MATCH(V22,OFFSET('semaine impaire (ac samedi pm)'!$B$1, MATCH($A22,OFFSET('semaine impaire (ac samedi pm)'!$B$1,MATCH(V$2,'semaine impaire (ac samedi pm)'!$B$1:$B$120,0)-1,1,12,1),0)-1+MATCH(V$2,'semaine impaire (ac samedi pm)'!$B$1:$B$120,0)-1,3,1,52),0)),\"\")","v":"7h30-7h45"},"7h30",{"$f":"IFERROR(OFFSET('semaine impaire (ac samedi pm)'!$D$2,,MATCH(\"z^z\",OFFSET('semaine impaire (ac samedi pm)'!$B$1, MATCH($A22,OFFSET('semaine impaire (ac samedi pm)'!$B$1,MATCH(V$2,'semaine impaire (ac samedi pm)'!$B$1:$B$120,0)-1,1,12,1),0)-1+MATCH(V$2,'semaine impaire (ac samedi pm)'!$B$1:$B$120,0)-1,3,1,52), 1)),\"\")","v":"12h15-12H30"},"12H30",{"$f":"IFERROR(HLOOKUP(\"z^z\",OFFSET('semaine impaire (ac samedi pm)'!$B$1, MATCH($A22,OFFSET('semaine impaire (ac samedi pm)'!$B$1,MATCH(AA$2,'semaine impaire (ac samedi pm)'!$B$1:$B$120,0)-1,1,12,1),0)-1+MATCH(AA$2,'semaine impaire (ac samedi pm)'!$B$1:$B$120,0)-1,3,1,52),1,1),\"\")","v":"dph"},{"$f":"IFERROR(OFFSET('semaine impaire (ac samedi pm)'!$D$2,,MATCH(AA22,OFFSET('semaine impaire (ac samedi pm)'!$B$1, MATCH($A22,OFFSET('semaine impaire (ac samedi pm)'!$B$1,MATCH(AA$2,'semaine impaire (ac samedi pm)'!$B$1:$B$120,0)-1,1,12,1),0)-1+MATCH(AA$2,'semaine impaire (ac samedi pm)'!$B$1:$B$120,0)-1,3,1,52),0)),\"\")","v":"8h30-8h45"},"8h30",{"$f":"IFERROR(OFFSET('semaine impaire (ac samedi pm)'!$D$2,,MATCH(\"z^z\",OFFSET('semaine impaire (ac samedi pm)'!$B$1, MATCH($A22,OFFSET('semaine impaire (ac samedi pm)'!$B$1,MATCH(AA$2,'semaine impaire (ac samedi pm)'!$B$1:$B$120,0)-1,1,12,1),0)-1+MATCH(AA$2,'semaine impaire (ac samedi pm)'!$B$1:$B$120,0)-1,3,1,52), 1)),\"\")","v":"17h30-17h45"},"17h45",{"$f":"IFERROR(HLOOKUP(\"z^z\",OFFSET('semaine impaire (ac samedi pm)'!$B$1, MATCH($A22,OFFSET('semaine impaire (ac samedi pm)'!$B$1,MATCH(AF$2,'semaine impaire (ac samedi pm)'!$B$1:$B$120,0)-1,1,12,1),0)-1+MATCH(AF$2,'semaine impaire (ac samedi pm)'!$B$1:$B$120,0)-1,3,1,52),1,1),\"\")","v":""},{"$f":"IFERROR(OFFSET('semaine impaire (ac samedi pm)'!$D$2,,MATCH(AF22,OFFSET('semaine impaire (ac samedi pm)'!$B$1, MATCH($A22,OFFSET('semaine impaire (ac samedi pm)'!$B$1,MATCH(AF$2,'semaine impaire (ac samedi pm)'!$B$1:$B$120,0)-1,1,12,1),0)-1+MATCH(AF$2,'semaine impaire (ac samedi pm)'!$B$1:$B$120,0)-1,3,1,52),0)),\"\")","v":""},"",{"$f":"IFERROR(OFFSET('semaine impaire (ac samedi pm)'!$D$2,,MATCH(\"z^z\",OFFSET('semaine impaire (ac samedi pm)'!$B$1, MATCH($A22,OFFSET('semaine impaire (ac samedi pm)'!$B$1,MATCH(AF$2,'semaine impaire (ac samedi pm)'!$B$1:$B$120,0)-1,1,12,1),0)-1+MATCH(AF$2,'semaine impaire (ac samedi pm)'!$B$1:$B$120,0)-1,3,1,52), 1)),\"\")","v":""},""]
["Laura",{"$f":"IFERROR(HLOOKUP(\"z^z\",OFFSET('semaine impaire (ac samedi pm)'!$B$1, MATCH($A23,OFFSET('semaine impaire (ac samedi pm)'!$B$1,MATCH(B$2,'semaine impaire (ac samedi pm)'!$B$1:$B$120,0)-1,1,12,1),0)-1+MATCH(B$2,'semaine impaire (ac samedi pm)'!$B$1:$B$120,0)-1,3,1,52),1,1),\"\")","v":"S"},{"$f":"IFERROR(OFFSET('semaine impaire (ac samedi pm)'!$D$2,,MATCH(B23,OFFSET('semaine impaire (ac samedi pm)'!$B$1, MATCH($A23,OFFSET('semaine impaire (ac samedi pm)'!$B$1,MATCH(B$2,'semaine impaire (ac samedi pm)'!$B$1:$B$120,0)-1,1,12,1),0)-1+MATCH(B$2,'semaine impaire (ac samedi pm)'!$B$1:$B$120,0)-1,3,1,52),0)),\"\")","v":"6h30-6h45"},"6h30",{"$f":"IFERROR(OFFSET('semaine impaire (ac samedi pm)'!$D$2,,MATCH(\"z^z\",OFFSET('semaine impaire (ac samedi pm)'!$B$1, MATCH($A23,OFFSET('semaine impaire (ac samedi pm)'!$B$1,MATCH(B$2,'semaine impaire (ac samedi pm)'!$B$1:$B$120,0)-1,1,12,1),0)-1+MATCH(B$2,'semaine impaire (ac samedi pm)'!$B$1:$B$120,0)-1,3,1,52), 1)),\"\")","v":"17h45-18h"},"18h",{"$f":"IFERROR(HLOOKUP(\"z^z\",OFFSET('semaine impaire (ac samedi pm)'!$B$1, MATCH($A23,OFFSET('semaine impaire (ac samedi pm)'!$B$1,MATCH(G$2,'semaine impaire (ac samedi pm)'!$B$1:$B$120,0)-1,1,12,1),0)-1+MATCH(G$2,'semaine impaire (ac samedi pm)'!$B$1:$B$120,0)-1,3,1,52),1,1),\"\")","v":"S"},{"$f":"IFERROR(OFFSET('semaine impaire (ac samedi pm)'!$D$2,,MATCH(G23,OFFSET('semaine impaire (ac samedi pm)'!$B$1, MATCH($A23,OFFSET('semaine impaire (ac samedi pm)'!$B$1,MATCH(G$2,'semaine impaire (ac samedi pm)'!$B$1:$B$120,0)-1,1,12,1),0)-1+MATCH(G$2,'semaine impaire (ac samedi pm)'!$B$1:$B$120,0)-1,3,1,52),0)),\"\")","v":"6h30-6h45"},"6h30",{"$f":"IFERROR(OFFSET('semaine impaire (ac samedi pm)'!$D$2,,MATCH(\"z^z\",OFFSET('semaine impaire (ac samedi pm)'!$B$1, MATCH($A23,OFFSET('semaine impaire (ac samedi pm)'!$B$1,MATCH(G$2,'semaine impaire (ac samedi pm)'!$B$1:$B$120,0)-1,1,12,1),0)-1+MATCH(G$2,'semaine impaire (ac samedi pm)'!$B$1:$B$120,0)-1,3,1,52), 1)),\"\")","v":"12h15-12H30"},"12H30",{"$f":"IFERROR(HLOOKUP(\"z^z\",OFFSET('semaine impaire (ac samedi pm)'!$B$1, MATCH($A23,OFFSET('semaine impaire (ac samedi pm)'!$B$1,MATCH(L$2,'semaine impaire (ac samedi pm)'!$B$1:$B$120,0)-1,1,12,1),0)-1+MATCH(L$2,'semaine impaire (ac samedi pm)'!$B$1:$B$120,0)-1,3,1,52),1,1),\"\")","v":"S"},{"$f":"IFERROR(OFFSET('semaine impaire (ac samedi pm)'!$D$2,,MATCH(L23,OFFSET('semaine impaire (ac samedi pm)'!$B$1, MATCH($A23,OFFSET('semaine impaire (ac samedi pm)'!$B$1,MATCH(L$2,'semaine impaire (ac samedi pm)'!$B$1:$B$120,0)-1,1,12,1),0)-1+MATCH(L$2,'semaine impaire (ac samedi pm)'!$B$1:$B$120,0)-1,3,1,52),0)),\"\")","v":"7h30-7h45"},"7h30",{"$f":"IFERROR(OFFSET('semaine impaire (ac samedi pm)'!$D$2,,MATCH(\"z^z\",OFFSET('semaine impaire (ac samedi pm)'!$B$1, MATCH($A23,OFFSET('semaine impaire (ac samedi pm)'!$B$1,MATCH(L$2,'semaine impaire (ac samedi pm)'!$B$1:$B$120,0)-1,1,12,1),0)-1+MATCH(L$2,'semaine impaire (ac samedi pm)'!$B$1:$B$120,0)-1,3,1,52), 1)),\"\")","v":"12h-12H15"},"12H15",{"$f":"IFERROR(HLOOKUP(\"z^z\",OFFSET('semaine impaire (ac samedi pm)'!$B$1, MATCH($A23,OFFSET('semaine impaire (ac samedi pm)'!$B$1,MATCH(Q$2,'semaine impaire (ac samedi pm)'!$B$1:$B$120,0)-1,1,12,1),0)-1+MATCH(Q$2,'semaine impaire (ac samedi pm)'!$B$1:$B$120,0)-1,3,1,52),1,1),\"\")","v":"S"},{"$f":"IFERROR(OFFSET('semaine impaire (ac samedi pm)'!$D$2,,MATCH(Q23,OFFSET('semaine impaire (ac samedi pm)'!$B$1, MATCH($A23,OFFSET('semaine impaire (ac samedi pm)'!$B$1,MATCH(Q$2,'semaine impaire (ac samedi pm)'!$B$1:$B$120,0)-1,1,12,1),0)-1+MATCH(Q$2,'semaine impaire (ac samedi pm)'!$B$1:$B$120,0)-1,3,1,52),0)),\"\")","v":"6h30-6h45"},"6h30",{"$f":"IFERROR(OFFSET('semaine impaire (ac samedi pm)'!$D$2,,MATCH(\"z^z\",OFFSET('semaine impaire (ac samedi pm)'!$B$1, MATCH($A23,OFFSET('semaine impaire (ac samedi pm)'!$B$1,MATCH(Q$2,'semaine impaire (ac samedi pm)'!$B$1:$B$120,0)-1,1,12,1),0)-1+MATCH(Q$2,'semaine impaire (ac samedi pm)'!$B$1:$B$120,0)-1,3,1,52), 1)),\"\")","v":"12h45-13H"},"13H",{"$f":"IFERROR(HLOOKUP(\"z^z\",OFFSET('semaine impaire (ac samedi pm)'!$B$1, MATCH($A23,OFFSET('semaine impaire (ac samedi pm)'!$B$1,MATCH(V$2,'semaine impaire (ac samedi pm)'!$B$1:$B$120,0)-1,1,12,1),0)-1+MATCH(V$2,'semaine impaire (ac samedi pm)'!$B$1:$B$120,0)-1,3,1,52),1,1),\"\")","v":"S"},{"$f":"IFERROR(OFFSET('semaine impaire (ac samedi pm)'!$D$2,,MATCH(V23,OFFSET('semaine impaire (ac samedi pm)'!$B$1, MATCH($A23,OFFSET('semaine impaire (ac samedi pm)'!$B$1,MATCH(V$2,'semaine impaire (ac samedi pm)'!$B$1:$B$120,0)-1,1,12,1),0)-1+MATCH(V$2,'semaine impaire (ac samedi pm)'!$B$1:$B$120,0)-1,3,1,52),0)),\"\")","v":"7h30-7h45"},"7h30",{"$f":"IFERROR(OFFSET('semaine impaire (ac samedi pm)'!$D$2,,MATCH(\"z^z\",OFFSET('semaine impaire (ac samedi pm)'!$B$1, MATCH($A23,OFFSET('semaine impaire (ac samedi pm)'!$B$1,MATCH(V$2,'semaine impaire (ac samedi pm)'!$B$1:$B$120,0)-1,1,12,1),0)-1+MATCH(V$2,'semaine impaire (ac samedi pm)'!$B$1:$B$120,0)-1,3,1,52), 1)),\"\")","v":"11h45-12H"},"12H",{"$f":"IFERROR(HLOOKUP(\"z^z\",OFFSET('semaine impaire (ac samedi pm)'!$B$1, MATCH($A23,OFFSET('semaine impaire (ac samedi pm)'!$B$1,MATCH(AA$2,'semaine impaire (ac samedi pm)'!$B$1:$B$120,0)-1,1,12,1),0)-1+MATCH(AA$2,'semaine impaire (ac samedi pm)'!$B$1:$B$120,0)-1,3,1,52),1,1),\"\")","v":"s"},{"$f":"IFERROR(OFFSET('semaine impaire (ac samedi pm)'!$D$2,,MATCH(AA23,OFFSET('semaine impaire (ac samedi pm)'!$B$1, MATCH($A23,OFFSET('semaine impaire (ac samedi pm)'!$B$1,MATCH(AA$2,'semaine impaire (ac samedi pm)'!$B$1:$B$120,0)-1,1,12,1),0)-1+MATCH(AA$2,'semaine impaire (ac samedi pm)'!$B$1:$B$120,0)-1,3,1,52),0)),\"\")","v":"13h30-13H45"},"13h30",{"$f":"IFERROR(OFFSET('semaine impaire (ac samedi pm)'!$D$2,,MATCH(\"z^z\",OFFSET('semaine impaire (ac samedi pm)'!$B$1, MATCH($A23,OFFSET('semaine impaire (ac samedi pm)'!$B$1,MATCH(AA$2,'semaine impaire (ac samedi pm)'!$B$1:$B$120,0)-1,1,12,1),0)-1+MATCH(AA$2,'semaine impaire (ac samedi pm)'!$B$1:$B$120,0)-1,3,1,52), 1)),\"\")","v":"18h45-19h"},"19h",{"$f":"IFERROR(HLOOKUP(\"z^z\",OFFSET('semaine impaire (ac samedi pm)'!$B$1, MATCH($A23,OFFSET('semaine impaire (ac samedi pm)'!$B$1,MATCH(AF$2,'semaine impaire (ac samedi pm)'!$B$1:$B$120,0)-1,1,12,1),0)-1+MATCH(AF$2,'semaine impaire (ac samedi pm)'!$B$1:$B$120,0)-1,3,1,52),1,1),\"\")","v":""},{"$f":"IFERROR(OFFSET('semaine impaire (ac samedi pm)'!$D$2,,MATCH(AF23,OFFSET('semaine impaire (ac samedi pm)'!$B$1, MATCH($A23,OFFSET('semaine impaire (ac samedi pm)'!$B$1,MATCH(AF$2,'semaine impaire (ac samedi pm)'!$B$1:$B$120,0)-1,1,12,1),0)-1+MATCH(AF$2,'semaine impaire (ac samedi pm)'!$B$1:$B$120,0)-1,3,1,52),0)),\"\")","v":""},"",{"$f":"IFERROR(OFFSET('semaine impaire (ac samedi pm)'!$D$2,,MATCH(\"z^z\",OFFSET('semaine impaire (ac samedi pm)'!$B$1, MATCH($A23,OFFSET('semaine impaire (ac samedi pm)'!$B$1,MATCH(AF$2,'semaine impaire (ac samedi pm)'!$B$1:$B$120,0)-1,1,12,1),0)-1+MATCH(AF$2,'semaine impaire (ac samedi pm)'!$B$1:$B$120,0)-1,3,1,52), 1)),\"\")","v":""},""]
["Said",{"$f":"IFERROR(HLOOKUP(\"z^z\",OFFSET('semaine impaire (ac samedi pm)'!$B$1, MATCH($A24,OFFSET('semaine impaire (ac samedi pm)'!$B$1,MATCH(B$2,'semaine impaire (ac samedi pm)'!$B$1:$B$120,0)-1,1,12,1),0)-1+MATCH(B$2,'semaine impaire (ac samedi pm)'!$B$1:$B$120,0)-1,3,1,52),1,1),\"\")","v":"L"},{"$f":"IFERROR(OFFSET('semaine impaire (ac samedi pm)'!$D$2,,MATCH(B24,OFFSET('semaine impaire (ac samedi pm)'!$B$1, MATCH($A24,OFFSET('semaine impaire (ac samedi pm)'!$B$1,MATCH(B$2,'semaine impaire (ac samedi pm)'!$B$1:$B$120,0)-1,1,12,1),0)-1+MATCH(B$2,'semaine impaire (ac samedi pm)'!$B$1:$B$120,0)-1,3,1,52),0)),\"\")","v":"7h-7h15"},"7h",{"$f":"IFERROR(OFFSET('semaine impaire (ac samedi pm)'!$D$2,,MATCH(\"z^z\",OFFSET('semaine impaire (ac samedi pm)'!$B$1, MATCH($A24,OFFSET('semaine impaire (ac samedi pm)'!$B$1,MATCH(B$2,'semaine impaire (ac samedi pm)'!$B$1:$B$120,0)-1,1,12,1),0)-1+MATCH(B$2,'semaine impaire (ac samedi pm)'!$B$1:$B$120,0)-1,3,1,52), 1)),\"\")","v":"13h15-13H30"},"13H30",{"$f":"IFERROR(HLOOKUP(\"z^z\",OFFSET('semaine impaire (ac samedi pm)'!$B$1, MATCH($A24,OFFSET('semaine impaire (ac samedi pm)'!$B$1,MATCH(G$2,'semaine impaire (ac samedi pm)'!$B$1:$B$120,0)-1,1,12,1),0)-1+MATCH(G$2,'semaine impaire (ac samedi pm)'!$B$1:$B$120,0)-1,3,1,52),1,1),\"\")","v":"L"},{"$f":"IFERROR(OFFSET('semaine impaire (ac samedi pm)'!$D$2,,MATCH(G24,OFFSET('semaine impaire (ac samedi pm)'!$B$1, MATCH($A24,OFFSET('semaine impaire (ac samedi pm)'!$B$1,MATCH(G$2,'semaine impaire (ac samedi pm)'!$B$1:$B$120,0)-1,1,12,1),0)-1+MATCH(G$2,'semaine impaire (ac samedi pm)'!$B$1:$B$120,0)-1,3,1,52),0)),\"\")","v":"7h-7h15"},"7h",{"$f":"IFERROR(OFFSET('semaine impaire (ac samedi pm)'!$D$2,,MATCH(\"z^z\",OFFSET('semaine impaire (ac samedi pm)'!$B$1, MATCH($A24,OFFSET('semaine impaire (ac samedi pm)'!$B$1,MATCH(G$2,'semaine impaire (ac samedi pm)'!$B$1:$B$120,0)-1,1,12,1),0)-1+MATCH(G$2,'semaine impaire (ac samedi pm)'!$B$1:$B$120,0)-1,3,1,52), 1)),\"\")","v":"12h45-13H"},"13H",{"$f":"IFERROR(HLOOKUP(\"z^z\",OFFSET('semaine impaire (ac samedi pm)'!$B$1, MATCH($A24,OFFSET('semaine impaire (ac samedi pm)'!$B$1,MATCH(L$2,'semaine impaire (ac samedi pm)'!$B$1:$B$120,0)-1,1,12,1),0)-1+MATCH(L$2,'semaine impaire (ac samedi pm)'!$B$1:$B$120,0)-1,3,1,52),1,1),\"\")","v":"L"},{"$f":"IFERROR(OFFSET('semaine impaire (ac samedi pm)'!$D$2,,MATCH(L24,OFFSET('semaine impaire (ac samedi pm)'!$B$1, MATCH($A24,OFFSET('semaine impaire (ac samedi pm)'!$B$1,MATCH(L$2,'semaine impaire (ac samedi pm)'!$B$1:$B$120,0)-1,1,12,1),0)-1+MATCH(L$2,'semaine impaire (ac samedi pm)'!$B$1:$B$120,0)-1,3,1,52),0)),\"\")","v":"7h-7h15"},"7h",{"$f":"IFERROR(OFFSET('semaine impaire (ac samedi pm)'!$D$2,,MATCH(\"z^z\",OFFSET('semaine impaire (ac samedi pm)'!$B$1, MATCH($A24,OFFSET('semaine impaire (ac samedi pm)'!$B$1,MATCH(L$2,'semaine impaire (ac samedi pm)'!$B$1:$B$120,0)-1,1,12,1),0)-1+MATCH(L$2,'semaine impaire (ac samedi pm)'!$B$1:$B$120,0)-1,3,1,52), 1)),\"\")","v":"12h15-12H30"},"12H30",{"$f":"IFERROR(HLOOKUP(\"z^z\",OFFSET('semaine impaire (ac samedi pm)'!$B$1, MATCH($A24,OFFSET('semaine impaire (ac samedi pm)'!$B$1,MATCH(Q$2,'semaine impaire (ac samedi pm)'!$B$1:$B$120,0)-1,1,12,1),0)-1+MATCH(Q$2,'semaine impaire (ac samedi pm)'!$B$1:$B$120,0)-1,3,1,52),1,1),\"\")","v":"L"},{"$f":"IFERROR(OFFSET('semaine impaire (ac samedi pm)'!$D$2,,MATCH(Q24,OFFSET('semaine impaire (ac samedi pm)'!$B$1, MATCH($A24,OFFSET('semaine impaire (ac samedi pm)'!$B$1,MATCH(Q$2,'semaine impaire (ac samedi pm)'!$B$1:$B$120,0)-1,1,12,1),0)-1+MATCH(Q$2,'semaine impaire (ac samedi pm)'!$B$1:$B$120,0)-1,3,1,52),0)),\"\")","v":"7h-7h15"},"7h",{"$f":"IFERROR(OFFSET('semaine impaire (ac samedi pm)'!$D$2,,MATCH(\"z^z\",OFFSET('semaine impaire (ac samedi pm)'!$B$1, MATCH($A24,OFFSET('semaine impaire (ac samedi pm)'!$B$1,MATCH(Q$2,'semaine impaire (ac samedi pm)'!$B$1:$B$120,0)-1,1,12,1),0)-1+MATCH(Q$2,'semaine impaire (ac samedi pm)'!$B$1:$B$120,0)-1,3,1,52), 1)),\"\")","v":"13H45-14H"},"14H",{"$f":"IFERROR(HLOOKUP(\"z^z\",OFFSET('semaine impaire (ac samedi pm)'!$B$1, MATCH($A24,OFFSET('semaine impaire (ac samedi pm)'!$B$1,MATCH(V$2,'semaine impaire (ac samedi pm)'!$B$1:$B$120,0)-1,1,12,1),0)-1+MATCH(V$2,'semaine impaire (ac samedi pm)'!$B$1:$B$120,0)-1,3,1,52),1,1),\"\")","v":"L"},{"$f":"IFERROR(OFFSET('semaine impaire (ac samedi pm)'!$D$2,,MATCH(V24,OFFSET('semaine impaire (ac samedi pm)'!$B$1, MATCH($A24,OFFSET('semaine impaire (ac samedi pm)'!$B$1,MATCH(V$2,'semaine impaire (ac samedi pm)'!$B$1:$B$120,0)-1,1,12,1),0)-1+MATCH(V$2,'semaine impaire (ac samedi pm)'!$B$1:$B$120,0)-1,3,1,52),0)),\"\")","v":"7h-7h15"},"7h",{"$f":"IFERROR(OFFSET('semaine impaire (ac samedi pm)'!$D$2,,MATCH(\"z^z\",OFFSET('semaine impaire (ac samedi pm)'!$B$1, MATCH($A24,OFFSET('semaine impaire (ac samedi pm)'!$B$1,MATCH(V$2,'semaine impaire (ac samedi pm)'!$B$1:$B$120,0)-1,1,12,1),0)-1+MATCH(V$2,'semaine impaire (ac samedi pm)'!$B$1:$B$120,0)-1,3,1,52), 1)),\"\")","v":"13h-13H15"},"13H15",{"$f":"IFERROR(HLOOKUP(\"z^z\",OFFSET('semaine impaire (ac samedi pm)'!$B$1, MATCH($A24,OFFSET('semaine impaire (ac samedi pm)'!$B$1,MATCH(AA$2,'semaine impaire (ac samedi pm)'!$B$1:$B$120,0)-1,1,12,1),0)-1+MATCH(AA$2,'semaine impaire (ac samedi pm)'!$B$1:$B$120,0)-1,3,1,52),1,1),\"\")","v":"L"},{"$f":"IFERROR(OFFSET('semaine impaire (ac samedi pm)'!$D$2,,MATCH(AA24,OFFSET('semaine impaire (ac samedi pm)'!$B$1, MATCH($A24,OFFSET('semaine impaire (ac samedi pm)'!$B$1,MATCH(AA$2,'semaine impaire (ac samedi pm)'!$B$1:$B$120,0)-1,1,12,1),0)-1+MATCH(AA$2,'semaine impaire (ac samedi pm)'!$B$1:$B$120,0)-1,3,1,52),0)),\"\")","v":"13h30-13H45"},"13h30",{"$f":"IFERROR(OFFSET('semaine impaire (ac samedi pm)'!$D$2,,MATCH(\"z^z\",OFFSET('semaine impaire (ac samedi pm)'!$B$1, MATCH($A24,OFFSET('semaine impaire (ac samedi pm)'!$B$1,MATCH(AA$2,'semaine impaire (ac samedi pm)'!$B$1:$B$120,0)-1,1,12,1),0)-1+MATCH(AA$2,'semaine impaire (ac samedi pm)'!$B$1:$B$120,0)-1,3,1,52), 1)),\"\")","v":"18h45-19h"},"19h",{"$f":"IFERROR(HLOOKUP(\"z^z\",OFFSET('semaine impaire (ac samedi pm)'!$B$1, MATCH($A24,OFFSET('semaine impaire (ac samedi pm)'!$B$1,MATCH(AF$2,'semaine impaire (ac samedi pm)'!$B$1:$B$120,0)-1,1,12,1),0)-1+MATCH(AF$2,'semaine impaire (ac samedi pm)'!$B$1:$B$120,0)-1,3,1,52),1,1),\"\")","v":""},{"$f":"IFERROR(OFFSET('semaine impaire (ac samedi pm)'!$D$2,,MATCH(AF24,OFFSET('semaine impaire (ac samedi pm)'!$B$1, MATCH($A24,OFFSET('semaine impaire (ac samedi pm)'!$B$1,MATCH(AF$2,'semaine impaire (ac samedi pm)'!$B$1:$B$120,0)-1,1,12,1),0)-1+MATCH(AF$2,'semaine impaire (ac samedi pm)'!$B$1:$B$120,0)-1,3,1,52),0)),\"\")","v":""},"",{"$f":"IFERROR(OFFSET('semaine impaire (ac samedi pm)'!$D$2,,MATCH(\"z^z\",OFFSET('semaine impaire (ac samedi pm)'!$B$1, MATCH($A24,OFFSET('semaine impaire (ac samedi pm)'!$B$1,MATCH(AF$2,'semaine impaire (ac samedi pm)'!$B$1:$B$120,0)-1,1,12,1),0)-1+MATCH(AF$2,'semaine impaire (ac samedi pm)'!$B$1:$B$120,0)-1,3,1,52), 1)),\"\")","v":""},""]
["Thibaut",{"$f":"IFERROR(HLOOKUP(\"z^z\",OFFSET('semaine impaire (ac samedi pm)'!$B$1, MATCH($A25,OFFSET('semaine impaire (ac samedi pm)'!$B$1,MATCH(B$2,'semaine impaire (ac samedi pm)'!$B$1:$B$120,0)-1,1,12,1),0)-1+MATCH(B$2,'semaine impaire (ac samedi pm)'!$B$1:$B$120,0)-1,3,1,52),1,1),\"\")","v":"L"},{"$f":"IFERROR(OFFSET('semaine impaire (ac samedi pm)'!$D$2,,MATCH(B25,OFFSET('semaine impaire (ac samedi pm)'!$B$1, MATCH($A25,OFFSET('semaine impaire (ac samedi pm)'!$B$1,MATCH(B$2,'semaine impaire (ac samedi pm)'!$B$1:$B$120,0)-1,1,12,1),0)-1+MATCH(B$2,'semaine impaire (ac samedi pm)'!$B$1:$B$120,0)-1,3,1,52),0)),\"\")","v":"6h30-6h45"},"6h30",{"$f":"IFERROR(OFFSET('semaine impaire (ac samedi pm)'!$D$2,,MATCH(\"z^z\",OFFSET('semaine impaire (ac samedi pm)'!$B$1, MATCH($A25,OFFSET('semaine impaire (ac samedi pm)'!$B$1,MATCH(B$2,'semaine impaire (ac samedi pm)'!$B$1:$B$120,0)-1,1,12,1),0)-1+MATCH(B$2,'semaine impaire (ac samedi pm)'!$B$1:$B$120,0)-1,3,1,52), 1)),\"\")","v":"12h45-13H"},"13H",{"$f":"IFERROR(HLOOKUP(\"z^z\",OFFSET('semaine impaire (ac samedi pm)'!$B$1, MATCH($A25,OFFSET('semaine impaire (ac samedi pm)'!$B$1,MATCH(G$2,'semaine impaire (ac samedi pm)'!$B$1:$B$120,0)-1,1,12,1),0)-1+MATCH(G$2,'semaine impaire (ac samedi pm)'!$B$1:$B$120,0)-1,3,1,52),1,1),\"\")","v":"L"},{"$f":"IFERROR(OFFSET('semaine impaire (ac samedi pm)'!$D$2,,MATCH(G25,OFFSET('semaine impaire (ac samedi pm)'!$B$1, MATCH($A25,OFFSET('semaine impaire (ac samedi pm)'!$B$1,MATCH(G$2,'semaine impaire (ac samedi pm)'!$B$1:$B$120,0)-1,1,12,1),0)-1+MATCH(G$2,'semaine impaire (ac samedi pm)'!$B$1:$B$120,0)-1,3,1,52),0)),\"\")","v":"6h30-6h45"},"6h30",{"$f":"IFERROR(OFFSET('semaine impaire (ac samedi pm)'!$D$2,,MATCH(\"z^z\",OFFSET('semaine impaire (ac samedi pm)'!$B$1, MATCH($A25,OFFSET('semaine impaire (ac samedi pm)'!$B$1,MATCH(G$2,'semaine impaire (ac samedi pm)'!$B$1:$B$120,0)-1,1,12,1),0)-1+MATCH(G$2,'semaine impaire (ac samedi pm)'!$B$1:$B$120,0)-1,3,1,52), 1)),\"\")","v":"11h45-12H"},"12H",{"$f":"IFERROR(HLOOKUP(\"z^z\",OFFSET('semaine impaire (ac samedi pm)'!$B$1, MATCH($A25,OFFSET('semaine impaire (ac samedi pm)'!$B$1,MATCH(L$2,'semaine impaire (ac samedi pm)'!$B$1:$B$120,0)-1,1,12,1),0)-1+MATCH(L$2,'semaine impaire (ac samedi pm)'!$B$1:$B$120,0)-1,3,1,52),1,1),\"\")","v":"L"},{"$f":"IFERROR(OFFSET('semaine impaire (ac samedi pm)'!$D$2,,MATCH(L25,OFFSET('semaine impaire (ac samedi pm)'!$B$1, MATCH($A25,OFFSET('semaine impaire (ac samedi pm)'!$B$1,MATCH(L$2,'semaine impaire (ac samedi pm)'!$B$1:$B$120,0)-1,1,12,1),0)-1+MATCH(L$2,'semaine impaire (ac samedi pm)'!$B$1:$B$120,0)-1,3,1,52),0)),\"\")","v":"7h30-7h45"},"7h30",{"$f":"IFERROR(OFFSET('semaine impaire (ac samedi pm)'!$D$2,,MATCH(\"z^z\",OFFSET('semaine impaire (ac samedi pm)'!$B$1, MATCH($A25,OFFSET('semaine impaire (ac samedi pm)'!$B$1,MATCH(L$2,'semaine impaire (ac samedi pm)'!$B$1:$B$120,0)-1,1,12,1),0)-1+MATCH(L$2,'semaine impaire (ac samedi pm)'!$B$1:$B$120,0)-1,3,1,52), 1)),\"\")","v":"11h45-12H"},"12H",{"$f":"IFERROR(HLOOKUP(\"z^z\",OFFSET('semaine impaire (ac samedi pm)'!$B$1, MATCH($A25,OFFSET('semaine impaire (ac samedi pm)'!$B$1,MATCH(Q$2,'semaine impaire (ac samedi pm)'!$B$1:$B$120,0)-1,1,12,1),0)-1+MATCH(Q$2,'semaine impaire (ac samedi pm)'!$B$1:$B$120,0)-1,3,1,52),1,1),\"\")","v":"L"},{"$f":"IFERROR(OFFSET('semaine impaire (ac samedi pm)'!$D$2,,MATCH(Q25,OFFSET('semaine impaire (ac samedi pm)'!$B$1, MATCH($A25,OFFSET('semaine impaire (ac samedi pm)'!$B$1,MATCH(Q$2,'semaine impaire (ac samedi pm)'!$B$1:$B$120,0)-1,1,12,1),0)-1+MATCH(Q$2,'semaine impaire (ac samedi pm)'!$B$1:$B$120,0)-1,3,1,52),0)),\"\")","v":"6h30-6h45"},"6h30",{"$f":"IFERROR(OFFSET('semaine impaire (ac samedi pm)'!$D$2,,MATCH(\"z^z\",OFFSET('semaine impaire (ac samedi pm)'!$B$1, MATCH($A25,OFFSET('semaine impaire (ac samedi pm)'!$B$1,MATCH(Q$2,'semaine impaire (ac samedi pm)'!$B$1:$B$120,0)-1,1,12,1),0)-1+MATCH(Q$2,'semaine impaire (ac samedi pm)'!$B$1:$B$120,0)-1,3,1,52), 1)),\"\")","v":"12h30-12H45"},"12H45",{"$f":"IFERROR(HLOOKUP(\"z^z\",OFFSET('semaine impaire (ac samedi pm)'!$B$1, MATCH($A25,OFFSET('semaine impaire (ac samedi pm)'!$B$1,MATCH(V$2,'semaine impaire (ac samedi pm)'!$B$1:$B$120,0)-1,1,12,1),0)-1+MATCH(V$2,'semaine impaire (ac samedi pm)'!$B$1:$B$120,0)-1,3,1,52),1,1),\"\")","v":"L"},{"$f":"IFERROR(OFFSET('semaine impaire (ac samedi pm)'!$D$2,,MATCH(V25,OFFSET('semaine impaire (ac samedi pm)'!$B$1, MATCH($A25,OFFSET('semaine impaire (ac samedi pm)'!$B$1,MATCH(V$2,'semaine impaire (ac samedi pm)'!$B$1:$B$120,0)-1,1,12,1),0)-1+MATCH(V$2,'semaine impaire (ac samedi pm)'!$B$1:$B$120,0)-1,3,1,52),0)),\"\")","v":"7h30-7h45"},"7h30",{"$f":"IFERROR(OFFSET('semaine impaire (ac samedi pm)'!$D$2,,MATCH(\"z^z\",OFFSET('semaine impaire (ac samedi pm)'!$B$1, MATCH($A25,OFFSET('semaine impaire (ac samedi pm)'!$B$1,MATCH(V$2,'semaine impaire (ac samedi pm)'!$B$1:$B$120,0)-1,1,12,1),0)-1+MATCH(V$2,'semaine impaire (ac samedi pm)'!$B$1:$B$120,0)-1,3,1,52), 1)),\"\")","v":"17h45-18h"},"18h",{"$f":"IFERROR(HLOOKUP(\"z^z\",OFFSET('semaine impaire (ac samedi pm)'!$B$1, MATCH($A25,OFFSET('semaine impaire (ac samedi pm)'!$B$1,MATCH(AA$2,'semaine impaire (ac samedi pm)'!$B$1:$B$120,0)-1,1,12,1),0)-1+MATCH(AA$2,'semaine impaire (ac samedi pm)'!$B$1:$B$120,0)-1,3,1,52),1,1),\"\")","v":"L"},{"$f":"IFERROR(OFFSET('semaine impaire (ac samedi pm)'!$D$2,,MATCH(AA25,OFFSET('semaine impaire (ac samedi pm)'!$B$1, MATCH($A25,OFFSET('semaine impaire (ac samedi pm)'!$B$1,MATCH(AA$2,'semaine impaire (ac samedi pm)'!$B$1:$B$120,0)-1,1,12,1),0)-1+MATCH(AA$2,'semaine impaire (ac samedi pm)'!$B$1:$B$120,0)-1,3,1,52),0)),\"\")","v":"13h-13H15"},"13h",{"$f":"IFERROR(OFFSET('semaine impaire (ac samedi pm)'!$D$2,,MATCH(\"z^z\",OFFSET('semaine impaire (ac samedi pm)'!$B$1, MATCH($A25,OFFSET('semaine impaire (ac samedi pm)'!$B$1,MATCH(AA$2,'semaine impaire (ac samedi pm)'!$B$1:$B$120,0)-1,1,12,1),0)-1+MATCH(AA$2,'semaine impaire (ac samedi pm)'!$B$1:$B$120,0)-1,3,1,52), 1)),\"\")","v":"18h45-19h"},"19h",{"$f":"IFERROR(HLOOKUP(\"z^z\",OFFSET('semaine impaire (ac samedi pm)'!$B$1, MATCH($A25,OFFSET('semaine impaire (ac samedi pm)'!$B$1,MATCH(AF$2,'semaine impaire (ac samedi pm)'!$B$1:$B$120,0)-1,1,12,1),0)-1+MATCH(AF$2,'semaine impaire (ac samedi pm)'!$B$1:$B$120,0)-1,3,1,52),1,1),\"\")","v":""},{"$f":"IFERROR(OFFSET('semaine impaire (ac samedi pm)'!$D$2,,MATCH(AF25,OFFSET('semaine impaire (ac samedi pm)'!$B$1, MATCH($A25,OFFSET('semaine impaire (ac samedi pm)'!$B$1,MATCH(AF$2,'semaine impaire (ac samedi pm)'!$B$1:$B$120,0)-1,1,12,1),0)-1+MATCH(AF$2,'semaine impaire (ac samedi pm)'!$B$1:$B$120,0)-1,3,1,52),0)),\"\")","v":""},"",{"$f":"IFERROR(OFFSET('semaine impaire (ac samedi pm)'!$D$2,,MATCH(\"z^z\",OFFSET('semaine impaire (ac samedi pm)'!$B$1, MATCH($A25,OFFSET('semaine impaire (ac samedi pm)'!$B$1,MATCH(AF$2,'semaine impaire (ac samedi pm)'!$B$1:$B$120,0)-1,1,12,1),0)-1+MATCH(AF$2,'semaine impaire (ac samedi pm)'!$B$1:$B$120,0)-1,3,1,52), 1)),\"\")","v":""},""]
["Vanessa",{"$f":"IFERROR(HLOOKUP(\"z^z\",OFFSET('semaine impaire (ac samedi pm)'!$B$1, MATCH($A26,OFFSET('semaine impaire (ac samedi pm)'!$B$1,MATCH(B$2,'semaine impaire (ac samedi pm)'!$B$1:$B$120,0)-1,1,12,1),0)-1+MATCH(B$2,'semaine impaire (ac samedi pm)'!$B$1:$B$120,0)-1,3,1,52),1,1),\"\")","v":"D/MG"},{"$f":"IFERROR(OFFSET('semaine impaire (ac samedi pm)'!$D$2,,MATCH(B26,OFFSET('semaine impaire (ac samedi pm)'!$B$1, MATCH($A26,OFFSET('semaine impaire (ac samedi pm)'!$B$1,MATCH(B$2,'semaine impaire (ac samedi pm)'!$B$1:$B$120,0)-1,1,12,1),0)-1+MATCH(B$2,'semaine impaire (ac samedi pm)'!$B$1:$B$120,0)-1,3,1,52),0)),\"\")","v":"9h30-9H45"},"9h30",{"$f":"IFERROR(OFFSET('semaine impaire (ac samedi pm)'!$D$2,,MATCH(\"z^z\",OFFSET('semaine impaire (ac samedi pm)'!$B$1, MATCH($A26,OFFSET('semaine impaire (ac samedi pm)'!$B$1,MATCH(B$2,'semaine impaire (ac samedi pm)'!$B$1:$B$120,0)-1,1,12,1),0)-1+MATCH(B$2,'semaine impaire (ac samedi pm)'!$B$1:$B$120,0)-1,3,1,52), 1)),\"\")","v":"13H45-14H"},"14H",{"$f":"IFERROR(HLOOKUP(\"z^z\",OFFSET('semaine impaire (ac samedi pm)'!$B$1, MATCH($A26,OFFSET('semaine impaire (ac samedi pm)'!$B$1,MATCH(G$2,'semaine impaire (ac samedi pm)'!$B$1:$B$120,0)-1,1,12,1),0)-1+MATCH(G$2,'semaine impaire (ac samedi pm)'!$B$1:$B$120,0)-1,3,1,52),1,1),\"\")","v":"D/MG"},{"$f":"IFERROR(OFFSET('semaine impaire (ac samedi pm)'!$D$2,,MATCH(G26,OFFSET('semaine impaire (ac samedi pm)'!$B$1, MATCH($A26,OFFSET('semaine impaire (ac samedi pm)'!$B$1,MATCH(G$2,'semaine impaire (ac samedi pm)'!$B$1:$B$120,0)-1,1,12,1),0)-1+MATCH(G$2,'semaine impaire (ac samedi pm)'!$B$1:$B$120,0)-1,3,1,52),0)),\"\")","v":"7h30-7h45"},"7h30",{"$f":"IFERROR(OFFSET('semaine impaire (ac samedi pm)'!$D$2,,MATCH(\"z^z\",OFFSET('semaine impaire (ac samedi pm)'!$B$1, MATCH($A26,OFFSET('semaine impaire (ac samedi pm)'!$B$1,MATCH(G$2,'semaine impaire (ac samedi pm)'!$B$1:$B$120,0)-1,1,12,1),0)-1+MATCH(G$2,'semaine impaire (ac samedi pm)'!$B$1:$B$120,0)-1,3,1,52), 1)),\"\")","v":"17h30-17h45"},"17h45",{"$f":"IFERROR(HLOOKUP(\"z^z\",OFFSET('semaine impaire (ac samedi pm)'!$B$1, MATCH($A26,OFFSET('semaine impaire (ac samedi pm)'!$B$1,MATCH(L$2,'semaine impaire (ac samedi pm)'!$B$1:$B$120,0)-1,1,12,1),0)-1+MATCH(L$2,'semaine impaire (ac samedi pm)'!$B$1:$B$120,0)-1,3,1,52),1,1),\"\")","v":""},{"$f":"IFERROR(OFFSET('semaine impaire (ac samedi pm)'!$D$2,,MATCH(L26,OFFSET('semaine impaire (ac samedi pm)'!$B$1, MATCH($A26,OFFSET('semaine impaire (ac samedi pm)'!$B$1,MATCH(L$2,'semaine impaire (ac samedi pm)'!$B$1:$B$120,0)-1,1,12,1),0)-1+MATCH(L$2,'semaine impaire (ac samedi pm)'!$B$1:$B$120,0)-1,3,1,52),0)),\"\")","v":""},"",{"$f":"IFERROR(OFFSET('semaine impaire (ac samedi pm)'!$D$2,,MATCH(\"z^z\",OFFSET('semaine impaire (ac samedi pm)'!$B$1, MATCH($A26,OFFSET('semaine impaire (ac samedi pm)'!$B$1,MATCH(L$2,'semaine impaire (ac samedi pm)'!$B$1:$B$120,0)-1,1,12,1),0)-1+MATCH(L$2,'semaine impaire (ac samedi pm)'!$B$1:$B$120,0)-1,3,1,52), 1)),\"\")","v":""},"",{"$f":"IFERROR(HLOOKUP(\"z^z\",OFFSET('semaine impaire (ac samedi pm)'!$B$1, MATCH($A26,OFFSET('semaine impaire (ac samedi pm)'!$B$1,MATCH(Q$2,'semaine impaire (ac samedi pm)'!$B$1:$B$120,0)-1,1,12,1),0)-1+MATCH(Q$2,'semaine impaire (ac samedi pm)'!$B$1:$B$120,0)-1,3,1,52),1,1),\"\")","v":"D/MG"},{"$f":"IFERROR(OFFSET('semaine impaire (ac samedi pm)'!$D$2,,MATCH(Q26,OFFSET('semaine impaire (ac samedi pm)'!$B$1, MATCH($A26,OFFSET('semaine impaire (ac samedi pm)'!$B$1,MATCH(Q$2,'semaine impaire (ac samedi pm)'!$B$1:$B$120,0)-1,1,12,1),0)-1+MATCH(Q$2,'semaine impaire (ac samedi pm)'!$B$1:$B$120,0)-1,3,1,52),0)),\"\")","v":"9h30-9H45"},"9h30",{"$f":"IFERROR(OFFSET('semaine impaire (ac samedi pm)'!$D$2,,MATCH(\"z^z\",OFFSET('semaine impaire (ac samedi pm)'!$B$1, MATCH($A26,OFFSET('semaine impaire (ac samedi pm)'!$B$1,MATCH(Q$2,'semaine impaire (ac samedi pm)'!$B$1:$B$120,0)-1,1,12,1),0)-1+MATCH(Q$2,'semaine impaire (ac samedi pm)'!$B$1:$B$120,0)-1,3,1,52), 1)),\"\")","v":"17h15-17h30"},"17h30",{"$f":"IFERROR(HLOOKUP(\"z^z\",OFFSET('semaine impaire (ac samedi pm)'!$B$1, MATCH($A26,OFFSET('semaine impaire (ac samedi pm)'!$B$1,MATCH(V$2,'semaine impaire (ac samedi pm)'!$B$1:$B$120,0)-1,1,12,1),0)-1+MATCH(V$2,'semaine impaire (ac samedi pm)'!$B$1:$B$120,0)-1,3,1,52),1,1),\"\")","v":"D/MG"},{"$f":"IFERROR(OFFSET('semaine impaire (ac samedi pm)'!$D$2,,MATCH(V26,OFFSET('semaine impaire (ac samedi pm)'!$B$1, MATCH($A26,OFFSET('semaine impaire (ac samedi pm)'!$B$1,MATCH(V$2,'semaine impaire (ac samedi pm)'!$B$1:$B$120,0)-1,1,12,1),0)-1+MATCH(V$2,'semaine impaire (ac samedi pm)'!$B$1:$B$120,0)-1,3,1,52),0)),\"\")","v":"9h30-9H45"},"9h30",{"$f":"IFERROR(OFFSET('semaine impaire (ac samedi pm)'!$D$2,,MATCH(\"z^z\",OFFSET('semaine impaire (ac samedi pm)'!$B$1, MATCH($A26,OFFSET('semaine impaire (ac samedi pm)'!$B$1,MATCH(V$2,'semaine impaire (ac samedi pm)'!$B$1:$B$120,0)-1,1,12,1),0)-1+MATCH(V$2,'semaine impaire (ac samedi pm)'!$B$1:$B$120,0)-1,3,1,52), 1)),\"\")","v":"15H-15H15"},"15H15",{"$f":"IFERROR(HLOOKUP(\"z^z\",OFFSET('semaine impaire (ac samedi pm)'!$B$1, MATCH($A26,OFFSET('semaine impaire (ac samedi pm)'!$B$1,MATCH(AA$2,'semaine impaire (ac samedi pm)'!$B$1:$B$120,0)-1,1,12,1),0)-1+MATCH(AA$2,'semaine impaire (ac samedi pm)'!$B$1:$B$120,0)-1,3,1,52),1,1),\"\")","v":"D/MG"},{"$f":"IFERROR(OFFSET('semaine impaire (ac samedi pm)'!$D$2,,MATCH(AA26,OFFSET('semaine impaire (ac samedi pm)'!$B$1, MATCH($A26,OFFSET('semaine impaire (ac samedi pm)'!$B$1,MATCH(AA$2,'semaine impaire (ac samedi pm)'!$B$1:$B$120,0)-1,1,12,1),0)-1+MATCH(AA$2,'semaine impaire (ac samedi pm)'!$B$1:$B$120,0)-1,3,1,52),0)),\"\")","v":"9h30-9H45"},"9h30",{"$f":"IFERROR(OFFSET('semaine impaire (ac samedi pm)'!$D$2,,MATCH(\"z^z\",OFFSET('semaine impaire (ac samedi pm)'!$B$1, MATCH($A26,OFFSET('semaine impaire (ac samedi pm)'!$B$1,MATCH(AA$2,'semaine impaire (ac samedi pm)'!$B$1:$B$120,0)-1,1,12,1),0)-1+MATCH(AA$2,'semaine impaire (ac samedi pm)'!$B$1:$B$120,0)-1,3,1,52), 1)),\"\")","v":"12h45-13H"},"13H",{"$f":"IFERROR(HLOOKUP(\"z^z\",OFFSET('semaine impaire (ac samedi pm)'!$B$1, MATCH($A26,OFFSET('semaine impaire (ac samedi pm)'!$B$1,MATCH(AF$2,'semaine impaire (ac samedi pm)'!$B$1:$B$120,0)-1,1,12,1),0)-1+MATCH(AF$2,'semaine impaire (ac samedi pm)'!$B$1:$B$120,0)-1,3,1,52),1,1),\"\")","v":""},{"$f":"IFERROR(OFFSET('semaine impaire (ac samedi pm)'!$D$2,,MATCH(AF26,OFFSET('semaine impaire (ac samedi pm)'!$B$1, MATCH($A26,OFFSET('semaine impaire (ac samedi pm)'!$B$1,MATCH(AF$2,'semaine impaire (ac samedi pm)'!$B$1:$B$120,0)-1,1,12,1),0)-1+MATCH(AF$2,'semaine impaire (ac samedi pm)'!$B$1:$B$120,0)-1,3,1,52),0)),\"\")","v":""},"",{"$f":"IFERROR(OFFSET('semaine impaire (ac samedi pm)'!$D$2,,MATCH(\"z^z\",OFFSET('semaine impaire (ac samedi pm)'!$B$1, MATCH($A26,OFFSET('semaine impaire (ac samedi pm)'!$B$1,MATCH(AF$2,'semaine impaire (ac samedi pm)'!$B$1:$B$120,0)-1,1,12,1),0)-1+MATCH(AF$2,'semaine impaire (ac samedi pm)'!$B$1:$B$120,0)-1,3,1,52), 1)),\"\")","v":""},""]

{"sheet":"horaires employés (2)","index":6,"n_rows":27,"n_cols":15,"rows_kept":27,"cut":false,"hidden":false,"merged":[]}
[null,"Horaires employés semaine paire (sans samedi pm)"]
[null,"LUNDI",null,"MARDI",null,"MERCREDI",null,"JEUDI",null,"VENDREDI",null,"SAMEDI",null,"DIMANCHE"]
[null,"Plage 1","Plage 2","Plage 1","Plage 2","Plage 1","Plage 2","Plage 1","Plage 2","Plage 1","Plage 2","Plage 1","Plage 2","Plage 1","Plage 2"]
["Assiya","F - 6h30-12H45",null,"F - 6h30-12H",null,"F - 6h30-11H30",null,"F - 6h30-13H",null,"F - 6h30-11H","F - 14H-17h","F - 6h30-12H30"]
["Aurore","S - 7h-13H",null,"S - 7h-12H",null,"S - 7h-10H",null,"S - 7h-13H",null,"S - 7h-12H",null,"S - 7h-12H","B - 15H-18h"]
["Bertrand","S - 9h30-14H",null,null,null,"S - 14H-17h30",null,"S - 9h30-14H",null,"S - 13h-17h30",null,"S - 9h30-12H30"]
["Corinne","S - 7h-13H30",null,"S - 7h-12H30","S - 14h30-18h","S - 7h30-12H",null,"S - 7h-13H30",null,"S - 7h30-12H15",null,"S - 7h-12H30"]
["Francoise","F - 6h45-13H",null,"F - 6h45-12H30",null,"F - 6h45-11H15",null,"F - 6h45-12H45",null,"F - 6h45-12H","F - 14H-17h","F - 6h30-12H30"]
["Ghislaine","DPH - 6h30-12H30",null,"DPH - 6h30-12H30",null,"DPH - 7h30-12H15",null,"DPH - 6h30-12H","DPH - 14H-18h","DPH - 7h30-12H30",null,"DPH - 7h-12H30"]
["Laura","S - 6h30-12H30","S - 14h30-18H","S - 6h30-12H30",null,"S - 7h30-12H15",null,"S - 6h30-13H",null,"S - 7h30-12H",null,"S - 7h-12H30"]
["Said","L - 7h-13H30",null,"L - 7h-13H",null,"L - 7h-12H30",null,"L - 7h-14H",null,"L - 7h-13H15",null,"L - 7h-12H30"]
["Thibaut","L - 6h30-13H",null,"L - 6h30-12H",null,"L - 7h30-12H",null,"L - 6h30-12H45",null,"L - 7h30-11H30","L - 14H-18h","L - 7h-13H"]
["Vanessa","D/MG - 9h30-14H",null,"D/MG - 7h30-12H30","D/MG - 14h30-17h45",null,null,"D/MG - 9h30-12H30","D/MG - 14h30-17h30","D/MG - 9h30-15H15",null,"D/MG - 9h30-13H"]
[]
[null,"Horaires employés semaine impaire (ac samedi pm)"]
[null,"LUNDI",null,"MARDI",null,"MERCREDI",null,"JEUDI",null,"VENDREDI",null,"SAMEDI",null,"DIMANCHE"]
[null,"Plage 1","Plage 2","Plage 1","Plage 2","Plage 1","Plage 2","Plage 1","Plage 2","Plage 1","Plage 2","Plage 1","Plage 2","Plage 1","Plage 2"]
["Assiya","F - 6h30-12H45",null,"F - 6h30-12H15",null,"F - 6h30-11H30",null,"F - 6h30-13H",null,"F - 6h30-11H",null,"F - 6h30-11H45","F - 14H-17h30"]
["Aurore","S - 7h-13H",null,"S - 7h-12H",null,"S - 7h-10H",null,"S - 7h-13H",null,"S - 7h-12H",null,"S - 14H-19h"]
["Bertrand","S - 9h30-14H",null,null,null,"S - 14H-17h30",null,"S - 9h30-14H",null,"S - 13h-17h30",null,"S - 9h30-12H30"]
["Corinne","S - 7h-13H30",null,"S - 7h-12H30","S - 14h30-18h","S - 7h30-12H",null,"S - 7h-13H30",null,"S - 7h30-12H15",null,"s - 13h30-19h"]
["Francoise","F - 6h45-12H45",null,"F - 6h45-12H30",null,"F - 6h45-11H15",null,"F - 6h45-12H45",null,"F - 6h45-12H15",null,"F - 6h30-12H","F - 14H-17h30"]
["Ghislaine","DPH - 6h30-12H30",null,"DPH - 7h30-12H30",null,"DPH - 7h30-12H15",null,"DPH - 6h30-12H","DPH - 14H-17h15","DPH - 7h30-12H30",null,"DPH - 8h30-11H30","dph - 13h30-17h45"]
["Laura","S - 6h30-12H30","S - 14h30-18h","S - 6h30-12H30",null,"S - 7h30-12H15",null,"S - 6h30-13H",null,"S - 7h30-12H",null,"s - 13h30-19h"]
["Said","L - 7h-13H30",null,"L - 7h-13H",null,"L - 7h-12H30",null,"L - 7h-14H",null,"L - 7h-13H15",null,"L - 13h30-19h"]
["Thibaut","L - 6h30-13H",null,"L - 6h30-12H",null,"L - 7h30-12H",null,"L - 6h30-12H45",null,"L - 7h30-11H30","L - 14H-18h","L - 13h-19h"]
["Vanessa","D/MG - 9h30-14H",null,"D/MG - 7h30-12H30","D/MG - 14h30-17h45",null,null,"D/MG - 9h30-12H30","D/MG - 14h30-17h30","D/MG - 9h30-15H15",null,"D/MG - 9h30-13H"]