{"text_format":"1","workbook":"xlsx","n_sheets":16,"sheets":["Relevé","Config","Employés","Janvier","Février","Mars","Avril","Mai","Juin","Juillet","Août","Septembre","Octobre","Novembre","Décembre","Guide utilisateur"],"not_rendered":{"charts":0,"images":0,"macros":1,"external_links":0,"defined_names":5,"comments":0,"pivot_tables":0},"unopened":[],"bounds":{"document_bytes":16777216,"sheet_cells":100000,"rows_first":2000,"rows_last":500,"rows_between":2000,"halvings":0,"cell_chars":16384,"cell_head_chars":4096},"cells_cut":0,"cells_raw":0,"read":"whole","date_system":"1900"}

{"sheet":"Relevé","index":0,"n_rows":78,"n_cols":29,"rows_kept":78,"cut":false,"hidden":false,"merged":[[6,2,6,24],[9,7,9,8],[9,13,9,14],[11,2,11,8],[11,10,11,16],[11,18,11,24],[48,16,48,24],[38,2,38,8],[38,10,38,16],[38,18,38,24],[1,6,1,19],[2,8,2,17],[4,2,4,5],[4,6,4,9],[4,17,4,24],[4,12,4,16],[20,2,20,8],[20,10,20,16],[20,18,20,24],[29,2,29,8],[29,10,29,16],[29,18,29,24]]}
[{"$f":"IFERROR(VLOOKUP(employe_ID,Employés!$A$2:$M$7,7,0),\"\")","v":0},"MonLogo"]
[null,null,null,null,null,null,"Relevé de congés annuels"]
[null,null,null,null,null,null,null,null,{"$f":"\"du \"&TEXT(DATE(ref_annee,1,1),\"j mmm\")&\" au \"&TEXT(DATE(ref_annee,12,31),\"j mmm aaaa\")","v":"du 1 janv au 31 déc 2015"}]
[]
[null,null,"# Employé:",null,null,null,"abc456",null,null,null,null,null,"Prénom & Nom:",null,null,null,null,{"$f":"PROPER(IF(employe_ID=\"\",\"Entrer un # employé\",IFERROR(VLOOKUP(employe_ID,employes,3,0)&\" \"&VLOOKUP(employe_ID,employes,2,0),\"# Employé inexistant\")))","v":"Pierre Durand"}]
[]
[null,null,"Détails des congés:"]
[null,null,{"$f":"$I$48&\"_Acc:\"","v":"Vacances_Acc:"},null,null,null,null,{"$f":"IFERROR(VLOOKUP(employe_ID,employes,4,0),\"\")","v":25},null,null,{"$f":"$N$48&\"_Acc:\"","v":"RTT_Acc:"},null,null,{"$f":"IFERROR(VLOOKUP(employe_ID,employes,5,0),\"\")","v":6},null,null,null,{"$f":"$R$48&\"_Acc:\"","v":"Arrêt Maladie_Acc:"},null,null,null,null,null,{"$f":"IFERROR(VLOOKUP(employe_ID,employes,6,0),\"\")","v":4}]
[null,null,{"$f":"$I$48&\"_Prises:\"","v":"Vacances_Prises:"},null,null,null,null,{"$f":"IF(H8<>\"\",COUNTIF($C$52:$Y$78,Config!$A$2),\"\")","v":2},null,null,{"$f":"$N$48&\"_Pris:\"","v":"RTT_Pris:"},null,null,{"$f":"IF(N8<>\"\",COUNTIF($C$52:$Y$78,Config!$A$3),\"\")","v":3},null,null,null,{"$f":"$R$48&\"_Pris:\"","v":"Arrêt Maladie_Pris:"},null,null,null,null,null,{"$f":"IF(X8<>\"\",COUNTIF($C$52:$Y$78,Config!$A$4),\"\")","v":2}]
[null,null,{"$f":"$I$48&\"_Solde:\"","v":"Vacances_Solde:"},null,null,null,null,{"$f":"IFERROR((H8-H9),\"\")","v":23},null,null,{"$f":"$N$48&\"_Solde:\"","v":"RTT_Solde:"},null,null,{"$f":"IFERROR((N8-N9),\"\")","v":3},null,null,null,{"$f":"$R$48&\"_Solde:\"","v":"Arrêt Maladie_Solde:"},null,null,null,null,null,{"$f":"IFERROR((X8-X9),\"\")","v":2}]
[]
[null,null,{"$f":"EDATE(DATE(ref_annee,1,1),0)","v":"2015-01-01"},null,null,null,null,null,null,null,{"$f":"EDATE(DATE(ref_annee,1,1),1)","v":"2015-02-01"},null,null,null,null,null,null,null,{"$f":"EDATE(DATE(ref_annee,1,1),2)","v":"2015-03-01"}]
[null,null,"L","M","M","J","V","S","D",null,"L","M","M","J","V","S","D",null,"L","M","M","J","V","S","D",null,null,null,"À quoi sert ce fichier?"]
[null,null,{"$f":"IF(WEEKDAY(C12)=2,C12,\"\")","v":""},{"$f":"IF(C14<>\"\",C14+1,IF(WEEKDAY(C12)=3,C12,\"\"))","v":""},{"$f":"IF(D14<>\"\",D14+1,IF(WEEKDAY(C12)=4,C12,\"\"))","v":""},{"$f":"IF(E14<>\"\",E14+1,IF(WEEKDAY(C12)=5,C12,\"\"))","v":"2015-01-01"},{"$f":"IF(F14<>\"\",F14+1,IF(WEEKDAY(C12)=6,C12,\"\"))","v":"2015-01-02"},{"$f":"IF(G14<>\"\",G14+1,IF(WEEKDAY(C12)=7,C12,\"\"))","v":"2015-01-03"},{"$f":"IF(H14<>\"\",H14+1,IF(WEEKDAY(C12)=1,C12,\"\"))","v":"2015-01-04"},null,{"$f":"IF(WEEKDAY(K12)=2,K12,\"\")","v":""},{"$f":"IF(K14<>\"\",K14+1,IF(WEEKDAY(K12)=3,K12,\"\"))","v":""},{"$f":"IF(L14<>\"\",L14+1,IF(WEEKDAY(K12)=4,K12,\"\"))","v":""},{"$f":"IF(M14<>\"\",M14+1,IF(WEEKDAY(K12)=5,K12,\"\"))","v":""},{"$f":"IF(N14<>\"\",N14+1,IF(WEEKDAY(K12)=6,K12,\"\"))","v":""},{"$f":"IF(O14<>\"\",O14+1,IF(WEEKDAY(K12)=7,K12,\"\"))","v":""},{"$f":"IF(P14<>\"\",P14+1,IF(WEEKDAY(K12)=1,K12,\"\"))","v":"2015-02-01"},null,{"$f":"IF(WEEKDAY(S12)=2,S12,\"\")","v":""},{"$f":"IF(S14<>\"\",S14+1,IF(WEEKDAY(S12)=3,S12,\"\"))","v":""},{"$f":"IF(T14<>\"\",T14+1,IF(WEEKDAY(S12)=4,S12,\"\"))","v":""},{"$f":"IF(U14<>\"\",U14+1,IF(WEEKDAY(S12)=5,S12,\"\"))","v":""},{"$f":"IF(V14<>\"\",V14+1,IF(WEEKDAY(S12)=6,S12,\"\"))","v":""},{"$f":"IF(W14<>\"\",W14+1,IF(WEEKDAY(S12)=7,S12,\"\"))","v":""},{"$f":"IF(X14<>\"\",X14+1,IF(WEEKDAY(S12)=1,S12,\"\"))","v":"2015-03-01"},null,null,null," - Gérer les congés approuvés des employés d'une entreprise"]
[null,null,{"$f":"I14+1","v":"2015-01-05"},{"$f":"C15+1","v":"2015-01-06"},"2015-01-07","2015-01-08","2015-01-09","2015-01-10","2015-01-11",null,{"$f":"Q14+1","v":"2015-02-02"},{"$f":"K15+1","v":"2015-02-03"},"2015-02-04","2015-02-05","2015-02-06","2015-02-07","2015-02-08",null,{"$f":"Y14+1","v":"2015-03-02"},{"$f":"S15+1","v":"2015-03-03"},"2015-03-04","2015-03-05","2015-03-06","2015-03-07","2015-03-08",null,null,null," - Produire un relevé détaillé des congés annuels"]
[null,null,{"$f":"I15+1","v":"2015-01-12"},{"$f":"C16+1","v":"2015-01-13"},"2015-01-14","2015-01-15","2015-01-16","2015-01-17","2015-01-18",null,{"$f":"Q15+1","v":"2015-02-09"},{"$f":"K16+1","v":"2015-02-10"},"2015-02-11","2015-02-12","2015-02-13","2015-02-14","2015-02-15",null,{"$f":"Y15+1","v":"2015-03-09"},{"$f":"S16+1","v":"2015-03-10"},"2015-03-11","2015-03-12","2015-03-13","2015-03-14","2015-03-15",null,null,null," - Envoyer un relevé détaillé à l'employé"]
[null,null,{"$f":"I16+1","v":"2015-01-19"},{"$f":"C17+1","v":"2015-01-20"},"2015-01-21","2015-01-22","2015-01-23","2015-01-24","2015-01-25",null,{"$f":"Q16+1","v":"2015-02-16"},{"$f":"K17+1","v":"2015-02-17"},"2015-02-18","2015-02-19","2015-02-20","2015-02-21","2015-02-22",null,{"$f":"Y16+1","v":"2015-03-16"},{"$f":"S17+1","v":"2015-03-17"},"2015-03-18","2015-03-19","2015-03-20","2015-03-21","2015-03-22",null,null,null,"Qui peut utliser ce fichier?"]
[null,null,{"$f":"IF(I17<EOMONTH(C12,0),I17+1,\"\")","v":"2015-01-26"},{"$f":"IF(C18<EOMONTH(C12,0),C18+1,\"\")","v":"2015-01-27"},{"$f":"IF(D18<EOMONTH(C12,0),D18+1,\"\")","v":"2015-01-28"},{"$f":"IF(E18<EOMONTH(C12,0),E18+1,\"\")","v":"2015-01-29"},{"$f":"IF(F18<EOMONTH(C12,0),F18+1,\"\")","v":"2015-01-30"},{"$f":"IF(G18<EOMONTH(C12,0),G18+1,\"\")","v":"2015-01-31"},{"$f":"IF(H18<EOMONTH(C12,0),H18+1,\"\")","v":""},null,{"$f":"IF(Q17<EOMONTH(K12,0),Q17+1,\"\")","v":"2015-02-23"},{"$f":"IF(K18<EOMONTH(K12,0),K18+1,\"\")","v":"2015-02-24"},{"$f":"IF(L18<EOMONTH(K12,0),L18+1,\"\")","v":"2015-02-25"},{"$f":"IF(M18<EOMONTH(K12,0),M18+1,\"\")","v":"2015-02-26"},{"$f":"IF(N18<EOMONTH(K12,0),N18+1,\"\")","v":"2015-02-27"},{"$f":"IF(O18<EOMONTH(K12,0),O18+1,\"\")","v":"2015-02-28"},{"$f":"IF(P18<EOMONTH(K12,0),P18+1,\"\")","v":""},null,{"$f":"IF(Y17<EOMONTH(S12,0),Y17+1,\"\")","v":"2015-03-23"},{"$f":"IF(S18<EOMONTH(S12,0),S18+1,\"\")","v":"2015-03-24"},{"$f":"IF(T18<EOMONTH(S12,0),T18+1,\"\")","v":"2015-03-25"},{"$f":"IF(U18<EOMONTH(S12,0),U18+1,\"\")","v":"2015-03-26"},{"$f":"IF(V18<EOMONTH(S12,0),V18+1,\"\")","v":"2015-03-27"},{"$f":"IF(W18<EOMONTH(S12,0),W18+1,\"\")","v":"2015-03-28"},{"$f":"IF(X18<EOMONTH(S12,0),X18+1,\"\")","v":"2015-03-29"},null,null,null," - Gestionnaire de congés, Secrétaire administrative,RH,etc."]
[null,null,{"$f":"IF(I18<EOMONTH(C12,0),I18+1,\"\")","v":""},{"$f":"IF(C19<EOMONTH(C12,0),C19+1,\"\")","v":""},{"$f":"IF(D19<EOMONTH(C12,0),D19+1,\"\")","v":""},{"$f":"IF(E19<EOMONTH(C12,0),E19+1,\"\")","v":""},{"$f":"IF(F19<EOMONTH(C12,0),F19+1,\"\")","v":""},{"$f":"IF(G19<EOMONTH(C12,0),G19+1,\"\")","v":""},{"$f":"IF(H19<EOMONTH(C12,0),H19+1,\"\")","v":""},null,{"$f":"IF(Q18<EOMONTH(K12,0),Q18+1,\"\")","v":""},{"$f":"IF(K19<EOMONTH(K12,0),K19+1,\"\")","v":""},{"$f":"IF(L19<EOMONTH(K12,0),L19+1,\"\")","v":""},{"$f":"IF(M19<EOMONTH(K12,0),M19+1,\"\")","v":""},{"$f":"IF(N19<EOMONTH(K12,0),N19+1,\"\")","v":""},{"$f":"IF(O19<EOMONTH(K12,0),O19+1,\"\")","v":""},{"$f":"IF(P19<EOMONTH(K12,0),P19+1,\"\")","v":""},null,{"$f":"IF(Y18<EOMONTH(S12,0),Y18+1,\"\")","v":"2015-03-30"},{"$f":"IF(S19<EOMONTH(S12,0),S19+1,\"\")","v":"2015-03-31"},{"$f":"IF(T19<EOMONTH(S12,0),T19+1,\"\")","v":""},{"$f":"IF(U19<EOMONTH(S12,0),U19+1,\"\")","v":""},{"$f":"IF(V19<EOMONTH(S12,0),V19+1,\"\")","v":""},{"$f":"IF(W19<EOMONTH(S12,0),W19+1,\"\")","v":""},{"$f":"IF(X19<EOMONTH(S12,0),X19+1,\"\")","v":""}]
[]
[null,null,{"$f":"EDATE(DATE(ref_annee,1,1),3)","v":"2015-04-01"},null,null,null,null,null,null,null,{"$f":"EDATE(DATE(ref_annee,1,1),4)","v":"2015-05-01"},null,null,null,null,null,null,null,{"$f":"EDATE(DATE(ref_annee,1,1),5)","v":"2015-06-01"}]
[null,null,"L","M","M","J","V","S","D",null,"L","M","M","J","V","S","D",null,"L","M","M","J","V","S","D"]
[null,null,{"$f":"IF(WEEKDAY(C21)=2,C21,\"\")","v":""},{"$f":"IF(C23<>\"\",C23+1,IF(WEEKDAY(C21)=3,C21,\"\"))","v":""},{"$f":"IF(D23<>\"\",D23+1,IF(WEEKDAY(C21)=4,C21,\"\"))","v":"2015-04-01"},{"$f":"IF(E23<>\"\",E23+1,IF(WEEKDAY(C21)=5,C21,\"\"))","v":"2015-04-02"},{"$f":"IF(F23<>\"\",F23+1,IF(WEEKDAY(C21)=6,C21,\"\"))","v":"2015-04-03"},{"$f":"IF(G23<>\"\",G23+1,IF(WEEKDAY(C21)=7,C21,\"\"))","v":"2015-04-04"},{"$f":"IF(H23<>\"\",H23+1,IF(WEEKDAY(C21)=1,C21,\"\"))","v":"2015-04-05"},null,{"$f":"IF(WEEKDAY(K21)=2,K21,\"\")","v":""},{"$f":"IF(K23<>\"\",K23+1,IF(WEEKDAY(K21)=3,K21,\"\"))","v":""},{"$f":"IF(L23<>\"\",L23+1,IF(WEEKDAY(K21)=4,K21,\"\"))","v":""},{"$f":"IF(M23<>\"\",M23+1,IF(WEEKDAY(K21)=5,K21,\"\"))","v":""},{"$f":"IF(N23<>\"\",N23+1,IF(WEEKDAY(K21)=6,K21,\"\"))","v":"2015-05-01"},{"$f":"IF(O23<>\"\",O23+1,IF(WEEKDAY(K21)=7,K21,\"\"))","v":"2015-05-02"},{"$f":"IF(P23<>\"\",P23+1,IF(WEEKDAY(K21)=1,K21,\"\"))","v":"2015-05-03"},null,{"$f":"IF(WEEKDAY(S21)=2,S21,\"\")","v":"2015-06-01"},{"$f":"IF(S23<>\"\",S23+1,IF(WEEKDAY(S21)=3,S21,\"\"))","v":"2015-06-02"},{"$f":"IF(T23<>\"\",T23+1,IF(WEEKDAY(S21)=4,S21,\"\"))","v":"2015-06-03"},{"$f":"IF(U23<>\"\",U23+1,IF(WEEKDAY(S21)=5,S21,\"\"))","v":"2015-06-04"},{"$f":"IF(V23<>\"\",V23+1,IF(WEEKDAY(S21)=6,S21,\"\"))","v":"2015-06-05"},{"$f":"IF(W23<>\"\",W23+1,IF(WEEKDAY(S21)=7,S21,\"\"))","v":"2015-06-06"},{"$f":"IF(X23<>\"\",X23+1,IF(WEEKDAY(S21)=1,S21,\"\"))","v":"2015-06-07"}]
[null,null,{"$f":"I23+1","v":"2015-04-06"},{"$f":"C24+1","v":"2015-04-07"},"2015-04-08","2015-04-09","2015-04-10","2015-04-11","2015-04-12",null,{"$f":"Q23+1","v":"2015-05-04"},{"$f":"K24+1","v":"2015-05-05"},"2015-05-06","2015-05-07","2015-05-08","2015-05-09","2015-05-10",null,{"$f":"Y23+1","v":"2015-06-08"},{"$f":"S24+1","v":"2015-06-09"},"2015-06-10","2015-06-11","2015-06-12","2015-06-13","2015-06-14"]
[null,null,{"$f":"I24+1","v":"2015-04-13"},{"$f":"C25+1","v":"2015-04-14"},"2015-04-15","2015-04-16","2015-04-17","2015-04-18","2015-04-19",null,{"$f":"Q24+1","v":"2015-05-11"},{"$f":"K25+1","v":"2015-05-12"},"2015-05-13","2015-05-14","2015-05-15","2015-05-16","2015-05-17",null,{"$f":"Y24+1","v":"2015-06-15"},{"$f":"S25+1","v":"2015-06-16"},"2015-06-17","2015-06-18","2015-06-19","2015-06-20","2015-06-21"]
[null,null,{"$f":"I25+1","v":"2015-04-20"},{"$f":"C26+1","v":"2015-04-21"},"2015-04-22","2015-04-23","2015-04-24","2015-04-25","2015-04-26",null,{"$f":"Q25+1","v":"2015-05-18"},{"$f":"K26+1","v":"2015-05-19"},"2015-05-20","2015-05-21","2015-05-22","2015-05-23","2015-05-24",null,{"$f":"Y25+1","v":"2015-06-22"},{"$f":"S26+1","v":"2015-06-23"},"2015-06-24","2015-06-25","2015-06-26","2015-06-27","2015-06-28"]
[null,null,{"$f":"IF(I26<EOMONTH(C21,0),I26+1,\"\")","v":"2015-04-27"},{"$f":"IF(C27<EOMONTH(C21,0),C27+1,\"\")","v":"2015-04-28"},{"$f":"IF(D27<EOMONTH(C21,0),D27+1,\"\")","v":"2015-04-29"},{"$f":"IF(E27<EOMONTH(C21,0),E27+1,\"\")","v":"2015-04-30"},{"$f":"IF(F27<EOMONTH(C21,0),F27+1,\"\")","v":""},{"$f":"IF(G27<EOMONTH(C21,0),G27+1,\"\")","v":""},{"$f":"IF(H27<EOMONTH(C21,0),H27+1,\"\")","v":""},null,{"$f":"IF(Q26<EOMONTH(K21,0),Q26+1,\"\")","v":"2015-05-25"},{"$f":"IF(K27<EOMONTH(K21,0),K27+1,\"\")","v":"2015-05-26"},{"$f":"IF(L27<EOMONTH(K21,0),L27+1,\"\")","v":"2015-05-27"},{"$f":"IF(M27<EOMONTH(K21,0),M27+1,\"\")","v":"2015-05-28"},{"$f":"IF(N27<EOMONTH(K21,0),N27+1,\"\")","v":"2015-05-29"},{"$f":"IF(O27<EOMONTH(K21,0),O27+1,\"\")","v":"2015-05-30"},{"$f":"IF(P27<EOMONTH(K21,0),P27+1,\"\")","v":"2015-05-31"},null,{"$f":"IF(Y26<EOMONTH(S21,0),Y26+1,\"\")","v":"2015-06-29"},{"$f":"IF(S27<EOMONTH(S21,0),S27+1,\"\")","v":"2015-06-30"},{"$f":"IF(T27<EOMONTH(S21,0),T27+1,\"\")","v":""},{"$f":"IF(U27<EOMONTH(S21,0),U27+1,\"\")","v":""},{"$f":"IF(V27<EOMONTH(S21,0),V27+1,\"\")","v":""},{"$f":"IF(W27<EOMONTH(S21,0),W27+1,\"\")","v":""},{"$f":"IF(X27<EOMONTH(S21,0),X27+1,\"\")","v":""}]
[null,null,{"$f":"IF(I27<EOMONTH(C21,0),I27+1,\"\")","v":""},{"$f":"IF(C28<EOMONTH(C21,0),C28+1,\"\")","v":""},{"$f":"IF(D28<EOMONTH(C21,0),D28+1,\"\")","v":""},{"$f":"IF(E28<EOMONTH(C21,0),E28+1,\"\")","v":""},{"$f":"IF(F28<EOMONTH(C21,0),F28+1,\"\")","v":""},{"$f":"IF(G28<EOMONTH(C21,0),G28+1,\"\")","v":""},{"$f":"IF(H28<EOMONTH(C21,0),H28+1,\"\")","v":""},null,{"$f":"IF(Q27<EOMONTH(K21,0),Q27+1,\"\")","v":""},{"$f":"IF(K28<EOMONTH(K21,0),K28+1,\"\")","v":""},{"$f":"IF(L28<EOMONTH(K21,0),L28+1,\"\")","v":""},{"$f":"IF(M28<EOMONTH(K21,0),M28+1,\"\")","v":""},{"$f":"IF(N28<EOMONTH(K21,0),N28+1,\"\")","v":""},{"$f":"IF(O28<EOMONTH(K21,0),O28+1,\"\")","v":""},{"$f":"IF(P28<EOMONTH(K21,0),P28+1,\"\")","v":""},null,{"$f":"IF(Y27<EOMONTH(S21,0),Y27+1,\"\")","v":""},{"$f":"IF(S28<EOMONTH(S21,0),S28+1,\"\")","v":""},{"$f":"IF(T28<EOMONTH(S21,0),T28+1,\"\")","v":""},{"$f":"IF(U28<EOMONTH(S21,0),U28+1,\"\")","v":""},{"$f":"IF(V28<EOMONTH(S21,0),V28+1,\"\")","v":""},{"$f":"IF(W28<EOMONTH(S21,0),W28+1,\"\")","v":""},{"$f":"IF(X28<EOMONTH(S21,0),X28+1,\"\")","v":""}]
[]
[null,null,{"$f":"EDATE(DATE(ref_annee,1,1),6)","v":"2015-07-01"},null,null,null,null,null,null,null,{"$f":"EDATE(DATE(ref_annee,1,1),7)","v":"2015-08-01"},null,null,null,null,null,null,null,{"$f":"EDATE(DATE(ref_annee,1,1),8)","v":"2015-09-01"}]
[null,null,"L","M","M","J","V","S","D",null,"L","M","M","J","V","S","D",null,"L","M","M","J","V","S","D"]
[null,null,{"$f":"IF(WEEKDAY(C30)=2,C30,\"\")","v":""},{"$f":"IF(C32<>\"\",C32+1,IF(WEEKDAY(C30)=3,C30,\"\"))","v":""},{"$f":"IF(D32<>\"\",D32+1,IF(WEEKDAY(C30)=4,C30,\"\"))","v":"2015-07-01"},{"$f":"IF(E32<>\"\",E32+1,IF(WEEKDAY(C30)=5,C30,\"\"))","v":"2015-07-02"},{"$f":"IF(F32<>\"\",F32+1,IF(WEEKDAY(C30)=6,C30,\"\"))","v":"2015-07-03"},{"$f":"IF(G32<>\"\",G32+1,IF(WEEKDAY(C30)=7,C30,\"\"))","v":"2015-07-04"},{"$f":"IF(H32<>\"\",H32+1,IF(WEEKDAY(C30)=1,C30,\"\"))","v":"2015-07-05"},null,{"$f":"IF(WEEKDAY(K30)=2,K30,\"\")","v":""},{"$f":"IF(K32<>\"\",K32+1,IF(WEEKDAY(K30)=3,K30,\"\"))","v":""},{"$f":"IF(L32<>\"\",L32+1,IF(WEEKDAY(K30)=4,K30,\"\"))","v":""},{"$f":"IF(M32<>\"\",M32+1,IF(WEEKDAY(K30)=5,K30,\"\"))","v":""},{"$f":"IF(N32<>\"\",N32+1,IF(WEEKDAY(K30)=6,K30,\"\"))","v":""},{"$f":"IF(O32<>\"\",O32+1,IF(WEEKDAY(K30)=7,K30,\"\"))","v":"2015-08-01"},{"$f":"IF(P32<>\"\",P32+1,IF(WEEKDAY(K30)=1,K30,\"\"))","v":"2015-08-02"},null,{"$f":"IF(WEEKDAY(S30)=2,S30,\"\")","v":""},{"$f":"IF(S32<>\"\",S32+1,IF(WEEKDAY(S30)=3,S30,\"\"))","v":"2015-09-01"},{"$f":"IF(T32<>\"\",T32+1,IF(WEEKDAY(S30)=4,S30,\"\"))","v":"2015-09-02"},{"$f":"IF(U32<>\"\",U32+1,IF(WEEKDAY(S30)=5,S30,\"\"))","v":"2015-09-03"},{"$f":"IF(V32<>\"\",V32+1,IF(WEEKDAY(S30)=6,S30,\"\"))","v":"2015-09-04"},{"$f":"IF(W32<>\"\",W32+1,IF(WEEKDAY(S30)=7,S30,\"\"))","v":"2015-09-05"},{"$f":"IF(X32<>\"\",X32+1,IF(WEEKDAY(S30)=1,S30,\"\"))","v":"2015-09-06"}]
[null,null,{"$f":"I32+1","v":"2015-07-06"},{"$f":"C33+1","v":"2015-07-07"},"2015-07-08","2015-07-09","2015-07-10","2015-07-11","2015-07-12",null,{"$f":"Q32+1","v":"2015-08-03"},{"$f":"K33+1","v":"2015-08-04"},"2015-08-05","2015-08-06","2015-08-07","2015-08-08","2015-08-09",null,{"$f":"Y32+1","v":"2015-09-07"},{"$f":"S33+1","v":"2015-09-08"},"2015-09-09","2015-09-10","2015-09-11","2015-09-12","2015-09-13"]
[null,null,{"$f":"I33+1","v":"2015-07-13"},{"$f":"C34+1","v":"2015-07-14"},"2015-07-15","2015-07-16","2015-07-17","2015-07-18","2015-07-19",null,{"$f":"Q33+1","v":"2015-08-10"},{"$f":"K34+1","v":"2015-08-11"},"2015-08-12","2015-08-13","2015-08-14","2015-08-15","2015-08-16",null,{"$f":"Y33+1","v":"2015-09-14"},{"$f":"S34+1","v":"2015-09-15"},"2015-09-16","2015-09-17","2015-09-18","2015-09-19","2015-09-20"]
[null,null,{"$f":"I34+1","v":"2015-07-20"},{"$f":"C35+1","v":"2015-07-21"},"2015-07-22","2015-07-23","2015-07-24","2015-07-25","2015-07-26",null,{"$f":"Q34+1","v":"2015-08-17"},{"$f":"K35+1","v":"2015-08-18"},"2015-08-19","2015-08-20","2015-08-21","2015-08-22","2015-08-23",null,{"$f":"Y34+1","v":"2015-09-21"},{"$f":"S35+1","v":"2015-09-22"},"2015-09-23","2015-09-24","2015-09-25","2015-09-26","2015-09-27"]
[null,null,{"$f":"IF(I35<EOMONTH(C30,0),I35+1,\"\")","v":"2015-07-27"},{"$f":"IF(C36<EOMONTH(C30,0),C36+1,\"\")","v":"2015-07-28"},{"$f":"IF(D36<EOMONTH(C30,0),D36+1,\"\")","v":"2015-07-29"},{"$f":"IF(E36<EOMONTH(C30,0),E36+1,\"\")","v":"2015-07-30"},{"$f":"IF(F36<EOMONTH(C30,0),F36+1,\"\")","v":"2015-07-31"},{"$f":"IF(G36<EOMONTH(C30,0),G36+1,\"\")","v":""},{"$f":"IF(H36<EOMONTH(C30,0),H36+1,\"\")","v":""},null,{"$f":"IF(Q35<EOMONTH(K30,0),Q35+1,\"\")","v":"2015-08-24"},{"$f":"IF(K36<EOMONTH(K30,0),K36+1,\"\")","v":"2015-08-25"},{"$f":"IF(L36<EOMONTH(K30,0),L36+1,\"\")","v":"2015-08-26"},{"$f":"IF(M36<EOMONTH(K30,0),M36+1,\"\")","v":"2015-08-27"},{"$f":"IF(N36<EOMONTH(K30,0),N36+1,\"\")","v":"2015-08-28"},{"$f":"IF(O36<EOMONTH(K30,0),O36+1,\"\")","v":"2015-08-29"},{"$f":"IF(P36<EOMONTH(K30,0),P36+1,\"\")","v":"2015-08-30"},null,{"$f":"IF(Y35<EOMONTH(S30,0),Y35+1,\"\")","v":"2015-09-28"},{"$f":"IF(S36<EOMONTH(S30,0),S36+1,\"\")","v":"2015-09-29"},{"$f":"IF(T36<EOMONTH(S30,0),T36+1,\"\")","v":"2015-09-30"},{"$f":"IF(U36<EOMONTH(S30,0),U36+1,\"\")","v":""},{"$f":"IF(V36<EOMONTH(S30,0),V36+1,\"\")","v":""},{"$f":"IF(W36<EOMONTH(S30,0),W36+1,\"\")","v":""},{"$f":"IF(X36<EOMONTH(S30,0),X36+1,\"\")","v":""}]
[null,null,{"$f":"IF(I36<EOMONTH(C30,0),I36+1,\"\")","v":""},{"$f":"IF(C37<EOMONTH(C30,0),C37+1,\"\")","v":""},{"$f":"IF(D37<EOMONTH(C30,0),D37+1,\"\")","v":""},{"$f":"IF(E37<EOMONTH(C30,0),E37+1,\"\")","v":""},{"$f":"IF(F37<EOMONTH(C30,0),F37+1,\"\")","v":""},{"$f":"IF(G37<EOMONTH(C30,0),G37+1,\"\")","v":""},{"$f":"IF(H37<EOMONTH(C30,0),H37+1,\"\")","v":""},null,{"$f":"IF(Q36<EOMONTH(K30,0),Q36+1,\"\")","v":"2015-08-31"},{"$f":"IF(K37<EOMONTH(K30,0),K37+1,\"\")","v":""},{"$f":"IF(L37<EOMONTH(K30,0),L37+1,\"\")","v":""},{"$f":"IF(M37<EOMONTH(K30,0),M37+1,\"\")","v":""},{"$f":"IF(N37<EOMONTH(K30,0),N37+1,\"\")","v":""},{"$f":"IF(O37<EOMONTH(K30,0),O37+1,\"\")","v":""},{"$f":"IF(P37<EOMONTH(K30,0),P37+1,\"\")","v":""},null,{"$f":"IF(Y36<EOMONTH(S30,0),Y36+1,\"\")","v":""},{"$f":"IF(S37<EOMONTH(S30,0),S37+1,\"\")","v":""},{"$f":"IF(T37<EOMONTH(S30,0),T37+1,\"\")","v":""},{"$f":"IF(U37<EOMONTH(S30,0),U37+1,\"\")","v":""},{"$f":"IF(V37<EOMONTH(S30,0),V37+1,\"\")","v":""},{"$f":"IF(W37<EOMONTH(S30,0),W37+1,\"\")","v":""},{"$f":"IF(X37<EOMONTH(S30,0),X37+1,\"\")","v":""}]
[]
[null,null,{"$f":"EDATE(DATE(ref_annee,1,1),9)","v":"2015-10-01"},null,null,null,null,null,null,null,{"$f":"EDATE(DATE(ref_annee,1,1),10)","v":"2015-11-01"},null,null,null,null,null,null,null,{"$f":"EDATE(DATE(ref_annee,1,1),11)","v":"2015-12-01"}]
[null,null,"L","M","M","J","V","S","D",null,"L","M","M","J","V","S","D",null,"L","M","M","J","V","S","D"]
[null,null,{"$f":"IF(WEEKDAY(C39)=2,C39,\"\")","v":""},{"$f":"IF(C41<>\"\",C41+1,IF(WEEKDAY(C39)=3,C39,\"\"))","v":""},{"$f":"IF(D41<>\"\",D41+1,IF(WEEKDAY(C39)=4,C39,\"\"))","v":""},{"$f":"IF(E41<>\"\",E41+1,IF(WEEKDAY(C39)=5,C39,\"\"))","v":"2015-10-01"},{"$f":"IF(F41<>\"\",F41+1,IF(WEEKDAY(C39)=6,C39,\"\"))","v":"2015-10-02"},{"$f":"IF(G41<>\"\",G41+1,IF(WEEKDAY(C39)=7,C39,\"\"))","v":"2015-10-03"},{"$f":"IF(H41<>\"\",H41+1,IF(WEEKDAY(C39)=1,C39,\"\"))","v":"2015-10-04"},null,{"$f":"IF(WEEKDAY(K39)=2,K39,\"\")","v":""},{"$f":"IF(K41<>\"\",K41+1,IF(WEEKDAY(K39)=3,K39,\"\"))","v":""},{"$f":"IF(L41<>\"\",L41+1,IF(WEEKDAY(K39)=4,K39,\"\"))","v":""},{"$f":"IF(M41<>\"\",M41+1,IF(WEEKDAY(K39)=5,K39,\"\"))","v":""},{"$f":"IF(N41<>\"\",N41+1,IF(WEEKDAY(K39)=6,K39,\"\"))","v":""},{"$f":"IF(O41<>\"\",O41+1,IF(WEEKDAY(K39)=7,K39,\"\"))","v":""},{"$f":"IF(P41<>\"\",P41+1,IF(WEEKDAY(K39)=1,K39,\"\"))","v":"2015-11-01"},null,{"$f":"IF(WEEKDAY(S39)=2,S39,\"\")","v":""},{"$f":"IF(S41<>\"\",S41+1,IF(WEEKDAY(S39)=3,S39,\"\"))","v":"2015-12-01"},{"$f":"IF(T41<>\"\",T41+1,IF(WEEKDAY(S39)=4,S39,\"\"))","v":"2015-12-02"},{"$f":"IF(U41<>\"\",U41+1,IF(WEEKDAY(S39)=5,S39,\"\"))","v":"2015-12-03"},{"$f":"IF(V41<>\"\",V41+1,IF(WEEKDAY(S39)=6,S39,\"\"))","v":"2015-12-04"},{"$f":"IF(W41<>\"\",W41+1,IF(WEEKDAY(S39)=7,S39,\"\"))","v":"2015-12-05"},{"$f":"IF(X41<>\"\",X41+1,IF(WEEKDAY(S39)=1,S39,\"\"))","v":"2015-12-06"}]
[null,null,{"$f":"I41+1","v":"2015-10-05"},{"$f":"C42+1","v":"2015-10-06"},"2015-10-07","2015-10-08","2015-10-09","2015-10-10","2015-10-11",null,{"$f":"Q41+1","v":"2015-11-02"},{"$f":"K42+1","v":"2015-11-03"},"2015-11-04","2015-11-05","2015-11-06","2015-11-07","2015-11-08",null,{"$f":"Y41+1","v":"2015-12-07"},{"$f":"S42+1","v":"2015-12-08"},"2015-12-09","2015-12-10","2015-12-11","2015-12-12","2015-12-13"]
[null,null,{"$f":"I42+1","v":"2015-10-12"},{"$f":"C43+1","v":"2015-10-13"},"2015-10-14","2015-10-15","2015-10-16","2015-10-17","2015-10-18",null,{"$f":"Q42+1","v":"2015-11-09"},{"$f":"K43+1","v":"2015-11-10"},"2015-11-11","2015-11-12","2015-11-13","2015-11-14","2015-11-15",null,{"$f":"Y42+1","v":"2015-12-14"},{"$f":"S43+1","v":"2015-12-15"},"2015-12-16","2015-12-17","2015-12-18","2015-12-19","2015-12-20"]
[null,null,{"$f":"I43+1","v":"2015-10-19"},{"$f":"C44+1","v":"2015-10-20"},"2015-10-21","2015-10-22","2015-10-23","2015-10-24","2015-10-25",null,{"$f":"Q43+1","v":"2015-11-16"},{"$f":"K44+1","v":"2015-11-17"},"2015-11-18","2015-11-19","2015-11-20","2015-11-21","2015-11-22",null,{"$f":"Y43+1","v":"2015-12-21"},{"$f":"S44+1","v":"2015-12-22"},"2015-12-23","2015-12-24","2015-12-25","2015-12-26","2015-12-27"]
[null,null,{"$f":"IF(I44<EOMONTH(C39,0),I44+1,\"\")","v":"2015-10-26"},{"$f":"IF(C45<EOMONTH(C39,0),C45+1,\"\")","v":"2015-10-27"},{"$f":"IF(D45<EOMONTH(C39,0),D45+1,\"\")","v":"2015-10-28"},{"$f":"IF(E45<EOMONTH(C39,0),E45+1,\"\")","v":"2015-10-29"},{"$f":"IF(F45<EOMONTH(C39,0),F45+1,\"\")","v":"2015-10-30"},{"$f":"IF(G45<EOMONTH(C39,0),G45+1,\"\")","v":"2015-10-31"},{"$f":"IF(H45<EOMONTH(C39,0),H45+1,\"\")","v":""},null,{"$f":"IF(Q44<EOMONTH(K39,0),Q44+1,\"\")","v":"2015-11-23"},{"$f":"IF(K45<EOMONTH(K39,0),K45+1,\"\")","v":"2015-11-24"},{"$f":"IF(L45<EOMONTH(K39,0),L45+1,\"\")","v":"2015-11-25"},{"$f":"IF(M45<EOMONTH(K39,0),M45+1,\"\")","v":"2015-11-26"},{"$f":"IF(N45<EOMONTH(K39,0),N45+1,\"\")","v":"2015-11-27"},{"$f":"IF(O45<EOMONTH(K39,0),O45+1,\"\")","v":"2015-11-28"},{"$f":"IF(P45<EOMONTH(K39,0),P45+1,\"\")","v":"2015-11-29"},null,{"$f":"IF(Y44<EOMONTH(S39,0),Y44+1,\"\")","v":"2015-12-28"},{"$f":"IF(S45<EOMONTH(S39,0),S45+1,\"\")","v":"2015-12-29"},{"$f":"IF(T45<EOMONTH(S39,0),T45+1,\"\")","v":"2015-12-30"},{"$f":"IF(U45<EOMONTH(S39,0),U45+1,\"\")","v":"2015-12-31"},{"$f":"IF(V45<EOMONTH(S39,0),V45+1,\"\")","v":""},{"$f":"IF(W45<EOMONTH(S39,0),W45+1,\"\")","v":""},{"$f":"IF(X45<EOMONTH(S39,0),X45+1,\"\")","v":""}]
[null,null,{"$f":"IF(I45<EOMONTH(C39,0),I45+1,\"\")","v":""},{"$f":"IF(C46<EOMONTH(C39,0),C46+1,\"\")","v":""},{"$f":"IF(D46<EOMONTH(C39,0),D46+1,\"\")","v":""},{"$f":"IF(E46<EOMONTH(C39,0),E46+1,\"\")","v":""},{"$f":"IF(F46<EOMONTH(C39,0),F46+1,\"\")","v":""},{"$f":"IF(G46<EOMONTH(C39,0),G46+1,\"\")","v":""},{"$f":"IF(H46<EOMONTH(C39,0),H46+1,\"\")","v":""},null,{"$f":"IF(Q45<EOMONTH(K39,0),Q45+1,\"\")","v":"2015-11-30"},{"$f":"IF(K46<EOMONTH(K39,0),K46+1,\"\")","v":""},{"$f":"IF(L46<EOMONTH(K39,0),L46+1,\"\")","v":""},{"$f":"IF(M46<EOMONTH(K39,0),M46+1,\"\")","v":""},{"$f":"IF(N46<EOMONTH(K39,0),N46+1,\"\")","v":""},{"$f":"IF(O46<EOMONTH(K39,0),O46+1,\"\")","v":""},{"$f":"IF(P46<EOMONTH(K39,0),P46+1,\"\")","v":""},null,{"$f":"IF(Y45<EOMONTH(S39,0),Y45+1,\"\")","v":""},{"$f":"IF(S46<EOMONTH(S39,0),S46+1,\"\")","v":""},{"$f":"IF(T46<EOMONTH(S39,0),T46+1,\"\")","v":""},{"$f":"IF(U46<EOMONTH(S39,0),U46+1,\"\")","v":""},{"$f":"IF(V46<EOMONTH(S39,0),V46+1,\"\")","v":""},{"$f":"IF(W46<EOMONTH(S39,0),W46+1,\"\")","v":""},{"$f":"IF(X46<EOMONTH(S39,0),X46+1,\"\")","v":""}]
[]
[null,null,null,"Férié",null,null,null,null,{"$f":"Config!$B$2","v":"Vacances"},null,null,null,null,{"$f":"Config!B3","v":"RTT"},null,null,null,{"$f":"Config!B4","v":"Arrêt Maladie"}]
[null,null,null,null,null,null,null,null,null,null,null,null,null,null,null,null,{"$f":"\"Date & Heure d'envoi: \"&TEXT(NOW(),\"d-mm-yyyy hh:mm\")","v":"Date & Heure d'envoi: d-10-yyyy 09:44"}]
[null,null,"http://tutoexcel1895.wordpress.com"]
[]
[null,null,{"$f":"IFERROR(HLOOKUP(C14,Janvier!$D$3:$AH$9,MATCH(employe_ID,Janvier!$A$3:$A$9,0),0),\"\")","v":""},{"$f":"IFERROR(HLOOKUP(D14,Janvier!$D$3:$AH$9,MATCH(employe_ID,Janvier!$A$3:$A$9,0),0),\"\")","v":""},{"$f":"IFERROR(HLOOKUP(E14,Janvier!$D$3:$AH$9,MATCH(employe_ID,Janvier!$A$3:$A$9,0),0),\"\")","v":""},{"$f":"IFERROR(HLOOKUP(F14,Janvier!$D$3:$AH$9,MATCH(employe_ID,Janvier!$A$3:$A$9,0),0),\"\")","v":0},{"$f":"IFERROR(HLOOKUP(G14,Janvier!$D$3:$AH$9,MATCH(employe_ID,Janvier!$A$3:$A$9,0),0),\"\")","v":"VAC"},{"$f":"IFERROR(HLOOKUP(H14,Janvier!$D$3:$AH$9,MATCH(employe_ID,Janvier!$A$3:$A$9,0),0),\"\")","v":0},{"$f":"IFERROR(HLOOKUP(I14,Janvier!$D$3:$AH$9,MATCH(employe_ID,Janvier!$A$3:$A$9,0),0),\"\")","v":0},null,{"$f":"IFERROR(HLOOKUP(K14,Février!$D$3:$AH$9,MATCH(employe_ID,Février!$A$3:$A$9,0),0),\"\")","v":0},{"$f":"IFERROR(HLOOKUP(L14,Février!$D$3:$AH$9,MATCH(employe_ID,Février!$A$3:$A$9,0),0),\"\")","v":0},{"$f":"IFERROR(HLOOKUP(M14,Février!$D$3:$AH$9,MATCH(employe_ID,Février!$A$3:$A$9,0),0),\"\")","v":0},{"$f":"IFERROR(HLOOKUP(N14,Février!$D$3:$AH$9,MATCH(employe_ID,Février!$A$3:$A$9,0),0),\"\")","v":0},{"$f":"IFERROR(HLOOKUP(O14,Février!$D$3:$AH$9,MATCH(employe_ID,Février!$A$3:$A$9,0),0),\"\")","v":0},{"$f":"IFERROR(HLOOKUP(P14,Février!$D$3:$AH$9,MATCH(employe_ID,Février!$A$3:$A$9,0),0),\"\")","v":0},{"$f":"IFERROR(HLOOKUP(Q14,Février!$D$3:$AH$9,MATCH(employe_ID,Février!$A$3:$A$9,0),0),\"\")","v":0},null,{"$f":"IFERROR(HLOOKUP(S14,Mars!$D$3:$AH$9,MATCH(employe_ID,Mars!$A$3:$A$9,0),0),\"\")","v":""},{"$f":"IFERROR(HLOOKUP(T14,Mars!$D$3:$AH$9,MATCH(employe_ID,Mars!$A$3:$A$9,0),0),\"\")","v":""},{"$f":"IFERROR(HLOOKUP(U14,Mars!$D$3:$AH$9,MATCH(employe_ID,Mars!$A$3:$A$9,0),0),\"\")","v":""},{"$f":"IFERROR(HLOOKUP(V14,Mars!$D$3:$AH$9,MATCH(employe_ID,Mars!$A$3:$A$9,0),0),\"\")","v":""},{"$f":"IFERROR(HLOOKUP(W14,Mars!$D$3:$AH$9,MATCH(employe_ID,Mars!$A$3:$A$9,0),0),\"\")","v":""},{"$f":"IFERROR(HLOOKUP(X14,Mars!$D$3:$AH$9,MATCH(employe_ID,Mars!$A$3:$A$9,0),0),\"\")","v":""},{"$f":"IFERROR(HLOOKUP(Y14,Mars!$D$3:$AH$9,MATCH(employe_ID,Mars!$A$3:$A$9,0),0),\"\")","v":0}]
[null,null,{"$f":"IFERROR(HLOOKUP(C15,Janvier!$D$3:$AH$9,MATCH(employe_ID,Janvier!$A$3:$A$9,0),0),\"\")","v":"RTT"},{"$f":"IFERROR(HLOOKUP(D15,Janvier!$D$3:$AH$9,MATCH(employe_ID,Janvier!$A$3:$A$9,0),0),\"\")","v":"RTT"},{"$f":"IFERROR(HLOOKUP(E15,Janvier!$D$3:$AH$9,MATCH(employe_ID,Janvier!$A$3:$A$9,0),0),\"\")","v":"ARM"},{"$f":"IFERROR(HLOOKUP(F15,Janvier!$D$3:$AH$9,MATCH(employe_ID,Janvier!$A$3:$A$9,0),0),\"\")","v":0},{"$f":"IFERROR(HLOOKUP(G15,Janvier!$D$3:$AH$9,MATCH(employe_ID,Janvier!$A$3:$A$9,0),0),\"\")","v":0},{"$f":"IFERROR(HLOOKUP(H15,Janvier!$D$3:$AH$9,MATCH(employe_ID,Janvier!$A$3:$A$9,0),0),\"\")","v":0},{"$f":"IFERROR(HLOOKUP(I15,Janvier!$D$3:$AH$9,MATCH(employe_ID,Janvier!$A$3:$A$9,0),0),\"\")","v":0},null,{"$f":"IFERROR(HLOOKUP(K15,Février!$D$3:$AH$9,MATCH(employe_ID,Février!$A$3:$A$9,0),0),\"\")","v":"VAC"},{"$f":"IFERROR(HLOOKUP(L15,Février!$D$3:$AH$9,MATCH(employe_ID,Février!$A$3:$A$9,0),0),\"\")","v":0},{"$f":"IFERROR(HLOOKUP(M15,Février!$D$3:$AH$9,MATCH(employe_ID,Février!$A$3:$A$9,0),0),\"\")","v":"ARM"},{"$f":"IFERROR(HLOOKUP(N15,Février!$D$3:$AH$9,MATCH(employe_ID,Février!$A$3:$A$9,0),0),\"\")","v":0},{"$f":"IFERROR(HLOOKUP(O15,Février!$D$3:$AH$9,MATCH(employe_ID,Février!$A$3:$A$9,0),0),\"\")","v":"RTT"},{"$f":"IFERROR(HLOOKUP(P15,Février!$D$3:$AH$9,MATCH(employe_ID,Février!$A$3:$A$9,0),0),\"\")","v":0},{"$f":"IFERROR(HLOOKUP(Q15,Février!$D$3:$AH$9,MATCH(employe_ID,Février!$A$3:$A$9,0),0),\"\")","v":0},null,{"$f":"IFERROR(HLOOKUP(S15,Mars!$D$3:$AH$9,MATCH(employe_ID,Mars!$A$3:$A$9,0),0),\"\")","v":0},{"$f":"IFERROR(HLOOKUP(T15,Mars!$D$3:$AH$9,MATCH(employe_ID,Mars!$A$3:$A$9,0),0),\"\")","v":0},{"$f":"IFERROR(HLOOKUP(U15,Mars!$D$3:$AH$9,MATCH(employe_ID,Mars!$A$3:$A$9,0),0),\"\")","v":0},{"$f":"IFERROR(HLOOKUP(V15,Mars!$D$3:$AH$9,MATCH(employe_ID,Mars!$A$3:$A$9,0),0),\"\")","v":0},{"$f":"IFERROR(HLOOKUP(W15,Mars!$D$3:$AH$9,MATCH(employe_ID,Mars!$A$3:$A$9,0),0),\"\")","v":0},{"$f":"IFERROR(HLOOKUP(X15,Mars!$D$3:$AH$9,MATCH(employe_ID,Mars!$A$3:$A$9,0),0),\"\")","v":0},{"$f":"IFERROR(HLOOKUP(Y15,Mars!$D$3:$AH$9,MATCH(employe_ID,Mars!$A$3:$A$9,0),0),\"\")","v":0}]
[null,null,{"$f":"IFERROR(HLOOKUP(C16,Janvier!$D$3:$AH$9,MATCH(employe_ID,Janvier!$A$3:$A$9,0),0),\"\")","v":0},{"$f":"IFERROR(HLOOKUP(D16,Janvier!$D$3:$AH$9,MATCH(employe_ID,Janvier!$A$3:$A$9,0),0),\"\")","v":0},{"$f":"IFERROR(HLOOKUP(E16,Janvier!$D$3:$AH$9,MATCH(employe_ID,Janvier!$A$3:$A$9,0),0),\"\")","v":0},{"$f":"IFERROR(HLOOKUP(F16,Janvier!$D$3:$AH$9,MATCH(employe_ID,Janvier!$A$3:$A$9,0),0),\"\")","v":0},{"$f":"IFERROR(HLOOKUP(G16,Janvier!$D$3:$AH$9,MATCH(employe_ID,Janvier!$A$3:$A$9,0),0),\"\")","v":0},{"$f":"IFERROR(HLOOKUP(H16,Janvier!$D$3:$AH$9,MATCH(employe_ID,Janvier!$A$3:$A$9,0),0),\"\")","v":0},{"$f":"IFERROR(HLOOKUP(I16,Janvier!$D$3:$AH$9,MATCH(employe_ID,Janvier!$A$3:$A$9,0),0),\"\")","v":0},null,{"$f":"IFERROR(HLOOKUP(K16,Février!$D$3:$AH$9,MATCH(employe_ID,Février!$A$3:$A$9,0),0),\"\")","v":0},{"$f":"IFERROR(HLOOKUP(L16,Février!$D$3:$AH$9,MATCH(employe_ID,Février!$A$3:$A$9,0),0),\"\")","v":0},{"$f":"IFERROR(HLOOKUP(M16,Février!$D$3:$AH$9,MATCH(employe_ID,Février!$A$3:$A$9,0),0),\"\")","v":0},{"$f":"IFERROR(HLOOKUP(N16,Février!$D$3:$AH$9,MATCH(employe_ID,Février!$A$3:$A$9,0),0),\"\")","v":0},{"$f":"IFERROR(HLOOKUP(O16,Février!$D$3:$AH$9,MATCH(employe_ID,Février!$A$3:$A$9,0),0),\"\")","v":0},{"$f":"IFERROR(HLOOKUP(P16,Février!$D$3:$AH$9,MATCH(employe_ID,Février!$A$3:$A$9,0),0),\"\")","v":0},{"$f":"IFERROR(HLOOKUP(Q16,Février!$D$3:$AH$9,MATCH(employe_ID,Février!$A$3:$A$9,0),0),\"\")","v":0},null,{"$f":"IFERROR(HLOOKUP(S16,Mars!$D$3:$AH$9,MATCH(employe_ID,Mars!$A$3:$A$9,0),0),\"\")","v":0},{"$f":"IFERROR(HLOOKUP(T16,Mars!$D$3:$AH$9,MATCH(employe_ID,Mars!$A$3:$A$9,0),0),\"\")","v":0},{"$f":"IFERROR(HLOOKUP(U16,Mars!$D$3:$AH$9,MATCH(employe_ID,Mars!$A$3:$A$9,0),0),\"\")","v":0},{"$f":"IFERROR(HLOOKUP(V16,Mars!$D$3:$AH$9,MATCH(employe_ID,Mars!$A$3:$A$9,0),0),\"\")","v":0},{"$f":"IFERROR(HLOOKUP(W16,Mars!$D$3:$AH$9,MATCH(employe_ID,Mars!$A$3:$A$9,0),0),\"\")","v":0},{"$f":"IFERROR(HLOOKUP(X16,Mars!$D$3:$AH$9,MATCH(employe_ID,Mars!$A$3:$A$9,0),0),\"\")","v":0},{"$f":"IFERROR(HLOOKUP(Y16,Mars!$D$3:$AH$9,MATCH(employe_ID,Mars!$A$3:$A$9,0),0),\"\")","v":0}]
[null,null,{"$f":"IFERROR(HLOOKUP(C17,Janvier!$D$3:$AH$9,MATCH(employe_ID,Janvier!$A$3:$A$9,0),0),\"\")","v":0},{"$f":"IFERROR(HLOOKUP(D17,Janvier!$D$3:$AH$9,MATCH(employe_ID,Janvier!$A$3:$A$9,0),0),\"\")","v":0},{"$f":"IFERROR(HLOOKUP(E17,Janvier!$D$3:$AH$9,MATCH(employe_ID,Janvier!$A$3:$A$9,0),0),\"\")","v":0},{"$f":"IFERROR(HLOOKUP(F17,Janvier!$D$3:$AH$9,MATCH(employe_ID,Janvier!$A$3:$A$9,0),0),\"\")","v":0},{"$f":"IFERROR(HLOOKUP(G17,Janvier!$D$3:$AH$9,MATCH(employe_ID,Janvier!$A$3:$A$9,0),0),\"\")","v":0},{"$f":"IFERROR(HLOOKUP(H17,Janvier!$D$3:$AH$9,MATCH(employe_ID,Janvier!$A$3:$A$9,0),0),\"\")","v":0},{"$f":"IFERROR(HLOOKUP(I17,Janvier!$D$3:$AH$9,MATCH(employe_ID,Janvier!$A$3:$A$9,0),0),\"\")","v":0},null,{"$f":"IFERROR(HLOOKUP(K17,Février!$D$3:$AH$9,MATCH(employe_ID,Février!$A$3:$A$9,0),0),\"\")","v":0},{"$f":"IFERROR(HLOOKUP(L17,Février!$D$3:$AH$9,MATCH(employe_ID,Février!$A$3:$A$9,0),0),\"\")","v":0},{"$f":"IFERROR(HLOOKUP(M17,Février!$D$3:$AH$9,MATCH(employe_ID,Février!$A$3:$A$9,0),0),\"\")","v":0},{"$f":"IFERROR(HLOOKUP(N17,Février!$D$3:$AH$9,MATCH(employe_ID,Février!$A$3:$A$9,0),0),\"\")","v":0},{"$f":"IFERROR(HLOOKUP(O17,Février!$D$3:$AH$9,MATCH(employe_ID,Février!$A$3:$A$9,0),0),\"\")","v":0},{"$f":"IFERROR(HLOOKUP(P17,Février!$D$3:$AH$9,MATCH(employe_ID,Février!$A$3:$A$9,0),0),\"\")","v":0},{"$f":"IFERROR(HLOOKUP(Q17,Février!$D$3:$AH$9,MATCH(employe_ID,Février!$A$3:$A$9,0),0),\"\")","v":0},null,{"$f":"IFERROR(HLOOKUP(S17,Mars!$D$3:$AH$9,MATCH(employe_ID,Mars!$A$3:$A$9,0),0),\"\")","v":0},{"$f":"IFERROR(HLOOKUP(T17,Mars!$D$3:$AH$9,MATCH(employe_ID,Mars!$A$3:$A$9,0),0),\"\")","v":0},{"$f":"IFERROR(HLOOKUP(U17,Mars!$D$3:$AH$9,MATCH(employe_ID,Mars!$A$3:$A$9,0),0),\"\")","v":0},{"$f":"IFERROR(HLOOKUP(V17,Mars!$D$3:$AH$9,MATCH(employe_ID,Mars!$A$3:$A$9,0),0),\"\")","v":0},{"$f":"IFERROR(HLOOKUP(W17,Mars!$D$3:$AH$9,MATCH(employe_ID,Mars!$A$3:$A$9,0),0),\"\")","v":0},{"$f":"IFERROR(HLOOKUP(X17,Mars!$D$3:$AH$9,MATCH(employe_ID,Mars!$A$3:$A$9,0),0),\"\")","v":0},{"$f":"IFERROR(HLOOKUP(Y17,Mars!$D$3:$AH$9,MATCH(employe_ID,Mars!$A$3:$A$9,0),0),\"\")","v":0}]
[null,null,{"$f":"IFERROR(HLOOKUP(C18,Janvier!$D$3:$AH$9,MATCH(employe_ID,Janvier!$A$3:$A$9,0),0),\"\")","v":0},{"$f":"IFERROR(HLOOKUP(D18,Janvier!$D$3:$AH$9,MATCH(employe_ID,Janvier!$A$3:$A$9,0),0),\"\")","v":0},{"$f":"IFERROR(HLOOKUP(E18,Janvier!$D$3:$AH$9,MATCH(employe_ID,Janvier!$A$3:$A$9,0),0),\"\")","v":0},{"$f":"IFERROR(HLOOKUP(F18,Janvier!$D$3:$AH$9,MATCH(employe_ID,Janvier!$A$3:$A$9,0),0),\"\")","v":0},{"$f":"IFERROR(HLOOKUP(G18,Janvier!$D$3:$AH$9,MATCH(employe_ID,Janvier!$A$3:$A$9,0),0),\"\")","v":0},{"$f":"IFERROR(HLOOKUP(H18,Janvier!$D$3:$AH$9,MATCH(employe_ID,Janvier!$A$3:$A$9,0),0),\"\")","v":0},{"$f":"IFERROR(HLOOKUP(I18,Janvier!$D$3:$AH$9,MATCH(employe_ID,Janvier!$A$3:$A$9,0),0),\"\")","v":""},null,{"$f":"IFERROR(HLOOKUP(K18,Février!$D$3:$AH$9,MATCH(employe_ID,Février!$A$3:$A$9,0),0),\"\")","v":0},{"$f":"IFERROR(HLOOKUP(L18,Février!$D$3:$AH$9,MATCH(employe_ID,Février!$A$3:$A$9,0),0),\"\")","v":0},{"$f":"IFERROR(HLOOKUP(M18,Février!$D$3:$AH$9,MATCH(employe_ID,Février!$A$3:$A$9,0),0),\"\")","v":0},{"$f":"IFERROR(HLOOKUP(N18,Février!$D$3:$AH$9,MATCH(employe_ID,Février!$A$3:$A$9,0),0),\"\")","v":0},{"$f":"IFERROR(HLOOKUP(O18,Février!$D$3:$AH$9,MATCH(employe_ID,Février!$A$3:$A$9,0),0),\"\")","v":0},{"$f":"IFERROR(HLOOKUP(P18,Février!$D$3:$AH$9,MATCH(employe_ID,Février!$A$3:$A$9,0),0),\"\")","v":0},{"$f":"IFERROR(HLOOKUP(Q18,Février!$D$3:$AH$9,MATCH(employe_ID,Février!$A$3:$A$9,0),0),\"\")","v":0},null,{"$f":"IFERROR(HLOOKUP(S18,Mars!$D$3:$AH$9,MATCH(employe_ID,Mars!$A$3:$A$9,0),0),\"\")","v":0},{"$f":"IFERROR(HLOOKUP(T18,Mars!$D$3:$AH$9,MATCH(employe_ID,Mars!$A$3:$A$9,0),0),\"\")","v":0},{"$f":"IFERROR(HLOOKUP(U18,Mars!$D$3:$AH$9,MATCH(employe_ID,Mars!$A$3:$A$9,0),0),\"\")","v":0},{"$f":"IFERROR(HLOOKUP(V18,Mars!$D$3:$AH$9,MATCH(employe_ID,Mars!$A$3:$A$9,0),0),\"\")","v":0},{"$f":"IFERROR(HLOOKUP(W18,Mars!$D$3:$AH$9,MATCH(employe_ID,Mars!$A$3:$A$9,0),0),\"\")","v":0},{"$f":"IFERROR(HLOOKUP(X18,Mars!$D$3:$AH$9,MATCH(employe_ID,Mars!$A$3:$A$9,0),0),\"\")","v":0},{"$f":"IFERROR(HLOOKUP(Y18,Mars!$D$3:$AH$9,MATCH(employe_ID,Mars!$A$3:$A$9,0),0),\"\")","v":0}]
[null,null,{"$f":"IFERROR(HLOOKUP(C19,Janvier!$D$3:$AH$9,MATCH(employe_ID,Janvier!$A$3:$A$9,0),0),\"\")","v":""},{"$f":"IFERROR(HLOOKUP(D19,Janvier!$D$3:$AH$9,MATCH(employe_ID,Janvier!$A$3:$A$9,0),0),\"\")","v":""},{"$f":"IFERROR(HLOOKUP(E19,Janvier!$D$3:$AH$9,MATCH(employe_ID,Janvier!$A$3:$A$9,0),0),\"\")","v":""},{"$f":"IFERROR(HLOOKUP(F19,Janvier!$D$3:$AH$9,MATCH(employe_ID,Janvier!$A$3:$A$9,0),0),\"\")","v":""},{"$f":"IFERROR(HLOOKUP(G19,Janvier!$D$3:$AH$9,MATCH(employe_ID,Janvier!$A$3:$A$9,0),0),\"\")","v":""},{"$f":"IFERROR(HLOOKUP(H19,Janvier!$D$3:$AH$9,MATCH(employe_ID,Janvier!$A$3:$A$9,0),0),\"\")","v":""},{"$f":"IFERROR(HLOOKUP(I19,Janvier!$D$3:$AH$9,MATCH(employe_ID,Janvier!$A$3:$A$9,0),0),\"\")","v":""},null,{"$f":"IFERROR(HLOOKUP(K19,Février!$D$3:$AH$9,MATCH(employe_ID,Février!$A$3:$A$9,0),0),\"\")","v":0},{"$f":"IFERROR(HLOOKUP(L19,Février!$D$3:$AH$9,MATCH(employe_ID,Février!$A$3:$A$9,0),0),\"\")","v":0},{"$f":"IFERROR(HLOOKUP(M19,Février!$D$3:$AH$9,MATCH(employe_ID,Février!$A$3:$A$9,0),0),\"\")","v":0},{"$f":"IFERROR(HLOOKUP(N19,Février!$D$3:$AH$9,MATCH(employe_ID,Février!$A$3:$A$9,0),0),\"\")","v":0},{"$f":"IFERROR(HLOOKUP(O19,Février!$D$3:$AH$9,MATCH(employe_ID,Février!$A$3:$A$9,0),0),\"\")","v":0},{"$f":"IFERROR(HLOOKUP(P19,Février!$D$3:$AH$9,MATCH(employe_ID,Février!$A$3:$A$9,0),0),\"\")","v":0},{"$f":"IFERROR(HLOOKUP(Q19,Février!$D$3:$AH$9,MATCH(employe_ID,Février!$A$3:$A$9,0),0),\"\")","v":0},null,{"$f":"IFERROR(HLOOKUP(S19,Mars!$D$3:$AH$9,MATCH(employe_ID,Mars!$A$3:$A$9,0),0),\"\")","v":0},{"$f":"IFERROR(HLOOKUP(T19,Mars!$D$3:$AH$9,MATCH(employe_ID,Mars!$A$3:$A$9,0),0),\"\")","v":0},{"$f":"IFERROR(HLOOKUP(U19,Mars!$D$3:$AH$9,MATCH(employe_ID,Mars!$A$3:$A$9,0),0),\"\")","v":""},{"$f":"IFERROR(HLOOKUP(V19,Mars!$D$3:$AH$9,MATCH(employe_ID,Mars!$A$3:$A$9,0),0),\"\")","v":""},{"$f":"IFERROR(HLOOKUP(W19,Mars!$D$3:$AH$9,MATCH(employe_ID,Mars!$A$3:$A$9,0),0),\"\")","v":""},{"$f":"IFERROR(HLOOKUP(X19,Mars!$D$3:$AH$9,MATCH(employe_ID,Mars!$A$3:$A$9,0),0),\"\")","v":""},{"$f":"IFERROR(HLOOKUP(Y19,Mars!$D$3:$AH$9,MATCH(employe_ID,Mars!$A$3:$A$9,0),0),\"\")","v":""}]
[]
[null,null,{"$f":"IFERROR(HLOOKUP(C23,Avril!$D$3:$AH$9,MATCH(employe_ID,Avril!$A$3:$A$9,0),0),\"\")","v":0},{"$f":"IFERROR(HLOOKUP(D23,Avril!$D$3:$AH$9,MATCH(employe_ID,Avril!$A$3:$A$9,0),0),\"\")","v":0},{"$f":"IFERROR(HLOOKUP(E23,Avril!$D$3:$AH$9,MATCH(employe_ID,Avril!$A$3:$A$9,0),0),\"\")","v":0},{"$f":"IFERROR(HLOOKUP(F23,Avril!$D$3:$AH$9,MATCH(employe_ID,Avril!$A$3:$A$9,0),0),\"\")","v":0},{"$f":"IFERROR(HLOOKUP(G23,Avril!$D$3:$AH$9,MATCH(employe_ID,Avril!$A$3:$A$9,0),0),\"\")","v":0},{"$f":"IFERROR(HLOOKUP(H23,Avril!$D$3:$AH$9,MATCH(employe_ID,Avril!$A$3:$A$9,0),0),\"\")","v":0},{"$f":"IFERROR(HLOOKUP(I23,Avril!$D$3:$AH$9,MATCH(employe_ID,Avril!$A$3:$A$9,0),0),\"\")","v":0},null,{"$f":"IFERROR(HLOOKUP(K23,Mai!$D$3:$AH$9,MATCH(employe_ID,Mai!$A$3:$A$9,0),0),\"\")","v":""},{"$f":"IFERROR(HLOOKUP(L23,Mai!$D$3:$AH$9,MATCH(employe_ID,Mai!$A$3:$A$9,0),0),\"\")","v":""},{"$f":"IFERROR(HLOOKUP(M23,Mai!$D$3:$AH$9,MATCH(employe_ID,Mai!$A$3:$A$9,0),0),\"\")","v":""},{"$f":"IFERROR(HLOOKUP(N23,Mai!$D$3:$AH$9,MATCH(employe_ID,Mai!$A$3:$A$9,0),0),\"\")","v":""},{"$f":"IFERROR(HLOOKUP(O23,Mai!$D$3:$AH$9,MATCH(employe_ID,Mai!$A$3:$A$9,0),0),\"\")","v":0},{"$f":"IFERROR(HLOOKUP(P23,Mai!$D$3:$AH$9,MATCH(employe_ID,Mai!$A$3:$A$9,0),0),\"\")","v":0},{"$f":"IFERROR(HLOOKUP(Q23,Mai!$D$3:$AH$9,MATCH(employe_ID,Mai!$A$3:$A$9,0),0),\"\")","v":0},null,{"$f":"IFERROR(HLOOKUP(S23,Juin!$D$3:$AH$9,MATCH(employe_ID,Juin!$A$3:$A$9,0),0),\"\")","v":0},{"$f":"IFERROR(HLOOKUP(T23,Juin!$D$3:$AH$9,MATCH(employe_ID,Juin!$A$3:$A$9,0),0),\"\")","v":0},{"$f":"IFERROR(HLOOKUP(U23,Juin!$D$3:$AH$9,MATCH(employe_ID,Juin!$A$3:$A$9,0),0),\"\")","v":0},{"$f":"IFERROR(HLOOKUP(V23,Juin!$D$3:$AH$9,MATCH(employe_ID,Juin!$A$3:$A$9,0),0),\"\")","v":0},{"$f":"IFERROR(HLOOKUP(W23,Juin!$D$3:$AH$9,MATCH(employe_ID,Juin!$A$3:$A$9,0),0),\"\")","v":0},{"$f":"IFERROR(HLOOKUP(X23,Juin!$D$3:$AH$9,MATCH(employe_ID,Juin!$A$3:$A$9,0),0),\"\")","v":0},{"$f":"IFERROR(HLOOKUP(Y23,Juin!$D$3:$AH$9,MATCH(employe_ID,Juin!$A$3:$A$9,0),0),\"\")","v":0}]
[null,null,{"$f":"IFERROR(HLOOKUP(C24,Avril!$D$3:$AH$9,MATCH(employe_ID,Avril!$A$3:$A$9,0),0),\"\")","v":0},{"$f":"IFERROR(HLOOKUP(D24,Avril!$D$3:$AH$9,MATCH(employe_ID,Avril!$A$3:$A$9,0),0),\"\")","v":0},{"$f":"IFERROR(HLOOKUP(E24,Avril!$D$3:$AH$9,MATCH(employe_ID,Avril!$A$3:$A$9,0),0),\"\")","v":0},{"$f":"IFERROR(HLOOKUP(F24,Avril!$D$3:$AH$9,MATCH(employe_ID,Avril!$A$3:$A$9,0),0),\"\")","v":0},{"$f":"IFERROR(HLOOKUP(G24,Avril!$D$3:$AH$9,MATCH(employe_ID,Avril!$A$3:$A$9,0),0),\"\")","v":0},{"$f":"IFERROR(HLOOKUP(H24,Avril!$D$3:$AH$9,MATCH(employe_ID,Avril!$A$3:$A$9,0),0),\"\")","v":0},{"$f":"IFERROR(HLOOKUP(I24,Avril!$D$3:$AH$9,MATCH(employe_ID,Avril!$A$3:$A$9,0),0),\"\")","v":0},null,{"$f":"IFERROR(HLOOKUP(K24,Mai!$D$3:$AH$9,MATCH(employe_ID,Mai!$A$3:$A$9,0),0),\"\")","v":0},{"$f":"IFERROR(HLOOKUP(L24,Mai!$D$3:$AH$9,MATCH(employe_ID,Mai!$A$3:$A$9,0),0),\"\")","v":0},{"$f":"IFERROR(HLOOKUP(M24,Mai!$D$3:$AH$9,MATCH(employe_ID,Mai!$A$3:$A$9,0),0),\"\")","v":0},{"$f":"IFERROR(HLOOKUP(N24,Mai!$D$3:$AH$9,MATCH(employe_ID,Mai!$A$3:$A$9,0),0),\"\")","v":0},{"$f":"IFERROR(HLOOKUP(O24,Mai!$D$3:$AH$9,MATCH(employe_ID,Mai!$A$3:$A$9,0),0),\"\")","v":0},{"$f":"IFERROR(HLOOKUP(P24,Mai!$D$3:$AH$9,MATCH(employe_ID,Mai!$A$3:$A$9,0),0),\"\")","v":0},{"$f":"IFERROR(HLOOKUP(Q24,Mai!$D$3:$AH$9,MATCH(employe_ID,Mai!$A$3:$A$9,0),0),\"\")","v":0},null,{"$f":"IFERROR(HLOOKUP(S24,Juin!$D$3:$AH$9,MATCH(employe_ID,Juin!$A$3:$A$9,0),0),\"\")","v":0},{"$f":"IFERROR(HLOOKUP(T24,Juin!$D$3:$AH$9,MATCH(employe_ID,Juin!$A$3:$A$9,0),0),\"\")","v":0},{"$f":"IFERROR(HLOOKUP(U24,Juin!$D$3:$AH$9,MATCH(employe_ID,Juin!$A$3:$A$9,0),0),\"\")","v":0},{"$f":"IFERROR(HLOOKUP(V24,Juin!$D$3:$AH$9,MATCH(employe_ID,Juin!$A$3:$A$9,0),0),\"\")","v":0},{"$f":"IFERROR(HLOOKUP(W24,Juin!$D$3:$AH$9,MATCH(employe_ID,Juin!$A$3:$A$9,0),0),\"\")","v":0},{"$f":"IFERROR(HLOOKUP(X24,Juin!$D$3:$AH$9,MATCH(employe_ID,Juin!$A$3:$A$9,0),0),\"\")","v":0},{"$f":"IFERROR(HLOOKUP(Y24,Juin!$D$3:$AH$9,MATCH(employe_ID,Juin!$A$3:$A$9,0),0),\"\")","v":0}]
[null,null,{"$f":"IFERROR(HLOOKUP(C25,Avril!$D$3:$AH$9,MATCH(employe_ID,Avril!$A$3:$A$9,0),0),\"\")","v":0},{"$f":"IFERROR(HLOOKUP(D25,Avril!$D$3:$AH$9,MATCH(employe_ID,Avril!$A$3:$A$9,0),0),\"\")","v":0},{"$f":"IFERROR(HLOOKUP(E25,Avril!$D$3:$AH$9,MATCH(employe_ID,Avril!$A$3:$A$9,0),0),\"\")","v":0},{"$f":"IFERROR(HLOOKUP(F25,Avril!$D$3:$AH$9,MATCH(employe_ID,Avril!$A$3:$A$9,0),0),\"\")","v":0},{"$f":"IFERROR(HLOOKUP(G25,Avril!$D$3:$AH$9,MATCH(employe_ID,Avril!$A$3:$A$9,0),0),\"\")","v":0},{"$f":"IFERROR(HLOOKUP(H25,Avril!$D$3:$AH$9,MATCH(employe_ID,Avril!$A$3:$A$9,0),0),\"\")","v":0},{"$f":"IFERROR(HLOOKUP(I25,Avril!$D$3:$AH$9,MATCH(employe_ID,Avril!$A$3:$A$9,0),0),\"\")","v":0},null,{"$f":"IFERROR(HLOOKUP(K25,Mai!$D$3:$AH$9,MATCH(employe_ID,Mai!$A$3:$A$9,0),0),\"\")","v":0},{"$f":"IFERROR(HLOOKUP(L25,Mai!$D$3:$AH$9,MATCH(employe_ID,Mai!$A$3:$A$9,0),0),\"\")","v":0},{"$f":"IFERROR(HLOOKUP(M25,Mai!$D$3:$AH$9,MATCH(employe_ID,Mai!$A$3:$A$9,0),0),\"\")","v":0},{"$f":"IFERROR(HLOOKUP(N25,Mai!$D$3:$AH$9,MATCH(employe_ID,Mai!$A$3:$A$9,0),0),\"\")","v":0},{"$f":"IFERROR(HLOOKUP(O25,Mai!$D$3:$AH$9,MATCH(employe_ID,Mai!$A$3:$A$9,0),0),\"\")","v":0},{"$f":"IFERROR(HLOOKUP(P25,Mai!$D$3:$AH$9,MATCH(employe_ID,Mai!$A$3:$A$9,0),0),\"\")","v":0},{"$f":"IFERROR(HLOOKUP(Q25,Mai!$D$3:$AH$9,MATCH(employe_ID,Mai!$A$3:$A$9,0),0),\"\")","v":0},null,{"$f":"IFERROR(HLOOKUP(S25,Juin!$D$3:$AH$9,MATCH(employe_ID,Juin!$A$3:$A$9,0),0),\"\")","v":0},{"$f":"IFERROR(HLOOKUP(T25,Juin!$D$3:$AH$9,MATCH(employe_ID,Juin!$A$3:$A$9,0),0),\"\")","v":0},{"$f":"IFERROR(HLOOKUP(U25,Juin!$D$3:$AH$9,MATCH(employe_ID,Juin!$A$3:$A$9,0),0),\"\")","v":0},{"$f":"IFERROR(HLOOKUP(V25,Juin!$D$3:$AH$9,MATCH(employe_ID,Juin!$A$3:$A$9,0),0),\"\")","v":0},{"$f":"IFERROR(HLOOKUP(W25,Juin!$D$3:$AH$9,MATCH(employe_ID,Juin!$A$3:$A$9,0),0),\"\")","v":0},{"$f":"IFERROR(HLOOKUP(X25,Juin!$D$3:$AH$9,MATCH(employe_ID,Juin!$A$3:$A$9,0),0),\"\")","v":0},{"$f":"IFERROR(HLOOKUP(Y25,Juin!$D$3:$AH$9,MATCH(employe_ID,Juin!$A$3:$A$9,0),0),\"\")","v":0}]
[null,null,{"$f":"IFERROR(HLOOKUP(C26,Avril!$D$3:$AH$9,MATCH(employe_ID,Avril!$A$3:$A$9,0),0),\"\")","v":0},{"$f":"IFERROR(HLOOKUP(D26,Avril!$D$3:$AH$9,MATCH(employe_ID,Avril!$A$3:$A$9,0),0),\"\")","v":0},{"$f":"IFERROR(HLOOKUP(E26,Avril!$D$3:$AH$9,MATCH(employe_ID,Avril!$A$3:$A$9,0),0),\"\")","v":0},{"$f":"IFERROR(HLOOKUP(F26,Avril!$D$3:$AH$9,MATCH(employe_ID,Avril!$A$3:$A$9,0),0),\"\")","v":0},{"$f":"IFERROR(HLOOKUP(G26,Avril!$D$3:$AH$9,MATCH(employe_ID,Avril!$A$3:$A$9,0),0),\"\")","v":0},{"$f":"IFERROR(HLOOKUP(H26,Avril!$D$3:$AH$9,MATCH(employe_ID,Avril!$A$3:$A$9,0),0),\"\")","v":0},{"$f":"IFERROR(HLOOKUP(I26,Avril!$D$3:$AH$9,MATCH(employe_ID,Avril!$A$3:$A$9,0),0),\"\")","v":0},null,{"$f":"IFERROR(HLOOKUP(K26,Mai!$D$3:$AH$9,MATCH(employe_ID,Mai!$A$3:$A$9,0),0),\"\")","v":0},{"$f":"IFERROR(HLOOKUP(L26,Mai!$D$3:$AH$9,MATCH(employe_ID,Mai!$A$3:$A$9,0),0),\"\")","v":0},{"$f":"IFERROR(HLOOKUP(M26,Mai!$D$3:$AH$9,MATCH(employe_ID,Mai!$A$3:$A$9,0),0),\"\")","v":0},{"$f":"IFERROR(HLOOKUP(N26,Mai!$D$3:$AH$9,MATCH(employe_ID,Mai!$A$3:$A$9,0),0),\"\")","v":0},{"$f":"IFERROR(HLOOKUP(O26,Mai!$D$3:$AH$9,MATCH(employe_ID,Mai!$A$3:$A$9,0),0),\"\")","v":0},{"$f":"IFERROR(HLOOKUP(P26,Mai!$D$3:$AH$9,MATCH(employe_ID,Mai!$A$3:$A$9,0),0),\"\")","v":0},{"$f":"IFERROR(HLOOKUP(Q26,Mai!$D$3:$AH$9,MATCH(employe_ID,Mai!$A$3:$A$9,0),0),\"\")","v":0},null,{"$f":"IFERROR(HLOOKUP(S26,Juin!$D$3:$AH$9,MATCH(employe_ID,Juin!$A$3:$A$9,0),0),\"\")","v":0},{"$f":"IFERROR(HLOOKUP(T26,Juin!$D$3:$AH$9,MATCH(employe_ID,Juin!$A$3:$A$9,0),0),\"\")","v":0},{"$f":"IFERROR(HLOOKUP(U26,Juin!$D$3:$AH$9,MATCH(employe_ID,Juin!$A$3:$A$9,0),0),\"\")","v":0},{"$f":"IFERROR(HLOOKUP(V26,Juin!$D$3:$AH$9,MATCH(employe_ID,Juin!$A$3:$A$9,0),0),\"\")","v":0},{"$f":"IFERROR(HLOOKUP(W26,Juin!$D$3:$AH$9,MATCH(employe_ID,Juin!$A$3:$A$9,0),0),\"\")","v":0},{"$f":"IFERROR(HLOOKUP(X26,Juin!$D$3:$AH$9,MATCH(employe_ID,Juin!$A$3:$A$9,0),0),\"\")","v":0},{"$f":"IFERROR(HLOOKUP(Y26,Juin!$D$3:$AH$9,MATCH(employe_ID,Juin!$A$3:$A$9,0),0),\"\")","v":0}]
[null,null,{"$f":"IFERROR(HLOOKUP(C27,Avril!$D$3:$AH$9,MATCH(employe_ID,Avril!$A$3:$A$9,0),0),\"\")","v":0},{"$f":"IFERROR(HLOOKUP(D27,Avril!$D$3:$AH$9,MATCH(employe_ID,Avril!$A$3:$A$9,0),0),\"\")","v":0},{"$f":"IFERROR(HLOOKUP(E27,Avril!$D$3:$AH$9,MATCH(employe_ID,Avril!$A$3:$A$9,0),0),\"\")","v":0},{"$f":"IFERROR(HLOOKUP(F27,Avril!$D$3:$AH$9,MATCH(employe_ID,Avril!$A$3:$A$9,0),0),\"\")","v":0},{"$f":"IFERROR(HLOOKUP(G27,Avril!$D$3:$AH$9,MATCH(employe_ID,Avril!$A$3:$A$9,0),0),\"\")","v":0},{"$f":"IFERROR(HLOOKUP(H27,Avril!$D$3:$AH$9,MATCH(employe_ID,Avril!$A$3:$A$9,0),0),\"\")","v":0},{"$f":"IFERROR(HLOOKUP(I27,Avril!$D$3:$AH$9,MATCH(employe_ID,Avril!$A$3:$A$9,0),0),\"\")","v":0},null,{"$f":"IFERROR(HLOOKUP(K27,Mai!$D$3:$AH$9,MATCH(employe_ID,Mai!$A$3:$A$9,0),0),\"\")","v":0},{"$f":"IFERROR(HLOOKUP(L27,Mai!$D$3:$AH$9,MATCH(employe_ID,Mai!$A$3:$A$9,0),0),\"\")","v":0},{"$f":"IFERROR(HLOOKUP(M27,Mai!$D$3:$AH$9,MATCH(employe_ID,Mai!$A$3:$A$9,0),0),\"\")","v":0},{"$f":"IFERROR(HLOOKUP(N27,Mai!$D$3:$AH$9,MATCH(employe_ID,Mai!$A$3:$A$9,0),0),\"\")","v":0},{"$f":"IFERROR(HLOOKUP(O27,Mai!$D$3:$AH$9,MATCH(employe_ID,Mai!$A$3:$A$9,0),0),\"\")","v":0},{"$f":"IFERROR(HLOOKUP(P27,Mai!$D$3:$AH$9,MATCH(employe_ID,Mai!$A$3:$A$9,0),0),\"\")","v":0},{"$f":"IFERROR(HLOOKUP(Q27,Mai!$D$3:$AH$9,MATCH(employe_ID,Mai!$A$3:$A$9,0),0),\"\")","v":0},null,{"$f":"IFERROR(HLOOKUP(S27,Juin!$D$3:$AH$9,MATCH(employe_ID,Juin!$A$3:$A$9,0),0),\"\")","v":0},{"$f":"IFERROR(HLOOKUP(T27,Juin!$D$3:$AH$9,MATCH(employe_ID,Juin!$A$3:$A$9,0),0),\"\")","v":0},{"$f":"IFERROR(HLOOKUP(U27,Juin!$D$3:$AH$9,MATCH(employe_ID,Juin!$A$3:$A$9,0),0),\"\")","v":0},{"$f":"IFERROR(HLOOKUP(V27,Juin!$D$3:$AH$9,MATCH(employe_ID,Juin!$A$3:$A$9,0),0),\"\")","v":0},{"$f":"IFERROR(HLOOKUP(W27,Juin!$D$3:$AH$9,MATCH(employe_ID,Juin!$A$3:$A$9,0),0),\"\")","v":0},{"$f":"IFERROR(HLOOKUP(X27,Juin!$D$3:$AH$9,MATCH(employe_ID,Juin!$A$3:$A$9,0),0),\"\")","v":0},{"$f":"IFERROR(HLOOKUP(Y27,Juin!$D$3:$AH$9,MATCH(employe_ID,Juin!$A$3:$A$9,0),0),\"\")","v":0}]
[null,null,{"$f":"IFERROR(HLOOKUP(C28,Avril!$D$3:$AH$9,MATCH(employe_ID,Avril!$A$3:$A$9,0),0),\"\")","v":0},{"$f":"IFERROR(HLOOKUP(D28,Avril!$D$3:$AH$9,MATCH(employe_ID,Avril!$A$3:$A$9,0),0),\"\")","v":0},{"$f":"IFERROR(HLOOKUP(E28,Avril!$D$3:$AH$9,MATCH(employe_ID,Avril!$A$3:$A$9,0),0),\"\")","v":0},{"$f":"IFERROR(HLOOKUP(F28,Avril!$D$3:$AH$9,MATCH(employe_ID,Avril!$A$3:$A$9,0),0),\"\")","v":0},{"$f":"IFERROR(HLOOKUP(G28,Avril!$D$3:$AH$9,MATCH(employe_ID,Avril!$A$3:$A$9,0),0),\"\")","v":0},{"$f":"IFERROR(HLOOKUP(H28,Avril!$D$3:$AH$9,MATCH(employe_ID,Avril!$A$3:$A$9,0),0),\"\")","v":0},{"$f":"IFERROR(HLOOKUP(I28,Avril!$D$3:$AH$9,MATCH(employe_ID,Avril!$A$3:$A$9,0),0),\"\")","v":0},null,{"$f":"IFERROR(HLOOKUP(K28,Mai!$D$3:$AH$9,MATCH(employe_ID,Mai!$A$3:$A$9,0),0),\"\")","v":""},{"$f":"IFERROR(HLOOKUP(L28,Mai!$D$3:$AH$9,MATCH(employe_ID,Mai!$A$3:$A$9,0),0),\"\")","v":""},{"$f":"IFERROR(HLOOKUP(M28,Mai!$D$3:$AH$9,MATCH(employe_ID,Mai!$A$3:$A$9,0),0),\"\")","v":""},{"$f":"IFERROR(HLOOKUP(N28,Mai!$D$3:$AH$9,MATCH(employe_ID,Mai!$A$3:$A$9,0),0),\"\")","v":""},{"$f":"IFERROR(HLOOKUP(O28,Mai!$D$3:$AH$9,MATCH(employe_ID,Mai!$A$3:$A$9,0),0),\"\")","v":""},{"$f":"IFERROR(HLOOKUP(P28,Mai!$D$3:$AH$9,MATCH(employe_ID,Mai!$A$3:$A$9,0),0),\"\")","v":""},{"$f":"IFERROR(HLOOKUP(Q28,Mai!$D$3:$AH$9,MATCH(employe_ID,Mai!$A$3:$A$9,0),0),\"\")","v":""},null,{"$f":"IFERROR(HLOOKUP(S28,Juin!$D$3:$AH$9,MATCH(employe_ID,Juin!$A$3:$A$9,0),0),\"\")","v":0},{"$f":"IFERROR(HLOOKUP(T28,Juin!$D$3:$AH$9,MATCH(employe_ID,Juin!$A$3:$A$9,0),0),\"\")","v":0},{"$f":"IFERROR(HLOOKUP(U28,Juin!$D$3:$AH$9,MATCH(employe_ID,Juin!$A$3:$A$9,0),0),\"\")","v":0},{"$f":"IFERROR(HLOOKUP(V28,Juin!$D$3:$AH$9,MATCH(employe_ID,Juin!$A$3:$A$9,0),0),\"\")","v":0},{"$f":"IFERROR(HLOOKUP(W28,Juin!$D$3:$AH$9,MATCH(employe_ID,Juin!$A$3:$A$9,0),0),\"\")","v":0},{"$f":"IFERROR(HLOOKUP(X28,Juin!$D$3:$AH$9,MATCH(employe_ID,Juin!$A$3:$A$9,0),0),\"\")","v":0},{"$f":"IFERROR(HLOOKUP(Y28,Juin!$D$3:$AH$9,MATCH(employe_ID,Juin!$A$3:$A$9,0),0),\"\")","v":0}]
[]
[null,null,{"$f":"IFERROR(HLOOKUP(C32,Juillet!$D$3:$AH$9,MATCH(employe_ID,Juillet!$A$3:$A$9,0),0),\"\")","v":""},{"$f":"IFERROR(HLOOKUP(D32,Juillet!$D$3:$AH$9,MATCH(employe_ID,Juillet!$A$3:$A$9,0),0),\"\")","v":""},{"$f":"IFERROR(HLOOKUP(E32,Juillet!$D$3:$AH$9,MATCH(employe_ID,Juillet!$A$3:$A$9,0),0),\"\")","v":0},{"$f":"IFERROR(HLOOKUP(F32,Juillet!$D$3:$AH$9,MATCH(employe_ID,Juillet!$A$3:$A$9,0),0),\"\")","v":0},{"$f":"IFERROR(HLOOKUP(G32,Juillet!$D$3:$AH$9,MATCH(employe_ID,Juillet!$A$3:$A$9,0),0),\"\")","v":0},{"$f":"IFERROR(HLOOKUP(H32,Juillet!$D$3:$AH$9,MATCH(employe_ID,Juillet!$A$3:$A$9,0),0),\"\")","v":0},{"$f":"IFERROR(HLOOKUP(I32,Juillet!$D$3:$AH$9,MATCH(employe_ID,Juillet!$A$3:$A$9,0),0),\"\")","v":0},null,{"$f":"IFERROR(HLOOKUP(K32,Août!$D$3:$AH$9,MATCH(employe_ID,Août!$A$3:$A$9,0),0),\"\")","v":""},{"$f":"IFERROR(HLOOKUP(L32,Août!$D$3:$AH$9,MATCH(employe_ID,Août!$A$3:$A$9,0),0),\"\")","v":""},{"$f":"IFERROR(HLOOKUP(M32,Août!$D$3:$AH$9,MATCH(employe_ID,Août!$A$3:$A$9,0),0),\"\")","v":""},{"$f":"IFERROR(HLOOKUP(N32,Août!$D$3:$AH$9,MATCH(employe_ID,Août!$A$3:$A$9,0),0),\"\")","v":""},{"$f":"IFERROR(HLOOKUP(O32,Août!$D$3:$AH$9,MATCH(employe_ID,Août!$A$3:$A$9,0),0),\"\")","v":""},{"$f":"IFERROR(HLOOKUP(P32,Août!$D$3:$AH$9,MATCH(employe_ID,Août!$A$3:$A$9,0),0),\"\")","v":0},{"$f":"IFERROR(HLOOKUP(Q32,Août!$D$3:$AH$9,MATCH(employe_ID,Août!$A$3:$A$9,0),0),\"\")","v":0},null,{"$f":"IFERROR(HLOOKUP(S32,Septembre!$D$3:$AH$9,MATCH(employe_ID,Septembre!$A$3:$A$9,0),0),\"\")","v":0},{"$f":"IFERROR(HLOOKUP(T32,Septembre!$D$3:$AH$9,MATCH(employe_ID,Septembre!$A$3:$A$9,0),0),\"\")","v":0},{"$f":"IFERROR(HLOOKUP(U32,Septembre!$D$3:$AH$9,MATCH(employe_ID,Septembre!$A$3:$A$9,0),0),\"\")","v":0},{"$f":"IFERROR(HLOOKUP(V32,Septembre!$D$3:$AH$9,MATCH(employe_ID,Septembre!$A$3:$A$9,0),0),\"\")","v":0},{"$f":"IFERROR(HLOOKUP(W32,Septembre!$D$3:$AH$9,MATCH(employe_ID,Septembre!$A$3:$A$9,0),0),\"\")","v":0},{"$f":"IFERROR(HLOOKUP(X32,Septembre!$D$3:$AH$9,MATCH(employe_ID,Septembre!$A$3:$A$9,0),0),\"\")","v":0},{"$f":"IFERROR(HLOOKUP(Y32,Septembre!$D$3:$AH$9,MATCH(employe_ID,Septembre!$A$3:$A$9,0),0),\"\")","v":0}]
[null,null,{"$f":"IFERROR(HLOOKUP(C33,Juillet!$D$3:$AH$9,MATCH(employe_ID,Juillet!$A$3:$A$9,0),0),\"\")","v":0},{"$f":"IFERROR(HLOOKUP(D33,Juillet!$D$3:$AH$9,MATCH(employe_ID,Juillet!$A$3:$A$9,0),0),\"\")","v":0},{"$f":"IFERROR(HLOOKUP(E33,Juillet!$D$3:$AH$9,MATCH(employe_ID,Juillet!$A$3:$A$9,0),0),\"\")","v":0},{"$f":"IFERROR(HLOOKUP(F33,Juillet!$D$3:$AH$9,MATCH(employe_ID,Juillet!$A$3:$A$9,0),0),\"\")","v":0},{"$f":"IFERROR(HLOOKUP(G33,Juillet!$D$3:$AH$9,MATCH(employe_ID,Juillet!$A$3:$A$9,0),0),\"\")","v":0},{"$f":"IFERROR(HLOOKUP(H33,Juillet!$D$3:$AH$9,MATCH(employe_ID,Juillet!$A$3:$A$9,0),0),\"\")","v":0},{"$f":"IFERROR(HLOOKUP(I33,Juillet!$D$3:$AH$9,MATCH(employe_ID,Juillet!$A$3:$A$9,0),0),\"\")","v":0},null,{"$f":"IFERROR(HLOOKUP(K33,Août!$D$3:$AH$9,MATCH(employe_ID,Août!$A$3:$A$9,0),0),\"\")","v":0},{"$f":"IFERROR(HLOOKUP(L33,Août!$D$3:$AH$9,MATCH(employe_ID,Août!$A$3:$A$9,0),0),\"\")","v":0},{"$f":"IFERROR(HLOOKUP(M33,Août!$D$3:$AH$9,MATCH(employe_ID,Août!$A$3:$A$9,0),0),\"\")","v":0},{"$f":"IFERROR(HLOOKUP(N33,Août!$D$3:$AH$9,MATCH(employe_ID,Août!$A$3:$A$9,0),0),\"\")","v":0},{"$f":"IFERROR(HLOOKUP(O33,Août!$D$3:$AH$9,MATCH(employe_ID,Août!$A$3:$A$9,0),0),\"\")","v":0},{"$f":"IFERROR(HLOOKUP(P33,Août!$D$3:$AH$9,MATCH(employe_ID,Août!$A$3:$A$9,0),0),\"\")","v":0},{"$f":"IFERROR(HLOOKUP(Q33,Août!$D$3:$AH$9,MATCH(employe_ID,Août!$A$3:$A$9,0),0),\"\")","v":0},null,{"$f":"IFERROR(HLOOKUP(S33,Septembre!$D$3:$AH$9,MATCH(employe_ID,Septembre!$A$3:$A$9,0),0),\"\")","v":0},{"$f":"IFERROR(HLOOKUP(T33,Septembre!$D$3:$AH$9,MATCH(employe_ID,Septembre!$A$3:$A$9,0),0),\"\")","v":0},{"$f":"IFERROR(HLOOKUP(U33,Septembre!$D$3:$AH$9,MATCH(employe_ID,Septembre!$A$3:$A$9,0),0),\"\")","v":0},{"$f":"IFERROR(HLOOKUP(V33,Septembre!$D$3:$AH$9,MATCH(employe_ID,Septembre!$A$3:$A$9,0),0),\"\")","v":0},{"$f":"IFERROR(HLOOKUP(W33,Septembre!$D$3:$AH$9,MATCH(employe_ID,Septembre!$A$3:$A$9,0),0),\"\")","v":0},{"$f":"IFERROR(HLOOKUP(X33,Septembre!$D$3:$AH$9,MATCH(employe_ID,Septembre!$A$3:$A$9,0),0),\"\")","v":0},{"$f":"IFERROR(HLOOKUP(Y33,Septembre!$D$3:$AH$9,MATCH(employe_ID,Septembre!$A$3:$A$9,0),0),\"\")","v":0}]
[null,null,{"$f":"IFERROR(HLOOKUP(C34,Juillet!$D$3:$AH$9,MATCH(employe_ID,Juillet!$A$3:$A$9,0),0),\"\")","v":0},{"$f":"IFERROR(HLOOKUP(D34,Juillet!$D$3:$AH$9,MATCH(employe_ID,Juillet!$A$3:$A$9,0),0),\"\")","v":0},{"$f":"IFERROR(HLOOKUP(E34,Juillet!$D$3:$AH$9,MATCH(employe_ID,Juillet!$A$3:$A$9,0),0),\"\")","v":0},{"$f":"IFERROR(HLOOKUP(F34,Juillet!$D$3:$AH$9,MATCH(employe_ID,Juillet!$A$3:$A$9,0),0),\"\")","v":0},{"$f":"IFERROR(HLOOKUP(G34,Juillet!$D$3:$AH$9,MATCH(employe_ID,Juillet!$A$3:$A$9,0),0),\"\")","v":0},{"$f":"IFERROR(HLOOKUP(H34,Juillet!$D$3:$AH$9,MATCH(employe_ID,Juillet!$A$3:$A$9,0),0),\"\")","v":0},{"$f":"IFERROR(HLOOKUP(I34,Juillet!$D$3:$AH$9,MATCH(employe_ID,Juillet!$A$3:$A$9,0),0),\"\")","v":0},null,{"$f":"IFERROR(HLOOKUP(K34,Août!$D$3:$AH$9,MATCH(employe_ID,Août!$A$3:$A$9,0),0),\"\")","v":0},{"$f":"IFERROR(HLOOKUP(L34,Août!$D$3:$AH$9,MATCH(employe_ID,Août!$A$3:$A$9,0),0),\"\")","v":0},{"$f":"IFERROR(HLOOKUP(M34,Août!$D$3:$AH$9,MATCH(employe_ID,Août!$A$3:$A$9,0),0),\"\")","v":0},{"$f":"IFERROR(HLOOKUP(N34,Août!$D$3:$AH$9,MATCH(employe_ID,Août!$A$3:$A$9,0),0),\"\")","v":0},{"$f":"IFERROR(HLOOKUP(O34,Août!$D$3:$AH$9,MATCH(employe_ID,Août!$A$3:$A$9,0),0),\"\")","v":0},{"$f":"IFERROR(HLOOKUP(P34,Août!$D$3:$AH$9,MATCH(employe_ID,Août!$A$3:$A$9,0),0),\"\")","v":0},{"$f":"IFERROR(HLOOKUP(Q34,Août!$D$3:$AH$9,MATCH(employe_ID,Août!$A$3:$A$9,0),0),\"\")","v":0},null,{"$f":"IFERROR(HLOOKUP(S34,Septembre!$D$3:$AH$9,MATCH(employe_ID,Septembre!$A$3:$A$9,0),0),\"\")","v":0},{"$f":"IFERROR(HLOOKUP(T34,Septembre!$D$3:$AH$9,MATCH(employe_ID,Septembre!$A$3:$A$9,0),0),\"\")","v":0},{"$f":"IFERROR(HLOOKUP(U34,Septembre!$D$3:$AH$9,MATCH(employe_ID,Septembre!$A$3:$A$9,0),0),\"\")","v":0},{"$f":"IFERROR(HLOOKUP(V34,Septembre!$D$3:$AH$9,MATCH(employe_ID,Septembre!$A$3:$A$9,0),0),\"\")","v":0},{"$f":"IFERROR(HLOOKUP(W34,Septembre!$D$3:$AH$9,MATCH(employe_ID,Septembre!$A$3:$A$9,0),0),\"\")","v":0},{"$f":"IFERROR(HLOOKUP(X34,Septembre!$D$3:$AH$9,MATCH(employe_ID,Septembre!$A$3:$A$9,0),0),\"\")","v":0},{"$f":"IFERROR(HLOOKUP(Y34,Septembre!$D$3:$AH$9,MATCH(employe_ID,Septembre!$A$3:$A$9,0),0),\"\")","v":0}]
[null,null,{"$f":"IFERROR(HLOOKUP(C35,Juillet!$D$3:$AH$9,MATCH(employe_ID,Juillet!$A$3:$A$9,0),0),\"\")","v":0},{"$f":"IFERROR(HLOOKUP(D35,Juillet!$D$3:$AH$9,MATCH(employe_ID,Juillet!$A$3:$A$9,0),0),\"\")","v":0},{"$f":"IFERROR(HLOOKUP(E35,Juillet!$D$3:$AH$9,MATCH(employe_ID,Juillet!$A$3:$A$9,0),0),\"\")","v":0},{"$f":"IFERROR(HLOOKUP(F35,Juillet!$D$3:$AH$9,MATCH(employe_ID,Juillet!$A$3:$A$9,0),0),\"\")","v":0},{"$f":"IFERROR(HLOOKUP(G35,Juillet!$D$3:$AH$9,MATCH(employe_ID,Juillet!$A$3:$A$9,0),0),\"\")","v":0},{"$f":"IFERROR(HLOOKUP(H35,Juillet!$D$3:$AH$9,MATCH(employe_ID,Juillet!$A$3:$A$9,0),0),\"\")","v":0},{"$f":"IFERROR(HLOOKUP(I35,Juillet!$D$3:$AH$9,MATCH(employe_ID,Juillet!$A$3:$A$9,0),0),\"\")","v":0},null,{"$f":"IFERROR(HLOOKUP(K35,Août!$D$3:$AH$9,MATCH(employe_ID,Août!$A$3:$A$9,0),0),\"\")","v":0},{"$f":"IFERROR(HLOOKUP(L35,Août!$D$3:$AH$9,MATCH(employe_ID,Août!$A$3:$A$9,0),0),\"\")","v":0},{"$f":"IFERROR(HLOOKUP(M35,Août!$D$3:$AH$9,MATCH(employe_ID,Août!$A$3:$A$9,0),0),\"\")","v":0},{"$f":"IFERROR(HLOOKUP(N35,Août!$D$3:$AH$9,MATCH(employe_ID,Août!$A$3:$A$9,0),0),\"\")","v":0},{"$f":"IFERROR(HLOOKUP(O35,Août!$D$3:$AH$9,MATCH(employe_ID,Août!$A$3:$A$9,0),0),\"\")","v":0},{"$f":"IFERROR(HLOOKUP(P35,Août!$D$3:$AH$9,MATCH(employe_ID,Août!$A$3:$A$9,0),0),\"\")","v":0},{"$f":"IFERROR(HLOOKUP(Q35,Août!$D$3:$AH$9,MATCH(employe_ID,Août!$A$3:$A$9,0),0),\"\")","v":0},null,{"$f":"IFERROR(HLOOKUP(S35,Septembre!$D$3:$AH$9,MATCH(employe_ID,Septembre!$A$3:$A$9,0),0),\"\")","v":0},{"$f":"IFERROR(HLOOKUP(T35,Septembre!$D$3:$AH$9,MATCH(employe_ID,Septembre!$A$3:$A$9,0),0),\"\")","v":0},{"$f":"IFERROR(HLOOKUP(U35,Septembre!$D$3:$AH$9,MATCH(employe_ID,Septembre!$A$3:$A$9,0),0),\"\")","v":0},{"$f":"IFERROR(HLOOKUP(V35,Septembre!$D$3:$AH$9,MATCH(employe_ID,Septembre!$A$3:$A$9,0),0),\"\")","v":0},{"$f":"IFERROR(HLOOKUP(W35,Septembre!$D$3:$AH$9,MATCH(employe_ID,Septembre!$A$3:$A$9,0),0),\"\")","v":0},{"$f":"IFERROR(HLOOKUP(X35,Septembre!$D$3:$AH$9,MATCH(employe_ID,Septembre!$A$3:$A$9,0),0),\"\")","v":0},{"$f":"IFERROR(HLOOKUP(Y35,Septembre!$D$3:$AH$9,MATCH(employe_ID,Septembre!$A$3:$A$9,0),0),\"\")","v":0}]
[null,null,{"$f":"IFERROR(HLOOKUP(C36,Juillet!$D$3:$AH$9,MATCH(employe_ID,Juillet!$A$3:$A$9,0),0),\"\")","v":0},{"$f":"IFERROR(HLOOKUP(D36,Juillet!$D$3:$AH$9,MATCH(employe_ID,Juillet!$A$3:$A$9,0),0),\"\")","v":0},{"$f":"IFERROR(HLOOKUP(E36,Juillet!$D$3:$AH$9,MATCH(employe_ID,Juillet!$A$3:$A$9,0),0),\"\")","v":0},{"$f":"IFERROR(HLOOKUP(F36,Juillet!$D$3:$AH$9,MATCH(employe_ID,Juillet!$A$3:$A$9,0),0),\"\")","v":0},{"$f":"IFERROR(HLOOKUP(G36,Juillet!$D$3:$AH$9,MATCH(employe_ID,Juillet!$A$3:$A$9,0),0),\"\")","v":0},{"$f":"IFERROR(HLOOKUP(H36,Juillet!$D$3:$AH$9,MATCH(employe_ID,Juillet!$A$3:$A$9,0),0),\"\")","v":""},{"$f":"IFERROR(HLOOKUP(I36,Juillet!$D$3:$AH$9,MATCH(employe_ID,Juillet!$A$3:$A$9,0),0),\"\")","v":""},null,{"$f":"IFERROR(HLOOKUP(K36,Août!$D$3:$AH$9,MATCH(employe_ID,Août!$A$3:$A$9,0),0),\"\")","v":0},{"$f":"IFERROR(HLOOKUP(L36,Août!$D$3:$AH$9,MATCH(employe_ID,Août!$A$3:$A$9,0),0),\"\")","v":0},{"$f":"IFERROR(HLOOKUP(M36,Août!$D$3:$AH$9,MATCH(employe_ID,Août!$A$3:$A$9,0),0),\"\")","v":0},{"$f":"IFERROR(HLOOKUP(N36,Août!$D$3:$AH$9,MATCH(employe_ID,Août!$A$3:$A$9,0),0),\"\")","v":0},{"$f":"IFERROR(HLOOKUP(O36,Août!$D$3:$AH$9,MATCH(employe_ID,Août!$A$3:$A$9,0),0),\"\")","v":0},{"$f":"IFERROR(HLOOKUP(P36,Août!$D$3:$AH$9,MATCH(employe_ID,Août!$A$3:$A$9,0),0),\"\")","v":0},{"$f":"IFERROR(HLOOKUP(Q36,Août!$D$3:$AH$9,MATCH(employe_ID,Août!$A$3:$A$9,0),0),\"\")","v":0},null,{"$f":"IFERROR(HLOOKUP(S36,Septembre!$D$3:$AH$9,MATCH(employe_ID,Septembre!$A$3:$A$9,0),0),\"\")","v":0},{"$f":"IFERROR(HLOOKUP(T36,Septembre!$D$3:$AH$9,MATCH(employe_ID,Septembre!$A$3:$A$9,0),0),\"\")","v":0},{"$f":"IFERROR(HLOOKUP(U36,Septembre!$D$3:$AH$9,MATCH(employe_ID,Septembre!$A$3:$A$9,0),0),\"\")","v":0},{"$f":"IFERROR(HLOOKUP(V36,Septembre!$D$3:$AH$9,MATCH(employe_ID,Septembre!$A$3:$A$9,0),0),\"\")","v":0},{"$f":"IFERROR(HLOOKUP(W36,Septembre!$D$3:$AH$9,MATCH(employe_ID,Septembre!$A$3:$A$9,0),0),\"\")","v":0},{"$f":"IFERROR(HLOOKUP(X36,Septembre!$D$3:$AH$9,MATCH(employe_ID,Septembre!$A$3:$A$9,0),0),\"\")","v":0},{"$f":"IFERROR(HLOOKUP(Y36,Septembre!$D$3:$AH$9,MATCH(employe_ID,Septembre!$A$3:$A$9,0),0),\"\")","v":0}]
[null,null,{"$f":"IFERROR(HLOOKUP(C37,Juillet!$D$3:$AH$9,MATCH(employe_ID,Juillet!$A$3:$A$9,0),0),\"\")","v":""},{"$f":"IFERROR(HLOOKUP(D37,Juillet!$D$3:$AH$9,MATCH(employe_ID,Juillet!$A$3:$A$9,0),0),\"\")","v":""},{"$f":"IFERROR(HLOOKUP(E37,Juillet!$D$3:$AH$9,MATCH(employe_ID,Juillet!$A$3:$A$9,0),0),\"\")","v":""},{"$f":"IFERROR(HLOOKUP(F37,Juillet!$D$3:$AH$9,MATCH(employe_ID,Juillet!$A$3:$A$9,0),0),\"\")","v":""},{"$f":"IFERROR(HLOOKUP(G37,Juillet!$D$3:$AH$9,MATCH(employe_ID,Juillet!$A$3:$A$9,0),0),\"\")","v":""},{"$f":"IFERROR(HLOOKUP(H37,Juillet!$D$3:$AH$9,MATCH(employe_ID,Juillet!$A$3:$A$9,0),0),\"\")","v":""},{"$f":"IFERROR(HLOOKUP(I37,Juillet!$D$3:$AH$9,MATCH(employe_ID,Juillet!$A$3:$A$9,0),0),\"\")","v":""},null,{"$f":"IFERROR(HLOOKUP(K37,Août!$D$3:$AH$9,MATCH(employe_ID,Août!$A$3:$A$9,0),0),\"\")","v":0},{"$f":"IFERROR(HLOOKUP(L37,Août!$D$3:$AH$9,MATCH(employe_ID,Août!$A$3:$A$9,0),0),\"\")","v":""},{"$f":"IFERROR(HLOOKUP(M37,Août!$D$3:$AH$9,MATCH(employe_ID,Août!$A$3:$A$9,0),0),\"\")","v":""},{"$f":"IFERROR(HLOOKUP(N37,Août!$D$3:$AH$9,MATCH(employe_ID,Août!$A$3:$A$9,0),0),\"\")","v":""},{"$f":"IFERROR(HLOOKUP(O37,Août!$D$3:$AH$9,MATCH(employe_ID,Août!$A$3:$A$9,0),0),\"\")","v":""},{"$f":"IFERROR(HLOOKUP(P37,Août!$D$3:$AH$9,MATCH(employe_ID,Août!$A$3:$A$9,0),0),\"\")","v":""},{"$f":"IFERROR(HLOOKUP(Q37,Août!$D$3:$AH$9,MATCH(employe_ID,Août!$A$3:$A$9,0),0),\"\")","v":""},null,{"$f":"IFERROR(HLOOKUP(S37,Septembre!$D$3:$AH$9,MATCH(employe_ID,Septembre!$A$3:$A$9,0),0),\"\")","v":0},{"$f":"IFERROR(HLOOKUP(T37,Septembre!$D$3:$AH$9,MATCH(employe_ID,Septembre!$A$3:$A$9,0),0),\"\")","v":0},{"$f":"IFERROR(HLOOKUP(U37,Septembre!$D$3:$AH$9,MATCH(employe_ID,Septembre!$A$3:$A$9,0),0),\"\")","v":0},{"$f":"IFERROR(HLOOKUP(V37,Septembre!$D$3:$AH$9,MATCH(employe_ID,Septembre!$A$3:$A$9,0),0),\"\")","v":0},{"$f":"IFERROR(HLOOKUP(W37,Septembre!$D$3:$AH$9,MATCH(employe_ID,Septembre!$A$3:$A$9,0),0),\"\")","v":0},{"$f":"IFERROR(HLOOKUP(X37,Septembre!$D$3:$AH$9,MATCH(employe_ID,Septembre!$A$3:$A$9,0),0),\"\")","v":0},{"$f":"IFERROR(HLOOKUP(Y37,Septembre!$D$3:$AH$9,MATCH(employe_ID,Septembre!$A$3:$A$9,0),0),\"\")","v":0}]
[]
[null,null,{"$f":"IFERROR(HLOOKUP(C41,Octobre!$D$3:$AH$9,MATCH(employe_ID,Octobre!$A$3:$A$9,0),0),\"\")","v":""},{"$f":"IFERROR(HLOOKUP(D41,Octobre!$D$3:$AH$9,MATCH(employe_ID,Octobre!$A$3:$A$9,0),0),\"\")","v":""},{"$f":"IFERROR(HLOOKUP(E41,Octobre!$D$3:$AH$9,MATCH(employe_ID,Octobre!$A$3:$A$9,0),0),\"\")","v":""},{"$f":"IFERROR(HLOOKUP(F41,Octobre!$D$3:$AH$9,MATCH(employe_ID,Octobre!$A$3:$A$9,0),0),\"\")","v":0},{"$f":"IFERROR(HLOOKUP(G41,Octobre!$D$3:$AH$9,MATCH(employe_ID,Octobre!$A$3:$A$9,0),0),\"\")","v":0},{"$f":"IFERROR(HLOOKUP(H41,Octobre!$D$3:$AH$9,MATCH(employe_ID,Octobre!$A$3:$A$9,0),0),\"\")","v":0},{"$f":"IFERROR(HLOOKUP(I41,Octobre!$D$3:$AH$9,MATCH(employe_ID,Octobre!$A$3:$A$9,0),0),\"\")","v":0},null,{"$f":"IFERROR(HLOOKUP(K41,Novembre!$D$3:$AH$9,MATCH(employe_ID,Novembre!$A$3:$A$9,0),0),\"\")","v":0},{"$f":"IFERROR(HLOOKUP(L41,Novembre!$D$3:$AH$9,MATCH(employe_ID,Novembre!$A$3:$A$9,0),0),\"\")","v":0},{"$f":"IFERROR(HLOOKUP(M41,Novembre!$D$3:$AH$9,MATCH(employe_ID,Novembre!$A$3:$A$9,0),0),\"\")","v":0},{"$f":"IFERROR(HLOOKUP(N41,Novembre!$D$3:$AH$9,MATCH(employe_ID,Novembre!$A$3:$A$9,0),0),\"\")","v":0},{"$f":"IFERROR(HLOOKUP(O41,Novembre!$D$3:$AH$9,MATCH(employe_ID,Novembre!$A$3:$A$9,0),0),\"\")","v":0},{"$f":"IFERROR(HLOOKUP(P41,Novembre!$D$3:$AH$9,MATCH(employe_ID,Novembre!$A$3:$A$9,0),0),\"\")","v":0},{"$f":"IFERROR(HLOOKUP(Q41,Novembre!$D$3:$AH$9,MATCH(employe_ID,Novembre!$A$3:$A$9,0),0),\"\")","v":0},null,{"$f":"IFERROR(HLOOKUP(S41,Décembre!$D$3:$AH$9,MATCH(employe_ID,Décembre!$A$3:$A$9,0),0),\"\")","v":""},{"$f":"IFERROR(HLOOKUP(T41,Décembre!$D$3:$AH$9,MATCH(employe_ID,Décembre!$A$3:$A$9,0),0),\"\")","v":0},{"$f":"IFERROR(HLOOKUP(U41,Décembre!$D$3:$AH$9,MATCH(employe_ID,Décembre!$A$3:$A$9,0),0),\"\")","v":0},{"$f":"IFERROR(HLOOKUP(V41,Décembre!$D$3:$AH$9,MATCH(employe_ID,Décembre!$A$3:$A$9,0),0),\"\")","v":0},{"$f":"IFERROR(HLOOKUP(W41,Décembre!$D$3:$AH$9,MATCH(employe_ID,Décembre!$A$3:$A$9,0),0),\"\")","v":0},{"$f":"IFERROR(HLOOKUP(X41,Décembre!$D$3:$AH$9,MATCH(employe_ID,Décembre!$A$3:$A$9,0),0),\"\")","v":0},{"$f":"IFERROR(HLOOKUP(Y41,Décembre!$D$3:$AH$9,MATCH(employe_ID,Décembre!$A$3:$A$9,0),0),\"\")","v":0}]
[null,null,{"$f":"IFERROR(HLOOKUP(C42,Octobre!$D$3:$AH$9,MATCH(employe_ID,Octobre!$A$3:$A$9,0),0),\"\")","v":0},{"$f":"IFERROR(HLOOKUP(D42,Octobre!$D$3:$AH$9,MATCH(employe_ID,Octobre!$A$3:$A$9,0),0),\"\")","v":0},{"$f":"IFERROR(HLOOKUP(E42,Octobre!$D$3:$AH$9,MATCH(employe_ID,Octobre!$A$3:$A$9,0),0),\"\")","v":0},{"$f":"IFERROR(HLOOKUP(F42,Octobre!$D$3:$AH$9,MATCH(employe_ID,Octobre!$A$3:$A$9,0),0),\"\")","v":0},{"$f":"IFERROR(HLOOKUP(G42,Octobre!$D$3:$AH$9,MATCH(employe_ID,Octobre!$A$3:$A$9,0),0),\"\")","v":0},{"$f":"IFERROR(HLOOKUP(H42,Octobre!$D$3:$AH$9,MATCH(employe_ID,Octobre!$A$3:$A$9,0),0),\"\")","v":0},{"$f":"IFERROR(HLOOKUP(I42,Octobre!$D$3:$AH$9,MATCH(employe_ID,Octobre!$A$3:$A$9,0),0),\"\")","v":0},null,{"$f":"IFERROR(HLOOKUP(K42,Novembre!$D$3:$AH$9,MATCH(employe_ID,Novembre!$A$3:$A$9,0),0),\"\")","v":0},{"$f":"IFERROR(HLOOKUP(L42,Novembre!$D$3:$AH$9,MATCH(employe_ID,Novembre!$A$3:$A$9,0),0),\"\")","v":0},{"$f":"IFERROR(HLOOKUP(M42,Novembre!$D$3:$AH$9,MATCH(employe_ID,Novembre!$A$3:$A$9,0),0),\"\")","v":0},{"$f":"IFERROR(HLOOKUP(N42,Novembre!$D$3:$AH$9,MATCH(employe_ID,Novembre!$A$3:$A$9,0),0),\"\")","v":0},{"$f":"IFERROR(HLOOKUP(O42,Novembre!$D$3:$AH$9,MATCH(employe_ID,Novembre!$A$3:$A$9,0),0),\"\")","v":0},{"$f":"IFERROR(HLOOKUP(P42,Novembre!$D$3:$AH$9,MATCH(employe_ID,Novembre!$A$3:$A$9,0),0),\"\")","v":0},{"$f":"IFERROR(HLOOKUP(Q42,Novembre!$D$3:$AH$9,MATCH(employe_ID,Novembre!$A$3:$A$9,0),0),\"\")","v":0},null,{"$f":"IFERROR(HLOOKUP(S42,Décembre!$D$3:$AH$9,MATCH(employe_ID,Décembre!$A$3:$A$9,0),0),\"\")","v":0},{"$f":"IFERROR(HLOOKUP(T42,Décembre!$D$3:$AH$9,MATCH(employe_ID,Décembre!$A$3:$A$9,0),0),\"\")","v":0},{"$f":"IFERROR(HLOOKUP(U42,Décembre!$D$3:$AH$9,MATCH(employe_ID,Décembre!$A$3:$A$9,0),0),\"\")","v":0},{"$f":"IFERROR(HLOOKUP(V42,Décembre!$D$3:$AH$9,MATCH(employe_ID,Décembre!$A$3:$A$9,0),0),\"\")","v":0},{"$f":"IFERROR(HLOOKUP(W42,Décembre!$D$3:$AH$9,MATCH(employe_ID,Décembre!$A$3:$A$9,0),0),\"\")","v":0},{"$f":"IFERROR(HLOOKUP(X42,Décembre!$D$3:$AH$9,MATCH(employe_ID,Décembre!$A$3:$A$9,0),0),\"\")","v":0},{"$f":"IFERROR(HLOOKUP(Y42,Décembre!$D$3:$AH$9,MATCH(employe_ID,Décembre!$A$3:$A$9,0),0),\"\")","v":0}]
[null,null,{"$f":"IFERROR(HLOOKUP(C43,Octobre!$D$3:$AH$9,MATCH(employe_ID,Octobre!$A$3:$A$9,0),0),\"\")","v":0},{"$f":"IFERROR(HLOOKUP(D43,Octobre!$D$3:$AH$9,MATCH(employe_ID,Octobre!$A$3:$A$9,0),0),\"\")","v":0},{"$f":"IFERROR(HLOOKUP(E43,Octobre!$D$3:$AH$9,MATCH(employe_ID,Octobre!$A$3:$A$9,0),0),\"\")","v":0},{"$f":"IFERROR(HLOOKUP(F43,Octobre!$D$3:$AH$9,MATCH(employe_ID,Octobre!$A$3:$A$9,0),0),\"\")","v":0},{"$f":"IFERROR(HLOOKUP(G43,Octobre!$D$3:$AH$9,MATCH(employe_ID,Octobre!$A$3:$A$9,0),0),\"\")","v":0},{"$f":"IFERROR(HLOOKUP(H43,Octobre!$D$3:$AH$9,MATCH(employe_ID,Octobre!$A$3:$A$9,0),0),\"\")","v":0},{"$f":"IFERROR(HLOOKUP(I43,Octobre!$D$3:$AH$9,MATCH(employe_ID,Octobre!$A$3:$A$9,0),0),\"\")","v":0},null,{"$f":"IFERROR(HLOOKUP(K43,Novembre!$D$3:$AH$9,MATCH(employe_ID,Novembre!$A$3:$A$9,0),0),\"\")","v":0},{"$f":"IFERROR(HLOOKUP(L43,Novembre!$D$3:$AH$9,MATCH(employe_ID,Novembre!$A$3:$A$9,0),0),\"\")","v":0},{"$f":"IFERROR(HLOOKUP(M43,Novembre!$D$3:$AH$9,MATCH(employe_ID,Novembre!$A$3:$A$9,0),0),\"\")","v":0},{"$f":"IFERROR(HLOOKUP(N43,Novembre!$D$3:$AH$9,MATCH(employe_ID,Novembre!$A$3:$A$9,0),0),\"\")","v":0},{"$f":"IFERROR(HLOOKUP(O43,Novembre!$D$3:$AH$9,MATCH(employe_ID,Novembre!$A$3:$A$9,0),0),\"\")","v":0},{"$f":"IFERROR(HLOOKUP(P43,Novembre!$D$3:$AH$9,MATCH(employe_ID,Novembre!$A$3:$A$9,0),0),\"\")","v":0},{"$f":"IFERROR(HLOOKUP(Q43,Novembre!$D$3:$AH$9,MATCH(employe_ID,Novembre!$A$3:$A$9,0),0),\"\")","v":0},null,{"$f":"IFERROR(HLOOKUP(S43,Décembre!$D$3:$AH$9,MATCH(employe_ID,Décembre!$A$3:$A$9,0),0),\"\")","v":0},{"$f":"IFERROR(HLOOKUP(T43,Décembre!$D$3:$AH$9,MATCH(employe_ID,Décembre!$A$3:$A$9,0),0),\"\")","v":0},{"$f":"IFERROR(HLOOKUP(U43,Décembre!$D$3:$AH$9,MATCH(employe_ID,Décembre!$A$3:$A$9,0),0),\"\")","v":0},{"$f":"IFERROR(HLOOKUP(V43,Décembre!$D$3:$AH$9,MATCH(employe_ID,Décembre!$A$3:$A$9,0),0),\"\")","v":0},{"$f":"IFERROR(HLOOKUP(W43,Décembre!$D$3:$AH$9,MATCH(employe_ID,Décembre!$A$3:$A$9,0),0),\"\")","v":0},{"$f":"IFERROR(HLOOKUP(X43,Décembre!$D$3:$AH$9,MATCH(employe_ID,Décembre!$A$3:$A$9,0),0),\"\")","v":0},{"$f":"IFERROR(HLOOKUP(Y43,Décembre!$D$3:$AH$9,MATCH(employe_ID,Décembre!$A$3:$A$9,0),0),\"\")","v":0}]
[null,null,{"$f":"IFERROR(HLOOKUP(C44,Octobre!$D$3:$AH$9,MATCH(employe_ID,Octobre!$A$3:$A$9,0),0),\"\")","v":0},{"$f":"IFERROR(HLOOKUP(D44,Octobre!$D$3:$AH$9,MATCH(employe_ID,Octobre!$A$3:$A$9,0),0),\"\")","v":0},{"$f":"IFERROR(HLOOKUP(E44,Octobre!$D$3:$AH$9,MATCH(employe_ID,Octobre!$A$3:$A$9,0),0),\"\")","v":0},{"$f":"IFERROR(HLOOKUP(F44,Octobre!$D$3:$AH$9,MATCH(employe_ID,Octobre!$A$3:$A$9,0),0),\"\")","v":0},{"$f":"IFERROR(HLOOKUP(G44,Octobre!$D$3:$AH$9,MATCH(employe_ID,Octobre!$A$3:$A$9,0),0),\"\")","v":0},{"$f":"IFERROR(HLOOKUP(H44,Octobre!$D$3:$AH$9,MATCH(employe_ID,Octobre!$A$3:$A$9,0),0),\"\")","v":0},{"$f":"IFERROR(HLOOKUP(I44,Octobre!$D$3:$AH$9,MATCH(employe_ID,Octobre!$A$3:$A$9,0),0),\"\")","v":0},null,{"$f":"IFERROR(HLOOKUP(K44,Novembre!$D$3:$AH$9,MATCH(employe_ID,Novembre!$A$3:$A$9,0),0),\"\")","v":0},{"$f":"IFERROR(HLOOKUP(L44,Novembre!$D$3:$AH$9,MATCH(employe_ID,Novembre!$A$3:$A$9,0),0),\"\")","v":0},{"$f":"IFERROR(HLOOKUP(M44,Novembre!$D$3:$AH$9,MATCH(employe_ID,Novembre!$A$3:$A$9,0),0),\"\")","v":0},{"$f":"IFERROR(HLOOKUP(N44,Novembre!$D$3:$AH$9,MATCH(employe_ID,Novembre!$A$3:$A$9,0),0),\"\")","v":0},{"$f":"IFERROR(HLOOKUP(O44,Novembre!$D$3:$AH$9,MATCH(employe_ID,Novembre!$A$3:$A$9,0),0),\"\")","v":0},{"$f":"IFERROR(HLOOKUP(P44,Novembre!$D$3:$AH$9,MATCH(employe_ID,Novembre!$A$3:$A$9,0),0),\"\")","v":0},{"$f":"IFERROR(HLOOKUP(Q44,Novembre!$D$3:$AH$9,MATCH(employe_ID,Novembre!$A$3:$A$9,0),0),\"\")","v":0},null,{"$f":"IFERROR(HLOOKUP(S44,Décembre!$D$3:$AH$9,MATCH(employe_ID,Décembre!$A$3:$A$9,0),0),\"\")","v":0},{"$f":"IFERROR(HLOOKUP(T44,Décembre!$D$3:$AH$9,MATCH(employe_ID,Décembre!$A$3:$A$9,0),0),\"\")","v":0},{"$f":"IFERROR(HLOOKUP(U44,Décembre!$D$3:$AH$9,MATCH(employe_ID,Décembre!$A$3:$A$9,0),0),\"\")","v":0},{"$f":"IFERROR(HLOOKUP(V44,Décembre!$D$3:$AH$9,MATCH(employe_ID,Décembre!$A$3:$A$9,0),0),\"\")","v":0},{"$f":"IFERROR(HLOOKUP(W44,Décembre!$D$3:$AH$9,MATCH(employe_ID,Décembre!$A$3:$A$9,0),0),\"\")","v":0},{"$f":"IFERROR(HLOOKUP(X44,Décembre!$D$3:$AH$9,MATCH(employe_ID,Décembre!$A$3:$A$9,0),0),\"\")","v":0},{"$f":"IFERROR(HLOOKUP(Y44,Décembre!$D$3:$AH$9,MATCH(employe_ID,Décembre!$A$3:$A$9,0),0),\"\")","v":0}]
[null,null,{"$f":"IFERROR(HLOOKUP(C45,Octobre!$D$3:$AH$9,MATCH(employe_ID,Octobre!$A$3:$A$9,0),0),\"\")","v":0},{"$f":"IFERROR(HLOOKUP(D45,Octobre!$D$3:$AH$9,MATCH(employe_ID,Octobre!$A$3:$A$9,0),0),\"\")","v":0},{"$f":"IFERROR(HLOOKUP(E45,Octobre!$D$3:$AH$9,MATCH(employe_ID,Octobre!$A$3:$A$9,0),0),\"\")","v":0},{"$f":"IFERROR(HLOOKUP(F45,Octobre!$D$3:$AH$9,MATCH(employe_ID,Octobre!$A$3:$A$9,0),0),\"\")","v":0},{"$f":"IFERROR(HLOOKUP(G45,Octobre!$D$3:$AH$9,MATCH(employe_ID,Octobre!$A$3:$A$9,0),0),\"\")","v":0},{"$f":"IFERROR(HLOOKUP(H45,Octobre!$D$3:$AH$9,MATCH(employe_ID,Octobre!$A$3:$A$9,0),0),\"\")","v":0},{"$f":"IFERROR(HLOOKUP(I45,Octobre!$D$3:$AH$9,MATCH(employe_ID,Octobre!$A$3:$A$9,0),0),\"\")","v":""},null,{"$f":"IFERROR(HLOOKUP(K45,Novembre!$D$3:$AH$9,MATCH(employe_ID,Novembre!$A$3:$A$9,0),0),\"\")","v":0},{"$f":"IFERROR(HLOOKUP(L45,Novembre!$D$3:$AH$9,MATCH(employe_ID,Novembre!$A$3:$A$9,0),0),\"\")","v":0},{"$f":"IFERROR(HLOOKUP(M45,Novembre!$D$3:$AH$9,MATCH(employe_ID,Novembre!$A$3:$A$9,0),0),\"\")","v":0},{"$f":"IFERROR(HLOOKUP(N45,Novembre!$D$3:$AH$9,MATCH(employe_ID,Novembre!$A$3:$A$9,0),0),\"\")","v":0},{"$f":"IFERROR(HLOOKUP(O45,Novembre!$D$3:$AH$9,MATCH(employe_ID,Novembre!$A$3:$A$9,0),0),\"\")","v":0},{"$f":"IFERROR(HLOOKUP(P45,Novembre!$D$3:$AH$9,MATCH(employe_ID,Novembre!$A$3:$A$9,0),0),\"\")","v":0},{"$f":"IFERROR(HLOOKUP(Q45,Novembre!$D$3:$AH$9,MATCH(employe_ID,Novembre!$A$3:$A$9,0),0),\"\")","v":0},null,{"$f":"IFERROR(HLOOKUP(S45,Décembre!$D$3:$AH$9,MATCH(employe_ID,Décembre!$A$3:$A$9,0),0),\"\")","v":0},{"$f":"IFERROR(HLOOKUP(T45,Décembre!$D$3:$AH$9,MATCH(employe_ID,Décembre!$A$3:$A$9,0),0),\"\")","v":0},{"$f":"IFERROR(HLOOKUP(U45,Décembre!$D$3:$AH$9,MATCH(employe_ID,Décembre!$A$3:$A$9,0),0),\"\")","v":0},{"$f":"IFERROR(HLOOKUP(V45,Décembre!$D$3:$AH$9,MATCH(employe_ID,Décembre!$A$3:$A$9,0),0),\"\")","v":0},{"$f":"IFERROR(HLOOKUP(W45,Décembre!$D$3:$AH$9,MATCH(employe_ID,Décembre!$A$3:$A$9,0),0),\"\")","v":""},{"$f":"IFERROR(HLOOKUP(X45,Décembre!$D$3:$AH$9,MATCH(employe_ID,Décembre!$A$3:$A$9,0),0),\"\")","v":""},{"$f":"IFERROR(HLOOKUP(Y45,Décembre!$D$3:$AH$9,MATCH(employe_ID,Décembre!$A$3:$A$9,0),0),\"\")","v":""}]
[null,null,{"$f":"IFERROR(HLOOKUP(C46,Octobre!$D$3:$AH$9,MATCH(employe_ID,Octobre!$A$3:$A$9,0),0),\"\")","v":""},{"$f":"IFERROR(HLOOKUP(D46,Octobre!$D$3:$AH$9,MATCH(employe_ID,Octobre!$A$3:$A$9,0),0),\"\")","v":""},{"$f":"IFERROR(HLOOKUP(E46,Octobre!$D$3:$AH$9,MATCH(employe_ID,Octobre!$A$3:$A$9,0),0),\"\")","v":""},{"$f":"IFERROR(HLOOKUP(F46,Octobre!$D$3:$AH$9,MATCH(employe_ID,Octobre!$A$3:$A$9,0),0),\"\")","v":""},{"$f":"IFERROR(HLOOKUP(G46,Octobre!$D$3:$AH$9,MATCH(employe_ID,Octobre!$A$3:$A$9,0),0),\"\")","v":""},{"$f":"IFERROR(HLOOKUP(H46,Octobre!$D$3:$AH$9,MATCH(employe_ID,Octobre!$A$3:$A$9,0),0),\"\")","v":""},{"$f":"IFERROR(HLOOKUP(I46,Octobre!$D$3:$AH$9,MATCH(employe_ID,Octobre!$A$3:$A$9,0),0),\"\")","v":""},null,{"$f":"IFERROR(HLOOKUP(K46,Novembre!$D$3:$AH$9,MATCH(employe_ID,Novembre!$A$3:$A$9,0),0),\"\")","v":0},{"$f":"IFERROR(HLOOKUP(L46,Novembre!$D$3:$AH$9,MATCH(employe_ID,Novembre!$A$3:$A$9,0),0),\"\")","v":0},{"$f":"IFERROR(HLOOKUP(M46,Novembre!$D$3:$AH$9,MATCH(employe_ID,Novembre!$A$3:$A$9,0),0),\"\")","v":0},{"$f":"IFERROR(HLOOKUP(N46,Novembre!$D$3:$AH$9,MATCH(employe_ID,Novembre!$A$3:$A$9,0),0),\"\")","v":0},{"$f":"IFERROR(HLOOKUP(O46,Novembre!$D$3:$AH$9,MATCH(employe_ID,Novembre!$A$3:$A$9,0),0),\"\")","v":0},{"$f":"IFERROR(HLOOKUP(P46,Novembre!$D$3:$AH$9,MATCH(employe_ID,Novembre!$A$3:$A$9,0),0),\"\")","v":0},{"$f":"IFERROR(HLOOKUP(Q46,Novembre!$D$3:$AH$9,MATCH(employe_ID,Novembre!$A$3:$A$9,0),0),\"\")","v":0},null,{"$f":"IFERROR(HLOOKUP(S46,Décembre!$D$3:$AH$9,MATCH(employe_ID,Décembre!$A$3:$A$9,0),0),\"\")","v":""},{"$f":"IFERROR(HLOOKUP(T46,Décembre!$D$3:$AH$9,MATCH(employe_ID,Décembre!$A$3:$A$9,0),0),\"\")","v":""},{"$f":"IFERROR(HLOOKUP(U46,Décembre!$D$3:$AH$9,MATCH(employe_ID,Décembre!$A$3:$A$9,0),0),\"\")","v":""},{"$f":"IFERROR(HLOOKUP(V46,Décembre!$D$3:$AH$9,MATCH(employe_ID,Décembre!$A$3:$A$9,0),0),\"\")","v":""},{"$f":"IFERROR(HLOOKUP(W46,Décembre!$D$3:$AH$9,MATCH(employe_ID,Décembre!$A$3:$A$9,0),0),\"\")","v":""},{"$f":"IFERROR(HLOOKUP(X46,Décembre!$D$3:$AH$9,MATCH(employe_ID,Décembre!$A$3:$A$9,0),0),\"\")","v":""},{"$f":"IFERROR(HLOOKUP(Y46,Décembre!$D$3:$AH$9,MATCH(employe_ID,Décembre!$A$3:$A$9,0),0),\"\")","v":""}]

{"sheet":"Config","index":1,"n_rows":15,"n_cols":11,"rows_kept":15,"cut":false,"hidden":false,"merged":[]}
["Codes","Description"]
["VAC","Vacances",null,null,"Année",2015,null,null,null,"Les fêtes civiles","Dates"]
["RTT","RTT",null,null,null,null,null,null,null,"1er janvier : « Jour de l'an »",{"$f":"DATE(ref_annee,1,1)","v":"2015-01-01"}]
["ARM","Arrêt Maladie",null,null,null,null,null,null,null,"1er mai : Fête du Travail",{"$f":"DATE(ref_annee,5,1)","v":"2015-05-01"}]
[null,null,null,null,null,null,null,null,null,"8 mai : Fête de la Victoire ",{"$f":"DATE(ref_annee,5,8)","v":"2015-05-08"}]
[null,null,null,null,null,null,null,null,null,"14 juillet : Fête nationale française",{"$f":"DATE(ref_annee,7,14)","v":"2015-07-14"}]
[null,null,null,null,null,null,null,null,null,"11 novembre : Armistice - Première Guerre mondiale",{"$f":"DATE(ref_annee,11,11)","v":"2015-11-11"}]
[null,null,null,null,null,null,null,null,null,"Les fêtes religieuses"]
[null,null,null,null,null,null,null,null,null,"Dimanche de Pâques",{"$f":"ROUND(DATE(ref_annee,4,1)/7+MOD(19*MOD(ref_annee,19)-7,30)*14%,0)*7-6","v":"2015-04-05"}]
[null,null,null,null,null,null,null,null,null,"Date variable : Lundi de Pâques (1 jour après Pâques) ",{"$f":"K9+1","v":"2015-04-06"}]
[null,null,null,null,null,null,null,null,null,"Date variable : Jeudi de l'Ascension (39 jours après Pâques) ",{"$f":"K9+39","v":"2015-05-14"}]
[null,null,null,null,null,null,null,null,null,"Date variable : Lundi de Pentecôte (50 jours après Pâques) ",{"$f":"K9+50","v":"2015-05-25"}]
[null,null,null,null,null,null,null,null,null,"15 août : Assomption ",{"$f":"DATE(ref_annee,8,15)","v":"2015-08-15"}]
[null,null,null,null,null,null,null,null,null,"1er novembre : la Toussaint.",{"$f":"DATE(ref_annee,11,1)","v":"2015-11-01"}]
[null,null,null,null,null,null,null,null,null,"25 décembre : Noël.",{"$f":"DATE(ref_annee,12,25)","v":"2015-12-25"}]

{"sheet":"Employés","index":2,"n_rows":7,"n_cols":13,"rows_kept":7,"cut":false,"hidden":false,"merged":[]}
["# Employé","Nom","Prénom","VAC_Acc","RTT_Acc","ARM_Acc","e-Mail","CP_Pris","RTT_Pris","AM_Pris","CP_Restant","RTT_Restant","AM_Restant"]
["ABC123","Dupont","Untel",25,5,3,"abc123@monentreprise.com"]
["ABC456","Durand","Pierre",25,6,4,null,{"$f":"COUNTIF(Janvier!D5:AH5,Config!$A$2)+COUNTIF(Février!D5:AH5,Config!$A$2)+COUNTIF(Mars!D5:AH5,Config!$A$2)+COUNTIF(Avril!D5:AH5,Config!$A$2)+COUNTIF(Mai!D5:AH5,Config!$A$2)+COUNTIF(Juin!D5:AH5,Config!$A$2)+COUNTIF(Juillet!D5:AH5,Config!$A$2)+COUNTIF(Août!D5:AH5,Config!$A$2)+COUNTIF(Septembre!D5:AH5,Config!$A$2)+COUNTIF(Octobre!D5:AH5,Config!$A$2)+COUNTIF(Novembre!D5:AH5,Config!$A$2)+COUNTIF(Décembre!D5:AH5,Config!$A$2)","v":2},{"$f":"COUNTIF(Janvier!E5:AI5,Config!$A$3)+COUNTIF(Février!E5:AI5,Config!$A$3)+COUNTIF(Mars!E5:AI5,Config!$A$3)+COUNTIF(Avril!E5:AI5,Config!$A$3)+COUNTIF(Mai!E5:AI5,Config!$A$3)+COUNTIF(Juin!E5:AI5,Config!$A$3)+COUNTIF(Juillet!E5:AI5,Config!$A$3)+COUNTIF(Août!E5:AI5,Config!$A$3)+COUNTIF(Septembre!E5:AI5,Config!$A$3)+COUNTIF(Octobre!E5:AI5,Config!$A$3)+COUNTIF(Novembre!E5:AI5,Config!$A$3)+COUNTIF(Décembre!E5:AI5,Config!$A$3)","v":3},{"$f":"COUNTIF(Janvier!F5:AJ5,Config!$A$4)+COUNTIF(Février!F5:AJ5,Config!$A$4)+COUNTIF(Mars!F5:AJ5,Config!$A$4)+COUNTIF(Avril!F5:AJ5,Config!$A$4)+COUNTIF(Mai!F5:AJ5,Config!$A$4)+COUNTIF(Juin!F5:AJ5,Config!$A$4)+COUNTIF(Juillet!F5:AJ5,Config!$A$4)+COUNTIF(Août!F5:AJ5,Config!$A$4)+COUNTIF(Septembre!F5:AJ5,Config!$A$4)+COUNTIF(Octobre!F5:AJ5,Config!$A$4)+COUNTIF(Novembre!F5:AJ5,Config!$A$4)+COUNTIF(Décembre!F5:AJ5,Config!$A$4)","v":2},{"$f":"Employés!$D3-Employés!$H3","v":23},{"$f":"Employés!$E3-Employés!$I3","v":3},{"$f":"Employés!$F3-Employés!$J3","v":2}]
[null,null,null,null,null,null,null,{"$f":"COUNTIF(Janvier!D6:AH6,Config!$A$2)+COUNTIF(Février!D6:AH6,Config!$A$2)+COUNTIF(Mars!D6:AH6,Config!$A$2)+COUNTIF(Avril!D6:AH6,Config!$A$2)+COUNTIF(Mai!D6:AH6,Config!$A$2)+COUNTIF(Juin!D6:AH6,Config!$A$2)+COUNTIF(Juillet!D6:AH6,Config!$A$2)+COUNTIF(Août!D6:AH6,Config!$A$2)+COUNTIF(Septembre!D6:AH6,Config!$A$2)+COUNTIF(Octobre!D6:AH6,Config!$A$2)+COUNTIF(Novembre!D6:AH6,Config!$A$2)+COUNTIF(Décembre!D6:AH6,Config!$A$2)","v":0},{"$f":"COUNTIF(Janvier!E6:AI6,Config!$A$3)+COUNTIF(Février!E6:AI6,Config!$A$3)+COUNTIF(Mars!E6:AI6,Config!$A$3)+COUNTIF(Avril!E6:AI6,Config!$A$3)+COUNTIF(Mai!E6:AI6,Config!$A$3)+COUNTIF(Juin!E6:AI6,Config!$A$3)+COUNTIF(Juillet!E6:AI6,Config!$A$3)+COUNTIF(Août!E6:AI6,Config!$A$3)+COUNTIF(Septembre!E6:AI6,Config!$A$3)+COUNTIF(Octobre!E6:AI6,Config!$A$3)+COUNTIF(Novembre!E6:AI6,Config!$A$3)+COUNTIF(Décembre!E6:AI6,Config!$A$3)","v":0},{"$f":"COUNTIF(Janvier!F6:AJ6,Config!$A$4)+COUNTIF(Février!F6:AJ6,Config!$A$4)+COUNTIF(Mars!F6:AJ6,Config!$A$4)+COUNTIF(Avril!F6:AJ6,Config!$A$4)+COUNTIF(Mai!F6:AJ6,Config!$A$4)+COUNTIF(Juin!F6:AJ6,Config!$A$4)+COUNTIF(Juillet!F6:AJ6,Config!$A$4)+COUNTIF(Août!F6:AJ6,Config!$A$4)+COUNTIF(Septembre!F6:AJ6,Config!$A$4)+COUNTIF(Octobre!F6:AJ6,Config!$A$4)+COUNTIF(Novembre!F6:AJ6,Config!$A$4)+COUNTIF(Décembre!F6:AJ6,Config!$A$4)","v":0},{"$f":"Employés!$D4-Employés!$H4","v":0},{"$f":"Employés!$E4-Employés!$I4","v":0},{"$f":"Employés!$F4-Employés!$J4","v":0}]
[null,null,null,null,null,null,null,{"$f":"COUNTIF(Janvier!D7:AH7,Config!$A$2)+COUNTIF(Février!D7:AH7,Config!$A$2)+COUNTIF(Mars!D7:AH7,Config!$A$2)+COUNTIF(Avril!D7:AH7,Config!$A$2)+COUNTIF(Mai!D7:AH7,Config!$A$2)+COUNTIF(Juin!D7:AH7,Config!$A$2)+COUNTIF(Juillet!D7:AH7,Config!$A$2)+COUNTIF(Août!D7:AH7,Config!$A$2)+COUNTIF(Septembre!D7:AH7,Config!$A$2)+COUNTIF(Octobre!D7:AH7,Config!$A$2)+COUNTIF(Novembre!D7:AH7,Config!$A$2)+COUNTIF(Décembre!D7:AH7,Config!$A$2)","v":0},{"$f":"COUNTIF(Janvier!E7:AI7,Config!$A$3)+COUNTIF(Février!E7:AI7,Config!$A$3)+COUNTIF(Mars!E7:AI7,Config!$A$3)+COUNTIF(Avril!E7:AI7,Config!$A$3)+COUNTIF(Mai!E7:AI7,Config!$A$3)+COUNTIF(Juin!E7:AI7,Config!$A$3)+COUNTIF(Juillet!E7:AI7,Config!$A$3)+COUNTIF(Août!E7:AI7,Config!$A$3)+COUNTIF(Septembre!E7:AI7,Config!$A$3)+COUNTIF(Octobre!E7:AI7,Config!$A$3)+COUNTIF(Novembre!E7:AI7,Config!$A$3)+COUNTIF(Décembre!E7:AI7,Config!$A$3)","v":0},{"$f":"COUNTIF(Janvier!F7:AJ7,Config!$A$4)+COUNTIF(Février!F7:AJ7,Config!$A$4)+COUNTIF(Mars!F7:AJ7,Config!$A$4)+COUNTIF(Avril!F7:AJ7,Config!$A$4)+COUNTIF(Mai!F7:AJ7,Config!$A$4)+COUNTIF(Juin!F7:AJ7,Config!$A$4)+COUNTIF(Juillet!F7:AJ7,Config!$A$4)+COUNTIF(Août!F7:AJ7,Config!$A$4)+COUNTIF(Septembre!F7:AJ7,Config!$A$4)+COUNTIF(Octobre!F7:AJ7,Config!$A$4)+COUNTIF(Novembre!F7:AJ7,Config!$A$4)+COUNTIF(Décembre!F7:AJ7,Config!$A$4)","v":0},{"$f":"Employés!$D5-Employés!$H5","v":0},{"$f":"Employés!$E5-Employés!$I5","v":0},{"$f":"Employés!$F5-Employés!$J5","v":0}]
[null,null,null,null,null,null,null,{"$f":"COUNTIF(Janvier!D8:AH8,Config!$A$2)+COUNTIF(Février!D8:AH8,Config!$A$2)+COUNTIF(Mars!D8:AH8,Config!$A$2)+COUNTIF(Avril!D8:AH8,Config!$A$2)+COUNTIF(Mai!D8:AH8,Config!$A$2)+COUNTIF(Juin!D8:AH8,Config!$A$2)+COUNTIF(Juillet!D8:AH8,Config!$A$2)+COUNTIF(Août!D8:AH8,Config!$A$2)+COUNTIF(Septembre!D8:AH8,Config!$A$2)+COUNTIF(Octobre!D8:AH8,Config!$A$2)+COUNTIF(Novembre!D8:AH8,Config!$A$2)+COUNTIF(Décembre!D8:AH8,Config!$A$2)","v":0},{"$f":"COUNTIF(Janvier!E8:AI8,Config!$A$3)+COUNTIF(Février!E8:AI8,Config!$A$3)+COUNTIF(Mars!E8:AI8,Config!$A$3)+COUNTIF(Avril!E8:AI8,Config!$A$3)+COUNTIF(Mai!E8:AI8,Config!$A$3)+COUNTIF(Juin!E8:AI8,Config!$A$3)+COUNTIF(Juillet!E8:AI8,Config!$A$3)+COUNTIF(Août!E8:AI8,Config!$A$3)+COUNTIF(Septembre!E8:AI8,Config!$A$3)+COUNTIF(Octobre!E8:AI8,Config!$A$3)+COUNTIF(Novembre!E8:AI8,Config!$A$3)+COUNTIF(Décembre!E8:AI8,Config!$A$3)","v":0},{"$f":"COUNTIF(Janvier!F8:AJ8,Config!$A$4)+COUNTIF(Février!F8:AJ8,Config!$A$4)+COUNTIF(Mars!F8:AJ8,Config!$A$4)+COUNTIF(Avril!F8:AJ8,Config!$A$4)+COUNTIF(Mai!F8:AJ8,Config!$A$4)+COUNTIF(Juin!F8:AJ8,Config!$A$4)+COUNTIF(Juillet!F8:AJ8,Config!$A$4)+COUNTIF(Août!F8:AJ8,Config!$A$4)+COUNTIF(Septembre!F8:AJ8,Config!$A$4)+COUNTIF(Octobre!F8:AJ8,Config!$A$4)+COUNTIF(Novembre!F8:AJ8,Config!$A$4)+COUNTIF(Décembre!F8:AJ8,Config!$A$4)","v":0},{"$f":"Employés!$D6-Employés!$H6","v":0},{"$f":"Employés!$E6-Employés!$I6","v":0},{"$f":"Employés!$F6-Employés!$J6","v":0}]
[null,null,null,null,null,null,null,{"$f":"COUNTIF(Janvier!D9:AH9,Config!$A$2)+COUNTIF(Février!D9:AH9,Config!$A$2)+COUNTIF(Mars!D9:AH9,Config!$A$2)+COUNTIF(Avril!D9:AH9,Config!$A$2)+COUNTIF(Mai!D9:AH9,Config!$A$2)+COUNTIF(Juin!D9:AH9,Config!$A$2)+COUNTIF(Juillet!D9:AH9,Config!$A$2)+COUNTIF(Août!D9:AH9,Config!$A$2)+COUNTIF(Septembre!D9:AH9,Config!$A$2)+COUNTIF(Octobre!D9:AH9,Config!$A$2)+COUNTIF(Novembre!D9:AH9,Config!$A$2)+COUNTIF(Décembre!D9:AH9,Config!$A$2)","v":0},{"$f":"COUNTIF(Janvier!E9:AI9,Config!$A$3)+COUNTIF(Février!E9:AI9,Config!$A$3)+COUNTIF(Mars!E9:AI9,Config!$A$3)+COUNTIF(Avril!E9:AI9,Config!$A$3)+COUNTIF(Mai!E9:AI9,Config!$A$3)+COUNTIF(Juin!E9:AI9,Config!$A$3)+COUNTIF(Juillet!E9:AI9,Config!$A$3)+COUNTIF(Août!E9:AI9,Config!$A$3)+COUNTIF(Septembre!E9:AI9,Config!$A$3)+COUNTIF(Octobre!E9:AI9,Config!$A$3)+COUNTIF(Novembre!E9:AI9,Config!$A$3)+COUNTIF(Décembre!E9:AI9,Config!$A$3)","v":0},{"$f":"COUNTIF(Janvier!F9:AJ9,Config!$A$4)+COUNTIF(Février!F9:AJ9,Config!$A$4)+COUNTIF(Mars!F9:AJ9,Config!$A$4)+COUNTIF(Avril!F9:AJ9,Config!$A$4)+COUNTIF(Mai!F9:AJ9,Config!$A$4)+COUNTIF(Juin!F9:AJ9,Config!$A$4)+COUNTIF(Juillet!F9:AJ9,Config!$A$4)+COUNTIF(Août!F9:AJ9,Config!$A$4)+COUNTIF(Septembre!F9:AJ9,Config!$A$4)+COUNTIF(Octobre!F9:AJ9,Config!$A$4)+COUNTIF(Novembre!F9:AJ9,Config!$A$4)+COUNTIF(Décembre!F9:AJ9,Config!$A$4)","v":0},{"$f":"Employés!$D7-Employés!$H7","v":0},{"$f":"Employés!$E7-Employés!$I7","v":0},{"$f":"Employés!$F7-Employés!$J7","v":0}]

{"sheet":"Janvier","index":3,"n_rows":9,"n_cols":34,"rows_kept":9,"cut":false,"hidden":false,"merged":[]}
[]
[null,null,null,{"$f":"IF(D3<>\"\",D3,\"\")","v":"2015-01-01"},"2015-01-02","2015-01-03","2015-01-04","2015-01-05","2015-01-06","2015-01-07","2015-01-08","2015-01-09","2015-01-10","2015-01-11","2015-01-12","2015-01-13","2015-01-14","2015-01-15","2015-01-16","2015-01-17","2015-01-18","2015-01-19","2015-01-20","2015-01-21","2015-01-22","2015-01-23","2015-01-24","2015-01-25","2015-01-26","2015-01-27","2015-01-28","2015-01-29","2015-01-30","2015-01-31"]
["# Employé","Nom","Prénom",{"$f":"EDATE(DATE(ref_annee,1,1),0)","v":"2015-01-01"},{"$f":"D3+1","v":"2015-01-02"},{"$f":"E3+1","v":"2015-01-03"},"2015-01-04","2015-01-05","2015-01-06","2015-01-07","2015-01-08","2015-01-09","2015-01-10","2015-01-11","2015-01-12","2015-01-13","2015-01-14",{"$f":"Q3+1","v":"2015-01-15"},"2015-01-16","2015-01-17","2015-01-18","2015-01-19","2015-01-20","2015-01-21","2015-01-22","2015-01-23","2015-01-24","2015-01-25",{"$f":"AB3+1","v":"2015-01-26"},"2015-01-27",{"$f":"IF(AD3<EOMONTH(AD3,0),AD3+1,\"\")","v":"2015-01-28"},{"$f":"IF(AE3<EOMONTH(AE3,0),AE3+1,\"\")","v":"2015-01-29"},{"$f":"IF(AF3<EOMONTH(AF3,0),AF3+1,\"\")","v":"2015-01-30"},{"$f":"IF(AG3<EOMONTH(AG3,0),AG3+1,\"\")","v":"2015-01-31"}]
[{"$f":"IF(Employés!A2<>\"\",Employés!A2,\"\")","v":"ABC123"},{"$f":"IF(Employés!B2<>\"\",Employés!B2,\"\")","v":"Dupont"},{"$f":"IF(Employés!C2<>\"\",Employés!C2,\"\")","v":"Untel"},"RTT","RTT",null,null,null,"VAC",null,null,"ARM"]
[{"$f":"IF(Employés!A3<>\"\",Employés!A3,\"\")","v":"ABC456"},{"$f":"IF(Employés!B3<>\"\",Employés!B3,\"\")","v":"Durand"},{"$f":"IF(Employés!C3<>\"\",Employés!C3,\"\")","v":"Pierre"},null,"VAC",null,null,"RTT","RTT","ARM"]
[{"$f":"IF(Employés!A4<>\"\",Employés!A4,\"\")","v":""},{"$f":"IF(Employés!B4<>\"\",Employés!B4,\"\")","v":""},{"$f":"IF(Employés!C4<>\"\",Employés!C4,\"\")","v":""}]
[{"$f":"IF(Employés!A5<>\"\",Employés!A5,\"\")","v":""},{"$f":"IF(Employés!B5<>\"\",Employés!B5,\"\")","v":""},{"$f":"IF(Employés!C5<>\"\",Employés!C5,\"\")","v":""}]
[{"$f":"IF(Employés!A6<>\"\",Employés!A6,\"\")","v":""},{"$f":"IF(Employés!B6<>\"\",Employés!B6,\"\")","v":""},{"$f":"IF(Employés!C6<>\"\",Employés!C6,\"\")","v":""}]
[{"$f":"IF(Employés!A7<>\"\",Employés!A7,\"\")","v":""},{"$f":"IF(Employés!B7<>\"\",Employés!B7,\"\")","v":""},{"$f":"IF(Employés!C7<>\"\",Employés!C7,\"\")","v":""}]

{"sheet":"Février","index":4,"n_rows":9,"n_cols":32,"rows_kept":9,"cut":false,"hidden":false,"merged":[]}
[]
[null,null,null,{"$f":"IF(D3<>\"\",D3,\"\")","v":"2015-02-01"},{"$f":"IF(E3<>\"\",E3,\"\")","v":"2015-02-02"},"2015-02-03","2015-02-04","2015-02-05","2015-02-06","2015-02-07","2015-02-08","2015-02-09","2015-02-10","2015-02-11","2015-02-12","2015-02-13","2015-02-14","2015-02-15","2015-02-16","2015-02-17","2015-02-18","2015-02-19","2015-02-20","2015-02-21","2015-02-22","2015-02-23","2015-02-24","2015-02-25","2015-02-26","2015-02-27","2015-02-28",""]
["# Employé","Nom","Prénom",{"$f":"EDATE(DATE(ref_annee,1,1),1)","v":"2015-02-01"},{"$f":"D3+1","v":"2015-02-02"},{"$f":"E3+1","v":"2015-02-03"},"2015-02-04","2015-02-05","2015-02-06","2015-02-07","2015-02-08","2015-02-09","2015-02-10","2015-02-11","2015-02-12","2015-02-13","2015-02-14",{"$f":"Q3+1","v":"2015-02-15"},"2015-02-16",{"$f":"S3+1","v":"2015-02-17"},"2015-02-18","2015-02-19","2015-02-20","2015-02-21","2015-02-22","2015-02-23","2015-02-24","2015-02-25",{"$f":"AB3+1","v":"2015-02-26"},"2015-02-27",{"$f":"IF(AD3<EOMONTH(AD3,0),AD3+1,\"\")","v":"2015-02-28"},{"$f":"IF(AE3<EOMONTH(AE3,0),AE3+1,\"\")","v":""}]
[{"$f":"IF(Employés!A2<>\"\",Employés!A2,\"\")","v":"ABC123"},{"$f":"IF(Employés!B2<>\"\",Employés!B2,\"\")","v":"Dupont"},{"$f":"IF(Employés!C2<>\"\",Employés!C2,\"\")","v":"Untel"},null,null,null,null,"RTT"]
[{"$f":"IF(Employés!A3<>\"\",Employés!A3,\"\")","v":"ABC456"},{"$f":"IF(Employés!B3<>\"\",Employés!B3,\"\")","v":"Durand"},{"$f":"IF(Employés!C3<>\"\",Employés!C3,\"\")","v":"Pierre"},null,"VAC",null,"ARM",null,"RTT"]
[{"$f":"IF(Employés!A4<>\"\",Employés!A4,\"\")","v":""},{"$f":"IF(Employés!B4<>\"\",Employés!B4,\"\")","v":""},{"$f":"IF(Employés!C4<>\"\",Employés!C4,\"\")","v":""}]
[{"$f":"IF(Employés!A5<>\"\",Employés!A5,\"\")","v":""},{"$f":"IF(Employés!B5<>\"\",Employés!B5,\"\")","v":""},{"$f":"IF(Employés!C5<>\"\",Employés!C5,\"\")","v":""}]
[{"$f":"IF(Employés!A6<>\"\",Employés!A6,\"\")","v":""},{"$f":"IF(Employés!B6<>\"\",Employés!B6,\"\")","v":""},{"$f":"IF(Employés!C6<>\"\",Employés!C6,\"\")","v":""}]
[{"$f":"IF(Employés!A7<>\"\",Employés!A7,\"\")","v":""},{"$f":"IF(Employés!B7<>\"\",Employés!B7,\"\")","v":""},{"$f":"IF(Employés!C7<>\"\",Employés!C7,\"\")","v":""}]

{"sheet":"Mars","index":5,"n_rows":9,"n_cols":34,"rows_kept":9,"cut":false,"hidden":false,"merged":[]}
[]
[null,null,null,{"$f":"IF(D3<>\"\",D3,\"\")","v":"2015-03-01"},{"$f":"IF(E3<>\"\",E3,\"\")","v":"2015-03-02"},"2015-03-03","2015-03-04","2015-03-05","2015-03-06","2015-03-07","2015-03-08","2015-03-09","2015-03-10","2015-03-11","2015-03-12","2015-03-13","2015-03-14","2015-03-15","2015-03-16","2015-03-17","2015-03-18","2015-03-19","2015-03-20","2015-03-21","2015-03-22","2015-03-23","2015-03-24","2015-03-25","2015-03-26","2015-03-27","2015-03-28","2015-03-29","2015-03-30","2015-03-31"]
["# Employé","Nom","Prénom",{"$f":"EDATE(DATE(ref_annee,1,1),2)","v":"2015-03-01"},{"$f":"D3+1","v":"2015-03-02"},{"$f":"E3+1","v":"2015-03-03"},"2015-03-04","2015-03-05","2015-03-06","2015-03-07","2015-03-08","2015-03-09","2015-03-10","2015-03-11","2015-03-12","2015-03-13","2015-03-14",{"$f":"Q3+1","v":"2015-03-15"},"2015-03-16","2015-03-17","2015-03-18","2015-03-19","2015-03-20","2015-03-21","2015-03-22","2015-03-23","2015-03-24","2015-03-25",{"$f":"AB3+1","v":"2015-03-26"},"2015-03-27",{"$f":"IF(AD3<EOMONTH(AD3,0),AD3+1,\"\")","v":"2015-03-28"},{"$f":"IF(AE3<EOMONTH(AE3,0),AE3+1,\"\")","v":"2015-03-29"},{"$f":"IF(AF3<EOMONTH(AF3,0),AF3+1,\"\")","v":"2015-03-30"},{"$f":"IF(AG3<EOMONTH(AG3,0),AG3+1,\"\")","v":"2015-03-31"}]
[{"$f":"IF(Employés!A2<>\"\",Employés!A2,\"\")","v":"ABC123"},{"$f":"IF(Employés!B2<>\"\",Employés!B2,\"\")","v":"Dupont"},{"$f":"IF(Employés!C2<>\"\",Employés!C2,\"\")","v":"Untel"}]
[{"$f":"IF(Employés!A3<>\"\",Employés!A3,\"\")","v":"ABC456"},{"$f":"IF(Employés!B3<>\"\",Employés!B3,\"\")","v":"Durand"},{"$f":"IF(Employés!C3<>\"\",Employés!C3,\"\")","v":"Pierre"}]
[{"$f":"IF(Employés!A4<>\"\",Employés!A4,\"\")","v":""},{"$f":"IF(Employés!B4<>\"\",Employés!B4,\"\")","v":""},{"$f":"IF(Employés!C4<>\"\",Employés!C4,\"\")","v":""}]
[{"$f":"IF(Employés!A5<>\"\",Employés!A5,\"\")","v":""},{"$f":"IF(Employés!B5<>\"\",Employés!B5,\"\")","v":""},{"$f":"IF(Employés!C5<>\"\",Employés!C5,\"\")","v":""}]
[{"$f":"IF(Employés!A6<>\"\",Employés!A6,\"\")","v":""},{"$f":"IF(Employés!B6<>\"\",Employés!B6,\"\")","v":""},{"$f":"IF(Employés!C6<>\"\",Employés!C6,\"\")","v":""}]
[{"$f":"IF(Employés!A7<>\"\",Employés!A7,\"\")","v":""},{"$f":"IF(Employés!B7<>\"\",Employés!B7,\"\")","v":""},{"$f":"IF(Employés!C7<>\"\",Employés!C7,\"\")","v":""}]

{"sheet":"Avril","index":6,"n_rows":9,"n_cols":34,"rows_kept":9,"cut":false,"hidden":false,"merged":[]}
[]
[null,null,null,{"$f":"IF(D3<>\"\",D3,\"\")","v":"2015-04-01"},{"$f":"IF(E3<>\"\",E3,\"\")","v":"2015-04-02"},"2015-04-03","2015-04-04","2015-04-05","2015-04-06","2015-04-07","2015-04-08","2015-04-09","2015-04-10","2015-04-11","2015-04-12","2015-04-13","2015-04-14","2015-04-15","2015-04-16","2015-04-17","2015-04-18","2015-04-19","2015-04-20","2015-04-21","2015-04-22","2015-04-23","2015-04-24","2015-04-25","2015-04-26","2015-04-27","2015-04-28","2015-04-29","2015-04-30",""]
["# Employé","Nom","Prénom",{"$f":"EDATE(DATE(ref_annee,1,1),3)","v":"2015-04-01"},{"$f":"D3+1","v":"2015-04-02"},{"$f":"E3+1","v":"2015-04-03"},"2015-04-04","2015-04-05","2015-04-06","2015-04-07","2015-04-08","2015-04-09","2015-04-10","2015-04-11","2015-04-12","2015-04-13","2015-04-14",{"$f":"Q3+1","v":"2015-04-15"},"2015-04-16","2015-04-17","2015-04-18","2015-04-19","2015-04-20","2015-04-21","2015-04-22","2015-04-23","2015-04-24","2015-04-25",{"$f":"AB3+1","v":"2015-04-26"},"2015-04-27",{"$f":"IF(AD3<EOMONTH(AD3,0),AD3+1,\"\")","v":"2015-04-28"},{"$f":"IF(AE3<EOMONTH(AE3,0),AE3+1,\"\")","v":"2015-04-29"},{"$f":"IF(AF3<EOMONTH(AF3,0),AF3+1,\"\")","v":"2015-04-30"},{"$f":"IF(AG3<EOMONTH(AG3,0),AG3+1,\"\")","v":""}]
[{"$f":"IF(Employés!A2<>\"\",Employés!A2,\"\")","v":"ABC123"},{"$f":"IF(Employés!B2<>\"\",Employés!B2,\"\")","v":"Dupont"},{"$f":"IF(Employés!C2<>\"\",Employés!C2,\"\")","v":"Untel"}]
[{"$f":"IF(Employés!A3<>\"\",Employés!A3,\"\")","v":"ABC456"},{"$f":"IF(Employés!B3<>\"\",Employés!B3,\"\")","v":"Durand"},{"$f":"IF(Employés!C3<>\"\",Employés!C3,\"\")","v":"Pierre"}]
[{"$f":"IF(Employés!A4<>\"\",Employés!A4,\"\")","v":""},{"$f":"IF(Employés!B4<>\"\",Employés!B4,\"\")","v":""},{"$f":"IF(Employés!C4<>\"\",Employés!C4,\"\")","v":""}]
[{"$f":"IF(Employés!A5<>\"\",Employés!A5,\"\")","v":""},{"$f":"IF(Employés!B5<>\"\",Employés!B5,\"\")","v":""},{"$f":"IF(Employés!C5<>\"\",Employés!C5,\"\")","v":""}]
[{"$f":"IF(Employés!A6<>\"\",Employés!A6,\"\")","v":""},{"$f":"IF(Employés!B6<>\"\",Employés!B6,\"\")","v":""},{"$f":"IF(Employés!C6<>\"\",Employés!C6,\"\")","v":""}]
[{"$f":"IF(Employés!A7<>\"\",Employés!A7,\"\")","v":""},{"$f":"IF(Employés!B7<>\"\",Employés!B7,\"\")","v":""},{"$f":"IF(Employés!C7<>\"\",Employés!C7,\"\")","v":""}]

{"sheet":"Mai","index":7,"n_rows":9,"n_cols":34,"rows_kept":9,"cut":false,"hidden":false,"merged":[]}
[]
[null,null,null,{"$f":"IF(D3<>\"\",D3,\"\")","v":"2015-05-01"},{"$f":"IF(E3<>\"\",E3,\"\")","v":"2015-05-02"},"2015-05-03","2015-05-04","2015-05-05","2015-05-06","2015-05-07","2015-05-08","2015-05-09","2015-05-10","2015-05-11","2015-05-12","2015-05-13","2015-05-14","2015-05-15","2015-05-16","2015-05-17","2015-05-18","2015-05-19","2015-05-20","2015-05-21","2015-05-22","2015-05-23","2015-05-24","2015-05-25","2015-05-26","2015-05-27","2015-05-28","2015-05-29","2015-05-30","2015-05-31"]
["# Employé","Nom","Prénom",{"$f":"EDATE(DATE(ref_annee,1,1),4)","v":"2015-05-01"},{"$f":"D3+1","v":"2015-05-02"},{"$f":"E3+1","v":"2015-05-03"},"2015-05-04","2015-05-05","2015-05-06","2015-05-07","2015-05-08","2015-05-09","2015-05-10","2015-05-11","2015-05-12","2015-05-13","2015-05-14",{"$f":"Q3+1","v":"2015-05-15"},"2015-05-16","2015-05-17","2015-05-18","2015-05-19","2015-05-20","2015-05-21","2015-05-22","2015-05-23","2015-05-24","2015-05-25",{"$f":"AB3+1","v":"2015-05-26"},"2015-05-27",{"$f":"IF(AD3<EOMONTH(AD3,0),AD3+1,\"\")","v":"2015-05-28"},{"$f":"IF(AE3<EOMONTH(AE3,0),AE3+1,\"\")","v":"2015-05-29"},{"$f":"IF(AF3<EOMONTH(AF3,0),AF3+1,\"\")","v":"2015-05-30"},{"$f":"IF(AG3<EOMONTH(AG3,0),AG3+1,\"\")","v":"2015-05-31"}]
[{"$f":"IF(Employés!A2<>\"\",Employés!A2,\"\")","v":"ABC123"},{"$f":"IF(Employés!B2<>\"\",Employés!B2,\"\")","v":"Dupont"},{"$f":"IF(Employés!C2<>\"\",Employés!C2,\"\")","v":"Untel"}]
[{"$f":"IF(Employés!A3<>\"\",Employés!A3,\"\")","v":"ABC456"},{"$f":"IF(Employés!B3<>\"\",Employés!B3,\"\")","v":"Durand"},{"$f":"IF(Employés!C3<>\"\",Employés!C3,\"\")","v":"Pierre"}]
[{"$f":"IF(Employés!A4<>\"\",Employés!A4,\"\")","v":""},{"$f":"IF(Employés!B4<>\"\",Employés!B4,\"\")","v":""},{"$f":"IF(Employés!C4<>\"\",Employés!C4,\"\")","v":""}]
[{"$f":"IF(Employés!A5<>\"\",Employés!A5,\"\")","v":""},{"$f":"IF(Employés!B5<>\"\",Employés!B5,\"\")","v":""},{"$f":"IF(Employés!C5<>\"\",Employés!C5,\"\")","v":""}]
[{"$f":"IF(Employés!A6<>\"\",Employés!A6,\"\")","v":""},{"$f":"IF(Employés!B6<>\"\",Employés!B6,\"\")","v":""},{"$f":"IF(Employés!C6<>\"\",Employés!C6,\"\")","v":""}]
[{"$f":"IF(Employés!A7<>\"\",Employés!A7,\"\")","v":""},{"$f":"IF(Employés!B7<>\"\",Employés!B7,\"\")","v":""},{"$f":"IF(Employés!C7<>\"\",Employés!C7,\"\")","v":""}]

{"sheet":"Juin","index":8,"n_rows":9,"n_cols":34,"rows_kept":9,"cut":false,"hidden":false,"merged":[]}
[]
[null,null,null,{"$f":"IF(D3<>\"\",D3,\"\")","v":"2015-06-01"},{"$f":"IF(E3<>\"\",E3,\"\")","v":"2015-06-02"},"2015-06-03","2015-06-04","2015-06-05","2015-06-06","2015-06-07","2015-06-08","2015-06-09","2015-06-10","2015-06-11","2015-06-12","2015-06-13","2015-06-14","2015-06-15","2015-06-16","2015-06-17","2015-06-18","2015-06-19","2015-06-20","2015-06-21","2015-06-22","2015-06-23","2015-06-24","2015-06-25","2015-06-26","2015-06-27","2015-06-28","2015-06-29","2015-06-30",""]
["# Employé","Nom","Prénom",{"$f":"EDATE(DATE(ref_annee,1,1),5)","v":"2015-06-01"},{"$f":"D3+1","v":"2015-06-02"},{"$f":"E3+1","v":"2015-06-03"},"2015-06-04","2015-06-05","2015-06-06","2015-06-07","2015-06-08","2015-06-09","2015-06-10","2015-06-11","2015-06-12","2015-06-13","2015-06-14",{"$f":"Q3+1","v":"2015-06-15"},"2015-06-16","2015-06-17","2015-06-18","2015-06-19","2015-06-20","2015-06-21","2015-06-22","2015-06-23","2015-06-24","2015-06-25",{"$f":"AB3+1","v":"2015-06-26"},"2015-06-27",{"$f":"IF(AD3<EOMONTH(AD3,0),AD3+1,\"\")","v":"2015-06-28"},{"$f":"IF(AE3<EOMONTH(AE3,0),AE3+1,\"\")","v":"2015-06-29"},{"$f":"IF(AF3<EOMONTH(AF3,0),AF3+1,\"\")","v":"2015-06-30"},{"$f":"IF(AG3<EOMONTH(AG3,0),AG3+1,\"\")","v":""}]
[{"$f":"IF(Employés!A2<>\"\",Employés!A2,\"\")","v":"ABC123"},{"$f":"IF(Employés!B2<>\"\",Employés!B2,\"\")","v":"Dupont"},{"$f":"IF(Employés!C2<>\"\",Employés!C2,\"\")","v":"Untel"}]
[{"$f":"IF(Employés!A3<>\"\",Employés!A3,\"\")","v":"ABC456"},{"$f":"IF(Employés!B3<>\"\",Employés!B3,\"\")","v":"Durand"},{"$f":"IF(Employés!C3<>\"\",Employés!C3,\"\")","v":"Pierre"}]
[{"$f":"IF(Employés!A4<>\"\",Employés!A4,\"\")","v":""},{"$f":"IF(Employés!B4<>\"\",Employés!B4,\"\")","v":""},{"$f":"IF(Employés!C4<>\"\",Employés!C4,\"\")","v":""}]
[{"$f":"IF(Employés!A5<>\"\",Employés!A5,\"\")","v":""},{"$f":"IF(Employés!B5<>\"\",Employés!B5,\"\")","v":""},{"$f":"IF(Employés!C5<>\"\",Employés!C5,\"\")","v":""}]
[{"$f":"IF(Employés!A6<>\"\",Employés!A6,\"\")","v":""},{"$f":"IF(Employés!B6<>\"\",Employés!B6,\"\")","v":""},{"$f":"IF(Employés!C6<>\"\",Employés!C6,\"\")","v":""}]
[{"$f":"IF(Employés!A7<>\"\",Employés!A7,\"\")","v":""},{"$f":"IF(Employés!B7<>\"\",Employés!B7,\"\")","v":""},{"$f":"IF(Employés!C7<>\"\",Employés!C7,\"\")","v":""}]

{"sheet":"Juillet","index":9,"n_rows":9,"n_cols":34,"rows_kept":9,"cut":false,"hidden":false,"merged":[]}
[]
[null,null,null,{"$f":"IF(D3<>\"\",D3,\"\")","v":"2015-07-01"},{"$f":"IF(E3<>\"\",E3,\"\")","v":"2015-07-02"},"2015-07-03","2015-07-04","2015-07-05","2015-07-06","2015-07-07","2015-07-08","2015-07-09","2015-07-10","2015-07-11","2015-07-12","2015-07-13","2015-07-14","2015-07-15","2015-07-16","2015-07-17","2015-07-18","2015-07-19","2015-07-20","2015-07-21","2015-07-22","2015-07-23","2015-07-24","2015-07-25","2015-07-26","2015-07-27","2015-07-28","2015-07-29","2015-07-30","2015-07-31"]
["# Employé","Nom","Prénom",{"$f":"EDATE(DATE(ref_annee,1,1),6)","v":"2015-07-01"},{"$f":"D3+1","v":"2015-07-02"},{"$f":"E3+1","v":"2015-07-03"},"2015-07-04","2015-07-05","2015-07-06","2015-07-07","2015-07-08","2015-07-09","2015-07-10","2015-07-11","2015-07-12","2015-07-13","2015-07-14",{"$f":"Q3+1","v":"2015-07-15"},"2015-07-16","2015-07-17","2015-07-18","2015-07-19","2015-07-20","2015-07-21","2015-07-22","2015-07-23","2015-07-24","2015-07-25",{"$f":"AB3+1","v":"2015-07-26"},"2015-07-27",{"$f":"IF(AD3<EOMONTH(AD3,0),AD3+1,\"\")","v":"2015-07-28"},{"$f":"IF(AE3<EOMONTH(AE3,0),AE3+1,\"\")","v":"2015-07-29"},{"$f":"IF(AF3<EOMONTH(AF3,0),AF3+1,\"\")","v":"2015-07-30"},{"$f":"IF(AG3<EOMONTH(AG3,0),AG3+1,\"\")","v":"2015-07-31"}]
[{"$f":"IF(Employés!A2<>\"\",Employés!A2,\"\")","v":"ABC123"},{"$f":"IF(Employés!B2<>\"\",Employés!B2,\"\")","v":"Dupont"},{"$f":"IF(Employés!C2<>\"\",Employés!C2,\"\")","v":"Untel"}]
[{"$f":"IF(Employés!A3<>\"\",Employés!A3,\"\")","v":"ABC456"},{"$f":"IF(Employés!B3<>\"\",Employés!B3,\"\")","v":"Durand"},{"$f":"IF(Employés!C3<>\"\",Employés!C3,\"\")","v":"Pierre"}]
[{"$f":"IF(Employés!A4<>\"\",Employés!A4,\"\")","v":""},{"$f":"IF(Employés!B4<>\"\",Employés!B4,\"\")","v":""},{"$f":"IF(Employés!C4<>\"\",Employés!C4,\"\")","v":""}]
[{"$f":"IF(Employés!A5<>\"\",Employés!A5,\"\")","v":""},{"$f":"IF(Employés!B5<>\"\",Employés!B5,\"\")","v":""},{"$f":"IF(Employés!C5<>\"\",Employés!C5,\"\")","v":""}]
[{"$f":"IF(Employés!A6<>\"\",Employés!A6,\"\")","v":""},{"$f":"IF(Employés!B6<>\"\",Employés!B6,\"\")","v":""},{"$f":"IF(Employés!C6<>\"\",Employés!C6,\"\")","v":""}]
[{"$f":"IF(Employés!A7<>\"\",Employés!A7,\"\")","v":""},{"$f":"IF(Employés!B7<>\"\",Employés!B7,\"\")","v":""},{"$f":"IF(Employés!C7<>\"\",Employés!C7,\"\")","v":""}]

{"sheet":"Août","index":10,"n_rows":9,"n_cols":34,"rows_kept":9,"cut":false,"hidden":false,"merged":[]}
[]
[null,null,null,{"$f":"IF(D3<>\"\",D3,\"\")","v":"2015-08-01"},{"$f":"IF(E3<>\"\",E3,\"\")","v":"2015-08-02"},"2015-08-03","2015-08-04","2015-08-05","2015-08-06","2015-08-07","2015-08-08","2015-08-09","2015-08-10","2015-08-11","2015-08-12","2015-08-13","2015-08-14","2015-08-15","2015-08-16","2015-08-17","2015-08-18","2015-08-19","2015-08-20","2015-08-21","2015-08-22","2015-08-23","2015-08-24","2015-08-25","2015-08-26","2015-08-27","2015-08-28","2015-08-29","2015-08-30","2015-08-31"]
["# Employé","Nom","Prénom",{"$f":"EDATE(DATE(ref_annee,1,1),7)","v":"2015-08-01"},{"$f":"D3+1","v":"2015-08-02"},{"$f":"E3+1","v":"2015-08-03"},"2015-08-04","2015-08-05","2015-08-06","2015-08-07","2015-08-08","2015-08-09","2015-08-10","2015-08-11","2015-08-12","2015-08-13","2015-08-14",{"$f":"Q3+1","v":"2015-08-15"},"2015-08-16","2015-08-17","2015-08-18","2015-08-19","2015-08-20","2015-08-21","2015-08-22","2015-08-23","2015-08-24","2015-08-25",{"$f":"AB3+1","v":"2015-08-26"},"2015-08-27",{"$f":"IF(AD3<EOMONTH(AD3,0),AD3+1,\"\")","v":"2015-08-28"},{"$f":"IF(AE3<EOMONTH(AE3,0),AE3+1,\"\")","v":"2015-08-29"},{"$f":"IF(AF3<EOMONTH(AF3,0),AF3+1,\"\")","v":"2015-08-30"},{"$f":"IF(AG3<EOMONTH(AG3,0),AG3+1,\"\")","v":"2015-08-31"}]
[{"$f":"IF(Employés!A2<>\"\",Employés!A2,\"\")","v":"ABC123"},{"$f":"IF(Employés!B2<>\"\",Employés!B2,\"\")","v":"Dupont"},{"$f":"IF(Employés!C2<>\"\",Employés!C2,\"\")","v":"Untel"}]
[{"$f":"IF(Employés!A3<>\"\",Employés!A3,\"\")","v":"ABC456"},{"$f":"IF(Employés!B3<>\"\",Employés!B3,\"\")","v":"Durand"},{"$f":"IF(Employés!C3<>\"\",Employés!C3,\"\")","v":"Pierre"}]
[{"$f":"IF(Employés!A4<>\"\",Employés!A4,\"\")","v":""},{"$f":"IF(Employés!B4<>\"\",Employés!B4,\"\")","v":""},{"$f":"IF(Employés!C4<>\"\",Employés!C4,\"\")","v":""}]
[{"$f":"IF(Employés!A5<>\"\",Employés!A5,\"\")","v":""},{"$f":"IF(Employés!B5<>\"\",Employés!B5,\"\")","v":""},{"$f":"IF(Employés!C5<>\"\",Employés!C5,\"\")","v":""}]
[{"$f":"IF(Employés!A6<>\"\",Employés!A6,\"\")","v":""},{"$f":"IF(Employés!B6<>\"\",Employés!B6,\"\")","v":""},{"$f":"IF(Employés!C6<>\"\",Employés!C6,\"\")","v":""}]
[{"$f":"IF(Employés!A7<>\"\",Employés!A7,\"\")","v":""},{"$f":"IF(Employés!B7<>\"\",Employés!B7,\"\")","v":""},{"$f":"IF(Employés!C7<>\"\",Employés!C7,\"\")","v":""}]

{"sheet":"Septembre","index":11,"n_rows":9,"n_cols":34,"rows_kept":9,"cut":false,"hidden":false,"merged":[]}
[]
[null,null,null,{"$f":"IF(D3<>\"\",D3,\"\")","v":"2015-09-01"},{"$f":"IF(E3<>\"\",E3,\"\")","v":"2015-09-02"},"2015-09-03","2015-09-04","2015-09-05","2015-09-06","2015-09-07","2015-09-08","2015-09-09","2015-09-10","2015-09-11","2015-09-12","2015-09-13","2015-09-14","2015-09-15","2015-09-16","2015-09-17","2015-09-18","2015-09-19","2015-09-20","2015-09-21","2015-09-22","2015-09-23","2015-09-24","2015-09-25","2015-09-26","2015-09-27","2015-09-28","2015-09-29","2015-09-30",""]
["# Employé","Nom","Prénom",{"$f":"EDATE(DATE(ref_annee,1,1),8)","v":"2015-09-01"},{"$f":"D3+1","v":"2015-09-02"},{"$f":"E3+1","v":"2015-09-03"},"2015-09-04","2015-09-05","2015-09-06","2015-09-07","2015-09-08","2015-09-09","2015-09-10","2015-09-11","2015-09-12","2015-09-13","2015-09-14",{"$f":"Q3+1","v":"2015-09-15"},"2015-09-16","2015-09-17","2015-09-18","2015-09-19","2015-09-20","2015-09-21","2015-09-22","2015-09-23","2015-09-24","2015-09-25",{"$f":"AB3+1","v":"2015-09-26"},"2015-09-27",{"$f":"IF(AD3<EOMONTH(AD3,0),AD3+1,\"\")","v":"2015-09-28"},{"$f":"IF(AE3<EOMONTH(AE3,0),AE3+1,\"\")","v":"2015-09-29"},{"$f":"IF(AF3<EOMONTH(AF3,0),AF3+1,\"\")","v":"2015-09-30"},{"$f":"IF(AG3<EOMONTH(AG3,0),AG3+1,\"\")","v":""}]
[{"$f":"IF(Employés!A2<>\"\",Employés!A2,\"\")","v":"ABC123"},{"$f":"IF(Employés!B2<>\"\",Employés!B2,\"\")","v":"Dupont"},{"$f":"IF(Employés!C2<>\"\",Employés!C2,\"\")","v":"Untel"}]
[{"$f":"IF(Employés!A3<>\"\",Employés!A3,\"\")","v":"ABC456"},{"$f":"IF(Employés!B3<>\"\",Employés!B3,\"\")","v":"Durand"},{"$f":"IF(Employés!C3<>\"\",Employés!C3,\"\")","v":"Pierre"}]
[{"$f":"IF(Employés!A4<>\"\",Employés!A4,\"\")","v":""},{"$f":"IF(Employés!B4<>\"\",Employés!B4,\"\")","v":""},{"$f":"IF(Employés!C4<>\"\",Employés!C4,\"\")","v":""}]
[{"$f":"IF(Employés!A5<>\"\",Employés!A5,\"\")","v":""},{"$f":"IF(Employés!B5<>\"\",Employés!B5,\"\")","v":""},{"$f":"IF(Employés!C5<>\"\",Employés!C5,\"\")","v":""}]
[{"$f":"IF(Employés!A6<>\"\",Employés!A6,\"\")","v":""},{"$f":"IF(Employés!B6<>\"\",Employés!B6,\"\")","v":""},{"$f":"IF(Employés!C6<>\"\",Employés!C6,\"\")","v":""}]
[{"$f":"IF(Employés!A7<>\"\",Employés!A7,\"\")","v":""},{"$f":"IF(Employés!B7<>\"\",Employés!B7,\"\")","v":""},{"$f":"IF(Employés!C7<>\"\",Employés!C7,\"\")","v":""}]

{"sheet":"Octobre","index":12,"n_rows":9,"n_cols":34,"rows_kept":9,"cut":false,"hidden":false,"merged":[]}
[]
[null,null,null,{"$f":"IF(D3<>\"\",D3,\"\")","v":"2015-10-01"},{"$f":"IF(E3<>\"\",E3,\"\")","v":"2015-10-02"},"2015-10-03","2015-10-04","2015-10-05","2015-10-06","2015-10-07","2015-10-08","2015-10-09","2015-10-10","2015-10-11","2015-10-12","2015-10-13","2015-10-14","2015-10-15","2015-10-16","2015-10-17","2015-10-18","2015-10-19","2015-10-20","2015-10-21","2015-10-22","2015-10-23","2015-10-24","2015-10-25","2015-10-26","2015-10-27","2015-10-28","2015-10-29","2015-10-30","2015-10-31"]
["# Employé","Nom","Prénom",{"$f":"EDATE(DATE(ref_annee,1,1),9)","v":"2015-10-01"},{"$f":"D3+1","v":"2015-10-02"},{"$f":"E3+1","v":"2015-10-03"},"2015-10-04","2015-10-05","2015-10-06","2015-10-07","2015-10-08","2015-10-09","2015-10-10","2015-10-11","2015-10-12","2015-10-13","2015-10-14",{"$f":"Q3+1","v":"2015-10-15"},"2015-10-16","2015-10-17","2015-10-18","2015-10-19","2015-10-20","2015-10-21","2015-10-22","2015-10-23","2015-10-24","2015-10-25",{"$f":"AB3+1","v":"2015-10-26"},"2015-10-27",{"$f":"IF(AD3<EOMONTH(AD3,0),AD3+1,\"\")","v":"2015-10-28"},{"$f":"IF(AE3<EOMONTH(AE3,0),AE3+1,\"\")","v":"2015-10-29"},{"$f":"IF(AF3<EOMONTH(AF3,0),AF3+1,\"\")","v":"2015-10-30"},{"$f":"IF(AG3<EOMONTH(AG3,0),AG3+1,\"\")","v":"2015-10-31"}]
[{"$f":"IF(Employés!A2<>\"\",Employés!A2,\"\")","v":"ABC123"},{"$f":"IF(Employés!B2<>\"\",Employés!B2,\"\")","v":"Dupont"},{"$f":"IF(Employés!C2<>\"\",Employés!C2,\"\")","v":"Untel"}]
[{"$f":"IF(Employés!A3<>\"\",Employés!A3,\"\")","v":"ABC456"},{"$f":"IF(Employés!B3<>\"\",Employés!B3,\"\")","v":"Durand"},{"$f":"IF(Employés!C3<>\"\",Employés!C3,\"\")","v":"Pierre"}]
[{"$f":"IF(Employés!A4<>\"\",Employés!A4,\"\")","v":""},{"$f":"IF(Employés!B4<>\"\",Employés!B4,\"\")","v":""},{"$f":"IF(Employés!C4<>\"\",Employés!C4,\"\")","v":""}]
[{"$f":"IF(Employés!A5<>\"\",Employés!A5,\"\")","v":""},{"$f":"IF(Employés!B5<>\"\",Employés!B5,\"\")","v":""},{"$f":"IF(Employés!C5<>\"\",Employés!C5,\"\")","v":""}]
[{"$f":"IF(Employés!A6<>\"\",Employés!A6,\"\")","v":""},{"$f":"IF(Employés!B6<>\"\",Employés!B6,\"\")","v":""},{"$f":"IF(Employés!C6<>\"\",Employés!C6,\"\")","v":""}]
[{"$f":"IF(Employés!A7<>\"\",Employés!A7,\"\")","v":""},{"$f":"IF(Employés!B7<>\"\",Employés!B7,\"\")","v":""},{"$f":"IF(Employés!C7<>\"\",Employés!C7,\"\")","v":""}]

{"sheet":"Novembre","index":13,"n_rows":9,"n_cols":34,"rows_kept":9,"cut":false,"hidden":false,"merged":[]}
[]
[null,null,null,{"$f":"IF(D3<>\"\",D3,\"\")","v":"2015-11-01"},{"$f":"IF(E3<>\"\",E3,\"\")","v":"2015-11-02"},"2015-11-03","2015-11-04","2015-11-05","2015-11-06","2015-11-07","2015-11-08","2015-11-09","2015-11-10","2015-11-11","2015-11-12","2015-11-13","2015-11-14","2015-11-15","2015-11-16","2015-11-17","2015-11-18","2015-11-19","2015-11-20","2015-11-21","2015-11-22","2015-11-23","2015-11-24","2015-11-25","2015-11-26","2015-11-27","2015-11-28","2015-11-29","2015-11-30",""]
["# Employé","Nom","Prénom",{"$f":"EDATE(DATE(ref_annee,1,1),10)","v":"2015-11-01"},{"$f":"D3+1","v":"2015-11-02"},{"$f":"E3+1","v":"2015-11-03"},"2015-11-04","2015-11-05","2015-11-06","2015-11-07","2015-11-08","2015-11-09","2015-11-10","2015-11-11","2015-11-12","2015-11-13","2015-11-14",{"$f":"Q3+1","v":"2015-11-15"},"2015-11-16","2015-11-17","2015-11-18","2015-11-19","2015-11-20","2015-11-21","2015-11-22","2015-11-23","2015-11-24","2015-11-25",{"$f":"AB3+1","v":"2015-11-26"},"2015-11-27",{"$f":"IF(AD3<EOMONTH(AD3,0),AD3+1,\"\")","v":"2015-11-28"},{"$f":"IF(AE3<EOMONTH(AE3,0),AE3+1,\"\")","v":"2015-11-29"},{"$f":"IF(AF3<EOMONTH(AF3,0),AF3+1,\"\")","v":"2015-11-30"},{"$f":"IF(AG3<EOMONTH(AG3,0),AG3+1,\"\")","v":""}]
[{"$f":"IF(Employés!A2<>\"\",Employés!A2,\"\")","v":"ABC123"},{"$f":"IF(Employés!B2<>\"\",Employés!B2,\"\")","v":"Dupont"},{"$f":"IF(Employés!C2<>\"\",Employés!C2,\"\")","v":"Untel"}]
[{"$f":"IF(Employés!A3<>\"\",Employés!A3,\"\")","v":"ABC456"},{"$f":"IF(Employés!B3<>\"\",Employés!B3,\"\")","v":"Durand"},{"$f":"IF(Employés!C3<>\"\",Employés!C3,\"\")","v":"Pierre"}]
[{"$f":"IF(Employés!A4<>\"\",Employés!A4,\"\")","v":""},{"$f":"IF(Employés!B4<>\"\",Employés!B4,\"\")","v":""},{"$f":"IF(Employés!C4<>\"\",Employés!C4,\"\")","v":""}]
[{"$f":"IF(Employés!A5<>\"\",Employés!A5,\"\")","v":""},{"$f":"IF(Employés!B5<>\"\",Employés!B5,\"\")","v":""},{"$f":"IF(Employés!C5<>\"\",Employés!C5,\"\")","v":""}]
[{"$f":"IF(Employés!A6<>\"\",Employés!A6,\"\")","v":""},{"$f":"IF(Employés!B6<>\"\",Employés!B6,\"\")","v":""},{"$f":"IF(Employés!C6<>\"\",Employés!C6,\"\")","v":""}]
[{"$f":"IF(Employés!A7<>\"\",Employés!A7,\"\")","v":""},{"$f":"IF(Employés!B7<>\"\",Employés!B7,\"\")","v":""},{"$f":"IF(Employés!C7<>\"\",Employés!C7,\"\")","v":""}]

{"sheet":"Décembre","index":14,"n_rows":9,"n_cols":34,"rows_kept":9,"cut":false,"hidden":false,"merged":[]}
[]
[null,null,null,{"$f":"IF(D3<>\"\",D3,\"\")","v":"2015-12-01"},{"$f":"IF(E3<>\"\",E3,\"\")","v":"2015-12-02"},"2015-12-03","2015-12-04","2015-12-05","2015-12-06","2015-12-07","2015-12-08","2015-12-09","2015-12-10","2015-12-11","2015-12-12","2015-12-13","2015-12-14","2015-12-15","2015-12-16","2015-12-17","2015-12-18","2015-12-19","2015-12-20","2015-12-21","2015-12-22","2015-12-23","2015-12-24","2015-12-25","2015-12-26","2015-12-27","2015-12-28","2015-12-29","2015-12-30","2015-12-31"]
["# Employé","Nom","Prénom",{"$f":"EDATE(DATE(ref_annee,1,1),11)","v":"2015-12-01"},{"$f":"D3+1","v":"2015-12-02"},{"$f":"E3+1","v":"2015-12-03"},"2015-12-04","2015-12-05","2015-12-06","2015-12-07","2015-12-08","2015-12-09","2015-12-10","2015-12-11","2015-12-12","2015-12-13","2015-12-14",{"$f":"Q3+1","v":"2015-12-15"},"2015-12-16","2015-12-17","2015-12-18","2015-12-19","2015-12-20","2015-12-21","2015-12-22","2015-12-23","2015-12-24","2015-12-25",{"$f":"AB3+1","v":"2015-12-26"},"2015-12-27",{"$f":"IF(AD3<EOMONTH(AD3,0),AD3+1,\"\")","v":"2015-12-28"},{"$f":"IF(AE3<EOMONTH(AE3,0),AE3+1,\"\")","v":"2015-12-29"},{"$f":"IF(AF3<EOMONTH(AF3,0),AF3+1,\"\")","v":"2015-12-30"},{"$f":"IF(AG3<EOMONTH(AG3,0),AG3+1,\"\")","v":"2015-12-31"}]
[{"$f":"IF(Employés!A2<>\"\",Employés!A2,\"\")","v":"ABC123"},{"$f":"IF(Employés!B2<>\"\",Employés!B2,\"\")","v":"Dupont"},{"$f":"IF(Employés!C2<>\"\",Employés!C2,\"\")","v":"Untel"}]
[{"$f":"IF(Employés!A3<>\"\",Employés!A3,\"\")","v":"ABC456"},{"$f":"IF(Employés!B3<>\"\",Employés!B3,\"\")","v":"Durand"},{"$f":"IF(Employés!C3<>\"\",Employés!C3,\"\")","v":"Pierre"}]
[{"$f":"IF(Employés!A4<>\"\",Employés!A4,\"\")","v":""},{"$f":"IF(Employés!B4<>\"\",Employés!B4,\"\")","v":""},{"$f":"IF(Employés!C4<>\"\",Employés!C4,\"\")","v":""}]
[{"$f":"IF(Employés!A5<>\"\",Employés!A5,\"\")","v":""},{"$f":"IF(Employés!B5<>\"\",Employés!B5,\"\")","v":""},{"$f":"IF(Employés!C5<>\"\",Employés!C5,\"\")","v":""}]
[{"$f":"IF(Employés!A6<>\"\",Employés!A6,\"\")","v":""},{"$f":"IF(Employés!B6<>\"\",Employés!B6,\"\")","v":""},{"$f":"IF(Employés!C6<>\"\",Employés!C6,\"\")","v":""}]
[{"$f":"IF(Employés!A7<>\"\",Employés!A7,\"\")","v":""},{"$f":"IF(Employés!B7<>\"\",Employés!B7,\"\")","v":""},{"$f":"IF(Employés!C7<>\"\",Employés!C7,\"\")","v":""}]

{"sheet":"Guide utilisateur","index":15,"n_rows":16,"n_cols":1,"rows_kept":16,"cut":false,"hidden":false,"merged":[]}
[]
[]
[]
[]
[]
["FAQ"]
["1. Comment entrer un nouvel employé?"]
[" - Aller dans l'onglet \"Employés\", Remplir la ligne avec les infos requises et Enregistrer (Ctl+S)"]
["2. Comment entrer des congés payés et approuvés pour un employé?"]
[" - Aller dans le l'onglet du mois approprié, placez-vous à la date approprié, cliquez sur la cellule et sélectionnez le code de congé appropié. Enregistrez (Ctrl+S)"]
["3. Comment produire un relevé de congés annuel pour un emloyé?"]
[" - Dans l'onglet \"Relevé\", entrez le # Employé dans la cellule appropriée, la feuille se remplira automatiquement"]
["4. Comment envoyer le relevé par e-mail (courriel)?"]
[" - Dans l'onglet \"Relevé\", cliquez sur le bouton \"Envoyer le relevé\", le système vous demandera de d'enregistrer le fichier au format PDF. Donnez un nom à votre fichier. Ensuite une fenêtre Outlook s'ouvre contenant le fichier joint, un message automatisé et l'adresse courriel de l'employé"]
["5. Puis-je changer les couleurs des codes?"]
[" - il ne sera pas possible de changer les couleurs des codes"]