{"text_format":"1","workbook":"xlsx","n_sheets":2,"sheets":["ACCUEIL","2017"],"not_rendered":{"charts":0,"images":0,"macros":1,"external_links":0,"defined_names":11,"comments":0,"pivot_tables":0},"unopened":[],"bounds":{"document_bytes":16777216,"sheet_cells":100000,"rows_first":2000,"rows_last":500,"rows_between":2000,"halvings":0,"cell_chars":16384,"cell_head_chars":4096},"cells_cut":0,"cells_raw":0,"read":"whole","date_system":"1900"}

{"sheet":"ACCUEIL","index":0,"n_rows":0,"n_cols":0,"rows_kept":0,"cut":false,"hidden":false,"merged":[[0,0,19,3]]}

{"sheet":"2017","index":1,"n_rows":47,"n_cols":10,"rows_kept":47,"cut":false,"hidden":false,"merged":[]}
[]
["DIRECTION :","SS DIRECTION :","SERVICES :","POSTE :","Nombre de poste :","Niveau :","Date souhaitée de recrutement :","Contrat :","Commentaires :"]
[{"$f":"IF(C3=\"\",\"\",IF(ISNA(INDEX(#REF!,MATCH('2017'!C3,#REF!,0))),\"SERVICE\",INDEX(#REF!,MATCH('2017'!C3,#REF!,0))))","v":""},{"$f":"IF(C3=\"\",\"\",IF(ISNA(INDEX(#REF!,MATCH('2017'!C3,#REF!,0))),\"NON VALIDE\",INDEX(#REF!,MATCH('2017'!C3,#REF!,0))))","v":""},null,null,null,null,null,null,null,{"$f":"IF(A3=\"\",\"\",IF(OR(D3=\"\",E3=\"\",F3=\"\",G3=\"\",H3=\"\"),\"Renseigner toutes les informations\",\"\"))","v":""}]
[{"$f":"IF(C4=\"\",\"\",IF(ISNA(INDEX(#REF!,MATCH('2017'!C4,#REF!,0))),\"SERVICE\",INDEX(#REF!,MATCH('2017'!C4,#REF!,0))))","v":""},{"$f":"IF(C4=\"\",\"\",IF(ISNA(INDEX(#REF!,MATCH('2017'!C4,#REF!,0))),\"NON VALIDE\",INDEX(#REF!,MATCH('2017'!C4,#REF!,0))))","v":""},null,null,null,null,null,null,null,{"$f":"IF(A4=\"\",\"\",IF(OR(D4=\"\",E4=\"\",F4=\"\",G4=\"\",H4=\"\"),\"Renseigner toutes les informations\",\"\"))","v":""}]
[{"$f":"IF(C5=\"\",\"\",IF(ISNA(INDEX(#REF!,MATCH('2017'!C5,#REF!,0))),\"SERVICE\",INDEX(#REF!,MATCH('2017'!C5,#REF!,0))))","v":""},{"$f":"IF(C5=\"\",\"\",IF(ISNA(INDEX(#REF!,MATCH('2017'!C5,#REF!,0))),\"NON VALIDE\",INDEX(#REF!,MATCH('2017'!C5,#REF!,0))))","v":""},null,null,null,null,null,null,null,""]
[{"$f":"IF(C6=\"\",\"\",IF(ISNA(INDEX(#REF!,MATCH('2017'!C6,#REF!,0))),\"SERVICE\",INDEX(#REF!,MATCH('2017'!C6,#REF!,0))))","v":""},{"$f":"IF(C6=\"\",\"\",IF(ISNA(INDEX(#REF!,MATCH('2017'!C6,#REF!,0))),\"NON VALIDE\",INDEX(#REF!,MATCH('2017'!C6,#REF!,0))))","v":""},null,null,null,null,null,null,null,""]
[{"$f":"IF(C7=\"\",\"\",IF(ISNA(INDEX(#REF!,MATCH('2017'!C7,#REF!,0))),\"SERVICE\",INDEX(#REF!,MATCH('2017'!C7,#REF!,0))))","v":""},{"$f":"IF(C7=\"\",\"\",IF(ISNA(INDEX(#REF!,MATCH('2017'!C7,#REF!,0))),\"NON VALIDE\",INDEX(#REF!,MATCH('2017'!C7,#REF!,0))))","v":""},null,null,null,null,null,null,null,""]
[{"$f":"IF(C8=\"\",\"\",IF(ISNA(INDEX(#REF!,MATCH('2017'!C8,#REF!,0))),\"SERVICE\",INDEX(#REF!,MATCH('2017'!C8,#REF!,0))))","v":""},{"$f":"IF(C8=\"\",\"\",IF(ISNA(INDEX(#REF!,MATCH('2017'!C8,#REF!,0))),\"NON VALIDE\",INDEX(#REF!,MATCH('2017'!C8,#REF!,0))))","v":""},null,null,null,null,null,null,null,""]
[{"$f":"IF(C9=\"\",\"\",IF(ISNA(INDEX(#REF!,MATCH('2017'!C9,#REF!,0))),\"SERVICE\",INDEX(#REF!,MATCH('2017'!C9,#REF!,0))))","v":""},{"$f":"IF(C9=\"\",\"\",IF(ISNA(INDEX(#REF!,MATCH('2017'!C9,#REF!,0))),\"NON VALIDE\",INDEX(#REF!,MATCH('2017'!C9,#REF!,0))))","v":""},null,null,null,null,null,null,null,""]
[{"$f":"IF(C10=\"\",\"\",IF(ISNA(INDEX(#REF!,MATCH('2017'!C10,#REF!,0))),\"SERVICE\",INDEX(#REF!,MATCH('2017'!C10,#REF!,0))))","v":""},{"$f":"IF(C10=\"\",\"\",IF(ISNA(INDEX(#REF!,MATCH('2017'!C10,#REF!,0))),\"NON VALIDE\",INDEX(#REF!,MATCH('2017'!C10,#REF!,0))))","v":""},null,null,null,null,null,null,null,""]
[{"$f":"IF(C11=\"\",\"\",IF(ISNA(INDEX(#REF!,MATCH('2017'!C11,#REF!,0))),\"SERVICE\",INDEX(#REF!,MATCH('2017'!C11,#REF!,0))))","v":""},{"$f":"IF(C11=\"\",\"\",IF(ISNA(INDEX(#REF!,MATCH('2017'!C11,#REF!,0))),\"NON VALIDE\",INDEX(#REF!,MATCH('2017'!C11,#REF!,0))))","v":""},null,null,null,null,null,null,null,""]
[{"$f":"IF(C12=\"\",\"\",IF(ISNA(INDEX(#REF!,MATCH('2017'!C12,#REF!,0))),\"SERVICE\",INDEX(#REF!,MATCH('2017'!C12,#REF!,0))))","v":""},{"$f":"IF(C12=\"\",\"\",IF(ISNA(INDEX(#REF!,MATCH('2017'!C12,#REF!,0))),\"NON VALIDE\",INDEX(#REF!,MATCH('2017'!C12,#REF!,0))))","v":""},null,null,null,null,null,null,null,""]
[{"$f":"IF(C13=\"\",\"\",IF(ISNA(INDEX(#REF!,MATCH('2017'!C13,#REF!,0))),\"SERVICE\",INDEX(#REF!,MATCH('2017'!C13,#REF!,0))))","v":""},{"$f":"IF(C13=\"\",\"\",IF(ISNA(INDEX(#REF!,MATCH('2017'!C13,#REF!,0))),\"NON VALIDE\",INDEX(#REF!,MATCH('2017'!C13,#REF!,0))))","v":""},null,null,null,null,null,null,null,""]
[{"$f":"IF(C14=\"\",\"\",IF(ISNA(INDEX(#REF!,MATCH('2017'!C14,#REF!,0))),\"SERVICE\",INDEX(#REF!,MATCH('2017'!C14,#REF!,0))))","v":""},{"$f":"IF(C14=\"\",\"\",IF(ISNA(INDEX(#REF!,MATCH('2017'!C14,#REF!,0))),\"NON VALIDE\",INDEX(#REF!,MATCH('2017'!C14,#REF!,0))))","v":""},null,null,null,null,null,null,null,""]
[{"$f":"IF(C15=\"\",\"\",IF(ISNA(INDEX(#REF!,MATCH('2017'!C15,#REF!,0))),\"SERVICE\",INDEX(#REF!,MATCH('2017'!C15,#REF!,0))))","v":""},{"$f":"IF(C15=\"\",\"\",IF(ISNA(INDEX(#REF!,MATCH('2017'!C15,#REF!,0))),\"NON VALIDE\",INDEX(#REF!,MATCH('2017'!C15,#REF!,0))))","v":""},null,null,null,null,null,null,null,""]
[{"$f":"IF(C16=\"\",\"\",IF(ISNA(INDEX(#REF!,MATCH('2017'!C16,#REF!,0))),\"SERVICE\",INDEX(#REF!,MATCH('2017'!C16,#REF!,0))))","v":""},{"$f":"IF(C16=\"\",\"\",IF(ISNA(INDEX(#REF!,MATCH('2017'!C16,#REF!,0))),\"NON VALIDE\",INDEX(#REF!,MATCH('2017'!C16,#REF!,0))))","v":""},null,null,null,null,null,null,null,""]
[{"$f":"IF(C17=\"\",\"\",IF(ISNA(INDEX(#REF!,MATCH('2017'!C17,#REF!,0))),\"SERVICE\",INDEX(#REF!,MATCH('2017'!C17,#REF!,0))))","v":""},{"$f":"IF(C17=\"\",\"\",IF(ISNA(INDEX(#REF!,MATCH('2017'!C17,#REF!,0))),\"NON VALIDE\",INDEX(#REF!,MATCH('2017'!C17,#REF!,0))))","v":""},null,null,null,null,null,null,null,""]
[{"$f":"IF(C18=\"\",\"\",IF(ISNA(INDEX(#REF!,MATCH('2017'!C18,#REF!,0))),\"SERVICE\",INDEX(#REF!,MATCH('2017'!C18,#REF!,0))))","v":""},{"$f":"IF(C18=\"\",\"\",IF(ISNA(INDEX(#REF!,MATCH('2017'!C18,#REF!,0))),\"NON VALIDE\",INDEX(#REF!,MATCH('2017'!C18,#REF!,0))))","v":""},null,null,null,null,null,null,null,""]
[{"$f":"IF(C19=\"\",\"\",IF(ISNA(INDEX(#REF!,MATCH('2017'!C19,#REF!,0))),\"SERVICE\",INDEX(#REF!,MATCH('2017'!C19,#REF!,0))))","v":""},{"$f":"IF(C19=\"\",\"\",IF(ISNA(INDEX(#REF!,MATCH('2017'!C19,#REF!,0))),\"NON VALIDE\",INDEX(#REF!,MATCH('2017'!C19,#REF!,0))))","v":""},null,null,null,null,null,null,null,""]
[{"$f":"IF(C20=\"\",\"\",IF(ISNA(INDEX(#REF!,MATCH('2017'!C20,#REF!,0))),\"SERVICE\",INDEX(#REF!,MATCH('2017'!C20,#REF!,0))))","v":""},{"$f":"IF(C20=\"\",\"\",IF(ISNA(INDEX(#REF!,MATCH('2017'!C20,#REF!,0))),\"NON VALIDE\",INDEX(#REF!,MATCH('2017'!C20,#REF!,0))))","v":""},null,null,null,null,null,null,null,""]
[{"$f":"IF(C21=\"\",\"\",IF(ISNA(INDEX(#REF!,MATCH('2017'!C21,#REF!,0))),\"SERVICE\",INDEX(#REF!,MATCH('2017'!C21,#REF!,0))))","v":""},{"$f":"IF(C21=\"\",\"\",IF(ISNA(INDEX(#REF!,MATCH('2017'!C21,#REF!,0))),\"NON VALIDE\",INDEX(#REF!,MATCH('2017'!C21,#REF!,0))))","v":""},null,null,null,null,null,null,null,""]
[{"$f":"IF(C22=\"\",\"\",IF(ISNA(INDEX(#REF!,MATCH('2017'!C22,#REF!,0))),\"SERVICE\",INDEX(#REF!,MATCH('2017'!C22,#REF!,0))))","v":""},{"$f":"IF(C22=\"\",\"\",IF(ISNA(INDEX(#REF!,MATCH('2017'!C22,#REF!,0))),\"NON VALIDE\",INDEX(#REF!,MATCH('2017'!C22,#REF!,0))))","v":""},null,null,null,null,null,null,null,""]
[{"$f":"IF(C23=\"\",\"\",IF(ISNA(INDEX(#REF!,MATCH('2017'!C23,#REF!,0))),\"SERVICE\",INDEX(#REF!,MATCH('2017'!C23,#REF!,0))))","v":""},{"$f":"IF(C23=\"\",\"\",IF(ISNA(INDEX(#REF!,MATCH('2017'!C23,#REF!,0))),\"NON VALIDE\",INDEX(#REF!,MATCH('2017'!C23,#REF!,0))))","v":""},null,null,null,null,null,null,null,""]
[{"$f":"IF(C24=\"\",\"\",IF(ISNA(INDEX(#REF!,MATCH('2017'!C24,#REF!,0))),\"SERVICE\",INDEX(#REF!,MATCH('2017'!C24,#REF!,0))))","v":""},{"$f":"IF(C24=\"\",\"\",IF(ISNA(INDEX(#REF!,MATCH('2017'!C24,#REF!,0))),\"NON VALIDE\",INDEX(#REF!,MATCH('2017'!C24,#REF!,0))))","v":""},null,null,null,null,null,null,null,""]
[{"$f":"IF(C25=\"\",\"\",IF(ISNA(INDEX(#REF!,MATCH('2017'!C25,#REF!,0))),\"SERVICE\",INDEX(#REF!,MATCH('2017'!C25,#REF!,0))))","v":""},{"$f":"IF(C25=\"\",\"\",IF(ISNA(INDEX(#REF!,MATCH('2017'!C25,#REF!,0))),\"NON VALIDE\",INDEX(#REF!,MATCH('2017'!C25,#REF!,0))))","v":""},null,null,null,null,null,null,null,""]
[{"$f":"IF(C26=\"\",\"\",IF(ISNA(INDEX(#REF!,MATCH('2017'!C26,#REF!,0))),\"SERVICE\",INDEX(#REF!,MATCH('2017'!C26,#REF!,0))))","v":""},{"$f":"IF(C26=\"\",\"\",IF(ISNA(INDEX(#REF!,MATCH('2017'!C26,#REF!,0))),\"NON VALIDE\",INDEX(#REF!,MATCH('2017'!C26,#REF!,0))))","v":""},null,null,null,null,null,null,null,""]
[{"$f":"IF(C27=\"\",\"\",IF(ISNA(INDEX(#REF!,MATCH('2017'!C27,#REF!,0))),\"SERVICE\",INDEX(#REF!,MATCH('2017'!C27,#REF!,0))))","v":""},{"$f":"IF(C27=\"\",\"\",IF(ISNA(INDEX(#REF!,MATCH('2017'!C27,#REF!,0))),\"NON VALIDE\",INDEX(#REF!,MATCH('2017'!C27,#REF!,0))))","v":""},null,null,null,null,null,null,null,""]
[{"$f":"IF(C28=\"\",\"\",IF(ISNA(INDEX(#REF!,MATCH('2017'!C28,#REF!,0))),\"SERVICE\",INDEX(#REF!,MATCH('2017'!C28,#REF!,0))))","v":""},{"$f":"IF(C28=\"\",\"\",IF(ISNA(INDEX(#REF!,MATCH('2017'!C28,#REF!,0))),\"NON VALIDE\",INDEX(#REF!,MATCH('2017'!C28,#REF!,0))))","v":""},null,null,null,null,null,null,null,""]
[{"$f":"IF(C29=\"\",\"\",IF(ISNA(INDEX(#REF!,MATCH('2017'!C29,#REF!,0))),\"SERVICE\",INDEX(#REF!,MATCH('2017'!C29,#REF!,0))))","v":""},{"$f":"IF(C29=\"\",\"\",IF(ISNA(INDEX(#REF!,MATCH('2017'!C29,#REF!,0))),\"NON VALIDE\",INDEX(#REF!,MATCH('2017'!C29,#REF!,0))))","v":""},null,null,null,null,null,null,null,""]
[{"$f":"IF(C30=\"\",\"\",IF(ISNA(INDEX(#REF!,MATCH('2017'!C30,#REF!,0))),\"SERVICE\",INDEX(#REF!,MATCH('2017'!C30,#REF!,0))))","v":""},{"$f":"IF(C30=\"\",\"\",IF(ISNA(INDEX(#REF!,MATCH('2017'!C30,#REF!,0))),\"NON VALIDE\",INDEX(#REF!,MATCH('2017'!C30,#REF!,0))))","v":""},null,null,null,null,null,null,null,""]
[{"$f":"IF(C31=\"\",\"\",IF(ISNA(INDEX(#REF!,MATCH('2017'!C31,#REF!,0))),\"SERVICE\",INDEX(#REF!,MATCH('2017'!C31,#REF!,0))))","v":""},{"$f":"IF(C31=\"\",\"\",IF(ISNA(INDEX(#REF!,MATCH('2017'!C31,#REF!,0))),\"NON VALIDE\",INDEX(#REF!,MATCH('2017'!C31,#REF!,0))))","v":""},null,null,null,null,null,null,null,""]
[{"$f":"IF(C32=\"\",\"\",IF(ISNA(INDEX(#REF!,MATCH('2017'!C32,#REF!,0))),\"SERVICE\",INDEX(#REF!,MATCH('2017'!C32,#REF!,0))))","v":""},{"$f":"IF(C32=\"\",\"\",IF(ISNA(INDEX(#REF!,MATCH('2017'!C32,#REF!,0))),\"NON VALIDE\",INDEX(#REF!,MATCH('2017'!C32,#REF!,0))))","v":""},null,null,null,null,null,null,null,""]
[{"$f":"IF(C33=\"\",\"\",IF(ISNA(INDEX(#REF!,MATCH('2017'!C33,#REF!,0))),\"SERVICE\",INDEX(#REF!,MATCH('2017'!C33,#REF!,0))))","v":""},{"$f":"IF(C33=\"\",\"\",IF(ISNA(INDEX(#REF!,MATCH('2017'!C33,#REF!,0))),\"NON VALIDE\",INDEX(#REF!,MATCH('2017'!C33,#REF!,0))))","v":""},null,null,null,null,null,null,null,""]
[{"$f":"IF(C34=\"\",\"\",IF(ISNA(INDEX(#REF!,MATCH('2017'!C34,#REF!,0))),\"SERVICE\",INDEX(#REF!,MATCH('2017'!C34,#REF!,0))))","v":""},{"$f":"IF(C34=\"\",\"\",IF(ISNA(INDEX(#REF!,MATCH('2017'!C34,#REF!,0))),\"NON VALIDE\",INDEX(#REF!,MATCH('2017'!C34,#REF!,0))))","v":""},null,null,null,null,null,null,null,""]
[{"$f":"IF(C35=\"\",\"\",IF(ISNA(INDEX(#REF!,MATCH('2017'!C35,#REF!,0))),\"SERVICE\",INDEX(#REF!,MATCH('2017'!C35,#REF!,0))))","v":""},{"$f":"IF(C35=\"\",\"\",IF(ISNA(INDEX(#REF!,MATCH('2017'!C35,#REF!,0))),\"NON VALIDE\",INDEX(#REF!,MATCH('2017'!C35,#REF!,0))))","v":""},null,null,null,null,null,null,null,""]
[{"$f":"IF(C36=\"\",\"\",IF(ISNA(INDEX(#REF!,MATCH('2017'!C36,#REF!,0))),\"SERVICE\",INDEX(#REF!,MATCH('2017'!C36,#REF!,0))))","v":""},{"$f":"IF(C36=\"\",\"\",IF(ISNA(INDEX(#REF!,MATCH('2017'!C36,#REF!,0))),\"NON VALIDE\",INDEX(#REF!,MATCH('2017'!C36,#REF!,0))))","v":""},null,null,null,null,null,null,null,""]
[{"$f":"IF(C37=\"\",\"\",IF(ISNA(INDEX(#REF!,MATCH('2017'!C37,#REF!,0))),\"SERVICE\",INDEX(#REF!,MATCH('2017'!C37,#REF!,0))))","v":""},{"$f":"IF(C37=\"\",\"\",IF(ISNA(INDEX(#REF!,MATCH('2017'!C37,#REF!,0))),\"NON VALIDE\",INDEX(#REF!,MATCH('2017'!C37,#REF!,0))))","v":""},null,null,null,null,null,null,null,""]
[{"$f":"IF(C38=\"\",\"\",IF(ISNA(INDEX(#REF!,MATCH('2017'!C38,#REF!,0))),\"SERVICE\",INDEX(#REF!,MATCH('2017'!C38,#REF!,0))))","v":""},{"$f":"IF(C38=\"\",\"\",IF(ISNA(INDEX(#REF!,MATCH('2017'!C38,#REF!,0))),\"NON VALIDE\",INDEX(#REF!,MATCH('2017'!C38,#REF!,0))))","v":""},null,null,null,null,null,null,null,""]
[{"$f":"IF(C39=\"\",\"\",IF(ISNA(INDEX(#REF!,MATCH('2017'!C39,#REF!,0))),\"SERVICE\",INDEX(#REF!,MATCH('2017'!C39,#REF!,0))))","v":""},{"$f":"IF(C39=\"\",\"\",IF(ISNA(INDEX(#REF!,MATCH('2017'!C39,#REF!,0))),\"NON VALIDE\",INDEX(#REF!,MATCH('2017'!C39,#REF!,0))))","v":""},null,null,null,null,null,null,null,""]
[{"$f":"IF(C40=\"\",\"\",IF(ISNA(INDEX(#REF!,MATCH('2017'!C40,#REF!,0))),\"SERVICE\",INDEX(#REF!,MATCH('2017'!C40,#REF!,0))))","v":""},{"$f":"IF(C40=\"\",\"\",IF(ISNA(INDEX(#REF!,MATCH('2017'!C40,#REF!,0))),\"NON VALIDE\",INDEX(#REF!,MATCH('2017'!C40,#REF!,0))))","v":""},null,null,null,null,null,null,null,""]
[{"$f":"IF(C41=\"\",\"\",IF(ISNA(INDEX(#REF!,MATCH('2017'!C41,#REF!,0))),\"SERVICE\",INDEX(#REF!,MATCH('2017'!C41,#REF!,0))))","v":""},{"$f":"IF(C41=\"\",\"\",IF(ISNA(INDEX(#REF!,MATCH('2017'!C41,#REF!,0))),\"NON VALIDE\",INDEX(#REF!,MATCH('2017'!C41,#REF!,0))))","v":""},null,null,null,null,null,null,null,""]
[{"$f":"IF(C42=\"\",\"\",IF(ISNA(INDEX(#REF!,MATCH('2017'!C42,#REF!,0))),\"SERVICE\",INDEX(#REF!,MATCH('2017'!C42,#REF!,0))))","v":""},{"$f":"IF(C42=\"\",\"\",IF(ISNA(INDEX(#REF!,MATCH('2017'!C42,#REF!,0))),\"NON VALIDE\",INDEX(#REF!,MATCH('2017'!C42,#REF!,0))))","v":""},null,null,null,null,null,null,null,""]
[{"$f":"IF(C43=\"\",\"\",IF(ISNA(INDEX(#REF!,MATCH('2017'!C43,#REF!,0))),\"SERVICE\",INDEX(#REF!,MATCH('2017'!C43,#REF!,0))))","v":""},{"$f":"IF(C43=\"\",\"\",IF(ISNA(INDEX(#REF!,MATCH('2017'!C43,#REF!,0))),\"NON VALIDE\",INDEX(#REF!,MATCH('2017'!C43,#REF!,0))))","v":""},null,null,null,null,null,null,null,""]
[{"$f":"IF(C44=\"\",\"\",IF(ISNA(INDEX(#REF!,MATCH('2017'!C44,#REF!,0))),\"SERVICE\",INDEX(#REF!,MATCH('2017'!C44,#REF!,0))))","v":""},{"$f":"IF(C44=\"\",\"\",IF(ISNA(INDEX(#REF!,MATCH('2017'!C44,#REF!,0))),\"NON VALIDE\",INDEX(#REF!,MATCH('2017'!C44,#REF!,0))))","v":""},null,null,null,null,null,null,null,""]
[{"$f":"IF(C45=\"\",\"\",IF(ISNA(INDEX(#REF!,MATCH('2017'!C45,#REF!,0))),\"SERVICE\",INDEX(#REF!,MATCH('2017'!C45,#REF!,0))))","v":""},{"$f":"IF(C45=\"\",\"\",IF(ISNA(INDEX(#REF!,MATCH('2017'!C45,#REF!,0))),\"NON VALIDE\",INDEX(#REF!,MATCH('2017'!C45,#REF!,0))))","v":""},null,null,null,null,null,null,null,""]
[{"$f":"IF(C46=\"\",\"\",IF(ISNA(INDEX(#REF!,MATCH('2017'!C46,#REF!,0))),\"SERVICE\",INDEX(#REF!,MATCH('2017'!C46,#REF!,0))))","v":""},{"$f":"IF(C46=\"\",\"\",IF(ISNA(INDEX(#REF!,MATCH('2017'!C46,#REF!,0))),\"NON VALIDE\",INDEX(#REF!,MATCH('2017'!C46,#REF!,0))))","v":""},null,null,null,null,null,null,null,""]
[{"$f":"IF(C47=\"\",\"\",IF(ISNA(INDEX(#REF!,MATCH('2017'!C47,#REF!,0))),\"SERVICE\",INDEX(#REF!,MATCH('2017'!C47,#REF!,0))))","v":""},{"$f":"IF(C47=\"\",\"\",IF(ISNA(INDEX(#REF!,MATCH('2017'!C47,#REF!,0))),\"NON VALIDE\",INDEX(#REF!,MATCH('2017'!C47,#REF!,0))))","v":""},null,null,null,null,null,null,null,""]