{"text_format":"1","workbook":"xlsx","n_sheets":12,"sheets":["Accueil","Demande","Rapport","Agenda","OLSA Mensuelle","OLSA Semestrielle","OLSA Annuelle","BJA Mensuelle","BJA Annuelle","Planning","Listes","Paramètres"],"not_rendered":{"charts":0,"images":12,"macros":1,"external_links":0,"defined_names":56,"comments":0,"pivot_tables":0},"unopened":[],"bounds":{"document_bytes":16777216,"sheet_cells":100000,"rows_first":2000,"rows_last":500,"rows_between":2000,"halvings":0,"cell_chars":16384,"cell_head_chars":4096},"cells_cut":0,"cells_raw":0,"read":"whole","date_system":"1900"}

{"sheet":"Accueil","index":0,"n_rows":4,"n_cols":3,"rows_kept":4,"cut":false,"hidden":false,"merged":[[2,2,2,6],[3,2,3,6]]}
[]
[]
[null,null,{"$f":"Raison_Sociale","v":",,,"}]
[null,null,{"$f":"Titre","v":"Demande d'intervention"}]

{"sheet":"Demande","index":1,"n_rows":15,"n_cols":10,"rows_kept":15,"cut":false,"hidden":false,"merged":[[0,0,0,5]]}
["Fichier demande d'intervention"]
[]
["Date","Demandeur","Priorité","Equipement","Problème rencontré","Observation",null,null,"CARACTERISTIQUE","CARACTERISTIQUE"]
["2016-08-03T10:05:46","BOUSQUIE Stéphane","Haute","MACEF NOIR","Problème de chauffe","aaaa"]
["2016-07-06T15:22:08","Adrien","Haute","MACEF  BLEU CLAIR","Vanne de vidange","sqsqsq"]
["2016-07-06T15:16:51","ETN","Haute","MACEF JAUNE","Vanne d'intro","zzdd"]
["2016-07-06T15:12:52","ETN","Haute","MACEF  BLEU CLAIR","Vanne de vidange","aaa"]
["2016-07-04T11:45:57","exemple","Faible","KALIX KX60","Le vide","vide"]
["2016-07-04T10:20:18","Adrien","Priorité","Equipement","Panne","qq"]
["2016-07-04T09:51:56","Demandeur","Priorité","Equipement","Panne","z"]
{"$rows_left_out":6}
{"sheet":"Rapport","index":2,"n_rows":15,"n_cols":9,"rows_kept":15,"cut":false,"hidden":false,"merged":[[0,0,0,5]]}
["Fichier de rapport d'intervention"]
[]
["Date","Demandeur","Priorité","Equipement","Observation technique","Etat",null,"CARACTERISTIQUE","CARACTERISTIQUE"]
["2016-08-03T10:05:46","BOUSQUIE Stéphane","Haute","MACEF NOIR"]
["2016-07-06T15:22:08","Adrien","Haute","MACEF  BLEU CLAIR","ssxxxx","Terminé"]
["2016-07-06T15:16:51","ETN","Haute","MACEF JAUNE"]
["2016-07-06T15:12:52","ETN","Haute","MACEF  BLEU CLAIR","aqqq","En cours"]
["2016-07-04T11:45:57","exemple","Faible","KALIX KX60","ok","En cours"]
["2016-07-04T10:20:18","Adrien","Priorité","Equipement","hhhhhhhhhhh","Terminé"]
["2016-07-04T09:51:56","Demandeur","Priorité","Equipement"]
{"$rows_left_out":6}
{"sheet":"Agenda","index":3,"n_rows":60,"n_cols":17,"rows_kept":60,"cut":false,"hidden":false,"merged":[[0,10,0,13],[2,1,2,7],[2,9,2,15],[12,1,12,7],[12,9,12,15],[5,17,6,19],[52,1,52,7],[52,9,52,15],[22,1,22,7],[22,9,22,15],[32,1,32,7],[32,9,32,15],[42,1,42,7],[42,9,42,15]]}
[null,null,null,null,null,null,"Préventif pour",null,null,null,2016]
[]
[null,"JANVIER",null,null,null,null,null,null,null,"FÉVRIER"]
[null,"L","M","M","J","V","S","D",null,"L","M","M","J","V","S","D"]
[null,{"$f":"IF(DAY(Jan_Dim1)=1,\"\",IF(AND(YEAR(Jan_Dim1+1)=Année_Calendaire,MONTH(Jan_Dim1+1)=1),Jan_Dim1+1,\"\"))","v":""},{"$f":"IF(DAY(Jan_Dim1)=1,\"\",IF(AND(YEAR(Jan_Dim1+2)=Année_Calendaire,MONTH(Jan_Dim1+2)=1),Jan_Dim1+2,\"\"))","v":""},{"$f":"IF(DAY(Jan_Dim1)=1,\"\",IF(AND(YEAR(Jan_Dim1+3)=Année_Calendaire,MONTH(Jan_Dim1+3)=1),Jan_Dim1+3,\"\"))","v":""},{"$f":"IF(DAY(Jan_Dim1)=1,\"\",IF(AND(YEAR(Jan_Dim1+4)=Année_Calendaire,MONTH(Jan_Dim1+4)=1),Jan_Dim1+4,\"\"))","v":""},{"$f":"IF(DAY(Jan_Dim1)=1,\"\",IF(AND(YEAR(Jan_Dim1+5)=Année_Calendaire,MONTH(Jan_Dim1+5)=1),Jan_Dim1+5,\"\"))","v":"2016-01-01"},{"$f":"IF(DAY(Jan_Dim1)=1,\"\",IF(AND(YEAR(Jan_Dim1+6)=Année_Calendaire,MONTH(Jan_Dim1+6)=1),Jan_Dim1+6,\"\"))","v":"2016-01-02"},{"$f":"IF(DAY(Jan_Dim1)=1,IF(AND(YEAR(Jan_Dim1)=Année_Calendaire,MONTH(Jan_Dim1)=1),Jan_Dim1,\"\"),IF(AND(YEAR(Jan_Dim1+7)=Année_Calendaire,MONTH(Jan_Dim1+7)=1),Jan_Dim1+7,\"\"))","v":"2016-01-03"},null,{"$f":"IF(DAY(Fév_Dim1)=1,\"\",IF(AND(YEAR(Fév_Dim1+1)=Année_Calendaire,MONTH(Fév_Dim1+1)=2),Fév_Dim1+1,\"\"))","v":"2016-02-01"},{"$f":"IF(DAY(Fév_Dim1)=1,\"\",IF(AND(YEAR(Fév_Dim1+2)=Année_Calendaire,MONTH(Fév_Dim1+2)=2),Fév_Dim1+2,\"\"))","v":"2016-02-02"},{"$f":"IF(DAY(Fév_Dim1)=1,\"\",IF(AND(YEAR(Fév_Dim1+3)=Année_Calendaire,MONTH(Fév_Dim1+3)=2),Fév_Dim1+3,\"\"))","v":"2016-02-03"},{"$f":"IF(DAY(Fév_Dim1)=1,\"\",IF(AND(YEAR(Fév_Dim1+4)=Année_Calendaire,MONTH(Fév_Dim1+4)=2),Fév_Dim1+4,\"\"))","v":"2016-02-04"},{"$f":"IF(DAY(Fév_Dim1)=1,\"\",IF(AND(YEAR(Fév_Dim1+5)=Année_Calendaire,MONTH(Fév_Dim1+5)=2),Fév_Dim1+5,\"\"))","v":"2016-02-05"},{"$f":"IF(DAY(Fév_Dim1)=1,\"\",IF(AND(YEAR(Fév_Dim1+6)=Année_Calendaire,MONTH(Fév_Dim1+6)=2),Fév_Dim1+6,\"\"))","v":"2016-02-06"},{"$f":"IF(DAY(Fév_Dim1)=1,IF(AND(YEAR(Fév_Dim1)=Année_Calendaire,MONTH(Fév_Dim1)=2),Fév_Dim1,\"\"),IF(AND(YEAR(Fév_Dim1+7)=Année_Calendaire,MONTH(Fév_Dim1+7)=2),Fév_Dim1+7,\"\"))","v":"2016-02-07"}]
[null,{"$f":"IF(DAY(Jan_Dim1)=1,IF(AND(YEAR(Jan_Dim1+1)=Année_Calendaire,MONTH(Jan_Dim1+1)=1),Jan_Dim1+1,\"\"),IF(AND(YEAR(Jan_Dim1+8)=Année_Calendaire,MONTH(Jan_Dim1+8)=1),Jan_Dim1+8,\"\"))","v":"2016-01-04"},{"$f":"IF(DAY(Jan_Dim1)=1,IF(AND(YEAR(Jan_Dim1+2)=Année_Calendaire,MONTH(Jan_Dim1+2)=1),Jan_Dim1+2,\"\"),IF(AND(YEAR(Jan_Dim1+9)=Année_Calendaire,MONTH(Jan_Dim1+9)=1),Jan_Dim1+9,\"\"))","v":"2016-01-05"},{"$f":"IF(DAY(Jan_Dim1)=1,IF(AND(YEAR(Jan_Dim1+3)=Année_Calendaire,MONTH(Jan_Dim1+3)=1),Jan_Dim1+3,\"\"),IF(AND(YEAR(Jan_Dim1+10)=Année_Calendaire,MONTH(Jan_Dim1+10)=1),Jan_Dim1+10,\"\"))","v":"2016-01-06"},{"$f":"IF(DAY(Jan_Dim1)=1,IF(AND(YEAR(Jan_Dim1+4)=Année_Calendaire,MONTH(Jan_Dim1+4)=1),Jan_Dim1+4,\"\"),IF(AND(YEAR(Jan_Dim1+11)=Année_Calendaire,MONTH(Jan_Dim1+11)=1),Jan_Dim1+11,\"\"))","v":"2016-01-07"},{"$f":"IF(DAY(Jan_Dim1)=1,IF(AND(YEAR(Jan_Dim1+5)=Année_Calendaire,MONTH(Jan_Dim1+5)=1),Jan_Dim1+5,\"\"),IF(AND(YEAR(Jan_Dim1+12)=Année_Calendaire,MONTH(Jan_Dim1+12)=1),Jan_Dim1+12,\"\"))","v":"2016-01-08"},{"$f":"IF(DAY(Jan_Dim1)=1,IF(AND(YEAR(Jan_Dim1+6)=Année_Calendaire,MONTH(Jan_Dim1+6)=1),Jan_Dim1+6,\"\"),IF(AND(YEAR(Jan_Dim1+13)=Année_Calendaire,MONTH(Jan_Dim1+13)=1),Jan_Dim1+13,\"\"))","v":"2016-01-09"},{"$f":"IF(DAY(Jan_Dim1)=1,IF(AND(YEAR(Jan_Dim1+7)=Année_Calendaire,MONTH(Jan_Dim1+7)=1),Jan_Dim1+7,\"\"),IF(AND(YEAR(Jan_Dim1+14)=Année_Calendaire,MONTH(Jan_Dim1+14)=1),Jan_Dim1+14,\"\"))","v":"2016-01-10"},null,{"$f":"IF(DAY(Fév_Dim1)=1,IF(AND(YEAR(Fév_Dim1+1)=Année_Calendaire,MONTH(Fév_Dim1+1)=2),Fév_Dim1+1,\"\"),IF(AND(YEAR(Fév_Dim1+8)=Année_Calendaire,MONTH(Fév_Dim1+8)=2),Fév_Dim1+8,\"\"))","v":"2016-02-08"},{"$f":"IF(DAY(Fév_Dim1)=1,IF(AND(YEAR(Fév_Dim1+2)=Année_Calendaire,MONTH(Fév_Dim1+2)=2),Fév_Dim1+2,\"\"),IF(AND(YEAR(Fév_Dim1+9)=Année_Calendaire,MONTH(Fév_Dim1+9)=2),Fév_Dim1+9,\"\"))","v":"2016-02-09"},{"$f":"IF(DAY(Fév_Dim1)=1,IF(AND(YEAR(Fév_Dim1+3)=Année_Calendaire,MONTH(Fév_Dim1+3)=2),Fév_Dim1+3,\"\"),IF(AND(YEAR(Fév_Dim1+10)=Année_Calendaire,MONTH(Fév_Dim1+10)=2),Fév_Dim1+10,\"\"))","v":"2016-02-10"},{"$f":"IF(DAY(Fév_Dim1)=1,IF(AND(YEAR(Fév_Dim1+4)=Année_Calendaire,MONTH(Fév_Dim1+4)=2),Fév_Dim1+4,\"\"),IF(AND(YEAR(Fév_Dim1+11)=Année_Calendaire,MONTH(Fév_Dim1+11)=2),Fév_Dim1+11,\"\"))","v":"2016-02-11"},{"$f":"IF(DAY(Fév_Dim1)=1,IF(AND(YEAR(Fév_Dim1+5)=Année_Calendaire,MONTH(Fév_Dim1+5)=2),Fév_Dim1+5,\"\"),IF(AND(YEAR(Fév_Dim1+12)=Année_Calendaire,MONTH(Fév_Dim1+12)=2),Fév_Dim1+12,\"\"))","v":"2016-02-12"},{"$f":"IF(DAY(Fév_Dim1)=1,IF(AND(YEAR(Fév_Dim1+6)=Année_Calendaire,MONTH(Fév_Dim1+6)=2),Fév_Dim1+6,\"\"),IF(AND(YEAR(Fév_Dim1+13)=Année_Calendaire,MONTH(Fév_Dim1+13)=2),Fév_Dim1+13,\"\"))","v":"2016-02-13"},{"$f":"IF(DAY(Fév_Dim1)=1,IF(AND(YEAR(Fév_Dim1+7)=Année_Calendaire,MONTH(Fév_Dim1+7)=2),Fév_Dim1+7,\"\"),IF(AND(YEAR(Fév_Dim1+14)=Année_Calendaire,MONTH(Fév_Dim1+14)=2),Fév_Dim1+14,\"\"))","v":"2016-02-14"}]
[null,{"$f":"IF(DAY(Jan_Dim1)=1,IF(AND(YEAR(Jan_Dim1+8)=Année_Calendaire,MONTH(Jan_Dim1+8)=1),Jan_Dim1+8,\"\"),IF(AND(YEAR(Jan_Dim1+15)=Année_Calendaire,MONTH(Jan_Dim1+15)=1),Jan_Dim1+15,\"\"))","v":"2016-01-11"},{"$f":"IF(DAY(Jan_Dim1)=1,IF(AND(YEAR(Jan_Dim1+9)=Année_Calendaire,MONTH(Jan_Dim1+9)=1),Jan_Dim1+9,\"\"),IF(AND(YEAR(Jan_Dim1+16)=Année_Calendaire,MONTH(Jan_Dim1+16)=1),Jan_Dim1+16,\"\"))","v":"2016-01-12"},{"$f":"IF(DAY(Jan_Dim1)=1,IF(AND(YEAR(Jan_Dim1+10)=Année_Calendaire,MONTH(Jan_Dim1+10)=1),Jan_Dim1+10,\"\"),IF(AND(YEAR(Jan_Dim1+17)=Année_Calendaire,MONTH(Jan_Dim1+17)=1),Jan_Dim1+17,\"\"))","v":"2016-01-13"},{"$f":"IF(DAY(Jan_Dim1)=1,IF(AND(YEAR(Jan_Dim1+11)=Année_Calendaire,MONTH(Jan_Dim1+11)=1),Jan_Dim1+11,\"\"),IF(AND(YEAR(Jan_Dim1+18)=Année_Calendaire,MONTH(Jan_Dim1+18)=1),Jan_Dim1+18,\"\"))","v":"2016-01-14"},{"$f":"IF(DAY(Jan_Dim1)=1,IF(AND(YEAR(Jan_Dim1+12)=Année_Calendaire,MONTH(Jan_Dim1+12)=1),Jan_Dim1+12,\"\"),IF(AND(YEAR(Jan_Dim1+19)=Année_Calendaire,MONTH(Jan_Dim1+19)=1),Jan_Dim1+19,\"\"))","v":"2016-01-15"},{"$f":"IF(DAY(Jan_Dim1)=1,IF(AND(YEAR(Jan_Dim1+13)=Année_Calendaire,MONTH(Jan_Dim1+13)=1),Jan_Dim1+13,\"\"),IF(AND(YEAR(Jan_Dim1+20)=Année_Calendaire,MONTH(Jan_Dim1+20)=1),Jan_Dim1+20,\"\"))","v":"2016-01-16"},{"$f":"IF(DAY(Jan_Dim1)=1,IF(AND(YEAR(Jan_Dim1+14)=Année_Calendaire,MONTH(Jan_Dim1+14)=1),Jan_Dim1+14,\"\"),IF(AND(YEAR(Jan_Dim1+21)=Année_Calendaire,MONTH(Jan_Dim1+21)=1),Jan_Dim1+21,\"\"))","v":"2016-01-17"},null,{"$f":"IF(DAY(Fév_Dim1)=1,IF(AND(YEAR(Fév_Dim1+8)=Année_Calendaire,MONTH(Fév_Dim1+8)=2),Fév_Dim1+8,\"\"),IF(AND(YEAR(Fév_Dim1+15)=Année_Calendaire,MONTH(Fév_Dim1+15)=2),Fév_Dim1+15,\"\"))","v":"2016-02-15"},{"$f":"IF(DAY(Fév_Dim1)=1,IF(AND(YEAR(Fév_Dim1+9)=Année_Calendaire,MONTH(Fév_Dim1+9)=2),Fév_Dim1+9,\"\"),IF(AND(YEAR(Fév_Dim1+16)=Année_Calendaire,MONTH(Fév_Dim1+16)=2),Fév_Dim1+16,\"\"))","v":"2016-02-16"},{"$f":"IF(DAY(Fév_Dim1)=1,IF(AND(YEAR(Fév_Dim1+10)=Année_Calendaire,MONTH(Fév_Dim1+10)=2),Fév_Dim1+10,\"\"),IF(AND(YEAR(Fév_Dim1+17)=Année_Calendaire,MONTH(Fév_Dim1+17)=2),Fév_Dim1+17,\"\"))","v":"2016-02-17"},{"$f":"IF(DAY(Fév_Dim1)=1,IF(AND(YEAR(Fév_Dim1+11)=Année_Calendaire,MONTH(Fév_Dim1+11)=2),Fév_Dim1+11,\"\"),IF(AND(YEAR(Fév_Dim1+18)=Année_Calendaire,MONTH(Fév_Dim1+18)=2),Fév_Dim1+18,\"\"))","v":"2016-02-18"},{"$f":"IF(DAY(Fév_Dim1)=1,IF(AND(YEAR(Fév_Dim1+12)=Année_Calendaire,MONTH(Fév_Dim1+12)=2),Fév_Dim1+12,\"\"),IF(AND(YEAR(Fév_Dim1+19)=Année_Calendaire,MONTH(Fév_Dim1+19)=2),Fév_Dim1+19,\"\"))","v":"2016-02-19"},{"$f":"IF(DAY(Fév_Dim1)=1,IF(AND(YEAR(Fév_Dim1+13)=Année_Calendaire,MONTH(Fév_Dim1+13)=2),Fév_Dim1+13,\"\"),IF(AND(YEAR(Fév_Dim1+20)=Année_Calendaire,MONTH(Fév_Dim1+20)=2),Fév_Dim1+20,\"\"))","v":"2016-02-20"},{"$f":"IF(DAY(Fév_Dim1)=1,IF(AND(YEAR(Fév_Dim1+14)=Année_Calendaire,MONTH(Fév_Dim1+14)=2),Fév_Dim1+14,\"\"),IF(AND(YEAR(Fév_Dim1+21)=Année_Calendaire,MONTH(Fév_Dim1+21)=2),Fév_Dim1+21,\"\"))","v":"2016-02-21"}]
[null,{"$f":"IF(DAY(Jan_Dim1)=1,IF(AND(YEAR(Jan_Dim1+15)=Année_Calendaire,MONTH(Jan_Dim1+15)=1),Jan_Dim1+15,\"\"),IF(AND(YEAR(Jan_Dim1+22)=Année_Calendaire,MONTH(Jan_Dim1+22)=1),Jan_Dim1+22,\"\"))","v":"2016-01-18"},{"$f":"IF(DAY(Jan_Dim1)=1,IF(AND(YEAR(Jan_Dim1+16)=Année_Calendaire,MONTH(Jan_Dim1+16)=1),Jan_Dim1+16,\"\"),IF(AND(YEAR(Jan_Dim1+23)=Année_Calendaire,MONTH(Jan_Dim1+23)=1),Jan_Dim1+23,\"\"))","v":"2016-01-19"},{"$f":"IF(DAY(Jan_Dim1)=1,IF(AND(YEAR(Jan_Dim1+17)=Année_Calendaire,MONTH(Jan_Dim1+17)=1),Jan_Dim1+17,\"\"),IF(AND(YEAR(Jan_Dim1+24)=Année_Calendaire,MONTH(Jan_Dim1+24)=1),Jan_Dim1+24,\"\"))","v":"2016-01-20"},{"$f":"IF(DAY(Jan_Dim1)=1,IF(AND(YEAR(Jan_Dim1+18)=Année_Calendaire,MONTH(Jan_Dim1+18)=1),Jan_Dim1+18,\"\"),IF(AND(YEAR(Jan_Dim1+25)=Année_Calendaire,MONTH(Jan_Dim1+25)=1),Jan_Dim1+25,\"\"))","v":"2016-01-21"},{"$f":"IF(DAY(Jan_Dim1)=1,IF(AND(YEAR(Jan_Dim1+19)=Année_Calendaire,MONTH(Jan_Dim1+19)=1),Jan_Dim1+19,\"\"),IF(AND(YEAR(Jan_Dim1+26)=Année_Calendaire,MONTH(Jan_Dim1+26)=1),Jan_Dim1+26,\"\"))","v":"2016-01-22"},{"$f":"IF(DAY(Jan_Dim1)=1,IF(AND(YEAR(Jan_Dim1+20)=Année_Calendaire,MONTH(Jan_Dim1+20)=1),Jan_Dim1+20,\"\"),IF(AND(YEAR(Jan_Dim1+27)=Année_Calendaire,MONTH(Jan_Dim1+27)=1),Jan_Dim1+27,\"\"))","v":"2016-01-23"},{"$f":"IF(DAY(Jan_Dim1)=1,IF(AND(YEAR(Jan_Dim1+21)=Année_Calendaire,MONTH(Jan_Dim1+21)=1),Jan_Dim1+21,\"\"),IF(AND(YEAR(Jan_Dim1+28)=Année_Calendaire,MONTH(Jan_Dim1+28)=1),Jan_Dim1+28,\"\"))","v":"2016-01-24"},null,{"$f":"IF(DAY(Fév_Dim1)=1,IF(AND(YEAR(Fév_Dim1+15)=Année_Calendaire,MONTH(Fév_Dim1+15)=2),Fév_Dim1+15,\"\"),IF(AND(YEAR(Fév_Dim1+22)=Année_Calendaire,MONTH(Fév_Dim1+22)=2),Fév_Dim1+22,\"\"))","v":"2016-02-22"},{"$f":"IF(DAY(Fév_Dim1)=1,IF(AND(YEAR(Fév_Dim1+16)=Année_Calendaire,MONTH(Fév_Dim1+16)=2),Fév_Dim1+16,\"\"),IF(AND(YEAR(Fév_Dim1+23)=Année_Calendaire,MONTH(Fév_Dim1+23)=2),Fév_Dim1+23,\"\"))","v":"2016-02-23"},{"$f":"IF(DAY(Fév_Dim1)=1,IF(AND(YEAR(Fév_Dim1+17)=Année_Calendaire,MONTH(Fév_Dim1+17)=2),Fév_Dim1+17,\"\"),IF(AND(YEAR(Fév_Dim1+24)=Année_Calendaire,MONTH(Fév_Dim1+24)=2),Fév_Dim1+24,\"\"))","v":"2016-02-24"},{"$f":"IF(DAY(Fév_Dim1)=1,IF(AND(YEAR(Fév_Dim1+18)=Année_Calendaire,MONTH(Fév_Dim1+18)=2),Fév_Dim1+18,\"\"),IF(AND(YEAR(Fév_Dim1+25)=Année_Calendaire,MONTH(Fév_Dim1+25)=2),Fév_Dim1+25,\"\"))","v":"2016-02-25"},{"$f":"IF(DAY(Fév_Dim1)=1,IF(AND(YEAR(Fév_Dim1+19)=Année_Calendaire,MONTH(Fév_Dim1+19)=2),Fév_Dim1+19,\"\"),IF(AND(YEAR(Fév_Dim1+26)=Année_Calendaire,MONTH(Fév_Dim1+26)=2),Fév_Dim1+26,\"\"))","v":"2016-02-26"},{"$f":"IF(DAY(Fév_Dim1)=1,IF(AND(YEAR(Fév_Dim1+20)=Année_Calendaire,MONTH(Fév_Dim1+20)=2),Fév_Dim1+20,\"\"),IF(AND(YEAR(Fév_Dim1+27)=Année_Calendaire,MONTH(Fév_Dim1+27)=2),Fév_Dim1+27,\"\"))","v":"2016-02-27"},{"$f":"IF(DAY(Fév_Dim1)=1,IF(AND(YEAR(Fév_Dim1+21)=Année_Calendaire,MONTH(Fév_Dim1+21)=2),Fév_Dim1+21,\"\"),IF(AND(YEAR(Fév_Dim1+28)=Année_Calendaire,MONTH(Fév_Dim1+28)=2),Fév_Dim1+28,\"\"))","v":"2016-02-28"}]
[null,{"$f":"IF(DAY(Jan_Dim1)=1,IF(AND(YEAR(Jan_Dim1+22)=Année_Calendaire,MONTH(Jan_Dim1+22)=1),Jan_Dim1+22,\"\"),IF(AND(YEAR(Jan_Dim1+29)=Année_Calendaire,MONTH(Jan_Dim1+29)=1),Jan_Dim1+29,\"\"))","v":"2016-01-25"},{"$f":"IF(DAY(Jan_Dim1)=1,IF(AND(YEAR(Jan_Dim1+23)=Année_Calendaire,MONTH(Jan_Dim1+23)=1),Jan_Dim1+23,\"\"),IF(AND(YEAR(Jan_Dim1+30)=Année_Calendaire,MONTH(Jan_Dim1+30)=1),Jan_Dim1+30,\"\"))","v":"2016-01-26"},{"$f":"IF(DAY(Jan_Dim1)=1,IF(AND(YEAR(Jan_Dim1+24)=Année_Calendaire,MONTH(Jan_Dim1+24)=1),Jan_Dim1+24,\"\"),IF(AND(YEAR(Jan_Dim1+31)=Année_Calendaire,MONTH(Jan_Dim1+31)=1),Jan_Dim1+31,\"\"))","v":"2016-01-27"},{"$f":"IF(DAY(Jan_Dim1)=1,IF(AND(YEAR(Jan_Dim1+25)=Année_Calendaire,MONTH(Jan_Dim1+25)=1),Jan_Dim1+25,\"\"),IF(AND(YEAR(Jan_Dim1+32)=Année_Calendaire,MONTH(Jan_Dim1+32)=1),Jan_Dim1+32,\"\"))","v":"2016-01-28"},{"$f":"IF(DAY(Jan_Dim1)=1,IF(AND(YEAR(Jan_Dim1+26)=Année_Calendaire,MONTH(Jan_Dim1+26)=1),Jan_Dim1+26,\"\"),IF(AND(YEAR(Jan_Dim1+33)=Année_Calendaire,MONTH(Jan_Dim1+33)=1),Jan_Dim1+33,\"\"))","v":"2016-01-29"},{"$f":"IF(DAY(Jan_Dim1)=1,IF(AND(YEAR(Jan_Dim1+27)=Année_Calendaire,MONTH(Jan_Dim1+27)=1),Jan_Dim1+27,\"\"),IF(AND(YEAR(Jan_Dim1+34)=Année_Calendaire,MONTH(Jan_Dim1+34)=1),Jan_Dim1+34,\"\"))","v":"2016-01-30"},{"$f":"IF(DAY(Jan_Dim1)=1,IF(AND(YEAR(Jan_Dim1+28)=Année_Calendaire,MONTH(Jan_Dim1+28)=1),Jan_Dim1+28,\"\"),IF(AND(YEAR(Jan_Dim1+35)=Année_Calendaire,MONTH(Jan_Dim1+35)=1),Jan_Dim1+35,\"\"))","v":"2016-01-31"},null,{"$f":"IF(DAY(Fév_Dim1)=1,IF(AND(YEAR(Fév_Dim1+22)=Année_Calendaire,MONTH(Fév_Dim1+22)=2),Fév_Dim1+22,\"\"),IF(AND(YEAR(Fév_Dim1+29)=Année_Calendaire,MONTH(Fév_Dim1+29)=2),Fév_Dim1+29,\"\"))","v":"2016-02-29"},{"$f":"IF(DAY(Fév_Dim1)=1,IF(AND(YEAR(Fév_Dim1+23)=Année_Calendaire,MONTH(Fév_Dim1+23)=2),Fév_Dim1+23,\"\"),IF(AND(YEAR(Fév_Dim1+30)=Année_Calendaire,MONTH(Fév_Dim1+30)=2),Fév_Dim1+30,\"\"))","v":""},{"$f":"IF(DAY(Fév_Dim1)=1,IF(AND(YEAR(Fév_Dim1+24)=Année_Calendaire,MONTH(Fév_Dim1+24)=2),Fév_Dim1+24,\"\"),IF(AND(YEAR(Fév_Dim1+31)=Année_Calendaire,MONTH(Fév_Dim1+31)=2),Fév_Dim1+31,\"\"))","v":""},{"$f":"IF(DAY(Fév_Dim1)=1,IF(AND(YEAR(Fév_Dim1+25)=Année_Calendaire,MONTH(Fév_Dim1+25)=2),Fév_Dim1+25,\"\"),IF(AND(YEAR(Fév_Dim1+32)=Année_Calendaire,MONTH(Fév_Dim1+32)=2),Fév_Dim1+32,\"\"))","v":""},{"$f":"IF(DAY(Fév_Dim1)=1,IF(AND(YEAR(Fév_Dim1+26)=Année_Calendaire,MONTH(Fév_Dim1+26)=2),Fév_Dim1+26,\"\"),IF(AND(YEAR(Fév_Dim1+33)=Année_Calendaire,MONTH(Fév_Dim1+33)=2),Fév_Dim1+33,\"\"))","v":""},{"$f":"IF(DAY(Fév_Dim1)=1,IF(AND(YEAR(Fév_Dim1+27)=Année_Calendaire,MONTH(Fév_Dim1+27)=2),Fév_Dim1+27,\"\"),IF(AND(YEAR(Fév_Dim1+34)=Année_Calendaire,MONTH(Fév_Dim1+34)=2),Fév_Dim1+34,\"\"))","v":""},{"$f":"IF(DAY(Fév_Dim1)=1,IF(AND(YEAR(Fév_Dim1+28)=Année_Calendaire,MONTH(Fév_Dim1+28)=2),Fév_Dim1+28,\"\"),IF(AND(YEAR(Fév_Dim1+35)=Année_Calendaire,MONTH(Fév_Dim1+35)=2),Fév_Dim1+35,\"\"))","v":""}]
[null,{"$f":"IF(DAY(Jan_Dim1)=1,IF(AND(YEAR(Jan_Dim1+29)=Année_Calendaire,MONTH(Jan_Dim1+29)=1),Jan_Dim1+29,\"\"),IF(AND(YEAR(Jan_Dim1+36)=Année_Calendaire,MONTH(Jan_Dim1+36)=1),Jan_Dim1+36,\"\"))","v":""},{"$f":"IF(DAY(Jan_Dim1)=1,IF(AND(YEAR(Jan_Dim1+30)=Année_Calendaire,MONTH(Jan_Dim1+30)=1),Jan_Dim1+30,\"\"),IF(AND(YEAR(Jan_Dim1+37)=Année_Calendaire,MONTH(Jan_Dim1+37)=1),Jan_Dim1+37,\"\"))","v":""},{"$f":"IF(DAY(Jan_Dim1)=1,IF(AND(YEAR(Jan_Dim1+31)=Année_Calendaire,MONTH(Jan_Dim1+31)=1),Jan_Dim1+31,\"\"),IF(AND(YEAR(Jan_Dim1+38)=Année_Calendaire,MONTH(Jan_Dim1+38)=1),Jan_Dim1+38,\"\"))","v":""},{"$f":"IF(DAY(Jan_Dim1)=1,IF(AND(YEAR(Jan_Dim1+32)=Année_Calendaire,MONTH(Jan_Dim1+32)=1),Jan_Dim1+32,\"\"),IF(AND(YEAR(Jan_Dim1+39)=Année_Calendaire,MONTH(Jan_Dim1+39)=1),Jan_Dim1+39,\"\"))","v":""},{"$f":"IF(DAY(Jan_Dim1)=1,IF(AND(YEAR(Jan_Dim1+33)=Année_Calendaire,MONTH(Jan_Dim1+33)=1),Jan_Dim1+33,\"\"),IF(AND(YEAR(Jan_Dim1+40)=Année_Calendaire,MONTH(Jan_Dim1+40)=1),Jan_Dim1+40,\"\"))","v":""},{"$f":"IF(DAY(Jan_Dim1)=1,IF(AND(YEAR(Jan_Dim1+34)=Année_Calendaire,MONTH(Jan_Dim1+34)=1),Jan_Dim1+34,\"\"),IF(AND(YEAR(Jan_Dim1+41)=Année_Calendaire,MONTH(Jan_Dim1+41)=1),Jan_Dim1+41,\"\"))","v":""},{"$f":"IF(DAY(Jan_Dim1)=1,IF(AND(YEAR(Jan_Dim1+35)=Année_Calendaire,MONTH(Jan_Dim1+35)=1),Jan_Dim1+35,\"\"),IF(AND(YEAR(Jan_Dim1+42)=Année_Calendaire,MONTH(Jan_Dim1+42)=1),Jan_Dim1+42,\"\"))","v":""},null,{"$f":"IF(DAY(Fév_Dim1)=1,IF(AND(YEAR(Fév_Dim1+29)=Année_Calendaire,MONTH(Fév_Dim1+29)=2),Fév_Dim1+29,\"\"),IF(AND(YEAR(Fév_Dim1+36)=Année_Calendaire,MONTH(Fév_Dim1+36)=2),Fév_Dim1+36,\"\"))","v":""},{"$f":"IF(DAY(Fév_Dim1)=1,IF(AND(YEAR(Fév_Dim1+30)=Année_Calendaire,MONTH(Fév_Dim1+30)=2),Fév_Dim1+30,\"\"),IF(AND(YEAR(Fév_Dim1+37)=Année_Calendaire,MONTH(Fév_Dim1+37)=2),Fév_Dim1+37,\"\"))","v":""},{"$f":"IF(DAY(Fév_Dim1)=1,IF(AND(YEAR(Fév_Dim1+31)=Année_Calendaire,MONTH(Fév_Dim1+31)=2),Fév_Dim1+31,\"\"),IF(AND(YEAR(Fév_Dim1+38)=Année_Calendaire,MONTH(Fév_Dim1+38)=2),Fév_Dim1+38,\"\"))","v":""},{"$f":"IF(DAY(Fév_Dim1)=1,IF(AND(YEAR(Fév_Dim1+32)=Année_Calendaire,MONTH(Fév_Dim1+32)=2),Fév_Dim1+32,\"\"),IF(AND(YEAR(Fév_Dim1+39)=Année_Calendaire,MONTH(Fév_Dim1+39)=2),Fév_Dim1+39,\"\"))","v":""},{"$f":"IF(DAY(Fév_Dim1)=1,IF(AND(YEAR(Fév_Dim1+33)=Année_Calendaire,MONTH(Fév_Dim1+33)=2),Fév_Dim1+33,\"\"),IF(AND(YEAR(Fév_Dim1+40)=Année_Calendaire,MONTH(Fév_Dim1+40)=2),Fév_Dim1+40,\"\"))","v":""},{"$f":"IF(DAY(Fév_Dim1)=1,IF(AND(YEAR(Fév_Dim1+34)=Année_Calendaire,MONTH(Fév_Dim1+34)=2),Fév_Dim1+34,\"\"),IF(AND(YEAR(Fév_Dim1+41)=Année_Calendaire,MONTH(Fév_Dim1+41)=2),Fév_Dim1+41,\"\"))","v":""},{"$f":"IF(DAY(Fév_Dim1)=1,IF(AND(YEAR(Fév_Dim1+35)=Année_Calendaire,MONTH(Fév_Dim1+35)=2),Fév_Dim1+35,\"\"),IF(AND(YEAR(Fév_Dim1+42)=Année_Calendaire,MONTH(Fév_Dim1+42)=2),Fév_Dim1+42,\"\"))","v":""}]
{"$rows_left_out":51}
{"sheet":"OLSA Mensuelle","index":4,"n_rows":1,"n_cols":2,"rows_kept":1,"cut":false,"hidden":false,"merged":[[0,1,0,16],[1,1,48,8],[1,9,48,16]]}
[null,"MAINTENANCE PREVENTIVE MENSUELLE MACEF "]

{"sheet":"OLSA Semestrielle","index":5,"n_rows":1,"n_cols":2,"rows_kept":1,"cut":false,"hidden":false,"merged":[[0,1,0,16],[1,1,48,8],[1,9,48,16]]}
[null,"MAINTENANCE PREVENTIVE Semestrielle MACEF "]

{"sheet":"OLSA Annuelle","index":6,"n_rows":1,"n_cols":2,"rows_kept":1,"cut":false,"hidden":false,"merged":[[0,1,0,32],[1,1,48,8],[1,9,48,16],[1,17,48,24],[1,25,48,32]]}
[null,"MAINTENANCE PREVENTIVE ANNUELLE MACEF "]

{"sheet":"BJA Mensuelle","index":7,"n_rows":1,"n_cols":2,"rows_kept":1,"cut":false,"hidden":false,"merged":[[1,1,48,8],[0,1,0,8]]}
[null,"MAINTENANCE PREVENTIVE MENSUELLE BJA"]

{"sheet":"BJA Annuelle","index":8,"n_rows":1,"n_cols":2,"rows_kept":1,"cut":false,"hidden":false,"merged":[[1,1,48,8],[1,9,48,16],[0,1,0,16]]}
[null,"MAINTENANCE PREVENTIVE ANNUELLE BJA"]

{"sheet":"Planning","index":9,"n_rows":15,"n_cols":14,"rows_kept":15,"cut":false,"hidden":false,"merged":[[0,1,0,13],[11,1,11,13],[12,1,14,1],[12,2,12,4],[13,2,13,4],[14,2,14,4]]}
[null,"PLANNING MAINTENANCE EQUIPEMENTS FABRICATION"]
[null,null,"Janvier","Février","Mars","Avril","Mai","Juin","Juillet","Août","Septembre","Octobre","Novembre","Décembre"]
[null,"BJA","Annuelle","Mensuelle","Mensuelle","Mensuelle","Mensuelle","Mensuelle","Mensuelle","Mensuelle","Mensuelle","Mensuelle","Mensuelle","Mensuelle"]
[null,"MACEF 100L ROUGE","Annuelle","Mensuelle","Mensuelle","Mensuelle","Mensuelle","Mensuelle","Semestrielle","Mensuelle","Mensuelle","Mensuelle","Mensuelle","Mensuelle"]
[null,"MACEF 50L NOIR","Annuelle","Mensuelle","Mensuelle","Mensuelle","Mensuelle","Mensuelle","Semestrielle","Mensuelle","Mensuelle","Mensuelle","Mensuelle","Mensuelle"]
[null,"MACEF 50L VIOLETTE","Mensuelle","Annuelle","Mensuelle","Mensuelle","Mensuelle","Mensuelle","Mensuelle","Semestrielle","Mensuelle","Mensuelle","Mensuelle","Mensuelle"]
[null,"MACEF 50L GRISE","Mensuelle","Annuelle","Mensuelle","Mensuelle","Mensuelle","Mensuelle","Mensuelle","Semestrielle","Mensuelle","Mensuelle","Mensuelle","Mensuelle"]
[null,"MACEF 50L MARINE","Mensuelle","Annuelle","Mensuelle","Mensuelle","Mensuelle","Mensuelle","Mensuelle","Semestrielle","Mensuelle","Mensuelle","Mensuelle","Mensuelle"]
[null,"MACEF 100 L CIEL","Mensuelle","Mensuelle","Annuelle","Mensuelle","Mensuelle","Mensuelle","Mensuelle","Mensuelle","Semestrielle","Mensuelle","Mensuelle","Mensuelle"]
[null,"MACEF 100 L PEPPER","Mensuelle","Mensuelle","Annuelle","Mensuelle","Mensuelle","Mensuelle","Mensuelle","Mensuelle","Semestrielle","Mensuelle","Mensuelle","Mensuelle"]
{"$rows_left_out":6}
{"sheet":"Listes","index":10,"n_rows":71,"n_cols":13,"rows_kept":71,"cut":false,"hidden":false,"merged":[]}
["Fchier des techniciens"]
[]
["Demandeur",null,null,"Priorité",null,null,"Equipement",null,null,"Etat",null,null,"Panne"]
["BELLI Karim",null,null,"Haute",null,null,"MACEF  BLEU CLAIR",null,null,"En cours",null,null,"Vanne de vidange"]
["BERAHA Corinne",null,null,"Moyenne",null,null,"MACEF JAUNE",null,null,"Terminé",null,null,"Vanne d'intro"]
["BOUSQUIE Stéphane",null,null,"Faible",null,null,"MACEF MARINE",null,null,null,null,null,"Le vide"]
["CAUWEL Séverine",null,null,null,null,null,"MACEF MELON",null,null,null,null,null,"Problème de chauffe"]
["EL AZZAOUI Morad",null,null,null,null,null,"MACEF NOIR",null,null,null,null,null,"Problème de refroidissement"]
["GODEFROID Nathalie",null,null,null,null,null,"MACEF PEPRMINT",null,null,null,null,null,"Joint de dome"]
["LEGRIS Aurelie",null,null,null,null,null,"MACEF ROUGE",null,null,null,null,null,"Essuie glace"]
{"$rows_left_out":62}
{"sheet":"Paramètres","index":11,"n_rows":18,"n_cols":3,"rows_kept":18,"cut":false,"hidden":false,"merged":[]}
["Raison sociale",",,,"]
["Titre","Demande d'intervention"]
["Cellule de Panne :",{"$f":"VLOOKUP(Listes!M4,Tableau5[[#All],[Panne]],1,FALSE)","v":"Vanne de vidange"}]
["Cellule de travail :",{"$f":"VLOOKUP(\"\", Liste_Demandeur,1,FALSE)","v":{"$error":"#N/A"}}]
["Cellule de pièce :",{"$f":"IFERROR(VLOOKUP(\"3333\", Pièces,5,FALSE), \"\")","v":""}]
["Cellule de priorité",{"$f":"VLOOKUP(\"\", Liste_Priorité,1,FALSE)","v":{"$error":"#N/A"}}]
["Cellule d'Equipement",{"$f":"VLOOKUP(\"\", Liste_Equipement,1,FALSE)","v":{"$error":"#N/A"}}]
["Cellule demandeur",{"$f":"VLOOKUP(Listes!A4,Tableau2[[#All],[Demandeur]],1,FALSE)","v":"BELLI Karim"}]
["Pièce","Référence",{"$f":"IFERROR(MATCH(VD_Pièce,Liste_Pièces,0)-1,0)","v":0}]
["Fournisseur","Libellé",{"$f":"IFERROR(MATCH(VD_Fournisseur,Liste_Fournisseurs,0)-1,0)","v":0}]
{"$rows_left_out":8}