{"text_format":"1","workbook":"xlsx","n_sheets":13,"sheets":["Aide","TCD","stock","Accueil","Produit","REF","Feuil2","initiales","Feuil3","Feuil5","Empl.","Feuil6","InvenT"],"not_rendered":{"charts":0,"images":29,"macros":1,"external_links":0,"defined_names":10,"comments":0,"pivot_tables":1},"unopened":[],"bounds":{"document_bytes":16777216,"sheet_cells":100000,"rows_first":2000,"rows_last":500,"rows_between":2000,"halvings":0,"cell_chars":16384,"cell_head_chars":4096},"cells_cut":0,"cells_raw":0,"read":"whole","date_system":"1900"}

{"sheet":"Aide","index":0,"n_rows":0,"n_cols":0,"rows_kept":0,"cut":false,"hidden":false,"merged":[[4,6,38,16]]}

{"sheet":"TCD","index":1,"n_rows":115,"n_cols":3,"rows_kept":115,"cut":false,"hidden":false,"merged":[]}
[]
[]
["Row Labels","Sum of Quantité","Sum of Palette"]
[0,0,0]
[0,0,0]
["(blank)"]
["//",0,8]
["//",0,8]
["abricot 1 kg",272,6]
[250,200,4]
[252,72,2]
["biscottes",480,10]
[284,240,5]
[289,96,2]
[291,48,1]
[314,96,2]
["bouchée",2361,1]
[312,46,1]
[317,2315,0]
["café",579,12]
{"$rows_left_out":96}
{"sheet":"stock","index":2,"n_rows":372,"n_cols":22,"rows_kept":372,"cut":false,"hidden":false,"merged":[]}
["EMPL.","Référence","Produit","Code","Date","Palette","Quantité",null,"ALERTE PEREMPTION","JOURS RESTANTS",90,30,0,100,null,268,97,365,null,{"$f":"TODAY()","v":"2016-09-02"}]
["A.1.0",3,"biscottes",314,"2017-01-09",1,48,{"$f":"E2-T1","v":129},{"$f":"IF(K2=90,\"ATTENTION MOINS DE 3 MOIS\",IF(L2=30,\"ATTENTION MOINS DE 30 JOURS\",IF(M2=0,\"PERIME!!!\",\"OK\")))","v":"OK"},{"$f":"E2-T1","v":129},{"$f":"IF(AND(J2<=90,J2>30),90,\"\")","v":""},{"$f":"IF(AND(J2<=30,J2>0),30,\"\")","v":""},{"$f":"IF(J2<=0,0,\"\")","v":""},{"$f":"IF(J2>90,\"n\",\"\")","v":"n"},null,null,null,null,null,null,"Agrilait sel (Coralis)",{"$f":"COUNTIF(C2:C372,\"*Agrilait sel*\")","v":0}]
["A.1.1",3,"biscottes",314,"2017-01-09",1,48,{"$f":"E3-T1","v":129},"OK",{"$f":"E3-T1","v":129},{"$f":"IF(AND(J3<=90,J3>30),90,\"\")","v":""},{"$f":"IF(AND(J3<=30,J3>0),30,\"\")","v":""},{"$f":"IF(J3<=0,0,\"b\")","v":"b"},{"$f":"IF(J3>90,\"n\",\"\")","v":"n"},null,null,null,null,null,null,"//",{"$f":"COUNTIF(C2:C372,\"*//*\")","v":97}]
["A.1.2",28,"céleri",260,"2016-11-16",1,55,{"$f":"E4-T1","v":75},"ATTENTION MOINS DE 3 MOIS",{"$f":"E4-T1","v":75},90,"",{"$f":"IF(J4<=0,0,\"b\")","v":"b"},"",null,null,null,null,null,null,"AOP Ovale dx lotx2",{"$f":"COUNTIF(C2:C372,\"*AOP ovale*\")","v":0}]
["A.1.3",20,"farine ",261,"2016-11-17",1,50,{"$f":"E5-T1","v":76},"ATTENTION MOINS DE 3 MOIS",{"$f":"E5-T1","v":76},90,"","b","",null,null,null,null,null,null,"AOP dx 5kg",{"$f":"COUNTIF(C2:C372,\"*AOP dx 5kg*\")","v":0}]
["A.2.0",20,"farine ",261,"2016-11-17",1,50,{"$f":"E6-T1","v":76},"ATTENTION MOINS DE 3 MOIS",{"$f":" E6-T1","v":76},90,{"$f":"IF(AND(J6<=30,J6>0),30,\"\")","v":""},{"$f":"IF(J6<=0,0,20)","v":20},"",null,null,null,null,null,null,"AOP dx 10kg",{"$f":"COUNTIF(C2:C372,\"*AOP dx 10kg\")","v":0}]
["A.2.1","//","//","//","//","//",0,{"$f":"E7-T1","v":{"$error":"#VALUE!"}},{"$error":"#VALUE!"},{"$f":"E7-T1","v":{"$error":"#VALUE!"}},{"$error":"#VALUE!"},{"$error":"#VALUE!"},{"$error":"#VALUE!"},{"$error":"#VALUE!"},null,null,null,null,null,null,"Bretagne sel (Coralis)",{"$f":"COUNTIF(C2:C372,\"*Bretagne sel (Coralis)\")","v":0}]
["A.2.2","//","//","//","//","//",0,{"$f":"E8-T1","v":{"$error":"#VALUE!"}},{"$error":"#VALUE!"},{"$f":"E8-T1","v":{"$error":"#VALUE!"}},{"$error":"#VALUE!"},{"$error":"#VALUE!"},{"$error":"#VALUE!"},{"$error":"#VALUE!"},null,null,null,null,null,null,"Crème 15 %",{"$f":"COUNTIF(C2:C372,\"*Crème 15 %\")","v":0}]
["A.2.3",20,"farine ",297,"2016-12-23",1,50,{"$f":"E9-T1","v":112},"OK",{"$f":"E9-T1","v":112},"","","b","n",null,null,null,null,null,null,"Crème 30 %",{"$f":"COUNTIF(C2:C372,\"*Crème 30 %\")","v":0}]
["A.3.0","//","//","//","//","//",0,{"$f":"E10-T1","v":{"$error":"#VALUE!"}},{"$error":"#VALUE!"},{"$f":"E10-T1","v":{"$error":"#VALUE!"}},{"$error":"#VALUE!"},{"$error":"#VALUE!"},{"$error":"#VALUE!"},{"$error":"#VALUE!"},null,null,null,null,null,null,"Crème U",{"$f":"COUNTIF(C2:C372,\"*Crème U\")","v":0}]
["A.3.1","//","//","//","//","//",0,{"$f":"E11-T1","v":{"$error":"#VALUE!"}},{"$error":"#VALUE!"},{"$f":"E11-T1","v":{"$error":"#VALUE!"}},{"$error":"#VALUE!"},{"$error":"#VALUE!"},{"$error":"#VALUE!"},{"$error":"#VALUE!"},null,null,null,null,null,null,"Croisés dx",{"$f":"COUNTIF(C2:C372,\"*Croisés dx*\")","v":0}]
["A.3.2",32,"cassoulet ",224,"2016-10-11",1,70,{"$f":"E12-T1","v":39},"ATTENTION MOINS DE 3 MOIS",{"$f":"E12-T1","v":39},90,"","b","",null,null,null,null,null,null,"Croisés sel",{"$f":"COUNTIF(C2:C372,\"*Croisés sel*\")","v":0}]
["A.3.3",32,"cassoulet ",224,"2016-10-11",1,70,{"$f":"E13-T1","v":39},"ATTENTION MOINS DE 3 MOIS",{"$f":"E13-T1","v":39},90,"","b","",null,null,null,null,null,null,"Cube",{"$f":"COUNTIF(C2:C372,\"*Cubes*\")","v":0}]
["A.4.0",32,"cassoulet ",224,"2016-10-11",1,70,{"$f":"E14-T1","v":39},"ATTENTION MOINS DE 3 MOIS",{"$f":"E14-T1","v":39},{"$f":"IF(AND(J14<=90,J14>30),90,\"\")","v":90},{"$f":"IF(AND(J14<=30,J14>0),30,\"\")","v":""},{"$f":"IF(J14<=0,0,\"b\")","v":"b"},{"$f":"IF(J14>90,\"n\",\"\")","v":""},null,null,null,null,null,null,"FONTE",{"$f":"COUNTIF(C2:C372,\"*Fonte*\")","v":0}]
["A.4.1",32,"cassoulet ",224,"2016-10-11",1,70,{"$f":"E15-T1","v":39},"ATTENTION MOINS DE 3 MOIS",{"$f":"E15-T1","v":39},90,"","b","",null," ",null,null,null,null,"Lot de deux dx",{"$f":"COUNTIF(C2:C372,\"*Lot de deux dx*\")","v":0}]
["A.4.2",32,"cassoulet ",224,"2016-10-11",1,70,{"$f":"E16-T1","v":39},"ATTENTION MOINS DE 3 MOIS",{"$f":"E16-T1","v":39},90,"","b","",null,null,null,null,null,null,"Lot de deux sel",{"$f":"COUNTIF(C2:C372,\"*Lot de deux sel*\")","v":0}]
["A.4.3","//","//","//","//","//",0,{"$f":"E17-T1","v":{"$error":"#VALUE!"}},{"$error":"#VALUE!"},{"$f":"E17-T1","v":{"$error":"#VALUE!"}},{"$error":"#VALUE!"},{"$error":"#VALUE!"},{"$error":"#VALUE!"},{"$error":"#VALUE!"},null,null,null,null,null,null,"Merci chef dx",{"$f":"COUNTIF(C2:C372,\"*Merci chef dx*\")","v":0}]
["A.5.0","//","//","//","//","//",0,{"$f":"E18-T1","v":{"$error":"#VALUE!"}},{"$error":"#VALUE!"},{"$f":"E18-T1","v":{"$error":"#VALUE!"}},{"$error":"#VALUE!"},{"$error":"#VALUE!"},{"$error":"#VALUE!"},{"$error":"#VALUE!"},null,null,null,null,null,null,"Pain box bio dx",{"$f":"COUNTIF(C2:C372,\"*Pain box bio dx*\")","v":0}]
["A.5.1","//","//","//","//","//",0,{"$f":"E19-T1","v":{"$error":"#VALUE!"}},{"$error":"#VALUE!"},{"$f":"E19-T1","v":{"$error":"#VALUE!"}},{"$error":"#VALUE!"},{"$error":"#VALUE!"},{"$error":"#VALUE!"},{"$error":"#VALUE!"},null,null,null,null,null,null,"Pain box dx",{"$f":"COUNTIF(C2:C372,\"*Pain box dx*\")","v":0}]
["A.5.2",31,"abricot 1 kg",250,"2016-11-06",1,50,{"$f":"E20-T1","v":65},"ATTENTION MOINS DE 3 MOIS",{"$f":"E20-T1","v":65},90,"","b","",null,null,null,null,null,null,"Pain Nizo (container)",{"$f":"COUNTIF(C2:C372,\"*Pain nizo (container)*\")","v":0}]
{"$rows_left_out":353}
{"sheet":"Accueil","index":3,"n_rows":0,"n_cols":0,"rows_kept":0,"cut":false,"hidden":false,"merged":[]}

{"sheet":"Produit","index":4,"n_rows":31,"n_cols":1,"rows_kept":31,"cut":false,"hidden":false,"merged":[]}
["//"]
["abricot 1 kg"]
["biscottes"]
["bouchée"]
["café"]
["carotte rappée"]
["cassoulet "]
["céleri"]
["chocolat"]
["farine "]
["frite"]
["haricot blanc x 2"]
["haricot vert x 2"]
["jambon "]
["lait x 1"]
["lait x 6"]
["lardons 500g"]
["macédoine 1 kg"]
["pain"]
["pain de mie"]
{"$rows_left_out":12}
{"sheet":"REF","index":5,"n_rows":36,"n_cols":1,"rows_kept":36,"cut":false,"hidden":false,"merged":[]}
["//"]
[1]
[2]
[3]
[4]
[5]
[6]
[7]
[8]
[9]
[10]
[11]
[12]
[13]
[14]
[15]
[16]
[17]
[18]
[19]
{"$rows_left_out":17}
{"sheet":"Feuil2","index":6,"n_rows":4,"n_cols":10,"rows_kept":4,"cut":false,"hidden":true,"merged":[[3,9,3,11]]}
[null,null,null,null,null,null,7,"heures"]
["Emplacement","Référence","Désignation","Code",null,"Palette","Quantité","Action"]
[]
[null,null,null,null,null,null,null,null,null,"Mettre ou la déposer"]

{"sheet":"initiales","index":7,"n_rows":4,"n_cols":1,"rows_kept":4,"cut":false,"hidden":true,"merged":[]}
["BG"]
["BL "]
["CN"]
["DB"]

{"sheet":"Feuil3","index":8,"n_rows":9,"n_cols":1,"rows_kept":9,"cut":false,"hidden":true,"merged":[]}
["ANTOINE"]
["FONTE"]
["FT85"]
["JAMET"]
["LAHAYE"]
["PREP.AV"]
["RENAULT"]
["SYSTEME U"]
["TFE"]

{"sheet":"Feuil5","index":9,"n_rows":27,"n_cols":31,"rows_kept":27,"cut":false,"hidden":false,"merged":[[26,30,26,33],[0,0,0,12],[10,30,10,33],[0,13,0,16],[0,17,0,19],[6,28,6,29],[6,30,6,33],[8,30,8,33],[7,30,7,33],[9,30,9,33],[0,20,0,26],[25,30,25,33],[23,30,23,33],[13,28,13,29],[13,30,13,33],[14,30,14,33],[15,30,15,33],[16,30,16,33],[24,30,24,33],[19,28,19,29],[19,30,19,33],[20,30,20,33],[21,30,21,33],[22,30,22,33]]}
["Historique de mouvements",null,null,null,null,null,null,null,null,null,null,null,null,"Erreur listbox recheche",null,null,null,"Erreur inputbox recherche",null,null,"Causes modification"]
["Date","Heure","Initiale","Action","Produit","Camion","Empl.","Référence","Produits","Code","Date","Palettes","Qtés",1,2,3,6,2,5,4,7,8,9,10,11,12,13]
[]
[]
[]
[]
[null,null,null,null,null,null,null,null,null,null,null,null,null,null,null,null,null,null,null,null,null,null,null,null,null,null,null,null,"Les erreurs listbox",null,"Les causes"]
[null,null,null,null,null,null,null,null,null,null,null,null,null,null,null,null,null,null,null,null,null,null,null,null,null,null,null,null,1,"Visu sur stock","Une vue sur le stockage par référence ou par code"]
[null,null,null,null,null,null,null,null,null,null,null,null,null,null,null,null,null,null,null,null,null,null,null,null,null,null,null,null,2,"Erreur de référence","Erreur de saisie"]
[null,null,null,null,null,null,null,null,null,null,null,null,null,null,null,null,null,null,null,null,null,null,null,null,null,null,null,null,3,"Mauvaise palette","Mauvaise palette à l'emplacement"]
[null,null,null,null,null,null,null,null,null,null,null,null,null,null,null,null,null,null,null,null,null,null,null,null,null,null,null,null,6,"emplacement Vide/ occupé","Emplacement vide ou occupé"]
[]
[]
[null,null,null,null,null,null,null,null,null,null,null,null,null,null,null,null,null,null,null,null,null,null,null,null,null,null,null,null,"Les erreurs inputbox",null,"Les causes"]
[null,null,null,null,null,null,null,null,null,null,null,null,null,null,null,null,null,null,null,null,null,null,null,null,null,null,null,null,2,"Erreur de référence","Erreur de saisie"]
[null,null,null,null,null,null,null,null,null,null,null,null,null,null,null,null,null,null,null,null,null,null,null,null,null,null,null,null,4,"Erreur d'action","Erreur dans l'action entrée/sortie"]
[null,null,null,null,null,null,null,null,null,null,null,null,null,null,null,null,null,null,null,null,null,null,null,null,null,null,null,null,5,"Autres stockage","N'est pas stocké dans ce magasin"]
[]
[]
[null,null,null,null,null,null,null,null,null,null,null,null,null,null,null,null,null,null,null,null,null,null,null,null,null,null,null,null,"Les modification",null,"Les causes"]
{"$rows_left_out":8}
{"sheet":"Empl.","index":10,"n_rows":48,"n_cols":68,"rows_kept":48,"cut":false,"hidden":false,"merged":[[23,2,23,20],[23,25,23,43],[23,48,23,66],[1,2,1,20],[1,25,1,43],[1,48,1,66],[12,2,12,20],[12,25,12,43],[12,48,12,66]]}
[]
[null,null,"A",null,null,null,null,null,null,null,null,null,null,null,null,null,null,null,null,null,null,null,null,null,null,"B",null,null,null,null,null,null,null,null,null,null,null,null,null,null,null,null,null,null,null,null,null,null,"C"]
[]
[null,null,"A.1.3",{"$f":"IF(stock!B5,\"//\",\"\")","v":"//"},"A.2.3",{"$f":"IF(stock!B9,\"//\",\"\")","v":"//"},"A.3.3",{"$f":"IF(stock!B13,\"//\",\"\")","v":"//"},null,"A.4.3",{"$f":"IF(stock!B17,\"//\",\"\")","v":{"$error":"#VALUE!"}},"A.5.3",{"$f":"IF(stock!B21,\"//\",\"\")","v":"//"},"A.6.3",{"$f":"IF(stock!B25,\"//\",\"\")","v":"//"},null,"A.7.3",{"$f":"IF(stock!B29,\"//\",\"\")","v":"//"},"A.8.3",{"$f":"IF(stock!B33,\"//\",\"\")","v":"//"},"A.9.3",{"$f":"IF(stock!B37,\"//\",\"\")","v":"//"},null,null,null,"B.9.3",{"$f":"IF(stock!B73,\"//\",\"\")","v":"//"},"B.8.3",{"$f":"IF(stock!B69,\"//\",\"\")","v":"//"},"B.7.3",{"$f":"IF(stock!B65,\"//\",\"\")","v":"//"},null,"B.6.3",{"$f":"IF(stock!B61,\"//\",\"\")","v":"//"},"B.5.3",{"$f":"IF(stock!B57,\"//\",\"\")","v":"//"},"B.4.3",{"$f":"IF(stock!B53,\"//\",\"\")","v":"//"},null,"B.3.3",{"$f":"IF(stock!B49,\"//\",\"\")","v":{"$error":"#VALUE!"}},"B.2.3",{"$f":"IF(stock!B45,\"//\",\"\")","v":"//"},"B.1.3",{"$f":"IF(stock!B41,\"//\",\"\")","v":{"$error":"#VALUE!"}},null,null,null,"C.1.3",{"$f":"IF(stock!B77,\"//\",\"\")","v":{"$error":"#VALUE!"}},"C.2.3",{"$f":"IF(stock!B81,\"//\",\"\")","v":{"$error":"#VALUE!"}},"C.3.3",{"$f":"IF(stock!B85,\"//\",\"\")","v":{"$error":"#VALUE!"}},null,"C.4.3",{"$f":"IF(stock!B89,\"//\",\"\")","v":{"$error":"#VALUE!"}},"C.5.3",{"$f":"IF(stock!B93,\"//\",\"\")","v":{"$error":"#VALUE!"}},"C.6.3",{"$f":"IF(stock!B97,\"//\",\"\")","v":{"$error":"#VALUE!"}},null,"C.7.3",{"$f":"IF(stock!B101,\"//\",\"\")","v":"//"},"C.8.3",{"$f":"IF(stock!B105,\"//\",\"\")","v":"//"},"C.9.3",{"$f":"IF(stock!B109,\"//\",\"\")","v":{"$error":"#VALUE!"}}]
[]
[null,null,"A.1.2",{"$f":"IF(stock!B4,\"//\",\"\")","v":"//"},"A.2.2",{"$f":"IF(stock!B8,\"//\",\"\")","v":{"$error":"#VALUE!"}},"A.3.2",{"$f":"IF(stock!B12,\"//\",\"\")","v":"//"},null,"A.4.2",{"$f":"IF(stock!B16,\"//\",\"\")","v":"//"},"A.5.2",{"$f":"IF(stock!B20,\"//\",\"\")","v":"//"},"A.6.2",{"$f":"IF(stock!B24,\"//\",\"\")","v":"//"},null,"A.7.2",{"$f":"IF(stock!B28,\"//\",\"\")","v":"//"},"A.8.2",{"$f":"IF(stock!B32,\"//\",\"\")","v":"//"},"A.9.2",{"$f":"IF(stock!B36,\"//\",\"\")","v":"//"},null,null,null,"B.9.2",{"$f":"IF(stock!B72,\"//\",\"\")","v":"//"},"B.8.2",{"$f":"IF(stock!B68,\"//\",\"\")","v":"//"},"B.7.2",{"$f":"IF(stock!B64,\"//\",\"\")","v":"//"},null,"B.6.2",{"$f":"IF(stock!B60,\"//\",\"\")","v":"//"},"B.5.2",{"$f":"IF(stock!B56,\"//\",\"\")","v":"//"},"B.4.2",{"$f":"IF(stock!B52,\"//\",\"\")","v":"//"},null,"B.3.2",{"$f":"IF(stock!B48,\"//\",\"\")","v":"//"},"B.2.2",{"$f":"IF(stock!B44,\"//\",\"\")","v":"//"},"B.1.2",{"$f":"IF(stock!B40,\"//\",\"\")","v":{"$error":"#VALUE!"}},null,null,null,"C.1.2",{"$f":"IF(stock!B76,\"//\",\"\")","v":{"$error":"#VALUE!"}},"C.2.2",{"$f":"IF(stock!B80,\"//\",\"\")","v":{"$error":"#VALUE!"}},"C.3.2",{"$f":"IF(stock!B84,\"//\",\"\")","v":{"$error":"#VALUE!"}},null,"C.4.2",{"$f":"IF(stock!B88,\"//\",\"\")","v":{"$error":"#VALUE!"}},"C.5.2",{"$f":"IF(stock!B92,\"//\",\"\")","v":{"$error":"#VALUE!"}},"C.6.2",{"$f":"IF(stock!B96,\"//\",\"\")","v":{"$error":"#VALUE!"}},null,"C.7.2",{"$f":"IF(stock!B100,\"//\",\"\")","v":{"$error":"#VALUE!"}},"C.8.2",{"$f":"IF(stock!B104,\"//\",\"\")","v":"//"},"C.9.2",{"$f":"IF(stock!B108,\"//\",\"\")","v":"//"}]
[]
[null,null,"A.1.1",{"$f":"IF(stock!B3,\"//\",\"\")","v":"//"},"A.2.1",{"$f":"IF(stock!B7,\"//\",\"\")","v":{"$error":"#VALUE!"}},"A.3.1",{"$f":"IF(stock!B11,\"//\",\"\")","v":{"$error":"#VALUE!"}},null,"A.4.1",{"$f":"IF(stock!B15,\"//\",\"\")","v":"//"},"A.5.1",{"$f":"IF(stock!B19,\"//\",\"\")","v":{"$error":"#VALUE!"}},"A.6.1",{"$f":"IF(stock!B23,\"//\",\"\")","v":"//"},null,"A.7.1",{"$f":"IF(stock!B27,\"//\",\"\")","v":"//"},"A.8.1",{"$f":"IF(stock!B31,\"//\",\"\")","v":"//"},"A.9.1",{"$f":"IF(stock!B35,\"//\",\"\")","v":"//"},null,null,null,"B.9.1",{"$f":"IF(stock!B71,\"//\",\"\")","v":"//"},"B.8.1",{"$f":"IF(stock!B67,\"//\",\"\")","v":"//"},"B.7.1",{"$f":"IF(stock!B63,\"//\",\"\")","v":{"$error":"#VALUE!"}},null,"B.6.1",{"$f":"IF(stock!B59,\"//\",\"\")","v":"//"},"B.5.1",{"$f":"IF(stock!B55,\"//\",\"\")","v":{"$error":"#VALUE!"}},"B.4.1",{"$f":"IF(stock!B51,\"//\",\"\")","v":"//"},null,"B.3.1",{"$f":"IF(stock!B47,\"//\",\"\")","v":"//"},"B.2.1",{"$f":"IF(stock!B43,\"//\",\"\")","v":{"$error":"#VALUE!"}},"B.1.1",{"$f":"IF(stock!B39,\"//\",\"\")","v":{"$error":"#VALUE!"}},null,null,null,"C.1.1",{"$f":"IF(stock!B75,\"//\",\"\")","v":"//"},"C.2.1",{"$f":"IF(stock!B79,\"//\",\"\")","v":{"$error":"#VALUE!"}},"C.3.1",{"$f":"IF(stock!B83,\"//\",\"\")","v":{"$error":"#VALUE!"}},null,"C.4.1",{"$f":"IF(stock!B87,\"//\",\"\")","v":{"$error":"#VALUE!"}},"C.5.1",{"$f":"IF(stock!B91,\"//\",\"\")","v":{"$error":"#VALUE!"}},"C.6.1",{"$f":"IF(stock!B95,\"//\",\"\")","v":{"$error":"#VALUE!"}},null,"C.7.1",{"$f":"IF(stock!B99,\"//\",\"\")","v":{"$error":"#VALUE!"}},"C.8.1",{"$f":"IF(stock!B103,\"//\",\"\")","v":"//"},"C.9.1",{"$f":"IF(stock!B107,\"//\",\"\")","v":"//"}]
[]
[null,null,"A.1.0",{"$f":"IF(stock!B2,\"//\",\"\")","v":"//"},"A.2.0",{"$f":"IF(stock!B6,\"//\",\"\")","v":"//"},"A.3.0",{"$f":"IF(stock!B10,\"//\",\"\")","v":{"$error":"#VALUE!"}},null,"A.4.0",{"$f":"IF(stock!B14,\"//\",\"\")","v":"//"},"A.5.0",{"$f":"IF(stock!B18,\"//\",\"\")","v":{"$error":"#VALUE!"}},"A.6.0",{"$f":"IF(stock!B22,\"//\",\"\")","v":"//"},null,"A.7.0",{"$f":"IF(stock!B26,\"//\",\"\")","v":"//"},"A.8.0",{"$f":"IF(stock!B30,\"//\",\"\")","v":"//"},"A.9.0",{"$f":"IF(stock!B34,\"//\",\"\")","v":"//"},null,null,null,"B.9.0",{"$f":"IF(stock!B70,\"//\",\"\")","v":"//"},"B.8.0",{"$f":"IF(stock!B66,\"//\",\"\")","v":"//"},"B.7.0",{"$f":"IF(stock!B62,\"//\",\"\")","v":"//"},null,"B.6.0",{"$f":"IF(stock!B58,\"//\",\"\")","v":"//"},"B.5.0",{"$f":"IF(stock!B54,\"//\",\"\")","v":"//"},"B.4.0",{"$f":"IF(stock!B50,\"//\",\"\")","v":"//"},null,"B.3.0",{"$f":"IF(stock!B46,\"//\",\"\")","v":"//"},"B.2.0",{"$f":"IF(stock!B42,\"//\",\"\")","v":"//"},"B.1.0",{"$f":"IF(stock!B38,\"//\",\"\")","v":"//"},null,null,null,"C.1.0",{"$f":"IF(stock!B74,\"//\",\"\")","v":"//"},"C.2.0",{"$f":"IF(stock!B78,\"//\",\"\")","v":"//"},"C.3.0",{"$f":"IF(stock!B82,\"//\",\"\")","v":"//"},null,"C.4.0",{"$f":"IF(stock!B86,\"//\",\"\")","v":"//"},"C.5.0",{"$f":"IF(stock!B90,\"//\",\"\")","v":"//"},"C.6.0",{"$f":"IF(stock!B94,\"//\",\"\")","v":"//"},null,"C.7.0",{"$f":"IF(stock!B98,\"//\",\"\")","v":"//"},"C.8.0",{"$f":"IF(stock!B102,\"//\",\"\")","v":"//"},"C.9.0",{"$f":"IF(stock!B106,\"//\",\"\")","v":"//"}]
[]
[]
[null,null,"D",null,null,null,null,null,null,null,null,null,null,null,null,null,null,null,null,null,null,null,null,null,null,"E",null,null,null,null,null,null,null,null,null,null,null,null,null,null,null,null,null,null,null,null,null,null,"F"]
[]
[null,null,"D.9.3",{"$f":"IF(stock!B145,\"//\",\"\")","v":{"$error":"#VALUE!"}},"D.8.3",{"$f":"IF(stock!B141,\"//\",\"\")","v":"//"},"D.7.3",{"$f":"IF(stock!B137,\"//\",\"\")","v":{"$error":"#VALUE!"}},null,"D.6.3",{"$f":"IF(stock!B133,\"//\",\"\")","v":"//"},"D.5.3",{"$f":"IF(stock!B129,\"//\",\"\")","v":"//"},"D.4.3",{"$f":"IF(stock!B125,\"//\",\"\")","v":"//"},null,"D.3.3",{"$f":"IF(stock!B121,\"//\",\"\")","v":"//"},"D.2.3",{"$f":"IF(stock!B117,\"//\",\"\")","v":{"$error":"#VALUE!"}},"D.1.3",{"$f":"IF(stock!B113,\"//\",\"\")","v":{"$error":"#VALUE!"}},null,null,null,"E.1.3",{"$f":"IF(stock!B149,\"//\",\"\")","v":"//"},"E.2.3",{"$f":"IF(stock!B153,\"//\",\"\")","v":"//"},"E.3.3",{"$f":"IF(stock!B157,\"//\",\"\")","v":"//"},null,"E.4.3",{"$f":"IF(stock!B161,\"//\",\"\")","v":"//"},"E.5.3",{"$f":"IF(stock!B165,\"//\",\"\")","v":"//"},"E.6.3",{"$f":"IF(stock!B169,\"//\",\"\")","v":"//"},null,"E.7.3",{"$f":"IF(stock!B173,\"//\",\"\")","v":"//"},"E.8.3",{"$f":"IF(stock!B177,\"//\",\"\")","v":"//"},"E.9.3",{"$f":"IF(stock!B181,\"//\",\"\")","v":"//"},null,null,null,"F.9.3",{"$f":"IF(stock!B217,\"//\",\"\")","v":"//"},"F.8.3",{"$f":"IF(stock!B213,\"//\",\"\")","v":"//"},"F.7.3",{"$f":"IF(stock!B209,\"//\",\"\")","v":"//"},null,"F.6.3",{"$f":"IF(stock!B205,\"//\",\"\")","v":"//"},"F.5.3",{"$f":"IF(stock!B201,\"//\",\"\")","v":"//"},"F.4.3",{"$f":"IF(stock!B197,\"//\",\"\")","v":"//"},null,"F.3.3",{"$f":"IF(stock!B193,\"//\",\"\")","v":"//"},"F.2.3",{"$f":"IF(stock!B189,\"//\",\"\")","v":"//"},"F.1.3",{"$f":"IF(stock!B185,\"//\",\"\")","v":"//"}]
[]
[null,null,"D.9.2",{"$f":"IF(stock!B144,\"//\",\"\")","v":"//"},"D.8.2",{"$f":"IF(stock!B140,\"//\",\"\")","v":"//"},"D.7.2",{"$f":"IF(stock!B136,\"//\",\"\")","v":"//"},null,"D.6.2",{"$f":"IF(stock!B132,\"//\",\"\")","v":{"$error":"#VALUE!"}},"D.5.2",{"$f":"IF(stock!B128,\"//\",\"\")","v":"//"},"D.4.2",{"$f":"IF(stock!B124,\"//\",\"\")","v":"//"},null,"D.3.2",{"$f":"IF(stock!B120,\"//\",\"\")","v":"//"},"D.2.2",{"$f":"IF(stock!B116,\"//\",\"\")","v":{"$error":"#VALUE!"}},"D.1.2",{"$f":"IF(stock!B112,\"//\",\"\")","v":{"$error":"#VALUE!"}},null,null,null,"E.1.2",{"$f":"IF(stock!B148,\"//\",\"\")","v":"//"},"E.2.2",{"$f":"IF(stock!B152,\"//\",\"\")","v":"//"},"E.3.2",{"$f":"IF(stock!B156,\"//\",\"\")","v":"//"},null,"E.4.2",{"$f":"IF(stock!B160,\"//\",\"\")","v":"//"},"E.5.2",{"$f":"IF(stock!B164,\"//\",\"\")","v":"//"},"E.6.2",{"$f":"IF(stock!B168,\"//\",\"\")","v":"//"},null,"E.7.2",{"$f":"IF(stock!B172,\"//\",\"\")","v":"//"},"E.8.2",{"$f":"IF(stock!B176,\"//\",\"\")","v":"//"},"E.9.2",{"$f":"IF(stock!B180,\"//\",\"\")","v":"//"},null,null,null,"F.9.2",{"$f":"IF(stock!B216,\"//\",\"\")","v":"//"},"F.8.2",{"$f":"IF(stock!B212,\"//\",\"\")","v":"//"},"F.7.2",{"$f":"IF(stock!B208,\"//\",\"\")","v":"//"},null,"F.6.2",{"$f":"IF(stock!B204,\"//\",\"\")","v":"//"},"F.5.2",{"$f":"IF(stock!B200,\"//\",\"\")","v":"//"},"F.4.2",{"$f":"IF(stock!B196,\"//\",\"\")","v":"//"},null,"F.3.2",{"$f":"IF(stock!B192,\"//\",\"\")","v":"//"},"F.2.2",{"$f":"IF(stock!B188,\"//\",\"\")","v":"//"},"F.1.2",{"$f":"IF(stock!B184,\"//\",\"\")","v":"//"}]
[]
[null,null,"D.9.1",{"$f":"IF(stock!B143,\"//\",\"\")","v":"//"},"D.8.1",{"$f":"IF(stock!B139,\"//\",\"\")","v":"//"},"D.7.1",{"$f":"IF(stock!B135,\"//\",\"\")","v":"//"},null,"D.6.1",{"$f":"IF(stock!B131,\"//\",\"\")","v":{"$error":"#VALUE!"}},"D.5.1",{"$f":"IF(stock!B127,\"//\",\"\")","v":"//"},"D.4.1",{"$f":"IF(stock!B123,\"//\",\"\")","v":"//"},null,"D.3.1",{"$f":"IF(stock!B119,\"//\",\"\")","v":{"$error":"#VALUE!"}},"D.2.1",{"$f":"IF(stock!B115,\"//\",\"\")","v":{"$error":"#VALUE!"}},"D.1.1",{"$f":"IF(stock!B111,\"//\",\"\")","v":{"$error":"#VALUE!"}},null,null,null,"E.1.1",{"$f":"IF(stock!B147,\"//\",\"\")","v":"//"},"E.2.1",{"$f":"IF(stock!B151,\"//\",\"\")","v":"//"},"E.3.1",{"$f":"IF(stock!B155,\"//\",\"\")","v":"//"},null,"E.4.1",{"$f":"IF(stock!B159,\"//\",\"\")","v":"//"},"E.5.1",{"$f":"IF(stock!B163,\"//\",\"\")","v":"//"},"E.6.1",{"$f":"IF(stock!B167,\"//\",\"\")","v":"//"},null,"E.7.1",{"$f":"IF(stock!B171,\"//\",\"\")","v":"//"},"E.8.1",{"$f":"IF(stock!B175,\"//\",\"\")","v":"//"},"E.9.1",{"$f":"IF(stock!B179,\"//\",\"\")","v":"//"},null,null,null,"F.9.1",{"$f":"IF(stock!B215,\"//\",\"\")","v":"//"},"F.8.1",{"$f":"IF(stock!B211,\"//\",\"\")","v":"//"},"F.7.1",{"$f":"IF(stock!B207,\"//\",\"\")","v":"//"},null,"F.6.1",{"$f":"IF(stock!B203,\"//\",\"\")","v":{"$error":"#VALUE!"}},"F.5.1",{"$f":"IF(stock!B199,\"//\",\"\")","v":"//"},"F.4.1",{"$f":"IF(stock!B195,\"//\",\"\")","v":"//"},null,"F.3.1",{"$f":"IF(stock!B191,\"//\",\"\")","v":{"$error":"#VALUE!"}},"F.2.1",{"$f":"IF(stock!B187,\"//\",\"\")","v":"//"},"F.1.1",{"$f":"IF(stock!B183,\"//\",\"\")","v":"//"}]
[]
{"$rows_left_out":29}
{"sheet":"Feuil6","index":11,"n_rows":12,"n_cols":22,"rows_kept":12,"cut":false,"hidden":false,"merged":[[0,0,0,10],[0,11,0,17],[4,19,4,20],[4,21,4,24],[5,21,5,24],[11,21,11,24],[6,21,6,24],[7,21,7,24],[8,21,8,24],[9,21,9,24],[10,21,10,24]]}
["Historique D'inventaire",null,null,null,null,null,null,null,null,null,null,"Causes modification"]
["Date","Heure","Initiales","Action","1","Référence","Produit","Code","Date Péremp.","Qté palettes","Qté Produit",1,2,3,4,5,6,7]
[]
[]
[null,null,null,null,null,null,null,null,null,null,null,null,null,null,null,null,null,null,null,"Les modification",null,"Les causes"]
[null,null,null,null,null,null,null,null,null,null,null,null,null,null,null,null,null,null,null,1,"Modif. Quantité +","Correction de la quantité, en +"]
[null,null,null,null,null,null,null,null,null,null,null,null,null,null,null,null,null,null,null,2,"Modif. Quantité -","Correction de la quantité, en -"]
[null,null,null,null,null,null,null,null,null,null,null,null,null,null,null,null,null,null,null,3,"Modif. Date","Correction de la date"]
[null,null,null,null,null,null,null,null,null,null,null,null,null,null,null,null,null,null,null,4,"Modif. De référence","Correction de référence"]
[null,null,null,null,null,null,null,null,null,null,null,null,null,null,null,null,null,null,null,5,"Modif. Code","Correction du code"]
[null,null,null,null,null,null,null,null,null,null,null,null,null,null,null,null,null,null,null,6,"Autres","  Empl.vide…"]
[null,null,null,null,null,null,null,null,null,null,null,null,null,null,null,null,null,null,null,7,"Inventaire OK","  R.A.S"]

{"sheet":"InvenT","index":12,"n_rows":89,"n_cols":7,"rows_kept":89,"cut":false,"hidden":false,"merged":[[0,0,0,6]]}
["Inventaire total"]
["L","Référence","Produit","Code","Date péremption","Palettes","Qté. Colis"]
[1,3,"biscottes",314,"2017-01-09","2p",96]
[2,3,"biscottes",289,"2016-12-15","2p",96]
[3,3,"biscottes",284,"2016-12-10","5p",240]
[4,3,"biscottes",291,"2016-12-17","1p",48]
[5,31,"abricot 1 kg",250,"2016-11-06","4p",200]
[6,31,"abricot 1 kg",252,"2016-11-08","2p",72]
[7]
[8]
[9]
[10]
[11]
[12]
[13]
[14]
[15]
[16]
[17]
[18]
{"$rows_left_out":69}