{"text_format":"1","workbook":"xlsx","n_sheets":13,"sheets":["Aide","TCD","stock","Accueil","Produit","REF","Feuil2","initiales","Feuil3","Feuil5","Empl.","Feuil6","InvenT"],"not_rendered":{"charts":0,"images":29,"macros":1,"external_links":0,"defined_names":10,"comments":0,"pivot_tables":1},"unopened":[],"bounds":{"document_bytes":16777216,"sheet_cells":100000,"rows_first":2000,"rows_last":500,"rows_between":2000,"halvings":0,"cell_chars":16384,"cell_head_chars":4096},"cells_cut":0,"cells_raw":0,"read":"whole","date_system":"1900"}

{"sheet":"Aide","index":0,"n_rows":0,"n_cols":0,"rows_kept":0,"cut":false,"hidden":false,"merged":[[4,6,38,16]]}

{"sheet":"TCD","index":1,"n_rows":115,"n_cols":3,"rows_kept":115,"cut":false,"hidden":false,"merged":[]}
[]
[]
["Row Labels","Sum of Quantité","Sum of Palette"]
[0,0,0]
[0,0,0]
["(blank)"]
["//",0,8]
["//",0,8]
["abricot 1 kg",272,6]
[250,200,4]
[252,72,2]
["biscottes",480,10]
[284,240,5]
[289,96,2]
[291,48,1]
[314,96,2]
["bouchée",2361,1]
[312,46,1]
[317,2315,0]
["café",579,12]
[189,100,2]
[251,479,10]
["carotte rappée",240,3]
[328,160,2]
[333,80,1]
["cassoulet ",350,5]
[224,350,5]
["céleri",1320,24]
[260,55,1]
[336,385,7]
[365,880,16]
["//",0,0]
["chocolat",0,0]
["//",0,0]
["farine ",150,3]
[261,100,2]
[297,50,1]
["frite",2275,16]
[120,80,1]
[256,1200,15]
[281,995,0]
["//",0,0]
["haricot blanc x 2",2240,16]
[277,140,1]
[295,2100,15]
["haricot vert x 2",8100,15]
[326,6480,12]
[332,1620,3]
["jambon ",1690,31]
[295,540,16]
[297,1120,14]
[331,30,1]
["lait x 1",96,2]
[263,48,1]
[345,48,1]
["lait x 6",832,16]
[275,832,16]
["lardons 500g",960,12]
[268,960,12]
["macédoine 1 kg",4370,55]
[183,80,1]
[275,3330,42]
[306,960,12]
["pain",3877,56]
[224,1567,23]
[238,70,1]
[324,2240,32]
["//",0,0]
["pain de mie",7964,81]
[193,72,1]
[255,792,11]
[267,72,1]
[315,216,3]
[327,2543,37]
[330,2016,28]
[335,2253,0]
["//",0,0]
["pêche 1kg",480,23]
[306,420,7]
[365,60,16]
["//",0,0]
["petits pois x 2",560,36]
[233,480,12]
[289,40,12]
[307,40,12]
["//",0,0]
["poire 1 kg",471,0]
[320,471,0]
["salade verte",480,6]
[361,480,6]
["salami",2023,26]
[362,2023,26]
["sardine x 2",5940,11]
[326,3780,7]
[328,2160,4]
["saucisse fumée",180,3]
[284,180,3]
["saucisson",4380,50]
[296,1390,16]
[321,2990,34]
["//",0,0]
["saucisson ail",6846,87]
[326,2046,27]
[327,1920,24]
[340,960,12]
[345,1920,24]
["sucre",336,8]
[364,336,8]
["//",0,0]
["thon ",20,0]
[306,10,0]
[321,10,0]
["(blank)"]
["(blank)"]
["Grand Total",59872,622]

{"sheet":"stock","index":2,"n_rows":372,"n_cols":22,"rows_kept":372,"cut":false,"hidden":false,"merged":[]}
["EMPL.","Référence","Produit","Code","Date","Palette","Quantité",null,"ALERTE PEREMPTION","JOURS RESTANTS",90,30,0,100,null,268,97,365,null,{"$f":"TODAY()","v":"2016-09-02"}]
["A.1.0",3,"biscottes",314,"2017-01-09",1,48,{"$f":"E2-T1","v":129},{"$f":"IF(K2=90,\"ATTENTION MOINS DE 3 MOIS\",IF(L2=30,\"ATTENTION MOINS DE 30 JOURS\",IF(M2=0,\"PERIME!!!\",\"OK\")))","v":"OK"},{"$f":"E2-T1","v":129},{"$f":"IF(AND(J2<=90,J2>30),90,\"\")","v":""},{"$f":"IF(AND(J2<=30,J2>0),30,\"\")","v":""},{"$f":"IF(J2<=0,0,\"\")","v":""},{"$f":"IF(J2>90,\"n\",\"\")","v":"n"},null,null,null,null,null,null,"Agrilait sel (Coralis)",{"$f":"COUNTIF(C2:C372,\"*Agrilait sel*\")","v":0}]
["A.1.1",3,"biscottes",314,"2017-01-09",1,48,{"$f":"E3-T1","v":129},"OK",{"$f":"E3-T1","v":129},{"$f":"IF(AND(J3<=90,J3>30),90,\"\")","v":""},{"$f":"IF(AND(J3<=30,J3>0),30,\"\")","v":""},{"$f":"IF(J3<=0,0,\"b\")","v":"b"},{"$f":"IF(J3>90,\"n\",\"\")","v":"n"},null,null,null,null,null,null,"//",{"$f":"COUNTIF(C2:C372,\"*//*\")","v":97}]
["A.1.2",28,"céleri",260,"2016-11-16",1,55,{"$f":"E4-T1","v":75},"ATTENTION MOINS DE 3 MOIS",{"$f":"E4-T1","v":75},90,"",{"$f":"IF(J4<=0,0,\"b\")","v":"b"},"",null,null,null,null,null,null,"AOP Ovale dx lotx2",{"$f":"COUNTIF(C2:C372,\"*AOP ovale*\")","v":0}]
["A.1.3",20,"farine ",261,"2016-11-17",1,50,{"$f":"E5-T1","v":76},"ATTENTION MOINS DE 3 MOIS",{"$f":"E5-T1","v":76},90,"","b","",null,null,null,null,null,null,"AOP dx 5kg",{"$f":"COUNTIF(C2:C372,\"*AOP dx 5kg*\")","v":0}]
["A.2.0",20,"farine ",261,"2016-11-17",1,50,{"$f":"E6-T1","v":76},"ATTENTION MOINS DE 3 MOIS",{"$f":" E6-T1","v":76},90,{"$f":"IF(AND(J6<=30,J6>0),30,\"\")","v":""},{"$f":"IF(J6<=0,0,20)","v":20},"",null,null,null,null,null,null,"AOP dx 10kg",{"$f":"COUNTIF(C2:C372,\"*AOP dx 10kg\")","v":0}]
["A.2.1","//","//","//","//","//",0,{"$f":"E7-T1","v":{"$error":"#VALUE!"}},{"$error":"#VALUE!"},{"$f":"E7-T1","v":{"$error":"#VALUE!"}},{"$error":"#VALUE!"},{"$error":"#VALUE!"},{"$error":"#VALUE!"},{"$error":"#VALUE!"},null,null,null,null,null,null,"Bretagne sel (Coralis)",{"$f":"COUNTIF(C2:C372,\"*Bretagne sel (Coralis)\")","v":0}]
["A.2.2","//","//","//","//","//",0,{"$f":"E8-T1","v":{"$error":"#VALUE!"}},{"$error":"#VALUE!"},{"$f":"E8-T1","v":{"$error":"#VALUE!"}},{"$error":"#VALUE!"},{"$error":"#VALUE!"},{"$error":"#VALUE!"},{"$error":"#VALUE!"},null,null,null,null,null,null,"Crème 15 %",{"$f":"COUNTIF(C2:C372,\"*Crème 15 %\")","v":0}]
["A.2.3",20,"farine ",297,"2016-12-23",1,50,{"$f":"E9-T1","v":112},"OK",{"$f":"E9-T1","v":112},"","","b","n",null,null,null,null,null,null,"Crème 30 %",{"$f":"COUNTIF(C2:C372,\"*Crème 30 %\")","v":0}]
["A.3.0","//","//","//","//","//",0,{"$f":"E10-T1","v":{"$error":"#VALUE!"}},{"$error":"#VALUE!"},{"$f":"E10-T1","v":{"$error":"#VALUE!"}},{"$error":"#VALUE!"},{"$error":"#VALUE!"},{"$error":"#VALUE!"},{"$error":"#VALUE!"},null,null,null,null,null,null,"Crème U",{"$f":"COUNTIF(C2:C372,\"*Crème U\")","v":0}]
["A.3.1","//","//","//","//","//",0,{"$f":"E11-T1","v":{"$error":"#VALUE!"}},{"$error":"#VALUE!"},{"$f":"E11-T1","v":{"$error":"#VALUE!"}},{"$error":"#VALUE!"},{"$error":"#VALUE!"},{"$error":"#VALUE!"},{"$error":"#VALUE!"},null,null,null,null,null,null,"Croisés dx",{"$f":"COUNTIF(C2:C372,\"*Croisés dx*\")","v":0}]
["A.3.2",32,"cassoulet ",224,"2016-10-11",1,70,{"$f":"E12-T1","v":39},"ATTENTION MOINS DE 3 MOIS",{"$f":"E12-T1","v":39},90,"","b","",null,null,null,null,null,null,"Croisés sel",{"$f":"COUNTIF(C2:C372,\"*Croisés sel*\")","v":0}]
["A.3.3",32,"cassoulet ",224,"2016-10-11",1,70,{"$f":"E13-T1","v":39},"ATTENTION MOINS DE 3 MOIS",{"$f":"E13-T1","v":39},90,"","b","",null,null,null,null,null,null,"Cube",{"$f":"COUNTIF(C2:C372,\"*Cubes*\")","v":0}]
["A.4.0",32,"cassoulet ",224,"2016-10-11",1,70,{"$f":"E14-T1","v":39},"ATTENTION MOINS DE 3 MOIS",{"$f":"E14-T1","v":39},{"$f":"IF(AND(J14<=90,J14>30),90,\"\")","v":90},{"$f":"IF(AND(J14<=30,J14>0),30,\"\")","v":""},{"$f":"IF(J14<=0,0,\"b\")","v":"b"},{"$f":"IF(J14>90,\"n\",\"\")","v":""},null,null,null,null,null,null,"FONTE",{"$f":"COUNTIF(C2:C372,\"*Fonte*\")","v":0}]
["A.4.1",32,"cassoulet ",224,"2016-10-11",1,70,{"$f":"E15-T1","v":39},"ATTENTION MOINS DE 3 MOIS",{"$f":"E15-T1","v":39},90,"","b","",null," ",null,null,null,null,"Lot de deux dx",{"$f":"COUNTIF(C2:C372,\"*Lot de deux dx*\")","v":0}]
["A.4.2",32,"cassoulet ",224,"2016-10-11",1,70,{"$f":"E16-T1","v":39},"ATTENTION MOINS DE 3 MOIS",{"$f":"E16-T1","v":39},90,"","b","",null,null,null,null,null,null,"Lot de deux sel",{"$f":"COUNTIF(C2:C372,\"*Lot de deux sel*\")","v":0}]
["A.4.3","//","//","//","//","//",0,{"$f":"E17-T1","v":{"$error":"#VALUE!"}},{"$error":"#VALUE!"},{"$f":"E17-T1","v":{"$error":"#VALUE!"}},{"$error":"#VALUE!"},{"$error":"#VALUE!"},{"$error":"#VALUE!"},{"$error":"#VALUE!"},null,null,null,null,null,null,"Merci chef dx",{"$f":"COUNTIF(C2:C372,\"*Merci chef dx*\")","v":0}]
["A.5.0","//","//","//","//","//",0,{"$f":"E18-T1","v":{"$error":"#VALUE!"}},{"$error":"#VALUE!"},{"$f":"E18-T1","v":{"$error":"#VALUE!"}},{"$error":"#VALUE!"},{"$error":"#VALUE!"},{"$error":"#VALUE!"},{"$error":"#VALUE!"},null,null,null,null,null,null,"Pain box bio dx",{"$f":"COUNTIF(C2:C372,\"*Pain box bio dx*\")","v":0}]
["A.5.1","//","//","//","//","//",0,{"$f":"E19-T1","v":{"$error":"#VALUE!"}},{"$error":"#VALUE!"},{"$f":"E19-T1","v":{"$error":"#VALUE!"}},{"$error":"#VALUE!"},{"$error":"#VALUE!"},{"$error":"#VALUE!"},{"$error":"#VALUE!"},null,null,null,null,null,null,"Pain box dx",{"$f":"COUNTIF(C2:C372,\"*Pain box dx*\")","v":0}]
["A.5.2",31,"abricot 1 kg",250,"2016-11-06",1,50,{"$f":"E20-T1","v":65},"ATTENTION MOINS DE 3 MOIS",{"$f":"E20-T1","v":65},90,"","b","",null,null,null,null,null,null,"Pain Nizo (container)",{"$f":"COUNTIF(C2:C372,\"*Pain nizo (container)*\")","v":0}]
["A.5.3",31,"abricot 1 kg",250,"2016-11-06",1,50,{"$f":"E21-T1","v":65},"ATTENTION MOINS DE 3 MOIS",{"$f":"E21-T1","v":65},90,"","b","",null,null,null,null,null,null,"Paturage dx ",{"$f":"COUNTIF(C2:C372,\"*Paturage dx*\")","v":0}]
["A.6.0",31,"abricot 1 kg",250,"2016-11-06",1,50,{"$f":"E22-T1","v":65},"ATTENTION MOINS DE 3 MOIS",{"$f":"E22-T1","v":65},90,"","b","",null,null,null,null,null,null,"Paturage dx (Coralis)",{"$f":"COUNTIF(C2:C372,\"*Paturage dx (Coralis)*\")","v":0}]
["A.6.1",31,"abricot 1 kg",250,"2016-11-06",1,50,{"$f":"E23-T1","v":65},"ATTENTION MOINS DE 3 MOIS",{"$f":"E23-T1","v":65},90,"","b","",null,null,null,null,null,null,"Paturage sel",{"$f":"COUNTIF(C2:C372,\"*Paturage sel*\")","v":0}]
["A.6.2",31,"abricot 1 kg",252,"2016-11-08",1,22,{"$f":"E24-T1","v":67},"ATTENTION MOINS DE 3 MOIS",{"$f":"E24-T1","v":67},90,"","b","",null,null,null,null,null,null,"Paturage sel (Coralis)",{"$f":"COUNTIF(C2:C372,\"*Paturage sel (Coralis)*\")","v":0}]
["A.6.3",31,"abricot 1 kg",252,"2016-11-08",1,50,{"$f":"E25-T1","v":67},"ATTENTION MOINS DE 3 MOIS",{"$f":"E25-T1","v":67},{"$f":"IF(AND(J25<=90,J25>30),90,\"\")","v":90},{"$f":"IF(AND(J25<=30,J25>0),30,\"\")","v":""},{"$f":"IF(J25<=0,0,\"b\")","v":"b"},{"$f":"IF(J25>90,\"n\",\"\")","v":""},null,null,null,null,null,null,"Savenay dx",{"$f":"COUNTIF(C2:C372,\"*Savenay dx*\")","v":0}]
["A.7.0",22,"café",251,"2016-11-07",1,50,{"$f":"E26-T1","v":66},"ATTENTION MOINS DE 3 MOIS",{"$f":"E26-T1","v":66},90,"","b","",null,null,null,null,null,null,"Savenay sel",{"$f":"COUNTIF(C2:C372,\"*Savenay sel*\")","v":0}]
["A.7.1",22,"café",251,"2016-11-07",1,50,{"$f":"E27-T1","v":66},"ATTENTION MOINS DE 3 MOIS",{"$f":"E27-T1","v":66},90,"","b","",null,null,null,null,null,null,"sel de mer 10kg",{"$f":"COUNTIF(C2:C372,\"*Sel de mer 10kg*\")","v":0}]
["A.7.2",22,"café",189,"2016-09-07",1,50,{"$f":"E28-T1","v":5},"ATTENTION MOINS DE 30 JOURS",{"$f":"E28-T1","v":5},"",30,"b","",null,null,null,null,null,null,"sel de mer 12kg",{"$f":"COUNTIF(C2:C372,\"*Sel de mer 12kg*\")","v":0}]
["A.7.3",22,"café",251,"2016-11-07",1,50,{"$f":"E29-T1","v":66},"ATTENTION MOINS DE 3 MOIS",{"$f":"E29-T1","v":66},90,"","b","",null,null,null,null,null,null,"sel de mer 5kg",{"$f":"COUNTIF(C2:C372,\"*Sel de mer 5kg*\")","v":0}]
["A.8.0",22,"café",251,"2016-11-07",1,29,{"$f":"E30-T1","v":66},"ATTENTION MOINS DE 3 MOIS",{"$f":"E30-T1","v":66},90,"","b","",null,null,null,null,null,null,"Technyfil1",{"$f":"COUNTIF(C2:C372,\"*technyfil1*\")","v":0}]
["A.8.1",22,"café",251,"2016-11-07",1,50,{"$f":"E31-T1","v":66},"ATTENTION MOINS DE 3 MOIS",{"$f":"E31-T1","v":66},90,"","b","",null,null,null,null,null,null,"Technyfil2",{"$f":"COUNTIF(C2:C372,\"*technyfil2*\")","v":0}]
["A.8.2",22,"café",251,"2016-11-07",1,50,{"$f":"E32-T1","v":66},"ATTENTION MOINS DE 3 MOIS",{"$f":"E32-T1","v":66},90,"","b","",null,null,null,null,null,null,"Technyfil3",{"$f":"COUNTIF(C2:C372,\"*technyfil2*\")","v":0}]
["A.8.3",22,"café",251,"2016-11-07",1,50,{"$f":"E33-T1","v":66},"ATTENTION MOINS DE 3 MOIS",{"$f":"E33-T1","v":66},90,"","b","",null,null,null,null,null,null,"Vachette dx",{"$f":"COUNTIF(C2:C372,\"*Vachette dx*\")","v":0}]
["A.9.0",22,"café",251,"2016-11-07",1,50,{"$f":"E34-T1","v":66},{"$f":"IF(K34=90,\"ATTENTION MOINS DE 3 MOIS\",IF(L34=30,\"ATTENTION MOINS DE 30 JOURS\",IF(M34=0,\"PERIME!!!\",\"OK\")))","v":"ATTENTION MOINS DE 3 MOIS"},{"$f":"E34-T1","v":66},90,"","b","",null,null,null,null,null,null,"Vachette sel",{"$f":"COUNTIF(C2:C372,\"*Vachette sel*\")","v":0}]
["A.9.1",22,"café",251,"2016-11-07",1,50,{"$f":"E35-T1","v":66},"ATTENTION MOINS DE 3 MOIS",{"$f":"E35-T1","v":66},90,"","b","",null," "]
["A.9.2",22,"café",189,"2016-09-07",1,50,{"$f":"E36-T1","v":5},"ATTENTION MOINS DE 30 JOURS",{"$f":"E36-T1","v":5},"",30,"b","",null," "]
["A.9.3",22,"café",251,"2016-11-07",1,50,{"$f":"E37-T1","v":66},"ATTENTION MOINS DE 3 MOIS",{"$f":"E37-T1","v":66},90,"","b","",null," "]
["B.1.0",8,"lait x 1",263,"2016-11-19",1,48,{"$f":"E38-T1","v":78},"ATTENTION MOINS DE 3 MOIS",{"$f":"E38-T1","v":78},90,"","b","",null," "]
["B.1.1","//","//","//","//","//",0,{"$f":"E39-T1","v":{"$error":"#VALUE!"}},{"$error":"#VALUE!"},{"$f":"E39-T1","v":{"$error":"#VALUE!"}},{"$error":"#VALUE!"},{"$error":"#VALUE!"},{"$error":"#VALUE!"},{"$error":"#VALUE!"},null," "]
["B.1.2","//","//","//","//","//",0,{"$f":"E40-T1","v":{"$error":"#VALUE!"}},{"$error":"#VALUE!"},{"$f":"E40-T1","v":{"$error":"#VALUE!"}},{"$error":"#VALUE!"},{"$error":"#VALUE!"},{"$error":"#VALUE!"},{"$error":"#VALUE!"}]
["B.1.3","//","//","//","//","//",0,{"$f":"E41-T1","v":{"$error":"#VALUE!"}},{"$error":"#VALUE!"},{"$f":"E41-T1","v":{"$error":"#VALUE!"}},{"$error":"#VALUE!"},{"$error":"#VALUE!"},{"$error":"#VALUE!"},{"$error":"#VALUE!"}]
["B.2.0",8,"lait x 1",345,"2017-02-10",1,48,{"$f":"E42-T1","v":161},"OK",{"$f":"E42-T1","v":161},"","","b","n"]
["B.2.1","//","//","//","//","//",0,{"$f":"E43-T1","v":{"$error":"#VALUE!"}},{"$error":"#VALUE!"},{"$f":"E43-T1","v":{"$error":"#VALUE!"}},{"$error":"#VALUE!"},{"$error":"#VALUE!"},{"$error":"#VALUE!"},{"$error":"#VALUE!"}]
["B.2.2",24,"bouchée",312,"2017-01-07",1,46,{"$f":"E44-T1","v":127},"OK",{"$f":"E44-T1","v":127},"","","b","n"]
["B.2.3",2,"pain",238,"2016-10-25",1,70,{"$f":"E45-T1","v":53},"ATTENTION MOINS DE 3 MOIS",{"$f":"E45-T1","v":53},90,"","b",""]
["B.3.0",3,"biscottes",289,"2016-12-15",1,48,{"$f":"E46-T1","v":104},"OK",{"$f":"E46-T1","v":104},"","","b","n"]
["B.3.1",2,"pain",224,"2016-10-11",1,70,{"$f":"E47-T1","v":39},"ATTENTION MOINS DE 3 MOIS",{"$f":"E47-T1","v":39},90,"","b",""]
["B.3.2",2,"pain",224,"2016-10-11",1,70,{"$f":"E48-T1","v":39},"ATTENTION MOINS DE 3 MOIS",{"$f":"E48-T1","v":39},90,"","b",""]
["B.3.3","//","//","//","//","//",0,{"$f":"E49-T1","v":{"$error":"#VALUE!"}},{"$error":"#VALUE!"},{"$f":"E49-T1","v":{"$error":"#VALUE!"}},{"$error":"#VALUE!"},{"$error":"#VALUE!"},{"$error":"#VALUE!"},{"$error":"#VALUE!"}]
["B.4.0",3,"biscottes",289,"2016-12-15",1,48,{"$f":"E50-T1","v":104},"OK",{"$f":"E50-T1","v":104},"","","b","n"]
["B.4.1",17,"saucisson ail",326,"2017-01-20",1,80,{"$f":"E51-T1","v":140},"OK",{"$f":"E51-T1","v":140},"","","b","n"]
["B.4.2",18,"macédoine 1 kg",275,"2016-12-01",1,50,{"$f":"E52-T1","v":90},"ATTENTION MOINS DE 3 MOIS",{"$f":"E52-T1","v":90},90,"","b",""]
["B.4.3",17,"saucisson ail",326,"2017-01-20",1,20,{"$f":"E53-T1","v":140},"OK",{"$f":"E53-T1","v":140},"","","b","n"]
["B.5.0",3,"biscottes",284,"2016-12-10",1,48,{"$f":"E54-T1","v":99},"OK",{"$f":"E54-T1","v":99},"","","b","n"]
["B.5.1","//","//","//","//","//",0,{"$f":"E55-T1","v":{"$error":"#VALUE!"}},{"$error":"#VALUE!"},{"$f":"E55-T1","v":{"$error":"#VALUE!"}},{"$error":"#VALUE!"},{"$error":"#VALUE!"},{"$error":"#VALUE!"},{"$error":"#VALUE!"}]
["B.5.2",5,"saucisson",296,"2016-12-22",1,90,{"$f":"E56-T1","v":111},"OK",{"$f":"E56-T1","v":111},"","","b","n"]
["B.5.3",5,"saucisson",296,"2016-12-22",1,90,{"$f":"E57-T1","v":111},"OK",{"$f":"E57-T1","v":111},"","","b","n"]
["B.6.0",3,"biscottes",284,"2016-12-10",1,48,{"$f":"E58-T1","v":99},{"$f":"IF(K58=90,\"ATTENTION MOINS DE 3 MOIS\",IF(L58=30,\"ATTENTION MOINS DE 30 JOURS\",IF(M58=0,\"PERIME!!!\",\"OK\")))","v":"OK"},{"$f":"E58-T1","v":99},"","","b","n"]
["B.6.1",19,"salami",362,"2017-02-27",1,23,{"$f":"E59-T1","v":178},{"$f":"IF(K59=90,\"ATTENTION MOINS DE 3 MOIS\",IF(L59=30,\"ATTENTION MOINS DE 30 JOURS\",IF(M59=0,\"PERIME!!!\",\"OK\")))","v":"OK"},{"$f":"E59-T1","v":178},"","","b","n"]
["B.6.2",21,"sucre",364,"2017-02-28",1,42,{"$f":"E60-T1","v":179},{"$f":"IF(K60=90,\"ATTENTION MOINS DE 3 MOIS\",IF(L60=30,\"ATTENTION MOINS DE 30 JOURS\",IF(M60=0,\"PERIME!!!\",\"OK\")))","v":"OK"},{"$f":"E60-T1","v":179},"","",{"$f":"IF(J60<=0,0,\"b\")","v":"b"},"n"]
["B.6.3",15,"salade verte",361,"2017-02-26",1,80,{"$f":"E61-T1","v":177},"OK",{"$f":"E61-T1","v":177},"","","b","n"]
["B.7.0",3,"biscottes",284,"2016-12-10",1,48,{"$f":"E62-T1","v":99},"OK",{"$f":"E62-T1","v":99},"","","b","n"]
["B.7.1","//","//","//","//","//",0,{"$f":"E63-T1","v":{"$error":"#VALUE!"}},{"$error":"#VALUE!"},{"$f":"E63-T1","v":{"$error":"#VALUE!"}},{"$error":"#VALUE!"},{"$error":"#VALUE!"},{"$error":"#VALUE!"},{"$error":"#VALUE!"}]
["B.7.2",5,"saucisson",321,"2017-01-16",1,90,{"$f":"E64-T1","v":136},"OK",{"$f":"E64-T1","v":136},"","","b","n"]
["B.7.3",5,"saucisson",321,"2017-01-16",1,20,{"$f":"E65-T1","v":136},"OK",{"$f":"E65-T1","v":136},"","","b","n"]
["B.8.0",3,"biscottes",284,"2016-12-10",1,48,{"$f":"E66-T1","v":99},"OK",{"$f":"E66-T1","v":99},"","","b","n"]
["B.8.1",28,"céleri",336,"2017-02-01",1,55,{"$f":"E67-T1","v":152},"OK",{"$f":"E67-T1","v":152},"","","b","n"]
["B.8.2",18,"macédoine 1 kg",275,"2016-12-01",1,80,{"$f":"E68-T1","v":90},"ATTENTION MOINS DE 3 MOIS",{"$f":"E68-T1","v":90},90,"","b",""]
["B.8.3",19,"salami",362,"2017-02-27",1,80,{"$f":"E69-T1","v":178},"OK",{"$f":"E69-T1","v":178},"","","b","n"]
["B.9.0",3,"biscottes",284,"2016-12-10",1,48,{"$f":"E70-T1","v":99},"OK",{"$f":"E70-T1","v":99},"","","b","n"]
["B.9.1",30,"pêche 1kg",306,"2017-01-01",1,60,{"$f":"E71-T1","v":121},"OK",{"$f":"E71-T1","v":121},"","","b","n"]
["B.9.2",17,"saucisson ail",326,"2017-01-20",1,26,{"$f":"E72-T1","v":140},"OK",{"$f":"E72-T1","v":140},"","","b","n"]
["B.9.3",15,"salade verte",361,"2017-02-26",1,80,{"$f":"E73-T1","v":177},"OK",{"$f":"E73-T1","v":177},"","","b","n"]
["C.1.0",7,"lait x 6",275,"2016-12-01",1,52,{"$f":"E74-T1","v":90},"ATTENTION MOINS DE 3 MOIS",{"$f":"E74-T1","v":90},90,"","b",""]
["C.1.1",11,"haricot blanc x 2",277,"2016-12-03",1,140,{"$f":"E75-T1","v":92},"OK",{"$f":"E75-T1","v":92},"","","b","n"]
["C.1.2","//","//","//","//","//",0,{"$f":"E76-T1","v":{"$error":"#VALUE!"}},{"$error":"#VALUE!"},{"$f":"E76-T1","v":{"$error":"#VALUE!"}},{"$error":"#VALUE!"},{"$error":"#VALUE!"},{"$error":"#VALUE!"},{"$error":"#VALUE!"}]
["C.1.3","//","//","//","//","//",0,{"$f":"E77-T1","v":{"$error":"#VALUE!"}},{"$error":"#VALUE!"},{"$f":"E77-T1","v":{"$error":"#VALUE!"}},{"$error":"#VALUE!"},{"$error":"#VALUE!"},{"$error":"#VALUE!"},{"$error":"#VALUE!"}]
["C.2.0",7,"lait x 6",275,"2016-12-01",1,52,{"$f":"E78-T1","v":90},"ATTENTION MOINS DE 3 MOIS",{"$f":"E78-T1","v":90},90,"","b",""]
["C.2.1","//","//","//","//","//",0,{"$f":"E79-T1","v":{"$error":"#VALUE!"}},{"$error":"#VALUE!"},{"$f":"E79-T1","v":{"$error":"#VALUE!"}},{"$error":"#VALUE!"},{"$error":"#VALUE!"},{"$error":"#VALUE!"},{"$error":"#VALUE!"}]
["C.2.2","//","//","//","//","//",0,{"$f":"E80-T1","v":{"$error":"#VALUE!"}},{"$error":"#VALUE!"},{"$f":"E80-T1","v":{"$error":"#VALUE!"}},{"$error":"#VALUE!"},{"$error":"#VALUE!"},{"$error":"#VALUE!"},{"$error":"#VALUE!"}]
["C.2.3","//","//","//","//","//",0,{"$f":"E81-T1","v":{"$error":"#VALUE!"}},{"$error":"#VALUE!"},{"$f":"E81-T1","v":{"$error":"#VALUE!"}},{"$error":"#VALUE!"},{"$error":"#VALUE!"},{"$error":"#VALUE!"},{"$error":"#VALUE!"}]
["C.3.0",28,"céleri",336,"2017-02-01",1,55,{"$f":"E82-T1","v":152},"OK",{"$f":"E82-T1","v":152},"","","b","n"]
["C.3.1","//","//","//","//","//",0,{"$f":"E83-T1","v":{"$error":"#VALUE!"}},{"$error":"#VALUE!"},{"$f":"E83-T71","v":{"$error":"#VALUE!"}},{"$error":"#VALUE!"},{"$error":"#VALUE!"},{"$error":"#VALUE!"},{"$error":"#VALUE!"}]
["C.3.2","//","//","//","//","//",0,{"$f":"E84-T1","v":{"$error":"#VALUE!"}},{"$error":"#VALUE!"},{"$f":"E84-T1","v":{"$error":"#VALUE!"}},{"$error":"#VALUE!"},{"$error":"#VALUE!"},{"$error":"#VALUE!"},{"$error":"#VALUE!"}]
["C.3.3","//","//","//","//","//",0,{"$f":"E85-T1","v":{"$error":"#VALUE!"}},{"$error":"#VALUE!"},{"$f":"E85-T1","v":{"$error":"#VALUE!"}},{"$error":"#VALUE!"},{"$error":"#VALUE!"},{"$error":"#VALUE!"},{"$error":"#VALUE!"}]
["C.4.0",7,"lait x 6",275,"2016-12-01",1,52,{"$f":"E86-T1","v":90},"ATTENTION MOINS DE 3 MOIS",{"$f":"E86-T1","v":90},90,"","b",""]
["C.4.1","//","//","//","//","//",0,{"$f":"E87-T1","v":{"$error":"#VALUE!"}},{"$error":"#VALUE!"},{"$f":"E87-T1","v":{"$error":"#VALUE!"}},{"$error":"#VALUE!"},{"$error":"#VALUE!"},{"$error":"#VALUE!"},{"$error":"#VALUE!"}]
["C.4.2","//","//","//","//","//",0,{"$f":"E88-T1","v":{"$error":"#VALUE!"}},{"$error":"#VALUE!"},{"$f":"E88-T1","v":{"$error":"#VALUE!"}},{"$error":"#VALUE!"},{"$error":"#VALUE!"},{"$error":"#VALUE!"},{"$error":"#VALUE!"}]
["C.4.3","//","//","//","//","//",0,{"$f":"E89-T1","v":{"$error":"#VALUE!"}},{"$error":"#VALUE!"},{"$f":"E89-T1","v":{"$error":"#VALUE!"}},{"$f":"IF(AND(J89<=90,J89>30),90,\"\")","v":{"$error":"#VALUE!"}},{"$f":"IF(AND(J89<=30,J89>0),30,\"\")","v":{"$error":"#VALUE!"}},{"$f":"IF(J89<=0,0,\"b\")","v":{"$error":"#VALUE!"}},{"$f":"IF(J89>90,\"n\",\"\")","v":{"$error":"#VALUE!"}}]
["C.5.0",7,"lait x 6",275,"2016-12-01",1,52,{"$f":"E90-T1","v":90},"ATTENTION MOINS DE 3 MOIS",{"$f":"E90-T1","v":90},90,"","b",""]
["C.5.1","//","//","//","//","//",0,{"$f":"E91-T1","v":{"$error":"#VALUE!"}},{"$error":"#VALUE!"},{"$f":"E91-T1","v":{"$error":"#VALUE!"}},{"$error":"#VALUE!"},{"$error":"#VALUE!"},{"$error":"#VALUE!"},{"$error":"#VALUE!"}]
["C.5.2","//","//","//","//","//",0,{"$f":"E92-T1","v":{"$error":"#VALUE!"}},{"$error":"#VALUE!"},{"$f":"E92-T1","v":{"$error":"#VALUE!"}},{"$error":"#VALUE!"},{"$error":"#VALUE!"},{"$error":"#VALUE!"},{"$error":"#VALUE!"}]
["C.5.3","//","//","//","//","//",0,{"$f":"E93-T1","v":{"$error":"#VALUE!"}},{"$error":"#VALUE!"},{"$f":"E93-T1","v":{"$error":"#VALUE!"}},{"$error":"#VALUE!"},{"$error":"#VALUE!"},{"$error":"#VALUE!"},{"$error":"#VALUE!"}]
["C.6.0",3,"biscottes",291,"2016-12-17",1,48,{"$f":"E94-T1","v":106},"OK",{"$f":"E94-T1","v":106},"","","b","n"]
["C.6.1","//","//","//","//","//",0,{"$f":"E95-T1","v":{"$error":"#VALUE!"}},{"$error":"#VALUE!"},{"$f":"E95-T1","v":{"$error":"#VALUE!"}},{"$error":"#VALUE!"},{"$error":"#VALUE!"},{"$error":"#VALUE!"},{"$error":"#VALUE!"}]
["C.6.2","//","//","//","//","//",0,{"$f":"E96-T1","v":{"$error":"#VALUE!"}},{"$error":"#VALUE!"},{"$f":"E96-T1","v":{"$error":"#VALUE!"}},{"$error":"#VALUE!"},{"$error":"#VALUE!"},{"$error":"#VALUE!"},{"$error":"#VALUE!"}]
["C.6.3","//","//","//","//","//",0,{"$f":"E97-T1","v":{"$error":"#VALUE!"}},{"$error":"#VALUE!"},{"$f":"E97-T1","v":{"$error":"#VALUE!"}},{"$error":"#VALUE!"},{"$error":"#VALUE!"},{"$error":"#VALUE!"},{"$error":"#VALUE!"}]
["C.7.0",6,"saucisse fumée",284,"2016-12-10",1,60,{"$f":"E98-T1","v":99},"OK",{"$f":"E98-T1","v":99},"","","b","n"]
["C.7.1","//","//","//","//","//",0,{"$f":"E99-T1","v":{"$error":"#VALUE!"}},{"$error":"#VALUE!"},{"$f":"E99-T1","v":{"$error":"#VALUE!"}},{"$error":"#VALUE!"},{"$error":"#VALUE!"},{"$error":"#VALUE!"},{"$error":"#VALUE!"}]
["C.7.2","//","//","//","//","//",0,{"$f":"E100-T1","v":{"$error":"#VALUE!"}},{"$error":"#VALUE!"},{"$f":"E100-T1","v":{"$error":"#VALUE!"}},{"$error":"#VALUE!"},{"$error":"#VALUE!"},{"$error":"#VALUE!"},{"$error":"#VALUE!"}]
["C.7.3",4,"pain de mie",315,"2017-01-10",1,72,{"$f":"E101-T1","v":130},"OK",{"$f":"E101-T1","v":130},"","","b","n"," "]
["C.8.0",7,"lait x 6",275,"2016-12-01",1,52,{"$f":"E102-T1","v":90},"ATTENTION MOINS DE 3 MOIS",{"$f":"E102-T1","v":90},90,"","b",""]
["C.8.1",7,"lait x 6",275,"2016-12-01",1,52,{"$f":"E103-T1","v":90},"ATTENTION MOINS DE 3 MOIS",{"$f":"E103-T1","v":90},90,"","b",""]
["C.8.2",7,"lait x 6",275,"2016-12-01",1,52,{"$f":"E104-T1","v":90},"ATTENTION MOINS DE 3 MOIS",{"$f":"E104-T1","v":90},90,"","b",""]
["C.8.3",7,"lait x 6",275,"2016-12-01",1,52,{"$f":"E105-T1","v":90},"ATTENTION MOINS DE 3 MOIS",{"$f":"E105-T1","v":90},90,"","b",""]
["C.9.0",7,"lait x 6",275,"2016-12-01",1,52,{"$f":"E106-T1","v":90},"ATTENTION MOINS DE 3 MOIS",{"$f":"E106-T1","v":90},90,"","b",""]
["C.9.1",4,"pain de mie",315,"2017-01-10",1,72,{"$f":"E107-T1","v":130},"OK",{"$f":"E107-T1","v":130},"","","b","n"]
["C.9.2",4,"pain de mie",315,"2017-01-10",1,72,{"$f":"E108-T1","v":130},"OK",{"$f":"E108-T1","v":130},"","","b","n"]
["C.9.3","//","//","//","//","//",0,{"$f":"E109-T1","v":{"$error":"#VALUE!"}},{"$error":"#VALUE!"},{"$f":"E109-T1","v":{"$error":"#VALUE!"}},{"$error":"#VALUE!"},{"$error":"#VALUE!"},{"$error":"#VALUE!"},{"$error":"#VALUE!"}]
["D.1.0",7,"lait x 6",275,"2016-12-01",1,52,{"$f":"E110-T1","v":90},"ATTENTION MOINS DE 3 MOIS",{"$f":"E110-T1","v":90},90,"","b",""]
["D.1.1","//","//","//","//","//",0,{"$f":"E111-T1","v":{"$error":"#VALUE!"}},{"$error":"#VALUE!"},{"$f":"E111-T1","v":{"$error":"#VALUE!"}},{"$error":"#VALUE!"},{"$error":"#VALUE!"},{"$error":"#VALUE!"},{"$error":"#VALUE!"}]
["D.1.2","//","//","//","//","//",0,{"$f":"E112-T1","v":{"$error":"#VALUE!"}},{"$error":"#VALUE!"},{"$f":"E112-T1","v":{"$error":"#VALUE!"}},{"$error":"#VALUE!"},{"$error":"#VALUE!"},{"$error":"#VALUE!"},{"$error":"#VALUE!"}]
["D.1.3","//","//","//","//","//",0,{"$f":"E113-T1","v":{"$error":"#VALUE!"}},{"$error":"#VALUE!"},{"$f":"E113-T1","v":{"$error":"#VALUE!"}},{"$error":"#VALUE!"},{"$error":"#VALUE!"},{"$error":"#VALUE!"},{"$error":"#VALUE!"}]
["D.2.0","//","//","//","//","//",0,{"$f":"E114-T1","v":{"$error":"#VALUE!"}},{"$error":"#VALUE!"},{"$f":"E114-T1","v":{"$error":"#VALUE!"}},{"$error":"#VALUE!"},{"$error":"#VALUE!"},{"$error":"#VALUE!"},{"$error":"#VALUE!"}]
["D.2.1","//","//","//","//","//",0,{"$f":"E115-T1","v":{"$error":"#VALUE!"}},{"$error":"#VALUE!"},{"$f":"E115-T1","v":{"$error":"#VALUE!"}},{"$error":"#VALUE!"},{"$error":"#VALUE!"},{"$error":"#VALUE!"},{"$error":"#VALUE!"}]
["D.2.2","//","//","//","//","//",0,{"$f":"E116-T1","v":{"$error":"#VALUE!"}},{"$error":"#VALUE!"},{"$f":"E116-T1","v":{"$error":"#VALUE!"}},{"$error":"#VALUE!"},{"$error":"#VALUE!"},{"$error":"#VALUE!"},{"$error":"#VALUE!"}]
["D.2.3","//","//","//","//","//",0,{"$f":"E117-T1","v":{"$error":"#VALUE!"}},{"$error":"#VALUE!"},{"$f":"E117-T1","v":{"$error":"#VALUE!"}},{"$error":"#VALUE!"},{"$error":"#VALUE!"},{"$error":"#VALUE!"},{"$error":"#VALUE!"}]
["D.3.0","//","//","//","//","//",0,{"$f":"E118-T1","v":{"$error":"#VALUE!"}},{"$error":"#VALUE!"},{"$f":"E118-T1","v":{"$error":"#VALUE!"}},{"$error":"#VALUE!"},{"$error":"#VALUE!"},{"$error":"#VALUE!"},{"$error":"#VALUE!"}]
["D.3.1","//","//","//","//","//",0,{"$f":"E119-T1","v":{"$error":"#VALUE!"}},{"$error":"#VALUE!"},{"$f":"E119-T1","v":{"$error":"#VALUE!"}},{"$error":"#VALUE!"},{"$error":"#VALUE!"},{"$error":"#VALUE!"},{"$error":"#VALUE!"}]
["D.3.2",16,"frite",120,"2016-06-29",1,80,{"$f":"E120-T1","v":-65},"PERIME!!!",{"$f":"E120-T1","v":-65},"","",0,""]
["D.3.3",16,"frite",256,"2016-11-12",1,80,{"$f":"E121-T1","v":71},"ATTENTION MOINS DE 3 MOIS",{"$f":"E121-T1","v":71},90,"","b",""]
["D.4.0",25,"sardine x 2",326,"2017-01-21",1,540,{"$f":"E122-T1","v":141},"OK",{"$f":"E122-T1","v":141},"","","b","n"]
["D.4.1",16,"frite",256,"2016-11-12",1,80,{"$f":"E123-T1","v":71},{"$f":"IF(K123=90,\"ATTENTION MOINS DE 3 MOIS\",IF(L123=30,\"ATTENTION MOINS DE 30 JOURS\",IF(M123=0,\"PERIME!!!\",\"OK\")))","v":"ATTENTION MOINS DE 3 MOIS"},{"$f":"E123-T1","v":71},90,"","b",""]
["D.4.2",16,"frite",256,"2016-11-12",1,80,{"$f":"E124-T1","v":71},"ATTENTION MOINS DE 3 MOIS",{"$f":"E124-T1","v":71},90,"","b",""]
["D.4.3",16,"frite",256,"2016-11-12",1,80,{"$f":"E125-T1","v":71},"ATTENTION MOINS DE 3 MOIS",{"$f":"E125-T1","v":71},90,"","b",""]
["D.5.0",6,"saucisse fumée",284,"2016-12-10",1,60,{"$f":"E126-T1","v":99},"OK",{"$f":"E126-T1","v":99},"","","b","n"]
["D.5.1",16,"frite",256,"2016-11-12",1,80,{"$f":"E127-T1","v":71},"ATTENTION MOINS DE 3 MOIS",{"$f":"E127-T1","v":71},90,"","b",""]
["D.5.2",16,"frite",256,"2016-11-12",1,80,{"$f":"E128-T1","v":71},"ATTENTION MOINS DE 3 MOIS",{"$f":"E128-T1","v":71},90,"","b",""]
["D.5.3",16,"frite",256,"2016-11-12",1,80,{"$f":"E129-T1","v":71},"ATTENTION MOINS DE 3 MOIS",{"$f":"E129-T1","v":71},90,"","b",""]
["D.6.0",25,"sardine x 2",326,"2017-01-21",1,540,{"$f":"E130-T1","v":141},"OK",{"$f":"E130-T1","v":141},"","","b","n"]
["D.6.1","//","//","//","//","//",0,{"$f":"E131-T1","v":{"$error":"#VALUE!"}},{"$error":"#VALUE!"},{"$f":"E131-T1","v":{"$error":"#VALUE!"}},{"$error":"#VALUE!"},{"$error":"#VALUE!"},{"$error":"#VALUE!"},{"$error":"#VALUE!"}]
["D.6.2","//","//","//","//","//",0,{"$f":"E132-T1","v":{"$error":"#VALUE!"}},{"$error":"#VALUE!"},{"$f":"E132-T1","v":{"$error":"#VALUE!"}},{"$error":"#VALUE!"},{"$error":"#VALUE!"},{"$error":"#VALUE!"},{"$error":"#VALUE!"}]
["D.6.3",16,"frite",256,"2016-11-12",1,80,{"$f":"E133-T1","v":71},"ATTENTION MOINS DE 3 MOIS",{"$f":"E133-T1","v":71},90,"","b",""]
["D.7.0",25,"sardine x 2",328,"2017-01-23",1,540,{"$f":"E134-T1","v":143},"OK",{"$f":"E134-T1","v":143},"","","b","n"]
["D.7.1",16,"frite",256,"2016-11-12",1,80,{"$f":"E135-T1","v":71},"ATTENTION MOINS DE 3 MOIS",{"$f":"E135-T1","v":71},90,"","b",""]
["D.7.2",16,"frite",256,"2016-11-12",1,80,{"$f":"E136-T1","v":71},"ATTENTION MOINS DE 3 MOIS",{"$f":"E136-T1","v":71},90,"","b",""]
["D.7.3","//","//","//","//","//",0,{"$f":"E137-T1","v":{"$error":"#VALUE!"}},{"$error":"#VALUE!"},{"$f":"E137-T1","v":{"$error":"#VALUE!"}},{"$error":"#VALUE!"},{"$error":"#VALUE!"},{"$error":"#VALUE!"},{"$error":"#VALUE!"}]
["D.8.0",25,"sardine x 2",326,"2017-01-21",1,540,{"$f":"E138-T1","v":141},"OK",{"$f":"E138-T1","v":141},"","","b","n"]
["D.8.1",16,"frite",256,"2016-11-12",1,80,{"$f":"E139-T1","v":71},"ATTENTION MOINS DE 3 MOIS",{"$f":"E139-T1","v":71},90,"","b",""]
["D.8.2",16,"frite",256,"2016-11-12",1,80,{"$f":"E140-T1","v":71},"ATTENTION MOINS DE 3 MOIS",{"$f":"E140-T1","v":71},90,"","b",""]
["D.8.3",16,"frite",256,"2016-11-12",1,80,{"$f":"E141-T1","v":71},"ATTENTION MOINS DE 3 MOIS",{"$f":"E141-T1","v":71},90,"","b",""]
["D.9.0",25,"sardine x 2",326,"2017-01-21",1,540,{"$f":"E142-T1","v":141},"OK",{"$f":"E142-T1","v":141},"","","b","n"]
["D.9.1",16,"frite",256,"2016-11-12",1,80,{"$f":"E143-T1","v":71},"ATTENTION MOINS DE 3 MOIS",{"$f":"E143-T1","v":71},90,"","b",""]
["D.9.2",16,"frite",256,"2016-11-12",1,80,{"$f":"E144-T1","v":71},"ATTENTION MOINS DE 3 MOIS",{"$f":"E144-T1","v":71},90,"","b",""]
["D.9.3","//","//","//","//","//",0,{"$f":"E145-T1","v":{"$error":"#VALUE!"}},{"$error":"#VALUE!"},{"$f":"E145-T1","v":{"$error":"#VALUE!"}},{"$error":"#VALUE!"},{"$error":"#VALUE!"},{"$error":"#VALUE!"},{"$error":"#VALUE!"}]
["E.1.0",25,"sardine x 2",328,"2017-01-23",1,540,{"$f":"E146-T1","v":143},"OK",{"$f":"E146-T1","v":143},"","","b","n"]
["E.1.1",29,"sucre","//","//","//",0,{"$f":"E147-T1","v":{"$error":"#VALUE!"}},{"$error":"#VALUE!"},{"$f":"E147-T1","v":{"$error":"#VALUE!"}},{"$error":"#VALUE!"},{"$error":"#VALUE!"},{"$error":"#VALUE!"},{"$error":"#VALUE!"}]
["E.1.2",29,"sucre","//","//","//",0,{"$f":"E148-T1","v":{"$error":"#VALUE!"}},{"$error":"#VALUE!"},{"$f":"E148-T1","v":{"$error":"#VALUE!"}},{"$error":"#VALUE!"},{"$error":"#VALUE!"},{"$error":"#VALUE!"},{"$error":"#VALUE!"}]
["E.1.3",29,"sucre","//","//","//",0,{"$f":"E149-T1","v":{"$error":"#VALUE!"}},{"$error":"#VALUE!"},{"$f":"E149-T1","v":{"$error":"#VALUE!"}},{"$error":"#VALUE!"},{"$error":"#VALUE!"},{"$error":"#VALUE!"},{"$error":"#VALUE!"}]
["E.2.0",25,"sardine x 2",326,"2017-01-21",1,540,{"$f":"E150-T1","v":141},"OK",{"$f":"E150-T1","v":141},"","","b","n"]
["E.2.1",29,"sucre","//","//","//",0,{"$f":"E151-T1","v":{"$error":"#VALUE!"}},{"$error":"#VALUE!"},{"$f":"E151-T1","v":{"$error":"#VALUE!"}},{"$error":"#VALUE!"},{"$error":"#VALUE!"},{"$error":"#VALUE!"},{"$error":"#VALUE!"}]
["E.2.2",29,"sucre","//","//","//",0,{"$f":"E152-T1","v":{"$error":"#VALUE!"}},{"$error":"#VALUE!"},{"$f":"E152-T1","v":{"$error":"#VALUE!"}},{"$error":"#VALUE!"},{"$error":"#VALUE!"},{"$error":"#VALUE!"},{"$error":"#VALUE!"}]
["E.2.3",29,"sucre","//","//","//",0,{"$f":"E153-T1","v":{"$error":"#VALUE!"}},{"$error":"#VALUE!"},{"$f":"E153-T1","v":{"$error":"#VALUE!"}},{"$f":"IF(AND(J153<=90,J153>30),90,\"\")","v":{"$error":"#VALUE!"}},{"$f":"IF(AND(J153<=30,J153>0),30,\"\")","v":{"$error":"#VALUE!"}},{"$f":"IF(J153<=0,0,\"b\")","v":{"$error":"#VALUE!"}},{"$f":"IF(J153>90,\"n\",\"\")","v":{"$error":"#VALUE!"}}]
["E.3.0",6,"saucisse fumée",284,"2016-12-10",1,60,{"$f":"E154-T1","v":99},"OK",{"$f":"E154-T1","v":99},"","","b","n"]
["E.3.1",29,"sucre","//","//","//",0,{"$f":"E155-T1","v":{"$error":"#VALUE!"}},{"$error":"#VALUE!"},{"$f":"E155-T1","v":{"$error":"#VALUE!"}},{"$error":"#VALUE!"},{"$error":"#VALUE!"},{"$error":"#VALUE!"},{"$error":"#VALUE!"}]
["E.3.2",29,"sucre","//","//","//",0,{"$f":"E156-T1","v":{"$error":"#VALUE!"}},{"$error":"#VALUE!"},{"$f":"E156-T1","v":{"$error":"#VALUE!"}},{"$error":"#VALUE!"},{"$error":"#VALUE!"},{"$error":"#VALUE!"},{"$error":"#VALUE!"}]
["E.3.3",29,"sucre","//","//","//",0,{"$f":"E157-T1","v":{"$error":"#VALUE!"}},{"$error":"#VALUE!"},{"$f":"E157-T1","v":{"$error":"#VALUE!"}},{"$error":"#VALUE!"},{"$error":"#VALUE!"},{"$error":"#VALUE!"},{"$error":"#VALUE!"}]
["E.4.0",25,"sardine x 2",326,"2017-01-21",1,540,{"$f":"E158-T1","v":141},"OK",{"$f":"E158-T1","v":141},"","","b","n"]
["E.4.1",29,"sucre","//","//","//",0,{"$f":"E159-T1","v":{"$error":"#VALUE!"}},{"$error":"#VALUE!"},{"$f":"E159-T1","v":{"$error":"#VALUE!"}},{"$error":"#VALUE!"},{"$error":"#VALUE!"},{"$error":"#VALUE!"},{"$error":"#VALUE!"}]
["E.4.2",29,"sucre","//","//","//",0,{"$f":"E160-T1","v":{"$error":"#VALUE!"}},{"$error":"#VALUE!"},{"$f":"E160-T1","v":{"$error":"#VALUE!"}},{"$error":"#VALUE!"},{"$error":"#VALUE!"},{"$error":"#VALUE!"},{"$error":"#VALUE!"}]
["E.4.3",29,"sucre","//","//","//",0,{"$f":"E161-T1","v":{"$error":"#VALUE!"}},{"$error":"#VALUE!"},{"$f":"E161-T1","v":{"$error":"#VALUE!"}},{"$error":"#VALUE!"},{"$error":"#VALUE!"},{"$error":"#VALUE!"},{"$error":"#VALUE!"}]
["E.5.0",25,"sardine x 2",328,"2017-01-23",1,540,{"$f":"E162-T1","v":143},"OK",{"$f":"E162-T1","v":143},"","","b","n"]
["E.5.1",2,"pain",224,"2016-10-11",1,70,{"$f":"E163-T1","v":39},"ATTENTION MOINS DE 3 MOIS",{"$f":"E163-T1","v":39},90,"","b",""]
["E.5.2",2,"pain","//","//","//",0,{"$f":"E164-T1","v":{"$error":"#VALUE!"}},{"$error":"#VALUE!"},{"$f":"E164-T1","v":{"$error":"#VALUE!"}},{"$error":"#VALUE!"},{"$error":"#VALUE!"},{"$error":"#VALUE!"},{"$error":"#VALUE!"}]
["E.5.3",2,"pain",224,"2016-10-11",1,70,{"$f":"E165-T1","v":39},"ATTENTION MOINS DE 3 MOIS",{"$f":"E165-T1","v":39},90,"","b",""]
["E.6.0",25,"sardine x 2",326,"2017-01-21",1,540,{"$f":"E166-T1","v":141},"OK",{"$f":"E166-T1","v":141},"","","b","n"]
["E.6.1",2,"pain",224,"2016-10-11",1,70,{"$f":"E167-T1","v":39},"ATTENTION MOINS DE 3 MOIS",{"$f":"E167-T1","v":39},90,"","b",""]
["E.6.2",2,"pain",224,"2016-10-11",1,70,{"$f":"E168-T1","v":39},"ATTENTION MOINS DE 3 MOIS",{"$f":"E168-T1","v":39},90,"","b",""]
["E.6.3",2,"pain",224,"2016-10-11",1,70,{"$f":"E169-T1","v":39},"ATTENTION MOINS DE 3 MOIS",{"$f":"E169-T1","v":39},90,"","b",""]
["E.7.0",25,"sardine x 2",328,"2017-01-23",1,540,{"$f":"E170-T1","v":143},"OK",{"$f":"E170-T1","v":143},"","","b","n"]
["E.7.1",2,"pain",224,"2016-10-11",1,70,{"$f":"E171-T1","v":39},"ATTENTION MOINS DE 3 MOIS",{"$f":"E171-T1","v":39},90,"","b",""]
["E.7.2",2,"pain",224,"2016-10-11",1,70,{"$f":"E172-T1","v":39},"ATTENTION MOINS DE 3 MOIS",{"$f":"E172-T1","v":39},90,"","b",""]
["E.7.3",2,"pain",224,"2016-10-11",1,70,{"$f":"E173-T1","v":39},"ATTENTION MOINS DE 3 MOIS",{"$f":"E173-T1","v":39},90,"","b",""]
["E.8.0",10,"haricot vert x 2",332,"2017-01-27",1,540,{"$f":"E174-T1","v":147},"OK",{"$f":"E174-T1","v":147},"","","b","n"]
["E.8.1",2,"pain",224,"2016-10-11",1,70,{"$f":"E175-T1","v":39},"ATTENTION MOINS DE 3 MOIS",{"$f":"E175-T1","v":39},90,"","b",""]
["E.8.2",30,"pêche 1kg",306,"2017-01-01",1,60,{"$f":"E176-T1","v":121},"OK",{"$f":"E176-T1","v":121},"","","b","n"]
["E.8.3",21,"sucre",364,"2017-02-28",1,42,{"$f":"E177-T1","v":179},"OK",{"$f":"E177-T1","v":179},"","","b","n"]
["E.9.0",10,"haricot vert x 2",326,"2017-01-21",1,540,{"$f":"E178-T1","v":141},"OK",{"$f":"E178-T1","v":141},"","","b","n"]
["E.9.1",28,"céleri",336,"2017-02-01",1,55,{"$f":"E179-T1","v":152},"OK",{"$f":"E179-T1","v":152},"","","b","n"]
["E.9.2",15,"salade verte",361,"2017-02-26",1,80,{"$f":"E180-T1","v":177},"OK",{"$f":"E180-T1","v":177},"","","b","n"]
["E.9.3",21,"sucre",364,"2017-02-28",1,42,{"$f":"E181-T1","v":179},"OK",{"$f":"E181-T1","v":179},"","","b","n"]
["F.1.0",10,"haricot vert x 2",326,"2017-01-21",1,540,{"$f":"E182-T1","v":141},"OK",{"$f":"E182-T1","v":141},"","","b","n"]
["F.1.1",21,"sucre",364,"2017-02-28",1,42,{"$f":"E183-T1","v":179},"OK",{"$f":"E183-T1","v":179},"","","b","n"]
["F.1.2",21,"sucre",364,"2017-02-28",1,42,{"$f":"E184-T1","v":179},"OK",{"$f":"E184-T1","v":179},"","","b","n"]
["F.1.3",30,"pêche 1kg",306,"2017-01-01",1,60,{"$f":"E185-T1","v":121},"OK",{"$f":"E185-T1","v":121},"","","b","n"]
["F.2.0",10,"haricot vert x 2",326,"2017-01-21",1,540,{"$f":"E186-T1","v":141},"OK",{"$f":"E186-T1","v":141},"","","b","n"]
["F.2.1",21,"sucre",364,"2017-02-28",1,42,{"$f":"E187-T1","v":179},{"$f":"IF(K187=90,\"ATTENTION MOINS DE 3 MOIS\",IF(L187=30,\"ATTENTION MOINS DE 30 JOURS\",IF(M187=0,\"PERIME!!!\",\"OK\")))","v":"OK"},{"$f":"E187-T1","v":179},"","","b","n"]
["F.2.2",18,"macédoine 1 kg",275,"2016-12-01",1,80,{"$f":"E188-T1","v":90},"ATTENTION MOINS DE 3 MOIS",{"$f":"E188-T1","v":90},90,"","b",""]
["F.2.3",28,"céleri",336,"2017-02-01",1,55,{"$f":"E189-T1","v":152},"OK",{"$f":"E189-T1","v":152},"","","b","n"]
["F.3.0",10,"haricot vert x 2",326,"2017-01-21",1,540,{"$f":"E190-T1","v":141},"OK",{"$f":"E190-T1","v":141},"","","b","n"]
["F.3.1","//","//","//","//","//",0,{"$f":"E191-T1","v":{"$error":"#VALUE!"}},{"$error":"#VALUE!"},{"$f":"E191-T1","v":{"$error":"#VALUE!"}},{"$error":"#VALUE!"},{"$error":"#VALUE!"},{"$error":"#VALUE!"},{"$error":"#VALUE!"}]
["F.3.2",15,"salade verte",361,"2017-02-26",1,80,{"$f":"E192-T1","v":177},"OK",{"$f":"E192-T1","v":177},"","","b","n"]
["F.3.3",21,"sucre",364,"2017-02-28",1,42,{"$f":"E193-T1","v":179},"OK",{"$f":"E193-T1","v":179},"","","b","n"]
["F.4.0",10,"haricot vert x 2",326,"2017-01-21",1,540,{"$f":"E194-T1","v":141},"OK",{"$f":"E194-T1","v":141},"","","b","n"]
["F.4.1",18,"macédoine 1 kg",275,"2016-12-01",1,80,{"$f":"E195-T1","v":90},"ATTENTION MOINS DE 3 MOIS",{"$f":"E195-T1","v":90},90,"","b",""]
["F.4.2",30,"pêche 1kg",306,"2017-01-01",1,60,{"$f":"E196-T1","v":121},"OK",{"$f":"E196-T1","v":121},"","","b","n"]
["F.4.3",21,"sucre",364,"2017-02-28",1,42,{"$f":"E197-T1","v":179},"OK",{"$f":"E197-T1","v":179},"","","b","n"]
["F.5.0",10,"haricot vert x 2",326,"2017-01-21",1,540,{"$f":"E198-T1","v":141},"OK",{"$f":"E198-T1","v":141},"","","b","n"]
["F.5.1",4,"pain de mie",255,"2016-11-11",1,72,{"$f":"E199-T1","v":70},"ATTENTION MOINS DE 3 MOIS",{"$f":"E199-T1","v":70},90,"","b",""]
["F.5.2",4,"pain de mie",255,"2016-11-11",1,72,{"$f":"E200-T1","v":70},"ATTENTION MOINS DE 3 MOIS",{"$f":"E200-T1","v":70},90,"","b",""]
["F.5.3",4,"pain de mie",255,"2016-11-11",1,72,{"$f":"E201-T1","v":70},"ATTENTION MOINS DE 3 MOIS",{"$f":"E201-T1","v":70},90,"","b",""]
["F.6.0",28,"céleri",336,"2017-02-01",1,55,{"$f":"E202-T1","v":152},"OK",{"$f":"E202-T1","v":152},"","","b","n"]
["F.6.1","//","//","//","//","//",0,{"$f":"E203-T1","v":{"$error":"#VALUE!"}},{"$error":"#VALUE!"},{"$f":"E203-T1","v":{"$error":"#VALUE!"}},{"$error":"#VALUE!"},{"$error":"#VALUE!"},{"$error":"#VALUE!"},{"$error":"#VALUE!"}]
["F.6.2",4,"pain de mie",255,"2016-11-11",1,72,{"$f":"E204-T1","v":70},"ATTENTION MOINS DE 3 MOIS",{"$f":"E204-T1","v":70},90,"","b",""]
["F.6.3",4,"pain de mie",255,"2016-11-11",1,72,{"$f":"E205-T1","v":70},"ATTENTION MOINS DE 3 MOIS",{"$f":"E205-T1","v":70},90,"","b",""]
["F.7.0",10,"haricot vert x 2",326,"2017-01-21",1,540,{"$f":"E206-T1","v":141},"OK",{"$f":"E206-T1","v":141},"","","b","n"]
["F.7.1",4,"pain de mie",193,"2016-09-11",1,72,{"$f":"E207-T1","v":9},"ATTENTION MOINS DE 30 JOURS",{"$f":"E207-T1","v":9},"",30,"b",""]
["F.7.2",4,"pain de mie",255,"2016-11-11",1,72,{"$f":"E208-T1","v":70},"ATTENTION MOINS DE 3 MOIS",{"$f":"E208-T1","v":70},90,"","b",""]
["F.7.3",4,"pain de mie",255,"2016-11-11",1,72,{"$f":"E209-T1","v":70},"ATTENTION MOINS DE 3 MOIS",{"$f":"E209-T1","v":70},90,"","b",""]
["F.8.0",7,"lait x 6",275,"2016-12-01",1,52,{"$f":"E210-T1","v":90},"ATTENTION MOINS DE 3 MOIS",{"$f":"E210-T1","v":90},90,"","b",""]
["F.8.1",4,"pain de mie",255,"2016-11-11",1,72,{"$f":"E211-T1","v":70},"ATTENTION MOINS DE 3 MOIS",{"$f":"E211-T1","v":70},90,"","b",""]
["F.8.2",4,"pain de mie",255,"2016-11-11",1,72,{"$f":"E212-T1","v":70},"ATTENTION MOINS DE 3 MOIS",{"$f":"E212-T1","v":70},90,"","b",""]
["F.8.3",4,"pain de mie",255,"2016-11-11",1,72,{"$f":"E213-T1","v":70},"ATTENTION MOINS DE 3 MOIS",{"$f":"E213-T1","v":70},90,"","b",""]
["F.9.0",4,"pain de mie",267,"2016-11-23",1,72,{"$f":"E214-T1","v":82},"ATTENTION MOINS DE 3 MOIS",{"$f":"E214-T1","v":82},90,"","b",""]
["F.9.1",4,"pain de mie",255,"2016-11-11",1,72,{"$f":"E215-T1","v":70},"ATTENTION MOINS DE 3 MOIS",{"$f":"E215-T1","v":70},90,"","b",""]
["F.9.2",15,"salade verte",361,"2017-02-26",1,80,{"$f":"E216-T1","v":177},"OK",{"$f":"E216-T1","v":177},"","","b","n"]
["F.9.3",30,"pêche 1kg",306,"2017-01-01",1,60,{"$f":"E217-T1","v":121},"OK",{"$f":"E217-T1","v":121},{"$f":"IF(AND(J217<=90,J217>30),90,\"\")","v":""},{"$f":"IF(AND(J217<=30,J217>0),30,\"\")","v":""},{"$f":"IF(J217<=0,0,\"b\")","v":"b"},{"$f":"IF(J217>90,\"n\",\"\")","v":"n"}]
["G.1.0",10,"haricot vert x 2",332,"2017-01-27",1,540,{"$f":"E218-T1","v":147},"OK",{"$f":"E218-T1","v":147},"","","b","n"]
["G.1.1","//","//","//","//","//",0,{"$f":"E219-T1","v":{"$error":"#VALUE!"}},{"$error":"#VALUE!"},{"$f":"E219-T1","v":{"$error":"#VALUE!"}},{"$error":"#VALUE!"},{"$error":"#VALUE!"},{"$error":"#VALUE!"},{"$error":"#VALUE!"}]
["G.1.2","//","//","//","//","//",0,{"$f":"E220-T1","v":{"$error":"#VALUE!"}},{"$error":"#VALUE!"},{"$f":"E220-T1","v":{"$error":"#VALUE!"}},{"$error":"#VALUE!"},{"$error":"#VALUE!"},{"$error":"#VALUE!"},{"$error":"#VALUE!"}]
["G.1.3","//","//","//","//","//",0,{"$f":"E221-T1","v":{"$error":"#VALUE!"}},{"$error":"#VALUE!"},{"$f":"E221-T1","v":{"$error":"#VALUE!"}},{"$error":"#VALUE!"},{"$error":"#VALUE!"},{"$error":"#VALUE!"},{"$error":"#VALUE!"}]
["G.2.0",13,"jambon ",331,"2017-01-26",1,30,{"$f":"E222-T1","v":146},"OK",{"$f":"E222-T1","v":146},"","","b","n"]
["G.2.1","//","//","//","//","//",0,{"$f":"E223-T1","v":{"$error":"#VALUE!"}},{"$error":"#VALUE!"},{"$f":"E223-T1","v":{"$error":"#VALUE!"}},{"$error":"#VALUE!"},{"$error":"#VALUE!"},{"$error":"#VALUE!"},{"$error":"#VALUE!"}]
["G.2.2","//","//","//","//","//",0,{"$f":"E224-T1","v":{"$error":"#VALUE!"}},{"$error":"#VALUE!"},{"$f":"E224-T1","v":{"$error":"#VALUE!"}},{"$error":"#VALUE!"},{"$error":"#VALUE!"},{"$error":"#VALUE!"},{"$error":"#VALUE!"}]
["G.2.3","//","//","//","//","//",0,{"$f":"E225-T1","v":{"$error":"#VALUE!"}},{"$error":"#VALUE!"},{"$f":"E225-T1","v":{"$error":"#VALUE!"}},{"$error":"#VALUE!"},{"$error":"#VALUE!"},{"$error":"#VALUE!"},{"$error":"#VALUE!"}]
["G.3.0","//","//","//","//","//",0,{"$f":"E226-T1","v":{"$error":"#VALUE!"}},{"$error":"#VALUE!"},{"$f":"E226-T1","v":{"$error":"#VALUE!"}},{"$error":"#VALUE!"},{"$error":"#VALUE!"},{"$error":"#VALUE!"},{"$error":"#VALUE!"}]
["G.3.1","//","//","//","//","//",0,{"$f":"E227-T1","v":{"$error":"#VALUE!"}},{"$error":"#VALUE!"},{"$f":"E227-T1","v":{"$error":"#VALUE!"}},{"$error":"#VALUE!"},{"$error":"#VALUE!"},{"$error":"#VALUE!"},{"$error":"#VALUE!"}]
["G.3.2","//","//","//","//","//",0,{"$f":"E228-T1","v":{"$error":"#VALUE!"}},{"$error":"#VALUE!"},{"$f":"E228-T1","v":{"$error":"#VALUE!"}},{"$error":"#VALUE!"},{"$error":"#VALUE!"},{"$error":"#VALUE!"},{"$error":"#VALUE!"}]
["G.3.3","//","//","//","//","//",0,{"$f":"E229-T1","v":{"$error":"#VALUE!"}},{"$error":"#VALUE!"},{"$f":"E229-T1","v":{"$error":"#VALUE!"}},{"$error":"#VALUE!"},{"$error":"#VALUE!"},{"$error":"#VALUE!"},{"$error":"#VALUE!"}]
["G.4.0","//","//","//","//","//",0,{"$f":"E230-T1","v":{"$error":"#VALUE!"}},{"$error":"#VALUE!"},{"$f":"E230-T1","v":{"$error":"#VALUE!"}},{"$error":"#VALUE!"},{"$error":"#VALUE!"},{"$error":"#VALUE!"},{"$error":"#VALUE!"}]
["G.4.1","//","//","//","//","//",0,{"$f":"E231-T1","v":{"$error":"#VALUE!"}},{"$error":"#VALUE!"},{"$f":"E231-T1","v":{"$error":"#VALUE!"}},{"$error":"#VALUE!"},{"$error":"#VALUE!"},{"$error":"#VALUE!"},{"$error":"#VALUE!"}]
["G.4.2","//","//","//","//","//",0,{"$f":"E232-T1","v":{"$error":"#VALUE!"}},{"$error":"#VALUE!"},{"$f":"E232-T1","v":{"$error":"#VALUE!"}},{"$error":"#VALUE!"},{"$error":"#VALUE!"},{"$error":"#VALUE!"},{"$error":"#VALUE!"}]
["G.4.3","//","//","//","//","//",0,{"$f":"E233-T1","v":{"$error":"#VALUE!"}},{"$error":"#VALUE!"},{"$f":"E233-T1","v":{"$error":"#VALUE!"}},{"$error":"#VALUE!"},{"$error":"#VALUE!"},{"$error":"#VALUE!"},{"$error":"#VALUE!"}]
["G.5.0","//","//","//","//","//",0,{"$f":"E234-T1","v":{"$error":"#VALUE!"}},{"$error":"#VALUE!"},{"$f":"E234-T1","v":{"$error":"#VALUE!"}},{"$error":"#VALUE!"},{"$error":"#VALUE!"},{"$error":"#VALUE!"},{"$error":"#VALUE!"}]
["G.5.1",2,"pain",224,"2016-10-11",1,70,{"$f":"E235-T1","v":39},"ATTENTION MOINS DE 3 MOIS",{"$f":"E235-T1","v":39},90,"","b",""]
["G.5.2",2,"pain",224,"2016-10-11",1,70,{"$f":"E236-T1","v":39},"ATTENTION MOINS DE 3 MOIS",{"$f":"E236-T1","v":39},90,"","b",""]
["G.5.3",2,"pain",224,"2016-10-11",1,70,{"$f":"E237-T1","v":39},"ATTENTION MOINS DE 3 MOIS",{"$f":"E237-T1","v":39},90,"","b",""]
["G.6.0",10,"haricot vert x 2",326,"2017-01-21",1,540,{"$f":"E238-T1","v":141},"OK",{"$f":"E238-T1","v":141},"","","b","n"]
["G.6.1",2,"pain",224,"2016-10-11",1,70,{"$f":"E239-T1","v":39},"ATTENTION MOINS DE 3 MOIS",{"$f":"E239-T1","v":39},90,"","b",""]
["G.6.2",2,"pain",224,"2016-10-11",1,70,{"$f":"E240-T1","v":39},"ATTENTION MOINS DE 3 MOIS",{"$f":"E240-T1","v":39},90,"","b",""]
["G.6.3",2,"pain",224,"2016-10-11",1,70,{"$f":"E241-T1","v":39},"ATTENTION MOINS DE 3 MOIS",{"$f":"E241-T1","v":39},90,"","b",""]
["G.7.0","//","//","//","//","//",0,{"$f":"E242-T1","v":{"$error":"#VALUE!"}},{"$error":"#VALUE!"},{"$f":"E242-T1","v":{"$error":"#VALUE!"}},{"$error":"#VALUE!"},{"$error":"#VALUE!"},{"$error":"#VALUE!"},{"$error":"#VALUE!"}]
["G.7.1","//","//","//","//","//",0,{"$f":"E243-T1","v":{"$error":"#VALUE!"}},{"$error":"#VALUE!"},{"$f":"E243-T1","v":{"$error":"#VALUE!"}},{"$error":"#VALUE!"},{"$error":"#VALUE!"},{"$error":"#VALUE!"},{"$error":"#VALUE!"}]
["G.7.2","//","//","//","//","//",0,{"$f":"E244-T1","v":{"$error":"#VALUE!"}},{"$error":"#VALUE!"},{"$f":"E244-T1","v":{"$error":"#VALUE!"}},{"$error":"#VALUE!"},{"$error":"#VALUE!"},{"$error":"#VALUE!"},{"$error":"#VALUE!"}]
["G.7.3","//","//","//","//","//",0,{"$f":"E245-T1","v":{"$error":"#VALUE!"}},{"$error":"#VALUE!"},{"$f":"E245-T1","v":{"$error":"#VALUE!"}},{"$error":"#VALUE!"},{"$error":"#VALUE!"},{"$error":"#VALUE!"},{"$error":"#VALUE!"}]
["G.8.0",28,"céleri",336,"2017-02-01",1,55,{"$f":"E246-T1","v":152},"OK",{"$f":"E246-T1","v":152},"","","b","n"]
["G.8.1",2,"pain",224,"2016-10-11",1,70,{"$f":"E247-T1","v":39},"ATTENTION MOINS DE 3 MOIS",{"$f":"E247-T1","v":39},90,"","b",""]
["G.8.2",2,"pain",224,"2016-10-11",1,70,{"$f":"E248-T1","v":39},"ATTENTION MOINS DE 3 MOIS",{"$f":"E248-T1","v":39},90,"","b",""]
["G.8.3",2,"pain",224,"2016-10-11",1,70,{"$f":"E249-T1","v":39},"ATTENTION MOINS DE 3 MOIS",{"$f":"E249-T1","v":39},90,"","b",""]
["G.9.0","//","//","//","//","//",0,{"$f":"E250-T1","v":{"$error":"#VALUE!"}},{"$error":"#VALUE!"},{"$f":"E250-T1","v":{"$error":"#VALUE!"}},{"$error":"#VALUE!"},{"$error":"#VALUE!"},{"$error":"#VALUE!"},{"$error":"#VALUE!"}]
["G.9.1",2,"pain",224,"2016-10-11",1,70,{"$f":"E251-T1","v":39},{"$f":"IF(K251=90,\"ATTENTION MOINS DE 3 MOIS\",IF(L251=30,\"ATTENTION MOINS DE 30 JOURS\",IF(M251=0,\"PERIME!!!\",\"OK\")))","v":"ATTENTION MOINS DE 3 MOIS"},{"$f":"E251-T1","v":39},90,"","b",""]
["G.9.2",2,"pain",224,"2016-10-11",1,70,{"$f":"E252-T1","v":39},"ATTENTION MOINS DE 3 MOIS",{"$f":"E252-T1","v":39},90,"","b",""]
["G.9.3",2,"pain",224,"2016-10-11",1,27,{"$f":"E253-T1","v":39},"ATTENTION MOINS DE 3 MOIS",{"$f":"E253-T1","v":39},90,"","b",""]
["H.1.0",7,"lait x 6",275,"2016-12-01",1,52,{"$f":"E254-T1","v":90},"ATTENTION MOINS DE 3 MOIS",{"$f":"E254-T1","v":90},90,"","b",""]
["H.1.1","//","//","//","//","//",0,{"$f":"E255-T1","v":{"$error":"#VALUE!"}},{"$error":"#VALUE!"},{"$f":"E255-T1","v":{"$error":"#VALUE!"}},{"$error":"#VALUE!"},{"$error":"#VALUE!"},{"$error":"#VALUE!"},{"$error":"#VALUE!"}]
["H.1.2","//","//","//","//","//",0,{"$f":"E256-T1","v":{"$error":"#VALUE!"}},{"$error":"#VALUE!"},{"$f":"E256-T1","v":{"$error":"#VALUE!"}},{"$error":"#VALUE!"},{"$error":"#VALUE!"},{"$error":"#VALUE!"},{"$error":"#VALUE!"}]
["H.1.3","//","//","//","//","//",0,{"$f":"E257-T1","v":{"$error":"#VALUE!"}},{"$error":"#VALUE!"},{"$f":"E257-T1","v":{"$error":"#VALUE!"}},{"$error":"#VALUE!"},{"$error":"#VALUE!"},{"$error":"#VALUE!"},{"$error":"#VALUE!"}]
["H.2.0",7,"lait x 6",275,"2016-10-01",1,52,{"$f":"E258-T1","v":29},"ATTENTION MOINS DE 30 JOURS",{"$f":"E258-T1","v":29},"",30,"b",""]
["H.2.1","//","//","//","//","//",0,{"$f":"E259-T1","v":{"$error":"#VALUE!"}},{"$error":"#VALUE!"},{"$f":"E259-T1","v":{"$error":"#VALUE!"}},{"$error":"#VALUE!"},{"$error":"#VALUE!"},{"$error":"#VALUE!"},{"$error":"#VALUE!"}]
["H.2.2",13,"jambon ",297,"2016-12-23",1,80,{"$f":"E260-T1","v":112},"OK",{"$f":"E260-T1","v":112},"","","b","n"]
["H.2.3",13,"jambon ",297,"2016-12-23",1,80,{"$f":"E261-T1","v":112},"OK",{"$f":"E261-T1","v":112},"","","b","n"]
["H.3.0",10,"haricot vert x 2",326,"2017-01-21",1,540,{"$f":"E262-T1","v":141},"OK",{"$f":"E262-T1","v":141},"","","b","n"]
["H.3.1",13,"jambon ",297,"2016-12-23",1,80,{"$f":"E263-T1","v":112},"OK",{"$f":"E263-T1","v":112},"","","b","n"]
["H.3.2",13,"jambon ",297,"2016-12-23",1,80,{"$f":"E264-T1","v":112},"OK",{"$f":"E264-T1","v":112},"","","b","n"]
["H.3.3",13,"jambon ",297,"2016-12-23",1,80,{"$f":"E265-T1","v":112},"OK",{"$f":"E265-T1","v":112},"","","b","n"]
["H.4.0",30,"pêche 1kg",306,"2017-01-01",1,60,{"$f":"E266-T1","v":121},"OK",{"$f":"E266-T1","v":121},"","","b","n"]
["H.4.1","//","//","//","//","//",0,{"$f":"E267-T1","v":{"$error":"#VALUE!"}},{"$error":"#VALUE!"},{"$f":"E267-T1","v":{"$error":"#VALUE!"}},{"$error":"#VALUE!"},{"$error":"#VALUE!"},{"$error":"#VALUE!"},{"$error":"#VALUE!"}]
["H.4.2","//","//","//","//","//",0,{"$f":"E268-T1","v":{"$error":"#VALUE!"}},{"$error":"#VALUE!"},{"$f":"E268-T1","v":{"$error":"#VALUE!"}},{"$error":"#VALUE!"},{"$error":"#VALUE!"},{"$error":"#VALUE!"},{"$error":"#VALUE!"}]
["H.4.3","//","//","//","//","//",0,{"$f":"E269-T1","v":{"$error":"#VALUE!"}},{"$error":"#VALUE!"},{"$f":"E269-T1","v":{"$error":"#VALUE!"}},{"$error":"#VALUE!"},{"$error":"#VALUE!"},{"$error":"#VALUE!"},{"$error":"#VALUE!"}]
["H.5.0",7,"lait x 6",275,"2016-12-01",1,52,{"$f":"E270-T1","v":90},"ATTENTION MOINS DE 3 MOIS",{"$f":"E270-T1","v":90},90,"","b",""]
["H.5.1","//","//","//","//","//",0,{"$f":"E271-T1","v":{"$error":"#VALUE!"}},{"$error":"#VALUE!"},{"$f":"E271-T1","v":{"$error":"#VALUE!"}},{"$error":"#VALUE!"},{"$error":"#VALUE!"},{"$error":"#VALUE!"},{"$error":"#VALUE!"}]
["H.5.2","//","//","//","//","//",0,{"$f":"E272-T1","v":{"$error":"#VALUE!"}},{"$error":"#VALUE!"},{"$f":"E272-T1","v":{"$error":"#VALUE!"}},{"$error":"#VALUE!"},{"$error":"#VALUE!"},{"$error":"#VALUE!"},{"$error":"#VALUE!"}]
["H.5.3","//","//","//","//","//",0,{"$f":"E273-T1","v":{"$error":"#VALUE!"}},{"$error":"#VALUE!"},{"$f":"E273-T1","v":{"$error":"#VALUE!"}},{"$error":"#VALUE!"},{"$error":"#VALUE!"},{"$error":"#VALUE!"},{"$error":"#VALUE!"}]
["H.6.0",7,"lait x 6",275,"2016-12-01",1,52,{"$f":"E274-T1","v":90},"ATTENTION MOINS DE 3 MOIS",{"$f":"E274-T1","v":90},90,"","b",""]
["H.6.1",13,"jambon ",297,"2016-12-23",1,80,{"$f":"E275-T1","v":112},"OK",{"$f":"E275-T1","v":112},"","","b","n"]
["H.6.2",13,"jambon ",297,"2016-12-23",1,80,{"$f":"E276-T1","v":112},"OK",{"$f":"E276-T1","v":112},"","","b","n"]
["H.6.3",13,"jambon ",297,"2016-12-23",1,80,{"$f":"E277-T1","v":112},"OK",{"$f":"E277-T1","v":112},"","","b","n"]
["H.7.0",10,"haricot vert x 2",326,"2017-01-21",1,540,{"$f":"E278-T1","v":141},"OK",{"$f":"E278-T1","v":141},"","","b","n"]
["H.7.1",14,"carotte rappée",328,"2017-01-23",1,80,{"$f":"E279-T1","v":143},"OK",{"$f":"E279-T1","v":143},"","","b","n"]
["H.7.2",14,"carotte rappée",333,"2017-01-28",1,80,{"$f":"E280-T1","v":148},"OK",{"$f":"E280-T1","v":148},"","","b","n"]
["H.7.3",14,"carotte rappée",328,"2017-01-23",1,80,{"$f":"E281-T1","v":143},"OK",{"$f":"E281-T1","v":143},{"$f":"IF(AND(J281<=90,J281>30),90,\"\")","v":""},{"$f":"IF(AND(J281<=30,J281>0),30,\"\")","v":""},{"$f":"IF(J281<=0,0,\"b\")","v":"b"},{"$f":"IF(J281>90,\"n\",\"\")","v":"n"}]
["H.8.0",7,"lait x 6",275,"2016-12-01",1,52,{"$f":"E282-T1","v":90},"ATTENTION MOINS DE 3 MOIS",{"$f":"E282-T1","v":90},90,"","b",""]
["H.8.1",13,"jambon ",297,"2016-12-23",1,80,{"$f":"E283-T1","v":112},"OK",{"$f":"E283-T1","v":112},"","","b","n"]
["H.8.2",13,"jambon ",297,"2016-12-23",1,80,{"$f":"E284-T1","v":112},"OK",{"$f":"E284-T1","v":112},"","","b","n"]
["H.8.3",13,"jambon ",297,"2016-12-23",1,80,{"$f":"E285-T1","v":112},"OK",{"$f":"E285-T1","v":112},"","","b","n"]
["H.9.0","//","//","//","//","//",0,{"$f":"E286-T1","v":{"$error":"#VALUE!"}},{"$error":"#VALUE!"},{"$f":"E286-T1","v":{"$error":"#VALUE!"}},{"$error":"#VALUE!"},{"$error":"#VALUE!"},{"$error":"#VALUE!"},{"$error":"#VALUE!"}]
["H.9.1",13,"jambon ",297,"2016-12-23",1,80,{"$f":"E287-T1","v":112},"OK",{"$f":"E287-T1","v":112},"","","b","n"]
["H.9.2",13,"jambon ",297,"2016-12-23",1,80,{"$f":"E288-T1","v":112},"OK",{"$f":"E288-T1","v":112},"","","b","n"]
["H.9.3",13,"jambon ",297,"2016-12-23",1,80,{"$f":"E289-T1","v":112},"OK",{"$f":"E289-T1","v":112},"","","b","n"]
["I.1.0","//","//","//","//","//",0,{"$f":"E290-T1","v":{"$error":"#VALUE!"}},{"$error":"#VALUE!"},{"$f":"E290-T1","v":{"$error":"#VALUE!"}},{"$error":"#VALUE!"},{"$error":"#VALUE!"},{"$error":"#VALUE!"},{"$error":"#VALUE!"}]
["I.1.1","//","//","//","//","//",0,{"$f":"E291-T1","v":{"$error":"#VALUE!"}},{"$error":"#VALUE!"},{"$f":"E291-T1","v":{"$error":"#VALUE!"}},{"$error":"#VALUE!"},{"$error":"#VALUE!"},{"$error":"#VALUE!"},{"$error":"#VALUE!"}]
["I.1.2",4,"pain de mie",327,"2017-01-22",1,72,{"$f":"E292-T1","v":142},"OK",{"$f":"E292-T1","v":142},"","","b","n"]
["I.1.3",4,"pain de mie",327,"2017-01-22",1,72,{"$f":"E293-T1","v":142},"OK",{"$f":"E293-T1","v":142},"","","b","n"]
["I.2.0",10,"haricot vert x 2",332,"2017-01-27",1,540,{"$f":"E294-T1","v":147},"OK",{"$f":"E294-T1","v":147},"","","b","n"]
["I.2.1",4,"pain de mie",327,"2017-01-22",1,72,{"$f":"E295-T1","v":142},"OK",{"$f":"E295-T1","v":142},"","","b","n"]
["I.2.2",4,"pain de mie",327,"2017-01-22",1,72,{"$f":"E296-T1","v":142},"OK",{"$f":"E296-T1","v":142},"","","b","n"]
["I.2.3",4,"pain de mie",327,"2017-01-22",1,23,{"$f":"E297-T1","v":142},"OK",{"$f":"E297-T1","v":142},"","","b","n"]
["I.3.0","//","//","//","//","//",0,{"$f":"E298-T1","v":{"$error":"#VALUE!"}},{"$error":"#VALUE!"},{"$f":"E298-T1","v":{"$error":"#VALUE!"}},{"$error":"#VALUE!"},{"$error":"#VALUE!"},{"$error":"#VALUE!"},{"$error":"#VALUE!"}]
["I.3.1",18,"macédoine 1 kg",275,"2016-12-01",1,80,{"$f":"E299-T1","v":90},"ATTENTION MOINS DE 3 MOIS",{"$f":"E299-T1","v":90},90,"","b",""]
["I.3.2",18,"macédoine 1 kg",275,"2016-12-01",1,80,{"$f":"E300-T1","v":90},"ATTENTION MOINS DE 3 MOIS",{"$f":"E300-T1","v":90},90,"","b",""]
["I.3.3",18,"macédoine 1 kg",275,"2016-12-01",1,80,{"$f":"E301-T1","v":90},"ATTENTION MOINS DE 3 MOIS",{"$f":"E301-T1","v":90},90,"","b",""]
["I.4.0","//","//","//","//","//",0,{"$f":"E302-T1","v":{"$error":"#VALUE!"}},{"$error":"#VALUE!"},{"$f":"E302-T1","v":{"$error":"#VALUE!"}},{"$error":"#VALUE!"},{"$error":"#VALUE!"},{"$error":"#VALUE!"},{"$error":"#VALUE!"}]
["I.4.1",18,"macédoine 1 kg",275,"2016-12-01",1,80,{"$f":"E303-T1","v":90},"ATTENTION MOINS DE 3 MOIS",{"$f":"E303-T1","v":90},90,"","b",""]
["I.4.2",18,"macédoine 1 kg",275,"2016-12-01",1,80,{"$f":"E304-T1","v":90},"ATTENTION MOINS DE 3 MOIS",{"$f":"E304-T1","v":90},90,"","b",""]
["I.4.3",18,"macédoine 1 kg",275,"2016-12-01",1,80,{"$f":"E305-T1","v":90},"ATTENTION MOINS DE 3 MOIS",{"$f":"E305-T1","v":90},90,"","b",""]
["I.5.0",28,"céleri",336,"2017-02-01",1,55,{"$f":"E306-T1","v":152},"OK",{"$f":"E306-T1","v":152},"","","b","n"]
["I.5.1",18,"macédoine 1 kg",275,"2016-12-01",1,80,{"$f":"E307-T1","v":90},"ATTENTION MOINS DE 3 MOIS",{"$f":"E307-T1","v":90},90,"","b",""]
["I.5.2",18,"macédoine 1 kg",275,"2016-12-01",1,80,{"$f":"E308-T1","v":90},"ATTENTION MOINS DE 3 MOIS",{"$f":"E308-T1","v":90},90,"","b",""]
["I.5.3",18,"macédoine 1 kg",275,"2016-12-01",1,80,{"$f":"E309-T1","v":90},"ATTENTION MOINS DE 3 MOIS",{"$f":"E309-T1","v":90},90,"","b",""]
["I.6.0","//","//","//","//","//",0,{"$f":"E310-T1","v":{"$error":"#VALUE!"}},{"$error":"#VALUE!"},{"$f":"E310-T1","v":{"$error":"#VALUE!"}},{"$error":"#VALUE!"},{"$error":"#VALUE!"},{"$error":"#VALUE!"},{"$error":"#VALUE!"}]
["I.6.1","//","//","//","//","//",0,{"$f":"E311-T1","v":{"$error":"#VALUE!"}},{"$error":"#VALUE!"},{"$f":"E311-T1","v":{"$error":"#VALUE!"}},{"$error":"#VALUE!"},{"$error":"#VALUE!"},{"$error":"#VALUE!"},{"$error":"#VALUE!"}]
["I.6.2","//","//","//","//","//",0,{"$f":"E312-T1","v":{"$error":"#VALUE!"}},{"$error":"#VALUE!"},{"$f":"E312-T1","v":{"$error":"#VALUE!"}},{"$error":"#VALUE!"},{"$error":"#VALUE!"},{"$error":"#VALUE!"},{"$error":"#VALUE!"}]
["I.6.3","//","//","//","//","//",0,{"$f":"E313-T1","v":{"$error":"#VALUE!"}},{"$error":"#VALUE!"},{"$f":"E313-T1","v":{"$error":"#VALUE!"}},{"$error":"#VALUE!"},{"$error":"#VALUE!"},{"$error":"#VALUE!"},{"$error":"#VALUE!"}]
["I.7.0",10,"haricot vert x 2",326,"2017-01-21",1,540,{"$f":"E314-T1","v":141},"OK",{"$f":"E314-T1","v":141},"","","b","n"]
["I.7.1",18,"macédoine 1 kg",183,"2016-09-01",1,80,{"$f":"E315-T1","v":-1},{"$f":"IF(K315=90,\"ATTENTION MOINS DE 3 MOIS\",IF(L315=30,\"ATTENTION MOINS DE 30 JOURS\",IF(M315=0,\"PERIME!!!\",\"OK\")))","v":"PERIME!!!"},{"$f":"E315-T1","v":-1},"","",0,""]
["I.7.2",18,"macédoine 1 kg",275,"2016-12-01",1,80,{"$f":"E316-T1","v":90},"ATTENTION MOINS DE 3 MOIS",{"$f":"E316-T1","v":90},90,"","b",""]
["I.7.3",18,"macédoine 1 kg",275,"2016-12-01",1,80,{"$f":"E317-T1","v":90},"ATTENTION MOINS DE 3 MOIS",{"$f":"E317-T1","v":90},90,"","b",""]
["I.8.0","//","//","//","//","//",0,{"$f":"E318-T1","v":{"$error":"#VALUE!"}},{"$error":"#VALUE!"},{"$f":"E318-T1","v":{"$error":"#VALUE!"}},{"$error":"#VALUE!"},{"$error":"#VALUE!"},{"$error":"#VALUE!"},{"$error":"#VALUE!"}]
["I.8.1","//","//","//","//","//",0,{"$f":"E319-T1","v":{"$error":"#VALUE!"}},{"$error":"#VALUE!"},{"$f":"E319-T1","v":{"$error":"#VALUE!"}},{"$error":"#VALUE!"},{"$error":"#VALUE!"},{"$error":"#VALUE!"},{"$error":"#VALUE!"}]
["I.8.2",30,"pêche 1kg",306,"2017-01-01",1,60,{"$f":"E320-T1","v":121},"OK",{"$f":"E320-T1","v":121},"","","b","n"]
["I.8.3",15,"salade verte",361,"2017-02-26",1,80,{"$f":"E321-T1","v":177},"OK",{"$f":"E321-T1","v":177},"","","b","n"]
["I.9.0",10,"haricot vert x 2",326,"2017-01-21",1,540,{"$f":"E322-T1","v":141},"OK",{"$f":"E322-T1","v":141},"","","b","n"]
["I.9.1",18,"macédoine 1 kg",275,"2016-12-01",1,80,{"$f":"E323-T1","v":90},"ATTENTION MOINS DE 3 MOIS",{"$f":"E323-T1","v":90},90,"","b",""]
["I.9.2",18,"macédoine 1 kg",275,"2016-12-01",1,80,{"$f":"E324-T1","v":90},"ATTENTION MOINS DE 3 MOIS",{"$f":"E324-T1","v":90},90,"","b",""]
["I.9.3",18,"macédoine 1 kg",275,"2016-12-01",1,80,{"$f":"E325-T1","v":90},"ATTENTION MOINS DE 3 MOIS",{"$f":"E325-T1","v":90},90,"","b",""]
["R.1 x24",5,"saucisson","//","//","//",0,{"$f":"E326-T1","v":{"$error":"#VALUE!"}},{"$error":"#VALUE!"},{"$f":"E326-T1","v":{"$error":"#VALUE!"}},{"$error":"#VALUE!"},{"$error":"#VALUE!"},{"$error":"#VALUE!"},{"$error":"#VALUE!"}]
["R.2 x24",19,"salami",362,"2017-02-27",24,1920,{"$f":"E327-T1","v":178},"OK",{"$f":"E327-T1","v":178},"","","b","n"]
["R.3 x32",4,"pain de mie",327,"2017-01-22",32,2232,{"$f":"E328-T1","v":142},"OK",{"$f":"E328-T1","v":142},"","","b","n"]
["R.4 x32",2,"pain","//","//","//",0,{"$f":"E329-T1","v":{"$error":"#VALUE!"}},{"$error":"#VALUE!"},{"$f":"E329-T1","v":{"$error":"#VALUE!"}},{"$error":"#VALUE!"},{"$error":"#VALUE!"},{"$error":"#VALUE!"},{"$error":"#VALUE!"}]
["R.5 x32",27,"thon ",306,"2017-01-01","10 cont",10,{"$f":"E330-T1","v":121},"OK",{"$f":"E330-T1","v":121},"","","b","n"]
["R.6 x32",17,"saucisson ail",345,"2017-02-10",24,1920,{"$f":"E331-T1","v":161},"OK",{"$f":"E331-T1","v":161},"","","b","n"]
["R.7 x32",4,"pain de mie",330,"2017-01-25",28,2016,{"$f":"E332-T1","v":145},"OK",{"$f":"E332-T1","v":145},"","","b","n"]
["R.8 x32",5,"saucisson",321,"2017-01-16",32,2880,{"$f":"E333-T1","v":136},"OK",{"$f":"E333-T1","v":136},"","","b","n"]
["R.9 x32",29,"sucre","//","//","//",0,{"$f":"E334-T1","v":{"$error":"#VALUE!"}},{"$error":"#VALUE!"},{"$f":"E334-T1","v":{"$error":"#VALUE!"}},{"$error":"#VALUE!"},{"$error":"#VALUE!"},{"$error":"#VALUE!"},{"$error":"#VALUE!"}]
["R.10 x32",17,"saucisson ail",326,"2017-01-20",24,1920,{"$f":"E335-T1","v":140},"OK",{"$f":"E335-T1","v":140},"","","b","n"]
["R.11 x32","//","//","//","//","//",0,{"$f":"E336-T1","v":{"$error":"#VALUE!"}},{"$error":"#VALUE!"},{"$f":"E336-T1","v":{"$error":"#VALUE!"}},{"$error":"#VALUE!"},{"$error":"#VALUE!"},{"$error":"#VALUE!"},{"$error":"#VALUE!"}]
["R.12 x32",4,"pain de mie",335,"2017-01-30","31+21c",2253,{"$f":"E337-T1","v":150},"OK",{"$f":"E337-T1","v":150},"","","b","n"]
["R.13 x32",17,"saucisson ail",327,"2017-01-21",24,1920,{"$f":"E338-T1","v":141},"OK",{"$f":"E338-T1","v":141},"","","b","n"]
["R.14 x32",4,"pain de mie","//","//","//",0,{"$f":"E339-T1","v":{"$error":"#VALUE!"}},{"$error":"#VALUE!"},{"$f":"E339-T1","v":{"$error":"#VALUE!"}},{"$error":"#VALUE!"},{"$error":"#VALUE!"},{"$error":"#VALUE!"},{"$error":"#VALUE!"}]
["R.15 x32",18,"macédoine 1 kg",275,"2016-12-01",24,1920,{"$f":"E340-T1","v":90},"ATTENTION MOINS DE 3 MOIS",{"$f":"E340-T1","v":90},90,"","b",""]
["R.16 x32","//","//","//","//","//",0,{"$f":"E341-T1","v":{"$error":"#VALUE!"}},{"$error":"#VALUE!"},{"$f":"E341-T1","v":{"$error":"#VALUE!"}},{"$error":"#VALUE!"},{"$error":"#VALUE!"},{"$error":"#VALUE!"},{"$error":"#VALUE!"}]
["R.17 x32",2,"pain",324,"2017-01-19",32,2240,{"$f":"E342-T1","v":139},"OK",{"$f":"E342-T1","v":139},"","","b","n"]
["R.18 x32",16,"frite","//","//","//",0,{"$f":"E343-T1","v":{"$error":"#VALUE!"}},{"$error":"#VALUE!"},{"$f":"E343-T1","v":{"$error":"#VALUE!"}},{"$error":"#VALUE!"},{"$error":"#VALUE!"},{"$error":"#VALUE!"},{"$error":"#VALUE!"}]
["R.19 x16",16,"frite",281,"2016-12-07","12+35c",995,{"$f":"E344-T1","v":96},"OK",{"$f":"E344-T1","v":96},"","","b","n"]
["R.20 x16",13,"jambon ",295,"2016-12-21",16,540,{"$f":"E345-T1","v":110},"OK",{"$f":"E345-T1","v":110},{"$f":"IF(AND(J345<=90,J345>30),90,\"\")","v":""},{"$f":"IF(AND(J345<=30,J345>0),30,\"\")","v":""},{"$f":"IF(J345<=0,0,\"b\")","v":"b"},{"$f":"IF(J345>90,\"n\",\"\")","v":"n"}]
["R.21 x16","//","//","//","//","//",0,{"$f":"E346-T1","v":{"$error":"#VALUE!"}},{"$error":"#VALUE!"},{"$f":"E346-T1","v":{"$error":"#VALUE!"}},{"$error":"#VALUE!"},{"$error":"#VALUE!"},{"$error":"#VALUE!"},{"$error":"#VALUE!"}]
["R.22 x16",28,"céleri",365,"2017-03-02",16,880,{"$f":"E347-T1","v":181},"OK",{"$f":"E347-T1","v":181},"","","b","n"]
["R.23 x16",17,"saucisson ail",340,"2017-02-05",12,960,{"$f":"E348-T1","v":156},"OK",{"$f":"E348-T1","v":156},"","","b","n"]
["R.24 x16",28,"céleri","//","//","//",0,{"$f":"E349-T1","v":{"$error":"#VALUE!"}},{"$error":"#VALUE!"},{"$f":"E349-T1","v":{"$error":"#VALUE!"}},{"$error":"#VALUE!"},{"$error":"#VALUE!"},{"$error":"#VALUE!"},{"$error":"#VALUE!"}]
["R.25 x16",9,"petits pois x 2",289,"2016-12-15",12,40,{"$f":"E350-T1","v":104},"OK",{"$f":"E350-T1","v":104},"","","b","n"]
["R.26 x16",5,"saucisson",296,"2016-12-22",14,1210,{"$f":"E351-T1","v":111},"OK",{"$f":"E351-T1","v":111},"","","b","n"]
["R.27 x16",30,"pêche 1kg","//","//","//",0,{"$f":"E352-T1","v":{"$error":"#VALUE!"}},{"$error":"#VALUE!"},{"$f":"E352-T1","v":{"$error":"#VALUE!"}},{"$error":"#VALUE!"},{"$error":"#VALUE!"},{"$error":"#VALUE!"},{"$error":"#VALUE!"}]
["R.28 x16",30,"pêche 1kg",365,"2017-03-02",16,60,{"$f":"E353-T1","v":181},"OK",{"$f":"E353-T1","v":181},"","","b","n"]
["R.29 x16","//","//","//","//","//",0,{"$f":"E354-T1","v":{"$error":"#VALUE!"}},{"$error":"#VALUE!"},{"$f":"E354-T1","v":{"$error":"#VALUE!"}},{"$error":"#VALUE!"},{"$error":"#VALUE!"},{"$error":"#VALUE!"},{"$error":"#VALUE!"}]
["R.30 x16",24,"bouchée",317,"2017-01-12","15+65c",2315,{"$f":"E355-T1","v":132},"OK",{"$f":"E355-T1","v":132},"","","b","n"]
["R.31 x16","//","//","//","//","//",0,{"$f":"E356-T1","v":{"$error":"#VALUE!"}},{"$error":"#VALUE!"},{"$f":"E356-T1","v":{"$error":"#VALUE!"}},{"$error":"#VALUE!"},{"$error":"#VALUE!"},{"$error":"#VALUE!"},{"$error":"#VALUE!"}]
["R.32 x16",11,"haricot blanc x 2",295,"2016-12-21",15,2100,{"$f":"E357-T1","v":110},"OK",{"$f":"E357-T1","v":110},"","","b","n"]
["R.33 x16",18,"macédoine 1 kg",306,"2017-01-01",12,960,{"$f":"E358-T1","v":121},"OK",{"$f":"E358-T1","v":121},"","","b","n"]
["R.34 x12",9,"petits pois x 2","//","//","//",0,{"$f":"E359-T1","v":{"$error":"#VALUE!"}},{"$error":"#VALUE!"},{"$f":"E359-T1","v":{"$error":"#VALUE!"}},{"$error":"#VALUE!"},{"$error":"#VALUE!"},{"$error":"#VALUE!"},{"$error":"#VALUE!"}]
["R.35 x12",9,"petits pois x 2",233,"2016-10-20",12,480,{"$f":"E360-T1","v":48},"ATTENTION MOINS DE 3 MOIS",{"$f":"E360-T1","v":48},90,"","b",""]
["R.36 x12",23,"poire 1 kg",320,"2017-01-15","9+21c",471,{"$f":"E361-T1","v":135},"OK",{"$f":"E361-T1","v":135},"","","b","n"]
["R.37 x12",12,"lardons 500g",268,"2016-11-24",12,960,{"$f":"E362-T1","v":83},"ATTENTION MOINS DE 3 MOIS",{"$f":"E362-T1","v":83},90,"","b",""]
["R.38 x16",1,"chocolat","//","//","//",0,{"$f":"E363-T1","v":{"$error":"#VALUE!"}},{"$error":"#VALUE!"},{"$f":"E363-T1","v":{"$error":"#VALUE!"}},{"$error":"#VALUE!"},{"$error":"#VALUE!"},{"$error":"#VALUE!"},{"$error":"#VALUE!"}]
["R.39 x16",9,"petits pois x 2",307,"2017-01-02",12,40,{"$f":"E364-T1","v":122},"OK",{"$f":"E364-T1","v":122},"","","b","n"]
["R.40 x16","//","//","//","//","//",0,{"$f":"E365-T1","v":{"$error":"#VALUE!"}},{"$error":"#VALUE!"},{"$f":"E365-T1","v":{"$error":"#VALUE!"}},{"$error":"#VALUE!"},{"$error":"#VALUE!"},{"$error":"#VALUE!"},{"$error":"#VALUE!"}]
["R.41 x8","//","//","//","2016-08-22",8,0,{"$f":"E366-T1","v":-11},"PERIME!!!",{"$f":"E366-T1","v":-11},"","",0,""]
["PARC",0,0,0,"00:00:00",0,0,null,null,null,"","",0,""]
["PA1",27,"thon ",321,"2017-01-16","10 cont",10,{"$f":"E368-T1","v":136},"OK",{"$f":"E368-T1","v":136},"","","b","n"]
["PA2",0,0,null,null,null,null,{"$f":"E369-T1","v":-42615},"PERIME!!!",{"$f":"E369-T1","v":-42615},"","",0,""]
["PA3",0,0,null,null,null,null,{"$f":"E370-T1","v":-42615},"PERIME!!!",{"$f":"E370-T1","v":-42615},"","",0,""]
["PA4",0,0,null,null,null,null,{"$f":"E371-T1","v":-42615},"PERIME!!!",{"$f":"E371-T1","v":-42615},"","",0,""]
["PA5",0,0,null,null,null,null,{"$f":"E372-T1","v":-42615},"PERIME!!!",{"$f":"E372-T1","v":-42615},"","",0,""]

{"sheet":"Accueil","index":3,"n_rows":0,"n_cols":0,"rows_kept":0,"cut":false,"hidden":false,"merged":[]}

{"sheet":"Produit","index":4,"n_rows":31,"n_cols":1,"rows_kept":31,"cut":false,"hidden":false,"merged":[]}
["//"]
["abricot 1 kg"]
["biscottes"]
["bouchée"]
["café"]
["carotte rappée"]
["cassoulet "]
["céleri"]
["chocolat"]
["farine "]
["frite"]
["haricot blanc x 2"]
["haricot vert x 2"]
["jambon "]
["lait x 1"]
["lait x 6"]
["lardons 500g"]
["macédoine 1 kg"]
["pain"]
["pain de mie"]
["pêche 1kg"]
["petits pois x 2"]
["poire 1 kg"]
["salade verte"]
["salami"]
["sardine x 2"]
["saucisse fumée"]
["saucisson"]
["saucisson ail"]
["sucre"]
["thon "]

{"sheet":"REF","index":5,"n_rows":36,"n_cols":1,"rows_kept":36,"cut":false,"hidden":false,"merged":[]}
["//"]
[1]
[2]
[3]
[4]
[5]
[6]
[7]
[8]
[9]
[10]
[11]
[12]
[13]
[14]
[15]
[16]
[17]
[18]
[19]
[20]
[21]
[22]
[23]
[24]
[25]
[26]
[27]
[28]
[29]
[30]
[31]
[32]
[33]
[34]
[35]

{"sheet":"Feuil2","index":6,"n_rows":4,"n_cols":10,"rows_kept":4,"cut":false,"hidden":true,"merged":[[3,9,3,11]]}
[null,null,null,null,null,null,7,"heures"]
["Emplacement","Référence","Désignation","Code",null,"Palette","Quantité","Action"]
[]
[null,null,null,null,null,null,null,null,null,"Mettre ou la déposer"]

{"sheet":"initiales","index":7,"n_rows":4,"n_cols":1,"rows_kept":4,"cut":false,"hidden":true,"merged":[]}
["BG"]
["BL "]
["CN"]
["DB"]

{"sheet":"Feuil3","index":8,"n_rows":9,"n_cols":1,"rows_kept":9,"cut":false,"hidden":true,"merged":[]}
["ANTOINE"]
["FONTE"]
["FT85"]
["JAMET"]
["LAHAYE"]
["PREP.AV"]
["RENAULT"]
["SYSTEME U"]
["TFE"]

{"sheet":"Feuil5","index":9,"n_rows":27,"n_cols":31,"rows_kept":27,"cut":false,"hidden":false,"merged":[[26,30,26,33],[0,0,0,12],[10,30,10,33],[0,13,0,16],[0,17,0,19],[6,28,6,29],[6,30,6,33],[8,30,8,33],[7,30,7,33],[9,30,9,33],[0,20,0,26],[25,30,25,33],[23,30,23,33],[13,28,13,29],[13,30,13,33],[14,30,14,33],[15,30,15,33],[16,30,16,33],[24,30,24,33],[19,28,19,29],[19,30,19,33],[20,30,20,33],[21,30,21,33],[22,30,22,33]]}
["Historique de mouvements",null,null,null,null,null,null,null,null,null,null,null,null,"Erreur listbox recheche",null,null,null,"Erreur inputbox recherche",null,null,"Causes modification"]
["Date","Heure","Initiale","Action","Produit","Camion","Empl.","Référence","Produits","Code","Date","Palettes","Qtés",1,2,3,6,2,5,4,7,8,9,10,11,12,13]
[]
[]
[]
[]
[null,null,null,null,null,null,null,null,null,null,null,null,null,null,null,null,null,null,null,null,null,null,null,null,null,null,null,null,"Les erreurs listbox",null,"Les causes"]
[null,null,null,null,null,null,null,null,null,null,null,null,null,null,null,null,null,null,null,null,null,null,null,null,null,null,null,null,1,"Visu sur stock","Une vue sur le stockage par référence ou par code"]
[null,null,null,null,null,null,null,null,null,null,null,null,null,null,null,null,null,null,null,null,null,null,null,null,null,null,null,null,2,"Erreur de référence","Erreur de saisie"]
[null,null,null,null,null,null,null,null,null,null,null,null,null,null,null,null,null,null,null,null,null,null,null,null,null,null,null,null,3,"Mauvaise palette","Mauvaise palette à l'emplacement"]
[null,null,null,null,null,null,null,null,null,null,null,null,null,null,null,null,null,null,null,null,null,null,null,null,null,null,null,null,6,"emplacement Vide/ occupé","Emplacement vide ou occupé"]
[]
[]
[null,null,null,null,null,null,null,null,null,null,null,null,null,null,null,null,null,null,null,null,null,null,null,null,null,null,null,null,"Les erreurs inputbox",null,"Les causes"]
[null,null,null,null,null,null,null,null,null,null,null,null,null,null,null,null,null,null,null,null,null,null,null,null,null,null,null,null,2,"Erreur de référence","Erreur de saisie"]
[null,null,null,null,null,null,null,null,null,null,null,null,null,null,null,null,null,null,null,null,null,null,null,null,null,null,null,null,4,"Erreur d'action","Erreur dans l'action entrée/sortie"]
[null,null,null,null,null,null,null,null,null,null,null,null,null,null,null,null,null,null,null,null,null,null,null,null,null,null,null,null,5,"Autres stockage","N'est pas stocké dans ce magasin"]
[]
[]
[null,null,null,null,null,null,null,null,null,null,null,null,null,null,null,null,null,null,null,null,null,null,null,null,null,null,null,null,"Les modification",null,"Les causes"]
[null,null,null,null,null,null,null,null,null,null,null,null,null,null,null,null,null,null,null,null,null,null,null,null,null,null,null,null,7,"Modif. Quantité +","Correction de la quantité, en +"]
[null,null,null,null,null,null,null,null,null,null,null,null,null,null,null,null,null,null,null,null,null,null,null,null,null,null,null,null,8,"Modif. Quantité -","Correction de la quantité, en -"]
[null,null,null,null,null,null,null,null,null,null,null,null,null,null,null,null,null,null,null,null,null,null,null,null,null,null,null,null,9,"Modif. Date","Correction de la date"]
[null,null,null,null,null,null,null,null,null,null,null,null,null,null,null,null,null,null,null,null,null,null,null,null,null,null,null,null,10,"Modif. De référence","Correction de référence"]
[null,null,null,null,null,null,null,null,null,null,null,null,null,null,null,null,null,null,null,null,null,null,null,null,null,null,null,null,11,"Modif. Code","Correction du code"]
[null,null,null,null,null,null,null,null,null,null,null,null,null,null,null,null,null,null,null,null,null,null,null,null,null,null,null,null,12,"Autres","  Empl.vide…"]
[null,null,null,null,null,null,null,null,null,null,null,null,null,null,null,null,null,null,null,null,null,null,null,null,null,null,null,null,13,"Inventaire OK","  R.A.S"]

{"sheet":"Empl.","index":10,"n_rows":48,"n_cols":68,"rows_kept":48,"cut":false,"hidden":false,"merged":[[23,2,23,20],[23,25,23,43],[23,48,23,66],[1,2,1,20],[1,25,1,43],[1,48,1,66],[12,2,12,20],[12,25,12,43],[12,48,12,66]]}
[]
[null,null,"A",null,null,null,null,null,null,null,null,null,null,null,null,null,null,null,null,null,null,null,null,null,null,"B",null,null,null,null,null,null,null,null,null,null,null,null,null,null,null,null,null,null,null,null,null,null,"C"]
[]
[null,null,"A.1.3",{"$f":"IF(stock!B5,\"//\",\"\")","v":"//"},"A.2.3",{"$f":"IF(stock!B9,\"//\",\"\")","v":"//"},"A.3.3",{"$f":"IF(stock!B13,\"//\",\"\")","v":"//"},null,"A.4.3",{"$f":"IF(stock!B17,\"//\",\"\")","v":{"$error":"#VALUE!"}},"A.5.3",{"$f":"IF(stock!B21,\"//\",\"\")","v":"//"},"A.6.3",{"$f":"IF(stock!B25,\"//\",\"\")","v":"//"},null,"A.7.3",{"$f":"IF(stock!B29,\"//\",\"\")","v":"//"},"A.8.3",{"$f":"IF(stock!B33,\"//\",\"\")","v":"//"},"A.9.3",{"$f":"IF(stock!B37,\"//\",\"\")","v":"//"},null,null,null,"B.9.3",{"$f":"IF(stock!B73,\"//\",\"\")","v":"//"},"B.8.3",{"$f":"IF(stock!B69,\"//\",\"\")","v":"//"},"B.7.3",{"$f":"IF(stock!B65,\"//\",\"\")","v":"//"},null,"B.6.3",{"$f":"IF(stock!B61,\"//\",\"\")","v":"//"},"B.5.3",{"$f":"IF(stock!B57,\"//\",\"\")","v":"//"},"B.4.3",{"$f":"IF(stock!B53,\"//\",\"\")","v":"//"},null,"B.3.3",{"$f":"IF(stock!B49,\"//\",\"\")","v":{"$error":"#VALUE!"}},"B.2.3",{"$f":"IF(stock!B45,\"//\",\"\")","v":"//"},"B.1.3",{"$f":"IF(stock!B41,\"//\",\"\")","v":{"$error":"#VALUE!"}},null,null,null,"C.1.3",{"$f":"IF(stock!B77,\"//\",\"\")","v":{"$error":"#VALUE!"}},"C.2.3",{"$f":"IF(stock!B81,\"//\",\"\")","v":{"$error":"#VALUE!"}},"C.3.3",{"$f":"IF(stock!B85,\"//\",\"\")","v":{"$error":"#VALUE!"}},null,"C.4.3",{"$f":"IF(stock!B89,\"//\",\"\")","v":{"$error":"#VALUE!"}},"C.5.3",{"$f":"IF(stock!B93,\"//\",\"\")","v":{"$error":"#VALUE!"}},"C.6.3",{"$f":"IF(stock!B97,\"//\",\"\")","v":{"$error":"#VALUE!"}},null,"C.7.3",{"$f":"IF(stock!B101,\"//\",\"\")","v":"//"},"C.8.3",{"$f":"IF(stock!B105,\"//\",\"\")","v":"//"},"C.9.3",{"$f":"IF(stock!B109,\"//\",\"\")","v":{"$error":"#VALUE!"}}]
[]
[null,null,"A.1.2",{"$f":"IF(stock!B4,\"//\",\"\")","v":"//"},"A.2.2",{"$f":"IF(stock!B8,\"//\",\"\")","v":{"$error":"#VALUE!"}},"A.3.2",{"$f":"IF(stock!B12,\"//\",\"\")","v":"//"},null,"A.4.2",{"$f":"IF(stock!B16,\"//\",\"\")","v":"//"},"A.5.2",{"$f":"IF(stock!B20,\"//\",\"\")","v":"//"},"A.6.2",{"$f":"IF(stock!B24,\"//\",\"\")","v":"//"},null,"A.7.2",{"$f":"IF(stock!B28,\"//\",\"\")","v":"//"},"A.8.2",{"$f":"IF(stock!B32,\"//\",\"\")","v":"//"},"A.9.2",{"$f":"IF(stock!B36,\"//\",\"\")","v":"//"},null,null,null,"B.9.2",{"$f":"IF(stock!B72,\"//\",\"\")","v":"//"},"B.8.2",{"$f":"IF(stock!B68,\"//\",\"\")","v":"//"},"B.7.2",{"$f":"IF(stock!B64,\"//\",\"\")","v":"//"},null,"B.6.2",{"$f":"IF(stock!B60,\"//\",\"\")","v":"//"},"B.5.2",{"$f":"IF(stock!B56,\"//\",\"\")","v":"//"},"B.4.2",{"$f":"IF(stock!B52,\"//\",\"\")","v":"//"},null,"B.3.2",{"$f":"IF(stock!B48,\"//\",\"\")","v":"//"},"B.2.2",{"$f":"IF(stock!B44,\"//\",\"\")","v":"//"},"B.1.2",{"$f":"IF(stock!B40,\"//\",\"\")","v":{"$error":"#VALUE!"}},null,null,null,"C.1.2",{"$f":"IF(stock!B76,\"//\",\"\")","v":{"$error":"#VALUE!"}},"C.2.2",{"$f":"IF(stock!B80,\"//\",\"\")","v":{"$error":"#VALUE!"}},"C.3.2",{"$f":"IF(stock!B84,\"//\",\"\")","v":{"$error":"#VALUE!"}},null,"C.4.2",{"$f":"IF(stock!B88,\"//\",\"\")","v":{"$error":"#VALUE!"}},"C.5.2",{"$f":"IF(stock!B92,\"//\",\"\")","v":{"$error":"#VALUE!"}},"C.6.2",{"$f":"IF(stock!B96,\"//\",\"\")","v":{"$error":"#VALUE!"}},null,"C.7.2",{"$f":"IF(stock!B100,\"//\",\"\")","v":{"$error":"#VALUE!"}},"C.8.2",{"$f":"IF(stock!B104,\"//\",\"\")","v":"//"},"C.9.2",{"$f":"IF(stock!B108,\"//\",\"\")","v":"//"}]
[]
[null,null,"A.1.1",{"$f":"IF(stock!B3,\"//\",\"\")","v":"//"},"A.2.1",{"$f":"IF(stock!B7,\"//\",\"\")","v":{"$error":"#VALUE!"}},"A.3.1",{"$f":"IF(stock!B11,\"//\",\"\")","v":{"$error":"#VALUE!"}},null,"A.4.1",{"$f":"IF(stock!B15,\"//\",\"\")","v":"//"},"A.5.1",{"$f":"IF(stock!B19,\"//\",\"\")","v":{"$error":"#VALUE!"}},"A.6.1",{"$f":"IF(stock!B23,\"//\",\"\")","v":"//"},null,"A.7.1",{"$f":"IF(stock!B27,\"//\",\"\")","v":"//"},"A.8.1",{"$f":"IF(stock!B31,\"//\",\"\")","v":"//"},"A.9.1",{"$f":"IF(stock!B35,\"//\",\"\")","v":"//"},null,null,null,"B.9.1",{"$f":"IF(stock!B71,\"//\",\"\")","v":"//"},"B.8.1",{"$f":"IF(stock!B67,\"//\",\"\")","v":"//"},"B.7.1",{"$f":"IF(stock!B63,\"//\",\"\")","v":{"$error":"#VALUE!"}},null,"B.6.1",{"$f":"IF(stock!B59,\"//\",\"\")","v":"//"},"B.5.1",{"$f":"IF(stock!B55,\"//\",\"\")","v":{"$error":"#VALUE!"}},"B.4.1",{"$f":"IF(stock!B51,\"//\",\"\")","v":"//"},null,"B.3.1",{"$f":"IF(stock!B47,\"//\",\"\")","v":"//"},"B.2.1",{"$f":"IF(stock!B43,\"//\",\"\")","v":{"$error":"#VALUE!"}},"B.1.1",{"$f":"IF(stock!B39,\"//\",\"\")","v":{"$error":"#VALUE!"}},null,null,null,"C.1.1",{"$f":"IF(stock!B75,\"//\",\"\")","v":"//"},"C.2.1",{"$f":"IF(stock!B79,\"//\",\"\")","v":{"$error":"#VALUE!"}},"C.3.1",{"$f":"IF(stock!B83,\"//\",\"\")","v":{"$error":"#VALUE!"}},null,"C.4.1",{"$f":"IF(stock!B87,\"//\",\"\")","v":{"$error":"#VALUE!"}},"C.5.1",{"$f":"IF(stock!B91,\"//\",\"\")","v":{"$error":"#VALUE!"}},"C.6.1",{"$f":"IF(stock!B95,\"//\",\"\")","v":{"$error":"#VALUE!"}},null,"C.7.1",{"$f":"IF(stock!B99,\"//\",\"\")","v":{"$error":"#VALUE!"}},"C.8.1",{"$f":"IF(stock!B103,\"//\",\"\")","v":"//"},"C.9.1",{"$f":"IF(stock!B107,\"//\",\"\")","v":"//"}]
[]
[null,null,"A.1.0",{"$f":"IF(stock!B2,\"//\",\"\")","v":"//"},"A.2.0",{"$f":"IF(stock!B6,\"//\",\"\")","v":"//"},"A.3.0",{"$f":"IF(stock!B10,\"//\",\"\")","v":{"$error":"#VALUE!"}},null,"A.4.0",{"$f":"IF(stock!B14,\"//\",\"\")","v":"//"},"A.5.0",{"$f":"IF(stock!B18,\"//\",\"\")","v":{"$error":"#VALUE!"}},"A.6.0",{"$f":"IF(stock!B22,\"//\",\"\")","v":"//"},null,"A.7.0",{"$f":"IF(stock!B26,\"//\",\"\")","v":"//"},"A.8.0",{"$f":"IF(stock!B30,\"//\",\"\")","v":"//"},"A.9.0",{"$f":"IF(stock!B34,\"//\",\"\")","v":"//"},null,null,null,"B.9.0",{"$f":"IF(stock!B70,\"//\",\"\")","v":"//"},"B.8.0",{"$f":"IF(stock!B66,\"//\",\"\")","v":"//"},"B.7.0",{"$f":"IF(stock!B62,\"//\",\"\")","v":"//"},null,"B.6.0",{"$f":"IF(stock!B58,\"//\",\"\")","v":"//"},"B.5.0",{"$f":"IF(stock!B54,\"//\",\"\")","v":"//"},"B.4.0",{"$f":"IF(stock!B50,\"//\",\"\")","v":"//"},null,"B.3.0",{"$f":"IF(stock!B46,\"//\",\"\")","v":"//"},"B.2.0",{"$f":"IF(stock!B42,\"//\",\"\")","v":"//"},"B.1.0",{"$f":"IF(stock!B38,\"//\",\"\")","v":"//"},null,null,null,"C.1.0",{"$f":"IF(stock!B74,\"//\",\"\")","v":"//"},"C.2.0",{"$f":"IF(stock!B78,\"//\",\"\")","v":"//"},"C.3.0",{"$f":"IF(stock!B82,\"//\",\"\")","v":"//"},null,"C.4.0",{"$f":"IF(stock!B86,\"//\",\"\")","v":"//"},"C.5.0",{"$f":"IF(stock!B90,\"//\",\"\")","v":"//"},"C.6.0",{"$f":"IF(stock!B94,\"//\",\"\")","v":"//"},null,"C.7.0",{"$f":"IF(stock!B98,\"//\",\"\")","v":"//"},"C.8.0",{"$f":"IF(stock!B102,\"//\",\"\")","v":"//"},"C.9.0",{"$f":"IF(stock!B106,\"//\",\"\")","v":"//"}]
[]
[]
[null,null,"D",null,null,null,null,null,null,null,null,null,null,null,null,null,null,null,null,null,null,null,null,null,null,"E",null,null,null,null,null,null,null,null,null,null,null,null,null,null,null,null,null,null,null,null,null,null,"F"]
[]
[null,null,"D.9.3",{"$f":"IF(stock!B145,\"//\",\"\")","v":{"$error":"#VALUE!"}},"D.8.3",{"$f":"IF(stock!B141,\"//\",\"\")","v":"//"},"D.7.3",{"$f":"IF(stock!B137,\"//\",\"\")","v":{"$error":"#VALUE!"}},null,"D.6.3",{"$f":"IF(stock!B133,\"//\",\"\")","v":"//"},"D.5.3",{"$f":"IF(stock!B129,\"//\",\"\")","v":"//"},"D.4.3",{"$f":"IF(stock!B125,\"//\",\"\")","v":"//"},null,"D.3.3",{"$f":"IF(stock!B121,\"//\",\"\")","v":"//"},"D.2.3",{"$f":"IF(stock!B117,\"//\",\"\")","v":{"$error":"#VALUE!"}},"D.1.3",{"$f":"IF(stock!B113,\"//\",\"\")","v":{"$error":"#VALUE!"}},null,null,null,"E.1.3",{"$f":"IF(stock!B149,\"//\",\"\")","v":"//"},"E.2.3",{"$f":"IF(stock!B153,\"//\",\"\")","v":"//"},"E.3.3",{"$f":"IF(stock!B157,\"//\",\"\")","v":"//"},null,"E.4.3",{"$f":"IF(stock!B161,\"//\",\"\")","v":"//"},"E.5.3",{"$f":"IF(stock!B165,\"//\",\"\")","v":"//"},"E.6.3",{"$f":"IF(stock!B169,\"//\",\"\")","v":"//"},null,"E.7.3",{"$f":"IF(stock!B173,\"//\",\"\")","v":"//"},"E.8.3",{"$f":"IF(stock!B177,\"//\",\"\")","v":"//"},"E.9.3",{"$f":"IF(stock!B181,\"//\",\"\")","v":"//"},null,null,null,"F.9.3",{"$f":"IF(stock!B217,\"//\",\"\")","v":"//"},"F.8.3",{"$f":"IF(stock!B213,\"//\",\"\")","v":"//"},"F.7.3",{"$f":"IF(stock!B209,\"//\",\"\")","v":"//"},null,"F.6.3",{"$f":"IF(stock!B205,\"//\",\"\")","v":"//"},"F.5.3",{"$f":"IF(stock!B201,\"//\",\"\")","v":"//"},"F.4.3",{"$f":"IF(stock!B197,\"//\",\"\")","v":"//"},null,"F.3.3",{"$f":"IF(stock!B193,\"//\",\"\")","v":"//"},"F.2.3",{"$f":"IF(stock!B189,\"//\",\"\")","v":"//"},"F.1.3",{"$f":"IF(stock!B185,\"//\",\"\")","v":"//"}]
[]
[null,null,"D.9.2",{"$f":"IF(stock!B144,\"//\",\"\")","v":"//"},"D.8.2",{"$f":"IF(stock!B140,\"//\",\"\")","v":"//"},"D.7.2",{"$f":"IF(stock!B136,\"//\",\"\")","v":"//"},null,"D.6.2",{"$f":"IF(stock!B132,\"//\",\"\")","v":{"$error":"#VALUE!"}},"D.5.2",{"$f":"IF(stock!B128,\"//\",\"\")","v":"//"},"D.4.2",{"$f":"IF(stock!B124,\"//\",\"\")","v":"//"},null,"D.3.2",{"$f":"IF(stock!B120,\"//\",\"\")","v":"//"},"D.2.2",{"$f":"IF(stock!B116,\"//\",\"\")","v":{"$error":"#VALUE!"}},"D.1.2",{"$f":"IF(stock!B112,\"//\",\"\")","v":{"$error":"#VALUE!"}},null,null,null,"E.1.2",{"$f":"IF(stock!B148,\"//\",\"\")","v":"//"},"E.2.2",{"$f":"IF(stock!B152,\"//\",\"\")","v":"//"},"E.3.2",{"$f":"IF(stock!B156,\"//\",\"\")","v":"//"},null,"E.4.2",{"$f":"IF(stock!B160,\"//\",\"\")","v":"//"},"E.5.2",{"$f":"IF(stock!B164,\"//\",\"\")","v":"//"},"E.6.2",{"$f":"IF(stock!B168,\"//\",\"\")","v":"//"},null,"E.7.2",{"$f":"IF(stock!B172,\"//\",\"\")","v":"//"},"E.8.2",{"$f":"IF(stock!B176,\"//\",\"\")","v":"//"},"E.9.2",{"$f":"IF(stock!B180,\"//\",\"\")","v":"//"},null,null,null,"F.9.2",{"$f":"IF(stock!B216,\"//\",\"\")","v":"//"},"F.8.2",{"$f":"IF(stock!B212,\"//\",\"\")","v":"//"},"F.7.2",{"$f":"IF(stock!B208,\"//\",\"\")","v":"//"},null,"F.6.2",{"$f":"IF(stock!B204,\"//\",\"\")","v":"//"},"F.5.2",{"$f":"IF(stock!B200,\"//\",\"\")","v":"//"},"F.4.2",{"$f":"IF(stock!B196,\"//\",\"\")","v":"//"},null,"F.3.2",{"$f":"IF(stock!B192,\"//\",\"\")","v":"//"},"F.2.2",{"$f":"IF(stock!B188,\"//\",\"\")","v":"//"},"F.1.2",{"$f":"IF(stock!B184,\"//\",\"\")","v":"//"}]
[]
[null,null,"D.9.1",{"$f":"IF(stock!B143,\"//\",\"\")","v":"//"},"D.8.1",{"$f":"IF(stock!B139,\"//\",\"\")","v":"//"},"D.7.1",{"$f":"IF(stock!B135,\"//\",\"\")","v":"//"},null,"D.6.1",{"$f":"IF(stock!B131,\"//\",\"\")","v":{"$error":"#VALUE!"}},"D.5.1",{"$f":"IF(stock!B127,\"//\",\"\")","v":"//"},"D.4.1",{"$f":"IF(stock!B123,\"//\",\"\")","v":"//"},null,"D.3.1",{"$f":"IF(stock!B119,\"//\",\"\")","v":{"$error":"#VALUE!"}},"D.2.1",{"$f":"IF(stock!B115,\"//\",\"\")","v":{"$error":"#VALUE!"}},"D.1.1",{"$f":"IF(stock!B111,\"//\",\"\")","v":{"$error":"#VALUE!"}},null,null,null,"E.1.1",{"$f":"IF(stock!B147,\"//\",\"\")","v":"//"},"E.2.1",{"$f":"IF(stock!B151,\"//\",\"\")","v":"//"},"E.3.1",{"$f":"IF(stock!B155,\"//\",\"\")","v":"//"},null,"E.4.1",{"$f":"IF(stock!B159,\"//\",\"\")","v":"//"},"E.5.1",{"$f":"IF(stock!B163,\"//\",\"\")","v":"//"},"E.6.1",{"$f":"IF(stock!B167,\"//\",\"\")","v":"//"},null,"E.7.1",{"$f":"IF(stock!B171,\"//\",\"\")","v":"//"},"E.8.1",{"$f":"IF(stock!B175,\"//\",\"\")","v":"//"},"E.9.1",{"$f":"IF(stock!B179,\"//\",\"\")","v":"//"},null,null,null,"F.9.1",{"$f":"IF(stock!B215,\"//\",\"\")","v":"//"},"F.8.1",{"$f":"IF(stock!B211,\"//\",\"\")","v":"//"},"F.7.1",{"$f":"IF(stock!B207,\"//\",\"\")","v":"//"},null,"F.6.1",{"$f":"IF(stock!B203,\"//\",\"\")","v":{"$error":"#VALUE!"}},"F.5.1",{"$f":"IF(stock!B199,\"//\",\"\")","v":"//"},"F.4.1",{"$f":"IF(stock!B195,\"//\",\"\")","v":"//"},null,"F.3.1",{"$f":"IF(stock!B191,\"//\",\"\")","v":{"$error":"#VALUE!"}},"F.2.1",{"$f":"IF(stock!B187,\"//\",\"\")","v":"//"},"F.1.1",{"$f":"IF(stock!B183,\"//\",\"\")","v":"//"}]
[]
[null,null,"D.9.0",{"$f":"IF(stock!B142,\"//\",\"\")","v":"//"},"D.8.0",{"$f":"IF(stock!B138,\"//\",\"\")","v":"//"},"D.7.0",{"$f":"IF(stock!B134,\"//\",\"\")","v":"//"},null,"D.6.0",{"$f":"IF(stock!B130,\"//\",\"\")","v":"//"},"D.5.0",{"$f":"IF(stock!B126,\"//\",\"\")","v":"//"},"D.4.0",{"$f":"IF(stock!B122,\"//\",\"\")","v":"//"},null,"D.3.0",{"$f":"IF(stock!B118,\"//\",\"\")","v":{"$error":"#VALUE!"}},"D.2.0",{"$f":"IF(stock!B114,\"//\",\"\")","v":{"$error":"#VALUE!"}},"D.1.0",{"$f":"IF(stock!B110,\"//\",\"\")","v":"//"},null,null,null,"E.1.0",{"$f":"IF(stock!B146,\"//\",\"\")","v":"//"},"E.2.0",{"$f":"IF(stock!B150,\"//\",\"\")","v":"//"},"E.3.0",{"$f":"IF(stock!B154,\"//\",\"\")","v":"//"},null,"E.4.0",{"$f":"IF(stock!B158,\"//\",\"\")","v":"//"},"E.5.0",{"$f":"IF(stock!B162,\"//\",\"\")","v":"//"},"E.6.0",{"$f":"IF(stock!B166,\"//\",\"\")","v":"//"},null,"E.7.0",{"$f":"IF(stock!B170,\"//\",\"\")","v":"//"},"E.8.0",{"$f":"IF(stock!B174,\"//\",\"\")","v":"//"},"E.9.0",{"$f":"IF(stock!B178,\"//\",\"\")","v":"//"},null,null,null,"F.9.0",{"$f":"IF(stock!B214,\"//\",\"\")","v":"//"},"F.8.0",{"$f":"IF(stock!B210,\"//\",\"\")","v":"//"},"F.7.0",{"$f":"IF(stock!B206,\"//\",\"\")","v":"//"},null,"F.6.0",{"$f":"IF(stock!B202,\"//\",\"\")","v":"//"},"F.5.0",{"$f":"IF(stock!B198,\"//\",\"\")","v":"//"},"F.4.0",{"$f":"IF(stock!B194,\"//\",\"\")","v":"//"},null,"F.3.0",{"$f":"IF(stock!B190,\"//\",\"\")","v":"//"},"F.2.0",{"$f":"IF(stock!B186,\"//\",\"\")","v":"//"},"F.1.0",{"$f":"IF(stock!B182,\"//\",\"\")","v":"//"}]
[]
[]
[null,null,"G",null,null,null,null,null,null,null,null,null,null,null,null,null,null,null,null,null,null,null,null,null,null,"H",null,null,null,null,null,null,null,null,null,null,null,null,null,null,null,null,null,null,null,null,null,null,"I"]
[]
[null,null,"G.1.3",{"$f":"IF(stock!B221,\"//\",\"\")","v":{"$error":"#VALUE!"}},"G.2.3",{"$f":"IF(stock!B225,\"//\",\"\")","v":{"$error":"#VALUE!"}},"G.3.3",{"$f":"IF(stock!B229,\"//\",\"\")","v":{"$error":"#VALUE!"}},null,"G.4.3",{"$f":"IF(stock!B233,\"//\",\"\")","v":{"$error":"#VALUE!"}},"G.5.3",{"$f":"IF(stock!B237,\"//\",\"\")","v":"//"},"G.6.3",{"$f":"IF(stock!B239,\"//\",\"\")","v":"//"},null,"G.7.3",{"$f":"IF(stock!B245,\"//\",\"\")","v":{"$error":"#VALUE!"}},"G.8.3",{"$f":"IF(stock!B249,\"//\",\"\")","v":"//"},"G.9.3",{"$f":"IF(stock!B253,\"//\",\"\")","v":"//"},null,null,null,"H.9.3",{"$f":"IF(stock!B289,\"//\",\"\")","v":"//"},"H.8.3",{"$f":"IF(stock!B285,\"//\",\"\")","v":"//"},"H.7.3",{"$f":"IF(stock!B281,\"//\",\"\")","v":"//"},null,"H.6.3",{"$f":"IF(stock!B277,\"//\",\"\")","v":"//"},"H.5.3",{"$f":"IF(stock!B273,\"//\",\"\")","v":{"$error":"#VALUE!"}},"H.4.3",{"$f":"IF(stock!B269,\"//\",\"\")","v":{"$error":"#VALUE!"}},null,"H.3.3",{"$f":"IF(stock!B265,\"//\",\"\")","v":"//"},"H.2.3",{"$f":"IF(stock!B261,\"//\",\"\")","v":"//"},"H.1.3",{"$f":"IF(stock!B257,\"//\",\"\")","v":{"$error":"#VALUE!"}},null,null,null,"I.1.3",{"$f":"IF(stock!B293,\"//\",\"\")","v":"//"},"I2.3",{"$f":"IF(stock!B297,\"//\",\"\")","v":"//"},"I.3.3",{"$f":"IF(stock!B301,\"//\",\"\")","v":"//"},null,"I.4.3",{"$f":"IF(stock!B305,\"//\",\"\")","v":"//"},"I.5.3",{"$f":"IF(stock!B309,\"//\",\"\")","v":"//"},"I.6.3",{"$f":"IF(stock!B313,\"//\",\"\")","v":{"$error":"#VALUE!"}},null,"I.7.3",{"$f":"IF(stock!B317,\"//\",\"\")","v":"//"},"I.8.3",{"$f":"IF(stock!B321,\"//\",\"\")","v":"//"},"I.9.3",{"$f":"IF(stock!B325,\"//\",\"\")","v":"//"}]
[]
[null,null,"G.1.2",{"$f":"IF(stock!B220,\"//\",\"\")","v":{"$error":"#VALUE!"}},"G.2.2",{"$f":"IF(stock!B224,\"//\",\"\")","v":{"$error":"#VALUE!"}},"G.3.2",{"$f":"IF(stock!B228,\"//\",\"\")","v":{"$error":"#VALUE!"}},null,"G.4.2",{"$f":"IF(stock!B232,\"//\",\"\")","v":{"$error":"#VALUE!"}},"G.5.2",{"$f":"IF(stock!B236,\"//\",\"\")","v":"//"},"G.6.2",{"$f":"IF(stock!B238,\"//\",\"\")","v":"//"},null,"G.7.2",{"$f":"IF(stock!B244,\"//\",\"\")","v":{"$error":"#VALUE!"}},"G.8.2",{"$f":"IF(stock!B248,\"//\",\"\")","v":"//"},"G.9.2",{"$f":"IF(stock!B252,\"//\",\"\")","v":"//"},null,null,null,"H.9.2",{"$f":"IF(stock!B288,\"//\",\"\")","v":"//"},"H.8.2",{"$f":"IF(stock!B284,\"//\",\"\")","v":"//"},"H.7.2",{"$f":"IF(stock!B280,\"//\",\"\")","v":"//"},null,"H.6.2",{"$f":"IF(stock!B276,\"//\",\"\")","v":"//"},"H.5.2",{"$f":"IF(stock!B272,\"//\",\"\")","v":{"$error":"#VALUE!"}},"H.4.2",{"$f":"IF(stock!B268,\"//\",\"\")","v":{"$error":"#VALUE!"}},null,"H.3.2",{"$f":"IF(stock!B264,\"//\",\"\")","v":"//"},"H.2.2",{"$f":"IF(stock!B260,\"//\",\"\")","v":"//"},"H.1.2",{"$f":"IF(stock!B256,\"//\",\"\")","v":{"$error":"#VALUE!"}},null,null,null,"I.1.2",{"$f":"IF(stock!B292,\"//\",\"\")","v":"//"},"I.2.2",{"$f":"IF(stock!B296,\"//\",\"\")","v":"//"},"I.3.2",{"$f":"IF(stock!B300,\"//\",\"\")","v":"//"},null,"I.4.2",{"$f":"IF(stock!B304,\"//\",\"\")","v":"//"},"I.5.2",{"$f":"IF(stock!B308,\"//\",\"\")","v":"//"},"I.6.2",{"$f":"IF(stock!B312,\"//\",\"\")","v":{"$error":"#VALUE!"}},null,"I.7.2",{"$f":"IF(stock!B316,\"//\",\"\")","v":"//"},"I.8.2",{"$f":"IF(stock!B320,\"//\",\"\")","v":"//"},"I.9.2",{"$f":"IF(stock!B324,\"//\",\"\")","v":"//"}]
[]
[null,null,"G.1.1",{"$f":"IF(stock!B219,\"//\",\"\")","v":{"$error":"#VALUE!"}},"G.2.1",{"$f":"IF(stock!B223,\"//\",\"\")","v":{"$error":"#VALUE!"}},"G.3.1",{"$f":"IF(stock!B227,\"//\",\"\")","v":{"$error":"#VALUE!"}},null,"G.4.1",{"$f":"IF(stock!B231,\"//\",\"\")","v":{"$error":"#VALUE!"}},"G.5.1",{"$f":"IF(stock!B235,\"//\",\"\")","v":"//"},"G.6.1",{"$f":"IF(stock!B237,\"//\",\"\")","v":"//"},null,"G.7.1",{"$f":"IF(stock!B243,\"//\",\"\")","v":{"$error":"#VALUE!"}},"G.8.1",{"$f":"IF(stock!B247,\"//\",\"\")","v":"//"},"G.9.1",{"$f":"IF(stock!B251,\"//\",\"\")","v":"//"},null,null,null,"H.9.1",{"$f":"IF(stock!B287,\"//\",\"\")","v":"//"},"H.8.1",{"$f":"IF(stock!B283,\"//\",\"\")","v":"//"},"H.7.1",{"$f":"IF(stock!B279,\"//\",\"\")","v":"//"},null,"H.6.1",{"$f":"IF(stock!B275,\"//\",\"\")","v":"//"},"H.5.1",{"$f":"IF(stock!B271,\"//\",\"\")","v":{"$error":"#VALUE!"}},"H.4.1",{"$f":"IF(stock!B267,\"//\",\"\")","v":{"$error":"#VALUE!"}},null,"H.3.1",{"$f":"IF(stock!B263,\"//\",\"\")","v":"//"},"H.2.1",{"$f":"IF(stock!B259,\"//\",\"\")","v":{"$error":"#VALUE!"}},"H.1.1",{"$f":"IF(stock!B255,\"//\",\"\")","v":{"$error":"#VALUE!"}},null,null,null,"I.1.1",{"$f":"IF(stock!B291,\"//\",\"\")","v":{"$error":"#VALUE!"}},"I.2.1",{"$f":"IF(stock!B295,\"//\",\"\")","v":"//"},"I.3.1",{"$f":"IF(stock!B299,\"//\",\"\")","v":"//"},null,"I.4.1",{"$f":"IF(stock!B303,\"//\",\"\")","v":"//"},"I.5.1",{"$f":"IF(stock!B307,\"//\",\"\")","v":"//"},"I.6.1",{"$f":"IF(stock!B311,\"//\",\"\")","v":{"$error":"#VALUE!"}},null,"I.7.1",{"$f":"IF(stock!B315,\"//\",\"\")","v":"//"},"I.8.1",{"$f":"IF(stock!B319,\"//\",\"\")","v":{"$error":"#VALUE!"}},"I.9.1",{"$f":"IF(stock!B323,\"//\",\"\")","v":"//"}]
[]
[null,null,"G.1.0",{"$f":"IF(stock!B218,\"//\",\"\")","v":"//"},"G.2.0",{"$f":"IF(stock!B222,\"//\",\"\")","v":"//"},"G.3.0",{"$f":"IF(stock!B226,\"//\",\"\")","v":{"$error":"#VALUE!"}},null,"G.4.0",{"$f":"IF(stock!B230,\"//\",\"\")","v":{"$error":"#VALUE!"}},"G.5.0",{"$f":"IF(stock!B234,\"//\",\"\")","v":{"$error":"#VALUE!"}},"G.6.0",{"$f":"IF(stock!B238,\"//\",\"\")","v":"//"},null,"G.7.0",{"$f":"IF(stock!B242,\"//\",\"\")","v":{"$error":"#VALUE!"}},"G.8.0",{"$f":"IF(stock!B246,\"//\",\"\")","v":"//"},"G.9.0",{"$f":"IF(stock!B250,\"//\",\"\")","v":{"$error":"#VALUE!"}},null,null,null,"H.9.0",{"$f":"IF(stock!B286,\"//\",\"\")","v":{"$error":"#VALUE!"}},"H.8.0",{"$f":"IF(stock!B282,\"//\",\"\")","v":"//"},"H.7.0",{"$f":"IF(stock!B278,\"//\",\"\")","v":"//"},null,"H.6.0",{"$f":"IF(stock!B274,\"//\",\"\")","v":"//"},"H.5.0",{"$f":"IF(stock!B270,\"//\",\"\")","v":"//"},"H.4.0",{"$f":"IF(stock!B266,\"//\",\"\")","v":"//"},null,"H.3.0",{"$f":"IF(stock!B262,\"//\",\"\")","v":"//"},"H.2.0",{"$f":"IF(stock!B258,\"//\",\"\")","v":"//"},"H.1.0",{"$f":"IF(stock!B254,\"//\",\"\")","v":"//"},null,null,null,"I.1.0",{"$f":"IF(stock!B290,\"//\",\"\")","v":{"$error":"#VALUE!"}},"I.2.0",{"$f":"IF(stock!B294,\"//\",\"\")","v":"//"},"I.3.0",{"$f":"IF(stock!B298,\"//\",\"\")","v":{"$error":"#VALUE!"}},null,"I.4.0",{"$f":"IF(stock!B302,\"//\",\"\")","v":{"$error":"#VALUE!"}},"I.5.0",{"$f":"IF(stock!B306,\"//\",\"\")","v":"//"},"I.6.0",{"$f":"IF(stock!B310,\"//\",\"\")","v":{"$error":"#VALUE!"}},null,"I.7.0",{"$f":"IF(stock!B314,\"//\",\"\")","v":"//"},"I.8.0",{"$f":"IF(stock!B318,\"//\",\"\")","v":{"$error":"#VALUE!"}},"I.9.0",{"$f":"IF(stock!B322,\"//\",\"\")","v":"//"}]
[]
[]
[]
[]
[]
[null,null,"R.1x24",{"$f":"IF(stock!B326,\"//\",\"\")","v":"//"},null,null,"R.2x24",{"$f":"IF(stock!B327,\"//\",\"\")","v":"//"},null,"R.3x32",{"$f":"IF(stock!B328,\"//\",\"\")","v":"//"},null,null,"R.4x32",{"$f":"IF(stock!B329,\"//\",\"\")","v":"//"},null,"R.5x32",{"$f":"IF(stock!B330,\"//\",\"\")","v":"//"},null,null,"R.6x32",{"$f":"IF(stock!B331,\"//\",\"\")","v":"//"},null,null,null,"R.7x32",{"$f":"IF(stock!B332,\"//\",\"\")","v":"//"},null,null,"R.8x32",{"$f":"IF(stock!B333,\"//\",\"\")","v":"//"},null,"R.9x32",{"$f":"IF(stock!B334,\"//\",\"\")","v":"//"},null,null,"R.10x32",{"$f":"IF(stock!B335,\"//\",\"\")","v":"//"},null,"R.11x32",{"$f":"IF(stock!B336,\"//\",\"\")","v":{"$error":"#VALUE!"}},null,null,"R.12x32",{"$f":"IF(stock!B337,\"//\",\"\")","v":"//"},null,null,null,"R.13x32",{"$f":"IF(stock!B338,\"//\",\"\")","v":"//"},null,null,"R.14x32",{"$f":"IF(stock!B339,\"//\",\"\")","v":"//"},null,"R.15x32",{"$f":"IF(stock!B340,\"//\",\"\")","v":"//"},null,null,"R.16x32",{"$f":"IF(stock!B341,\"//\",\"\")","v":{"$error":"#VALUE!"}},null,"R.17x32",{"$f":"IF(stock!B342,\"//\",\"\")","v":"//"},null,null,"R.18x32",{"$f":"IF(stock!B343,\"//\",\"\")","v":"//"}]
[]
[]
[]
[]
[null,null,"R.19x24",{"$f":"IF(stock!B344,\"//\",\"\")","v":"//"},null,null,"R.20x24",{"$f":"IF(stock!B345,\"//\",\"\")","v":"//"},null,"R.21x32",{"$f":"IF(stock!B346,\"//\",\"\")","v":{"$error":"#VALUE!"}},null,null,"R.22x32",{"$f":"IF(stock!B347,\"//\",\"\")","v":"//"},null,"R.23x32",{"$f":"IF(stock!B348,\"//\",\"\")","v":"//"},null,null,"R.24x32",{"$f":"IF(stock!B349,\"//\",\"\")","v":"//"},null,null,null,"R.25x32",{"$f":"IF(stock!B350,\"//\",\"\")","v":"//"},null,null,"R.26x32",{"$f":"IF(stock!B351,\"//\",\"\")","v":"//"},null,"R.27x32",{"$f":"IF(stock!B352,\"//\",\"\")","v":"//"},null,null,"R.28x32",{"$f":"IF(stock!B353,\"//\",\"\")","v":"//"},null,"R.29x32",{"$f":"IF(stock!B354,\"//\",\"\")","v":{"$error":"#VALUE!"}},null,null,"R.30x32",{"$f":"IF(stock!B355,\"//\",\"\")","v":"//"},null,null,null,"R.31x32",{"$f":"IF(stock!B356,\"//\",\"\")","v":{"$error":"#VALUE!"}},null,null,"R.32x32",{"$f":"IF(stock!B357,\"//\",\"\")","v":"//"},null,"R.33x32",{"$f":"IF(stock!B358,\"//\",\"\")","v":"//"},null,null,"R.34x32",{"$f":"IF(stock!B359,\"//\",\"\")","v":"//"},null,"R.35x32",{"$f":"IF(stock!B360,\"//\",\"\")","v":"//"},null,null,"R.36x32",{"$f":"IF(stock!B361,\"//\",\"\")","v":"//"}]
[]
[]
[]
[]
[null,null,"R.37x24",{"$f":"IF(stock!B362,\"//\",\"\")","v":"//"},null,null,"R.38x24",{"$f":"IF(stock!B363,\"//\",\"\")","v":"//"},null,"R.39x32",{"$f":"IF(stock!B364,\"//\",\"\")","v":"//"},null,null,"R.40x32",{"$f":"IF(stock!B365,\"//\",\"\")","v":{"$error":"#VALUE!"}},null,"R.41x32",{"$f":"IF(stock!B366,\"//\",\"\")","v":{"$error":"#VALUE!"}}]

{"sheet":"Feuil6","index":11,"n_rows":12,"n_cols":22,"rows_kept":12,"cut":false,"hidden":false,"merged":[[0,0,0,10],[0,11,0,17],[4,19,4,20],[4,21,4,24],[5,21,5,24],[11,21,11,24],[6,21,6,24],[7,21,7,24],[8,21,8,24],[9,21,9,24],[10,21,10,24]]}
["Historique D'inventaire",null,null,null,null,null,null,null,null,null,null,"Causes modification"]
["Date","Heure","Initiales","Action","1","Référence","Produit","Code","Date Péremp.","Qté palettes","Qté Produit",1,2,3,4,5,6,7]
[]
[]
[null,null,null,null,null,null,null,null,null,null,null,null,null,null,null,null,null,null,null,"Les modification",null,"Les causes"]
[null,null,null,null,null,null,null,null,null,null,null,null,null,null,null,null,null,null,null,1,"Modif. Quantité +","Correction de la quantité, en +"]
[null,null,null,null,null,null,null,null,null,null,null,null,null,null,null,null,null,null,null,2,"Modif. Quantité -","Correction de la quantité, en -"]
[null,null,null,null,null,null,null,null,null,null,null,null,null,null,null,null,null,null,null,3,"Modif. Date","Correction de la date"]
[null,null,null,null,null,null,null,null,null,null,null,null,null,null,null,null,null,null,null,4,"Modif. De référence","Correction de référence"]
[null,null,null,null,null,null,null,null,null,null,null,null,null,null,null,null,null,null,null,5,"Modif. Code","Correction du code"]
[null,null,null,null,null,null,null,null,null,null,null,null,null,null,null,null,null,null,null,6,"Autres","  Empl.vide…"]
[null,null,null,null,null,null,null,null,null,null,null,null,null,null,null,null,null,null,null,7,"Inventaire OK","  R.A.S"]

{"sheet":"InvenT","index":12,"n_rows":89,"n_cols":7,"rows_kept":89,"cut":false,"hidden":false,"merged":[[0,0,0,6]]}
["Inventaire total"]
["L","Référence","Produit","Code","Date péremption","Palettes","Qté. Colis"]
[1,3,"biscottes",314,"2017-01-09","2p",96]
[2,3,"biscottes",289,"2016-12-15","2p",96]
[3,3,"biscottes",284,"2016-12-10","5p",240]
[4,3,"biscottes",291,"2016-12-17","1p",48]
[5,31,"abricot 1 kg",250,"2016-11-06","4p",200]
[6,31,"abricot 1 kg",252,"2016-11-08","2p",72]
[7]
[8]
[9]
[10]
[11]
[12]
[13]
[14]
[15]
[16]
[17]
[18]
[19]
[20]
[21]
[22]
[23]
[24]
[25]
[26]
[27]
[28]
[29]
[30]
[31]
[32]
[33]
[34]
[35]
[36]
[37]
[38]
[39]
[40]
[41]
[42]
[43]
[44]
[45]
[46]
[47]
[48]
[49]
[50]
[51]
[52]
[53]
[54]
[55]
[56]
[57]
[58]
[59]
[60]
[61]
[62]
[63]
[64]
[65]
[66]
[67]
[68]
[69]
[70]
[71]
[72]
[73]
[74]
[75]
[76]
[77]
[78]
[79]
[80]
[81]
[82]
[83]
[84]
[85]
[86]
[87]