{"text_format":"1","workbook":"xlsx","n_sheets":7,"sheets":["Accueil","Donnees","Ordonnancement","Ordonna","Usine","Commentaires","Informations"],"not_rendered":{"charts":1,"images":6,"macros":1,"external_links":1,"defined_names":18,"comments":1,"pivot_tables":0},"unopened":[],"bounds":{"document_bytes":16777216,"sheet_cells":100000,"rows_first":2000,"rows_last":500,"rows_between":2000,"halvings":0,"cell_chars":16384,"cell_head_chars":4096},"cells_cut":0,"cells_raw":0,"read":"row_number_cap","date_system":"1900"}

{"sheet":"Accueil","index":0,"n_rows":15,"n_cols":4,"rows_kept":15,"cut":false,"hidden":false,"merged":[[0,0,1,0]]}
[{"$f":"NOW()","v":"2016-08-10T11:04:07.080"}]
[]
[]
[]
[]
[]
[]
[null,null,null,"Roanne"]
[]
[]
[]
[]
[]
[]
[null,null,null,"momo"]

{"sheet":"Donnees","index":1,"n_rows":61,"n_cols":24,"rows_kept":61,"cut":false,"hidden":false,"merged":[]}
["Familles","Poids livré\nen kg","équipement de lavage ","Unité de lavage (Kg)","TcycleL","Séchoir","TcycleS","Calandre","TcycleC",null,null,"CodeFamille","PourCent\nPoids","Code à 2 chiffres","PourCent\ncumulés",{"$f":"L1","v":"CodeFamille"},{"$f":"C1","v":"équipement de lavage "},{"$f":"D1","v":"Unité de lavage (Kg)"},{"$f":"H1","v":"Calandre"},"Temps total",null,"TcycleC",null,"Total Poids livré"]
["Blanchissage plat1",20.953448275862069,1,50,"00:01:47",5,"00:13:00","plat6",3.6711416617612609,null,null,{"$f":"CONCATENATE(A2, \" - \",N2)","v":"Blanchissage plat1 - 01"},{"$f":"B2/$X$2","v":2.9819698277022428E-3},"01",0,{"$f":"L2","v":"Blanchissage plat1 - 01"},{"$f":"C2","v":1},{"$f":"D2","v":50},"plat6",{"$f":"E2+G2+I2","v":3.6814078654649647},null,128.32600239659175,{"$f":"V2/24/60","v":8.9115279442077602E-2},{"$f":"SUM(B2:B100)","v":7026.7137115896812}]
["Blanchissage plat6",48.6,4,540,"00:00:00",5,"00:13:00","plat3",7.3260073260073284,null,null,{"$f":"CONCATENATE(A3, \" - \",N3)","v":"Blanchissage plat6 - 02"},{"$f":"B3/$X$2","v":6.9164622318169033E-3},"02",{"$f":"O2+M2","v":2.9819698277022428E-3},"Blanchissage plat6 - 02",{"$f":"C3","v":4},540,"plat3",{"$f":"E3+G3+I3","v":7.3350351037851063},null,59.425663258835094,{"$f":"V3/24/60","v":4.1267821707524376E-2}]
["alése abs",28.309141694652538,1,50,"00:01:47",6,"00:20:00","plat6","12:06:40.252",null,null,"alése abs - 03",4.0287882581526218E-3,"03",9.8984320595191452E-3,"alése abs - 03",1,50,"plat6","12:28:27.252",null,128.32600239659175,8.9115279442077602E-2]
["carré/gant",2.319337700514589,1,50,"00:01:47",6,"00:20:00","plat6",2.1557878349886934,null,null,"carré/gant - 04",3.3007431293082754E-4,"04",1.3927220317671768E-2,"carré/gant - 04",1,50,"plat6",2.1709151498035082,null,128.32600239659175,8.9115279442077602E-2]
["ch tab",6.8697528894561444,1,50,"00:01:47",1,"00:02:27","plat3","11:52:58.475",null,null,"ch tab - 05",9.7766227164276668E-4,"05",1.4257294630602595E-2,"ch tab - 05",1,50,"plat3","11:57:12.475",null,59.425663258835094,4.1267821707524376E-2]
["chmal",12.500000000000004,1,50,"00:01:47",6,"00:20:00","plat6",3.0769230769230762,null,null,"chmal - 06",1.7789254711463233E-3,"06",1.5234956902245361E-2,"chmal - 06",1,50,"plat6",3.092050391737891,null,122.75658904999779,8.5247631284720696E-2]
["couette/couv",64.551515151515147,1,50,"00:01:47",6,"00:20:00","plat6","14:52:18.635",null,null,"couette/couv - 07",9.1865867603294453E-3,"07",1.7013882373391683E-2,"couette/couv - 07",1,50,"plat6","15:14:05.635",null,122.75658904999779,8.5247631284720696E-2]
["drap petit",46.1271992793286,1,50,"00:01:47",2,"00:02:30","plat1","02:01:42.462",null,null,"drap petit - 08",6.5645479768511959E-3,"08",2.6200469133721128E-2,"drap petit - 08",1,50,"plat1","02:05:59.462",null,122.75658904999779,8.5247631284720696E-2]
["drap grand",61.197316254440814,1,50,"00:01:47",2,"00:02:30","plat1","01:44:34.785",null,null,"drap grand - 09",8.7092371720657313E-3,"09",3.2765017110572323E-2,"drap grand - 09",1,50,"plat1","01:48:51.785",null,122.75658904999779,8.5247631284720696E-2]
["drap bain",21.601842470896688,1,50,"00:01:47",3,"00:22:00","plat4","04:00:28.784",null,null,"drap bain - 10",3.074245423613483E-3,"10",4.1474254282638054E-2,"drap bain - 10",1,50,"plat4","04:24:15.784",null,128.32600239659175,8.9115279442077602E-2]
["drap bain luxe",29.862010627316515,1,50,"00:01:47",3,"00:22:00","plat4","03:08:39.672",null,null,"drap bain luxe - 11",4.2497833059660425E-3,"11",4.4548499706251535E-2,"drap bain luxe - 11",1,50,"plat4","03:32:26.672",null,128.32600239659175,8.9115279442077602E-2]
["drap housse",29.794174323601368,1,50,"00:01:47",6,"00:20:00","plat6","10:35:56.523",null,null,"drap housse - 12",4.2401292476822589E-3,"12",4.8798283012217579E-2,"drap housse - 12",1,50,"plat6","10:57:43.523",null,128.32600239659175,8.9115279442077602E-2]
["drap luxe",57.892990358677842,1,50,"00:01:47",2,"00:02:30","plat1","01:50:32.927",null,null,"drap luxe - 13",8.2389852119904398E-3,"13",5.3038412259899838E-2,"drap luxe - 13",1,50,"plat1","01:54:49.927",null,12.968484605365797,9.0058920870595797E-3]
["grde al",25.482406885598653,1,50,"00:01:47",2,"00:02:30","plat1","03:04:40.309",null,null,"grde al - 14",3.6265042139924709E-3,"14",6.1277397471890274E-2,"grde al - 14",1,50,"plat1","03:08:57.309",null,122.75658904999779,8.5247631284720696E-2]
["nap .30",607.62571061093252,4,540,"00:00:00",1,"00:02:27","plat2",2.0640890049337739,null,null,"nap .30 - 15",8.6473668282333785E-2,"15",6.4903901685882739E-2,"nap .30 - 15",4,540,"plat2",2.0657903938226627,null,59.425663258835094,4.1267821707524376E-2]
["nap .50",1649.8251608667103,4,540,"00:00:00",1,"00:02:27","plat2",1.2669964249708998,null,null,"nap .50 - 16",0.23479328012830963,"16",0.15137756996821652,"nap .50 - 16",4,540,"plat2",1.2686978138597886,null,12.968484605365797,9.0058920870595797E-3]
["nap 12",237.43458022649278,4,540,"00:00:00",1,"00:02:27","plat2",1.886524982392294,null,null,"nap 12 - 17",3.3790273799667446E-2,"17",0.38617085009652619,"nap 12 - 17",4,540,"plat2",1.8882263712811829,null,12.968484605365797,9.0058920870595797E-3]
["nap 15",393.0269343242868,4,540,"00:00:00",1,"00:02:27","plat2",1.3676200631426092,null,null,"nap 15 - 18",5.5933249945282142E-2,"18",0.41996112389619361,"nap 15 - 18",4,540,"plat2",1.369321452031498,null,122.75658904999779,8.5247631284720696E-2]
["nap 18",456.83291384950934,4,540,"00:00:00",1,"00:02:27","plat2",1.1766041903766924,null,null,"nap 18 - 19",6.5013736520390872E-2,"19",0.47589437384147576,"nap 18 - 19",4,540,"plat2",1.1783055792655812,null,122.75658904999779,8.5247631284720696E-2]
{"$rows_left_out":42}
{"sheet":"Ordonnancement","index":2,"n_rows":24,"n_cols":15,"rows_kept":24,"cut":false,"hidden":false,"merged":[[22,8,22,9],[22,10,22,11],[23,8,23,11],[23,13,23,15]]}
["Produit Tunnel","Equipement lavage","Calandre",null,"Produit Laveuse","Equipement lavage","Calandre"]
["HC GD portrait - 40",1,"plat2"]
[]
[]
[]
[]
[]
[]
[]
[]
[]
[]
[]
[]
[]
[]
[]
[]
[]
[]
{"$rows_left_out":5}
{"sheet":"Ordonna","index":3,"n_rows":54,"n_cols":13,"rows_kept":54,"cut":false,"hidden":true,"merged":[[0,11,0,12],[0,0,0,2],[0,4,0,7]]}
["Données",null,null,null,"Pour tirage au sort",null,null,null,null,null,null,"Sélection"]
["CodeFamille","Calandre","Tonnage (kg)",null,"en %","%\ncumulés","CodeFamille","Calandre",null,null,"nap 22 - 21","CodeFamille","Calandre"]
[{"$f":"Donnees!L2","v":"Blanchissage plat1 - 01"},{"$f":"Donnees!S2","v":"plat6"},{"$f":"Donnees!B2","v":20.953448275862069},null,{"$f":"C3/$C$54","v":2.9819698277022428E-3},0,{"$f":"A3","v":"Blanchissage plat1 - 01"},{"$f":"B3","v":"plat6"},null,null,"nap 24 - 22","hous trav - 22","Plat5"]
[{"$f":"Donnees!L3","v":"Blanchissage plat6 - 02"},{"$f":"Donnees!S3","v":"plat3"},{"$f":"Donnees!B3","v":48.6},null,{"$f":"C4/$C$54","v":6.9164622318169033E-3},{"$f":"F3+E3","v":2.9819698277022428E-3},{"$f":"A4","v":"Blanchissage plat6 - 02"},"plat3",null,null,"nap 22 - 21","drap grand - 16","Plat3"]
[{"$f":"Donnees!L4","v":"alése abs - 03"},{"$f":"Donnees!S4","v":"plat6"},{"$f":"Donnees!B4","v":28.309141694652538},null,4.0287882581526218E-3,{"$f":"F4+E4","v":9.8984320595191452E-3},"alése abs - 03","plat6",null,null,"HC GD portrait - 39","drap 1/2 - 11","Plat4"]
[{"$f":"Donnees!L5","v":"carré/gant - 04"},{"$f":"Donnees!S5","v":"plat6"},{"$f":"Donnees!B5","v":2.319337700514589},null,3.3007431293082754E-4,1.3927220317671768E-2,"carré/gant - 04","plat6",null,null,"nap .50 - 16","drap bain luxe - 14","Plat5"]
[{"$f":"Donnees!L6","v":"ch tab - 05"},{"$f":"Donnees!S6","v":"plat3"},{"$f":"Donnees!B6","v":6.8697528894561444},null,9.7766227164276668E-4,1.4257294630602595E-2,"ch tab - 05","plat3",null,null,"serv tab pte - 32"]
[{"$f":"Donnees!L7","v":"chmal - 06"},{"$f":"Donnees!S7","v":"plat6"},{"$f":"Donnees!B7","v":12.500000000000004},null,1.7789254711463233E-3,1.5234956902245361E-2,"chmal - 06","plat6"]
[{"$f":"Donnees!L8","v":"couette/couv - 07"},{"$f":"Donnees!S8","v":"plat6"},{"$f":"Donnees!B8","v":64.551515151515147},null,9.1865867603294453E-3,1.7013882373391683E-2,"couette/couv - 07","plat6"]
[{"$f":"Donnees!L9","v":"drap petit - 08"},{"$f":"Donnees!S9","v":"plat1"},{"$f":"Donnees!B9","v":46.1271992793286},null,6.5645479768511959E-3,2.6200469133721128E-2,"drap petit - 08","plat1"]
[{"$f":"Donnees!L10","v":"drap grand - 09"},{"$f":"Donnees!S10","v":"plat1"},{"$f":"Donnees!B10","v":61.197316254440814},null,8.7092371720657313E-3,3.2765017110572323E-2,"drap grand - 09","plat1"]
[{"$f":"Donnees!L11","v":"drap bain - 10"},{"$f":"Donnees!S11","v":"plat4"},{"$f":"Donnees!B11","v":21.601842470896688},null,3.074245423613483E-3,4.1474254282638054E-2,"drap bain - 10","plat4"]
[{"$f":"Donnees!L12","v":"drap bain luxe - 11"},{"$f":"Donnees!S12","v":"plat4"},{"$f":"Donnees!B12","v":29.862010627316515},null,4.2497833059660425E-3,4.4548499706251535E-2,"drap bain luxe - 11","plat4"]
[{"$f":"Donnees!L13","v":"drap housse - 12"},{"$f":"Donnees!S13","v":"plat6"},{"$f":"Donnees!B13","v":29.794174323601368},null,4.2401292476822589E-3,4.8798283012217579E-2,"drap housse - 12","plat6"]
[{"$f":"Donnees!L14","v":"drap luxe - 13"},{"$f":"Donnees!S14","v":"plat1"},{"$f":"Donnees!B14","v":57.892990358677842},null,8.2389852119904398E-3,5.3038412259899838E-2,"drap luxe - 13","plat1"]
[{"$f":"Donnees!L15","v":"grde al - 14"},{"$f":"Donnees!S15","v":"plat1"},{"$f":"Donnees!B15","v":25.482406885598653},null,3.6265042139924709E-3,6.1277397471890274E-2,"grde al - 14","plat1"]
[{"$f":"Donnees!L16","v":"nap .30 - 15"},{"$f":"Donnees!S16","v":"plat2"},{"$f":"Donnees!B16","v":607.62571061093252},null,8.6473668282333785E-2,6.4903901685882739E-2,"nap .30 - 15","plat2"]
[{"$f":"Donnees!L17","v":"nap .50 - 16"},{"$f":"Donnees!S17","v":"plat2"},{"$f":"Donnees!B17","v":1649.8251608667103},null,0.23479328012830963,0.15137756996821652,"nap .50 - 16","plat2"]
[{"$f":"Donnees!L18","v":"nap 12 - 17"},{"$f":"Donnees!S18","v":"plat2"},{"$f":"Donnees!B18","v":237.43458022649278},null,3.3790273799667446E-2,0.38617085009652619,"nap 12 - 17","plat2"]
[{"$f":"Donnees!L19","v":"nap 15 - 18"},{"$f":"Donnees!S19","v":"plat2"},{"$f":"Donnees!B19","v":393.0269343242868},null,5.5933249945282142E-2,0.41996112389619361,"nap 15 - 18","plat2"]
{"$rows_left_out":35}
{"sheet":"Usine","index":4,"n_rows":50,"n_cols":47,"rows_kept":50,"cut":false,"hidden":false,"merged":[[0,28,0,32],[0,36,0,40],[18,15,18,17],[0,20,0,24],[1,0,1,4],[1,6,1,10]],"read":"row_number_cap"}
[null,null,null,null,null,null,null,null,null,null,null,null,null,null,null,null,null,null,null,null,"Equipements de lavage",null,null,null,null,"Lavage",null,null,"Approvisionnement",null,null,null,null,"Séchoir",null,null,"Approvisionnement",null,null,null,null,"Calandre",null,"Sortie ","Heure de Sortie ","Commentaire calandre ","Durée"]
["Vers tunnel",null,null,null,null,null,"Vers laveuses",null,null,null,null,null,null,null,null,null,null,null,null,null,"n°","Modèle",null,null,null,null,null,null,"n°","Modèle",null,null,null,null,null,null,"n°","Modèle",null,null,null,null,null,"HC GD portrait - 40",0.36069384829865558,null,{"$f":"SUM(SUMIF($A$3:$A$40,AR2,$D$3:$D$40),SUMIF($G$3:$G$40,AR2,$J$3:$J$40))","v":0.10460588195663913}]
["Produit Tunnel","Calandre","Entrée","Durée","Sortie",null,"Produit Laveuses","Calandre","Entrée","Durée","Sortie",null,null,"Tonnage semaine",1000,null,null,null,null,"Machine",1,1,"Tunnel",null,null,50,null,"Machine",1,0,null,null,null,null,null,"Machine",1,"plat1",null,null,null,null,null,null,null,null,{"$f":"SUM(SUMIF($A$3:$A$40,AR3,$D$3:$D$40),SUMIF($G$3:$G$40,AR3,$J$3:$J$40))","v":0}]
["HC GD portrait - 40","plat2",0.25,{"$f":"IF(C4=\"\",\"\",VLOOKUP(A4,Donnees!$P$2:$T$61,5,FALSE))","v":0.10460588195663913},{"$f":"IF(C4=\"\",\"\",C4+D4)","v":0.35460588195663911},null,null,null,null,{"$f":"IF(I4=\"\",\"\",VLOOKUP(G4,Donnees!$P$2:$U$40,5))","v":""},{"$f":"IF(I4=\"\",\"\",I4+J4)","v":""},null,null,"Débit total",{"$f":"(SUM(AP3,AP9,AP15,AP21,AP27,AP33)/SUM(AU2:AU45))","v":477.98459383694916},null,null,null,null,"Produit",null,null,null,null,null,null,null,"Produit",null,null,null,null,null,null,null,"Produit",null,null,null,null,null,null,null,null,null,null,0]
[null,null,null,{"$f":"IF(C5=\"\",\"\",VLOOKUP(A5,Donnees!$P$2:$T$61,5,FALSE))","v":""},{"$f":"IF(C5=\"\",\"\",C5+D5)","v":""},null,null,null,null,{"$f":"IF(I5=\"\",\"\",VLOOKUP(G5,Donnees!$P$2:$U$40,5))","v":""},{"$f":"IF(I5=\"\",\"\",I5+J5)","v":""},null,null,null,null,null,null,null,null,"Quantité",null,null,null,null,null,null,null,"Quantité",null,null,null,null,null,null,null,"Quantité",null,null,null,null,null,null,null,null,null,null,0]
[null,null,null,{"$f":"IF(C6=\"\",\"\",VLOOKUP(A6,Donnees!$P$2:$T$61,5,FALSE))","v":""},"",null,null,null,null,{"$f":"IF(I6=\"\",\"\",VLOOKUP(G6,Donnees!$P$2:$U$40,5))","v":""},"",null,null,"Heure départ",0.25,null,null,null,null,"Heure entrée",null,null,null,null,null,null,null,"Heure entrée",null,null,null,null,null,null,null,"Heure entrée",null,null,null,null,null,null,null,null,null,null,0]
[null,null,null,{"$f":"IF(C7=\"\",\"\",VLOOKUP(A7,Donnees!$P$2:$T$61,5,FALSE))","v":""},"",null,null,null,null,{"$f":"IF(I7=\"\",\"\",VLOOKUP(G7,Donnees!$P$2:$U$40,5))","v":""},"",null,null,"Heure fin",1.25,null,null,null,null,"Durée",null,null,null,null,null,null,null,"Durée",null,null,null,null,null,null,null,"Durée",null,null,null,null,null,null,null,null,null,null,0]
[null,null,null,{"$f":"IF(C8=\"\",\"\",VLOOKUP(A8,Donnees!$P$2:$T$61,5,FALSE))","v":""},"",null,null,null,null,{"$f":"IF(I8=\"\",\"\",VLOOKUP(G8,Donnees!$P$2:$U$40,5))","v":""},"",null,null,"Heure simulée",0.36111111111111072,null,null,null,null,"Heure sortie",null,null,null,null,null,null,null,"Heure sortie",null,null,null,null,null,null,null,"Heure sortie",null,null,null,null,null,null,null,null,null,null,0]
[null,null,null,{"$f":"IF(C9=\"\",\"\",VLOOKUP(A9,Donnees!$P$2:$T$61,5,FALSE))","v":""},"",null,null,null,null,{"$f":"IF(I9=\"\",\"\",VLOOKUP(G9,Donnees!$P$2:$U$40,5))","v":""},"",null,null,null,null,null,null,null,null,null,null,null,null,null,null,null,null,"Machine",2,1,null,null,null,50,null,"Machine",2,"plat2",null,null,null,50,null,null,null,null,0]
[null,null,null,{"$f":"IF(C10=\"\",\"\",VLOOKUP(A10,Donnees!$P$2:$T$61,5,FALSE))","v":""},"",null,null,null,null,{"$f":"IF(I10=\"\",\"\",VLOOKUP(G10,Donnees!$P$2:$U$40,5))","v":""},"",null,null,null,null,null,null,null,null,null,null,null,null,null,null,null,null,"Produit",null,null,null,null,null,null,null,"Produit",null,null,null,null,null,null,null,null,null,null,0]
[null,null,null,{"$f":"IF(C11=\"\",\"\",VLOOKUP(A11,Donnees!$P$2:$T$61,5,FALSE))","v":""},"",null,null,null,null,{"$f":"IF(I11=\"\",\"\",VLOOKUP(G11,Donnees!$P$2:$U$40,5))","v":""},"",null,null,null,null,null,null,null,null,null,null,null,null,null,null,null,null,"Quantité",null,null,null,null,null,null,null,"Quantité",null,null,null,null,null,null,null,null,null,null,0]
[null,null,null,{"$f":"IF(C12=\"\",\"\",VLOOKUP(A12,Donnees!$P$2:$T$61,5,FALSE))","v":""},"",null,null,null,null,{"$f":"IF(I12=\"\",\"\",VLOOKUP(G12,Donnees!$P$2:$U$40,5))","v":""},"",null,null,null,null,null,null,null,null,null,null,null,null,null,null,null,null,"Heure entrée",null,null,null,null,null,null,null,"Heure entrée",null,null,null,null,null,null,null,null,null,null,0]
[null,null,null,{"$f":"IF(C13=\"\",\"\",VLOOKUP(A13,Donnees!$P$2:$T$61,5,FALSE))","v":""},"",null,null,null,null,{"$f":"IF(I13=\"\",\"\",VLOOKUP(G13,Donnees!$P$2:$U$40,5))","v":""},"",null,null,null,null,null,null,null,null,null,null,null,null,null,null,null,null,"Durée",null,null,null,null,null,null,null,"Durée",null,null,null,null,null,null,null,null,null,null,0]
[null,null,null,{"$f":"IF(C14=\"\",\"\",VLOOKUP(A14,Donnees!$P$2:$T$61,5,FALSE))","v":""},"",null,null,null,null,{"$f":"IF(I14=\"\",\"\",VLOOKUP(G14,Donnees!$P$2:$U$40,5))","v":""},"",null,null,null,null,null,null,null,null,null,null,null,null,null,null,null,null,"Heure sortie",null,null,null,null,null,null,null,"Heure sortie",null,null,null,null,null,null,null,null,null,null,0]
[null,null,null,{"$f":"IF(C15=\"\",\"\",VLOOKUP(A15,Donnees!$P$2:$T$61,5,FALSE))","v":""},"",null,null,null,null,{"$f":"IF(I15=\"\",\"\",VLOOKUP(G15,Donnees!$P$2:$U$40,5))","v":""},"",null,null,null,null,null,null,null,null,"Machine",3,4,"Laveuse",null,null,null,null,"Machine",3,2,null,null,null,null,null,"Machine",3,"plat3",null,null,null,null,null,null,null,null,0]
[null,null,null,{"$f":"IF(C16=\"\",\"\",VLOOKUP(A16,Donnees!$P$2:$T$61,5,FALSE))","v":""},"",null,null,null,null,{"$f":"IF(I16=\"\",\"\",VLOOKUP(G16,Donnees!$P$2:$U$40,5))","v":""},"",null,null,null,null,null,null,null,null,"Produit",null,null,null,null,null,null,null,"Produit",null,null,null,null,null,null,null,"Produit",null,null,null,null,null,null,null,null,null,null,0]
[null,null,null,{"$f":"IF(C17=\"\",\"\",VLOOKUP(A17,Donnees!$P$2:$T$61,5,FALSE))","v":""},"",null,null,null,null,{"$f":"IF(I17=\"\",\"\",VLOOKUP(G17,Donnees!$P$2:$U$40,5))","v":""},"",null,null,null,null,null,null,null,null,"Quantité",null,null,null,null,null,null,null,"Quantité",null,null,null,null,null,null,null,"Quantité",null,null,null,null,null,null,null,null,null,null,0]
[null,null,null,{"$f":"IF(C18=\"\",\"\",VLOOKUP(A18,Donnees!$P$2:$T$61,5,FALSE))","v":""},"",null,null,null,null,{"$f":"IF(I18=\"\",\"\",VLOOKUP(G18,Donnees!$P$2:$U$40,5))","v":""},"",null,null,null,null,null,null,null,null,"Heure entrée",null,null,null,null,null,null,null,"Heure entrée",null,null,null,null,null,null,null,"Heure entrée",null,null,null,null,null,null,null,null,null,null,0]
[null,null,null,{"$f":"IF(C19=\"\",\"\",VLOOKUP(A19,Donnees!$P$2:$T$61,5,FALSE))","v":""},"",null,null,null,null,{"$f":"IF(I19=\"\",\"\",VLOOKUP(G19,Donnees!$P$2:$U$40,5))","v":""},"",null,null,null,null,null,null,null,null,"Durée",null,null,null,null,null,null,null,"Durée",null,null,null,null,null,null,null,"Durée",null,null,null,null,null,null,null,null,null,null,0]
[null,null,null,{"$f":"IF(C20=\"\",\"\",VLOOKUP(A20,Donnees!$P$2:$T$61,5,FALSE))","v":""},"",null,null,null,null,{"$f":"IF(I20=\"\",\"\",VLOOKUP(G20,Donnees!$P$2:$U$40,5))","v":""},"",null,null,null,null,null,null,null,null,"Heure sortie",null,null,null,null,null,null,null,"Heure sortie",null,null,null,null,null,null,null,"Heure sortie",null,null,null,null,null,null,null,null,null,null,0]
{"$rows_left_out":31}
{"sheet":"Commentaires","index":5,"n_rows":41,"n_cols":4,"rows_kept":41,"cut":false,"hidden":false,"merged":[]}
["N°","Commentaires","Centre","Débit Total"]
[1,"momo","Roanne",{"$f":"(SUM(AE1,AE7,AE13,AE19,AE25,AE31)/SUM(#REF!))","v":{"$error":"#REF!"}}]
[2]
[3]
[4]
[5]
[6]
[7]
[8]
[9]
[10]
[11]
[12]
[13]
[14]
[15]
[16]
[17]
[18]
[19]
{"$rows_left_out":22}
{"sheet":"Informations","index":6,"n_rows":35,"n_cols":14,"rows_kept":35,"cut":false,"hidden":true,"merged":[[10,2,11,6],[10,7,11,7]]}
["Ceci est un \"poste de travail\"",null,null,null,null,null,null,null,null,"le poste de travail est un \"modèle\" applicable aux séchoirs et aux calendreuses"]
[]
[null,null,null,null,null,null,null,null,null,"Qmin, Qmax non utilisés. Il pourrait être envisagé que la machine n'accepte que des quantités minimales et maximales, le produit restant en attente si quantité insuffisante"]
[null,null,"n°","Modèle","Qmin","Qmax",null,"Tot",null,"Chaque machine a un n° particulier, mais plusieurs machines peuvent être du même \"Modèle\". Chaque produit est travaillé par un modèle particulier (non prévu: produit pouvant être traité par plusieurs modèles différents)"]
[null,"Machine",1,0,null,null,null,null,null,"description de la machine - dernière colonne = la machine elle-même, les 5 colonnes qui précèdent = Approvisionnement = file d'attente avant d'entrer dans la machine"]
[null,"Produit",null,null,null,null,null,null,null,"indique le code du produit à travailler"]
[null,"Quantité",null,null,null,null,null,null,null,"indique la quantité de ce produit"]
[null,"Heure entrée",null,null,null,null,null,null,null,"heure d'entrée du produit au point indiqué"]
[null,"Durée",null,null,null,null,null,null,null,"durée du traitement",null,null,null,"est une fonction du produit"]
[null,"Heure sortie",null,null,null,null,null,null,null,"heure de sortie (= heure d'entrée + durée)"]
[null,null,"file d'attente",null,null,null,null,"machine"]
[]
[]
[null,null,"la file d'attente ne correspond pas nécessairement à une réalité physique"]
[null,null,"mais elle permet dans la simulation de localiser les points à problème: là où \"ça n'avance pas\""]
[]
[]
[null,"Simulation:"]
[null,"se fait en partant des sorties vers l'entrée"]
[null,"1) sur chaque machine pour faire \"sortir\" les produits + poussée de la file"]
{"$rows_left_out":15}