{"text_format":"1","workbook":"xlsx","n_sheets":3,"sheets":["Planning des congés"," A VOIR","jours Féries 2016"],"not_rendered":{"charts":0,"images":0,"macros":1,"external_links":1,"defined_names":31,"comments":0,"pivot_tables":0},"unopened":[],"bounds":{"document_bytes":16777216,"sheet_cells":100000,"rows_first":2000,"rows_last":500,"rows_between":2000,"halvings":0,"cell_chars":16384,"cell_head_chars":4096},"cells_cut":0,"cells_raw":0,"read":"whole","date_system":"1900"}

{"sheet":"Planning des congés","index":0,"n_rows":30,"n_cols":73,"rows_kept":30,"cut":false,"hidden":true,"merged":[[4,0,4,31]]}
[2,null,null,null,null,null,null,null,null,null,null,null,null,null,null,null,null,null,null,null,null,null,null,null,null,null,null,null,null,null,null,null,null,null,null,null,null,null,null,null,null,null,null,null,null,null,null,null,null,null,null,null,null,null,null,null,null,null,null,null,null,null,null,null,null,null,null,null,null,null,null,null,"JANVIER"]
[2016,null,null,null,null,null,null,null,null,null,null,null,null,null,null,null,null,null,null,null,null,null,null,null,null,null,null,null,null,null,null,null,null,null,null,null,null,null,null,null,null,null,null,null,null,null,null,null,null,null,null,null,null,null,null,null,null,null,null,null,null,null,null,null,null,null,null,null,null,null,null,null,"FÉVRIER"]
[null,null,null,null,null,null,null,null,null,null,null,null,null,null,null,null,null,null,null,null,null,null,null,null,null,null,null,null,null,null,null,null,null,null,null,null,null,null,null,null,null,null,null,null,null,null,null,null,null,null,null,null,null,null,null,null,null,null,null,null,null,null,null,null,null,null,null,null,null,null,null,null,"MARS"]
[null,null,null,null,null,null,null,null,null,null,null,null,null,null,null,null,null,null,null,null,null,null,null,null,null,null,null,null,null,null,null,null,null,null,null,null,null,null,null,null,null,null,null,null,null,null,null,null,null,null,null,null,null,null,null,null,null,null,null,null,null,null,null,null,null,null,null,null,null,null,null,null,"AVRIL"]
[{"$f":"\"Periode de \"&TEXT(DATE($A$2,$A$1,1),\"jj mmmm aaaa\")&\" au \"&TEXT(DATE($A$2,$A$1+1,1)-1,\"jj mmmm aaaa\")","v":"Periode de 01 février 2016 au 29 février 2016"},null,null,null,null,null,null,null,null,null,null,null,null,null,null,null,null,null,null,null,null,null,null,null,null,null,null,null,null,null,null,null,null,null,null,null,null,null,null,null,null,null,null,null,null,null,null,null,null,null,null,null,null,null,null,null,null,null,null,null,null,null,null,null,null,null,null,null,null,null,null,null,"MAI"]
[null,null,null,null,null,null,null,null,null,null,null,null,null,null,null,null,null,null,null,null,null,null,null,null,null,null,null,null,null,null,null,null,null,null,null,null,null,null,null,null,null,null,null,null,null,null,null,null,null,null,null,null,null,null,null,null,null,null,null,null,null,null,null,null,null,null,null,null,null,null,null,null,"JUIN"]
[null,{"$f":"DATE($A$2,$A$1,1)","v":"2016-02-01"},{"$f":"B7+1","v":"2016-02-02"},{"$f":"C7+1","v":"2016-02-03"},"2016-02-04","2016-02-05","2016-02-06","2016-02-07","2016-02-08","2016-02-09","2016-02-10","2016-02-11","2016-02-12","2016-02-13","2016-02-14","2016-02-15","2016-02-16","2016-02-17","2016-02-18","2016-02-19","2016-02-20","2016-02-21","2016-02-22","2016-02-23","2016-02-24","2016-02-25","2016-02-26","2016-02-27","2016-02-28",{"$f":"AC7+1","v":"2016-02-29"},"2016-03-01","2016-03-02",null,null,null,null,null,null,null,null,null,null,null,null,null,null,null,null,null,null,null,null,null,null,null,null,null,null,null,null,null,null,null,null,null,null,null,null,null,null,null,null,"JUILLET"]
[null,null,null,null,null,null,null,null,null,null,null,null,null,null,null,null,null,null,null,null,null,null,null,null,null,null,null,null,null,null,null,null,null,null,null,null,null,null,null,null,null,null,null,null,null,null,null,null,null,null,null,null,null,null,null,null,null,null,null,null,null,null,null,null,null,null,null,null,null,null,null,null,"AOÛT"]
["EMPLOYE1",null,null,null,null,null,null,null,null,null,null,"c","c","c","c","c","c",null,null,null,null,null,null,null,null,null,null,null,null,null,null,null,{"$f":"SUM(COUNTIF(OFFSET($B9,23*(ROW($1:$13)-1),0,1,31),\"c\"))","v":6},null,null,null,null,null,null,null,null,null,null,null,null,null,null,null,null,null,null,null,null,null,null,null,null,null,null,null,null,null,null,null,null,null,null,null,null,null,null,null,"SEPTEMBRE"]
["EMPLOYE2",null,null,null,null,null,null,null,null,null,null,null,null,null,null,null,null,null,null,null,null,null,null,null,null,null,null,null,null,null,null,null,{"$f":"SUM(COUNTIF(OFFSET($B10,23*(ROW($1:$13)-1),0,1,31),\"c\"))","v":0},null,null,null,null,null,null,null,null,null,null,null,null,null,null,null,null,null,null,null,null,null,null,null,null,null,null,null,null,null,null,null,null,null,null,null,null,null,null,null,"OCTOBRE"]
["EMPLOYE3",null,null,null,null,null,null,null,null,null,null,null,null,null,null,null,null,null,null,null,null,null,null,null,null,null,null,null,null,null,null,null,0,null,null,null,null,null,null,null,null,null,null,null,null,null,null,null,null,null,null,null,null,null,null,null,null,null,null,null,null,null,null,null,null,null,null,null,null,null,null,null,"NOVEMBRE"]
["EMPLOYE4",null,null,null,null,null,null,null,null,null,null,null,null,null,null,null,null,null,null,null,null,null,null,null,null,null,null,null,null,null,null,null,0,null,null,null,null,null,null,null,null,null,null,null,null,null,null,null,null,null,null,null,null,null,null,null,null,null,null,null,null,null,null,null,null,null,null,null,null,null,null,null,"DÉCEMBRE"]
["EMPLOYE5",null,null,null,null,null,null,null,null,null,null,null,null,null,null,null,null,null,null,null,null,null,null,null,null,null,null,null,null,null,null,null,0]
["EMPLOYE6",null,null,null,null,null,null,null,null,null,null,null,null,null,null,null,null,null,null,null,null,null,null,null,null,null,null,null,null,null,null,null,0]
["EMPLOYE7",null,null,null,null,null,null,null,null,null,null,null,null,null,null,null,null,null,null,null,null,null,null,null,null,null,null,null,null,null,null,null,0]
["EMPLOYE8",null,null,null,null,null,null,null,null,null,null,null,null,null,null,null,null,null,null,null,null,null,null,null,null,null,null,null,null,null,null,null,0]
["EMPLOYE9",null,null,null,null,null,null,null,null,null,null,null,null,null,null,null,null,null,null,null,null,null,null,null,null,null,null,null,null,null,null,null,0]
["EMPLOYE10",null,null,null,null,null,null,null,null,null,null,null,null,null,null,null,null,null,null,null,null,null,null,null,null,null,null,null,null,null,null,null,0]
["EMPLOYE11",null,null,null,null,null,null,null,null,null,null,null,null,null,null,null,null,null,null,null,null,null,null,null,null,null,null,null,null,null,null,null,0]
["EMPLOYE12",null,null,null,null,null,null,null,null,null,null,null,null,null,null,null,null,null,null,null,null,null,null,null,null,null,null,null,null,null,null,null,0]
["EMPLOYE13",null,null,null,null,null,null,null,null,null,null,null,null,null,null,null,null,null,null,null,null,null,null,null,null,null,null,null,null,null,null,null,0]
["EMPLOYE14",null,null,null,null,null,null,null,null,null,null,null,null,null,null,null,null,null,null,null,null,null,null,null,null,null,null,null,null,null,null,null,0]
["EMPLOYE15",null,null,null,null,null,null,null,null,null,null,null,null,null,null,null,null,null,null,null,null,null,null,null,null,null,null,null,null,null,null,null,0]
["EMPLOYE16",null,null,null,null,null,null,null,null,null,null,null,null,null,null,null,null,null,null,null,null,null,null,null,null,null,null,null,null,null,null,null,0]
["EMPLOYE17",null,null,null,null,null,null,null,null,null,null,null,null,null,null,null,null,null,null,null,null,null,null,null,null,null,null,null,null,null,null,null,0]
["EMPLOYE18",null,null,null,null,null,null,null,null,null,null,null,null,null,null,null,null,null,null,null,null,null,null,null,null,null,null,null,null,null,null,null,0]
["EMPLOYE19",null,null,null,null,null,null,null,null,null,null,null,null,null,null,null,null,null,null,null,null,null,null,null,null,null,null,null,null,null,null,null,0]
["EMPLOYE20",null,null,null,null,null,null,null,null,null,null,null,null,null,null,null,null,null,null,null,null,null,null,null,null,null,null,null,null,null,null,null,0]
["EMPLOYE21",null,null,null,null,null,null,null,null,null,null,null,null,null,null,null,null,null,null,null,null,null,null,null,null,null,null,null,null,null,null,null,0]
["EMPLOYE22",null,null,null,null,null,null,null,null,null,null,null,null,null,null,null,null,null,null,null,null,null,null,null,null,null,null,null,null,null,null,null,0]

{"sheet":" A VOIR","index":1,"n_rows":28,"n_cols":388,"rows_kept":28,"cut":false,"hidden":false,"merged":[]}
[]
[null,"Periode de 01 janvier 2016 au 31 janvier 2016",null,null,null,null,null,null,null,null,null,null,null,null,null,null,null,null,null,null,null,null,null,null,null,null,null,null,null,null,null,null,null,null,null,null,"Periode de 01 février 2016 au 29 février 2016",null,null,null,null,null,null,null,null,null,null,null,null,null,null,null,null,null,null,null,null,null,null,null,null,null,null,null,null,null,null,null,null,"Periode de 01 mars 2016 au 31 mars 2016",null,null,null,null,null,null,null,null,null,null,null,null,null,null,null,null,null,null,null,null,null,null,null,null,null,null,null,null,null,null,null,null,null,null,"Periode de 01 avril 2016 au 30 avril 2016",null,null,null,null,null,null,null,null,null,null,null,null,null,null,null,null,null,null,null,null,null,null,null,null,null,null,null,null,null,null,null,null,null,"Periode de 01 mai 2016 au 31 mai 2016",null,null,null,null,null,null,null,null,null,null,null,null,null,null,null,null,null,null,null,null,null,null,null,null,null,null,null,null,null,null,null,null,null,null," "]
[]
[null,null,null,"Jours Ouvrés","Jours Ouvrés","2016-01-01","2016-01-02","2016-01-03","2016-01-04","2016-01-05","2016-01-06","2016-01-07","2016-01-08","2016-01-09","2016-01-10","2016-01-11","2016-01-12","2016-01-13","2016-01-14","2016-01-15","2016-01-16","2016-01-17","2016-01-18","2016-01-19","2016-01-20","2016-01-21","2016-01-22","2016-01-23","2016-01-24","2016-01-25","2016-01-26","2016-01-27","2016-01-28","2016-01-29","2016-01-30","2016-01-31",null,null,"Jours Ouvrés","Jours Ouvrés","2016-02-01","2016-02-02","2016-02-03","2016-02-04","2016-02-05","2016-02-06","2016-02-07","2016-02-08","2016-02-09","2016-02-10","2016-02-11","2016-02-12","2016-02-13","2016-02-14","2016-02-15","2016-02-16","2016-02-17","2016-02-18","2016-02-19","2016-02-20","2016-02-21","2016-02-22","2016-02-23","2016-02-24","2016-02-25","2016-02-26","2016-02-27","2016-02-28","2016-02-29",null,null,"Jours Ouvrés","Jours Ouvrés","2016-03-01","2016-03-02","2016-03-03","2016-03-04","2016-03-05","2016-03-06","2016-03-07","2016-03-08","2016-03-09","2016-03-10","2016-03-11","2016-03-12","2016-03-13","2016-03-14","2016-03-15","2016-03-16","2016-03-17","2016-03-18","2016-03-19","2016-03-20","2016-03-21","2016-03-22","2016-03-23","2016-03-24","2016-03-25","2016-03-26","2016-03-27","2016-03-28","2016-03-29","2016-03-30","2016-03-31",null,null,"Jours Ouvrés","Jours Ouvrés","2016-04-01","2016-04-02","2016-04-03","2016-04-04","2016-04-05","2016-04-06","2016-04-07","2016-04-08","2016-04-09","2016-04-10","2016-04-11","2016-04-12","2016-04-13","2016-04-14","2016-04-15","2016-04-16","2016-04-17","2016-04-18","2016-04-19","2016-04-20","2016-04-21","2016-04-22","2016-04-23","2016-04-24","2016-04-25","2016-04-26","2016-04-27","2016-04-28","2016-04-29","2016-04-30",null,null,"Jours Ouvrés","Jours Ouvrés","2016-05-01","2016-05-02","2016-05-03","2016-05-04","2016-05-05","2016-05-06","2016-05-07","2016-05-08","2016-05-09","2016-05-10","2016-05-11","2016-05-12","2016-05-13","2016-05-14","2016-05-15","2016-05-16","2016-05-17","2016-05-18","2016-05-19","2016-05-20","2016-05-21","2016-05-22","2016-05-23","2016-05-24","2016-05-25","2016-05-26","2016-05-27","2016-05-28","2016-05-29","2016-05-30","2016-05-31",null,"2016-06-01","2016-06-02","2016-06-03","2016-06-04","2016-06-05","2016-06-06","2016-06-07","2016-06-08","2016-06-09","2016-06-10","2016-06-11","2016-06-12","2016-06-13","2016-06-14","2016-06-15","2016-06-16","2016-06-17","2016-06-18","2016-06-19","2016-06-20","2016-06-21","2016-06-22","2016-06-23","2016-06-24","2016-06-25","2016-06-26","2016-06-27","2016-06-28","2016-06-29","2016-06-30","2016-07-01","2016-07-02","2016-07-03","2016-07-04","2016-07-05","2016-07-06","2016-07-07","2016-07-08","2016-07-09","2016-07-10","2016-07-11","2016-07-12","2016-07-13","2016-07-14","2016-07-15","2016-07-16","2016-07-17","2016-07-18","2016-07-19","2016-07-20","2016-07-21","2016-07-22","2016-07-23","2016-07-24","2016-07-25","2016-07-26","2016-07-27","2016-07-28","2016-07-29","2016-07-30","2016-07-31","2016-08-01","2016-08-02","2016-08-03","2016-08-04","2016-08-05","2016-08-06","2016-08-07","2016-08-08","2016-08-09","2016-08-10","2016-08-11","2016-08-12","2016-08-13","2016-08-14","2016-08-15","2016-08-16","2016-08-17","2016-08-18","2016-08-19","2016-08-20","2016-08-21","2016-08-22","2016-08-23","2016-08-24","2016-08-25","2016-08-26","2016-08-27","2016-08-28","2016-08-29","2016-08-30","2016-08-31","2016-09-01","2016-09-02","2016-09-03","2016-09-04","2016-09-05","2016-09-06","2016-09-07","2016-09-08","2016-09-09","2016-09-10","2016-09-11","2016-09-12","2016-09-13","2016-09-14","2016-09-15","2016-09-16","2016-09-17","2016-09-18","2016-09-19","2016-09-20","2016-09-21","2016-09-22","2016-09-23","2016-09-24","2016-09-25","2016-09-26","2016-09-27","2016-09-28","2016-09-29","2016-09-30","2016-10-01","2016-10-02","2016-10-03","2016-10-04","2016-10-05","2016-10-06","2016-10-07","2016-10-08","2016-10-09","2016-10-10","2016-10-11","2016-10-12","2016-10-13","2016-10-14","2016-10-15","2016-10-16","2016-10-17","2016-10-18","2016-10-19","2016-10-20","2016-10-21","2016-10-22","2016-10-23","2016-10-24","2016-10-25","2016-10-26","2016-10-27","2016-10-28","2016-10-29","2016-10-30","2016-10-31","2016-11-01","2016-11-02","2016-11-03","2016-11-04","2016-11-05","2016-11-06","2016-11-07","2016-11-08","2016-11-09","2016-11-10","2016-11-11","2016-11-12","2016-11-13","2016-11-14","2016-11-15","2016-11-16","2016-11-17","2016-11-18","2016-11-19","2016-11-20","2016-11-21","2016-11-22","2016-11-23","2016-11-24","2016-11-25","2016-11-26","2016-11-27","2016-11-28","2016-11-29","2016-11-30","2016-12-01","2016-12-02","2016-12-03","2016-12-04","2016-12-05","2016-12-06","2016-12-07","2016-12-08","2016-12-09","2016-12-10","2016-12-11","2016-12-12","2016-12-13","2016-12-14","2016-12-15","2016-12-16","2016-12-17","2016-12-18","2016-12-19","2016-12-20","2016-12-21","2016-12-22","2016-12-23","2016-12-24","2016-12-25","2016-12-26","2016-12-27","2016-12-28","2016-12-29","2016-12-30","2016-12-31"]
["Noms de l'employé","Début ","Fin","sans les samedis et sans jours fériés ","avec les Samedis sans jours fériés",{"$f":"F4","v":"2016-01-01"},{"$f":"G4","v":"2016-01-02"},"2016-01-03","2016-01-04","2016-01-05","2016-01-06","2016-01-07","2016-01-08","2016-01-09","2016-01-10","2016-01-11","2016-01-12","2016-01-13","2016-01-14","2016-01-15","2016-01-16","2016-01-17","2016-01-18","2016-01-19","2016-01-20","2016-01-21","2016-01-22","2016-01-23","2016-01-24","2016-01-25","2016-01-26","2016-01-27","2016-01-28","2016-01-29","2016-01-30","2016-01-31","Début ","Fin","sans les samedis et sans jours fériés ","avec les Samedis sans jours fériés","2016-02-01","2016-02-02","2016-02-03","2016-02-04","2016-02-05","2016-02-06","2016-02-07","2016-02-08","2016-02-09","2016-02-10","2016-02-11","2016-02-12","2016-02-13","2016-02-14","2016-02-15","2016-02-16","2016-02-17","2016-02-18","2016-02-19","2016-02-20","2016-02-21","2016-02-22","2016-02-23","2016-02-24","2016-02-25","2016-02-26","2016-02-27","2016-02-28","2016-02-29","Début ","Fin","sans les samedis et sans jours fériés ","avec les Samedis sans jours fériés","2016-03-01","2016-03-02","2016-03-03","2016-03-04","2016-03-05",{"$f":"CA4","v":"2016-03-06"},"2016-03-07","2016-03-08","2016-03-09","2016-03-10","2016-03-11","2016-03-12","2016-03-13","2016-03-14","2016-03-15","2016-03-16","2016-03-17","2016-03-18","2016-03-19","2016-03-20","2016-03-21","2016-03-22","2016-03-23","2016-03-24","2016-03-25","2016-03-26","2016-03-27","2016-03-28","2016-03-29","2016-03-30","2016-03-31","Début ","Fin","sans les samedis et sans jours fériés ","avec les Samedis sans jours fériés","2016-04-01","2016-04-02","2016-04-03","2016-04-04","2016-04-05","2016-04-06","2016-04-07","2016-04-08","2016-04-09","2016-04-10","2016-04-11","2016-04-12","2016-04-13","2016-04-14","2016-04-15","2016-04-16","2016-04-17","2016-04-18","2016-04-19","2016-04-20","2016-04-21","2016-04-22","2016-04-23","2016-04-24","2016-04-25","2016-04-26","2016-04-27","2016-04-28","2016-04-29","2016-04-30","Début ","Fin","sans les samedis et sans jours fériés ","avec les Samedis sans jours fériés","2016-05-01","2016-05-02","2016-05-03","2016-05-04","2016-05-05","2016-05-06",{"$f":"ES4","v":"2016-05-07"},{"$f":"ET4","v":"2016-05-08"},{"$f":"EU4","v":"2016-05-09"},{"$f":"EV4","v":"2016-05-10"},{"$f":"EW4","v":"2016-05-11"},{"$f":"EX4","v":"2016-05-12"},{"$f":"EY4","v":"2016-05-13"},{"$f":"EZ4","v":"2016-05-14"},{"$f":"FA4","v":"2016-05-15"},{"$f":"FB4","v":"2016-05-16"},{"$f":"FC4","v":"2016-05-17"},{"$f":"FD4","v":"2016-05-18"},{"$f":"FE4","v":"2016-05-19"},{"$f":"FF4","v":"2016-05-20"},{"$f":"FG4","v":"2016-05-21"},{"$f":"FH4","v":"2016-05-22"},{"$f":"FI4","v":"2016-05-23"},{"$f":"FJ4","v":"2016-05-24"},{"$f":"FK4","v":"2016-05-25"},{"$f":"FL4","v":"2016-05-26"},{"$f":"FM4","v":"2016-05-27"},{"$f":"FN4","v":"2016-05-28"},{"$f":"FO4","v":"2016-05-29"},{"$f":"FP4","v":"2016-05-30"},{"$f":"FQ4","v":"2016-05-31"},null,{"$f":"FS4","v":"2016-06-01"},{"$f":"FT4","v":"2016-06-02"},{"$f":"FU4","v":"2016-06-03"},{"$f":"FV4","v":"2016-06-04"},{"$f":"FW4","v":"2016-06-05"},{"$f":"FX4","v":"2016-06-06"},{"$f":"FY4","v":"2016-06-07"},{"$f":"FZ4","v":"2016-06-08"},{"$f":"GA4","v":"2016-06-09"},{"$f":"GB4","v":"2016-06-10"},{"$f":"GC4","v":"2016-06-11"},{"$f":"GD4","v":"2016-06-12"},{"$f":"GE4","v":"2016-06-13"},{"$f":"GF4","v":"2016-06-14"},{"$f":"GG4","v":"2016-06-15"},{"$f":"GH4","v":"2016-06-16"},{"$f":"GI4","v":"2016-06-17"},{"$f":"GJ4","v":"2016-06-18"},{"$f":"GK4","v":"2016-06-19"},{"$f":"GL4","v":"2016-06-20"},{"$f":"GM4","v":"2016-06-21"},{"$f":"GN4","v":"2016-06-22"},{"$f":"GO4","v":"2016-06-23"},{"$f":"GP4","v":"2016-06-24"},{"$f":"GQ4","v":"2016-06-25"},{"$f":"GR4","v":"2016-06-26"},{"$f":"GS4","v":"2016-06-27"},{"$f":"GT4","v":"2016-06-28"},{"$f":"GU4","v":"2016-06-29"},{"$f":"GV4","v":"2016-06-30"},{"$f":"GW4","v":"2016-07-01"},{"$f":"GX4","v":"2016-07-02"},{"$f":"GY4","v":"2016-07-03"},{"$f":"GZ4","v":"2016-07-04"},{"$f":"HA4","v":"2016-07-05"},{"$f":"HB4","v":"2016-07-06"},{"$f":"HC4","v":"2016-07-07"},{"$f":"HD4","v":"2016-07-08"},{"$f":"HE4","v":"2016-07-09"},{"$f":"HF4","v":"2016-07-10"},{"$f":"HG4","v":"2016-07-11"},{"$f":"HH4","v":"2016-07-12"},{"$f":"HI4","v":"2016-07-13"},{"$f":"HJ4","v":"2016-07-14"},{"$f":"HK4","v":"2016-07-15"},{"$f":"HL4","v":"2016-07-16"},{"$f":"HM4","v":"2016-07-17"},{"$f":"HN4","v":"2016-07-18"},{"$f":"HO4","v":"2016-07-19"},{"$f":"HP4","v":"2016-07-20"},{"$f":"HQ4","v":"2016-07-21"},{"$f":"HR4","v":"2016-07-22"},{"$f":"HS4","v":"2016-07-23"},{"$f":"HT4","v":"2016-07-24"},{"$f":"HU4","v":"2016-07-25"},{"$f":"HV4","v":"2016-07-26"},{"$f":"HW4","v":"2016-07-27"},{"$f":"HX4","v":"2016-07-28"},{"$f":"HY4","v":"2016-07-29"},{"$f":"HZ4","v":"2016-07-30"},{"$f":"IA4","v":"2016-07-31"},{"$f":"IB4","v":"2016-08-01"},{"$f":"IC4","v":"2016-08-02"},{"$f":"ID4","v":"2016-08-03"},{"$f":"IE4","v":"2016-08-04"},{"$f":"IF4","v":"2016-08-05"},{"$f":"IG4","v":"2016-08-06"},{"$f":"IH4","v":"2016-08-07"},{"$f":"II4","v":"2016-08-08"},{"$f":"IJ4","v":"2016-08-09"},{"$f":"IK4","v":"2016-08-10"},{"$f":"IL4","v":"2016-08-11"},{"$f":"IM4","v":"2016-08-12"},{"$f":"IN4","v":"2016-08-13"},{"$f":"IO4","v":"2016-08-14"},{"$f":"IP4","v":"2016-08-15"},{"$f":"IQ4","v":"2016-08-16"},{"$f":"IR4","v":"2016-08-17"},{"$f":"IS4","v":"2016-08-18"},{"$f":"IT4","v":"2016-08-19"},{"$f":"IU4","v":"2016-08-20"},{"$f":"IV4","v":"2016-08-21"},{"$f":"IW4","v":"2016-08-22"},{"$f":"IX4","v":"2016-08-23"},{"$f":"IY4","v":"2016-08-24"},{"$f":"IZ4","v":"2016-08-25"},{"$f":"JA4","v":"2016-08-26"},{"$f":"JB4","v":"2016-08-27"},{"$f":"JC4","v":"2016-08-28"},{"$f":"JD4","v":"2016-08-29"},{"$f":"JE4","v":"2016-08-30"},{"$f":"JF4","v":"2016-08-31"},{"$f":"JG4","v":"2016-09-01"},{"$f":"JH4","v":"2016-09-02"},{"$f":"JI4","v":"2016-09-03"},{"$f":"JJ4","v":"2016-09-04"},{"$f":"JK4","v":"2016-09-05"},{"$f":"JL4","v":"2016-09-06"},{"$f":"JM4","v":"2016-09-07"},{"$f":"JN4","v":"2016-09-08"},{"$f":"JO4","v":"2016-09-09"},{"$f":"JP4","v":"2016-09-10"},{"$f":"JQ4","v":"2016-09-11"},{"$f":"JR4","v":"2016-09-12"},{"$f":"JS4","v":"2016-09-13"},{"$f":"JT4","v":"2016-09-14"},{"$f":"JU4","v":"2016-09-15"},{"$f":"JV4","v":"2016-09-16"},{"$f":"JW4","v":"2016-09-17"},{"$f":"JX4","v":"2016-09-18"},{"$f":"JY4","v":"2016-09-19"},{"$f":"JZ4","v":"2016-09-20"},{"$f":"KA4","v":"2016-09-21"},{"$f":"KB4","v":"2016-09-22"},{"$f":"KC4","v":"2016-09-23"},{"$f":"KD4","v":"2016-09-24"},{"$f":"KE4","v":"2016-09-25"},{"$f":"KF4","v":"2016-09-26"},{"$f":"KG4","v":"2016-09-27"},{"$f":"KH4","v":"2016-09-28"},{"$f":"KI4","v":"2016-09-29"},{"$f":"KJ4","v":"2016-09-30"},{"$f":"KK4","v":"2016-10-01"},{"$f":"KL4","v":"2016-10-02"},{"$f":"KM4","v":"2016-10-03"},{"$f":"KN4","v":"2016-10-04"},{"$f":"KO4","v":"2016-10-05"},{"$f":"KP4","v":"2016-10-06"},{"$f":"KQ4","v":"2016-10-07"},{"$f":"KR4","v":"2016-10-08"},{"$f":"KS4","v":"2016-10-09"},{"$f":"KT4","v":"2016-10-10"},{"$f":"KU4","v":"2016-10-11"},{"$f":"KV4","v":"2016-10-12"},{"$f":"KW4","v":"2016-10-13"},{"$f":"KX4","v":"2016-10-14"},{"$f":"KY4","v":"2016-10-15"},{"$f":"KZ4","v":"2016-10-16"},{"$f":"LA4","v":"2016-10-17"},{"$f":"LB4","v":"2016-10-18"},{"$f":"LC4","v":"2016-10-19"},{"$f":"LD4","v":"2016-10-20"},{"$f":"LE4","v":"2016-10-21"},{"$f":"LF4","v":"2016-10-22"},{"$f":"LG4","v":"2016-10-23"},{"$f":"LH4","v":"2016-10-24"},{"$f":"LI4","v":"2016-10-25"},{"$f":"LJ4","v":"2016-10-26"},{"$f":"LK4","v":"2016-10-27"},{"$f":"LL4","v":"2016-10-28"},{"$f":"LM4","v":"2016-10-29"},{"$f":"LN4","v":"2016-10-30"},{"$f":"LO4","v":"2016-10-31"},{"$f":"LP4","v":"2016-11-01"},{"$f":"LQ4","v":"2016-11-02"},{"$f":"LR4","v":"2016-11-03"},{"$f":"LS4","v":"2016-11-04"},{"$f":"LT4","v":"2016-11-05"},{"$f":"LU4","v":"2016-11-06"},{"$f":"LV4","v":"2016-11-07"},{"$f":"LW4","v":"2016-11-08"},{"$f":"LX4","v":"2016-11-09"},{"$f":"LY4","v":"2016-11-10"},{"$f":"LZ4","v":"2016-11-11"},{"$f":"MA4","v":"2016-11-12"},{"$f":"MB4","v":"2016-11-13"},{"$f":"MC4","v":"2016-11-14"},{"$f":"MD4","v":"2016-11-15"},{"$f":"ME4","v":"2016-11-16"},{"$f":"MF4","v":"2016-11-17"},{"$f":"MG4","v":"2016-11-18"},{"$f":"MH4","v":"2016-11-19"},{"$f":"MI4","v":"2016-11-20"},{"$f":"MJ4","v":"2016-11-21"},{"$f":"MK4","v":"2016-11-22"},{"$f":"ML4","v":"2016-11-23"},{"$f":"MM4","v":"2016-11-24"},{"$f":"MN4","v":"2016-11-25"},{"$f":"MO4","v":"2016-11-26"},{"$f":"MP4","v":"2016-11-27"},{"$f":"MQ4","v":"2016-11-28"},{"$f":"MR4","v":"2016-11-29"},{"$f":"MS4","v":"2016-11-30"},{"$f":"MT4","v":"2016-12-01"},{"$f":"MU4","v":"2016-12-02"},{"$f":"MV4","v":"2016-12-03"},{"$f":"MW4","v":"2016-12-04"},{"$f":"MX4","v":"2016-12-05"},{"$f":"MY4","v":"2016-12-06"},{"$f":"MZ4","v":"2016-12-07"},{"$f":"NA4","v":"2016-12-08"},{"$f":"NB4","v":"2016-12-09"},{"$f":"NC4","v":"2016-12-10"},{"$f":"ND4","v":"2016-12-11"},{"$f":"NE4","v":"2016-12-12"},{"$f":"NF4","v":"2016-12-13"},{"$f":"NG4","v":"2016-12-14"},{"$f":"NH4","v":"2016-12-15"},{"$f":"NI4","v":"2016-12-16"},{"$f":"NJ4","v":"2016-12-17"},{"$f":"NK4","v":"2016-12-18"},{"$f":"NL4","v":"2016-12-19"},{"$f":"NM4","v":"2016-12-20"},{"$f":"NN4","v":"2016-12-21"},{"$f":"NO4","v":"2016-12-22"},{"$f":"NP4","v":"2016-12-23"},{"$f":"NQ4","v":"2016-12-24"},{"$f":"NR4","v":"2016-12-25"},{"$f":"NS4","v":"2016-12-26"},{"$f":"NT4","v":"2016-12-27"},{"$f":"NU4","v":"2016-12-28"},{"$f":"NV4","v":"2016-12-29"},{"$f":"NW4","v":"2016-12-30"},{"$f":"NX4","v":"2016-12-31"}]
[null,null,null,null,null,"F",{"$f":"IF(WEEKDAY(5:5,2)>5,\"f\",\"\")","v":"f"},{"$f":"IF(WEEKDAY(5:5,2)>5,\"f\",\"\")","v":"f"},{"$f":"IF(WEEKDAY(5:5,2)>5,\"f\",\"\")","v":""},{"$f":"IF(WEEKDAY(5:5,2)>5,\"f\",\"\")","v":""},{"$f":"IF(WEEKDAY(5:5,2)>5,\"f\",\"\")","v":""},{"$f":"IF(WEEKDAY(5:5,2)>5,\"f\",\"\")","v":""},{"$f":"IF(WEEKDAY(5:5,2)>5,\"f\",\"\")","v":""},{"$f":"IF(WEEKDAY(5:5,2)>5,\"f\",\"\")","v":"f"},{"$f":"IF(WEEKDAY(5:5,2)>5,\"f\",\"\")","v":"f"},{"$f":"IF(WEEKDAY(5:5,2)>5,\"f\",\"\")","v":""},{"$f":"IF(WEEKDAY(5:5,2)>5,\"f\",\"\")","v":""},{"$f":"IF(WEEKDAY(5:5,2)>5,\"f\",\"\")","v":""},{"$f":"IF(WEEKDAY(5:5,2)>5,\"f\",\"\")","v":""},{"$f":"IF(WEEKDAY(5:5,2)>5,\"f\",\"\")","v":""},{"$f":"IF(WEEKDAY(5:5,2)>5,\"f\",\"\")","v":"f"},{"$f":"IF(WEEKDAY(5:5,2)>5,\"f\",\"\")","v":"f"},{"$f":"IF(WEEKDAY(5:5,2)>5,\"f\",\"\")","v":""},{"$f":"IF(WEEKDAY(5:5,2)>5,\"f\",\"\")","v":""},{"$f":"IF(WEEKDAY(5:5,2)>5,\"f\",\"\")","v":""},{"$f":"IF(WEEKDAY(5:5,2)>5,\"f\",\"\")","v":""},{"$f":"IF(WEEKDAY(5:5,2)>5,\"f\",\"\")","v":""},{"$f":"IF(WEEKDAY(5:5,2)>5,\"f\",\"\")","v":"f"},{"$f":"IF(WEEKDAY(5:5,2)>5,\"f\",\"\")","v":"f"},{"$f":"IF(WEEKDAY(5:5,2)>5,\"f\",\"\")","v":""},{"$f":"IF(WEEKDAY(5:5,2)>5,\"f\",\"\")","v":""},{"$f":"IF(WEEKDAY(5:5,2)>5,\"f\",\"\")","v":""},{"$f":"IF(WEEKDAY(5:5,2)>5,\"f\",\"\")","v":""},{"$f":"IF(WEEKDAY(5:5,2)>5,\"f\",\"\")","v":""},{"$f":"IF(WEEKDAY(5:5,2)>5,\"f\",\"\")","v":"f"},{"$f":"IF(WEEKDAY(5:5,2)>5,\"f\",\"\")","v":"f"},null,null,null,null,"F",{"$f":"IF(WEEKDAY(5:5,2)>5,\"f\",\"\")","v":""},{"$f":"IF(WEEKDAY(5:5,2)>5,\"f\",\"\")","v":""},{"$f":"IF(WEEKDAY(5:5,2)>5,\"f\",\"\")","v":""},{"$f":"IF(WEEKDAY(5:5,2)>5,\"f\",\"\")","v":""},{"$f":"IF(WEEKDAY(5:5,2)>5,\"f\",\"\")","v":"f"},{"$f":"IF(WEEKDAY(5:5,2)>5,\"f\",\"\")","v":"f"},{"$f":"IF(WEEKDAY(5:5,2)>5,\"f\",\"\")","v":""},{"$f":"IF(WEEKDAY(5:5,2)>5,\"f\",\"\")","v":""},{"$f":"IF(WEEKDAY(5:5,2)>5,\"f\",\"\")","v":""},{"$f":"IF(WEEKDAY(5:5,2)>5,\"f\",\"\")","v":""},{"$f":"IF(WEEKDAY(5:5,2)>5,\"f\",\"\")","v":""},{"$f":"IF(WEEKDAY(5:5,2)>5,\"f\",\"\")","v":"f"},{"$f":"IF(WEEKDAY(5:5,2)>5,\"f\",\"\")","v":"f"},{"$f":"IF(WEEKDAY(5:5,2)>5,\"f\",\"\")","v":""},{"$f":"IF(WEEKDAY(5:5,2)>5,\"f\",\"\")","v":""},{"$f":"IF(WEEKDAY(5:5,2)>5,\"f\",\"\")","v":""},{"$f":"IF(WEEKDAY(5:5,2)>5,\"f\",\"\")","v":""},{"$f":"IF(WEEKDAY(5:5,2)>5,\"f\",\"\")","v":""},{"$f":"IF(WEEKDAY(5:5,2)>5,\"f\",\"\")","v":"f"},{"$f":"IF(WEEKDAY(5:5,2)>5,\"f\",\"\")","v":"f"},{"$f":"IF(WEEKDAY(5:5,2)>5,\"f\",\"\")","v":""},{"$f":"IF(WEEKDAY(5:5,2)>5,\"f\",\"\")","v":""},{"$f":"IF(WEEKDAY(5:5,2)>5,\"f\",\"\")","v":""},{"$f":"IF(WEEKDAY(5:5,2)>5,\"f\",\"\")","v":""},{"$f":"IF(WEEKDAY(5:5,2)>5,\"f\",\"\")","v":""},{"$f":"IF(WEEKDAY(5:5,2)>5,\"f\",\"\")","v":"f"},{"$f":"IF(WEEKDAY(5:5,2)>5,\"f\",\"\")","v":"f"},{"$f":"IF(WEEKDAY(5:5,2)>5,\"f\",\"\")","v":""},null,null,null,null,{"$f":"IF(WEEKDAY(5:5,2)>5,\"f\",\"\")","v":""},{"$f":"IF(WEEKDAY(5:5,2)>5,\"f\",\"\")","v":""},{"$f":"IF(WEEKDAY(5:5,2)>5,\"f\",\"\")","v":""},{"$f":"IF(WEEKDAY(5:5,2)>5,\"f\",\"\")","v":""},{"$f":"IF(WEEKDAY(5:5,2)>5,\"f\",\"\")","v":"f"},{"$f":"IF(WEEKDAY(5:5,2)>5,\"f\",\"\")","v":"f"},{"$f":"IF(WEEKDAY(5:5,2)>5,\"f\",\"\")","v":""},{"$f":"IF(WEEKDAY(5:5,2)>5,\"f\",\"\")","v":""},{"$f":"IF(WEEKDAY(5:5,2)>5,\"f\",\"\")","v":""},{"$f":"IF(WEEKDAY(5:5,2)>5,\"f\",\"\")","v":""},{"$f":"IF(WEEKDAY(5:5,2)>5,\"f\",\"\")","v":""},{"$f":"IF(WEEKDAY(5:5,2)>5,\"f\",\"\")","v":"f"},{"$f":"IF(WEEKDAY(5:5,2)>5,\"f\",\"\")","v":"f"},{"$f":"IF(WEEKDAY(5:5,2)>5,\"f\",\"\")","v":""},{"$f":"IF(WEEKDAY(5:5,2)>5,\"f\",\"\")","v":""},{"$f":"IF(WEEKDAY(5:5,2)>5,\"f\",\"\")","v":""},{"$f":"IF(WEEKDAY(5:5,2)>5,\"f\",\"\")","v":""},{"$f":"IF(WEEKDAY(5:5,2)>5,\"f\",\"\")","v":""},{"$f":"IF(WEEKDAY(5:5,2)>5,\"f\",\"\")","v":"f"},{"$f":"IF(WEEKDAY(5:5,2)>5,\"f\",\"\")","v":"f"},{"$f":"IF(WEEKDAY(5:5,2)>5,\"f\",\"\")","v":""},{"$f":"IF(WEEKDAY(5:5,2)>5,\"f\",\"\")","v":""},{"$f":"IF(WEEKDAY(5:5,2)>5,\"f\",\"\")","v":""},{"$f":"IF(WEEKDAY(5:5,2)>5,\"f\",\"\")","v":""},{"$f":"IF(WEEKDAY(5:5,2)>5,\"f\",\"\")","v":""},{"$f":"IF(WEEKDAY(5:5,2)>5,\"f\",\"\")","v":"f"},{"$f":"IF(WEEKDAY(5:5,2)>5,\"f\",\"\")","v":"f"},{"$f":"IF(WEEKDAY(5:5,2)>5,\"f\",\"\")","v":""},{"$f":"IF(WEEKDAY(5:5,2)>5,\"f\",\"\")","v":""},{"$f":"IF(WEEKDAY(5:5,2)>5,\"f\",\"\")","v":""},{"$f":"IF(WEEKDAY(5:5,2)>5,\"f\",\"\")","v":""},null,null,null,null,{"$f":"IF(WEEKDAY(5:5,2)>5,\"f\",\"\")","v":""},{"$f":"IF(WEEKDAY(5:5,2)>5,\"f\",\"\")","v":"f"},{"$f":"IF(WEEKDAY(5:5,2)>5,\"f\",\"\")","v":"f"},{"$f":"IF(WEEKDAY(5:5,2)>5,\"f\",\"\")","v":""},{"$f":"IF(WEEKDAY(5:5,2)>5,\"f\",\"\")","v":""},{"$f":"IF(WEEKDAY(5:5,2)>5,\"f\",\"\")","v":""},{"$f":"IF(WEEKDAY(5:5,2)>5,\"f\",\"\")","v":""},{"$f":"IF(WEEKDAY(5:5,2)>5,\"f\",\"\")","v":""},{"$f":"IF(WEEKDAY(5:5,2)>5,\"f\",\"\")","v":"f"},{"$f":"IF(WEEKDAY(5:5,2)>5,\"f\",\"\")","v":"f"},{"$f":"IF(WEEKDAY(5:5,2)>5,\"f\",\"\")","v":""},{"$f":"IF(WEEKDAY(5:5,2)>5,\"f\",\"\")","v":""},{"$f":"IF(WEEKDAY(5:5,2)>5,\"f\",\"\")","v":""},{"$f":"IF(WEEKDAY(5:5,2)>5,\"f\",\"\")","v":""},{"$f":"IF(WEEKDAY(5:5,2)>5,\"f\",\"\")","v":""},{"$f":"IF(WEEKDAY(5:5,2)>5,\"f\",\"\")","v":"f"},{"$f":"IF(WEEKDAY(5:5,2)>5,\"f\",\"\")","v":"f"},{"$f":"IF(WEEKDAY(5:5,2)>5,\"f\",\"\")","v":""},{"$f":"IF(WEEKDAY(5:5,2)>5,\"f\",\"\")","v":""},{"$f":"IF(WEEKDAY(5:5,2)>5,\"f\",\"\")","v":""},{"$f":"IF(WEEKDAY(5:5,2)>5,\"f\",\"\")","v":""},{"$f":"IF(WEEKDAY(5:5,2)>5,\"f\",\"\")","v":""},{"$f":"IF(WEEKDAY(5:5,2)>5,\"f\",\"\")","v":"f"},{"$f":"IF(WEEKDAY(5:5,2)>5,\"f\",\"\")","v":"f"},{"$f":"IF(WEEKDAY(5:5,2)>5,\"f\",\"\")","v":""},{"$f":"IF(WEEKDAY(5:5,2)>5,\"f\",\"\")","v":""},{"$f":"IF(WEEKDAY(5:5,2)>5,\"f\",\"\")","v":""},{"$f":"IF(WEEKDAY(5:5,2)>5,\"f\",\"\")","v":""},{"$f":"IF(WEEKDAY(5:5,2)>5,\"f\",\"\")","v":""},{"$f":"IF(WEEKDAY(5:5,2)>5,\"f\",\"\")","v":"f"},null,null,null,null,{"$f":"IF(WEEKDAY(5:5,2)>5,\"f\",\"\")","v":"f"},{"$f":"IF(WEEKDAY(5:5,2)>5,\"f\",\"\")","v":""},{"$f":"IF(WEEKDAY(5:5,2)>5,\"f\",\"\")","v":""},{"$f":"IF(WEEKDAY(5:5,2)>5,\"f\",\"\")","v":""},{"$f":"IF(WEEKDAY(5:5,2)>5,\"f\",\"\")","v":""},{"$f":"IF(WEEKDAY(5:5,2)>5,\"f\",\"\")","v":""},{"$f":"IF(WEEKDAY(5:5,2)>5,\"f\",\"\")","v":"f"},{"$f":"IF(WEEKDAY(5:5,2)>5,\"f\",\"\")","v":"f"},{"$f":"IF(WEEKDAY(5:5,2)>5,\"f\",\"\")","v":""},{"$f":"IF(WEEKDAY(5:5,2)>5,\"f\",\"\")","v":""},{"$f":"IF(WEEKDAY(5:5,2)>5,\"f\",\"\")","v":""},{"$f":"IF(WEEKDAY(5:5,2)>5,\"f\",\"\")","v":""},{"$f":"IF(WEEKDAY(5:5,2)>5,\"f\",\"\")","v":""},{"$f":"IF(WEEKDAY(5:5,2)>5,\"f\",\"\")","v":"f"},{"$f":"IF(WEEKDAY(5:5,2)>5,\"f\",\"\")","v":"f"},{"$f":"IF(WEEKDAY(5:5,2)>5,\"f\",\"\")","v":""},{"$f":"IF(WEEKDAY(5:5,2)>5,\"f\",\"\")","v":""},{"$f":"IF(WEEKDAY(5:5,2)>5,\"f\",\"\")","v":""},{"$f":"IF(WEEKDAY(5:5,2)>5,\"f\",\"\")","v":""},{"$f":"IF(WEEKDAY(5:5,2)>5,\"f\",\"\")","v":""},{"$f":"IF(WEEKDAY(5:5,2)>5,\"f\",\"\")","v":"f"},{"$f":"IF(WEEKDAY(5:5,2)>5,\"f\",\"\")","v":"f"},{"$f":"IF(WEEKDAY(5:5,2)>5,\"f\",\"\")","v":""},{"$f":"IF(WEEKDAY(5:5,2)>5,\"f\",\"\")","v":""},{"$f":"IF(WEEKDAY(5:5,2)>5,\"f\",\"\")","v":""},{"$f":"IF(WEEKDAY(5:5,2)>5,\"f\",\"\")","v":""},{"$f":"IF(WEEKDAY(5:5,2)>5,\"f\",\"\")","v":""},{"$f":"IF(WEEKDAY(5:5,2)>5,\"f\",\"\")","v":"f"},{"$f":"IF(WEEKDAY(5:5,2)>5,\"f\",\"\")","v":"f"},{"$f":"IF(WEEKDAY(5:5,2)>5,\"f\",\"\")","v":""},{"$f":"IF(WEEKDAY(5:5,2)>5,\"f\",\"\")","v":""},null,{"$f":"IF(WEEKDAY(5:5,2)>5,\"f\",\"\")","v":""},{"$f":"IF(WEEKDAY(5:5,2)>5,\"f\",\"\")","v":""},{"$f":"IF(WEEKDAY(5:5,2)>5,\"f\",\"\")","v":""},{"$f":"IF(WEEKDAY(5:5,2)>5,\"f\",\"\")","v":"f"},{"$f":"IF(WEEKDAY(5:5,2)>5,\"f\",\"\")","v":"f"},{"$f":"IF(WEEKDAY(5:5,2)>5,\"f\",\"\")","v":""},{"$f":"IF(WEEKDAY(5:5,2)>5,\"f\",\"\")","v":""},{"$f":"IF(WEEKDAY(5:5,2)>5,\"f\",\"\")","v":""},{"$f":"IF(WEEKDAY(5:5,2)>5,\"f\",\"\")","v":""},{"$f":"IF(WEEKDAY(5:5,2)>5,\"f\",\"\")","v":""},{"$f":"IF(WEEKDAY(5:5,2)>5,\"f\",\"\")","v":"f"},{"$f":"IF(WEEKDAY(5:5,2)>5,\"f\",\"\")","v":"f"},{"$f":"IF(WEEKDAY(5:5,2)>5,\"f\",\"\")","v":""},{"$f":"IF(WEEKDAY(5:5,2)>5,\"f\",\"\")","v":""},{"$f":"IF(WEEKDAY(5:5,2)>5,\"f\",\"\")","v":""},{"$f":"IF(WEEKDAY(5:5,2)>5,\"f\",\"\")","v":""},{"$f":"IF(WEEKDAY(5:5,2)>5,\"f\",\"\")","v":""},{"$f":"IF(WEEKDAY(5:5,2)>5,\"f\",\"\")","v":"f"},{"$f":"IF(WEEKDAY(5:5,2)>5,\"f\",\"\")","v":"f"},{"$f":"IF(WEEKDAY(5:5,2)>5,\"f\",\"\")","v":""},{"$f":"IF(WEEKDAY(5:5,2)>5,\"f\",\"\")","v":""},{"$f":"IF(WEEKDAY(5:5,2)>5,\"f\",\"\")","v":""},{"$f":"IF(WEEKDAY(5:5,2)>5,\"f\",\"\")","v":""},{"$f":"IF(WEEKDAY(5:5,2)>5,\"f\",\"\")","v":""},{"$f":"IF(WEEKDAY(5:5,2)>5,\"f\",\"\")","v":"f"},{"$f":"IF(WEEKDAY(5:5,2)>5,\"f\",\"\")","v":"f"},{"$f":"IF(WEEKDAY(5:5,2)>5,\"f\",\"\")","v":""},{"$f":"IF(WEEKDAY(5:5,2)>5,\"f\",\"\")","v":""},{"$f":"IF(WEEKDAY(5:5,2)>5,\"f\",\"\")","v":""},{"$f":"IF(WEEKDAY(5:5,2)>5,\"f\",\"\")","v":""},{"$f":"IF(WEEKDAY(5:5,2)>5,\"f\",\"\")","v":""},{"$f":"IF(WEEKDAY(5:5,2)>5,\"f\",\"\")","v":"f"},{"$f":"IF(WEEKDAY(5:5,2)>5,\"f\",\"\")","v":"f"},{"$f":"IF(WEEKDAY(5:5,2)>5,\"f\",\"\")","v":""},{"$f":"IF(WEEKDAY(5:5,2)>5,\"f\",\"\")","v":""},{"$f":"IF(WEEKDAY(5:5,2)>5,\"f\",\"\")","v":""},{"$f":"IF(WEEKDAY(5:5,2)>5,\"f\",\"\")","v":""},{"$f":"IF(WEEKDAY(5:5,2)>5,\"f\",\"\")","v":""},{"$f":"IF(WEEKDAY(5:5,2)>5,\"f\",\"\")","v":"f"},{"$f":"IF(WEEKDAY(5:5,2)>5,\"f\",\"\")","v":"f"},{"$f":"IF(WEEKDAY(5:5,2)>5,\"f\",\"\")","v":""},{"$f":"IF(WEEKDAY(5:5,2)>5,\"f\",\"\")","v":""},{"$f":"IF(WEEKDAY(5:5,2)>5,\"f\",\"\")","v":""},{"$f":"IF(WEEKDAY(5:5,2)>5,\"f\",\"\")","v":""},{"$f":"IF(WEEKDAY(5:5,2)>5,\"f\",\"\")","v":""},{"$f":"IF(WEEKDAY(5:5,2)>5,\"f\",\"\")","v":"f"},{"$f":"IF(WEEKDAY(5:5,2)>5,\"f\",\"\")","v":"f"},{"$f":"IF(WEEKDAY(5:5,2)>5,\"f\",\"\")","v":""},{"$f":"IF(WEEKDAY(5:5,2)>5,\"f\",\"\")","v":""},{"$f":"IF(WEEKDAY(5:5,2)>5,\"f\",\"\")","v":""},{"$f":"IF(WEEKDAY(5:5,2)>5,\"f\",\"\")","v":""},{"$f":"IF(WEEKDAY(5:5,2)>5,\"f\",\"\")","v":""},{"$f":"IF(WEEKDAY(5:5,2)>5,\"f\",\"\")","v":"f"},{"$f":"IF(WEEKDAY(5:5,2)>5,\"f\",\"\")","v":"f"},{"$f":"IF(WEEKDAY(5:5,2)>5,\"f\",\"\")","v":""},{"$f":"IF(WEEKDAY(5:5,2)>5,\"f\",\"\")","v":""},{"$f":"IF(WEEKDAY(5:5,2)>5,\"f\",\"\")","v":""},{"$f":"IF(WEEKDAY(5:5,2)>5,\"f\",\"\")","v":""},{"$f":"IF(WEEKDAY(5:5,2)>5,\"f\",\"\")","v":""},{"$f":"IF(WEEKDAY(5:5,2)>5,\"f\",\"\")","v":"f"},{"$f":"IF(WEEKDAY(5:5,2)>5,\"f\",\"\")","v":"f"},{"$f":"IF(WEEKDAY(5:5,2)>5,\"f\",\"\")","v":""},{"$f":"IF(WEEKDAY(5:5,2)>5,\"f\",\"\")","v":""},{"$f":"IF(WEEKDAY(5:5,2)>5,\"f\",\"\")","v":""},{"$f":"IF(WEEKDAY(5:5,2)>5,\"f\",\"\")","v":""},{"$f":"IF(WEEKDAY(5:5,2)>5,\"f\",\"\")","v":""},{"$f":"IF(WEEKDAY(5:5,2)>5,\"f\",\"\")","v":"f"},{"$f":"IF(WEEKDAY(5:5,2)>5,\"f\",\"\")","v":"f"},{"$f":"IF(WEEKDAY(5:5,2)>5,\"f\",\"\")","v":""},{"$f":"IF(WEEKDAY(5:5,2)>5,\"f\",\"\")","v":""},{"$f":"IF(WEEKDAY(5:5,2)>5,\"f\",\"\")","v":""},{"$f":"IF(WEEKDAY(5:5,2)>5,\"f\",\"\")","v":""},{"$f":"IF(WEEKDAY(5:5,2)>5,\"f\",\"\")","v":""},{"$f":"IF(WEEKDAY(5:5,2)>5,\"f\",\"\")","v":"f"},{"$f":"IF(WEEKDAY(5:5,2)>5,\"f\",\"\")","v":"f"},{"$f":"IF(WEEKDAY(5:5,2)>5,\"f\",\"\")","v":""},{"$f":"IF(WEEKDAY(5:5,2)>5,\"f\",\"\")","v":""},{"$f":"IF(WEEKDAY(5:5,2)>5,\"f\",\"\")","v":""},{"$f":"IF(WEEKDAY(5:5,2)>5,\"f\",\"\")","v":""},{"$f":"IF(WEEKDAY(5:5,2)>5,\"f\",\"\")","v":""},{"$f":"IF(WEEKDAY(5:5,2)>5,\"f\",\"\")","v":"f"},{"$f":"IF(WEEKDAY(5:5,2)>5,\"f\",\"\")","v":"f"},{"$f":"IF(WEEKDAY(5:5,2)>5,\"f\",\"\")","v":""},{"$f":"IF(WEEKDAY(5:5,2)>5,\"f\",\"\")","v":""},{"$f":"IF(WEEKDAY(5:5,2)>5,\"f\",\"\")","v":""},{"$f":"IF(WEEKDAY(5:5,2)>5,\"f\",\"\")","v":""},{"$f":"IF(WEEKDAY(5:5,2)>5,\"f\",\"\")","v":""},{"$f":"IF(WEEKDAY(5:5,2)>5,\"f\",\"\")","v":"f"},{"$f":"IF(WEEKDAY(5:5,2)>5,\"f\",\"\")","v":"f"},{"$f":"IF(WEEKDAY(5:5,2)>5,\"f\",\"\")","v":""},{"$f":"IF(WEEKDAY(5:5,2)>5,\"f\",\"\")","v":""},{"$f":"IF(WEEKDAY(5:5,2)>5,\"f\",\"\")","v":""},{"$f":"IF(WEEKDAY(5:5,2)>5,\"f\",\"\")","v":""},{"$f":"IF(WEEKDAY(5:5,2)>5,\"f\",\"\")","v":""},{"$f":"IF(WEEKDAY(5:5,2)>5,\"f\",\"\")","v":"f"},{"$f":"IF(WEEKDAY(5:5,2)>5,\"f\",\"\")","v":"f"},{"$f":"IF(WEEKDAY(5:5,2)>5,\"f\",\"\")","v":""},{"$f":"IF(WEEKDAY(5:5,2)>5,\"f\",\"\")","v":""},{"$f":"IF(WEEKDAY(5:5,2)>5,\"f\",\"\")","v":""},{"$f":"IF(WEEKDAY(5:5,2)>5,\"f\",\"\")","v":""},{"$f":"IF(WEEKDAY(5:5,2)>5,\"f\",\"\")","v":""},{"$f":"IF(WEEKDAY(5:5,2)>5,\"f\",\"\")","v":"f"},{"$f":"IF(WEEKDAY(5:5,2)>5,\"f\",\"\")","v":"f"},{"$f":"IF(WEEKDAY(5:5,2)>5,\"f\",\"\")","v":""},{"$f":"IF(WEEKDAY(5:5,2)>5,\"f\",\"\")","v":""},{"$f":"IF(WEEKDAY(5:5,2)>5,\"f\",\"\")","v":""},{"$f":"IF(WEEKDAY(5:5,2)>5,\"f\",\"\")","v":""},{"$f":"IF(WEEKDAY(5:5,2)>5,\"f\",\"\")","v":""},{"$f":"IF(WEEKDAY(5:5,2)>5,\"f\",\"\")","v":"f"},{"$f":"IF(WEEKDAY(5:5,2)>5,\"f\",\"\")","v":"f"},{"$f":"IF(WEEKDAY(5:5,2)>5,\"f\",\"\")","v":""},{"$f":"IF(WEEKDAY(5:5,2)>5,\"f\",\"\")","v":""},{"$f":"IF(WEEKDAY(5:5,2)>5,\"f\",\"\")","v":""},{"$f":"IF(WEEKDAY(5:5,2)>5,\"f\",\"\")","v":""},{"$f":"IF(WEEKDAY(5:5,2)>5,\"f\",\"\")","v":""},{"$f":"IF(WEEKDAY(5:5,2)>5,\"f\",\"\")","v":"f"},{"$f":"IF(WEEKDAY(5:5,2)>5,\"f\",\"\")","v":"f"},{"$f":"IF(WEEKDAY(5:5,2)>5,\"f\",\"\")","v":""},{"$f":"IF(WEEKDAY(5:5,2)>5,\"f\",\"\")","v":""},{"$f":"IF(WEEKDAY(5:5,2)>5,\"f\",\"\")","v":""},{"$f":"IF(WEEKDAY(5:5,2)>5,\"f\",\"\")","v":""},{"$f":"IF(WEEKDAY(5:5,2)>5,\"f\",\"\")","v":""},{"$f":"IF(WEEKDAY(5:5,2)>5,\"f\",\"\")","v":"f"},{"$f":"IF(WEEKDAY(5:5,2)>5,\"f\",\"\")","v":"f"},{"$f":"IF(WEEKDAY(5:5,2)>5,\"f\",\"\")","v":""},{"$f":"IF(WEEKDAY(5:5,2)>5,\"f\",\"\")","v":""},{"$f":"IF(WEEKDAY(5:5,2)>5,\"f\",\"\")","v":""},{"$f":"IF(WEEKDAY(5:5,2)>5,\"f\",\"\")","v":""},{"$f":"IF(WEEKDAY(5:5,2)>5,\"f\",\"\")","v":""},{"$f":"IF(WEEKDAY(5:5,2)>5,\"f\",\"\")","v":"f"},{"$f":"IF(WEEKDAY(5:5,2)>5,\"f\",\"\")","v":"f"},{"$f":"IF(WEEKDAY(5:5,2)>5,\"f\",\"\")","v":""},{"$f":"IF(WEEKDAY(5:5,2)>5,\"f\",\"\")","v":""},{"$f":"IF(WEEKDAY(5:5,2)>5,\"f\",\"\")","v":""},{"$f":"IF(WEEKDAY(5:5,2)>5,\"f\",\"\")","v":""},{"$f":"IF(WEEKDAY(5:5,2)>5,\"f\",\"\")","v":""},{"$f":"IF(WEEKDAY(5:5,2)>5,\"f\",\"\")","v":"f"},{"$f":"IF(WEEKDAY(5:5,2)>5,\"f\",\"\")","v":"f"},{"$f":"IF(WEEKDAY(5:5,2)>5,\"f\",\"\")","v":""},{"$f":"IF(WEEKDAY(5:5,2)>5,\"f\",\"\")","v":""},{"$f":"IF(WEEKDAY(5:5,2)>5,\"f\",\"\")","v":""},{"$f":"IF(WEEKDAY(5:5,2)>5,\"f\",\"\")","v":""},{"$f":"IF(WEEKDAY(5:5,2)>5,\"f\",\"\")","v":""},{"$f":"IF(WEEKDAY(5:5,2)>5,\"f\",\"\")","v":"f"},{"$f":"IF(WEEKDAY(5:5,2)>5,\"f\",\"\")","v":"f"},{"$f":"IF(WEEKDAY(5:5,2)>5,\"f\",\"\")","v":""},{"$f":"IF(WEEKDAY(5:5,2)>5,\"f\",\"\")","v":""},{"$f":"IF(WEEKDAY(5:5,2)>5,\"f\",\"\")","v":""},{"$f":"IF(WEEKDAY(5:5,2)>5,\"f\",\"\")","v":""},{"$f":"IF(WEEKDAY(5:5,2)>5,\"f\",\"\")","v":""},{"$f":"IF(WEEKDAY(5:5,2)>5,\"f\",\"\")","v":"f"},{"$f":"IF(WEEKDAY(5:5,2)>5,\"f\",\"\")","v":"f"},{"$f":"IF(WEEKDAY(5:5,2)>5,\"f\",\"\")","v":""},{"$f":"IF(WEEKDAY(5:5,2)>5,\"f\",\"\")","v":""},{"$f":"IF(WEEKDAY(5:5,2)>5,\"f\",\"\")","v":""},{"$f":"IF(WEEKDAY(5:5,2)>5,\"f\",\"\")","v":""},{"$f":"IF(WEEKDAY(5:5,2)>5,\"f\",\"\")","v":""},{"$f":"IF(WEEKDAY(5:5,2)>5,\"f\",\"\")","v":"f"},{"$f":"IF(WEEKDAY(5:5,2)>5,\"f\",\"\")","v":"f"},{"$f":"IF(WEEKDAY(5:5,2)>5,\"f\",\"\")","v":""},{"$f":"IF(WEEKDAY(5:5,2)>5,\"f\",\"\")","v":""},{"$f":"IF(WEEKDAY(5:5,2)>5,\"f\",\"\")","v":""},{"$f":"IF(WEEKDAY(5:5,2)>5,\"f\",\"\")","v":""},{"$f":"IF(WEEKDAY(5:5,2)>5,\"f\",\"\")","v":""},{"$f":"IF(WEEKDAY(5:5,2)>5,\"f\",\"\")","v":"f"},{"$f":"IF(WEEKDAY(5:5,2)>5,\"f\",\"\")","v":"f"},{"$f":"IF(WEEKDAY(5:5,2)>5,\"f\",\"\")","v":""},{"$f":"IF(WEEKDAY(5:5,2)>5,\"f\",\"\")","v":""},{"$f":"IF(WEEKDAY(5:5,2)>5,\"f\",\"\")","v":""},{"$f":"IF(WEEKDAY(5:5,2)>5,\"f\",\"\")","v":""},{"$f":"IF(WEEKDAY(5:5,2)>5,\"f\",\"\")","v":""},{"$f":"IF(WEEKDAY(5:5,2)>5,\"f\",\"\")","v":"f"},{"$f":"IF(WEEKDAY(5:5,2)>5,\"f\",\"\")","v":"f"},{"$f":"IF(WEEKDAY(5:5,2)>5,\"f\",\"\")","v":""},{"$f":"IF(WEEKDAY(5:5,2)>5,\"f\",\"\")","v":""},{"$f":"IF(WEEKDAY(5:5,2)>5,\"f\",\"\")","v":""},{"$f":"IF(WEEKDAY(5:5,2)>5,\"f\",\"\")","v":""},{"$f":"IF(WEEKDAY(5:5,2)>5,\"f\",\"\")","v":""},{"$f":"IF(WEEKDAY(5:5,2)>5,\"f\",\"\")","v":"f"},{"$f":"IF(WEEKDAY(5:5,2)>5,\"f\",\"\")","v":"f"},{"$f":"IF(WEEKDAY(5:5,2)>5,\"f\",\"\")","v":""},{"$f":"IF(WEEKDAY(5:5,2)>5,\"f\",\"\")","v":""},{"$f":"IF(WEEKDAY(5:5,2)>5,\"f\",\"\")","v":""},{"$f":"IF(WEEKDAY(5:5,2)>5,\"f\",\"\")","v":""},{"$f":"IF(WEEKDAY(5:5,2)>5,\"f\",\"\")","v":""},{"$f":"IF(WEEKDAY(5:5,2)>5,\"f\",\"\")","v":"f"},{"$f":"IF(WEEKDAY(5:5,2)>5,\"f\",\"\")","v":"f"},{"$f":"IF(WEEKDAY(5:5,2)>5,\"f\",\"\")","v":""},{"$f":"IF(WEEKDAY(5:5,2)>5,\"f\",\"\")","v":""},{"$f":"IF(WEEKDAY(5:5,2)>5,\"f\",\"\")","v":""},{"$f":"IF(WEEKDAY(5:5,2)>5,\"f\",\"\")","v":""},{"$f":"IF(WEEKDAY(5:5,2)>5,\"f\",\"\")","v":""},{"$f":"IF(WEEKDAY(5:5,2)>5,\"f\",\"\")","v":"f"},{"$f":"IF(WEEKDAY(5:5,2)>5,\"f\",\"\")","v":"f"},{"$f":"IF(WEEKDAY(5:5,2)>5,\"f\",\"\")","v":""},{"$f":"IF(WEEKDAY(5:5,2)>5,\"f\",\"\")","v":""},{"$f":"IF(WEEKDAY(5:5,2)>5,\"f\",\"\")","v":""},{"$f":"IF(WEEKDAY(5:5,2)>5,\"f\",\"\")","v":""},{"$f":"IF(WEEKDAY(5:5,2)>5,\"f\",\"\")","v":""},{"$f":"IF(WEEKDAY(5:5,2)>5,\"f\",\"\")","v":"f"},{"$f":"IF(WEEKDAY(5:5,2)>5,\"f\",\"\")","v":"f"},{"$f":"IF(WEEKDAY(5:5,2)>5,\"f\",\"\")","v":""},{"$f":"IF(WEEKDAY(5:5,2)>5,\"f\",\"\")","v":""},{"$f":"IF(WEEKDAY(5:5,2)>5,\"f\",\"\")","v":""},{"$f":"IF(WEEKDAY(5:5,2)>5,\"f\",\"\")","v":""},{"$f":"IF(WEEKDAY(5:5,2)>5,\"f\",\"\")","v":""},{"$f":"IF(WEEKDAY(5:5,2)>5,\"f\",\"\")","v":"f"},{"$f":"IF(WEEKDAY(5:5,2)>5,\"f\",\"\")","v":"f"},{"$f":"IF(WEEKDAY(5:5,2)>5,\"f\",\"\")","v":""},{"$f":"IF(WEEKDAY(5:5,2)>5,\"f\",\"\")","v":""},{"$f":"IF(WEEKDAY(5:5,2)>5,\"f\",\"\")","v":""},{"$f":"IF(WEEKDAY(5:5,2)>5,\"f\",\"\")","v":""},{"$f":"IF(WEEKDAY(5:5,2)>5,\"f\",\"\")","v":""},{"$f":"IF(WEEKDAY(5:5,2)>5,\"f\",\"\")","v":"f"}]
["EMPLOYE1","2016-01-01","2016-01-10",{"$f":"NETWORKDAYS(B7,C7,'jours Féries 2016'!$B$1:$B$14)","v":5},{"$f":"COUNTIF(F7:AJ7,\"C\")","v":5},{"$f":"IF(AND(dates>=Début01, dates<=Fin_01,NOT(feries=\"F\")),\"C\",\"\")","v":""},{"$f":"IF(AND(dates>=Début01, dates<=Fin_01,NOT(feries=\"F\")),\"C\",\"\")","v":""},"","C","C","C","C","C","","",{"$f":"IF(AND(dates>=Début01, dates<=Fin_01,NOT(feries=\"F\")),\"C\",\"\")","v":""},"","","","","","","","","",{"$f":"IF(AND(dates>=Début01, dates<=Fin_01,NOT(feries=\"F\")),\"C\",\"\")","v":""},"","","","","","","","","","",null,null,{"$f":"NETWORKDAYS(AK7,AL7,'jours Féries 2016'!$B$1:$B$14)","v":0},{"$f":"COUNTIF(AO7:BQ7,\"C\")","v":0},{"$f":"IF(AND(dates>=Début02, dates<=Fin_02,NOT(feries=\"F\")),\"C\",\"\")","v":""},{"$f":"IF(AND(dates>=Début02, dates<=Fin_02,NOT(feries=\"F\")),\"C\",\"\")","v":""},{"$f":"IF(AND(dates>=Début02, dates<=Fin_02,NOT(feries=\"F\")),\"C\",\"\")","v":""},{"$f":"IF(AND(dates>=Début02, dates<=Fin_02,NOT(feries=\"F\")),\"C\",\"\")","v":""},{"$f":"IF(AND(dates>=Début02, dates<=Fin_02,NOT(feries=\"F\")),\"C\",\"\")","v":""},{"$f":"IF(AND(dates>=Début02, dates<=Fin_02,NOT(feries=\"F\")),\"C\",\"\")","v":""},{"$f":"IF(AND(dates>=Début02, dates<=Fin_02,NOT(feries=\"F\")),\"C\",\"\")","v":""},{"$f":"IF(AND(dates>=Début02, dates<=Fin_02,NOT(feries=\"F\")),\"C\",\"\")","v":""},{"$f":"IF(AND(dates>=Début02, dates<=Fin_02,NOT(feries=\"F\")),\"C\",\"\")","v":""},{"$f":"IF(AND(dates>=Début02, dates<=Fin_02,NOT(feries=\"F\")),\"C\",\"\")","v":""},{"$f":"IF(AND(dates>=Début02, dates<=Fin_02,NOT(feries=\"F\")),\"C\",\"\")","v":""},{"$f":"IF(AND(dates>=Début02, dates<=Fin_02,NOT(feries=\"F\")),\"C\",\"\")","v":""},{"$f":"IF(AND(dates>=Début02, dates<=Fin_02,NOT(feries=\"F\")),\"C\",\"\")","v":""},{"$f":"IF(AND(dates>=Début02, dates<=Fin_02,NOT(feries=\"F\")),\"C\",\"\")","v":""},{"$f":"IF(AND(dates>=Début02, dates<=Fin_02,NOT(feries=\"F\")),\"C\",\"\")","v":""},{"$f":"IF(AND(dates>=Début02, dates<=Fin_02,NOT(feries=\"F\")),\"C\",\"\")","v":""},{"$f":"IF(AND(dates>=Début02, dates<=Fin_02,NOT(feries=\"F\")),\"C\",\"\")","v":""},{"$f":"IF(AND(dates>=Début02, dates<=Fin_02,NOT(feries=\"F\")),\"C\",\"\")","v":""},{"$f":"IF(AND(dates>=Début02, dates<=Fin_02,NOT(feries=\"F\")),\"C\",\"\")","v":""},{"$f":"IF(AND(dates>=Début02, dates<=Fin_02,NOT(feries=\"F\")),\"C\",\"\")","v":""},{"$f":"IF(AND(dates>=Début02, dates<=Fin_02,NOT(feries=\"F\")),\"C\",\"\")","v":""},{"$f":"IF(AND(dates>=Début02, dates<=Fin_02,NOT(feries=\"F\")),\"C\",\"\")","v":""},{"$f":"IF(AND(dates>=Début02, dates<=Fin_02,NOT(feries=\"F\")),\"C\",\"\")","v":""},{"$f":"IF(AND(dates>=Début02, dates<=Fin_02,NOT(feries=\"F\")),\"C\",\"\")","v":""},{"$f":"IF(AND(dates>=Début02, dates<=Fin_02,NOT(feries=\"F\")),\"C\",\"\")","v":""},{"$f":"IF(AND(dates>=Début02, dates<=Fin_02,NOT(feries=\"F\")),\"C\",\"\")","v":""},{"$f":"IF(AND(dates>=Début02, dates<=Fin_02,NOT(feries=\"F\")),\"C\",\"\")","v":""},{"$f":"IF(AND(dates>=Début02, dates<=Fin_02,NOT(feries=\"F\")),\"C\",\"\")","v":""},{"$f":"IF(AND(dates>=Début02, dates<=Fin_02,NOT(feries=\"F\")),\"C\",\"\")","v":""},null,null,{"$f":"NETWORKDAYS(BR7,BS7,'jours Féries 2016'!$B$1:$B$14)","v":0},{"$f":"COUNTIF(BV7:CZ7,\"C\")","v":0},{"$f":"IF(AND(dates>=Début03, dates<=Fin_03,NOT(feries=\"F\")),\"C\",\"\")","v":""},{"$f":"IF(AND(dates>=Début03, dates<=Fin_03,NOT(feries=\"F\")),\"C\",\"\")","v":""},{"$f":"IF(AND(dates>=Début03, dates<=Fin_03,NOT(feries=\"F\")),\"C\",\"\")","v":""},{"$f":"IF(AND(dates>=Début03, dates<=Fin_03,NOT(feries=\"F\")),\"C\",\"\")","v":""},{"$f":"IF(AND(dates>=Début03, dates<=Fin_03,NOT(feries=\"F\")),\"C\",\"\")","v":""},{"$f":"IF(AND(dates>=Début03, dates<=Fin_03,NOT(feries=\"F\")),\"C\",\"\")","v":""},{"$f":"IF(AND(dates>=Début03, dates<=Fin_03,NOT(feries=\"F\")),\"C\",\"\")","v":""},{"$f":"IF(AND(dates>=Début03, dates<=Fin_03,NOT(feries=\"F\")),\"C\",\"\")","v":""},{"$f":"IF(AND(dates>=Début03, dates<=Fin_03,NOT(feries=\"F\")),\"C\",\"\")","v":""},{"$f":"IF(AND(dates>=Début03, dates<=Fin_03,NOT(feries=\"F\")),\"C\",\"\")","v":""},{"$f":"IF(AND(dates>=Début03, dates<=Fin_03,NOT(feries=\"F\")),\"C\",\"\")","v":""},{"$f":"IF(AND(dates>=Début03, dates<=Fin_03,NOT(feries=\"F\")),\"C\",\"\")","v":""},{"$f":"IF(AND(dates>=Début03, dates<=Fin_03,NOT(feries=\"F\")),\"C\",\"\")","v":""},{"$f":"IF(AND(dates>=Début03, dates<=Fin_03,NOT(feries=\"F\")),\"C\",\"\")","v":""},{"$f":"IF(AND(dates>=Début03, dates<=Fin_03,NOT(feries=\"F\")),\"C\",\"\")","v":""},{"$f":"IF(AND(dates>=Début03, dates<=Fin_03,NOT(feries=\"F\")),\"C\",\"\")","v":""},{"$f":"IF(AND(dates>=Début03, dates<=Fin_03,NOT(feries=\"F\")),\"C\",\"\")","v":""},{"$f":"IF(AND(dates>=Début03, dates<=Fin_03,NOT(feries=\"F\")),\"C\",\"\")","v":""},{"$f":"IF(AND(dates>=Début03, dates<=Fin_03,NOT(feries=\"F\")),\"C\",\"\")","v":""},{"$f":"IF(AND(dates>=Début03, dates<=Fin_03,NOT(feries=\"F\")),\"C\",\"\")","v":""},{"$f":"IF(AND(dates>=Début03, dates<=Fin_03,NOT(feries=\"F\")),\"C\",\"\")","v":""},{"$f":"IF(AND(dates>=Début03, dates<=Fin_03,NOT(feries=\"F\")),\"C\",\"\")","v":""},{"$f":"IF(AND(dates>=Début03, dates<=Fin_03,NOT(feries=\"F\")),\"C\",\"\")","v":""},{"$f":"IF(AND(dates>=Début03, dates<=Fin_03,NOT(feries=\"F\")),\"C\",\"\")","v":""},{"$f":"IF(AND(dates>=Début03, dates<=Fin_03,NOT(feries=\"F\")),\"C\",\"\")","v":""},{"$f":"IF(AND(dates>=Début03, dates<=Fin_03,NOT(feries=\"F\")),\"C\",\"\")","v":""},{"$f":"IF(AND(dates>=Début03, dates<=Fin_03,NOT(feries=\"F\")),\"C\",\"\")","v":""},{"$f":"IF(AND(dates>=Début03, dates<=Fin_03,NOT(feries=\"F\")),\"C\",\"\")","v":""},{"$f":"IF(AND(dates>=Début03, dates<=Fin_03,NOT(feries=\"F\")),\"C\",\"\")","v":""},{"$f":"IF(AND(dates>=Début03, dates<=Fin_03,NOT(feries=\"F\")),\"C\",\"\")","v":""},{"$f":"IF(AND(dates>=Début03, dates<=Fin_03,NOT(feries=\"F\")),\"C\",\"\")","v":""},null,null,{"$f":"NETWORKDAYS(DA7,DB7,'jours Féries 2016'!$B$1:$B$14)","v":0},{"$f":"COUNTIF(DE7:EH7,\"C\")","v":0},{"$f":"IF(AND(dates>=Début04, dates<=Fin_04,NOT(feries=\"F\")),\"C\",\"\")","v":""},{"$f":"IF(AND(dates>=Début04, dates<=Fin_04,NOT(feries=\"F\")),\"C\",\"\")","v":""},{"$f":"IF(AND(dates>=Début04, dates<=Fin_04,NOT(feries=\"F\")),\"C\",\"\")","v":""},{"$f":"IF(AND(dates>=Début04, dates<=Fin_04,NOT(feries=\"F\")),\"C\",\"\")","v":""},{"$f":"IF(AND(dates>=Début04, dates<=Fin_04,NOT(feries=\"F\")),\"C\",\"\")","v":""},{"$f":"IF(AND(dates>=Début04, dates<=Fin_04,NOT(feries=\"F\")),\"C\",\"\")","v":""},{"$f":"IF(AND(dates>=Début04, dates<=Fin_04,NOT(feries=\"F\")),\"C\",\"\")","v":""},{"$f":"IF(AND(dates>=Début04, dates<=Fin_04,NOT(feries=\"F\")),\"C\",\"\")","v":""},{"$f":"IF(AND(dates>=Début04, dates<=Fin_04,NOT(feries=\"F\")),\"C\",\"\")","v":""},{"$f":"IF(AND(dates>=Début04, dates<=Fin_04,NOT(feries=\"F\")),\"C\",\"\")","v":""},{"$f":"IF(AND(dates>=Début04, dates<=Fin_04,NOT(feries=\"F\")),\"C\",\"\")","v":""},{"$f":"IF(AND(dates>=Début04, dates<=Fin_04,NOT(feries=\"F\")),\"C\",\"\")","v":""},{"$f":"IF(AND(dates>=Début04, dates<=Fin_04,NOT(feries=\"F\")),\"C\",\"\")","v":""},{"$f":"IF(AND(dates>=Début04, dates<=Fin_04,NOT(feries=\"F\")),\"C\",\"\")","v":""},{"$f":"IF(AND(dates>=Début04, dates<=Fin_04,NOT(feries=\"F\")),\"C\",\"\")","v":""},{"$f":"IF(AND(dates>=Début04, dates<=Fin_04,NOT(feries=\"F\")),\"C\",\"\")","v":""},{"$f":"IF(AND(dates>=Début04, dates<=Fin_04,NOT(feries=\"F\")),\"C\",\"\")","v":""},{"$f":"IF(AND(dates>=Début04, dates<=Fin_04,NOT(feries=\"F\")),\"C\",\"\")","v":""},{"$f":"IF(AND(dates>=Début04, dates<=Fin_04,NOT(feries=\"F\")),\"C\",\"\")","v":""},{"$f":"IF(AND(dates>=Début04, dates<=Fin_04,NOT(feries=\"F\")),\"C\",\"\")","v":""},{"$f":"IF(AND(dates>=Début04, dates<=Fin_04,NOT(feries=\"F\")),\"C\",\"\")","v":""},{"$f":"IF(AND(dates>=Début04, dates<=Fin_04,NOT(feries=\"F\")),\"C\",\"\")","v":""},{"$f":"IF(AND(dates>=Début04, dates<=Fin_04,NOT(feries=\"F\")),\"C\",\"\")","v":""},{"$f":"IF(AND(dates>=Début04, dates<=Fin_04,NOT(feries=\"F\")),\"C\",\"\")","v":""},{"$f":"IF(AND(dates>=Début04, dates<=Fin_04,NOT(feries=\"F\")),\"C\",\"\")","v":""},{"$f":"IF(AND(dates>=Début04, dates<=Fin_04,NOT(feries=\"F\")),\"C\",\"\")","v":""},{"$f":"IF(AND(dates>=Début04, dates<=Fin_04,NOT(feries=\"F\")),\"C\",\"\")","v":""},{"$f":"IF(AND(dates>=Début04, dates<=Fin_04,NOT(feries=\"F\")),\"C\",\"\")","v":""},{"$f":"IF(AND(dates>=Début04, dates<=Fin_04,NOT(feries=\"F\")),\"C\",\"\")","v":""},{"$f":"IF(AND(dates>=Début04, dates<=Fin_04,NOT(feries=\"F\")),\"C\",\"\")","v":""},null,null,{"$f":"NETWORKDAYS(EI7,EJ7,'jours Féries 2016'!$B$1:$B$14)","v":0},{"$f":"COUNTIF(EM7:GD7,\"C\")","v":0},{"$f":"IF(AND(dates>=Début01, dates<=Fin_01,NOT(feries=\"F\")),\"C\",\"\")","v":""},{"$f":"IF(AND(dates>=Début01, dates<=Fin_01,NOT(feries=\"F\")),\"C\",\"\")","v":""},"","","","","","","","","","","","","","","",{"$f":"IF(AND(dates>=Début01, dates<=Fin_01,NOT(feries=\"F\")),\"C\",\"\")","v":""},"","","","","","","","","","","","","",null,"","","","","","","","","","","","","","","","","","","","","","","","","","","","","","","","","","","","","","","","","","","","","","","","","","",{"$f":"IF(AND(dates>=Début01, dates<=Fin_01,NOT(feries=\"F\")),\"C\",\"\")","v":""},"","","","","","","","","","","","","","","","","","","","","","","","","","","","","","","","","","","","","","","","","","","","","","","","","","","","","","","","","","","","","","","",{"$f":"IF(AND(dates>=Début01, dates<=Fin_01,NOT(feries=\"F\")),\"C\",\"\")","v":""},"","","","","","","","","","","","","","","","","","","","","","","","","","","","","","","","","","","","","","","","","","","","","","","","","","","","","","","","","","","","","","","",{"$f":"IF(AND(dates>=Début01, dates<=Fin_01,NOT(feries=\"F\")),\"C\",\"\")","v":""},"","","","","","","","","","","","","","","","","","","","","","","","","","","","","","","","","","",""]
["EMPLOYE2","2016-01-02","2016-01-11",{"$f":"NETWORKDAYS(B8,C8,'jours Féries 2016'!$B$1:$B$14)","v":6},6,"","","","C","C","C","C","C","","","C","","","","","","","","","","","","","","","","","","","","",null,null,{"$f":"NETWORKDAYS(AK8,AL8,'jours Féries 2016'!$B$1:$B$14)","v":0},0,{"$f":"IF(AND(dates>=Début02, dates<=Fin_02,NOT(feries=\"F\")),\"C\",\"\")","v":""},{"$f":"IF(AND(dates>=Début02, dates<=Fin_02,NOT(feries=\"F\")),\"C\",\"\")","v":""},{"$f":"IF(AND(dates>=Début02, dates<=Fin_02,NOT(feries=\"F\")),\"C\",\"\")","v":""},{"$f":"IF(AND(dates>=Début02, dates<=Fin_02,NOT(feries=\"F\")),\"C\",\"\")","v":""},{"$f":"IF(AND(dates>=Début02, dates<=Fin_02,NOT(feries=\"F\")),\"C\",\"\")","v":""},{"$f":"IF(AND(dates>=Début02, dates<=Fin_02,NOT(feries=\"F\")),\"C\",\"\")","v":""},{"$f":"IF(AND(dates>=Début02, dates<=Fin_02,NOT(feries=\"F\")),\"C\",\"\")","v":""},{"$f":"IF(AND(dates>=Début02, dates<=Fin_02,NOT(feries=\"F\")),\"C\",\"\")","v":""},{"$f":"IF(AND(dates>=Début02, dates<=Fin_02,NOT(feries=\"F\")),\"C\",\"\")","v":""},{"$f":"IF(AND(dates>=Début02, dates<=Fin_02,NOT(feries=\"F\")),\"C\",\"\")","v":""},{"$f":"IF(AND(dates>=Début02, dates<=Fin_02,NOT(feries=\"F\")),\"C\",\"\")","v":""},{"$f":"IF(AND(dates>=Début02, dates<=Fin_02,NOT(feries=\"F\")),\"C\",\"\")","v":""},{"$f":"IF(AND(dates>=Début02, dates<=Fin_02,NOT(feries=\"F\")),\"C\",\"\")","v":""},{"$f":"IF(AND(dates>=Début02, dates<=Fin_02,NOT(feries=\"F\")),\"C\",\"\")","v":""},{"$f":"IF(AND(dates>=Début02, dates<=Fin_02,NOT(feries=\"F\")),\"C\",\"\")","v":""},{"$f":"IF(AND(dates>=Début02, dates<=Fin_02,NOT(feries=\"F\")),\"C\",\"\")","v":""},{"$f":"IF(AND(dates>=Début02, dates<=Fin_02,NOT(feries=\"F\")),\"C\",\"\")","v":""},{"$f":"IF(AND(dates>=Début02, dates<=Fin_02,NOT(feries=\"F\")),\"C\",\"\")","v":""},{"$f":"IF(AND(dates>=Début02, dates<=Fin_02,NOT(feries=\"F\")),\"C\",\"\")","v":""},{"$f":"IF(AND(dates>=Début02, dates<=Fin_02,NOT(feries=\"F\")),\"C\",\"\")","v":""},{"$f":"IF(AND(dates>=Début02, dates<=Fin_02,NOT(feries=\"F\")),\"C\",\"\")","v":""},{"$f":"IF(AND(dates>=Début02, dates<=Fin_02,NOT(feries=\"F\")),\"C\",\"\")","v":""},{"$f":"IF(AND(dates>=Début02, dates<=Fin_02,NOT(feries=\"F\")),\"C\",\"\")","v":""},{"$f":"IF(AND(dates>=Début02, dates<=Fin_02,NOT(feries=\"F\")),\"C\",\"\")","v":""},{"$f":"IF(AND(dates>=Début02, dates<=Fin_02,NOT(feries=\"F\")),\"C\",\"\")","v":""},{"$f":"IF(AND(dates>=Début02, dates<=Fin_02,NOT(feries=\"F\")),\"C\",\"\")","v":""},{"$f":"IF(AND(dates>=Début02, dates<=Fin_02,NOT(feries=\"F\")),\"C\",\"\")","v":""},{"$f":"IF(AND(dates>=Début02, dates<=Fin_02,NOT(feries=\"F\")),\"C\",\"\")","v":""},{"$f":"IF(AND(dates>=Début02, dates<=Fin_02,NOT(feries=\"F\")),\"C\",\"\")","v":""},null,null,{"$f":"NETWORKDAYS(BR8,BS8,'jours Féries 2016'!$B$1:$B$14)","v":0},0,{"$f":"IF(AND(dates>=Début03, dates<=Fin_03,NOT(feries=\"F\")),\"C\",\"\")","v":""},{"$f":"IF(AND(dates>=Début03, dates<=Fin_03,NOT(feries=\"F\")),\"C\",\"\")","v":""},{"$f":"IF(AND(dates>=Début03, dates<=Fin_03,NOT(feries=\"F\")),\"C\",\"\")","v":""},{"$f":"IF(AND(dates>=Début03, dates<=Fin_03,NOT(feries=\"F\")),\"C\",\"\")","v":""},{"$f":"IF(AND(dates>=Début03, dates<=Fin_03,NOT(feries=\"F\")),\"C\",\"\")","v":""},{"$f":"IF(AND(dates>=Début03, dates<=Fin_03,NOT(feries=\"F\")),\"C\",\"\")","v":""},{"$f":"IF(AND(dates>=Début03, dates<=Fin_03,NOT(feries=\"F\")),\"C\",\"\")","v":""},{"$f":"IF(AND(dates>=Début03, dates<=Fin_03,NOT(feries=\"F\")),\"C\",\"\")","v":""},{"$f":"IF(AND(dates>=Début03, dates<=Fin_03,NOT(feries=\"F\")),\"C\",\"\")","v":""},{"$f":"IF(AND(dates>=Début03, dates<=Fin_03,NOT(feries=\"F\")),\"C\",\"\")","v":""},{"$f":"IF(AND(dates>=Début03, dates<=Fin_03,NOT(feries=\"F\")),\"C\",\"\")","v":""},{"$f":"IF(AND(dates>=Début03, dates<=Fin_03,NOT(feries=\"F\")),\"C\",\"\")","v":""},{"$f":"IF(AND(dates>=Début03, dates<=Fin_03,NOT(feries=\"F\")),\"C\",\"\")","v":""},{"$f":"IF(AND(dates>=Début03, dates<=Fin_03,NOT(feries=\"F\")),\"C\",\"\")","v":""},{"$f":"IF(AND(dates>=Début03, dates<=Fin_03,NOT(feries=\"F\")),\"C\",\"\")","v":""},{"$f":"IF(AND(dates>=Début03, dates<=Fin_03,NOT(feries=\"F\")),\"C\",\"\")","v":""},{"$f":"IF(AND(dates>=Début03, dates<=Fin_03,NOT(feries=\"F\")),\"C\",\"\")","v":""},{"$f":"IF(AND(dates>=Début03, dates<=Fin_03,NOT(feries=\"F\")),\"C\",\"\")","v":""},{"$f":"IF(AND(dates>=Début03, dates<=Fin_03,NOT(feries=\"F\")),\"C\",\"\")","v":""},{"$f":"IF(AND(dates>=Début03, dates<=Fin_03,NOT(feries=\"F\")),\"C\",\"\")","v":""},{"$f":"IF(AND(dates>=Début03, dates<=Fin_03,NOT(feries=\"F\")),\"C\",\"\")","v":""},{"$f":"IF(AND(dates>=Début03, dates<=Fin_03,NOT(feries=\"F\")),\"C\",\"\")","v":""},{"$f":"IF(AND(dates>=Début03, dates<=Fin_03,NOT(feries=\"F\")),\"C\",\"\")","v":""},{"$f":"IF(AND(dates>=Début03, dates<=Fin_03,NOT(feries=\"F\")),\"C\",\"\")","v":""},{"$f":"IF(AND(dates>=Début03, dates<=Fin_03,NOT(feries=\"F\")),\"C\",\"\")","v":""},{"$f":"IF(AND(dates>=Début03, dates<=Fin_03,NOT(feries=\"F\")),\"C\",\"\")","v":""},{"$f":"IF(AND(dates>=Début03, dates<=Fin_03,NOT(feries=\"F\")),\"C\",\"\")","v":""},{"$f":"IF(AND(dates>=Début03, dates<=Fin_03,NOT(feries=\"F\")),\"C\",\"\")","v":""},{"$f":"IF(AND(dates>=Début03, dates<=Fin_03,NOT(feries=\"F\")),\"C\",\"\")","v":""},{"$f":"IF(AND(dates>=Début03, dates<=Fin_03,NOT(feries=\"F\")),\"C\",\"\")","v":""},{"$f":"IF(AND(dates>=Début03, dates<=Fin_03,NOT(feries=\"F\")),\"C\",\"\")","v":""},null,null,{"$f":"NETWORKDAYS(DA8,DB8,'jours Féries 2016'!$B$1:$B$14)","v":0},0,{"$f":"IF(AND(dates>=Début04, dates<=Fin_04,NOT(feries=\"F\")),\"C\",\"\")","v":""},{"$f":"IF(AND(dates>=Début04, dates<=Fin_04,NOT(feries=\"F\")),\"C\",\"\")","v":""},{"$f":"IF(AND(dates>=Début04, dates<=Fin_04,NOT(feries=\"F\")),\"C\",\"\")","v":""},{"$f":"IF(AND(dates>=Début04, dates<=Fin_04,NOT(feries=\"F\")),\"C\",\"\")","v":""},{"$f":"IF(AND(dates>=Début04, dates<=Fin_04,NOT(feries=\"F\")),\"C\",\"\")","v":""},{"$f":"IF(AND(dates>=Début04, dates<=Fin_04,NOT(feries=\"F\")),\"C\",\"\")","v":""},{"$f":"IF(AND(dates>=Début04, dates<=Fin_04,NOT(feries=\"F\")),\"C\",\"\")","v":""},{"$f":"IF(AND(dates>=Début04, dates<=Fin_04,NOT(feries=\"F\")),\"C\",\"\")","v":""},{"$f":"IF(AND(dates>=Début04, dates<=Fin_04,NOT(feries=\"F\")),\"C\",\"\")","v":""},{"$f":"IF(AND(dates>=Début04, dates<=Fin_04,NOT(feries=\"F\")),\"C\",\"\")","v":""},{"$f":"IF(AND(dates>=Début04, dates<=Fin_04,NOT(feries=\"F\")),\"C\",\"\")","v":""},{"$f":"IF(AND(dates>=Début04, dates<=Fin_04,NOT(feries=\"F\")),\"C\",\"\")","v":""},{"$f":"IF(AND(dates>=Début04, dates<=Fin_04,NOT(feries=\"F\")),\"C\",\"\")","v":""},{"$f":"IF(AND(dates>=Début04, dates<=Fin_04,NOT(feries=\"F\")),\"C\",\"\")","v":""},{"$f":"IF(AND(dates>=Début04, dates<=Fin_04,NOT(feries=\"F\")),\"C\",\"\")","v":""},{"$f":"IF(AND(dates>=Début04, dates<=Fin_04,NOT(feries=\"F\")),\"C\",\"\")","v":""},{"$f":"IF(AND(dates>=Début04, dates<=Fin_04,NOT(feries=\"F\")),\"C\",\"\")","v":""},{"$f":"IF(AND(dates>=Début04, dates<=Fin_04,NOT(feries=\"F\")),\"C\",\"\")","v":""},{"$f":"IF(AND(dates>=Début04, dates<=Fin_04,NOT(feries=\"F\")),\"C\",\"\")","v":""},{"$f":"IF(AND(dates>=Début04, dates<=Fin_04,NOT(feries=\"F\")),\"C\",\"\")","v":""},{"$f":"IF(AND(dates>=Début04, dates<=Fin_04,NOT(feries=\"F\")),\"C\",\"\")","v":""},{"$f":"IF(AND(dates>=Début04, dates<=Fin_04,NOT(feries=\"F\")),\"C\",\"\")","v":""},{"$f":"IF(AND(dates>=Début04, dates<=Fin_04,NOT(feries=\"F\")),\"C\",\"\")","v":""},{"$f":"IF(AND(dates>=Début04, dates<=Fin_04,NOT(feries=\"F\")),\"C\",\"\")","v":""},{"$f":"IF(AND(dates>=Début04, dates<=Fin_04,NOT(feries=\"F\")),\"C\",\"\")","v":""},{"$f":"IF(AND(dates>=Début04, dates<=Fin_04,NOT(feries=\"F\")),\"C\",\"\")","v":""},{"$f":"IF(AND(dates>=Début04, dates<=Fin_04,NOT(feries=\"F\")),\"C\",\"\")","v":""},{"$f":"IF(AND(dates>=Début04, dates<=Fin_04,NOT(feries=\"F\")),\"C\",\"\")","v":""},{"$f":"IF(AND(dates>=Début04, dates<=Fin_04,NOT(feries=\"F\")),\"C\",\"\")","v":""},{"$f":"IF(AND(dates>=Début04, dates<=Fin_04,NOT(feries=\"F\")),\"C\",\"\")","v":""},"2016-05-01","2016-05-20",{"$f":"NETWORKDAYS(EI8,EJ8,'jours Féries 2016'!$B$1:$B$14)","v":13},{"$f":"COUNTIF(EM8:GD8,\"C\")","v":0},"","","","","","",{"$f":"IF(AND(dates>=Début01, dates<=Fin_01,NOT(feries=\"F\")),\"C\",\"\")","v":""},"","","","","","","","","","","","","","","","","","","","","","","","",null,"","","","","","","","","","","","","","","","","","","","","","","","","","","","","","","","","","","","","","","","","","","","","","","","","","","","","","","","","","","","","","","","","","","","","","","","","","","","","","","","","","","","","","","","","","","","","","","","","","","","","","","","","","","","","","","","","","","","","","","","","","","","","","","","","","","","","","","","","","","","","","","","","","","","","","","","","","","","","","","","","","","","","","","","","","","","","","","","","","","","","","","","","","","","","","","","","","","","","","","","","","","","","","","","","","","","","",""]
["EMPLOYE3","2016-01-03","2016-01-12",{"$f":"NETWORKDAYS(B9,C9,'jours Féries 2016'!$B$1:$B$14)","v":7},7,"","","","C","C","C","C","C","","","C","C","","","","","","","","","","","","","","","","","","","",null,null,{"$f":"NETWORKDAYS(AK9,AL9,'jours Féries 2016'!$B$1:$B$14)","v":0},0,{"$f":"IF(AND(dates>=Début02, dates<=Fin_02,NOT(feries=\"F\")),\"C\",\"\")","v":""},{"$f":"IF(AND(dates>=Début02, dates<=Fin_02,NOT(feries=\"F\")),\"C\",\"\")","v":""},{"$f":"IF(AND(dates>=Début02, dates<=Fin_02,NOT(feries=\"F\")),\"C\",\"\")","v":""},{"$f":"IF(AND(dates>=Début02, dates<=Fin_02,NOT(feries=\"F\")),\"C\",\"\")","v":""},{"$f":"IF(AND(dates>=Début02, dates<=Fin_02,NOT(feries=\"F\")),\"C\",\"\")","v":""},{"$f":"IF(AND(dates>=Début02, dates<=Fin_02,NOT(feries=\"F\")),\"C\",\"\")","v":""},{"$f":"IF(AND(dates>=Début02, dates<=Fin_02,NOT(feries=\"F\")),\"C\",\"\")","v":""},{"$f":"IF(AND(dates>=Début02, dates<=Fin_02,NOT(feries=\"F\")),\"C\",\"\")","v":""},{"$f":"IF(AND(dates>=Début02, dates<=Fin_02,NOT(feries=\"F\")),\"C\",\"\")","v":""},{"$f":"IF(AND(dates>=Début02, dates<=Fin_02,NOT(feries=\"F\")),\"C\",\"\")","v":""},{"$f":"IF(AND(dates>=Début02, dates<=Fin_02,NOT(feries=\"F\")),\"C\",\"\")","v":""},{"$f":"IF(AND(dates>=Début02, dates<=Fin_02,NOT(feries=\"F\")),\"C\",\"\")","v":""},{"$f":"IF(AND(dates>=Début02, dates<=Fin_02,NOT(feries=\"F\")),\"C\",\"\")","v":""},{"$f":"IF(AND(dates>=Début02, dates<=Fin_02,NOT(feries=\"F\")),\"C\",\"\")","v":""},{"$f":"IF(AND(dates>=Début02, dates<=Fin_02,NOT(feries=\"F\")),\"C\",\"\")","v":""},{"$f":"IF(AND(dates>=Début02, dates<=Fin_02,NOT(feries=\"F\")),\"C\",\"\")","v":""},{"$f":"IF(AND(dates>=Début02, dates<=Fin_02,NOT(feries=\"F\")),\"C\",\"\")","v":""},{"$f":"IF(AND(dates>=Début02, dates<=Fin_02,NOT(feries=\"F\")),\"C\",\"\")","v":""},{"$f":"IF(AND(dates>=Début02, dates<=Fin_02,NOT(feries=\"F\")),\"C\",\"\")","v":""},{"$f":"IF(AND(dates>=Début02, dates<=Fin_02,NOT(feries=\"F\")),\"C\",\"\")","v":""},{"$f":"IF(AND(dates>=Début02, dates<=Fin_02,NOT(feries=\"F\")),\"C\",\"\")","v":""},{"$f":"IF(AND(dates>=Début02, dates<=Fin_02,NOT(feries=\"F\")),\"C\",\"\")","v":""},{"$f":"IF(AND(dates>=Début02, dates<=Fin_02,NOT(feries=\"F\")),\"C\",\"\")","v":""},{"$f":"IF(AND(dates>=Début02, dates<=Fin_02,NOT(feries=\"F\")),\"C\",\"\")","v":""},{"$f":"IF(AND(dates>=Début02, dates<=Fin_02,NOT(feries=\"F\")),\"C\",\"\")","v":""},{"$f":"IF(AND(dates>=Début02, dates<=Fin_02,NOT(feries=\"F\")),\"C\",\"\")","v":""},{"$f":"IF(AND(dates>=Début02, dates<=Fin_02,NOT(feries=\"F\")),\"C\",\"\")","v":""},{"$f":"IF(AND(dates>=Début02, dates<=Fin_02,NOT(feries=\"F\")),\"C\",\"\")","v":""},{"$f":"IF(AND(dates>=Début02, dates<=Fin_02,NOT(feries=\"F\")),\"C\",\"\")","v":""},"2016-03-10","2016-03-15",{"$f":"NETWORKDAYS(BR9,BS9,'jours Féries 2016'!$B$1:$B$14)","v":4},4,{"$f":"IF(AND(dates>=Début03, dates<=Fin_03,NOT(feries=\"F\")),\"C\",\"\")","v":""},{"$f":"IF(AND(dates>=Début03, dates<=Fin_03,NOT(feries=\"F\")),\"C\",\"\")","v":""},{"$f":"IF(AND(dates>=Début03, dates<=Fin_03,NOT(feries=\"F\")),\"C\",\"\")","v":""},{"$f":"IF(AND(dates>=Début03, dates<=Fin_03,NOT(feries=\"F\")),\"C\",\"\")","v":""},{"$f":"IF(AND(dates>=Début03, dates<=Fin_03,NOT(feries=\"F\")),\"C\",\"\")","v":""},{"$f":"IF(AND(dates>=Début03, dates<=Fin_03,NOT(feries=\"F\")),\"C\",\"\")","v":""},{"$f":"IF(AND(dates>=Début03, dates<=Fin_03,NOT(feries=\"F\")),\"C\",\"\")","v":""},{"$f":"IF(AND(dates>=Début03, dates<=Fin_03,NOT(feries=\"F\")),\"C\",\"\")","v":""},{"$f":"IF(AND(dates>=Début03, dates<=Fin_03,NOT(feries=\"F\")),\"C\",\"\")","v":""},{"$f":"IF(AND(dates>=Début03, dates<=Fin_03,NOT(feries=\"F\")),\"C\",\"\")","v":"C"},{"$f":"IF(AND(dates>=Début03, dates<=Fin_03,NOT(feries=\"F\")),\"C\",\"\")","v":"C"},{"$f":"IF(AND(dates>=Début03, dates<=Fin_03,NOT(feries=\"F\")),\"C\",\"\")","v":""},{"$f":"IF(AND(dates>=Début03, dates<=Fin_03,NOT(feries=\"F\")),\"C\",\"\")","v":""},{"$f":"IF(AND(dates>=Début03, dates<=Fin_03,NOT(feries=\"F\")),\"C\",\"\")","v":"C"},{"$f":"IF(AND(dates>=Début03, dates<=Fin_03,NOT(feries=\"F\")),\"C\",\"\")","v":"C"},{"$f":"IF(AND(dates>=Début03, dates<=Fin_03,NOT(feries=\"F\")),\"C\",\"\")","v":""},{"$f":"IF(AND(dates>=Début03, dates<=Fin_03,NOT(feries=\"F\")),\"C\",\"\")","v":""},{"$f":"IF(AND(dates>=Début03, dates<=Fin_03,NOT(feries=\"F\")),\"C\",\"\")","v":""},{"$f":"IF(AND(dates>=Début03, dates<=Fin_03,NOT(feries=\"F\")),\"C\",\"\")","v":""},{"$f":"IF(AND(dates>=Début03, dates<=Fin_03,NOT(feries=\"F\")),\"C\",\"\")","v":""},{"$f":"IF(AND(dates>=Début03, dates<=Fin_03,NOT(feries=\"F\")),\"C\",\"\")","v":""},{"$f":"IF(AND(dates>=Début03, dates<=Fin_03,NOT(feries=\"F\")),\"C\",\"\")","v":""},{"$f":"IF(AND(dates>=Début03, dates<=Fin_03,NOT(feries=\"F\")),\"C\",\"\")","v":""},{"$f":"IF(AND(dates>=Début03, dates<=Fin_03,NOT(feries=\"F\")),\"C\",\"\")","v":""},{"$f":"IF(AND(dates>=Début03, dates<=Fin_03,NOT(feries=\"F\")),\"C\",\"\")","v":""},{"$f":"IF(AND(dates>=Début03, dates<=Fin_03,NOT(feries=\"F\")),\"C\",\"\")","v":""},{"$f":"IF(AND(dates>=Début03, dates<=Fin_03,NOT(feries=\"F\")),\"C\",\"\")","v":""},{"$f":"IF(AND(dates>=Début03, dates<=Fin_03,NOT(feries=\"F\")),\"C\",\"\")","v":""},{"$f":"IF(AND(dates>=Début03, dates<=Fin_03,NOT(feries=\"F\")),\"C\",\"\")","v":""},{"$f":"IF(AND(dates>=Début03, dates<=Fin_03,NOT(feries=\"F\")),\"C\",\"\")","v":""},{"$f":"IF(AND(dates>=Début03, dates<=Fin_03,NOT(feries=\"F\")),\"C\",\"\")","v":""},null,null,{"$f":"NETWORKDAYS(DA9,DB9,'jours Féries 2016'!$B$1:$B$14)","v":0},0,{"$f":"IF(AND(dates>=Début04, dates<=Fin_04,NOT(feries=\"F\")),\"C\",\"\")","v":""},{"$f":"IF(AND(dates>=Début04, dates<=Fin_04,NOT(feries=\"F\")),\"C\",\"\")","v":""},{"$f":"IF(AND(dates>=Début04, dates<=Fin_04,NOT(feries=\"F\")),\"C\",\"\")","v":""},{"$f":"IF(AND(dates>=Début04, dates<=Fin_04,NOT(feries=\"F\")),\"C\",\"\")","v":""},{"$f":"IF(AND(dates>=Début04, dates<=Fin_04,NOT(feries=\"F\")),\"C\",\"\")","v":""},{"$f":"IF(AND(dates>=Début04, dates<=Fin_04,NOT(feries=\"F\")),\"C\",\"\")","v":""},{"$f":"IF(AND(dates>=Début04, dates<=Fin_04,NOT(feries=\"F\")),\"C\",\"\")","v":""},{"$f":"IF(AND(dates>=Début04, dates<=Fin_04,NOT(feries=\"F\")),\"C\",\"\")","v":""},{"$f":"IF(AND(dates>=Début04, dates<=Fin_04,NOT(feries=\"F\")),\"C\",\"\")","v":""},{"$f":"IF(AND(dates>=Début04, dates<=Fin_04,NOT(feries=\"F\")),\"C\",\"\")","v":""},{"$f":"IF(AND(dates>=Début04, dates<=Fin_04,NOT(feries=\"F\")),\"C\",\"\")","v":""},{"$f":"IF(AND(dates>=Début04, dates<=Fin_04,NOT(feries=\"F\")),\"C\",\"\")","v":""},{"$f":"IF(AND(dates>=Début04, dates<=Fin_04,NOT(feries=\"F\")),\"C\",\"\")","v":""},{"$f":"IF(AND(dates>=Début04, dates<=Fin_04,NOT(feries=\"F\")),\"C\",\"\")","v":""},{"$f":"IF(AND(dates>=Début04, dates<=Fin_04,NOT(feries=\"F\")),\"C\",\"\")","v":""},{"$f":"IF(AND(dates>=Début04, dates<=Fin_04,NOT(feries=\"F\")),\"C\",\"\")","v":""},{"$f":"IF(AND(dates>=Début04, dates<=Fin_04,NOT(feries=\"F\")),\"C\",\"\")","v":""},{"$f":"IF(AND(dates>=Début04, dates<=Fin_04,NOT(feries=\"F\")),\"C\",\"\")","v":""},{"$f":"IF(AND(dates>=Début04, dates<=Fin_04,NOT(feries=\"F\")),\"C\",\"\")","v":""},{"$f":"IF(AND(dates>=Début04, dates<=Fin_04,NOT(feries=\"F\")),\"C\",\"\")","v":""},{"$f":"IF(AND(dates>=Début04, dates<=Fin_04,NOT(feries=\"F\")),\"C\",\"\")","v":""},{"$f":"IF(AND(dates>=Début04, dates<=Fin_04,NOT(feries=\"F\")),\"C\",\"\")","v":""},{"$f":"IF(AND(dates>=Début04, dates<=Fin_04,NOT(feries=\"F\")),\"C\",\"\")","v":""},{"$f":"IF(AND(dates>=Début04, dates<=Fin_04,NOT(feries=\"F\")),\"C\",\"\")","v":""},{"$f":"IF(AND(dates>=Début04, dates<=Fin_04,NOT(feries=\"F\")),\"C\",\"\")","v":""},{"$f":"IF(AND(dates>=Début04, dates<=Fin_04,NOT(feries=\"F\")),\"C\",\"\")","v":""},{"$f":"IF(AND(dates>=Début04, dates<=Fin_04,NOT(feries=\"F\")),\"C\",\"\")","v":""},{"$f":"IF(AND(dates>=Début04, dates<=Fin_04,NOT(feries=\"F\")),\"C\",\"\")","v":""},{"$f":"IF(AND(dates>=Début04, dates<=Fin_04,NOT(feries=\"F\")),\"C\",\"\")","v":""},{"$f":"IF(AND(dates>=Début04, dates<=Fin_04,NOT(feries=\"F\")),\"C\",\"\")","v":""},null,null,{"$f":"NETWORKDAYS(EI9,EJ9,'jours Féries 2016'!$B$1:$B$14)","v":0},{"$f":"COUNTIF(EM9:GD9,\"C\")","v":0},"","","","","","","","","","","","","","","","","","","","","","","","","","","","","","","",null,"","","","","","","","","","","","","","","","","","","","","","","","","","","","","","","","","","","","","","","","","","","","","","","","","","","","","","","","","","","","","","","","","","","","","","","","","","","","","","","","","","","","","","","","","","","","","","","","","","","","","","","","","","","","","","","","","","","","","","","","","","","","","","","","","","","","","","","","","","","","","","","","","","","","","","","","","","","","","","","","","","","","","","","","","","","","","","","","","","","","","","","","","","","","","","","","","","","","","","","","","","","","","","","","","","","","","",""]
["EMPLOYE4","2016-01-04","2016-01-13",{"$f":"NETWORKDAYS(B10,C10,'jours Féries 2016'!$B$1:$B$14)","v":8},8,"","","","C","C","C","C","C","","","C","C","C","","","","","","","","","","","","","","","","","","",null,null,{"$f":"NETWORKDAYS(AK10,AL10,'jours Féries 2016'!$B$1:$B$14)","v":0},0,{"$f":"IF(AND(dates>=Début02, dates<=Fin_02,NOT(feries=\"F\")),\"C\",\"\")","v":""},{"$f":"IF(AND(dates>=Début02, dates<=Fin_02,NOT(feries=\"F\")),\"C\",\"\")","v":""},{"$f":"IF(AND(dates>=Début02, dates<=Fin_02,NOT(feries=\"F\")),\"C\",\"\")","v":""},{"$f":"IF(AND(dates>=Début02, dates<=Fin_02,NOT(feries=\"F\")),\"C\",\"\")","v":""},{"$f":"IF(AND(dates>=Début02, dates<=Fin_02,NOT(feries=\"F\")),\"C\",\"\")","v":""},{"$f":"IF(AND(dates>=Début02, dates<=Fin_02,NOT(feries=\"F\")),\"C\",\"\")","v":""},{"$f":"IF(AND(dates>=Début02, dates<=Fin_02,NOT(feries=\"F\")),\"C\",\"\")","v":""},{"$f":"IF(AND(dates>=Début02, dates<=Fin_02,NOT(feries=\"F\")),\"C\",\"\")","v":""},{"$f":"IF(AND(dates>=Début02, dates<=Fin_02,NOT(feries=\"F\")),\"C\",\"\")","v":""},{"$f":"IF(AND(dates>=Début02, dates<=Fin_02,NOT(feries=\"F\")),\"C\",\"\")","v":""},{"$f":"IF(AND(dates>=Début02, dates<=Fin_02,NOT(feries=\"F\")),\"C\",\"\")","v":""},{"$f":"IF(AND(dates>=Début02, dates<=Fin_02,NOT(feries=\"F\")),\"C\",\"\")","v":""},{"$f":"IF(AND(dates>=Début02, dates<=Fin_02,NOT(feries=\"F\")),\"C\",\"\")","v":""},{"$f":"IF(AND(dates>=Début02, dates<=Fin_02,NOT(feries=\"F\")),\"C\",\"\")","v":""},{"$f":"IF(AND(dates>=Début02, dates<=Fin_02,NOT(feries=\"F\")),\"C\",\"\")","v":""},{"$f":"IF(AND(dates>=Début02, dates<=Fin_02,NOT(feries=\"F\")),\"C\",\"\")","v":""},{"$f":"IF(AND(dates>=Début02, dates<=Fin_02,NOT(feries=\"F\")),\"C\",\"\")","v":""},{"$f":"IF(AND(dates>=Début02, dates<=Fin_02,NOT(feries=\"F\")),\"C\",\"\")","v":""},{"$f":"IF(AND(dates>=Début02, dates<=Fin_02,NOT(feries=\"F\")),\"C\",\"\")","v":""},{"$f":"IF(AND(dates>=Début02, dates<=Fin_02,NOT(feries=\"F\")),\"C\",\"\")","v":""},{"$f":"IF(AND(dates>=Début02, dates<=Fin_02,NOT(feries=\"F\")),\"C\",\"\")","v":""},{"$f":"IF(AND(dates>=Début02, dates<=Fin_02,NOT(feries=\"F\")),\"C\",\"\")","v":""},{"$f":"IF(AND(dates>=Début02, dates<=Fin_02,NOT(feries=\"F\")),\"C\",\"\")","v":""},{"$f":"IF(AND(dates>=Début02, dates<=Fin_02,NOT(feries=\"F\")),\"C\",\"\")","v":""},{"$f":"IF(AND(dates>=Début02, dates<=Fin_02,NOT(feries=\"F\")),\"C\",\"\")","v":""},{"$f":"IF(AND(dates>=Début02, dates<=Fin_02,NOT(feries=\"F\")),\"C\",\"\")","v":""},{"$f":"IF(AND(dates>=Début02, dates<=Fin_02,NOT(feries=\"F\")),\"C\",\"\")","v":""},{"$f":"IF(AND(dates>=Début02, dates<=Fin_02,NOT(feries=\"F\")),\"C\",\"\")","v":""},{"$f":"IF(AND(dates>=Début02, dates<=Fin_02,NOT(feries=\"F\")),\"C\",\"\")","v":""},null,null,{"$f":"NETWORKDAYS(BR10,BS10,'jours Féries 2016'!$B$1:$B$14)","v":0},0,{"$f":"IF(AND(dates>=Début03, dates<=Fin_03,NOT(feries=\"F\")),\"C\",\"\")","v":""},{"$f":"IF(AND(dates>=Début03, dates<=Fin_03,NOT(feries=\"F\")),\"C\",\"\")","v":""},{"$f":"IF(AND(dates>=Début03, dates<=Fin_03,NOT(feries=\"F\")),\"C\",\"\")","v":""},{"$f":"IF(AND(dates>=Début03, dates<=Fin_03,NOT(feries=\"F\")),\"C\",\"\")","v":""},{"$f":"IF(AND(dates>=Début03, dates<=Fin_03,NOT(feries=\"F\")),\"C\",\"\")","v":""},{"$f":"IF(AND(dates>=Début03, dates<=Fin_03,NOT(feries=\"F\")),\"C\",\"\")","v":""},{"$f":"IF(AND(dates>=Début03, dates<=Fin_03,NOT(feries=\"F\")),\"C\",\"\")","v":""},{"$f":"IF(AND(dates>=Début03, dates<=Fin_03,NOT(feries=\"F\")),\"C\",\"\")","v":""},{"$f":"IF(AND(dates>=Début03, dates<=Fin_03,NOT(feries=\"F\")),\"C\",\"\")","v":""},{"$f":"IF(AND(dates>=Début03, dates<=Fin_03,NOT(feries=\"F\")),\"C\",\"\")","v":""},{"$f":"IF(AND(dates>=Début03, dates<=Fin_03,NOT(feries=\"F\")),\"C\",\"\")","v":""},{"$f":"IF(AND(dates>=Début03, dates<=Fin_03,NOT(feries=\"F\")),\"C\",\"\")","v":""},{"$f":"IF(AND(dates>=Début03, dates<=Fin_03,NOT(feries=\"F\")),\"C\",\"\")","v":""},{"$f":"IF(AND(dates>=Début03, dates<=Fin_03,NOT(feries=\"F\")),\"C\",\"\")","v":""},{"$f":"IF(AND(dates>=Début03, dates<=Fin_03,NOT(feries=\"F\")),\"C\",\"\")","v":""},{"$f":"IF(AND(dates>=Début03, dates<=Fin_03,NOT(feries=\"F\")),\"C\",\"\")","v":""},{"$f":"IF(AND(dates>=Début03, dates<=Fin_03,NOT(feries=\"F\")),\"C\",\"\")","v":""},{"$f":"IF(AND(dates>=Début03, dates<=Fin_03,NOT(feries=\"F\")),\"C\",\"\")","v":""},{"$f":"IF(AND(dates>=Début03, dates<=Fin_03,NOT(feries=\"F\")),\"C\",\"\")","v":""},{"$f":"IF(AND(dates>=Début03, dates<=Fin_03,NOT(feries=\"F\")),\"C\",\"\")","v":""},{"$f":"IF(AND(dates>=Début03, dates<=Fin_03,NOT(feries=\"F\")),\"C\",\"\")","v":""},{"$f":"IF(AND(dates>=Début03, dates<=Fin_03,NOT(feries=\"F\")),\"C\",\"\")","v":""},{"$f":"IF(AND(dates>=Début03, dates<=Fin_03,NOT(feries=\"F\")),\"C\",\"\")","v":""},{"$f":"IF(AND(dates>=Début03, dates<=Fin_03,NOT(feries=\"F\")),\"C\",\"\")","v":""},{"$f":"IF(AND(dates>=Début03, dates<=Fin_03,NOT(feries=\"F\")),\"C\",\"\")","v":""},{"$f":"IF(AND(dates>=Début03, dates<=Fin_03,NOT(feries=\"F\")),\"C\",\"\")","v":""},{"$f":"IF(AND(dates>=Début03, dates<=Fin_03,NOT(feries=\"F\")),\"C\",\"\")","v":""},{"$f":"IF(AND(dates>=Début03, dates<=Fin_03,NOT(feries=\"F\")),\"C\",\"\")","v":""},{"$f":"IF(AND(dates>=Début03, dates<=Fin_03,NOT(feries=\"F\")),\"C\",\"\")","v":""},{"$f":"IF(AND(dates>=Début03, dates<=Fin_03,NOT(feries=\"F\")),\"C\",\"\")","v":""},{"$f":"IF(AND(dates>=Début03, dates<=Fin_03,NOT(feries=\"F\")),\"C\",\"\")","v":""},null,null,{"$f":"NETWORKDAYS(DA10,DB10,'jours Féries 2016'!$B$1:$B$14)","v":0},0,{"$f":"IF(AND(dates>=Début04, dates<=Fin_04,NOT(feries=\"F\")),\"C\",\"\")","v":""},{"$f":"IF(AND(dates>=Début04, dates<=Fin_04,NOT(feries=\"F\")),\"C\",\"\")","v":""},{"$f":"IF(AND(dates>=Début04, dates<=Fin_04,NOT(feries=\"F\")),\"C\",\"\")","v":""},{"$f":"IF(AND(dates>=Début04, dates<=Fin_04,NOT(feries=\"F\")),\"C\",\"\")","v":""},{"$f":"IF(AND(dates>=Début04, dates<=Fin_04,NOT(feries=\"F\")),\"C\",\"\")","v":""},{"$f":"IF(AND(dates>=Début04, dates<=Fin_04,NOT(feries=\"F\")),\"C\",\"\")","v":""},{"$f":"IF(AND(dates>=Début04, dates<=Fin_04,NOT(feries=\"F\")),\"C\",\"\")","v":""},{"$f":"IF(AND(dates>=Début04, dates<=Fin_04,NOT(feries=\"F\")),\"C\",\"\")","v":""},{"$f":"IF(AND(dates>=Début04, dates<=Fin_04,NOT(feries=\"F\")),\"C\",\"\")","v":""},{"$f":"IF(AND(dates>=Début04, dates<=Fin_04,NOT(feries=\"F\")),\"C\",\"\")","v":""},{"$f":"IF(AND(dates>=Début04, dates<=Fin_04,NOT(feries=\"F\")),\"C\",\"\")","v":""},{"$f":"IF(AND(dates>=Début04, dates<=Fin_04,NOT(feries=\"F\")),\"C\",\"\")","v":""},{"$f":"IF(AND(dates>=Début04, dates<=Fin_04,NOT(feries=\"F\")),\"C\",\"\")","v":""},{"$f":"IF(AND(dates>=Début04, dates<=Fin_04,NOT(feries=\"F\")),\"C\",\"\")","v":""},{"$f":"IF(AND(dates>=Début04, dates<=Fin_04,NOT(feries=\"F\")),\"C\",\"\")","v":""},{"$f":"IF(AND(dates>=Début04, dates<=Fin_04,NOT(feries=\"F\")),\"C\",\"\")","v":""},{"$f":"IF(AND(dates>=Début04, dates<=Fin_04,NOT(feries=\"F\")),\"C\",\"\")","v":""},{"$f":"IF(AND(dates>=Début04, dates<=Fin_04,NOT(feries=\"F\")),\"C\",\"\")","v":""},{"$f":"IF(AND(dates>=Début04, dates<=Fin_04,NOT(feries=\"F\")),\"C\",\"\")","v":""},{"$f":"IF(AND(dates>=Début04, dates<=Fin_04,NOT(feries=\"F\")),\"C\",\"\")","v":""},{"$f":"IF(AND(dates>=Début04, dates<=Fin_04,NOT(feries=\"F\")),\"C\",\"\")","v":""},{"$f":"IF(AND(dates>=Début04, dates<=Fin_04,NOT(feries=\"F\")),\"C\",\"\")","v":""},{"$f":"IF(AND(dates>=Début04, dates<=Fin_04,NOT(feries=\"F\")),\"C\",\"\")","v":""},{"$f":"IF(AND(dates>=Début04, dates<=Fin_04,NOT(feries=\"F\")),\"C\",\"\")","v":""},{"$f":"IF(AND(dates>=Début04, dates<=Fin_04,NOT(feries=\"F\")),\"C\",\"\")","v":""},{"$f":"IF(AND(dates>=Début04, dates<=Fin_04,NOT(feries=\"F\")),\"C\",\"\")","v":""},{"$f":"IF(AND(dates>=Début04, dates<=Fin_04,NOT(feries=\"F\")),\"C\",\"\")","v":""},{"$f":"IF(AND(dates>=Début04, dates<=Fin_04,NOT(feries=\"F\")),\"C\",\"\")","v":""},{"$f":"IF(AND(dates>=Début04, dates<=Fin_04,NOT(feries=\"F\")),\"C\",\"\")","v":""},{"$f":"IF(AND(dates>=Début04, dates<=Fin_04,NOT(feries=\"F\")),\"C\",\"\")","v":""},null,null,{"$f":"NETWORKDAYS(EI10,EJ10,'jours Féries 2016'!$B$1:$B$14)","v":0},{"$f":"COUNTIF(EM10:GD10,\"C\")","v":0},"","","","","","","","","","","","","","","","","","","","","","","","","","","","","","","",null,"","","","","","","","","","","","","","","","","","","","","","","","","","","","","","","","","","","","","","","","","","","","","","","","","","","","","","","","","","","","","","","","","","","","","","","","","","","","","","","","","","","","","","","","","","","","","","","","","","","","","","","","","","","","","","","","","",{"$f":"IF(AND(dates>=Début01, dates<=Fin_01,NOT(feries=\"F\")),\"C\",\"\")","v":""},"","","","","","","","","","","","","","","","","","","","","","","","","","","","","","","","","","","","","","","","","","","","","","","","","","","","","","","","","","","","","","","","","","","","","","","","","","","","","","","","","","","","","","","","","","","","","","","","","","","",""]
["EMPLOYE5","2016-01-05","2016-01-14",{"$f":"NETWORKDAYS(B11,C11,'jours Féries 2016'!$B$1:$B$14)","v":8},8,"","","","","C","C","C","C","","","C","C","C","C","","","","","","","","","","","","","","","","","",null,null,{"$f":"NETWORKDAYS(AK11,AL11,'jours Féries 2016'!$B$1:$B$14)","v":0},0,{"$f":"IF(AND(dates>=Début02, dates<=Fin_02,NOT(feries=\"F\")),\"C\",\"\")","v":""},{"$f":"IF(AND(dates>=Début02, dates<=Fin_02,NOT(feries=\"F\")),\"C\",\"\")","v":""},{"$f":"IF(AND(dates>=Début02, dates<=Fin_02,NOT(feries=\"F\")),\"C\",\"\")","v":""},{"$f":"IF(AND(dates>=Début02, dates<=Fin_02,NOT(feries=\"F\")),\"C\",\"\")","v":""},{"$f":"IF(AND(dates>=Début02, dates<=Fin_02,NOT(feries=\"F\")),\"C\",\"\")","v":""},{"$f":"IF(AND(dates>=Début02, dates<=Fin_02,NOT(feries=\"F\")),\"C\",\"\")","v":""},{"$f":"IF(AND(dates>=Début02, dates<=Fin_02,NOT(feries=\"F\")),\"C\",\"\")","v":""},{"$f":"IF(AND(dates>=Début02, dates<=Fin_02,NOT(feries=\"F\")),\"C\",\"\")","v":""},{"$f":"IF(AND(dates>=Début02, dates<=Fin_02,NOT(feries=\"F\")),\"C\",\"\")","v":""},{"$f":"IF(AND(dates>=Début02, dates<=Fin_02,NOT(feries=\"F\")),\"C\",\"\")","v":""},{"$f":"IF(AND(dates>=Début02, dates<=Fin_02,NOT(feries=\"F\")),\"C\",\"\")","v":""},{"$f":"IF(AND(dates>=Début02, dates<=Fin_02,NOT(feries=\"F\")),\"C\",\"\")","v":""},{"$f":"IF(AND(dates>=Début02, dates<=Fin_02,NOT(feries=\"F\")),\"C\",\"\")","v":""},{"$f":"IF(AND(dates>=Début02, dates<=Fin_02,NOT(feries=\"F\")),\"C\",\"\")","v":""},{"$f":"IF(AND(dates>=Début02, dates<=Fin_02,NOT(feries=\"F\")),\"C\",\"\")","v":""},{"$f":"IF(AND(dates>=Début02, dates<=Fin_02,NOT(feries=\"F\")),\"C\",\"\")","v":""},{"$f":"IF(AND(dates>=Début02, dates<=Fin_02,NOT(feries=\"F\")),\"C\",\"\")","v":""},{"$f":"IF(AND(dates>=Début02, dates<=Fin_02,NOT(feries=\"F\")),\"C\",\"\")","v":""},{"$f":"IF(AND(dates>=Début02, dates<=Fin_02,NOT(feries=\"F\")),\"C\",\"\")","v":""},{"$f":"IF(AND(dates>=Début02, dates<=Fin_02,NOT(feries=\"F\")),\"C\",\"\")","v":""},{"$f":"IF(AND(dates>=Début02, dates<=Fin_02,NOT(feries=\"F\")),\"C\",\"\")","v":""},{"$f":"IF(AND(dates>=Début02, dates<=Fin_02,NOT(feries=\"F\")),\"C\",\"\")","v":""},{"$f":"IF(AND(dates>=Début02, dates<=Fin_02,NOT(feries=\"F\")),\"C\",\"\")","v":""},{"$f":"IF(AND(dates>=Début02, dates<=Fin_02,NOT(feries=\"F\")),\"C\",\"\")","v":""},{"$f":"IF(AND(dates>=Début02, dates<=Fin_02,NOT(feries=\"F\")),\"C\",\"\")","v":""},{"$f":"IF(AND(dates>=Début02, dates<=Fin_02,NOT(feries=\"F\")),\"C\",\"\")","v":""},{"$f":"IF(AND(dates>=Début02, dates<=Fin_02,NOT(feries=\"F\")),\"C\",\"\")","v":""},{"$f":"IF(AND(dates>=Début02, dates<=Fin_02,NOT(feries=\"F\")),\"C\",\"\")","v":""},{"$f":"IF(AND(dates>=Début02, dates<=Fin_02,NOT(feries=\"F\")),\"C\",\"\")","v":""},null,null,{"$f":"NETWORKDAYS(BR11,BS11,'jours Féries 2016'!$B$1:$B$14)","v":0},0,{"$f":"IF(AND(dates>=Début03, dates<=Fin_03,NOT(feries=\"F\")),\"C\",\"\")","v":""},{"$f":"IF(AND(dates>=Début03, dates<=Fin_03,NOT(feries=\"F\")),\"C\",\"\")","v":""},{"$f":"IF(AND(dates>=Début03, dates<=Fin_03,NOT(feries=\"F\")),\"C\",\"\")","v":""},{"$f":"IF(AND(dates>=Début03, dates<=Fin_03,NOT(feries=\"F\")),\"C\",\"\")","v":""},{"$f":"IF(AND(dates>=Début03, dates<=Fin_03,NOT(feries=\"F\")),\"C\",\"\")","v":""},{"$f":"IF(AND(dates>=Début03, dates<=Fin_03,NOT(feries=\"F\")),\"C\",\"\")","v":""},{"$f":"IF(AND(dates>=Début03, dates<=Fin_03,NOT(feries=\"F\")),\"C\",\"\")","v":""},{"$f":"IF(AND(dates>=Début03, dates<=Fin_03,NOT(feries=\"F\")),\"C\",\"\")","v":""},{"$f":"IF(AND(dates>=Début03, dates<=Fin_03,NOT(feries=\"F\")),\"C\",\"\")","v":""},{"$f":"IF(AND(dates>=Début03, dates<=Fin_03,NOT(feries=\"F\")),\"C\",\"\")","v":""},{"$f":"IF(AND(dates>=Début03, dates<=Fin_03,NOT(feries=\"F\")),\"C\",\"\")","v":""},{"$f":"IF(AND(dates>=Début03, dates<=Fin_03,NOT(feries=\"F\")),\"C\",\"\")","v":""},{"$f":"IF(AND(dates>=Début03, dates<=Fin_03,NOT(feries=\"F\")),\"C\",\"\")","v":""},{"$f":"IF(AND(dates>=Début03, dates<=Fin_03,NOT(feries=\"F\")),\"C\",\"\")","v":""},{"$f":"IF(AND(dates>=Début03, dates<=Fin_03,NOT(feries=\"F\")),\"C\",\"\")","v":""},{"$f":"IF(AND(dates>=Début03, dates<=Fin_03,NOT(feries=\"F\")),\"C\",\"\")","v":""},{"$f":"IF(AND(dates>=Début03, dates<=Fin_03,NOT(feries=\"F\")),\"C\",\"\")","v":""},{"$f":"IF(AND(dates>=Début03, dates<=Fin_03,NOT(feries=\"F\")),\"C\",\"\")","v":""},{"$f":"IF(AND(dates>=Début03, dates<=Fin_03,NOT(feries=\"F\")),\"C\",\"\")","v":""},{"$f":"IF(AND(dates>=Début03, dates<=Fin_03,NOT(feries=\"F\")),\"C\",\"\")","v":""},{"$f":"IF(AND(dates>=Début03, dates<=Fin_03,NOT(feries=\"F\")),\"C\",\"\")","v":""},{"$f":"IF(AND(dates>=Début03, dates<=Fin_03,NOT(feries=\"F\")),\"C\",\"\")","v":""},{"$f":"IF(AND(dates>=Début03, dates<=Fin_03,NOT(feries=\"F\")),\"C\",\"\")","v":""},{"$f":"IF(AND(dates>=Début03, dates<=Fin_03,NOT(feries=\"F\")),\"C\",\"\")","v":""},{"$f":"IF(AND(dates>=Début03, dates<=Fin_03,NOT(feries=\"F\")),\"C\",\"\")","v":""},{"$f":"IF(AND(dates>=Début03, dates<=Fin_03,NOT(feries=\"F\")),\"C\",\"\")","v":""},{"$f":"IF(AND(dates>=Début03, dates<=Fin_03,NOT(feries=\"F\")),\"C\",\"\")","v":""},{"$f":"IF(AND(dates>=Début03, dates<=Fin_03,NOT(feries=\"F\")),\"C\",\"\")","v":""},{"$f":"IF(AND(dates>=Début03, dates<=Fin_03,NOT(feries=\"F\")),\"C\",\"\")","v":""},{"$f":"IF(AND(dates>=Début03, dates<=Fin_03,NOT(feries=\"F\")),\"C\",\"\")","v":""},{"$f":"IF(AND(dates>=Début03, dates<=Fin_03,NOT(feries=\"F\")),\"C\",\"\")","v":""},null,null,{"$f":"NETWORKDAYS(DA11,DB11,'jours Féries 2016'!$B$1:$B$14)","v":0},0,{"$f":"IF(AND(dates>=Début04, dates<=Fin_04,NOT(feries=\"F\")),\"C\",\"\")","v":""},{"$f":"IF(AND(dates>=Début04, dates<=Fin_04,NOT(feries=\"F\")),\"C\",\"\")","v":""},{"$f":"IF(AND(dates>=Début04, dates<=Fin_04,NOT(feries=\"F\")),\"C\",\"\")","v":""},{"$f":"IF(AND(dates>=Début04, dates<=Fin_04,NOT(feries=\"F\")),\"C\",\"\")","v":""},{"$f":"IF(AND(dates>=Début04, dates<=Fin_04,NOT(feries=\"F\")),\"C\",\"\")","v":""},{"$f":"IF(AND(dates>=Début04, dates<=Fin_04,NOT(feries=\"F\")),\"C\",\"\")","v":""},{"$f":"IF(AND(dates>=Début04, dates<=Fin_04,NOT(feries=\"F\")),\"C\",\"\")","v":""},{"$f":"IF(AND(dates>=Début04, dates<=Fin_04,NOT(feries=\"F\")),\"C\",\"\")","v":""},{"$f":"IF(AND(dates>=Début04, dates<=Fin_04,NOT(feries=\"F\")),\"C\",\"\")","v":""},{"$f":"IF(AND(dates>=Début04, dates<=Fin_04,NOT(feries=\"F\")),\"C\",\"\")","v":""},{"$f":"IF(AND(dates>=Début04, dates<=Fin_04,NOT(feries=\"F\")),\"C\",\"\")","v":""},{"$f":"IF(AND(dates>=Début04, dates<=Fin_04,NOT(feries=\"F\")),\"C\",\"\")","v":""},{"$f":"IF(AND(dates>=Début04, dates<=Fin_04,NOT(feries=\"F\")),\"C\",\"\")","v":""},{"$f":"IF(AND(dates>=Début04, dates<=Fin_04,NOT(feries=\"F\")),\"C\",\"\")","v":""},{"$f":"IF(AND(dates>=Début04, dates<=Fin_04,NOT(feries=\"F\")),\"C\",\"\")","v":""},{"$f":"IF(AND(dates>=Début04, dates<=Fin_04,NOT(feries=\"F\")),\"C\",\"\")","v":""},{"$f":"IF(AND(dates>=Début04, dates<=Fin_04,NOT(feries=\"F\")),\"C\",\"\")","v":""},{"$f":"IF(AND(dates>=Début04, dates<=Fin_04,NOT(feries=\"F\")),\"C\",\"\")","v":""},{"$f":"IF(AND(dates>=Début04, dates<=Fin_04,NOT(feries=\"F\")),\"C\",\"\")","v":""},{"$f":"IF(AND(dates>=Début04, dates<=Fin_04,NOT(feries=\"F\")),\"C\",\"\")","v":""},{"$f":"IF(AND(dates>=Début04, dates<=Fin_04,NOT(feries=\"F\")),\"C\",\"\")","v":""},{"$f":"IF(AND(dates>=Début04, dates<=Fin_04,NOT(feries=\"F\")),\"C\",\"\")","v":""},{"$f":"IF(AND(dates>=Début04, dates<=Fin_04,NOT(feries=\"F\")),\"C\",\"\")","v":""},{"$f":"IF(AND(dates>=Début04, dates<=Fin_04,NOT(feries=\"F\")),\"C\",\"\")","v":""},{"$f":"IF(AND(dates>=Début04, dates<=Fin_04,NOT(feries=\"F\")),\"C\",\"\")","v":""},{"$f":"IF(AND(dates>=Début04, dates<=Fin_04,NOT(feries=\"F\")),\"C\",\"\")","v":""},{"$f":"IF(AND(dates>=Début04, dates<=Fin_04,NOT(feries=\"F\")),\"C\",\"\")","v":""},{"$f":"IF(AND(dates>=Début04, dates<=Fin_04,NOT(feries=\"F\")),\"C\",\"\")","v":""},{"$f":"IF(AND(dates>=Début04, dates<=Fin_04,NOT(feries=\"F\")),\"C\",\"\")","v":""},{"$f":"IF(AND(dates>=Début04, dates<=Fin_04,NOT(feries=\"F\")),\"C\",\"\")","v":""},null,null,{"$f":"NETWORKDAYS(EI11,EJ11,'jours Féries 2016'!$B$1:$B$14)","v":0},{"$f":"COUNTIF(EM11:GD11,\"C\")","v":0},{"$f":"IF(AND(dates>=Début01, dates<=Fin_01,NOT(feries=\"F\")),\"C\",\"\")","v":""},"","","","","","","","","","","","","","","","","","","","","","","","","","","","","","",null,"","","","","","","","","","","","","","","","","","","","","","","","","","","","","","","","","","","","","","","","","","","","","","","","","","",{"$f":"IF(AND(dates>=Début01, dates<=Fin_01,NOT(feries=\"F\")),\"C\",\"\")","v":""},"","","","","","","","","","","","","","","","","","","","","","","","","","","","","","","","","","","","","","","","","","","","","","","","","","","","","","","","","","","","","","","","","","","","","","","","","","","","","","","","","","","","","","","","","","","","","","","","","","","","","","","","","","","","","","","","","","","","","","","","","","","","","","","","","","","","","","","","","","","","","","","","","","","","","","","","","","","","","","","","","","",""]
["EMPLOYE6","2016-01-06","2016-01-15",{"$f":"NETWORKDAYS(B12,C12,'jours Féries 2016'!$B$1:$B$14)","v":8},8,"","","","","","C","C","C","","","C","C","C","C","C","","","","","","","","","","","","","","","","",null,null,{"$f":"NETWORKDAYS(AK12,AL12,'jours Féries 2016'!$B$1:$B$14)","v":0},0,{"$f":"IF(AND(dates>=Début02, dates<=Fin_02,NOT(feries=\"F\")),\"C\",\"\")","v":""},{"$f":"IF(AND(dates>=Début02, dates<=Fin_02,NOT(feries=\"F\")),\"C\",\"\")","v":""},{"$f":"IF(AND(dates>=Début02, dates<=Fin_02,NOT(feries=\"F\")),\"C\",\"\")","v":""},{"$f":"IF(AND(dates>=Début02, dates<=Fin_02,NOT(feries=\"F\")),\"C\",\"\")","v":""},{"$f":"IF(AND(dates>=Début02, dates<=Fin_02,NOT(feries=\"F\")),\"C\",\"\")","v":""},{"$f":"IF(AND(dates>=Début02, dates<=Fin_02,NOT(feries=\"F\")),\"C\",\"\")","v":""},{"$f":"IF(AND(dates>=Début02, dates<=Fin_02,NOT(feries=\"F\")),\"C\",\"\")","v":""},{"$f":"IF(AND(dates>=Début02, dates<=Fin_02,NOT(feries=\"F\")),\"C\",\"\")","v":""},{"$f":"IF(AND(dates>=Début02, dates<=Fin_02,NOT(feries=\"F\")),\"C\",\"\")","v":""},{"$f":"IF(AND(dates>=Début02, dates<=Fin_02,NOT(feries=\"F\")),\"C\",\"\")","v":""},{"$f":"IF(AND(dates>=Début02, dates<=Fin_02,NOT(feries=\"F\")),\"C\",\"\")","v":""},{"$f":"IF(AND(dates>=Début02, dates<=Fin_02,NOT(feries=\"F\")),\"C\",\"\")","v":""},{"$f":"IF(AND(dates>=Début02, dates<=Fin_02,NOT(feries=\"F\")),\"C\",\"\")","v":""},{"$f":"IF(AND(dates>=Début02, dates<=Fin_02,NOT(feries=\"F\")),\"C\",\"\")","v":""},{"$f":"IF(AND(dates>=Début02, dates<=Fin_02,NOT(feries=\"F\")),\"C\",\"\")","v":""},{"$f":"IF(AND(dates>=Début02, dates<=Fin_02,NOT(feries=\"F\")),\"C\",\"\")","v":""},{"$f":"IF(AND(dates>=Début02, dates<=Fin_02,NOT(feries=\"F\")),\"C\",\"\")","v":""},{"$f":"IF(AND(dates>=Début02, dates<=Fin_02,NOT(feries=\"F\")),\"C\",\"\")","v":""},{"$f":"IF(AND(dates>=Début02, dates<=Fin_02,NOT(feries=\"F\")),\"C\",\"\")","v":""},{"$f":"IF(AND(dates>=Début02, dates<=Fin_02,NOT(feries=\"F\")),\"C\",\"\")","v":""},{"$f":"IF(AND(dates>=Début02, dates<=Fin_02,NOT(feries=\"F\")),\"C\",\"\")","v":""},{"$f":"IF(AND(dates>=Début02, dates<=Fin_02,NOT(feries=\"F\")),\"C\",\"\")","v":""},{"$f":"IF(AND(dates>=Début02, dates<=Fin_02,NOT(feries=\"F\")),\"C\",\"\")","v":""},{"$f":"IF(AND(dates>=Début02, dates<=Fin_02,NOT(feries=\"F\")),\"C\",\"\")","v":""},{"$f":"IF(AND(dates>=Début02, dates<=Fin_02,NOT(feries=\"F\")),\"C\",\"\")","v":""},{"$f":"IF(AND(dates>=Début02, dates<=Fin_02,NOT(feries=\"F\")),\"C\",\"\")","v":""},{"$f":"IF(AND(dates>=Début02, dates<=Fin_02,NOT(feries=\"F\")),\"C\",\"\")","v":""},{"$f":"IF(AND(dates>=Début02, dates<=Fin_02,NOT(feries=\"F\")),\"C\",\"\")","v":""},{"$f":"IF(AND(dates>=Début02, dates<=Fin_02,NOT(feries=\"F\")),\"C\",\"\")","v":""},null,null,{"$f":"NETWORKDAYS(BR12,BS12,'jours Féries 2016'!$B$1:$B$14)","v":0},0,{"$f":"IF(AND(dates>=Début03, dates<=Fin_03,NOT(feries=\"F\")),\"C\",\"\")","v":""},{"$f":"IF(AND(dates>=Début03, dates<=Fin_03,NOT(feries=\"F\")),\"C\",\"\")","v":""},{"$f":"IF(AND(dates>=Début03, dates<=Fin_03,NOT(feries=\"F\")),\"C\",\"\")","v":""},{"$f":"IF(AND(dates>=Début03, dates<=Fin_03,NOT(feries=\"F\")),\"C\",\"\")","v":""},{"$f":"IF(AND(dates>=Début03, dates<=Fin_03,NOT(feries=\"F\")),\"C\",\"\")","v":""},{"$f":"IF(AND(dates>=Début03, dates<=Fin_03,NOT(feries=\"F\")),\"C\",\"\")","v":""},{"$f":"IF(AND(dates>=Début03, dates<=Fin_03,NOT(feries=\"F\")),\"C\",\"\")","v":""},{"$f":"IF(AND(dates>=Début03, dates<=Fin_03,NOT(feries=\"F\")),\"C\",\"\")","v":""},{"$f":"IF(AND(dates>=Début03, dates<=Fin_03,NOT(feries=\"F\")),\"C\",\"\")","v":""},{"$f":"IF(AND(dates>=Début03, dates<=Fin_03,NOT(feries=\"F\")),\"C\",\"\")","v":""},{"$f":"IF(AND(dates>=Début03, dates<=Fin_03,NOT(feries=\"F\")),\"C\",\"\")","v":""},{"$f":"IF(AND(dates>=Début03, dates<=Fin_03,NOT(feries=\"F\")),\"C\",\"\")","v":""},{"$f":"IF(AND(dates>=Début03, dates<=Fin_03,NOT(feries=\"F\")),\"C\",\"\")","v":""},{"$f":"IF(AND(dates>=Début03, dates<=Fin_03,NOT(feries=\"F\")),\"C\",\"\")","v":""},{"$f":"IF(AND(dates>=Début03, dates<=Fin_03,NOT(feries=\"F\")),\"C\",\"\")","v":""},{"$f":"IF(AND(dates>=Début03, dates<=Fin_03,NOT(feries=\"F\")),\"C\",\"\")","v":""},{"$f":"IF(AND(dates>=Début03, dates<=Fin_03,NOT(feries=\"F\")),\"C\",\"\")","v":""},{"$f":"IF(AND(dates>=Début03, dates<=Fin_03,NOT(feries=\"F\")),\"C\",\"\")","v":""},{"$f":"IF(AND(dates>=Début03, dates<=Fin_03,NOT(feries=\"F\")),\"C\",\"\")","v":""},{"$f":"IF(AND(dates>=Début03, dates<=Fin_03,NOT(feries=\"F\")),\"C\",\"\")","v":""},{"$f":"IF(AND(dates>=Début03, dates<=Fin_03,NOT(feries=\"F\")),\"C\",\"\")","v":""},{"$f":"IF(AND(dates>=Début03, dates<=Fin_03,NOT(feries=\"F\")),\"C\",\"\")","v":""},{"$f":"IF(AND(dates>=Début03, dates<=Fin_03,NOT(feries=\"F\")),\"C\",\"\")","v":""},{"$f":"IF(AND(dates>=Début03, dates<=Fin_03,NOT(feries=\"F\")),\"C\",\"\")","v":""},{"$f":"IF(AND(dates>=Début03, dates<=Fin_03,NOT(feries=\"F\")),\"C\",\"\")","v":""},{"$f":"IF(AND(dates>=Début03, dates<=Fin_03,NOT(feries=\"F\")),\"C\",\"\")","v":""},{"$f":"IF(AND(dates>=Début03, dates<=Fin_03,NOT(feries=\"F\")),\"C\",\"\")","v":""},{"$f":"IF(AND(dates>=Début03, dates<=Fin_03,NOT(feries=\"F\")),\"C\",\"\")","v":""},{"$f":"IF(AND(dates>=Début03, dates<=Fin_03,NOT(feries=\"F\")),\"C\",\"\")","v":""},{"$f":"IF(AND(dates>=Début03, dates<=Fin_03,NOT(feries=\"F\")),\"C\",\"\")","v":""},{"$f":"IF(AND(dates>=Début03, dates<=Fin_03,NOT(feries=\"F\")),\"C\",\"\")","v":""},"2016-04-04","2016-04-18",{"$f":"NETWORKDAYS(DA12,DB12,'jours Féries 2016'!$B$1:$B$14)","v":11},11,{"$f":"IF(AND(dates>=Début04, dates<=Fin_04,NOT(feries=\"F\")),\"C\",\"\")","v":""},{"$f":"IF(AND(dates>=Début04, dates<=Fin_04,NOT(feries=\"F\")),\"C\",\"\")","v":""},{"$f":"IF(AND(dates>=Début04, dates<=Fin_04,NOT(feries=\"F\")),\"C\",\"\")","v":""},{"$f":"IF(AND(dates>=Début04, dates<=Fin_04,NOT(feries=\"F\")),\"C\",\"\")","v":"C"},{"$f":"IF(AND(dates>=Début04, dates<=Fin_04,NOT(feries=\"F\")),\"C\",\"\")","v":"C"},{"$f":"IF(AND(dates>=Début04, dates<=Fin_04,NOT(feries=\"F\")),\"C\",\"\")","v":"C"},{"$f":"IF(AND(dates>=Début04, dates<=Fin_04,NOT(feries=\"F\")),\"C\",\"\")","v":"C"},{"$f":"IF(AND(dates>=Début04, dates<=Fin_04,NOT(feries=\"F\")),\"C\",\"\")","v":"C"},{"$f":"IF(AND(dates>=Début04, dates<=Fin_04,NOT(feries=\"F\")),\"C\",\"\")","v":""},{"$f":"IF(AND(dates>=Début04, dates<=Fin_04,NOT(feries=\"F\")),\"C\",\"\")","v":""},{"$f":"IF(AND(dates>=Début04, dates<=Fin_04,NOT(feries=\"F\")),\"C\",\"\")","v":"C"},{"$f":"IF(AND(dates>=Début04, dates<=Fin_04,NOT(feries=\"F\")),\"C\",\"\")","v":"C"},{"$f":"IF(AND(dates>=Début04, dates<=Fin_04,NOT(feries=\"F\")),\"C\",\"\")","v":"C"},{"$f":"IF(AND(dates>=Début04, dates<=Fin_04,NOT(feries=\"F\")),\"C\",\"\")","v":"C"},{"$f":"IF(AND(dates>=Début04, dates<=Fin_04,NOT(feries=\"F\")),\"C\",\"\")","v":"C"},{"$f":"IF(AND(dates>=Début04, dates<=Fin_04,NOT(feries=\"F\")),\"C\",\"\")","v":""},{"$f":"IF(AND(dates>=Début04, dates<=Fin_04,NOT(feries=\"F\")),\"C\",\"\")","v":""},{"$f":"IF(AND(dates>=Début04, dates<=Fin_04,NOT(feries=\"F\")),\"C\",\"\")","v":"C"},{"$f":"IF(AND(dates>=Début04, dates<=Fin_04,NOT(feries=\"F\")),\"C\",\"\")","v":""},{"$f":"IF(AND(dates>=Début04, dates<=Fin_04,NOT(feries=\"F\")),\"C\",\"\")","v":""},{"$f":"IF(AND(dates>=Début04, dates<=Fin_04,NOT(feries=\"F\")),\"C\",\"\")","v":""},{"$f":"IF(AND(dates>=Début04, dates<=Fin_04,NOT(feries=\"F\")),\"C\",\"\")","v":""},{"$f":"IF(AND(dates>=Début04, dates<=Fin_04,NOT(feries=\"F\")),\"C\",\"\")","v":""},{"$f":"IF(AND(dates>=Début04, dates<=Fin_04,NOT(feries=\"F\")),\"C\",\"\")","v":""},{"$f":"IF(AND(dates>=Début04, dates<=Fin_04,NOT(feries=\"F\")),\"C\",\"\")","v":""},{"$f":"IF(AND(dates>=Début04, dates<=Fin_04,NOT(feries=\"F\")),\"C\",\"\")","v":""},{"$f":"IF(AND(dates>=Début04, dates<=Fin_04,NOT(feries=\"F\")),\"C\",\"\")","v":""},{"$f":"IF(AND(dates>=Début04, dates<=Fin_04,NOT(feries=\"F\")),\"C\",\"\")","v":""},{"$f":"IF(AND(dates>=Début04, dates<=Fin_04,NOT(feries=\"F\")),\"C\",\"\")","v":""},{"$f":"IF(AND(dates>=Début04, dates<=Fin_04,NOT(feries=\"F\")),\"C\",\"\")","v":""},null,null,{"$f":"NETWORKDAYS(EI12,EJ12,'jours Féries 2016'!$B$1:$B$14)","v":0},{"$f":"COUNTIF(EM12:GD12,\"C\")","v":0},"","","","","","",{"$f":"IF(AND(dates>=Début01, dates<=Fin_01,NOT(feries=\"F\")),\"C\",\"\")","v":""},"","","","","","","","","","","","","","","","","","","","","","","","",null,"","","","","","","","","","","","","","","","","","","","","","","","","","","","","","","","","","","","","","","","","","","","","","","","","","","","","","","","","","","","","","","","","","","","","","","","","","","","","","","","","","","","","","","","","","","","","","","","","","","","","","","","","","","","","","","","","","","","","","","","","","","","","","","","","","","","","","","","","","","","","","","","","","","","","","","","","","","","","","","","","","","","","","","","","","","","","","","","","","","","","","","","","","","","","","","","","","","","","","","","","","","","","","","","","","","","","",""]
["EMPLOYE7","2016-01-07","2016-01-16",{"$f":"NETWORKDAYS(B13,C13,'jours Féries 2016'!$B$1:$B$14)","v":7},7,"","","","","","","C","C","","","C","C","C","C","C","","","","","","","","","","","","","","","","",null,null,{"$f":"NETWORKDAYS(AK13,AL13,'jours Féries 2016'!$B$1:$B$14)","v":0},0,{"$f":"IF(AND(dates>=Début02, dates<=Fin_02,NOT(feries=\"F\")),\"C\",\"\")","v":""},{"$f":"IF(AND(dates>=Début02, dates<=Fin_02,NOT(feries=\"F\")),\"C\",\"\")","v":""},{"$f":"IF(AND(dates>=Début02, dates<=Fin_02,NOT(feries=\"F\")),\"C\",\"\")","v":""},{"$f":"IF(AND(dates>=Début02, dates<=Fin_02,NOT(feries=\"F\")),\"C\",\"\")","v":""},{"$f":"IF(AND(dates>=Début02, dates<=Fin_02,NOT(feries=\"F\")),\"C\",\"\")","v":""},{"$f":"IF(AND(dates>=Début02, dates<=Fin_02,NOT(feries=\"F\")),\"C\",\"\")","v":""},{"$f":"IF(AND(dates>=Début02, dates<=Fin_02,NOT(feries=\"F\")),\"C\",\"\")","v":""},{"$f":"IF(AND(dates>=Début02, dates<=Fin_02,NOT(feries=\"F\")),\"C\",\"\")","v":""},{"$f":"IF(AND(dates>=Début02, dates<=Fin_02,NOT(feries=\"F\")),\"C\",\"\")","v":""},{"$f":"IF(AND(dates>=Début02, dates<=Fin_02,NOT(feries=\"F\")),\"C\",\"\")","v":""},{"$f":"IF(AND(dates>=Début02, dates<=Fin_02,NOT(feries=\"F\")),\"C\",\"\")","v":""},{"$f":"IF(AND(dates>=Début02, dates<=Fin_02,NOT(feries=\"F\")),\"C\",\"\")","v":""},{"$f":"IF(AND(dates>=Début02, dates<=Fin_02,NOT(feries=\"F\")),\"C\",\"\")","v":""},{"$f":"IF(AND(dates>=Début02, dates<=Fin_02,NOT(feries=\"F\")),\"C\",\"\")","v":""},{"$f":"IF(AND(dates>=Début02, dates<=Fin_02,NOT(feries=\"F\")),\"C\",\"\")","v":""},{"$f":"IF(AND(dates>=Début02, dates<=Fin_02,NOT(feries=\"F\")),\"C\",\"\")","v":""},{"$f":"IF(AND(dates>=Début02, dates<=Fin_02,NOT(feries=\"F\")),\"C\",\"\")","v":""},{"$f":"IF(AND(dates>=Début02, dates<=Fin_02,NOT(feries=\"F\")),\"C\",\"\")","v":""},{"$f":"IF(AND(dates>=Début02, dates<=Fin_02,NOT(feries=\"F\")),\"C\",\"\")","v":""},{"$f":"IF(AND(dates>=Début02, dates<=Fin_02,NOT(feries=\"F\")),\"C\",\"\")","v":""},{"$f":"IF(AND(dates>=Début02, dates<=Fin_02,NOT(feries=\"F\")),\"C\",\"\")","v":""},{"$f":"IF(AND(dates>=Début02, dates<=Fin_02,NOT(feries=\"F\")),\"C\",\"\")","v":""},{"$f":"IF(AND(dates>=Début02, dates<=Fin_02,NOT(feries=\"F\")),\"C\",\"\")","v":""},{"$f":"IF(AND(dates>=Début02, dates<=Fin_02,NOT(feries=\"F\")),\"C\",\"\")","v":""},{"$f":"IF(AND(dates>=Début02, dates<=Fin_02,NOT(feries=\"F\")),\"C\",\"\")","v":""},{"$f":"IF(AND(dates>=Début02, dates<=Fin_02,NOT(feries=\"F\")),\"C\",\"\")","v":""},{"$f":"IF(AND(dates>=Début02, dates<=Fin_02,NOT(feries=\"F\")),\"C\",\"\")","v":""},{"$f":"IF(AND(dates>=Début02, dates<=Fin_02,NOT(feries=\"F\")),\"C\",\"\")","v":""},{"$f":"IF(AND(dates>=Début02, dates<=Fin_02,NOT(feries=\"F\")),\"C\",\"\")","v":""},null,null,{"$f":"NETWORKDAYS(BR13,BS13,'jours Féries 2016'!$B$1:$B$14)","v":0},0,{"$f":"IF(AND(dates>=Début03, dates<=Fin_03,NOT(feries=\"F\")),\"C\",\"\")","v":""},{"$f":"IF(AND(dates>=Début03, dates<=Fin_03,NOT(feries=\"F\")),\"C\",\"\")","v":""},{"$f":"IF(AND(dates>=Début03, dates<=Fin_03,NOT(feries=\"F\")),\"C\",\"\")","v":""},{"$f":"IF(AND(dates>=Début03, dates<=Fin_03,NOT(feries=\"F\")),\"C\",\"\")","v":""},{"$f":"IF(AND(dates>=Début03, dates<=Fin_03,NOT(feries=\"F\")),\"C\",\"\")","v":""},{"$f":"IF(AND(dates>=Début03, dates<=Fin_03,NOT(feries=\"F\")),\"C\",\"\")","v":""},{"$f":"IF(AND(dates>=Début03, dates<=Fin_03,NOT(feries=\"F\")),\"C\",\"\")","v":""},{"$f":"IF(AND(dates>=Début03, dates<=Fin_03,NOT(feries=\"F\")),\"C\",\"\")","v":""},{"$f":"IF(AND(dates>=Début03, dates<=Fin_03,NOT(feries=\"F\")),\"C\",\"\")","v":""},{"$f":"IF(AND(dates>=Début03, dates<=Fin_03,NOT(feries=\"F\")),\"C\",\"\")","v":""},{"$f":"IF(AND(dates>=Début03, dates<=Fin_03,NOT(feries=\"F\")),\"C\",\"\")","v":""},{"$f":"IF(AND(dates>=Début03, dates<=Fin_03,NOT(feries=\"F\")),\"C\",\"\")","v":""},{"$f":"IF(AND(dates>=Début03, dates<=Fin_03,NOT(feries=\"F\")),\"C\",\"\")","v":""},{"$f":"IF(AND(dates>=Début03, dates<=Fin_03,NOT(feries=\"F\")),\"C\",\"\")","v":""},{"$f":"IF(AND(dates>=Début03, dates<=Fin_03,NOT(feries=\"F\")),\"C\",\"\")","v":""},{"$f":"IF(AND(dates>=Début03, dates<=Fin_03,NOT(feries=\"F\")),\"C\",\"\")","v":""},{"$f":"IF(AND(dates>=Début03, dates<=Fin_03,NOT(feries=\"F\")),\"C\",\"\")","v":""},{"$f":"IF(AND(dates>=Début03, dates<=Fin_03,NOT(feries=\"F\")),\"C\",\"\")","v":""},{"$f":"IF(AND(dates>=Début03, dates<=Fin_03,NOT(feries=\"F\")),\"C\",\"\")","v":""},{"$f":"IF(AND(dates>=Début03, dates<=Fin_03,NOT(feries=\"F\")),\"C\",\"\")","v":""},{"$f":"IF(AND(dates>=Début03, dates<=Fin_03,NOT(feries=\"F\")),\"C\",\"\")","v":""},{"$f":"IF(AND(dates>=Début03, dates<=Fin_03,NOT(feries=\"F\")),\"C\",\"\")","v":""},{"$f":"IF(AND(dates>=Début03, dates<=Fin_03,NOT(feries=\"F\")),\"C\",\"\")","v":""},{"$f":"IF(AND(dates>=Début03, dates<=Fin_03,NOT(feries=\"F\")),\"C\",\"\")","v":""},{"$f":"IF(AND(dates>=Début03, dates<=Fin_03,NOT(feries=\"F\")),\"C\",\"\")","v":""},{"$f":"IF(AND(dates>=Début03, dates<=Fin_03,NOT(feries=\"F\")),\"C\",\"\")","v":""},{"$f":"IF(AND(dates>=Début03, dates<=Fin_03,NOT(feries=\"F\")),\"C\",\"\")","v":""},{"$f":"IF(AND(dates>=Début03, dates<=Fin_03,NOT(feries=\"F\")),\"C\",\"\")","v":""},{"$f":"IF(AND(dates>=Début03, dates<=Fin_03,NOT(feries=\"F\")),\"C\",\"\")","v":""},{"$f":"IF(AND(dates>=Début03, dates<=Fin_03,NOT(feries=\"F\")),\"C\",\"\")","v":""},{"$f":"IF(AND(dates>=Début03, dates<=Fin_03,NOT(feries=\"F\")),\"C\",\"\")","v":""},null,null,{"$f":"NETWORKDAYS(DA13,DB13,'jours Féries 2016'!$B$1:$B$14)","v":0},0,{"$f":"IF(AND(dates>=Début04, dates<=Fin_04,NOT(feries=\"F\")),\"C\",\"\")","v":""},{"$f":"IF(AND(dates>=Début04, dates<=Fin_04,NOT(feries=\"F\")),\"C\",\"\")","v":""},{"$f":"IF(AND(dates>=Début04, dates<=Fin_04,NOT(feries=\"F\")),\"C\",\"\")","v":""},{"$f":"IF(AND(dates>=Début04, dates<=Fin_04,NOT(feries=\"F\")),\"C\",\"\")","v":""},{"$f":"IF(AND(dates>=Début04, dates<=Fin_04,NOT(feries=\"F\")),\"C\",\"\")","v":""},{"$f":"IF(AND(dates>=Début04, dates<=Fin_04,NOT(feries=\"F\")),\"C\",\"\")","v":""},{"$f":"IF(AND(dates>=Début04, dates<=Fin_04,NOT(feries=\"F\")),\"C\",\"\")","v":""},{"$f":"IF(AND(dates>=Début04, dates<=Fin_04,NOT(feries=\"F\")),\"C\",\"\")","v":""},{"$f":"IF(AND(dates>=Début04, dates<=Fin_04,NOT(feries=\"F\")),\"C\",\"\")","v":""},{"$f":"IF(AND(dates>=Début04, dates<=Fin_04,NOT(feries=\"F\")),\"C\",\"\")","v":""},{"$f":"IF(AND(dates>=Début04, dates<=Fin_04,NOT(feries=\"F\")),\"C\",\"\")","v":""},{"$f":"IF(AND(dates>=Début04, dates<=Fin_04,NOT(feries=\"F\")),\"C\",\"\")","v":""},{"$f":"IF(AND(dates>=Début04, dates<=Fin_04,NOT(feries=\"F\")),\"C\",\"\")","v":""},{"$f":"IF(AND(dates>=Début04, dates<=Fin_04,NOT(feries=\"F\")),\"C\",\"\")","v":""},{"$f":"IF(AND(dates>=Début04, dates<=Fin_04,NOT(feries=\"F\")),\"C\",\"\")","v":""},{"$f":"IF(AND(dates>=Début04, dates<=Fin_04,NOT(feries=\"F\")),\"C\",\"\")","v":""},{"$f":"IF(AND(dates>=Début04, dates<=Fin_04,NOT(feries=\"F\")),\"C\",\"\")","v":""},{"$f":"IF(AND(dates>=Début04, dates<=Fin_04,NOT(feries=\"F\")),\"C\",\"\")","v":""},{"$f":"IF(AND(dates>=Début04, dates<=Fin_04,NOT(feries=\"F\")),\"C\",\"\")","v":""},{"$f":"IF(AND(dates>=Début04, dates<=Fin_04,NOT(feries=\"F\")),\"C\",\"\")","v":""},{"$f":"IF(AND(dates>=Début04, dates<=Fin_04,NOT(feries=\"F\")),\"C\",\"\")","v":""},{"$f":"IF(AND(dates>=Début04, dates<=Fin_04,NOT(feries=\"F\")),\"C\",\"\")","v":""},{"$f":"IF(AND(dates>=Début04, dates<=Fin_04,NOT(feries=\"F\")),\"C\",\"\")","v":""},{"$f":"IF(AND(dates>=Début04, dates<=Fin_04,NOT(feries=\"F\")),\"C\",\"\")","v":""},{"$f":"IF(AND(dates>=Début04, dates<=Fin_04,NOT(feries=\"F\")),\"C\",\"\")","v":""},{"$f":"IF(AND(dates>=Début04, dates<=Fin_04,NOT(feries=\"F\")),\"C\",\"\")","v":""},{"$f":"IF(AND(dates>=Début04, dates<=Fin_04,NOT(feries=\"F\")),\"C\",\"\")","v":""},{"$f":"IF(AND(dates>=Début04, dates<=Fin_04,NOT(feries=\"F\")),\"C\",\"\")","v":""},{"$f":"IF(AND(dates>=Début04, dates<=Fin_04,NOT(feries=\"F\")),\"C\",\"\")","v":""},{"$f":"IF(AND(dates>=Début04, dates<=Fin_04,NOT(feries=\"F\")),\"C\",\"\")","v":""},null,null,{"$f":"NETWORKDAYS(EI13,EJ13,'jours Féries 2016'!$B$1:$B$14)","v":0},{"$f":"COUNTIF(EM13:GD13,\"C\")","v":0},"","","","","","","","","","","","","","","","","","","","","","","","","","","","","","","",null,"","","","","","","","","","","","","","","","","","","","","","","","","","","","","","","","","","","","","","","","","","","","","","","","","","","","","","","","","","","","","","","","","","","","","","","","","","","","","","","","","","","","","","","","","","","","","","","","","","","","","","","","","","","","","","","","","","","","","","","","","","","","","","","","","","","","","","","","","","","","","","","","","","","","","","","","","","","","","","","","","","","","","","","","","","","","","","","","","","","","","","","","","","","","","","","","","","","","","","","","","","","","","","","","","","","","","",""]
["EMPLOYE8","2016-01-08","2016-01-17",{"$f":"NETWORKDAYS(B14,C14,'jours Féries 2016'!$B$1:$B$14)","v":6},6,"","","","","","","","C","","","C","C","C","C","C","","","","","","","","","","","","","","","","","2016-02-02","2016-02-10",{"$f":"NETWORKDAYS(AK14,AL14,'jours Féries 2016'!$B$1:$B$14)","v":7},7,{"$f":"IF(AND(dates>=Début02, dates<=Fin_02,NOT(feries=\"F\")),\"C\",\"\")","v":""},{"$f":"IF(AND(dates>=Début02, dates<=Fin_02,NOT(feries=\"F\")),\"C\",\"\")","v":"C"},{"$f":"IF(AND(dates>=Début02, dates<=Fin_02,NOT(feries=\"F\")),\"C\",\"\")","v":"C"},{"$f":"IF(AND(dates>=Début02, dates<=Fin_02,NOT(feries=\"F\")),\"C\",\"\")","v":"C"},{"$f":"IF(AND(dates>=Début02, dates<=Fin_02,NOT(feries=\"F\")),\"C\",\"\")","v":"C"},{"$f":"IF(AND(dates>=Début02, dates<=Fin_02,NOT(feries=\"F\")),\"C\",\"\")","v":""},{"$f":"IF(AND(dates>=Début02, dates<=Fin_02,NOT(feries=\"F\")),\"C\",\"\")","v":""},{"$f":"IF(AND(dates>=Début02, dates<=Fin_02,NOT(feries=\"F\")),\"C\",\"\")","v":"C"},{"$f":"IF(AND(dates>=Début02, dates<=Fin_02,NOT(feries=\"F\")),\"C\",\"\")","v":"C"},{"$f":"IF(AND(dates>=Début02, dates<=Fin_02,NOT(feries=\"F\")),\"C\",\"\")","v":"C"},{"$f":"IF(AND(dates>=Début02, dates<=Fin_02,NOT(feries=\"F\")),\"C\",\"\")","v":""},{"$f":"IF(AND(dates>=Début02, dates<=Fin_02,NOT(feries=\"F\")),\"C\",\"\")","v":""},{"$f":"IF(AND(dates>=Début02, dates<=Fin_02,NOT(feries=\"F\")),\"C\",\"\")","v":""},{"$f":"IF(AND(dates>=Début02, dates<=Fin_02,NOT(feries=\"F\")),\"C\",\"\")","v":""},{"$f":"IF(AND(dates>=Début02, dates<=Fin_02,NOT(feries=\"F\")),\"C\",\"\")","v":""},{"$f":"IF(AND(dates>=Début02, dates<=Fin_02,NOT(feries=\"F\")),\"C\",\"\")","v":""},{"$f":"IF(AND(dates>=Début02, dates<=Fin_02,NOT(feries=\"F\")),\"C\",\"\")","v":""},{"$f":"IF(AND(dates>=Début02, dates<=Fin_02,NOT(feries=\"F\")),\"C\",\"\")","v":""},{"$f":"IF(AND(dates>=Début02, dates<=Fin_02,NOT(feries=\"F\")),\"C\",\"\")","v":""},{"$f":"IF(AND(dates>=Début02, dates<=Fin_02,NOT(feries=\"F\")),\"C\",\"\")","v":""},{"$f":"IF(AND(dates>=Début02, dates<=Fin_02,NOT(feries=\"F\")),\"C\",\"\")","v":""},{"$f":"IF(AND(dates>=Début02, dates<=Fin_02,NOT(feries=\"F\")),\"C\",\"\")","v":""},{"$f":"IF(AND(dates>=Début02, dates<=Fin_02,NOT(feries=\"F\")),\"C\",\"\")","v":""},{"$f":"IF(AND(dates>=Début02, dates<=Fin_02,NOT(feries=\"F\")),\"C\",\"\")","v":""},{"$f":"IF(AND(dates>=Début02, dates<=Fin_02,NOT(feries=\"F\")),\"C\",\"\")","v":""},{"$f":"IF(AND(dates>=Début02, dates<=Fin_02,NOT(feries=\"F\")),\"C\",\"\")","v":""},{"$f":"IF(AND(dates>=Début02, dates<=Fin_02,NOT(feries=\"F\")),\"C\",\"\")","v":""},{"$f":"IF(AND(dates>=Début02, dates<=Fin_02,NOT(feries=\"F\")),\"C\",\"\")","v":""},{"$f":"IF(AND(dates>=Début02, dates<=Fin_02,NOT(feries=\"F\")),\"C\",\"\")","v":""},null,null,{"$f":"NETWORKDAYS(BR14,BS14,'jours Féries 2016'!$B$1:$B$14)","v":0},0,{"$f":"IF(AND(dates>=Début03, dates<=Fin_03,NOT(feries=\"F\")),\"C\",\"\")","v":""},{"$f":"IF(AND(dates>=Début03, dates<=Fin_03,NOT(feries=\"F\")),\"C\",\"\")","v":""},{"$f":"IF(AND(dates>=Début03, dates<=Fin_03,NOT(feries=\"F\")),\"C\",\"\")","v":""},{"$f":"IF(AND(dates>=Début03, dates<=Fin_03,NOT(feries=\"F\")),\"C\",\"\")","v":""},{"$f":"IF(AND(dates>=Début03, dates<=Fin_03,NOT(feries=\"F\")),\"C\",\"\")","v":""},{"$f":"IF(AND(dates>=Début03, dates<=Fin_03,NOT(feries=\"F\")),\"C\",\"\")","v":""},{"$f":"IF(AND(dates>=Début03, dates<=Fin_03,NOT(feries=\"F\")),\"C\",\"\")","v":""},{"$f":"IF(AND(dates>=Début03, dates<=Fin_03,NOT(feries=\"F\")),\"C\",\"\")","v":""},{"$f":"IF(AND(dates>=Début03, dates<=Fin_03,NOT(feries=\"F\")),\"C\",\"\")","v":""},{"$f":"IF(AND(dates>=Début03, dates<=Fin_03,NOT(feries=\"F\")),\"C\",\"\")","v":""},{"$f":"IF(AND(dates>=Début03, dates<=Fin_03,NOT(feries=\"F\")),\"C\",\"\")","v":""},{"$f":"IF(AND(dates>=Début03, dates<=Fin_03,NOT(feries=\"F\")),\"C\",\"\")","v":""},{"$f":"IF(AND(dates>=Début03, dates<=Fin_03,NOT(feries=\"F\")),\"C\",\"\")","v":""},{"$f":"IF(AND(dates>=Début03, dates<=Fin_03,NOT(feries=\"F\")),\"C\",\"\")","v":""},{"$f":"IF(AND(dates>=Début03, dates<=Fin_03,NOT(feries=\"F\")),\"C\",\"\")","v":""},{"$f":"IF(AND(dates>=Début03, dates<=Fin_03,NOT(feries=\"F\")),\"C\",\"\")","v":""},{"$f":"IF(AND(dates>=Début03, dates<=Fin_03,NOT(feries=\"F\")),\"C\",\"\")","v":""},{"$f":"IF(AND(dates>=Début03, dates<=Fin_03,NOT(feries=\"F\")),\"C\",\"\")","v":""},{"$f":"IF(AND(dates>=Début03, dates<=Fin_03,NOT(feries=\"F\")),\"C\",\"\")","v":""},{"$f":"IF(AND(dates>=Début03, dates<=Fin_03,NOT(feries=\"F\")),\"C\",\"\")","v":""},{"$f":"IF(AND(dates>=Début03, dates<=Fin_03,NOT(feries=\"F\")),\"C\",\"\")","v":""},{"$f":"IF(AND(dates>=Début03, dates<=Fin_03,NOT(feries=\"F\")),\"C\",\"\")","v":""},{"$f":"IF(AND(dates>=Début03, dates<=Fin_03,NOT(feries=\"F\")),\"C\",\"\")","v":""},{"$f":"IF(AND(dates>=Début03, dates<=Fin_03,NOT(feries=\"F\")),\"C\",\"\")","v":""},{"$f":"IF(AND(dates>=Début03, dates<=Fin_03,NOT(feries=\"F\")),\"C\",\"\")","v":""},{"$f":"IF(AND(dates>=Début03, dates<=Fin_03,NOT(feries=\"F\")),\"C\",\"\")","v":""},{"$f":"IF(AND(dates>=Début03, dates<=Fin_03,NOT(feries=\"F\")),\"C\",\"\")","v":""},{"$f":"IF(AND(dates>=Début03, dates<=Fin_03,NOT(feries=\"F\")),\"C\",\"\")","v":""},{"$f":"IF(AND(dates>=Début03, dates<=Fin_03,NOT(feries=\"F\")),\"C\",\"\")","v":""},{"$f":"IF(AND(dates>=Début03, dates<=Fin_03,NOT(feries=\"F\")),\"C\",\"\")","v":""},{"$f":"IF(AND(dates>=Début03, dates<=Fin_03,NOT(feries=\"F\")),\"C\",\"\")","v":""},null,null,{"$f":"NETWORKDAYS(DA14,DB14,'jours Féries 2016'!$B$1:$B$14)","v":0},0,{"$f":"IF(AND(dates>=Début04, dates<=Fin_04,NOT(feries=\"F\")),\"C\",\"\")","v":""},{"$f":"IF(AND(dates>=Début04, dates<=Fin_04,NOT(feries=\"F\")),\"C\",\"\")","v":""},{"$f":"IF(AND(dates>=Début04, dates<=Fin_04,NOT(feries=\"F\")),\"C\",\"\")","v":""},{"$f":"IF(AND(dates>=Début04, dates<=Fin_04,NOT(feries=\"F\")),\"C\",\"\")","v":""},{"$f":"IF(AND(dates>=Début04, dates<=Fin_04,NOT(feries=\"F\")),\"C\",\"\")","v":""},{"$f":"IF(AND(dates>=Début04, dates<=Fin_04,NOT(feries=\"F\")),\"C\",\"\")","v":""},{"$f":"IF(AND(dates>=Début04, dates<=Fin_04,NOT(feries=\"F\")),\"C\",\"\")","v":""},{"$f":"IF(AND(dates>=Début04, dates<=Fin_04,NOT(feries=\"F\")),\"C\",\"\")","v":""},{"$f":"IF(AND(dates>=Début04, dates<=Fin_04,NOT(feries=\"F\")),\"C\",\"\")","v":""},{"$f":"IF(AND(dates>=Début04, dates<=Fin_04,NOT(feries=\"F\")),\"C\",\"\")","v":""},{"$f":"IF(AND(dates>=Début04, dates<=Fin_04,NOT(feries=\"F\")),\"C\",\"\")","v":""},{"$f":"IF(AND(dates>=Début04, dates<=Fin_04,NOT(feries=\"F\")),\"C\",\"\")","v":""},{"$f":"IF(AND(dates>=Début04, dates<=Fin_04,NOT(feries=\"F\")),\"C\",\"\")","v":""},{"$f":"IF(AND(dates>=Début04, dates<=Fin_04,NOT(feries=\"F\")),\"C\",\"\")","v":""},{"$f":"IF(AND(dates>=Début04, dates<=Fin_04,NOT(feries=\"F\")),\"C\",\"\")","v":""},{"$f":"IF(AND(dates>=Début04, dates<=Fin_04,NOT(feries=\"F\")),\"C\",\"\")","v":""},{"$f":"IF(AND(dates>=Début04, dates<=Fin_04,NOT(feries=\"F\")),\"C\",\"\")","v":""},{"$f":"IF(AND(dates>=Début04, dates<=Fin_04,NOT(feries=\"F\")),\"C\",\"\")","v":""},{"$f":"IF(AND(dates>=Début04, dates<=Fin_04,NOT(feries=\"F\")),\"C\",\"\")","v":""},{"$f":"IF(AND(dates>=Début04, dates<=Fin_04,NOT(feries=\"F\")),\"C\",\"\")","v":""},{"$f":"IF(AND(dates>=Début04, dates<=Fin_04,NOT(feries=\"F\")),\"C\",\"\")","v":""},{"$f":"IF(AND(dates>=Début04, dates<=Fin_04,NOT(feries=\"F\")),\"C\",\"\")","v":""},{"$f":"IF(AND(dates>=Début04, dates<=Fin_04,NOT(feries=\"F\")),\"C\",\"\")","v":""},{"$f":"IF(AND(dates>=Début04, dates<=Fin_04,NOT(feries=\"F\")),\"C\",\"\")","v":""},{"$f":"IF(AND(dates>=Début04, dates<=Fin_04,NOT(feries=\"F\")),\"C\",\"\")","v":""},{"$f":"IF(AND(dates>=Début04, dates<=Fin_04,NOT(feries=\"F\")),\"C\",\"\")","v":""},{"$f":"IF(AND(dates>=Début04, dates<=Fin_04,NOT(feries=\"F\")),\"C\",\"\")","v":""},{"$f":"IF(AND(dates>=Début04, dates<=Fin_04,NOT(feries=\"F\")),\"C\",\"\")","v":""},{"$f":"IF(AND(dates>=Début04, dates<=Fin_04,NOT(feries=\"F\")),\"C\",\"\")","v":""},{"$f":"IF(AND(dates>=Début04, dates<=Fin_04,NOT(feries=\"F\")),\"C\",\"\")","v":""},null,null,{"$f":"NETWORKDAYS(EI14,EJ14,'jours Féries 2016'!$B$1:$B$14)","v":0},{"$f":"COUNTIF(EM14:GD14,\"C\")","v":0},"","","","","","","","","","","","","","","","","","","","","","","","","","","","","","","",null,"","","","","","","","","","","","","","","","","","","","","","","","","","","","","","","","","","","","","","","","","","","","","","","","","","","","","","","","","","","","","","","","","","","","","","","","","","","","","","","","","","","","","","","","","","","","","","","","","","","","","","","","","","","","","","","","","",{"$f":"IF(AND(dates>=Début01, dates<=Fin_01,NOT(feries=\"F\")),\"C\",\"\")","v":""},"","","","","","","","","","","","","","","","","","","","","","","","","","","","","","","","","","","","","","","","","","","","","","","","","","","","","","","","","","","","","","","","","","","",{"$f":"IF(AND(dates>=Début01, dates<=Fin_01,NOT(feries=\"F\")),\"C\",\"\")","v":""},"","","","","","","","","","","","","","","","","","","","","","","","","","","","","","","",""]
["EMPLOYE9","2016-01-09","2016-01-18",{"$f":"NETWORKDAYS(B15,C15,'jours Féries 2016'!$B$1:$B$14)","v":6},6,"","","","","","","","","","","C","C","C","C","C","","","C","","","","","","","","","","","","","",null,null,{"$f":"NETWORKDAYS(AK15,AL15,'jours Féries 2016'!$B$1:$B$14)","v":0},0,{"$f":"IF(AND(dates>=Début02, dates<=Fin_02,NOT(feries=\"F\")),\"C\",\"\")","v":""},{"$f":"IF(AND(dates>=Début02, dates<=Fin_02,NOT(feries=\"F\")),\"C\",\"\")","v":""},{"$f":"IF(AND(dates>=Début02, dates<=Fin_02,NOT(feries=\"F\")),\"C\",\"\")","v":""},{"$f":"IF(AND(dates>=Début02, dates<=Fin_02,NOT(feries=\"F\")),\"C\",\"\")","v":""},{"$f":"IF(AND(dates>=Début02, dates<=Fin_02,NOT(feries=\"F\")),\"C\",\"\")","v":""},{"$f":"IF(AND(dates>=Début02, dates<=Fin_02,NOT(feries=\"F\")),\"C\",\"\")","v":""},{"$f":"IF(AND(dates>=Début02, dates<=Fin_02,NOT(feries=\"F\")),\"C\",\"\")","v":""},{"$f":"IF(AND(dates>=Début02, dates<=Fin_02,NOT(feries=\"F\")),\"C\",\"\")","v":""},{"$f":"IF(AND(dates>=Début02, dates<=Fin_02,NOT(feries=\"F\")),\"C\",\"\")","v":""},{"$f":"IF(AND(dates>=Début02, dates<=Fin_02,NOT(feries=\"F\")),\"C\",\"\")","v":""},{"$f":"IF(AND(dates>=Début02, dates<=Fin_02,NOT(feries=\"F\")),\"C\",\"\")","v":""},{"$f":"IF(AND(dates>=Début02, dates<=Fin_02,NOT(feries=\"F\")),\"C\",\"\")","v":""},{"$f":"IF(AND(dates>=Début02, dates<=Fin_02,NOT(feries=\"F\")),\"C\",\"\")","v":""},{"$f":"IF(AND(dates>=Début02, dates<=Fin_02,NOT(feries=\"F\")),\"C\",\"\")","v":""},{"$f":"IF(AND(dates>=Début02, dates<=Fin_02,NOT(feries=\"F\")),\"C\",\"\")","v":""},{"$f":"IF(AND(dates>=Début02, dates<=Fin_02,NOT(feries=\"F\")),\"C\",\"\")","v":""},{"$f":"IF(AND(dates>=Début02, dates<=Fin_02,NOT(feries=\"F\")),\"C\",\"\")","v":""},{"$f":"IF(AND(dates>=Début02, dates<=Fin_02,NOT(feries=\"F\")),\"C\",\"\")","v":""},{"$f":"IF(AND(dates>=Début02, dates<=Fin_02,NOT(feries=\"F\")),\"C\",\"\")","v":""},{"$f":"IF(AND(dates>=Début02, dates<=Fin_02,NOT(feries=\"F\")),\"C\",\"\")","v":""},{"$f":"IF(AND(dates>=Début02, dates<=Fin_02,NOT(feries=\"F\")),\"C\",\"\")","v":""},{"$f":"IF(AND(dates>=Début02, dates<=Fin_02,NOT(feries=\"F\")),\"C\",\"\")","v":""},{"$f":"IF(AND(dates>=Début02, dates<=Fin_02,NOT(feries=\"F\")),\"C\",\"\")","v":""},{"$f":"IF(AND(dates>=Début02, dates<=Fin_02,NOT(feries=\"F\")),\"C\",\"\")","v":""},{"$f":"IF(AND(dates>=Début02, dates<=Fin_02,NOT(feries=\"F\")),\"C\",\"\")","v":""},{"$f":"IF(AND(dates>=Début02, dates<=Fin_02,NOT(feries=\"F\")),\"C\",\"\")","v":""},{"$f":"IF(AND(dates>=Début02, dates<=Fin_02,NOT(feries=\"F\")),\"C\",\"\")","v":""},{"$f":"IF(AND(dates>=Début02, dates<=Fin_02,NOT(feries=\"F\")),\"C\",\"\")","v":""},{"$f":"IF(AND(dates>=Début02, dates<=Fin_02,NOT(feries=\"F\")),\"C\",\"\")","v":""},null,null,{"$f":"NETWORKDAYS(BR15,BS15,'jours Féries 2016'!$B$1:$B$14)","v":0},0,{"$f":"IF(AND(dates>=Début03, dates<=Fin_03,NOT(feries=\"F\")),\"C\",\"\")","v":""},{"$f":"IF(AND(dates>=Début03, dates<=Fin_03,NOT(feries=\"F\")),\"C\",\"\")","v":""},{"$f":"IF(AND(dates>=Début03, dates<=Fin_03,NOT(feries=\"F\")),\"C\",\"\")","v":""},{"$f":"IF(AND(dates>=Début03, dates<=Fin_03,NOT(feries=\"F\")),\"C\",\"\")","v":""},{"$f":"IF(AND(dates>=Début03, dates<=Fin_03,NOT(feries=\"F\")),\"C\",\"\")","v":""},{"$f":"IF(AND(dates>=Début03, dates<=Fin_03,NOT(feries=\"F\")),\"C\",\"\")","v":""},{"$f":"IF(AND(dates>=Début03, dates<=Fin_03,NOT(feries=\"F\")),\"C\",\"\")","v":""},{"$f":"IF(AND(dates>=Début03, dates<=Fin_03,NOT(feries=\"F\")),\"C\",\"\")","v":""},{"$f":"IF(AND(dates>=Début03, dates<=Fin_03,NOT(feries=\"F\")),\"C\",\"\")","v":""},{"$f":"IF(AND(dates>=Début03, dates<=Fin_03,NOT(feries=\"F\")),\"C\",\"\")","v":""},{"$f":"IF(AND(dates>=Début03, dates<=Fin_03,NOT(feries=\"F\")),\"C\",\"\")","v":""},{"$f":"IF(AND(dates>=Début03, dates<=Fin_03,NOT(feries=\"F\")),\"C\",\"\")","v":""},{"$f":"IF(AND(dates>=Début03, dates<=Fin_03,NOT(feries=\"F\")),\"C\",\"\")","v":""},{"$f":"IF(AND(dates>=Début03, dates<=Fin_03,NOT(feries=\"F\")),\"C\",\"\")","v":""},{"$f":"IF(AND(dates>=Début03, dates<=Fin_03,NOT(feries=\"F\")),\"C\",\"\")","v":""},{"$f":"IF(AND(dates>=Début03, dates<=Fin_03,NOT(feries=\"F\")),\"C\",\"\")","v":""},{"$f":"IF(AND(dates>=Début03, dates<=Fin_03,NOT(feries=\"F\")),\"C\",\"\")","v":""},{"$f":"IF(AND(dates>=Début03, dates<=Fin_03,NOT(feries=\"F\")),\"C\",\"\")","v":""},{"$f":"IF(AND(dates>=Début03, dates<=Fin_03,NOT(feries=\"F\")),\"C\",\"\")","v":""},{"$f":"IF(AND(dates>=Début03, dates<=Fin_03,NOT(feries=\"F\")),\"C\",\"\")","v":""},{"$f":"IF(AND(dates>=Début03, dates<=Fin_03,NOT(feries=\"F\")),\"C\",\"\")","v":""},{"$f":"IF(AND(dates>=Début03, dates<=Fin_03,NOT(feries=\"F\")),\"C\",\"\")","v":""},{"$f":"IF(AND(dates>=Début03, dates<=Fin_03,NOT(feries=\"F\")),\"C\",\"\")","v":""},{"$f":"IF(AND(dates>=Début03, dates<=Fin_03,NOT(feries=\"F\")),\"C\",\"\")","v":""},{"$f":"IF(AND(dates>=Début03, dates<=Fin_03,NOT(feries=\"F\")),\"C\",\"\")","v":""},{"$f":"IF(AND(dates>=Début03, dates<=Fin_03,NOT(feries=\"F\")),\"C\",\"\")","v":""},{"$f":"IF(AND(dates>=Début03, dates<=Fin_03,NOT(feries=\"F\")),\"C\",\"\")","v":""},{"$f":"IF(AND(dates>=Début03, dates<=Fin_03,NOT(feries=\"F\")),\"C\",\"\")","v":""},{"$f":"IF(AND(dates>=Début03, dates<=Fin_03,NOT(feries=\"F\")),\"C\",\"\")","v":""},{"$f":"IF(AND(dates>=Début03, dates<=Fin_03,NOT(feries=\"F\")),\"C\",\"\")","v":""},{"$f":"IF(AND(dates>=Début03, dates<=Fin_03,NOT(feries=\"F\")),\"C\",\"\")","v":""},null,null,{"$f":"NETWORKDAYS(DA15,DB15,'jours Féries 2016'!$B$1:$B$14)","v":0},0,{"$f":"IF(AND(dates>=Début04, dates<=Fin_04,NOT(feries=\"F\")),\"C\",\"\")","v":""},{"$f":"IF(AND(dates>=Début04, dates<=Fin_04,NOT(feries=\"F\")),\"C\",\"\")","v":""},{"$f":"IF(AND(dates>=Début04, dates<=Fin_04,NOT(feries=\"F\")),\"C\",\"\")","v":""},{"$f":"IF(AND(dates>=Début04, dates<=Fin_04,NOT(feries=\"F\")),\"C\",\"\")","v":""},{"$f":"IF(AND(dates>=Début04, dates<=Fin_04,NOT(feries=\"F\")),\"C\",\"\")","v":""},{"$f":"IF(AND(dates>=Début04, dates<=Fin_04,NOT(feries=\"F\")),\"C\",\"\")","v":""},{"$f":"IF(AND(dates>=Début04, dates<=Fin_04,NOT(feries=\"F\")),\"C\",\"\")","v":""},{"$f":"IF(AND(dates>=Début04, dates<=Fin_04,NOT(feries=\"F\")),\"C\",\"\")","v":""},{"$f":"IF(AND(dates>=Début04, dates<=Fin_04,NOT(feries=\"F\")),\"C\",\"\")","v":""},{"$f":"IF(AND(dates>=Début04, dates<=Fin_04,NOT(feries=\"F\")),\"C\",\"\")","v":""},{"$f":"IF(AND(dates>=Début04, dates<=Fin_04,NOT(feries=\"F\")),\"C\",\"\")","v":""},{"$f":"IF(AND(dates>=Début04, dates<=Fin_04,NOT(feries=\"F\")),\"C\",\"\")","v":""},{"$f":"IF(AND(dates>=Début04, dates<=Fin_04,NOT(feries=\"F\")),\"C\",\"\")","v":""},{"$f":"IF(AND(dates>=Début04, dates<=Fin_04,NOT(feries=\"F\")),\"C\",\"\")","v":""},{"$f":"IF(AND(dates>=Début04, dates<=Fin_04,NOT(feries=\"F\")),\"C\",\"\")","v":""},{"$f":"IF(AND(dates>=Début04, dates<=Fin_04,NOT(feries=\"F\")),\"C\",\"\")","v":""},{"$f":"IF(AND(dates>=Début04, dates<=Fin_04,NOT(feries=\"F\")),\"C\",\"\")","v":""},{"$f":"IF(AND(dates>=Début04, dates<=Fin_04,NOT(feries=\"F\")),\"C\",\"\")","v":""},{"$f":"IF(AND(dates>=Début04, dates<=Fin_04,NOT(feries=\"F\")),\"C\",\"\")","v":""},{"$f":"IF(AND(dates>=Début04, dates<=Fin_04,NOT(feries=\"F\")),\"C\",\"\")","v":""},{"$f":"IF(AND(dates>=Début04, dates<=Fin_04,NOT(feries=\"F\")),\"C\",\"\")","v":""},{"$f":"IF(AND(dates>=Début04, dates<=Fin_04,NOT(feries=\"F\")),\"C\",\"\")","v":""},{"$f":"IF(AND(dates>=Début04, dates<=Fin_04,NOT(feries=\"F\")),\"C\",\"\")","v":""},{"$f":"IF(AND(dates>=Début04, dates<=Fin_04,NOT(feries=\"F\")),\"C\",\"\")","v":""},{"$f":"IF(AND(dates>=Début04, dates<=Fin_04,NOT(feries=\"F\")),\"C\",\"\")","v":""},{"$f":"IF(AND(dates>=Début04, dates<=Fin_04,NOT(feries=\"F\")),\"C\",\"\")","v":""},{"$f":"IF(AND(dates>=Début04, dates<=Fin_04,NOT(feries=\"F\")),\"C\",\"\")","v":""},{"$f":"IF(AND(dates>=Début04, dates<=Fin_04,NOT(feries=\"F\")),\"C\",\"\")","v":""},{"$f":"IF(AND(dates>=Début04, dates<=Fin_04,NOT(feries=\"F\")),\"C\",\"\")","v":""},{"$f":"IF(AND(dates>=Début04, dates<=Fin_04,NOT(feries=\"F\")),\"C\",\"\")","v":""},null,null,{"$f":"NETWORKDAYS(EI15,EJ15,'jours Féries 2016'!$B$1:$B$14)","v":0},{"$f":"COUNTIF(EM15:GD15,\"C\")","v":0},{"$f":"IF(AND(dates>=Début01, dates<=Fin_01,NOT(feries=\"F\")),\"C\",\"\")","v":""},"","","","","","","","","","","","","","","","","","","","","","","","","","","","","","",null,"","","","","","","","","","","","","","","","","","","","","","","","","","","","","","","","","","","","","","","","","","","","","","","","","","",{"$f":"IF(AND(dates>=Début01, dates<=Fin_01,NOT(feries=\"F\")),\"C\",\"\")","v":""},"","","","","","","","","","","","","","","","","","","","","","","","","","","","","","","","","","","","","","","","","","","","","","","","","","","","","","","","","","","","","","","","","","","","","","","","","","","","","","","","","","","","","","","","","","","","","","","","","","","","","","","","","","","","","","","","","","","","","","","","","","","","","","","",{"$f":"IF(AND(dates>=Début01, dates<=Fin_01,NOT(feries=\"F\")),\"C\",\"\")","v":""},"","","","","","","","","","","","","","","","","","","","","","","","","","","","","","","","","","",""]
["EMPLOYE10","2016-01-10","2016-01-19",{"$f":"NETWORKDAYS(B16,C16,'jours Féries 2016'!$B$1:$B$14)","v":7},7,"","","","","","","","","","","C","C","C","C","C","","","C","C","","","","","","","","","","","","",null,null,{"$f":"NETWORKDAYS(AK16,AL16,'jours Féries 2016'!$B$1:$B$14)","v":0},0,{"$f":"IF(AND(dates>=Début02, dates<=Fin_02,NOT(feries=\"F\")),\"C\",\"\")","v":""},{"$f":"IF(AND(dates>=Début02, dates<=Fin_02,NOT(feries=\"F\")),\"C\",\"\")","v":""},{"$f":"IF(AND(dates>=Début02, dates<=Fin_02,NOT(feries=\"F\")),\"C\",\"\")","v":""},{"$f":"IF(AND(dates>=Début02, dates<=Fin_02,NOT(feries=\"F\")),\"C\",\"\")","v":""},{"$f":"IF(AND(dates>=Début02, dates<=Fin_02,NOT(feries=\"F\")),\"C\",\"\")","v":""},{"$f":"IF(AND(dates>=Début02, dates<=Fin_02,NOT(feries=\"F\")),\"C\",\"\")","v":""},{"$f":"IF(AND(dates>=Début02, dates<=Fin_02,NOT(feries=\"F\")),\"C\",\"\")","v":""},{"$f":"IF(AND(dates>=Début02, dates<=Fin_02,NOT(feries=\"F\")),\"C\",\"\")","v":""},{"$f":"IF(AND(dates>=Début02, dates<=Fin_02,NOT(feries=\"F\")),\"C\",\"\")","v":""},{"$f":"IF(AND(dates>=Début02, dates<=Fin_02,NOT(feries=\"F\")),\"C\",\"\")","v":""},{"$f":"IF(AND(dates>=Début02, dates<=Fin_02,NOT(feries=\"F\")),\"C\",\"\")","v":""},{"$f":"IF(AND(dates>=Début02, dates<=Fin_02,NOT(feries=\"F\")),\"C\",\"\")","v":""},{"$f":"IF(AND(dates>=Début02, dates<=Fin_02,NOT(feries=\"F\")),\"C\",\"\")","v":""},{"$f":"IF(AND(dates>=Début02, dates<=Fin_02,NOT(feries=\"F\")),\"C\",\"\")","v":""},{"$f":"IF(AND(dates>=Début02, dates<=Fin_02,NOT(feries=\"F\")),\"C\",\"\")","v":""},{"$f":"IF(AND(dates>=Début02, dates<=Fin_02,NOT(feries=\"F\")),\"C\",\"\")","v":""},{"$f":"IF(AND(dates>=Début02, dates<=Fin_02,NOT(feries=\"F\")),\"C\",\"\")","v":""},{"$f":"IF(AND(dates>=Début02, dates<=Fin_02,NOT(feries=\"F\")),\"C\",\"\")","v":""},{"$f":"IF(AND(dates>=Début02, dates<=Fin_02,NOT(feries=\"F\")),\"C\",\"\")","v":""},{"$f":"IF(AND(dates>=Début02, dates<=Fin_02,NOT(feries=\"F\")),\"C\",\"\")","v":""},{"$f":"IF(AND(dates>=Début02, dates<=Fin_02,NOT(feries=\"F\")),\"C\",\"\")","v":""},{"$f":"IF(AND(dates>=Début02, dates<=Fin_02,NOT(feries=\"F\")),\"C\",\"\")","v":""},{"$f":"IF(AND(dates>=Début02, dates<=Fin_02,NOT(feries=\"F\")),\"C\",\"\")","v":""},{"$f":"IF(AND(dates>=Début02, dates<=Fin_02,NOT(feries=\"F\")),\"C\",\"\")","v":""},{"$f":"IF(AND(dates>=Début02, dates<=Fin_02,NOT(feries=\"F\")),\"C\",\"\")","v":""},{"$f":"IF(AND(dates>=Début02, dates<=Fin_02,NOT(feries=\"F\")),\"C\",\"\")","v":""},{"$f":"IF(AND(dates>=Début02, dates<=Fin_02,NOT(feries=\"F\")),\"C\",\"\")","v":""},{"$f":"IF(AND(dates>=Début02, dates<=Fin_02,NOT(feries=\"F\")),\"C\",\"\")","v":""},{"$f":"IF(AND(dates>=Début02, dates<=Fin_02,NOT(feries=\"F\")),\"C\",\"\")","v":""},null,null,{"$f":"NETWORKDAYS(BR16,BS16,'jours Féries 2016'!$B$1:$B$14)","v":0},0,{"$f":"IF(AND(dates>=Début03, dates<=Fin_03,NOT(feries=\"F\")),\"C\",\"\")","v":""},{"$f":"IF(AND(dates>=Début03, dates<=Fin_03,NOT(feries=\"F\")),\"C\",\"\")","v":""},{"$f":"IF(AND(dates>=Début03, dates<=Fin_03,NOT(feries=\"F\")),\"C\",\"\")","v":""},{"$f":"IF(AND(dates>=Début03, dates<=Fin_03,NOT(feries=\"F\")),\"C\",\"\")","v":""},{"$f":"IF(AND(dates>=Début03, dates<=Fin_03,NOT(feries=\"F\")),\"C\",\"\")","v":""},{"$f":"IF(AND(dates>=Début03, dates<=Fin_03,NOT(feries=\"F\")),\"C\",\"\")","v":""},{"$f":"IF(AND(dates>=Début03, dates<=Fin_03,NOT(feries=\"F\")),\"C\",\"\")","v":""},{"$f":"IF(AND(dates>=Début03, dates<=Fin_03,NOT(feries=\"F\")),\"C\",\"\")","v":""},{"$f":"IF(AND(dates>=Début03, dates<=Fin_03,NOT(feries=\"F\")),\"C\",\"\")","v":""},{"$f":"IF(AND(dates>=Début03, dates<=Fin_03,NOT(feries=\"F\")),\"C\",\"\")","v":""},{"$f":"IF(AND(dates>=Début03, dates<=Fin_03,NOT(feries=\"F\")),\"C\",\"\")","v":""},{"$f":"IF(AND(dates>=Début03, dates<=Fin_03,NOT(feries=\"F\")),\"C\",\"\")","v":""},{"$f":"IF(AND(dates>=Début03, dates<=Fin_03,NOT(feries=\"F\")),\"C\",\"\")","v":""},{"$f":"IF(AND(dates>=Début03, dates<=Fin_03,NOT(feries=\"F\")),\"C\",\"\")","v":""},{"$f":"IF(AND(dates>=Début03, dates<=Fin_03,NOT(feries=\"F\")),\"C\",\"\")","v":""},{"$f":"IF(AND(dates>=Début03, dates<=Fin_03,NOT(feries=\"F\")),\"C\",\"\")","v":""},{"$f":"IF(AND(dates>=Début03, dates<=Fin_03,NOT(feries=\"F\")),\"C\",\"\")","v":""},{"$f":"IF(AND(dates>=Début03, dates<=Fin_03,NOT(feries=\"F\")),\"C\",\"\")","v":""},{"$f":"IF(AND(dates>=Début03, dates<=Fin_03,NOT(feries=\"F\")),\"C\",\"\")","v":""},{"$f":"IF(AND(dates>=Début03, dates<=Fin_03,NOT(feries=\"F\")),\"C\",\"\")","v":""},{"$f":"IF(AND(dates>=Début03, dates<=Fin_03,NOT(feries=\"F\")),\"C\",\"\")","v":""},{"$f":"IF(AND(dates>=Début03, dates<=Fin_03,NOT(feries=\"F\")),\"C\",\"\")","v":""},{"$f":"IF(AND(dates>=Début03, dates<=Fin_03,NOT(feries=\"F\")),\"C\",\"\")","v":""},{"$f":"IF(AND(dates>=Début03, dates<=Fin_03,NOT(feries=\"F\")),\"C\",\"\")","v":""},{"$f":"IF(AND(dates>=Début03, dates<=Fin_03,NOT(feries=\"F\")),\"C\",\"\")","v":""},{"$f":"IF(AND(dates>=Début03, dates<=Fin_03,NOT(feries=\"F\")),\"C\",\"\")","v":""},{"$f":"IF(AND(dates>=Début03, dates<=Fin_03,NOT(feries=\"F\")),\"C\",\"\")","v":""},{"$f":"IF(AND(dates>=Début03, dates<=Fin_03,NOT(feries=\"F\")),\"C\",\"\")","v":""},{"$f":"IF(AND(dates>=Début03, dates<=Fin_03,NOT(feries=\"F\")),\"C\",\"\")","v":""},{"$f":"IF(AND(dates>=Début03, dates<=Fin_03,NOT(feries=\"F\")),\"C\",\"\")","v":""},{"$f":"IF(AND(dates>=Début03, dates<=Fin_03,NOT(feries=\"F\")),\"C\",\"\")","v":""},null,null,{"$f":"NETWORKDAYS(DA16,DB16,'jours Féries 2016'!$B$1:$B$14)","v":0},0,{"$f":"IF(AND(dates>=Début04, dates<=Fin_04,NOT(feries=\"F\")),\"C\",\"\")","v":""},{"$f":"IF(AND(dates>=Début04, dates<=Fin_04,NOT(feries=\"F\")),\"C\",\"\")","v":""},{"$f":"IF(AND(dates>=Début04, dates<=Fin_04,NOT(feries=\"F\")),\"C\",\"\")","v":""},{"$f":"IF(AND(dates>=Début04, dates<=Fin_04,NOT(feries=\"F\")),\"C\",\"\")","v":""},{"$f":"IF(AND(dates>=Début04, dates<=Fin_04,NOT(feries=\"F\")),\"C\",\"\")","v":""},{"$f":"IF(AND(dates>=Début04, dates<=Fin_04,NOT(feries=\"F\")),\"C\",\"\")","v":""},{"$f":"IF(AND(dates>=Début04, dates<=Fin_04,NOT(feries=\"F\")),\"C\",\"\")","v":""},{"$f":"IF(AND(dates>=Début04, dates<=Fin_04,NOT(feries=\"F\")),\"C\",\"\")","v":""},{"$f":"IF(AND(dates>=Début04, dates<=Fin_04,NOT(feries=\"F\")),\"C\",\"\")","v":""},{"$f":"IF(AND(dates>=Début04, dates<=Fin_04,NOT(feries=\"F\")),\"C\",\"\")","v":""},{"$f":"IF(AND(dates>=Début04, dates<=Fin_04,NOT(feries=\"F\")),\"C\",\"\")","v":""},{"$f":"IF(AND(dates>=Début04, dates<=Fin_04,NOT(feries=\"F\")),\"C\",\"\")","v":""},{"$f":"IF(AND(dates>=Début04, dates<=Fin_04,NOT(feries=\"F\")),\"C\",\"\")","v":""},{"$f":"IF(AND(dates>=Début04, dates<=Fin_04,NOT(feries=\"F\")),\"C\",\"\")","v":""},{"$f":"IF(AND(dates>=Début04, dates<=Fin_04,NOT(feries=\"F\")),\"C\",\"\")","v":""},{"$f":"IF(AND(dates>=Début04, dates<=Fin_04,NOT(feries=\"F\")),\"C\",\"\")","v":""},{"$f":"IF(AND(dates>=Début04, dates<=Fin_04,NOT(feries=\"F\")),\"C\",\"\")","v":""},{"$f":"IF(AND(dates>=Début04, dates<=Fin_04,NOT(feries=\"F\")),\"C\",\"\")","v":""},{"$f":"IF(AND(dates>=Début04, dates<=Fin_04,NOT(feries=\"F\")),\"C\",\"\")","v":""},{"$f":"IF(AND(dates>=Début04, dates<=Fin_04,NOT(feries=\"F\")),\"C\",\"\")","v":""},{"$f":"IF(AND(dates>=Début04, dates<=Fin_04,NOT(feries=\"F\")),\"C\",\"\")","v":""},{"$f":"IF(AND(dates>=Début04, dates<=Fin_04,NOT(feries=\"F\")),\"C\",\"\")","v":""},{"$f":"IF(AND(dates>=Début04, dates<=Fin_04,NOT(feries=\"F\")),\"C\",\"\")","v":""},{"$f":"IF(AND(dates>=Début04, dates<=Fin_04,NOT(feries=\"F\")),\"C\",\"\")","v":""},{"$f":"IF(AND(dates>=Début04, dates<=Fin_04,NOT(feries=\"F\")),\"C\",\"\")","v":""},{"$f":"IF(AND(dates>=Début04, dates<=Fin_04,NOT(feries=\"F\")),\"C\",\"\")","v":""},{"$f":"IF(AND(dates>=Début04, dates<=Fin_04,NOT(feries=\"F\")),\"C\",\"\")","v":""},{"$f":"IF(AND(dates>=Début04, dates<=Fin_04,NOT(feries=\"F\")),\"C\",\"\")","v":""},{"$f":"IF(AND(dates>=Début04, dates<=Fin_04,NOT(feries=\"F\")),\"C\",\"\")","v":""},{"$f":"IF(AND(dates>=Début04, dates<=Fin_04,NOT(feries=\"F\")),\"C\",\"\")","v":""},null,null,{"$f":"NETWORKDAYS(EI16,EJ16,'jours Féries 2016'!$B$1:$B$14)","v":0},{"$f":"COUNTIF(EM16:GD16,\"C\")","v":0},"","","","","","",{"$f":"IF(AND(dates>=Début01, dates<=Fin_01,NOT(feries=\"F\")),\"C\",\"\")","v":""},"","","","","","","","","","","","","","","","","","","","","","","","",null,"","","","","","","","","","","","","","","","","","","","","","","","","","","","","","","","","","","","","","","","","","","","","","","","","","","","","","","","","","","","","","","","","","","","","","","","","","","","","","","","","","","","","","","","","","","","","","","","","","","","","","","","","","","","","","","","","","","","","","","","","","","","","","","","","","","","","","","","","","","","","","","","","","","","","","","","","","","","","","","","","","","","","","","","","","","","","","","","","","","","","","","","","","","","","","","","","","","","","","","","","","","","","","","","","","","","","",""]
["EMPLOYE11","2016-01-11","2016-01-20",{"$f":"NETWORKDAYS(B17,C17,'jours Féries 2016'!$B$1:$B$14)","v":8},8,{"$f":"IF(AND(dates>=Début01, dates<=Fin_01,NOT(feries=\"F\")),\"C\",\"\")","v":""},"","","","","","","","","",{"$f":"IF(AND(dates>=Début01, dates<=Fin_01,NOT(feries=\"F\")),\"C\",\"\")","v":"C"},"C","C","C","C","","","C","C","C",{"$f":"IF(AND(dates>=Début01, dates<=Fin_01,NOT(feries=\"F\")),\"C\",\"\")","v":""},"","","","","","","","","","",null,null,{"$f":"NETWORKDAYS(AK17,AL17,'jours Féries 2016'!$B$1:$B$14)","v":0},0,{"$f":"IF(AND(dates>=Début02, dates<=Fin_02,NOT(feries=\"F\")),\"C\",\"\")","v":""},{"$f":"IF(AND(dates>=Début02, dates<=Fin_02,NOT(feries=\"F\")),\"C\",\"\")","v":""},{"$f":"IF(AND(dates>=Début02, dates<=Fin_02,NOT(feries=\"F\")),\"C\",\"\")","v":""},{"$f":"IF(AND(dates>=Début02, dates<=Fin_02,NOT(feries=\"F\")),\"C\",\"\")","v":""},{"$f":"IF(AND(dates>=Début02, dates<=Fin_02,NOT(feries=\"F\")),\"C\",\"\")","v":""},{"$f":"IF(AND(dates>=Début02, dates<=Fin_02,NOT(feries=\"F\")),\"C\",\"\")","v":""},{"$f":"IF(AND(dates>=Début02, dates<=Fin_02,NOT(feries=\"F\")),\"C\",\"\")","v":""},{"$f":"IF(AND(dates>=Début02, dates<=Fin_02,NOT(feries=\"F\")),\"C\",\"\")","v":""},{"$f":"IF(AND(dates>=Début02, dates<=Fin_02,NOT(feries=\"F\")),\"C\",\"\")","v":""},{"$f":"IF(AND(dates>=Début02, dates<=Fin_02,NOT(feries=\"F\")),\"C\",\"\")","v":""},{"$f":"IF(AND(dates>=Début02, dates<=Fin_02,NOT(feries=\"F\")),\"C\",\"\")","v":""},{"$f":"IF(AND(dates>=Début02, dates<=Fin_02,NOT(feries=\"F\")),\"C\",\"\")","v":""},{"$f":"IF(AND(dates>=Début02, dates<=Fin_02,NOT(feries=\"F\")),\"C\",\"\")","v":""},{"$f":"IF(AND(dates>=Début02, dates<=Fin_02,NOT(feries=\"F\")),\"C\",\"\")","v":""},{"$f":"IF(AND(dates>=Début02, dates<=Fin_02,NOT(feries=\"F\")),\"C\",\"\")","v":""},{"$f":"IF(AND(dates>=Début02, dates<=Fin_02,NOT(feries=\"F\")),\"C\",\"\")","v":""},{"$f":"IF(AND(dates>=Début02, dates<=Fin_02,NOT(feries=\"F\")),\"C\",\"\")","v":""},{"$f":"IF(AND(dates>=Début02, dates<=Fin_02,NOT(feries=\"F\")),\"C\",\"\")","v":""},{"$f":"IF(AND(dates>=Début02, dates<=Fin_02,NOT(feries=\"F\")),\"C\",\"\")","v":""},{"$f":"IF(AND(dates>=Début02, dates<=Fin_02,NOT(feries=\"F\")),\"C\",\"\")","v":""},{"$f":"IF(AND(dates>=Début02, dates<=Fin_02,NOT(feries=\"F\")),\"C\",\"\")","v":""},{"$f":"IF(AND(dates>=Début02, dates<=Fin_02,NOT(feries=\"F\")),\"C\",\"\")","v":""},{"$f":"IF(AND(dates>=Début02, dates<=Fin_02,NOT(feries=\"F\")),\"C\",\"\")","v":""},{"$f":"IF(AND(dates>=Début02, dates<=Fin_02,NOT(feries=\"F\")),\"C\",\"\")","v":""},{"$f":"IF(AND(dates>=Début02, dates<=Fin_02,NOT(feries=\"F\")),\"C\",\"\")","v":""},{"$f":"IF(AND(dates>=Début02, dates<=Fin_02,NOT(feries=\"F\")),\"C\",\"\")","v":""},{"$f":"IF(AND(dates>=Début02, dates<=Fin_02,NOT(feries=\"F\")),\"C\",\"\")","v":""},{"$f":"IF(AND(dates>=Début02, dates<=Fin_02,NOT(feries=\"F\")),\"C\",\"\")","v":""},{"$f":"IF(AND(dates>=Début02, dates<=Fin_02,NOT(feries=\"F\")),\"C\",\"\")","v":""},null,null,{"$f":"NETWORKDAYS(BR17,BS17,'jours Féries 2016'!$B$1:$B$14)","v":0},0,{"$f":"IF(AND(dates>=Début03, dates<=Fin_03,NOT(feries=\"F\")),\"C\",\"\")","v":""},{"$f":"IF(AND(dates>=Début03, dates<=Fin_03,NOT(feries=\"F\")),\"C\",\"\")","v":""},{"$f":"IF(AND(dates>=Début03, dates<=Fin_03,NOT(feries=\"F\")),\"C\",\"\")","v":""},{"$f":"IF(AND(dates>=Début03, dates<=Fin_03,NOT(feries=\"F\")),\"C\",\"\")","v":""},{"$f":"IF(AND(dates>=Début03, dates<=Fin_03,NOT(feries=\"F\")),\"C\",\"\")","v":""},{"$f":"IF(AND(dates>=Début03, dates<=Fin_03,NOT(feries=\"F\")),\"C\",\"\")","v":""},{"$f":"IF(AND(dates>=Début03, dates<=Fin_03,NOT(feries=\"F\")),\"C\",\"\")","v":""},{"$f":"IF(AND(dates>=Début03, dates<=Fin_03,NOT(feries=\"F\")),\"C\",\"\")","v":""},{"$f":"IF(AND(dates>=Début03, dates<=Fin_03,NOT(feries=\"F\")),\"C\",\"\")","v":""},{"$f":"IF(AND(dates>=Début03, dates<=Fin_03,NOT(feries=\"F\")),\"C\",\"\")","v":""},{"$f":"IF(AND(dates>=Début03, dates<=Fin_03,NOT(feries=\"F\")),\"C\",\"\")","v":""},{"$f":"IF(AND(dates>=Début03, dates<=Fin_03,NOT(feries=\"F\")),\"C\",\"\")","v":""},{"$f":"IF(AND(dates>=Début03, dates<=Fin_03,NOT(feries=\"F\")),\"C\",\"\")","v":""},{"$f":"IF(AND(dates>=Début03, dates<=Fin_03,NOT(feries=\"F\")),\"C\",\"\")","v":""},{"$f":"IF(AND(dates>=Début03, dates<=Fin_03,NOT(feries=\"F\")),\"C\",\"\")","v":""},{"$f":"IF(AND(dates>=Début03, dates<=Fin_03,NOT(feries=\"F\")),\"C\",\"\")","v":""},{"$f":"IF(AND(dates>=Début03, dates<=Fin_03,NOT(feries=\"F\")),\"C\",\"\")","v":""},{"$f":"IF(AND(dates>=Début03, dates<=Fin_03,NOT(feries=\"F\")),\"C\",\"\")","v":""},{"$f":"IF(AND(dates>=Début03, dates<=Fin_03,NOT(feries=\"F\")),\"C\",\"\")","v":""},{"$f":"IF(AND(dates>=Début03, dates<=Fin_03,NOT(feries=\"F\")),\"C\",\"\")","v":""},{"$f":"IF(AND(dates>=Début03, dates<=Fin_03,NOT(feries=\"F\")),\"C\",\"\")","v":""},{"$f":"IF(AND(dates>=Début03, dates<=Fin_03,NOT(feries=\"F\")),\"C\",\"\")","v":""},{"$f":"IF(AND(dates>=Début03, dates<=Fin_03,NOT(feries=\"F\")),\"C\",\"\")","v":""},{"$f":"IF(AND(dates>=Début03, dates<=Fin_03,NOT(feries=\"F\")),\"C\",\"\")","v":""},{"$f":"IF(AND(dates>=Début03, dates<=Fin_03,NOT(feries=\"F\")),\"C\",\"\")","v":""},{"$f":"IF(AND(dates>=Début03, dates<=Fin_03,NOT(feries=\"F\")),\"C\",\"\")","v":""},{"$f":"IF(AND(dates>=Début03, dates<=Fin_03,NOT(feries=\"F\")),\"C\",\"\")","v":""},{"$f":"IF(AND(dates>=Début03, dates<=Fin_03,NOT(feries=\"F\")),\"C\",\"\")","v":""},{"$f":"IF(AND(dates>=Début03, dates<=Fin_03,NOT(feries=\"F\")),\"C\",\"\")","v":""},{"$f":"IF(AND(dates>=Début03, dates<=Fin_03,NOT(feries=\"F\")),\"C\",\"\")","v":""},{"$f":"IF(AND(dates>=Début03, dates<=Fin_03,NOT(feries=\"F\")),\"C\",\"\")","v":""},null,null,{"$f":"NETWORKDAYS(DA17,DB17,'jours Féries 2016'!$B$1:$B$14)","v":0},0,{"$f":"IF(AND(dates>=Début04, dates<=Fin_04,NOT(feries=\"F\")),\"C\",\"\")","v":""},{"$f":"IF(AND(dates>=Début04, dates<=Fin_04,NOT(feries=\"F\")),\"C\",\"\")","v":""},{"$f":"IF(AND(dates>=Début04, dates<=Fin_04,NOT(feries=\"F\")),\"C\",\"\")","v":""},{"$f":"IF(AND(dates>=Début04, dates<=Fin_04,NOT(feries=\"F\")),\"C\",\"\")","v":""},{"$f":"IF(AND(dates>=Début04, dates<=Fin_04,NOT(feries=\"F\")),\"C\",\"\")","v":""},{"$f":"IF(AND(dates>=Début04, dates<=Fin_04,NOT(feries=\"F\")),\"C\",\"\")","v":""},{"$f":"IF(AND(dates>=Début04, dates<=Fin_04,NOT(feries=\"F\")),\"C\",\"\")","v":""},{"$f":"IF(AND(dates>=Début04, dates<=Fin_04,NOT(feries=\"F\")),\"C\",\"\")","v":""},{"$f":"IF(AND(dates>=Début04, dates<=Fin_04,NOT(feries=\"F\")),\"C\",\"\")","v":""},{"$f":"IF(AND(dates>=Début04, dates<=Fin_04,NOT(feries=\"F\")),\"C\",\"\")","v":""},{"$f":"IF(AND(dates>=Début04, dates<=Fin_04,NOT(feries=\"F\")),\"C\",\"\")","v":""},{"$f":"IF(AND(dates>=Début04, dates<=Fin_04,NOT(feries=\"F\")),\"C\",\"\")","v":""},{"$f":"IF(AND(dates>=Début04, dates<=Fin_04,NOT(feries=\"F\")),\"C\",\"\")","v":""},{"$f":"IF(AND(dates>=Début04, dates<=Fin_04,NOT(feries=\"F\")),\"C\",\"\")","v":""},{"$f":"IF(AND(dates>=Début04, dates<=Fin_04,NOT(feries=\"F\")),\"C\",\"\")","v":""},{"$f":"IF(AND(dates>=Début04, dates<=Fin_04,NOT(feries=\"F\")),\"C\",\"\")","v":""},{"$f":"IF(AND(dates>=Début04, dates<=Fin_04,NOT(feries=\"F\")),\"C\",\"\")","v":""},{"$f":"IF(AND(dates>=Début04, dates<=Fin_04,NOT(feries=\"F\")),\"C\",\"\")","v":""},{"$f":"IF(AND(dates>=Début04, dates<=Fin_04,NOT(feries=\"F\")),\"C\",\"\")","v":""},{"$f":"IF(AND(dates>=Début04, dates<=Fin_04,NOT(feries=\"F\")),\"C\",\"\")","v":""},{"$f":"IF(AND(dates>=Début04, dates<=Fin_04,NOT(feries=\"F\")),\"C\",\"\")","v":""},{"$f":"IF(AND(dates>=Début04, dates<=Fin_04,NOT(feries=\"F\")),\"C\",\"\")","v":""},{"$f":"IF(AND(dates>=Début04, dates<=Fin_04,NOT(feries=\"F\")),\"C\",\"\")","v":""},{"$f":"IF(AND(dates>=Début04, dates<=Fin_04,NOT(feries=\"F\")),\"C\",\"\")","v":""},{"$f":"IF(AND(dates>=Début04, dates<=Fin_04,NOT(feries=\"F\")),\"C\",\"\")","v":""},{"$f":"IF(AND(dates>=Début04, dates<=Fin_04,NOT(feries=\"F\")),\"C\",\"\")","v":""},{"$f":"IF(AND(dates>=Début04, dates<=Fin_04,NOT(feries=\"F\")),\"C\",\"\")","v":""},{"$f":"IF(AND(dates>=Début04, dates<=Fin_04,NOT(feries=\"F\")),\"C\",\"\")","v":""},{"$f":"IF(AND(dates>=Début04, dates<=Fin_04,NOT(feries=\"F\")),\"C\",\"\")","v":""},{"$f":"IF(AND(dates>=Début04, dates<=Fin_04,NOT(feries=\"F\")),\"C\",\"\")","v":""},null,null,{"$f":"NETWORKDAYS(EI17,EJ17,'jours Féries 2016'!$B$1:$B$14)","v":0},{"$f":"COUNTIF(EM17:GD17,\"C\")","v":0},"","","","","","","","","","","","","","","","","","","","","","","","","","","","","","","",null,"","","","","","","","","","","","","","","","","","","","","","","","","","","","","","","","","","","","","","","","","","","","","","","","","","","","","","","","","","","","","","","","","","","","","","","","","","","","","","","","","","","","","","","","","","","","","","","","","","","","","","","","","","","","","","","","","","","","","","","","","","","","","","","","","","","","","","","","","","","","","","","","","","","","","","","","","","","","","","","","","","","","","","","","","","","","","","","","","","","","","","","","","","","","","","","","","","","","","","","","","","","","","","","","","","","","","",""]
["EMPLOYE12","2016-01-12","2016-01-21",{"$f":"NETWORKDAYS(B18,C18,'jours Féries 2016'!$B$1:$B$14)","v":8},8,"","","","","","","","","","","","C","C","C","C","","","C","C","C","C","","","","","","","","","","",null,null,{"$f":"NETWORKDAYS(AK18,AL18,'jours Féries 2016'!$B$1:$B$14)","v":0},0,{"$f":"IF(AND(dates>=Début02, dates<=Fin_02,NOT(feries=\"F\")),\"C\",\"\")","v":""},{"$f":"IF(AND(dates>=Début02, dates<=Fin_02,NOT(feries=\"F\")),\"C\",\"\")","v":""},{"$f":"IF(AND(dates>=Début02, dates<=Fin_02,NOT(feries=\"F\")),\"C\",\"\")","v":""},{"$f":"IF(AND(dates>=Début02, dates<=Fin_02,NOT(feries=\"F\")),\"C\",\"\")","v":""},{"$f":"IF(AND(dates>=Début02, dates<=Fin_02,NOT(feries=\"F\")),\"C\",\"\")","v":""},{"$f":"IF(AND(dates>=Début02, dates<=Fin_02,NOT(feries=\"F\")),\"C\",\"\")","v":""},{"$f":"IF(AND(dates>=Début02, dates<=Fin_02,NOT(feries=\"F\")),\"C\",\"\")","v":""},{"$f":"IF(AND(dates>=Début02, dates<=Fin_02,NOT(feries=\"F\")),\"C\",\"\")","v":""},{"$f":"IF(AND(dates>=Début02, dates<=Fin_02,NOT(feries=\"F\")),\"C\",\"\")","v":""},{"$f":"IF(AND(dates>=Début02, dates<=Fin_02,NOT(feries=\"F\")),\"C\",\"\")","v":""},{"$f":"IF(AND(dates>=Début02, dates<=Fin_02,NOT(feries=\"F\")),\"C\",\"\")","v":""},{"$f":"IF(AND(dates>=Début02, dates<=Fin_02,NOT(feries=\"F\")),\"C\",\"\")","v":""},{"$f":"IF(AND(dates>=Début02, dates<=Fin_02,NOT(feries=\"F\")),\"C\",\"\")","v":""},{"$f":"IF(AND(dates>=Début02, dates<=Fin_02,NOT(feries=\"F\")),\"C\",\"\")","v":""},{"$f":"IF(AND(dates>=Début02, dates<=Fin_02,NOT(feries=\"F\")),\"C\",\"\")","v":""},{"$f":"IF(AND(dates>=Début02, dates<=Fin_02,NOT(feries=\"F\")),\"C\",\"\")","v":""},{"$f":"IF(AND(dates>=Début02, dates<=Fin_02,NOT(feries=\"F\")),\"C\",\"\")","v":""},{"$f":"IF(AND(dates>=Début02, dates<=Fin_02,NOT(feries=\"F\")),\"C\",\"\")","v":""},{"$f":"IF(AND(dates>=Début02, dates<=Fin_02,NOT(feries=\"F\")),\"C\",\"\")","v":""},{"$f":"IF(AND(dates>=Début02, dates<=Fin_02,NOT(feries=\"F\")),\"C\",\"\")","v":""},{"$f":"IF(AND(dates>=Début02, dates<=Fin_02,NOT(feries=\"F\")),\"C\",\"\")","v":""},{"$f":"IF(AND(dates>=Début02, dates<=Fin_02,NOT(feries=\"F\")),\"C\",\"\")","v":""},{"$f":"IF(AND(dates>=Début02, dates<=Fin_02,NOT(feries=\"F\")),\"C\",\"\")","v":""},{"$f":"IF(AND(dates>=Début02, dates<=Fin_02,NOT(feries=\"F\")),\"C\",\"\")","v":""},{"$f":"IF(AND(dates>=Début02, dates<=Fin_02,NOT(feries=\"F\")),\"C\",\"\")","v":""},{"$f":"IF(AND(dates>=Début02, dates<=Fin_02,NOT(feries=\"F\")),\"C\",\"\")","v":""},{"$f":"IF(AND(dates>=Début02, dates<=Fin_02,NOT(feries=\"F\")),\"C\",\"\")","v":""},{"$f":"IF(AND(dates>=Début02, dates<=Fin_02,NOT(feries=\"F\")),\"C\",\"\")","v":""},{"$f":"IF(AND(dates>=Début02, dates<=Fin_02,NOT(feries=\"F\")),\"C\",\"\")","v":""},null,null,{"$f":"NETWORKDAYS(BR18,BS18,'jours Féries 2016'!$B$1:$B$14)","v":0},0,{"$f":"IF(AND(dates>=Début03, dates<=Fin_03,NOT(feries=\"F\")),\"C\",\"\")","v":""},{"$f":"IF(AND(dates>=Début03, dates<=Fin_03,NOT(feries=\"F\")),\"C\",\"\")","v":""},{"$f":"IF(AND(dates>=Début03, dates<=Fin_03,NOT(feries=\"F\")),\"C\",\"\")","v":""},{"$f":"IF(AND(dates>=Début03, dates<=Fin_03,NOT(feries=\"F\")),\"C\",\"\")","v":""},{"$f":"IF(AND(dates>=Début03, dates<=Fin_03,NOT(feries=\"F\")),\"C\",\"\")","v":""},{"$f":"IF(AND(dates>=Début03, dates<=Fin_03,NOT(feries=\"F\")),\"C\",\"\")","v":""},{"$f":"IF(AND(dates>=Début03, dates<=Fin_03,NOT(feries=\"F\")),\"C\",\"\")","v":""},{"$f":"IF(AND(dates>=Début03, dates<=Fin_03,NOT(feries=\"F\")),\"C\",\"\")","v":""},{"$f":"IF(AND(dates>=Début03, dates<=Fin_03,NOT(feries=\"F\")),\"C\",\"\")","v":""},{"$f":"IF(AND(dates>=Début03, dates<=Fin_03,NOT(feries=\"F\")),\"C\",\"\")","v":""},{"$f":"IF(AND(dates>=Début03, dates<=Fin_03,NOT(feries=\"F\")),\"C\",\"\")","v":""},{"$f":"IF(AND(dates>=Début03, dates<=Fin_03,NOT(feries=\"F\")),\"C\",\"\")","v":""},{"$f":"IF(AND(dates>=Début03, dates<=Fin_03,NOT(feries=\"F\")),\"C\",\"\")","v":""},{"$f":"IF(AND(dates>=Début03, dates<=Fin_03,NOT(feries=\"F\")),\"C\",\"\")","v":""},{"$f":"IF(AND(dates>=Début03, dates<=Fin_03,NOT(feries=\"F\")),\"C\",\"\")","v":""},{"$f":"IF(AND(dates>=Début03, dates<=Fin_03,NOT(feries=\"F\")),\"C\",\"\")","v":""},{"$f":"IF(AND(dates>=Début03, dates<=Fin_03,NOT(feries=\"F\")),\"C\",\"\")","v":""},{"$f":"IF(AND(dates>=Début03, dates<=Fin_03,NOT(feries=\"F\")),\"C\",\"\")","v":""},{"$f":"IF(AND(dates>=Début03, dates<=Fin_03,NOT(feries=\"F\")),\"C\",\"\")","v":""},{"$f":"IF(AND(dates>=Début03, dates<=Fin_03,NOT(feries=\"F\")),\"C\",\"\")","v":""},{"$f":"IF(AND(dates>=Début03, dates<=Fin_03,NOT(feries=\"F\")),\"C\",\"\")","v":""},{"$f":"IF(AND(dates>=Début03, dates<=Fin_03,NOT(feries=\"F\")),\"C\",\"\")","v":""},{"$f":"IF(AND(dates>=Début03, dates<=Fin_03,NOT(feries=\"F\")),\"C\",\"\")","v":""},{"$f":"IF(AND(dates>=Début03, dates<=Fin_03,NOT(feries=\"F\")),\"C\",\"\")","v":""},{"$f":"IF(AND(dates>=Début03, dates<=Fin_03,NOT(feries=\"F\")),\"C\",\"\")","v":""},{"$f":"IF(AND(dates>=Début03, dates<=Fin_03,NOT(feries=\"F\")),\"C\",\"\")","v":""},{"$f":"IF(AND(dates>=Début03, dates<=Fin_03,NOT(feries=\"F\")),\"C\",\"\")","v":""},{"$f":"IF(AND(dates>=Début03, dates<=Fin_03,NOT(feries=\"F\")),\"C\",\"\")","v":""},{"$f":"IF(AND(dates>=Début03, dates<=Fin_03,NOT(feries=\"F\")),\"C\",\"\")","v":""},{"$f":"IF(AND(dates>=Début03, dates<=Fin_03,NOT(feries=\"F\")),\"C\",\"\")","v":""},{"$f":"IF(AND(dates>=Début03, dates<=Fin_03,NOT(feries=\"F\")),\"C\",\"\")","v":""},null,null,{"$f":"NETWORKDAYS(DA18,DB18,'jours Féries 2016'!$B$1:$B$14)","v":0},0,{"$f":"IF(AND(dates>=Début04, dates<=Fin_04,NOT(feries=\"F\")),\"C\",\"\")","v":""},{"$f":"IF(AND(dates>=Début04, dates<=Fin_04,NOT(feries=\"F\")),\"C\",\"\")","v":""},{"$f":"IF(AND(dates>=Début04, dates<=Fin_04,NOT(feries=\"F\")),\"C\",\"\")","v":""},{"$f":"IF(AND(dates>=Début04, dates<=Fin_04,NOT(feries=\"F\")),\"C\",\"\")","v":""},{"$f":"IF(AND(dates>=Début04, dates<=Fin_04,NOT(feries=\"F\")),\"C\",\"\")","v":""},{"$f":"IF(AND(dates>=Début04, dates<=Fin_04,NOT(feries=\"F\")),\"C\",\"\")","v":""},{"$f":"IF(AND(dates>=Début04, dates<=Fin_04,NOT(feries=\"F\")),\"C\",\"\")","v":""},{"$f":"IF(AND(dates>=Début04, dates<=Fin_04,NOT(feries=\"F\")),\"C\",\"\")","v":""},{"$f":"IF(AND(dates>=Début04, dates<=Fin_04,NOT(feries=\"F\")),\"C\",\"\")","v":""},{"$f":"IF(AND(dates>=Début04, dates<=Fin_04,NOT(feries=\"F\")),\"C\",\"\")","v":""},{"$f":"IF(AND(dates>=Début04, dates<=Fin_04,NOT(feries=\"F\")),\"C\",\"\")","v":""},{"$f":"IF(AND(dates>=Début04, dates<=Fin_04,NOT(feries=\"F\")),\"C\",\"\")","v":""},{"$f":"IF(AND(dates>=Début04, dates<=Fin_04,NOT(feries=\"F\")),\"C\",\"\")","v":""},{"$f":"IF(AND(dates>=Début04, dates<=Fin_04,NOT(feries=\"F\")),\"C\",\"\")","v":""},{"$f":"IF(AND(dates>=Début04, dates<=Fin_04,NOT(feries=\"F\")),\"C\",\"\")","v":""},{"$f":"IF(AND(dates>=Début04, dates<=Fin_04,NOT(feries=\"F\")),\"C\",\"\")","v":""},{"$f":"IF(AND(dates>=Début04, dates<=Fin_04,NOT(feries=\"F\")),\"C\",\"\")","v":""},{"$f":"IF(AND(dates>=Début04, dates<=Fin_04,NOT(feries=\"F\")),\"C\",\"\")","v":""},{"$f":"IF(AND(dates>=Début04, dates<=Fin_04,NOT(feries=\"F\")),\"C\",\"\")","v":""},{"$f":"IF(AND(dates>=Début04, dates<=Fin_04,NOT(feries=\"F\")),\"C\",\"\")","v":""},{"$f":"IF(AND(dates>=Début04, dates<=Fin_04,NOT(feries=\"F\")),\"C\",\"\")","v":""},{"$f":"IF(AND(dates>=Début04, dates<=Fin_04,NOT(feries=\"F\")),\"C\",\"\")","v":""},{"$f":"IF(AND(dates>=Début04, dates<=Fin_04,NOT(feries=\"F\")),\"C\",\"\")","v":""},{"$f":"IF(AND(dates>=Début04, dates<=Fin_04,NOT(feries=\"F\")),\"C\",\"\")","v":""},{"$f":"IF(AND(dates>=Début04, dates<=Fin_04,NOT(feries=\"F\")),\"C\",\"\")","v":""},{"$f":"IF(AND(dates>=Début04, dates<=Fin_04,NOT(feries=\"F\")),\"C\",\"\")","v":""},{"$f":"IF(AND(dates>=Début04, dates<=Fin_04,NOT(feries=\"F\")),\"C\",\"\")","v":""},{"$f":"IF(AND(dates>=Début04, dates<=Fin_04,NOT(feries=\"F\")),\"C\",\"\")","v":""},{"$f":"IF(AND(dates>=Début04, dates<=Fin_04,NOT(feries=\"F\")),\"C\",\"\")","v":""},{"$f":"IF(AND(dates>=Début04, dates<=Fin_04,NOT(feries=\"F\")),\"C\",\"\")","v":""},null,null,{"$f":"NETWORKDAYS(EI18,EJ18,'jours Féries 2016'!$B$1:$B$14)","v":0},{"$f":"COUNTIF(EM18:GD18,\"C\")","v":0},"","","","","","","","","","","","","","","","","","","","","","","","","","","","","","","",null,"","","","","","","","","","","","","","","","","","","","","","","","","","","","","","","","","","","","","","","","","","","","","","","","","","","","","","","","","","","","","","","","","","","","","","","","","","","","","","","","","","","","","","","","","","","","","","","","","","","","","","","","","","","","","","","","","",{"$f":"IF(AND(dates>=Début01, dates<=Fin_01,NOT(feries=\"F\")),\"C\",\"\")","v":""},"","","","","","","","","","","","","","","","","","","","","","","","","","","","","","","","","","","","","","","","","","","","","","","","","","","","","","","","","","","","","","","","","","","","","","","","","","","","","","","","","","","","","","","","","","","","","","","","","","","",""]
["EMPLOYE13","2016-01-13","2016-01-22",{"$f":"NETWORKDAYS(B19,C19,'jours Féries 2016'!$B$1:$B$14)","v":8},8,"","","","","","","","","","","","","C","C","C","","","C","C","C","C","C","","","","","","","","","",null,null,{"$f":"NETWORKDAYS(AK19,AL19,'jours Féries 2016'!$B$1:$B$14)","v":0},0,{"$f":"IF(AND(dates>=Début02, dates<=Fin_02,NOT(feries=\"F\")),\"C\",\"\")","v":""},{"$f":"IF(AND(dates>=Début02, dates<=Fin_02,NOT(feries=\"F\")),\"C\",\"\")","v":""},{"$f":"IF(AND(dates>=Début02, dates<=Fin_02,NOT(feries=\"F\")),\"C\",\"\")","v":""},{"$f":"IF(AND(dates>=Début02, dates<=Fin_02,NOT(feries=\"F\")),\"C\",\"\")","v":""},{"$f":"IF(AND(dates>=Début02, dates<=Fin_02,NOT(feries=\"F\")),\"C\",\"\")","v":""},{"$f":"IF(AND(dates>=Début02, dates<=Fin_02,NOT(feries=\"F\")),\"C\",\"\")","v":""},{"$f":"IF(AND(dates>=Début02, dates<=Fin_02,NOT(feries=\"F\")),\"C\",\"\")","v":""},{"$f":"IF(AND(dates>=Début02, dates<=Fin_02,NOT(feries=\"F\")),\"C\",\"\")","v":""},{"$f":"IF(AND(dates>=Début02, dates<=Fin_02,NOT(feries=\"F\")),\"C\",\"\")","v":""},{"$f":"IF(AND(dates>=Début02, dates<=Fin_02,NOT(feries=\"F\")),\"C\",\"\")","v":""},{"$f":"IF(AND(dates>=Début02, dates<=Fin_02,NOT(feries=\"F\")),\"C\",\"\")","v":""},{"$f":"IF(AND(dates>=Début02, dates<=Fin_02,NOT(feries=\"F\")),\"C\",\"\")","v":""},{"$f":"IF(AND(dates>=Début02, dates<=Fin_02,NOT(feries=\"F\")),\"C\",\"\")","v":""},{"$f":"IF(AND(dates>=Début02, dates<=Fin_02,NOT(feries=\"F\")),\"C\",\"\")","v":""},{"$f":"IF(AND(dates>=Début02, dates<=Fin_02,NOT(feries=\"F\")),\"C\",\"\")","v":""},{"$f":"IF(AND(dates>=Début02, dates<=Fin_02,NOT(feries=\"F\")),\"C\",\"\")","v":""},{"$f":"IF(AND(dates>=Début02, dates<=Fin_02,NOT(feries=\"F\")),\"C\",\"\")","v":""},{"$f":"IF(AND(dates>=Début02, dates<=Fin_02,NOT(feries=\"F\")),\"C\",\"\")","v":""},{"$f":"IF(AND(dates>=Début02, dates<=Fin_02,NOT(feries=\"F\")),\"C\",\"\")","v":""},{"$f":"IF(AND(dates>=Début02, dates<=Fin_02,NOT(feries=\"F\")),\"C\",\"\")","v":""},{"$f":"IF(AND(dates>=Début02, dates<=Fin_02,NOT(feries=\"F\")),\"C\",\"\")","v":""},{"$f":"IF(AND(dates>=Début02, dates<=Fin_02,NOT(feries=\"F\")),\"C\",\"\")","v":""},{"$f":"IF(AND(dates>=Début02, dates<=Fin_02,NOT(feries=\"F\")),\"C\",\"\")","v":""},{"$f":"IF(AND(dates>=Début02, dates<=Fin_02,NOT(feries=\"F\")),\"C\",\"\")","v":""},{"$f":"IF(AND(dates>=Début02, dates<=Fin_02,NOT(feries=\"F\")),\"C\",\"\")","v":""},{"$f":"IF(AND(dates>=Début02, dates<=Fin_02,NOT(feries=\"F\")),\"C\",\"\")","v":""},{"$f":"IF(AND(dates>=Début02, dates<=Fin_02,NOT(feries=\"F\")),\"C\",\"\")","v":""},{"$f":"IF(AND(dates>=Début02, dates<=Fin_02,NOT(feries=\"F\")),\"C\",\"\")","v":""},{"$f":"IF(AND(dates>=Début02, dates<=Fin_02,NOT(feries=\"F\")),\"C\",\"\")","v":""},null,null,{"$f":"NETWORKDAYS(BR19,BS19,'jours Féries 2016'!$B$1:$B$14)","v":0},0,{"$f":"IF(AND(dates>=Début03, dates<=Fin_03,NOT(feries=\"F\")),\"C\",\"\")","v":""},{"$f":"IF(AND(dates>=Début03, dates<=Fin_03,NOT(feries=\"F\")),\"C\",\"\")","v":""},{"$f":"IF(AND(dates>=Début03, dates<=Fin_03,NOT(feries=\"F\")),\"C\",\"\")","v":""},{"$f":"IF(AND(dates>=Début03, dates<=Fin_03,NOT(feries=\"F\")),\"C\",\"\")","v":""},{"$f":"IF(AND(dates>=Début03, dates<=Fin_03,NOT(feries=\"F\")),\"C\",\"\")","v":""},{"$f":"IF(AND(dates>=Début03, dates<=Fin_03,NOT(feries=\"F\")),\"C\",\"\")","v":""},{"$f":"IF(AND(dates>=Début03, dates<=Fin_03,NOT(feries=\"F\")),\"C\",\"\")","v":""},{"$f":"IF(AND(dates>=Début03, dates<=Fin_03,NOT(feries=\"F\")),\"C\",\"\")","v":""},{"$f":"IF(AND(dates>=Début03, dates<=Fin_03,NOT(feries=\"F\")),\"C\",\"\")","v":""},{"$f":"IF(AND(dates>=Début03, dates<=Fin_03,NOT(feries=\"F\")),\"C\",\"\")","v":""},{"$f":"IF(AND(dates>=Début03, dates<=Fin_03,NOT(feries=\"F\")),\"C\",\"\")","v":""},{"$f":"IF(AND(dates>=Début03, dates<=Fin_03,NOT(feries=\"F\")),\"C\",\"\")","v":""},{"$f":"IF(AND(dates>=Début03, dates<=Fin_03,NOT(feries=\"F\")),\"C\",\"\")","v":""},{"$f":"IF(AND(dates>=Début03, dates<=Fin_03,NOT(feries=\"F\")),\"C\",\"\")","v":""},{"$f":"IF(AND(dates>=Début03, dates<=Fin_03,NOT(feries=\"F\")),\"C\",\"\")","v":""},{"$f":"IF(AND(dates>=Début03, dates<=Fin_03,NOT(feries=\"F\")),\"C\",\"\")","v":""},{"$f":"IF(AND(dates>=Début03, dates<=Fin_03,NOT(feries=\"F\")),\"C\",\"\")","v":""},{"$f":"IF(AND(dates>=Début03, dates<=Fin_03,NOT(feries=\"F\")),\"C\",\"\")","v":""},{"$f":"IF(AND(dates>=Début03, dates<=Fin_03,NOT(feries=\"F\")),\"C\",\"\")","v":""},{"$f":"IF(AND(dates>=Début03, dates<=Fin_03,NOT(feries=\"F\")),\"C\",\"\")","v":""},{"$f":"IF(AND(dates>=Début03, dates<=Fin_03,NOT(feries=\"F\")),\"C\",\"\")","v":""},{"$f":"IF(AND(dates>=Début03, dates<=Fin_03,NOT(feries=\"F\")),\"C\",\"\")","v":""},{"$f":"IF(AND(dates>=Début03, dates<=Fin_03,NOT(feries=\"F\")),\"C\",\"\")","v":""},{"$f":"IF(AND(dates>=Début03, dates<=Fin_03,NOT(feries=\"F\")),\"C\",\"\")","v":""},{"$f":"IF(AND(dates>=Début03, dates<=Fin_03,NOT(feries=\"F\")),\"C\",\"\")","v":""},{"$f":"IF(AND(dates>=Début03, dates<=Fin_03,NOT(feries=\"F\")),\"C\",\"\")","v":""},{"$f":"IF(AND(dates>=Début03, dates<=Fin_03,NOT(feries=\"F\")),\"C\",\"\")","v":""},{"$f":"IF(AND(dates>=Début03, dates<=Fin_03,NOT(feries=\"F\")),\"C\",\"\")","v":""},{"$f":"IF(AND(dates>=Début03, dates<=Fin_03,NOT(feries=\"F\")),\"C\",\"\")","v":""},{"$f":"IF(AND(dates>=Début03, dates<=Fin_03,NOT(feries=\"F\")),\"C\",\"\")","v":""},{"$f":"IF(AND(dates>=Début03, dates<=Fin_03,NOT(feries=\"F\")),\"C\",\"\")","v":""},null,null,{"$f":"NETWORKDAYS(DA19,DB19,'jours Féries 2016'!$B$1:$B$14)","v":0},0,{"$f":"IF(AND(dates>=Début04, dates<=Fin_04,NOT(feries=\"F\")),\"C\",\"\")","v":""},{"$f":"IF(AND(dates>=Début04, dates<=Fin_04,NOT(feries=\"F\")),\"C\",\"\")","v":""},{"$f":"IF(AND(dates>=Début04, dates<=Fin_04,NOT(feries=\"F\")),\"C\",\"\")","v":""},{"$f":"IF(AND(dates>=Début04, dates<=Fin_04,NOT(feries=\"F\")),\"C\",\"\")","v":""},{"$f":"IF(AND(dates>=Début04, dates<=Fin_04,NOT(feries=\"F\")),\"C\",\"\")","v":""},{"$f":"IF(AND(dates>=Début04, dates<=Fin_04,NOT(feries=\"F\")),\"C\",\"\")","v":""},{"$f":"IF(AND(dates>=Début04, dates<=Fin_04,NOT(feries=\"F\")),\"C\",\"\")","v":""},{"$f":"IF(AND(dates>=Début04, dates<=Fin_04,NOT(feries=\"F\")),\"C\",\"\")","v":""},{"$f":"IF(AND(dates>=Début04, dates<=Fin_04,NOT(feries=\"F\")),\"C\",\"\")","v":""},{"$f":"IF(AND(dates>=Début04, dates<=Fin_04,NOT(feries=\"F\")),\"C\",\"\")","v":""},{"$f":"IF(AND(dates>=Début04, dates<=Fin_04,NOT(feries=\"F\")),\"C\",\"\")","v":""},{"$f":"IF(AND(dates>=Début04, dates<=Fin_04,NOT(feries=\"F\")),\"C\",\"\")","v":""},{"$f":"IF(AND(dates>=Début04, dates<=Fin_04,NOT(feries=\"F\")),\"C\",\"\")","v":""},{"$f":"IF(AND(dates>=Début04, dates<=Fin_04,NOT(feries=\"F\")),\"C\",\"\")","v":""},{"$f":"IF(AND(dates>=Début04, dates<=Fin_04,NOT(feries=\"F\")),\"C\",\"\")","v":""},{"$f":"IF(AND(dates>=Début04, dates<=Fin_04,NOT(feries=\"F\")),\"C\",\"\")","v":""},{"$f":"IF(AND(dates>=Début04, dates<=Fin_04,NOT(feries=\"F\")),\"C\",\"\")","v":""},{"$f":"IF(AND(dates>=Début04, dates<=Fin_04,NOT(feries=\"F\")),\"C\",\"\")","v":""},{"$f":"IF(AND(dates>=Début04, dates<=Fin_04,NOT(feries=\"F\")),\"C\",\"\")","v":""},{"$f":"IF(AND(dates>=Début04, dates<=Fin_04,NOT(feries=\"F\")),\"C\",\"\")","v":""},{"$f":"IF(AND(dates>=Début04, dates<=Fin_04,NOT(feries=\"F\")),\"C\",\"\")","v":""},{"$f":"IF(AND(dates>=Début04, dates<=Fin_04,NOT(feries=\"F\")),\"C\",\"\")","v":""},{"$f":"IF(AND(dates>=Début04, dates<=Fin_04,NOT(feries=\"F\")),\"C\",\"\")","v":""},{"$f":"IF(AND(dates>=Début04, dates<=Fin_04,NOT(feries=\"F\")),\"C\",\"\")","v":""},{"$f":"IF(AND(dates>=Début04, dates<=Fin_04,NOT(feries=\"F\")),\"C\",\"\")","v":""},{"$f":"IF(AND(dates>=Début04, dates<=Fin_04,NOT(feries=\"F\")),\"C\",\"\")","v":""},{"$f":"IF(AND(dates>=Début04, dates<=Fin_04,NOT(feries=\"F\")),\"C\",\"\")","v":""},{"$f":"IF(AND(dates>=Début04, dates<=Fin_04,NOT(feries=\"F\")),\"C\",\"\")","v":""},{"$f":"IF(AND(dates>=Début04, dates<=Fin_04,NOT(feries=\"F\")),\"C\",\"\")","v":""},{"$f":"IF(AND(dates>=Début04, dates<=Fin_04,NOT(feries=\"F\")),\"C\",\"\")","v":""},null,null,{"$f":"NETWORKDAYS(EI19,EJ19,'jours Féries 2016'!$B$1:$B$14)","v":0},{"$f":"COUNTIF(EM19:GD19,\"C\")","v":0},{"$f":"IF(AND(dates>=Début01, dates<=Fin_01,NOT(feries=\"F\")),\"C\",\"\")","v":""},"","","","","","","","","","","","","","","","","","","","","","","","","","","","","","",null,"","","","","","","","","","","","","","","","","","","","","","","","","","","","","","","","","","","","","","","","","","","","","","","","","","",{"$f":"IF(AND(dates>=Début01, dates<=Fin_01,NOT(feries=\"F\")),\"C\",\"\")","v":""},"","","","","","","","","","","","","","","","","","","","","","","","","","","","","","","","","","","","","","","","","","","","","","","","","","","","","","","","","","","","","","","","","","","","","","","","","","","","","","","","","","","","","","","","","","","","","","","","","","","","","","","","","","","","","","","","","","","","","","","","","","","","","","","","","","","","","","","","","","","","","","","","","","","","","","","","","","","","","","","","","","",""]
["EMPLOYE14","2016-01-14","2016-01-23",{"$f":"NETWORKDAYS(B20,C20,'jours Féries 2016'!$B$1:$B$14)","v":7},7,"","","","","","","","","","","","","","C","C","","","C","C","C","C","C","","","","","","","","","",null,null,{"$f":"NETWORKDAYS(AK20,AL20,'jours Féries 2016'!$B$1:$B$14)","v":0},0,{"$f":"IF(AND(dates>=Début02, dates<=Fin_02,NOT(feries=\"F\")),\"C\",\"\")","v":""},{"$f":"IF(AND(dates>=Début02, dates<=Fin_02,NOT(feries=\"F\")),\"C\",\"\")","v":""},{"$f":"IF(AND(dates>=Début02, dates<=Fin_02,NOT(feries=\"F\")),\"C\",\"\")","v":""},{"$f":"IF(AND(dates>=Début02, dates<=Fin_02,NOT(feries=\"F\")),\"C\",\"\")","v":""},{"$f":"IF(AND(dates>=Début02, dates<=Fin_02,NOT(feries=\"F\")),\"C\",\"\")","v":""},{"$f":"IF(AND(dates>=Début02, dates<=Fin_02,NOT(feries=\"F\")),\"C\",\"\")","v":""},{"$f":"IF(AND(dates>=Début02, dates<=Fin_02,NOT(feries=\"F\")),\"C\",\"\")","v":""},{"$f":"IF(AND(dates>=Début02, dates<=Fin_02,NOT(feries=\"F\")),\"C\",\"\")","v":""},{"$f":"IF(AND(dates>=Début02, dates<=Fin_02,NOT(feries=\"F\")),\"C\",\"\")","v":""},{"$f":"IF(AND(dates>=Début02, dates<=Fin_02,NOT(feries=\"F\")),\"C\",\"\")","v":""},{"$f":"IF(AND(dates>=Début02, dates<=Fin_02,NOT(feries=\"F\")),\"C\",\"\")","v":""},{"$f":"IF(AND(dates>=Début02, dates<=Fin_02,NOT(feries=\"F\")),\"C\",\"\")","v":""},{"$f":"IF(AND(dates>=Début02, dates<=Fin_02,NOT(feries=\"F\")),\"C\",\"\")","v":""},{"$f":"IF(AND(dates>=Début02, dates<=Fin_02,NOT(feries=\"F\")),\"C\",\"\")","v":""},{"$f":"IF(AND(dates>=Début02, dates<=Fin_02,NOT(feries=\"F\")),\"C\",\"\")","v":""},{"$f":"IF(AND(dates>=Début02, dates<=Fin_02,NOT(feries=\"F\")),\"C\",\"\")","v":""},{"$f":"IF(AND(dates>=Début02, dates<=Fin_02,NOT(feries=\"F\")),\"C\",\"\")","v":""},{"$f":"IF(AND(dates>=Début02, dates<=Fin_02,NOT(feries=\"F\")),\"C\",\"\")","v":""},{"$f":"IF(AND(dates>=Début02, dates<=Fin_02,NOT(feries=\"F\")),\"C\",\"\")","v":""},{"$f":"IF(AND(dates>=Début02, dates<=Fin_02,NOT(feries=\"F\")),\"C\",\"\")","v":""},{"$f":"IF(AND(dates>=Début02, dates<=Fin_02,NOT(feries=\"F\")),\"C\",\"\")","v":""},{"$f":"IF(AND(dates>=Début02, dates<=Fin_02,NOT(feries=\"F\")),\"C\",\"\")","v":""},{"$f":"IF(AND(dates>=Début02, dates<=Fin_02,NOT(feries=\"F\")),\"C\",\"\")","v":""},{"$f":"IF(AND(dates>=Début02, dates<=Fin_02,NOT(feries=\"F\")),\"C\",\"\")","v":""},{"$f":"IF(AND(dates>=Début02, dates<=Fin_02,NOT(feries=\"F\")),\"C\",\"\")","v":""},{"$f":"IF(AND(dates>=Début02, dates<=Fin_02,NOT(feries=\"F\")),\"C\",\"\")","v":""},{"$f":"IF(AND(dates>=Début02, dates<=Fin_02,NOT(feries=\"F\")),\"C\",\"\")","v":""},{"$f":"IF(AND(dates>=Début02, dates<=Fin_02,NOT(feries=\"F\")),\"C\",\"\")","v":""},{"$f":"IF(AND(dates>=Début02, dates<=Fin_02,NOT(feries=\"F\")),\"C\",\"\")","v":""},null,null,{"$f":"NETWORKDAYS(BR20,BS20,'jours Féries 2016'!$B$1:$B$14)","v":0},0,{"$f":"IF(AND(dates>=Début03, dates<=Fin_03,NOT(feries=\"F\")),\"C\",\"\")","v":""},{"$f":"IF(AND(dates>=Début03, dates<=Fin_03,NOT(feries=\"F\")),\"C\",\"\")","v":""},{"$f":"IF(AND(dates>=Début03, dates<=Fin_03,NOT(feries=\"F\")),\"C\",\"\")","v":""},{"$f":"IF(AND(dates>=Début03, dates<=Fin_03,NOT(feries=\"F\")),\"C\",\"\")","v":""},{"$f":"IF(AND(dates>=Début03, dates<=Fin_03,NOT(feries=\"F\")),\"C\",\"\")","v":""},{"$f":"IF(AND(dates>=Début03, dates<=Fin_03,NOT(feries=\"F\")),\"C\",\"\")","v":""},{"$f":"IF(AND(dates>=Début03, dates<=Fin_03,NOT(feries=\"F\")),\"C\",\"\")","v":""},{"$f":"IF(AND(dates>=Début03, dates<=Fin_03,NOT(feries=\"F\")),\"C\",\"\")","v":""},{"$f":"IF(AND(dates>=Début03, dates<=Fin_03,NOT(feries=\"F\")),\"C\",\"\")","v":""},{"$f":"IF(AND(dates>=Début03, dates<=Fin_03,NOT(feries=\"F\")),\"C\",\"\")","v":""},{"$f":"IF(AND(dates>=Début03, dates<=Fin_03,NOT(feries=\"F\")),\"C\",\"\")","v":""},{"$f":"IF(AND(dates>=Début03, dates<=Fin_03,NOT(feries=\"F\")),\"C\",\"\")","v":""},{"$f":"IF(AND(dates>=Début03, dates<=Fin_03,NOT(feries=\"F\")),\"C\",\"\")","v":""},{"$f":"IF(AND(dates>=Début03, dates<=Fin_03,NOT(feries=\"F\")),\"C\",\"\")","v":""},{"$f":"IF(AND(dates>=Début03, dates<=Fin_03,NOT(feries=\"F\")),\"C\",\"\")","v":""},{"$f":"IF(AND(dates>=Début03, dates<=Fin_03,NOT(feries=\"F\")),\"C\",\"\")","v":""},{"$f":"IF(AND(dates>=Début03, dates<=Fin_03,NOT(feries=\"F\")),\"C\",\"\")","v":""},{"$f":"IF(AND(dates>=Début03, dates<=Fin_03,NOT(feries=\"F\")),\"C\",\"\")","v":""},{"$f":"IF(AND(dates>=Début03, dates<=Fin_03,NOT(feries=\"F\")),\"C\",\"\")","v":""},{"$f":"IF(AND(dates>=Début03, dates<=Fin_03,NOT(feries=\"F\")),\"C\",\"\")","v":""},{"$f":"IF(AND(dates>=Début03, dates<=Fin_03,NOT(feries=\"F\")),\"C\",\"\")","v":""},{"$f":"IF(AND(dates>=Début03, dates<=Fin_03,NOT(feries=\"F\")),\"C\",\"\")","v":""},{"$f":"IF(AND(dates>=Début03, dates<=Fin_03,NOT(feries=\"F\")),\"C\",\"\")","v":""},{"$f":"IF(AND(dates>=Début03, dates<=Fin_03,NOT(feries=\"F\")),\"C\",\"\")","v":""},{"$f":"IF(AND(dates>=Début03, dates<=Fin_03,NOT(feries=\"F\")),\"C\",\"\")","v":""},{"$f":"IF(AND(dates>=Début03, dates<=Fin_03,NOT(feries=\"F\")),\"C\",\"\")","v":""},{"$f":"IF(AND(dates>=Début03, dates<=Fin_03,NOT(feries=\"F\")),\"C\",\"\")","v":""},{"$f":"IF(AND(dates>=Début03, dates<=Fin_03,NOT(feries=\"F\")),\"C\",\"\")","v":""},{"$f":"IF(AND(dates>=Début03, dates<=Fin_03,NOT(feries=\"F\")),\"C\",\"\")","v":""},{"$f":"IF(AND(dates>=Début03, dates<=Fin_03,NOT(feries=\"F\")),\"C\",\"\")","v":""},{"$f":"IF(AND(dates>=Début03, dates<=Fin_03,NOT(feries=\"F\")),\"C\",\"\")","v":""},null,null,{"$f":"NETWORKDAYS(DA20,DB20,'jours Féries 2016'!$B$1:$B$14)","v":0},0,{"$f":"IF(AND(dates>=Début04, dates<=Fin_04,NOT(feries=\"F\")),\"C\",\"\")","v":""},{"$f":"IF(AND(dates>=Début04, dates<=Fin_04,NOT(feries=\"F\")),\"C\",\"\")","v":""},{"$f":"IF(AND(dates>=Début04, dates<=Fin_04,NOT(feries=\"F\")),\"C\",\"\")","v":""},{"$f":"IF(AND(dates>=Début04, dates<=Fin_04,NOT(feries=\"F\")),\"C\",\"\")","v":""},{"$f":"IF(AND(dates>=Début04, dates<=Fin_04,NOT(feries=\"F\")),\"C\",\"\")","v":""},{"$f":"IF(AND(dates>=Début04, dates<=Fin_04,NOT(feries=\"F\")),\"C\",\"\")","v":""},{"$f":"IF(AND(dates>=Début04, dates<=Fin_04,NOT(feries=\"F\")),\"C\",\"\")","v":""},{"$f":"IF(AND(dates>=Début04, dates<=Fin_04,NOT(feries=\"F\")),\"C\",\"\")","v":""},{"$f":"IF(AND(dates>=Début04, dates<=Fin_04,NOT(feries=\"F\")),\"C\",\"\")","v":""},{"$f":"IF(AND(dates>=Début04, dates<=Fin_04,NOT(feries=\"F\")),\"C\",\"\")","v":""},{"$f":"IF(AND(dates>=Début04, dates<=Fin_04,NOT(feries=\"F\")),\"C\",\"\")","v":""},{"$f":"IF(AND(dates>=Début04, dates<=Fin_04,NOT(feries=\"F\")),\"C\",\"\")","v":""},{"$f":"IF(AND(dates>=Début04, dates<=Fin_04,NOT(feries=\"F\")),\"C\",\"\")","v":""},{"$f":"IF(AND(dates>=Début04, dates<=Fin_04,NOT(feries=\"F\")),\"C\",\"\")","v":""},{"$f":"IF(AND(dates>=Début04, dates<=Fin_04,NOT(feries=\"F\")),\"C\",\"\")","v":""},{"$f":"IF(AND(dates>=Début04, dates<=Fin_04,NOT(feries=\"F\")),\"C\",\"\")","v":""},{"$f":"IF(AND(dates>=Début04, dates<=Fin_04,NOT(feries=\"F\")),\"C\",\"\")","v":""},{"$f":"IF(AND(dates>=Début04, dates<=Fin_04,NOT(feries=\"F\")),\"C\",\"\")","v":""},{"$f":"IF(AND(dates>=Début04, dates<=Fin_04,NOT(feries=\"F\")),\"C\",\"\")","v":""},{"$f":"IF(AND(dates>=Début04, dates<=Fin_04,NOT(feries=\"F\")),\"C\",\"\")","v":""},{"$f":"IF(AND(dates>=Début04, dates<=Fin_04,NOT(feries=\"F\")),\"C\",\"\")","v":""},{"$f":"IF(AND(dates>=Début04, dates<=Fin_04,NOT(feries=\"F\")),\"C\",\"\")","v":""},{"$f":"IF(AND(dates>=Début04, dates<=Fin_04,NOT(feries=\"F\")),\"C\",\"\")","v":""},{"$f":"IF(AND(dates>=Début04, dates<=Fin_04,NOT(feries=\"F\")),\"C\",\"\")","v":""},{"$f":"IF(AND(dates>=Début04, dates<=Fin_04,NOT(feries=\"F\")),\"C\",\"\")","v":""},{"$f":"IF(AND(dates>=Début04, dates<=Fin_04,NOT(feries=\"F\")),\"C\",\"\")","v":""},{"$f":"IF(AND(dates>=Début04, dates<=Fin_04,NOT(feries=\"F\")),\"C\",\"\")","v":""},{"$f":"IF(AND(dates>=Début04, dates<=Fin_04,NOT(feries=\"F\")),\"C\",\"\")","v":""},{"$f":"IF(AND(dates>=Début04, dates<=Fin_04,NOT(feries=\"F\")),\"C\",\"\")","v":""},{"$f":"IF(AND(dates>=Début04, dates<=Fin_04,NOT(feries=\"F\")),\"C\",\"\")","v":""},null,null,{"$f":"NETWORKDAYS(EI20,EJ20,'jours Féries 2016'!$B$1:$B$14)","v":0},{"$f":"COUNTIF(EM20:GD20,\"C\")","v":0},"","","","","","",{"$f":"IF(AND(dates>=Début01, dates<=Fin_01,NOT(feries=\"F\")),\"C\",\"\")","v":""},"","","","","","","","","","","","","","","","","","","","","","","","",null,"","","","","","","","","","","","","","","","","","","","","","","","","","","","","","","","","","","","","","","","","","","","","","","","","","","","","","","","","","","","","","","","","","","","","","","","","","","","","","","","","","","","","","","","","","","","","","","","","","","","","","","","","","","","","","","","","","","","","","","","","","","","","","","","","","","","","","","","","","","","","","","","","","","","","","","","","","","","","","","","","","","","","","","","","","","","","","","","","","","","","","","","","","","","","","","","","","","","","","","","","","","","","","","","","","","","","",""]
["EMPLOYE15","2016-01-15","2016-01-24",{"$f":"NETWORKDAYS(B21,C21,'jours Féries 2016'!$B$1:$B$14)","v":6},6,"","","","","","","","","","","","","","","C","","","C","C","C","C","C","","","","","","","","","",null,null,{"$f":"NETWORKDAYS(AK21,AL21,'jours Féries 2016'!$B$1:$B$14)","v":0},0,{"$f":"IF(AND(dates>=Début02, dates<=Fin_02,NOT(feries=\"F\")),\"C\",\"\")","v":""},{"$f":"IF(AND(dates>=Début02, dates<=Fin_02,NOT(feries=\"F\")),\"C\",\"\")","v":""},{"$f":"IF(AND(dates>=Début02, dates<=Fin_02,NOT(feries=\"F\")),\"C\",\"\")","v":""},{"$f":"IF(AND(dates>=Début02, dates<=Fin_02,NOT(feries=\"F\")),\"C\",\"\")","v":""},{"$f":"IF(AND(dates>=Début02, dates<=Fin_02,NOT(feries=\"F\")),\"C\",\"\")","v":""},{"$f":"IF(AND(dates>=Début02, dates<=Fin_02,NOT(feries=\"F\")),\"C\",\"\")","v":""},{"$f":"IF(AND(dates>=Début02, dates<=Fin_02,NOT(feries=\"F\")),\"C\",\"\")","v":""},{"$f":"IF(AND(dates>=Début02, dates<=Fin_02,NOT(feries=\"F\")),\"C\",\"\")","v":""},{"$f":"IF(AND(dates>=Début02, dates<=Fin_02,NOT(feries=\"F\")),\"C\",\"\")","v":""},{"$f":"IF(AND(dates>=Début02, dates<=Fin_02,NOT(feries=\"F\")),\"C\",\"\")","v":""},{"$f":"IF(AND(dates>=Début02, dates<=Fin_02,NOT(feries=\"F\")),\"C\",\"\")","v":""},{"$f":"IF(AND(dates>=Début02, dates<=Fin_02,NOT(feries=\"F\")),\"C\",\"\")","v":""},{"$f":"IF(AND(dates>=Début02, dates<=Fin_02,NOT(feries=\"F\")),\"C\",\"\")","v":""},{"$f":"IF(AND(dates>=Début02, dates<=Fin_02,NOT(feries=\"F\")),\"C\",\"\")","v":""},{"$f":"IF(AND(dates>=Début02, dates<=Fin_02,NOT(feries=\"F\")),\"C\",\"\")","v":""},{"$f":"IF(AND(dates>=Début02, dates<=Fin_02,NOT(feries=\"F\")),\"C\",\"\")","v":""},{"$f":"IF(AND(dates>=Début02, dates<=Fin_02,NOT(feries=\"F\")),\"C\",\"\")","v":""},{"$f":"IF(AND(dates>=Début02, dates<=Fin_02,NOT(feries=\"F\")),\"C\",\"\")","v":""},{"$f":"IF(AND(dates>=Début02, dates<=Fin_02,NOT(feries=\"F\")),\"C\",\"\")","v":""},{"$f":"IF(AND(dates>=Début02, dates<=Fin_02,NOT(feries=\"F\")),\"C\",\"\")","v":""},{"$f":"IF(AND(dates>=Début02, dates<=Fin_02,NOT(feries=\"F\")),\"C\",\"\")","v":""},{"$f":"IF(AND(dates>=Début02, dates<=Fin_02,NOT(feries=\"F\")),\"C\",\"\")","v":""},{"$f":"IF(AND(dates>=Début02, dates<=Fin_02,NOT(feries=\"F\")),\"C\",\"\")","v":""},{"$f":"IF(AND(dates>=Début02, dates<=Fin_02,NOT(feries=\"F\")),\"C\",\"\")","v":""},{"$f":"IF(AND(dates>=Début02, dates<=Fin_02,NOT(feries=\"F\")),\"C\",\"\")","v":""},{"$f":"IF(AND(dates>=Début02, dates<=Fin_02,NOT(feries=\"F\")),\"C\",\"\")","v":""},{"$f":"IF(AND(dates>=Début02, dates<=Fin_02,NOT(feries=\"F\")),\"C\",\"\")","v":""},{"$f":"IF(AND(dates>=Début02, dates<=Fin_02,NOT(feries=\"F\")),\"C\",\"\")","v":""},{"$f":"IF(AND(dates>=Début02, dates<=Fin_02,NOT(feries=\"F\")),\"C\",\"\")","v":""},null,null,{"$f":"NETWORKDAYS(BR21,BS21,'jours Féries 2016'!$B$1:$B$14)","v":0},0,{"$f":"IF(AND(dates>=Début03, dates<=Fin_03,NOT(feries=\"F\")),\"C\",\"\")","v":""},{"$f":"IF(AND(dates>=Début03, dates<=Fin_03,NOT(feries=\"F\")),\"C\",\"\")","v":""},{"$f":"IF(AND(dates>=Début03, dates<=Fin_03,NOT(feries=\"F\")),\"C\",\"\")","v":""},{"$f":"IF(AND(dates>=Début03, dates<=Fin_03,NOT(feries=\"F\")),\"C\",\"\")","v":""},{"$f":"IF(AND(dates>=Début03, dates<=Fin_03,NOT(feries=\"F\")),\"C\",\"\")","v":""},{"$f":"IF(AND(dates>=Début03, dates<=Fin_03,NOT(feries=\"F\")),\"C\",\"\")","v":""},{"$f":"IF(AND(dates>=Début03, dates<=Fin_03,NOT(feries=\"F\")),\"C\",\"\")","v":""},{"$f":"IF(AND(dates>=Début03, dates<=Fin_03,NOT(feries=\"F\")),\"C\",\"\")","v":""},{"$f":"IF(AND(dates>=Début03, dates<=Fin_03,NOT(feries=\"F\")),\"C\",\"\")","v":""},{"$f":"IF(AND(dates>=Début03, dates<=Fin_03,NOT(feries=\"F\")),\"C\",\"\")","v":""},{"$f":"IF(AND(dates>=Début03, dates<=Fin_03,NOT(feries=\"F\")),\"C\",\"\")","v":""},{"$f":"IF(AND(dates>=Début03, dates<=Fin_03,NOT(feries=\"F\")),\"C\",\"\")","v":""},{"$f":"IF(AND(dates>=Début03, dates<=Fin_03,NOT(feries=\"F\")),\"C\",\"\")","v":""},{"$f":"IF(AND(dates>=Début03, dates<=Fin_03,NOT(feries=\"F\")),\"C\",\"\")","v":""},{"$f":"IF(AND(dates>=Début03, dates<=Fin_03,NOT(feries=\"F\")),\"C\",\"\")","v":""},{"$f":"IF(AND(dates>=Début03, dates<=Fin_03,NOT(feries=\"F\")),\"C\",\"\")","v":""},{"$f":"IF(AND(dates>=Début03, dates<=Fin_03,NOT(feries=\"F\")),\"C\",\"\")","v":""},{"$f":"IF(AND(dates>=Début03, dates<=Fin_03,NOT(feries=\"F\")),\"C\",\"\")","v":""},{"$f":"IF(AND(dates>=Début03, dates<=Fin_03,NOT(feries=\"F\")),\"C\",\"\")","v":""},{"$f":"IF(AND(dates>=Début03, dates<=Fin_03,NOT(feries=\"F\")),\"C\",\"\")","v":""},{"$f":"IF(AND(dates>=Début03, dates<=Fin_03,NOT(feries=\"F\")),\"C\",\"\")","v":""},{"$f":"IF(AND(dates>=Début03, dates<=Fin_03,NOT(feries=\"F\")),\"C\",\"\")","v":""},{"$f":"IF(AND(dates>=Début03, dates<=Fin_03,NOT(feries=\"F\")),\"C\",\"\")","v":""},{"$f":"IF(AND(dates>=Début03, dates<=Fin_03,NOT(feries=\"F\")),\"C\",\"\")","v":""},{"$f":"IF(AND(dates>=Début03, dates<=Fin_03,NOT(feries=\"F\")),\"C\",\"\")","v":""},{"$f":"IF(AND(dates>=Début03, dates<=Fin_03,NOT(feries=\"F\")),\"C\",\"\")","v":""},{"$f":"IF(AND(dates>=Début03, dates<=Fin_03,NOT(feries=\"F\")),\"C\",\"\")","v":""},{"$f":"IF(AND(dates>=Début03, dates<=Fin_03,NOT(feries=\"F\")),\"C\",\"\")","v":""},{"$f":"IF(AND(dates>=Début03, dates<=Fin_03,NOT(feries=\"F\")),\"C\",\"\")","v":""},{"$f":"IF(AND(dates>=Début03, dates<=Fin_03,NOT(feries=\"F\")),\"C\",\"\")","v":""},{"$f":"IF(AND(dates>=Début03, dates<=Fin_03,NOT(feries=\"F\")),\"C\",\"\")","v":""},null,null,{"$f":"NETWORKDAYS(DA21,DB21,'jours Féries 2016'!$B$1:$B$14)","v":0},0,{"$f":"IF(AND(dates>=Début04, dates<=Fin_04,NOT(feries=\"F\")),\"C\",\"\")","v":""},{"$f":"IF(AND(dates>=Début04, dates<=Fin_04,NOT(feries=\"F\")),\"C\",\"\")","v":""},{"$f":"IF(AND(dates>=Début04, dates<=Fin_04,NOT(feries=\"F\")),\"C\",\"\")","v":""},{"$f":"IF(AND(dates>=Début04, dates<=Fin_04,NOT(feries=\"F\")),\"C\",\"\")","v":""},{"$f":"IF(AND(dates>=Début04, dates<=Fin_04,NOT(feries=\"F\")),\"C\",\"\")","v":""},{"$f":"IF(AND(dates>=Début04, dates<=Fin_04,NOT(feries=\"F\")),\"C\",\"\")","v":""},{"$f":"IF(AND(dates>=Début04, dates<=Fin_04,NOT(feries=\"F\")),\"C\",\"\")","v":""},{"$f":"IF(AND(dates>=Début04, dates<=Fin_04,NOT(feries=\"F\")),\"C\",\"\")","v":""},{"$f":"IF(AND(dates>=Début04, dates<=Fin_04,NOT(feries=\"F\")),\"C\",\"\")","v":""},{"$f":"IF(AND(dates>=Début04, dates<=Fin_04,NOT(feries=\"F\")),\"C\",\"\")","v":""},{"$f":"IF(AND(dates>=Début04, dates<=Fin_04,NOT(feries=\"F\")),\"C\",\"\")","v":""},{"$f":"IF(AND(dates>=Début04, dates<=Fin_04,NOT(feries=\"F\")),\"C\",\"\")","v":""},{"$f":"IF(AND(dates>=Début04, dates<=Fin_04,NOT(feries=\"F\")),\"C\",\"\")","v":""},{"$f":"IF(AND(dates>=Début04, dates<=Fin_04,NOT(feries=\"F\")),\"C\",\"\")","v":""},{"$f":"IF(AND(dates>=Début04, dates<=Fin_04,NOT(feries=\"F\")),\"C\",\"\")","v":""},{"$f":"IF(AND(dates>=Début04, dates<=Fin_04,NOT(feries=\"F\")),\"C\",\"\")","v":""},{"$f":"IF(AND(dates>=Début04, dates<=Fin_04,NOT(feries=\"F\")),\"C\",\"\")","v":""},{"$f":"IF(AND(dates>=Début04, dates<=Fin_04,NOT(feries=\"F\")),\"C\",\"\")","v":""},{"$f":"IF(AND(dates>=Début04, dates<=Fin_04,NOT(feries=\"F\")),\"C\",\"\")","v":""},{"$f":"IF(AND(dates>=Début04, dates<=Fin_04,NOT(feries=\"F\")),\"C\",\"\")","v":""},{"$f":"IF(AND(dates>=Début04, dates<=Fin_04,NOT(feries=\"F\")),\"C\",\"\")","v":""},{"$f":"IF(AND(dates>=Début04, dates<=Fin_04,NOT(feries=\"F\")),\"C\",\"\")","v":""},{"$f":"IF(AND(dates>=Début04, dates<=Fin_04,NOT(feries=\"F\")),\"C\",\"\")","v":""},{"$f":"IF(AND(dates>=Début04, dates<=Fin_04,NOT(feries=\"F\")),\"C\",\"\")","v":""},{"$f":"IF(AND(dates>=Début04, dates<=Fin_04,NOT(feries=\"F\")),\"C\",\"\")","v":""},{"$f":"IF(AND(dates>=Début04, dates<=Fin_04,NOT(feries=\"F\")),\"C\",\"\")","v":""},{"$f":"IF(AND(dates>=Début04, dates<=Fin_04,NOT(feries=\"F\")),\"C\",\"\")","v":""},{"$f":"IF(AND(dates>=Début04, dates<=Fin_04,NOT(feries=\"F\")),\"C\",\"\")","v":""},{"$f":"IF(AND(dates>=Début04, dates<=Fin_04,NOT(feries=\"F\")),\"C\",\"\")","v":""},{"$f":"IF(AND(dates>=Début04, dates<=Fin_04,NOT(feries=\"F\")),\"C\",\"\")","v":""},null,null,{"$f":"NETWORKDAYS(EI21,EJ21,'jours Féries 2016'!$B$1:$B$14)","v":0},{"$f":"COUNTIF(EM21:GD21,\"C\")","v":0},"","","","","","","","","","","","","","","","","","","","","","","","","","","","","","","",null,"","","","","","","","","","","","","","","","","","","","","","","","","","","","","","","","","","","","","","","","","","","","","","","","","","","","","","","","","","","","","","","","","","","","","","","","","","","","","","","","","","","","","","","","","","","","","","","","","","","","","","","","","","","","","","","","","","","","","","","","","","","","","","","","","","","","","","","","","","","","","","","","","","","","","","","","","","","","","","","","","","","","","","","","","","","","","","","","","","","","","","","","","","","","","","","","","","","","","","","","","","","","","","","","","","","","","",""]
["EMPLOYE16","2016-01-16","2016-01-25",{"$f":"NETWORKDAYS(B22,C22,'jours Féries 2016'!$B$1:$B$14)","v":6},6,"","","","","","","","","","","","","","","","","","C","C","C","C","C","","","C","","","","","","",null,null,{"$f":"NETWORKDAYS(AK22,AL22,'jours Féries 2016'!$B$1:$B$14)","v":0},0,{"$f":"IF(AND(dates>=Début02, dates<=Fin_02,NOT(feries=\"F\")),\"C\",\"\")","v":""},{"$f":"IF(AND(dates>=Début02, dates<=Fin_02,NOT(feries=\"F\")),\"C\",\"\")","v":""},{"$f":"IF(AND(dates>=Début02, dates<=Fin_02,NOT(feries=\"F\")),\"C\",\"\")","v":""},{"$f":"IF(AND(dates>=Début02, dates<=Fin_02,NOT(feries=\"F\")),\"C\",\"\")","v":""},{"$f":"IF(AND(dates>=Début02, dates<=Fin_02,NOT(feries=\"F\")),\"C\",\"\")","v":""},{"$f":"IF(AND(dates>=Début02, dates<=Fin_02,NOT(feries=\"F\")),\"C\",\"\")","v":""},{"$f":"IF(AND(dates>=Début02, dates<=Fin_02,NOT(feries=\"F\")),\"C\",\"\")","v":""},{"$f":"IF(AND(dates>=Début02, dates<=Fin_02,NOT(feries=\"F\")),\"C\",\"\")","v":""},{"$f":"IF(AND(dates>=Début02, dates<=Fin_02,NOT(feries=\"F\")),\"C\",\"\")","v":""},{"$f":"IF(AND(dates>=Début02, dates<=Fin_02,NOT(feries=\"F\")),\"C\",\"\")","v":""},{"$f":"IF(AND(dates>=Début02, dates<=Fin_02,NOT(feries=\"F\")),\"C\",\"\")","v":""},{"$f":"IF(AND(dates>=Début02, dates<=Fin_02,NOT(feries=\"F\")),\"C\",\"\")","v":""},{"$f":"IF(AND(dates>=Début02, dates<=Fin_02,NOT(feries=\"F\")),\"C\",\"\")","v":""},{"$f":"IF(AND(dates>=Début02, dates<=Fin_02,NOT(feries=\"F\")),\"C\",\"\")","v":""},{"$f":"IF(AND(dates>=Début02, dates<=Fin_02,NOT(feries=\"F\")),\"C\",\"\")","v":""},{"$f":"IF(AND(dates>=Début02, dates<=Fin_02,NOT(feries=\"F\")),\"C\",\"\")","v":""},{"$f":"IF(AND(dates>=Début02, dates<=Fin_02,NOT(feries=\"F\")),\"C\",\"\")","v":""},{"$f":"IF(AND(dates>=Début02, dates<=Fin_02,NOT(feries=\"F\")),\"C\",\"\")","v":""},{"$f":"IF(AND(dates>=Début02, dates<=Fin_02,NOT(feries=\"F\")),\"C\",\"\")","v":""},{"$f":"IF(AND(dates>=Début02, dates<=Fin_02,NOT(feries=\"F\")),\"C\",\"\")","v":""},{"$f":"IF(AND(dates>=Début02, dates<=Fin_02,NOT(feries=\"F\")),\"C\",\"\")","v":""},{"$f":"IF(AND(dates>=Début02, dates<=Fin_02,NOT(feries=\"F\")),\"C\",\"\")","v":""},{"$f":"IF(AND(dates>=Début02, dates<=Fin_02,NOT(feries=\"F\")),\"C\",\"\")","v":""},{"$f":"IF(AND(dates>=Début02, dates<=Fin_02,NOT(feries=\"F\")),\"C\",\"\")","v":""},{"$f":"IF(AND(dates>=Début02, dates<=Fin_02,NOT(feries=\"F\")),\"C\",\"\")","v":""},{"$f":"IF(AND(dates>=Début02, dates<=Fin_02,NOT(feries=\"F\")),\"C\",\"\")","v":""},{"$f":"IF(AND(dates>=Début02, dates<=Fin_02,NOT(feries=\"F\")),\"C\",\"\")","v":""},{"$f":"IF(AND(dates>=Début02, dates<=Fin_02,NOT(feries=\"F\")),\"C\",\"\")","v":""},{"$f":"IF(AND(dates>=Début02, dates<=Fin_02,NOT(feries=\"F\")),\"C\",\"\")","v":""},null,null,{"$f":"NETWORKDAYS(BR22,BS22,'jours Féries 2016'!$B$1:$B$14)","v":0},0,{"$f":"IF(AND(dates>=Début03, dates<=Fin_03,NOT(feries=\"F\")),\"C\",\"\")","v":""},{"$f":"IF(AND(dates>=Début03, dates<=Fin_03,NOT(feries=\"F\")),\"C\",\"\")","v":""},{"$f":"IF(AND(dates>=Début03, dates<=Fin_03,NOT(feries=\"F\")),\"C\",\"\")","v":""},{"$f":"IF(AND(dates>=Début03, dates<=Fin_03,NOT(feries=\"F\")),\"C\",\"\")","v":""},{"$f":"IF(AND(dates>=Début03, dates<=Fin_03,NOT(feries=\"F\")),\"C\",\"\")","v":""},{"$f":"IF(AND(dates>=Début03, dates<=Fin_03,NOT(feries=\"F\")),\"C\",\"\")","v":""},{"$f":"IF(AND(dates>=Début03, dates<=Fin_03,NOT(feries=\"F\")),\"C\",\"\")","v":""},{"$f":"IF(AND(dates>=Début03, dates<=Fin_03,NOT(feries=\"F\")),\"C\",\"\")","v":""},{"$f":"IF(AND(dates>=Début03, dates<=Fin_03,NOT(feries=\"F\")),\"C\",\"\")","v":""},{"$f":"IF(AND(dates>=Début03, dates<=Fin_03,NOT(feries=\"F\")),\"C\",\"\")","v":""},{"$f":"IF(AND(dates>=Début03, dates<=Fin_03,NOT(feries=\"F\")),\"C\",\"\")","v":""},{"$f":"IF(AND(dates>=Début03, dates<=Fin_03,NOT(feries=\"F\")),\"C\",\"\")","v":""},{"$f":"IF(AND(dates>=Début03, dates<=Fin_03,NOT(feries=\"F\")),\"C\",\"\")","v":""},{"$f":"IF(AND(dates>=Début03, dates<=Fin_03,NOT(feries=\"F\")),\"C\",\"\")","v":""},{"$f":"IF(AND(dates>=Début03, dates<=Fin_03,NOT(feries=\"F\")),\"C\",\"\")","v":""},{"$f":"IF(AND(dates>=Début03, dates<=Fin_03,NOT(feries=\"F\")),\"C\",\"\")","v":""},{"$f":"IF(AND(dates>=Début03, dates<=Fin_03,NOT(feries=\"F\")),\"C\",\"\")","v":""},{"$f":"IF(AND(dates>=Début03, dates<=Fin_03,NOT(feries=\"F\")),\"C\",\"\")","v":""},{"$f":"IF(AND(dates>=Début03, dates<=Fin_03,NOT(feries=\"F\")),\"C\",\"\")","v":""},{"$f":"IF(AND(dates>=Début03, dates<=Fin_03,NOT(feries=\"F\")),\"C\",\"\")","v":""},{"$f":"IF(AND(dates>=Début03, dates<=Fin_03,NOT(feries=\"F\")),\"C\",\"\")","v":""},{"$f":"IF(AND(dates>=Début03, dates<=Fin_03,NOT(feries=\"F\")),\"C\",\"\")","v":""},{"$f":"IF(AND(dates>=Début03, dates<=Fin_03,NOT(feries=\"F\")),\"C\",\"\")","v":""},{"$f":"IF(AND(dates>=Début03, dates<=Fin_03,NOT(feries=\"F\")),\"C\",\"\")","v":""},{"$f":"IF(AND(dates>=Début03, dates<=Fin_03,NOT(feries=\"F\")),\"C\",\"\")","v":""},{"$f":"IF(AND(dates>=Début03, dates<=Fin_03,NOT(feries=\"F\")),\"C\",\"\")","v":""},{"$f":"IF(AND(dates>=Début03, dates<=Fin_03,NOT(feries=\"F\")),\"C\",\"\")","v":""},{"$f":"IF(AND(dates>=Début03, dates<=Fin_03,NOT(feries=\"F\")),\"C\",\"\")","v":""},{"$f":"IF(AND(dates>=Début03, dates<=Fin_03,NOT(feries=\"F\")),\"C\",\"\")","v":""},{"$f":"IF(AND(dates>=Début03, dates<=Fin_03,NOT(feries=\"F\")),\"C\",\"\")","v":""},{"$f":"IF(AND(dates>=Début03, dates<=Fin_03,NOT(feries=\"F\")),\"C\",\"\")","v":""},null,null,{"$f":"NETWORKDAYS(DA22,DB22,'jours Féries 2016'!$B$1:$B$14)","v":0},0,{"$f":"IF(AND(dates>=Début04, dates<=Fin_04,NOT(feries=\"F\")),\"C\",\"\")","v":""},{"$f":"IF(AND(dates>=Début04, dates<=Fin_04,NOT(feries=\"F\")),\"C\",\"\")","v":""},{"$f":"IF(AND(dates>=Début04, dates<=Fin_04,NOT(feries=\"F\")),\"C\",\"\")","v":""},{"$f":"IF(AND(dates>=Début04, dates<=Fin_04,NOT(feries=\"F\")),\"C\",\"\")","v":""},{"$f":"IF(AND(dates>=Début04, dates<=Fin_04,NOT(feries=\"F\")),\"C\",\"\")","v":""},{"$f":"IF(AND(dates>=Début04, dates<=Fin_04,NOT(feries=\"F\")),\"C\",\"\")","v":""},{"$f":"IF(AND(dates>=Début04, dates<=Fin_04,NOT(feries=\"F\")),\"C\",\"\")","v":""},{"$f":"IF(AND(dates>=Début04, dates<=Fin_04,NOT(feries=\"F\")),\"C\",\"\")","v":""},{"$f":"IF(AND(dates>=Début04, dates<=Fin_04,NOT(feries=\"F\")),\"C\",\"\")","v":""},{"$f":"IF(AND(dates>=Début04, dates<=Fin_04,NOT(feries=\"F\")),\"C\",\"\")","v":""},{"$f":"IF(AND(dates>=Début04, dates<=Fin_04,NOT(feries=\"F\")),\"C\",\"\")","v":""},{"$f":"IF(AND(dates>=Début04, dates<=Fin_04,NOT(feries=\"F\")),\"C\",\"\")","v":""},{"$f":"IF(AND(dates>=Début04, dates<=Fin_04,NOT(feries=\"F\")),\"C\",\"\")","v":""},{"$f":"IF(AND(dates>=Début04, dates<=Fin_04,NOT(feries=\"F\")),\"C\",\"\")","v":""},{"$f":"IF(AND(dates>=Début04, dates<=Fin_04,NOT(feries=\"F\")),\"C\",\"\")","v":""},{"$f":"IF(AND(dates>=Début04, dates<=Fin_04,NOT(feries=\"F\")),\"C\",\"\")","v":""},{"$f":"IF(AND(dates>=Début04, dates<=Fin_04,NOT(feries=\"F\")),\"C\",\"\")","v":""},{"$f":"IF(AND(dates>=Début04, dates<=Fin_04,NOT(feries=\"F\")),\"C\",\"\")","v":""},{"$f":"IF(AND(dates>=Début04, dates<=Fin_04,NOT(feries=\"F\")),\"C\",\"\")","v":""},{"$f":"IF(AND(dates>=Début04, dates<=Fin_04,NOT(feries=\"F\")),\"C\",\"\")","v":""},{"$f":"IF(AND(dates>=Début04, dates<=Fin_04,NOT(feries=\"F\")),\"C\",\"\")","v":""},{"$f":"IF(AND(dates>=Début04, dates<=Fin_04,NOT(feries=\"F\")),\"C\",\"\")","v":""},{"$f":"IF(AND(dates>=Début04, dates<=Fin_04,NOT(feries=\"F\")),\"C\",\"\")","v":""},{"$f":"IF(AND(dates>=Début04, dates<=Fin_04,NOT(feries=\"F\")),\"C\",\"\")","v":""},{"$f":"IF(AND(dates>=Début04, dates<=Fin_04,NOT(feries=\"F\")),\"C\",\"\")","v":""},{"$f":"IF(AND(dates>=Début04, dates<=Fin_04,NOT(feries=\"F\")),\"C\",\"\")","v":""},{"$f":"IF(AND(dates>=Début04, dates<=Fin_04,NOT(feries=\"F\")),\"C\",\"\")","v":""},{"$f":"IF(AND(dates>=Début04, dates<=Fin_04,NOT(feries=\"F\")),\"C\",\"\")","v":""},{"$f":"IF(AND(dates>=Début04, dates<=Fin_04,NOT(feries=\"F\")),\"C\",\"\")","v":""},{"$f":"IF(AND(dates>=Début04, dates<=Fin_04,NOT(feries=\"F\")),\"C\",\"\")","v":""},null,null,{"$f":"NETWORKDAYS(EI22,EJ22,'jours Féries 2016'!$B$1:$B$14)","v":0},{"$f":"COUNTIF(EM22:GD22,\"C\")","v":0},"","","","","","","","","","","","","","","","","","","","","","","","","","","","","","","",null,"","","","","","","","","","","","","","","","","","","","","","","","","","","","","","","","","","","","","","","","","","","","","","","","","","","","","","","","","","","","","","","","","","","","","","","","","","","","","","","","","","","","","","","","","","","","","","","","","","","","","","","","","","","","","","","","","",{"$f":"IF(AND(dates>=Début01, dates<=Fin_01,NOT(feries=\"F\")),\"C\",\"\")","v":""},"","","","","","","","","","","","","","","","","","","","","","","","","","","","","","","","","","","","","","","","","","","","","","","","","","","","","","","","","","","","","","","","","","","",{"$f":"IF(AND(dates>=Début01, dates<=Fin_01,NOT(feries=\"F\")),\"C\",\"\")","v":""},"","","","","","","","","","","","","","","","","","","","","","","","","","","","","","","",""]
["EMPLOYE17","2016-01-17","2016-01-26",{"$f":"NETWORKDAYS(B23,C23,'jours Féries 2016'!$B$1:$B$14)","v":7},7,"","","","","","","","","","","","","","","","","","C","C","C","C","C","","","C","C","","","","","",null,null,{"$f":"NETWORKDAYS(AK23,AL23,'jours Féries 2016'!$B$1:$B$14)","v":0},0,{"$f":"IF(AND(dates>=Début02, dates<=Fin_02,NOT(feries=\"F\")),\"C\",\"\")","v":""},{"$f":"IF(AND(dates>=Début02, dates<=Fin_02,NOT(feries=\"F\")),\"C\",\"\")","v":""},{"$f":"IF(AND(dates>=Début02, dates<=Fin_02,NOT(feries=\"F\")),\"C\",\"\")","v":""},{"$f":"IF(AND(dates>=Début02, dates<=Fin_02,NOT(feries=\"F\")),\"C\",\"\")","v":""},{"$f":"IF(AND(dates>=Début02, dates<=Fin_02,NOT(feries=\"F\")),\"C\",\"\")","v":""},{"$f":"IF(AND(dates>=Début02, dates<=Fin_02,NOT(feries=\"F\")),\"C\",\"\")","v":""},{"$f":"IF(AND(dates>=Début02, dates<=Fin_02,NOT(feries=\"F\")),\"C\",\"\")","v":""},{"$f":"IF(AND(dates>=Début02, dates<=Fin_02,NOT(feries=\"F\")),\"C\",\"\")","v":""},{"$f":"IF(AND(dates>=Début02, dates<=Fin_02,NOT(feries=\"F\")),\"C\",\"\")","v":""},{"$f":"IF(AND(dates>=Début02, dates<=Fin_02,NOT(feries=\"F\")),\"C\",\"\")","v":""},{"$f":"IF(AND(dates>=Début02, dates<=Fin_02,NOT(feries=\"F\")),\"C\",\"\")","v":""},{"$f":"IF(AND(dates>=Début02, dates<=Fin_02,NOT(feries=\"F\")),\"C\",\"\")","v":""},{"$f":"IF(AND(dates>=Début02, dates<=Fin_02,NOT(feries=\"F\")),\"C\",\"\")","v":""},{"$f":"IF(AND(dates>=Début02, dates<=Fin_02,NOT(feries=\"F\")),\"C\",\"\")","v":""},{"$f":"IF(AND(dates>=Début02, dates<=Fin_02,NOT(feries=\"F\")),\"C\",\"\")","v":""},{"$f":"IF(AND(dates>=Début02, dates<=Fin_02,NOT(feries=\"F\")),\"C\",\"\")","v":""},{"$f":"IF(AND(dates>=Début02, dates<=Fin_02,NOT(feries=\"F\")),\"C\",\"\")","v":""},{"$f":"IF(AND(dates>=Début02, dates<=Fin_02,NOT(feries=\"F\")),\"C\",\"\")","v":""},{"$f":"IF(AND(dates>=Début02, dates<=Fin_02,NOT(feries=\"F\")),\"C\",\"\")","v":""},{"$f":"IF(AND(dates>=Début02, dates<=Fin_02,NOT(feries=\"F\")),\"C\",\"\")","v":""},{"$f":"IF(AND(dates>=Début02, dates<=Fin_02,NOT(feries=\"F\")),\"C\",\"\")","v":""},{"$f":"IF(AND(dates>=Début02, dates<=Fin_02,NOT(feries=\"F\")),\"C\",\"\")","v":""},{"$f":"IF(AND(dates>=Début02, dates<=Fin_02,NOT(feries=\"F\")),\"C\",\"\")","v":""},{"$f":"IF(AND(dates>=Début02, dates<=Fin_02,NOT(feries=\"F\")),\"C\",\"\")","v":""},{"$f":"IF(AND(dates>=Début02, dates<=Fin_02,NOT(feries=\"F\")),\"C\",\"\")","v":""},{"$f":"IF(AND(dates>=Début02, dates<=Fin_02,NOT(feries=\"F\")),\"C\",\"\")","v":""},{"$f":"IF(AND(dates>=Début02, dates<=Fin_02,NOT(feries=\"F\")),\"C\",\"\")","v":""},{"$f":"IF(AND(dates>=Début02, dates<=Fin_02,NOT(feries=\"F\")),\"C\",\"\")","v":""},{"$f":"IF(AND(dates>=Début02, dates<=Fin_02,NOT(feries=\"F\")),\"C\",\"\")","v":""},null,null,{"$f":"NETWORKDAYS(BR23,BS23,'jours Féries 2016'!$B$1:$B$14)","v":0},0,{"$f":"IF(AND(dates>=Début03, dates<=Fin_03,NOT(feries=\"F\")),\"C\",\"\")","v":""},{"$f":"IF(AND(dates>=Début03, dates<=Fin_03,NOT(feries=\"F\")),\"C\",\"\")","v":""},{"$f":"IF(AND(dates>=Début03, dates<=Fin_03,NOT(feries=\"F\")),\"C\",\"\")","v":""},{"$f":"IF(AND(dates>=Début03, dates<=Fin_03,NOT(feries=\"F\")),\"C\",\"\")","v":""},{"$f":"IF(AND(dates>=Début03, dates<=Fin_03,NOT(feries=\"F\")),\"C\",\"\")","v":""},{"$f":"IF(AND(dates>=Début03, dates<=Fin_03,NOT(feries=\"F\")),\"C\",\"\")","v":""},{"$f":"IF(AND(dates>=Début03, dates<=Fin_03,NOT(feries=\"F\")),\"C\",\"\")","v":""},{"$f":"IF(AND(dates>=Début03, dates<=Fin_03,NOT(feries=\"F\")),\"C\",\"\")","v":""},{"$f":"IF(AND(dates>=Début03, dates<=Fin_03,NOT(feries=\"F\")),\"C\",\"\")","v":""},{"$f":"IF(AND(dates>=Début03, dates<=Fin_03,NOT(feries=\"F\")),\"C\",\"\")","v":""},{"$f":"IF(AND(dates>=Début03, dates<=Fin_03,NOT(feries=\"F\")),\"C\",\"\")","v":""},{"$f":"IF(AND(dates>=Début03, dates<=Fin_03,NOT(feries=\"F\")),\"C\",\"\")","v":""},{"$f":"IF(AND(dates>=Début03, dates<=Fin_03,NOT(feries=\"F\")),\"C\",\"\")","v":""},{"$f":"IF(AND(dates>=Début03, dates<=Fin_03,NOT(feries=\"F\")),\"C\",\"\")","v":""},{"$f":"IF(AND(dates>=Début03, dates<=Fin_03,NOT(feries=\"F\")),\"C\",\"\")","v":""},{"$f":"IF(AND(dates>=Début03, dates<=Fin_03,NOT(feries=\"F\")),\"C\",\"\")","v":""},{"$f":"IF(AND(dates>=Début03, dates<=Fin_03,NOT(feries=\"F\")),\"C\",\"\")","v":""},{"$f":"IF(AND(dates>=Début03, dates<=Fin_03,NOT(feries=\"F\")),\"C\",\"\")","v":""},{"$f":"IF(AND(dates>=Début03, dates<=Fin_03,NOT(feries=\"F\")),\"C\",\"\")","v":""},{"$f":"IF(AND(dates>=Début03, dates<=Fin_03,NOT(feries=\"F\")),\"C\",\"\")","v":""},{"$f":"IF(AND(dates>=Début03, dates<=Fin_03,NOT(feries=\"F\")),\"C\",\"\")","v":""},{"$f":"IF(AND(dates>=Début03, dates<=Fin_03,NOT(feries=\"F\")),\"C\",\"\")","v":""},{"$f":"IF(AND(dates>=Début03, dates<=Fin_03,NOT(feries=\"F\")),\"C\",\"\")","v":""},{"$f":"IF(AND(dates>=Début03, dates<=Fin_03,NOT(feries=\"F\")),\"C\",\"\")","v":""},{"$f":"IF(AND(dates>=Début03, dates<=Fin_03,NOT(feries=\"F\")),\"C\",\"\")","v":""},{"$f":"IF(AND(dates>=Début03, dates<=Fin_03,NOT(feries=\"F\")),\"C\",\"\")","v":""},{"$f":"IF(AND(dates>=Début03, dates<=Fin_03,NOT(feries=\"F\")),\"C\",\"\")","v":""},{"$f":"IF(AND(dates>=Début03, dates<=Fin_03,NOT(feries=\"F\")),\"C\",\"\")","v":""},{"$f":"IF(AND(dates>=Début03, dates<=Fin_03,NOT(feries=\"F\")),\"C\",\"\")","v":""},{"$f":"IF(AND(dates>=Début03, dates<=Fin_03,NOT(feries=\"F\")),\"C\",\"\")","v":""},{"$f":"IF(AND(dates>=Début03, dates<=Fin_03,NOT(feries=\"F\")),\"C\",\"\")","v":""},null,null,{"$f":"NETWORKDAYS(DA23,DB23,'jours Féries 2016'!$B$1:$B$14)","v":0},0,{"$f":"IF(AND(dates>=Début04, dates<=Fin_04,NOT(feries=\"F\")),\"C\",\"\")","v":""},{"$f":"IF(AND(dates>=Début04, dates<=Fin_04,NOT(feries=\"F\")),\"C\",\"\")","v":""},{"$f":"IF(AND(dates>=Début04, dates<=Fin_04,NOT(feries=\"F\")),\"C\",\"\")","v":""},{"$f":"IF(AND(dates>=Début04, dates<=Fin_04,NOT(feries=\"F\")),\"C\",\"\")","v":""},{"$f":"IF(AND(dates>=Début04, dates<=Fin_04,NOT(feries=\"F\")),\"C\",\"\")","v":""},{"$f":"IF(AND(dates>=Début04, dates<=Fin_04,NOT(feries=\"F\")),\"C\",\"\")","v":""},{"$f":"IF(AND(dates>=Début04, dates<=Fin_04,NOT(feries=\"F\")),\"C\",\"\")","v":""},{"$f":"IF(AND(dates>=Début04, dates<=Fin_04,NOT(feries=\"F\")),\"C\",\"\")","v":""},{"$f":"IF(AND(dates>=Début04, dates<=Fin_04,NOT(feries=\"F\")),\"C\",\"\")","v":""},{"$f":"IF(AND(dates>=Début04, dates<=Fin_04,NOT(feries=\"F\")),\"C\",\"\")","v":""},{"$f":"IF(AND(dates>=Début04, dates<=Fin_04,NOT(feries=\"F\")),\"C\",\"\")","v":""},{"$f":"IF(AND(dates>=Début04, dates<=Fin_04,NOT(feries=\"F\")),\"C\",\"\")","v":""},{"$f":"IF(AND(dates>=Début04, dates<=Fin_04,NOT(feries=\"F\")),\"C\",\"\")","v":""},{"$f":"IF(AND(dates>=Début04, dates<=Fin_04,NOT(feries=\"F\")),\"C\",\"\")","v":""},{"$f":"IF(AND(dates>=Début04, dates<=Fin_04,NOT(feries=\"F\")),\"C\",\"\")","v":""},{"$f":"IF(AND(dates>=Début04, dates<=Fin_04,NOT(feries=\"F\")),\"C\",\"\")","v":""},{"$f":"IF(AND(dates>=Début04, dates<=Fin_04,NOT(feries=\"F\")),\"C\",\"\")","v":""},{"$f":"IF(AND(dates>=Début04, dates<=Fin_04,NOT(feries=\"F\")),\"C\",\"\")","v":""},{"$f":"IF(AND(dates>=Début04, dates<=Fin_04,NOT(feries=\"F\")),\"C\",\"\")","v":""},{"$f":"IF(AND(dates>=Début04, dates<=Fin_04,NOT(feries=\"F\")),\"C\",\"\")","v":""},{"$f":"IF(AND(dates>=Début04, dates<=Fin_04,NOT(feries=\"F\")),\"C\",\"\")","v":""},{"$f":"IF(AND(dates>=Début04, dates<=Fin_04,NOT(feries=\"F\")),\"C\",\"\")","v":""},{"$f":"IF(AND(dates>=Début04, dates<=Fin_04,NOT(feries=\"F\")),\"C\",\"\")","v":""},{"$f":"IF(AND(dates>=Début04, dates<=Fin_04,NOT(feries=\"F\")),\"C\",\"\")","v":""},{"$f":"IF(AND(dates>=Début04, dates<=Fin_04,NOT(feries=\"F\")),\"C\",\"\")","v":""},{"$f":"IF(AND(dates>=Début04, dates<=Fin_04,NOT(feries=\"F\")),\"C\",\"\")","v":""},{"$f":"IF(AND(dates>=Début04, dates<=Fin_04,NOT(feries=\"F\")),\"C\",\"\")","v":""},{"$f":"IF(AND(dates>=Début04, dates<=Fin_04,NOT(feries=\"F\")),\"C\",\"\")","v":""},{"$f":"IF(AND(dates>=Début04, dates<=Fin_04,NOT(feries=\"F\")),\"C\",\"\")","v":""},{"$f":"IF(AND(dates>=Début04, dates<=Fin_04,NOT(feries=\"F\")),\"C\",\"\")","v":""},null,null,{"$f":"NETWORKDAYS(EI23,EJ23,'jours Féries 2016'!$B$1:$B$14)","v":0},{"$f":"COUNTIF(EM23:GD23,\"C\")","v":0},"","","","","","","","","","","","","","","","","","","","","","","","","","","","","","","",null,"","","","","","","","","","","","","","","","","","","","","","","","","","","","","","","","","","","","","","",{"$f":"IF(AND(dates>=Début01, dates<=Fin_01,NOT(feries=\"F\")),\"C\",\"\")","v":""},"","","","","","","","","","","","","","","","","","","","","","","","","","","","","","","","","","","","","","","","","","","","","","","","","","","","","","","","","","","","","","","",{"$f":"IF(AND(dates>=Début01, dates<=Fin_01,NOT(feries=\"F\")),\"C\",\"\")","v":""},"","","","","","","","","","","","","","","","","","","","","","","","","","","","","","","","","","","","","","","","","","","","","","","","","","","","","","","","","","","","","","","","","","","","","","","","","","",{"$f":"IF(AND(dates>=Début01, dates<=Fin_01,NOT(feries=\"F\")),\"C\",\"\")","v":""},"","","","","","","","","","","","","","","","","","","","","","","","","","","","","","","","","","","",""]
["EMPLOYE18","2016-01-18","2016-01-27",{"$f":"NETWORKDAYS(B24,C24,'jours Féries 2016'!$B$1:$B$14)","v":8},8,"","","","","","","","","","","","","","","","","","C","C","C","C","C","","","C","C","C","","","","",null,null,{"$f":"NETWORKDAYS(AK24,AL24,'jours Féries 2016'!$B$1:$B$14)","v":0},0,{"$f":"IF(AND(dates>=Début02, dates<=Fin_02,NOT(feries=\"F\")),\"C\",\"\")","v":""},{"$f":"IF(AND(dates>=Début02, dates<=Fin_02,NOT(feries=\"F\")),\"C\",\"\")","v":""},{"$f":"IF(AND(dates>=Début02, dates<=Fin_02,NOT(feries=\"F\")),\"C\",\"\")","v":""},{"$f":"IF(AND(dates>=Début02, dates<=Fin_02,NOT(feries=\"F\")),\"C\",\"\")","v":""},{"$f":"IF(AND(dates>=Début02, dates<=Fin_02,NOT(feries=\"F\")),\"C\",\"\")","v":""},{"$f":"IF(AND(dates>=Début02, dates<=Fin_02,NOT(feries=\"F\")),\"C\",\"\")","v":""},{"$f":"IF(AND(dates>=Début02, dates<=Fin_02,NOT(feries=\"F\")),\"C\",\"\")","v":""},{"$f":"IF(AND(dates>=Début02, dates<=Fin_02,NOT(feries=\"F\")),\"C\",\"\")","v":""},{"$f":"IF(AND(dates>=Début02, dates<=Fin_02,NOT(feries=\"F\")),\"C\",\"\")","v":""},{"$f":"IF(AND(dates>=Début02, dates<=Fin_02,NOT(feries=\"F\")),\"C\",\"\")","v":""},{"$f":"IF(AND(dates>=Début02, dates<=Fin_02,NOT(feries=\"F\")),\"C\",\"\")","v":""},{"$f":"IF(AND(dates>=Début02, dates<=Fin_02,NOT(feries=\"F\")),\"C\",\"\")","v":""},{"$f":"IF(AND(dates>=Début02, dates<=Fin_02,NOT(feries=\"F\")),\"C\",\"\")","v":""},{"$f":"IF(AND(dates>=Début02, dates<=Fin_02,NOT(feries=\"F\")),\"C\",\"\")","v":""},{"$f":"IF(AND(dates>=Début02, dates<=Fin_02,NOT(feries=\"F\")),\"C\",\"\")","v":""},{"$f":"IF(AND(dates>=Début02, dates<=Fin_02,NOT(feries=\"F\")),\"C\",\"\")","v":""},{"$f":"IF(AND(dates>=Début02, dates<=Fin_02,NOT(feries=\"F\")),\"C\",\"\")","v":""},{"$f":"IF(AND(dates>=Début02, dates<=Fin_02,NOT(feries=\"F\")),\"C\",\"\")","v":""},{"$f":"IF(AND(dates>=Début02, dates<=Fin_02,NOT(feries=\"F\")),\"C\",\"\")","v":""},{"$f":"IF(AND(dates>=Début02, dates<=Fin_02,NOT(feries=\"F\")),\"C\",\"\")","v":""},{"$f":"IF(AND(dates>=Début02, dates<=Fin_02,NOT(feries=\"F\")),\"C\",\"\")","v":""},{"$f":"IF(AND(dates>=Début02, dates<=Fin_02,NOT(feries=\"F\")),\"C\",\"\")","v":""},{"$f":"IF(AND(dates>=Début02, dates<=Fin_02,NOT(feries=\"F\")),\"C\",\"\")","v":""},{"$f":"IF(AND(dates>=Début02, dates<=Fin_02,NOT(feries=\"F\")),\"C\",\"\")","v":""},{"$f":"IF(AND(dates>=Début02, dates<=Fin_02,NOT(feries=\"F\")),\"C\",\"\")","v":""},{"$f":"IF(AND(dates>=Début02, dates<=Fin_02,NOT(feries=\"F\")),\"C\",\"\")","v":""},{"$f":"IF(AND(dates>=Début02, dates<=Fin_02,NOT(feries=\"F\")),\"C\",\"\")","v":""},{"$f":"IF(AND(dates>=Début02, dates<=Fin_02,NOT(feries=\"F\")),\"C\",\"\")","v":""},{"$f":"IF(AND(dates>=Début02, dates<=Fin_02,NOT(feries=\"F\")),\"C\",\"\")","v":""},null,null,{"$f":"NETWORKDAYS(BR24,BS24,'jours Féries 2016'!$B$1:$B$14)","v":0},0,{"$f":"IF(AND(dates>=Début03, dates<=Fin_03,NOT(feries=\"F\")),\"C\",\"\")","v":""},{"$f":"IF(AND(dates>=Début03, dates<=Fin_03,NOT(feries=\"F\")),\"C\",\"\")","v":""},{"$f":"IF(AND(dates>=Début03, dates<=Fin_03,NOT(feries=\"F\")),\"C\",\"\")","v":""},{"$f":"IF(AND(dates>=Début03, dates<=Fin_03,NOT(feries=\"F\")),\"C\",\"\")","v":""},{"$f":"IF(AND(dates>=Début03, dates<=Fin_03,NOT(feries=\"F\")),\"C\",\"\")","v":""},{"$f":"IF(AND(dates>=Début03, dates<=Fin_03,NOT(feries=\"F\")),\"C\",\"\")","v":""},{"$f":"IF(AND(dates>=Début03, dates<=Fin_03,NOT(feries=\"F\")),\"C\",\"\")","v":""},{"$f":"IF(AND(dates>=Début03, dates<=Fin_03,NOT(feries=\"F\")),\"C\",\"\")","v":""},{"$f":"IF(AND(dates>=Début03, dates<=Fin_03,NOT(feries=\"F\")),\"C\",\"\")","v":""},{"$f":"IF(AND(dates>=Début03, dates<=Fin_03,NOT(feries=\"F\")),\"C\",\"\")","v":""},{"$f":"IF(AND(dates>=Début03, dates<=Fin_03,NOT(feries=\"F\")),\"C\",\"\")","v":""},{"$f":"IF(AND(dates>=Début03, dates<=Fin_03,NOT(feries=\"F\")),\"C\",\"\")","v":""},{"$f":"IF(AND(dates>=Début03, dates<=Fin_03,NOT(feries=\"F\")),\"C\",\"\")","v":""},{"$f":"IF(AND(dates>=Début03, dates<=Fin_03,NOT(feries=\"F\")),\"C\",\"\")","v":""},{"$f":"IF(AND(dates>=Début03, dates<=Fin_03,NOT(feries=\"F\")),\"C\",\"\")","v":""},{"$f":"IF(AND(dates>=Début03, dates<=Fin_03,NOT(feries=\"F\")),\"C\",\"\")","v":""},{"$f":"IF(AND(dates>=Début03, dates<=Fin_03,NOT(feries=\"F\")),\"C\",\"\")","v":""},{"$f":"IF(AND(dates>=Début03, dates<=Fin_03,NOT(feries=\"F\")),\"C\",\"\")","v":""},{"$f":"IF(AND(dates>=Début03, dates<=Fin_03,NOT(feries=\"F\")),\"C\",\"\")","v":""},{"$f":"IF(AND(dates>=Début03, dates<=Fin_03,NOT(feries=\"F\")),\"C\",\"\")","v":""},{"$f":"IF(AND(dates>=Début03, dates<=Fin_03,NOT(feries=\"F\")),\"C\",\"\")","v":""},{"$f":"IF(AND(dates>=Début03, dates<=Fin_03,NOT(feries=\"F\")),\"C\",\"\")","v":""},{"$f":"IF(AND(dates>=Début03, dates<=Fin_03,NOT(feries=\"F\")),\"C\",\"\")","v":""},{"$f":"IF(AND(dates>=Début03, dates<=Fin_03,NOT(feries=\"F\")),\"C\",\"\")","v":""},{"$f":"IF(AND(dates>=Début03, dates<=Fin_03,NOT(feries=\"F\")),\"C\",\"\")","v":""},{"$f":"IF(AND(dates>=Début03, dates<=Fin_03,NOT(feries=\"F\")),\"C\",\"\")","v":""},{"$f":"IF(AND(dates>=Début03, dates<=Fin_03,NOT(feries=\"F\")),\"C\",\"\")","v":""},{"$f":"IF(AND(dates>=Début03, dates<=Fin_03,NOT(feries=\"F\")),\"C\",\"\")","v":""},{"$f":"IF(AND(dates>=Début03, dates<=Fin_03,NOT(feries=\"F\")),\"C\",\"\")","v":""},{"$f":"IF(AND(dates>=Début03, dates<=Fin_03,NOT(feries=\"F\")),\"C\",\"\")","v":""},{"$f":"IF(AND(dates>=Début03, dates<=Fin_03,NOT(feries=\"F\")),\"C\",\"\")","v":""},null,null,{"$f":"NETWORKDAYS(DA24,DB24,'jours Féries 2016'!$B$1:$B$14)","v":0},0,{"$f":"IF(AND(dates>=Début04, dates<=Fin_04,NOT(feries=\"F\")),\"C\",\"\")","v":""},{"$f":"IF(AND(dates>=Début04, dates<=Fin_04,NOT(feries=\"F\")),\"C\",\"\")","v":""},{"$f":"IF(AND(dates>=Début04, dates<=Fin_04,NOT(feries=\"F\")),\"C\",\"\")","v":""},{"$f":"IF(AND(dates>=Début04, dates<=Fin_04,NOT(feries=\"F\")),\"C\",\"\")","v":""},{"$f":"IF(AND(dates>=Début04, dates<=Fin_04,NOT(feries=\"F\")),\"C\",\"\")","v":""},{"$f":"IF(AND(dates>=Début04, dates<=Fin_04,NOT(feries=\"F\")),\"C\",\"\")","v":""},{"$f":"IF(AND(dates>=Début04, dates<=Fin_04,NOT(feries=\"F\")),\"C\",\"\")","v":""},{"$f":"IF(AND(dates>=Début04, dates<=Fin_04,NOT(feries=\"F\")),\"C\",\"\")","v":""},{"$f":"IF(AND(dates>=Début04, dates<=Fin_04,NOT(feries=\"F\")),\"C\",\"\")","v":""},{"$f":"IF(AND(dates>=Début04, dates<=Fin_04,NOT(feries=\"F\")),\"C\",\"\")","v":""},{"$f":"IF(AND(dates>=Début04, dates<=Fin_04,NOT(feries=\"F\")),\"C\",\"\")","v":""},{"$f":"IF(AND(dates>=Début04, dates<=Fin_04,NOT(feries=\"F\")),\"C\",\"\")","v":""},{"$f":"IF(AND(dates>=Début04, dates<=Fin_04,NOT(feries=\"F\")),\"C\",\"\")","v":""},{"$f":"IF(AND(dates>=Début04, dates<=Fin_04,NOT(feries=\"F\")),\"C\",\"\")","v":""},{"$f":"IF(AND(dates>=Début04, dates<=Fin_04,NOT(feries=\"F\")),\"C\",\"\")","v":""},{"$f":"IF(AND(dates>=Début04, dates<=Fin_04,NOT(feries=\"F\")),\"C\",\"\")","v":""},{"$f":"IF(AND(dates>=Début04, dates<=Fin_04,NOT(feries=\"F\")),\"C\",\"\")","v":""},{"$f":"IF(AND(dates>=Début04, dates<=Fin_04,NOT(feries=\"F\")),\"C\",\"\")","v":""},{"$f":"IF(AND(dates>=Début04, dates<=Fin_04,NOT(feries=\"F\")),\"C\",\"\")","v":""},{"$f":"IF(AND(dates>=Début04, dates<=Fin_04,NOT(feries=\"F\")),\"C\",\"\")","v":""},{"$f":"IF(AND(dates>=Début04, dates<=Fin_04,NOT(feries=\"F\")),\"C\",\"\")","v":""},{"$f":"IF(AND(dates>=Début04, dates<=Fin_04,NOT(feries=\"F\")),\"C\",\"\")","v":""},{"$f":"IF(AND(dates>=Début04, dates<=Fin_04,NOT(feries=\"F\")),\"C\",\"\")","v":""},{"$f":"IF(AND(dates>=Début04, dates<=Fin_04,NOT(feries=\"F\")),\"C\",\"\")","v":""},{"$f":"IF(AND(dates>=Début04, dates<=Fin_04,NOT(feries=\"F\")),\"C\",\"\")","v":""},{"$f":"IF(AND(dates>=Début04, dates<=Fin_04,NOT(feries=\"F\")),\"C\",\"\")","v":""},{"$f":"IF(AND(dates>=Début04, dates<=Fin_04,NOT(feries=\"F\")),\"C\",\"\")","v":""},{"$f":"IF(AND(dates>=Début04, dates<=Fin_04,NOT(feries=\"F\")),\"C\",\"\")","v":""},{"$f":"IF(AND(dates>=Début04, dates<=Fin_04,NOT(feries=\"F\")),\"C\",\"\")","v":""},{"$f":"IF(AND(dates>=Début04, dates<=Fin_04,NOT(feries=\"F\")),\"C\",\"\")","v":""},null,null,{"$f":"NETWORKDAYS(EI24,EJ24,'jours Féries 2016'!$B$1:$B$14)","v":0},{"$f":"COUNTIF(EM24:GD24,\"C\")","v":0},"","","","","","",{"$f":"IF(AND(dates>=Début01, dates<=Fin_01,NOT(feries=\"F\")),\"C\",\"\")","v":""},"","","","","","","","","","","","","","","","","","","","","","","","",null,"","","","","","","","","","","","","","","","","","","","","","","","","","","","","","","","","","","","","","","","","","","","","","","","","","","","","","","","","","","","","","","","","","","","","","","","","","","","","","","","","","","","","","","","","","","","","","","","","","","","","","","","","","","","","","","","","","","","","","","","","","","","","","","","","","","","","","","","","","","","","","","","","","","","","","","","","","","","","","","","","","","","","","","","","","","","","","","","","","","","","","","","","","","","","","","","","","","","","","","","","","","","","","","","","","","","","",""]
["EMPLOYE19","2016-01-19","2016-01-28",{"$f":"NETWORKDAYS(B25,C25,'jours Féries 2016'!$B$1:$B$14)","v":8},8,"","","","","","","","","","","","","","","","","","","C","C","C","C","","","C","C","C","C","","","",null,null,{"$f":"NETWORKDAYS(AK25,AL25,'jours Féries 2016'!$B$1:$B$14)","v":0},0,{"$f":"IF(AND(dates>=Début02, dates<=Fin_02,NOT(feries=\"F\")),\"C\",\"\")","v":""},{"$f":"IF(AND(dates>=Début02, dates<=Fin_02,NOT(feries=\"F\")),\"C\",\"\")","v":""},{"$f":"IF(AND(dates>=Début02, dates<=Fin_02,NOT(feries=\"F\")),\"C\",\"\")","v":""},{"$f":"IF(AND(dates>=Début02, dates<=Fin_02,NOT(feries=\"F\")),\"C\",\"\")","v":""},{"$f":"IF(AND(dates>=Début02, dates<=Fin_02,NOT(feries=\"F\")),\"C\",\"\")","v":""},{"$f":"IF(AND(dates>=Début02, dates<=Fin_02,NOT(feries=\"F\")),\"C\",\"\")","v":""},{"$f":"IF(AND(dates>=Début02, dates<=Fin_02,NOT(feries=\"F\")),\"C\",\"\")","v":""},{"$f":"IF(AND(dates>=Début02, dates<=Fin_02,NOT(feries=\"F\")),\"C\",\"\")","v":""},{"$f":"IF(AND(dates>=Début02, dates<=Fin_02,NOT(feries=\"F\")),\"C\",\"\")","v":""},{"$f":"IF(AND(dates>=Début02, dates<=Fin_02,NOT(feries=\"F\")),\"C\",\"\")","v":""},{"$f":"IF(AND(dates>=Début02, dates<=Fin_02,NOT(feries=\"F\")),\"C\",\"\")","v":""},{"$f":"IF(AND(dates>=Début02, dates<=Fin_02,NOT(feries=\"F\")),\"C\",\"\")","v":""},{"$f":"IF(AND(dates>=Début02, dates<=Fin_02,NOT(feries=\"F\")),\"C\",\"\")","v":""},{"$f":"IF(AND(dates>=Début02, dates<=Fin_02,NOT(feries=\"F\")),\"C\",\"\")","v":""},{"$f":"IF(AND(dates>=Début02, dates<=Fin_02,NOT(feries=\"F\")),\"C\",\"\")","v":""},{"$f":"IF(AND(dates>=Début02, dates<=Fin_02,NOT(feries=\"F\")),\"C\",\"\")","v":""},{"$f":"IF(AND(dates>=Début02, dates<=Fin_02,NOT(feries=\"F\")),\"C\",\"\")","v":""},{"$f":"IF(AND(dates>=Début02, dates<=Fin_02,NOT(feries=\"F\")),\"C\",\"\")","v":""},{"$f":"IF(AND(dates>=Début02, dates<=Fin_02,NOT(feries=\"F\")),\"C\",\"\")","v":""},{"$f":"IF(AND(dates>=Début02, dates<=Fin_02,NOT(feries=\"F\")),\"C\",\"\")","v":""},{"$f":"IF(AND(dates>=Début02, dates<=Fin_02,NOT(feries=\"F\")),\"C\",\"\")","v":""},{"$f":"IF(AND(dates>=Début02, dates<=Fin_02,NOT(feries=\"F\")),\"C\",\"\")","v":""},{"$f":"IF(AND(dates>=Début02, dates<=Fin_02,NOT(feries=\"F\")),\"C\",\"\")","v":""},{"$f":"IF(AND(dates>=Début02, dates<=Fin_02,NOT(feries=\"F\")),\"C\",\"\")","v":""},{"$f":"IF(AND(dates>=Début02, dates<=Fin_02,NOT(feries=\"F\")),\"C\",\"\")","v":""},{"$f":"IF(AND(dates>=Début02, dates<=Fin_02,NOT(feries=\"F\")),\"C\",\"\")","v":""},{"$f":"IF(AND(dates>=Début02, dates<=Fin_02,NOT(feries=\"F\")),\"C\",\"\")","v":""},{"$f":"IF(AND(dates>=Début02, dates<=Fin_02,NOT(feries=\"F\")),\"C\",\"\")","v":""},{"$f":"IF(AND(dates>=Début02, dates<=Fin_02,NOT(feries=\"F\")),\"C\",\"\")","v":""},null,null,{"$f":"NETWORKDAYS(BR25,BS25,'jours Féries 2016'!$B$1:$B$14)","v":0},0,{"$f":"IF(AND(dates>=Début03, dates<=Fin_03,NOT(feries=\"F\")),\"C\",\"\")","v":""},{"$f":"IF(AND(dates>=Début03, dates<=Fin_03,NOT(feries=\"F\")),\"C\",\"\")","v":""},{"$f":"IF(AND(dates>=Début03, dates<=Fin_03,NOT(feries=\"F\")),\"C\",\"\")","v":""},{"$f":"IF(AND(dates>=Début03, dates<=Fin_03,NOT(feries=\"F\")),\"C\",\"\")","v":""},{"$f":"IF(AND(dates>=Début03, dates<=Fin_03,NOT(feries=\"F\")),\"C\",\"\")","v":""},{"$f":"IF(AND(dates>=Début03, dates<=Fin_03,NOT(feries=\"F\")),\"C\",\"\")","v":""},{"$f":"IF(AND(dates>=Début03, dates<=Fin_03,NOT(feries=\"F\")),\"C\",\"\")","v":""},{"$f":"IF(AND(dates>=Début03, dates<=Fin_03,NOT(feries=\"F\")),\"C\",\"\")","v":""},{"$f":"IF(AND(dates>=Début03, dates<=Fin_03,NOT(feries=\"F\")),\"C\",\"\")","v":""},{"$f":"IF(AND(dates>=Début03, dates<=Fin_03,NOT(feries=\"F\")),\"C\",\"\")","v":""},{"$f":"IF(AND(dates>=Début03, dates<=Fin_03,NOT(feries=\"F\")),\"C\",\"\")","v":""},{"$f":"IF(AND(dates>=Début03, dates<=Fin_03,NOT(feries=\"F\")),\"C\",\"\")","v":""},{"$f":"IF(AND(dates>=Début03, dates<=Fin_03,NOT(feries=\"F\")),\"C\",\"\")","v":""},{"$f":"IF(AND(dates>=Début03, dates<=Fin_03,NOT(feries=\"F\")),\"C\",\"\")","v":""},{"$f":"IF(AND(dates>=Début03, dates<=Fin_03,NOT(feries=\"F\")),\"C\",\"\")","v":""},{"$f":"IF(AND(dates>=Début03, dates<=Fin_03,NOT(feries=\"F\")),\"C\",\"\")","v":""},{"$f":"IF(AND(dates>=Début03, dates<=Fin_03,NOT(feries=\"F\")),\"C\",\"\")","v":""},{"$f":"IF(AND(dates>=Début03, dates<=Fin_03,NOT(feries=\"F\")),\"C\",\"\")","v":""},{"$f":"IF(AND(dates>=Début03, dates<=Fin_03,NOT(feries=\"F\")),\"C\",\"\")","v":""},{"$f":"IF(AND(dates>=Début03, dates<=Fin_03,NOT(feries=\"F\")),\"C\",\"\")","v":""},{"$f":"IF(AND(dates>=Début03, dates<=Fin_03,NOT(feries=\"F\")),\"C\",\"\")","v":""},{"$f":"IF(AND(dates>=Début03, dates<=Fin_03,NOT(feries=\"F\")),\"C\",\"\")","v":""},{"$f":"IF(AND(dates>=Début03, dates<=Fin_03,NOT(feries=\"F\")),\"C\",\"\")","v":""},{"$f":"IF(AND(dates>=Début03, dates<=Fin_03,NOT(feries=\"F\")),\"C\",\"\")","v":""},{"$f":"IF(AND(dates>=Début03, dates<=Fin_03,NOT(feries=\"F\")),\"C\",\"\")","v":""},{"$f":"IF(AND(dates>=Début03, dates<=Fin_03,NOT(feries=\"F\")),\"C\",\"\")","v":""},{"$f":"IF(AND(dates>=Début03, dates<=Fin_03,NOT(feries=\"F\")),\"C\",\"\")","v":""},{"$f":"IF(AND(dates>=Début03, dates<=Fin_03,NOT(feries=\"F\")),\"C\",\"\")","v":""},{"$f":"IF(AND(dates>=Début03, dates<=Fin_03,NOT(feries=\"F\")),\"C\",\"\")","v":""},{"$f":"IF(AND(dates>=Début03, dates<=Fin_03,NOT(feries=\"F\")),\"C\",\"\")","v":""},{"$f":"IF(AND(dates>=Début03, dates<=Fin_03,NOT(feries=\"F\")),\"C\",\"\")","v":""},null,null,{"$f":"NETWORKDAYS(DA25,DB25,'jours Féries 2016'!$B$1:$B$14)","v":0},0,{"$f":"IF(AND(dates>=Début04, dates<=Fin_04,NOT(feries=\"F\")),\"C\",\"\")","v":""},{"$f":"IF(AND(dates>=Début04, dates<=Fin_04,NOT(feries=\"F\")),\"C\",\"\")","v":""},{"$f":"IF(AND(dates>=Début04, dates<=Fin_04,NOT(feries=\"F\")),\"C\",\"\")","v":""},{"$f":"IF(AND(dates>=Début04, dates<=Fin_04,NOT(feries=\"F\")),\"C\",\"\")","v":""},{"$f":"IF(AND(dates>=Début04, dates<=Fin_04,NOT(feries=\"F\")),\"C\",\"\")","v":""},{"$f":"IF(AND(dates>=Début04, dates<=Fin_04,NOT(feries=\"F\")),\"C\",\"\")","v":""},{"$f":"IF(AND(dates>=Début04, dates<=Fin_04,NOT(feries=\"F\")),\"C\",\"\")","v":""},{"$f":"IF(AND(dates>=Début04, dates<=Fin_04,NOT(feries=\"F\")),\"C\",\"\")","v":""},{"$f":"IF(AND(dates>=Début04, dates<=Fin_04,NOT(feries=\"F\")),\"C\",\"\")","v":""},{"$f":"IF(AND(dates>=Début04, dates<=Fin_04,NOT(feries=\"F\")),\"C\",\"\")","v":""},{"$f":"IF(AND(dates>=Début04, dates<=Fin_04,NOT(feries=\"F\")),\"C\",\"\")","v":""},{"$f":"IF(AND(dates>=Début04, dates<=Fin_04,NOT(feries=\"F\")),\"C\",\"\")","v":""},{"$f":"IF(AND(dates>=Début04, dates<=Fin_04,NOT(feries=\"F\")),\"C\",\"\")","v":""},{"$f":"IF(AND(dates>=Début04, dates<=Fin_04,NOT(feries=\"F\")),\"C\",\"\")","v":""},{"$f":"IF(AND(dates>=Début04, dates<=Fin_04,NOT(feries=\"F\")),\"C\",\"\")","v":""},{"$f":"IF(AND(dates>=Début04, dates<=Fin_04,NOT(feries=\"F\")),\"C\",\"\")","v":""},{"$f":"IF(AND(dates>=Début04, dates<=Fin_04,NOT(feries=\"F\")),\"C\",\"\")","v":""},{"$f":"IF(AND(dates>=Début04, dates<=Fin_04,NOT(feries=\"F\")),\"C\",\"\")","v":""},{"$f":"IF(AND(dates>=Début04, dates<=Fin_04,NOT(feries=\"F\")),\"C\",\"\")","v":""},{"$f":"IF(AND(dates>=Début04, dates<=Fin_04,NOT(feries=\"F\")),\"C\",\"\")","v":""},{"$f":"IF(AND(dates>=Début04, dates<=Fin_04,NOT(feries=\"F\")),\"C\",\"\")","v":""},{"$f":"IF(AND(dates>=Début04, dates<=Fin_04,NOT(feries=\"F\")),\"C\",\"\")","v":""},{"$f":"IF(AND(dates>=Début04, dates<=Fin_04,NOT(feries=\"F\")),\"C\",\"\")","v":""},{"$f":"IF(AND(dates>=Début04, dates<=Fin_04,NOT(feries=\"F\")),\"C\",\"\")","v":""},{"$f":"IF(AND(dates>=Début04, dates<=Fin_04,NOT(feries=\"F\")),\"C\",\"\")","v":""},{"$f":"IF(AND(dates>=Début04, dates<=Fin_04,NOT(feries=\"F\")),\"C\",\"\")","v":""},{"$f":"IF(AND(dates>=Début04, dates<=Fin_04,NOT(feries=\"F\")),\"C\",\"\")","v":""},{"$f":"IF(AND(dates>=Début04, dates<=Fin_04,NOT(feries=\"F\")),\"C\",\"\")","v":""},{"$f":"IF(AND(dates>=Début04, dates<=Fin_04,NOT(feries=\"F\")),\"C\",\"\")","v":""},{"$f":"IF(AND(dates>=Début04, dates<=Fin_04,NOT(feries=\"F\")),\"C\",\"\")","v":""},null,null,{"$f":"NETWORKDAYS(EI25,EJ25,'jours Féries 2016'!$B$1:$B$14)","v":0},{"$f":"COUNTIF(EM25:GD25,\"C\")","v":0},"","","","","","","","","","","","","","","","","","","","","","","","","","","","","","","",null,"","","","","","","","","","","","","","","","","","","","","","","","","","","","","","","","","","","","","","","","","","","","","","","","","","","","","","","","","","","","","","","","","","","","","","","","","","","","","","","","","","","","","","","","","","","","","","","","","","","","","","","","","","","","","","","","","","","","","","","","","","","","","","","","","","","","","","","","","","","","","","","","","","","","","","","","","","","","","","","","","","","","","","","","","","","","","","","","","","","","","","","","","","","","","","","","","","","","","","","","","","","","","","","","","","","","","",""]
["EMPLOYE20","2016-01-20","2016-01-29",{"$f":"NETWORKDAYS(B26,C26,'jours Féries 2016'!$B$1:$B$14)","v":8},8,"","","","","","","","","","","","","","","","","","","","C","C","C","","","C","C","C","C","C","","",null,null,{"$f":"NETWORKDAYS(AK26,AL26,'jours Féries 2016'!$B$1:$B$14)","v":0},0,{"$f":"IF(AND(dates>=Début02, dates<=Fin_02,NOT(feries=\"F\")),\"C\",\"\")","v":""},{"$f":"IF(AND(dates>=Début02, dates<=Fin_02,NOT(feries=\"F\")),\"C\",\"\")","v":""},{"$f":"IF(AND(dates>=Début02, dates<=Fin_02,NOT(feries=\"F\")),\"C\",\"\")","v":""},{"$f":"IF(AND(dates>=Début02, dates<=Fin_02,NOT(feries=\"F\")),\"C\",\"\")","v":""},{"$f":"IF(AND(dates>=Début02, dates<=Fin_02,NOT(feries=\"F\")),\"C\",\"\")","v":""},{"$f":"IF(AND(dates>=Début02, dates<=Fin_02,NOT(feries=\"F\")),\"C\",\"\")","v":""},{"$f":"IF(AND(dates>=Début02, dates<=Fin_02,NOT(feries=\"F\")),\"C\",\"\")","v":""},{"$f":"IF(AND(dates>=Début02, dates<=Fin_02,NOT(feries=\"F\")),\"C\",\"\")","v":""},{"$f":"IF(AND(dates>=Début02, dates<=Fin_02,NOT(feries=\"F\")),\"C\",\"\")","v":""},{"$f":"IF(AND(dates>=Début02, dates<=Fin_02,NOT(feries=\"F\")),\"C\",\"\")","v":""},{"$f":"IF(AND(dates>=Début02, dates<=Fin_02,NOT(feries=\"F\")),\"C\",\"\")","v":""},{"$f":"IF(AND(dates>=Début02, dates<=Fin_02,NOT(feries=\"F\")),\"C\",\"\")","v":""},{"$f":"IF(AND(dates>=Début02, dates<=Fin_02,NOT(feries=\"F\")),\"C\",\"\")","v":""},{"$f":"IF(AND(dates>=Début02, dates<=Fin_02,NOT(feries=\"F\")),\"C\",\"\")","v":""},{"$f":"IF(AND(dates>=Début02, dates<=Fin_02,NOT(feries=\"F\")),\"C\",\"\")","v":""},{"$f":"IF(AND(dates>=Début02, dates<=Fin_02,NOT(feries=\"F\")),\"C\",\"\")","v":""},{"$f":"IF(AND(dates>=Début02, dates<=Fin_02,NOT(feries=\"F\")),\"C\",\"\")","v":""},{"$f":"IF(AND(dates>=Début02, dates<=Fin_02,NOT(feries=\"F\")),\"C\",\"\")","v":""},{"$f":"IF(AND(dates>=Début02, dates<=Fin_02,NOT(feries=\"F\")),\"C\",\"\")","v":""},{"$f":"IF(AND(dates>=Début02, dates<=Fin_02,NOT(feries=\"F\")),\"C\",\"\")","v":""},{"$f":"IF(AND(dates>=Début02, dates<=Fin_02,NOT(feries=\"F\")),\"C\",\"\")","v":""},{"$f":"IF(AND(dates>=Début02, dates<=Fin_02,NOT(feries=\"F\")),\"C\",\"\")","v":""},{"$f":"IF(AND(dates>=Début02, dates<=Fin_02,NOT(feries=\"F\")),\"C\",\"\")","v":""},{"$f":"IF(AND(dates>=Début02, dates<=Fin_02,NOT(feries=\"F\")),\"C\",\"\")","v":""},{"$f":"IF(AND(dates>=Début02, dates<=Fin_02,NOT(feries=\"F\")),\"C\",\"\")","v":""},{"$f":"IF(AND(dates>=Début02, dates<=Fin_02,NOT(feries=\"F\")),\"C\",\"\")","v":""},{"$f":"IF(AND(dates>=Début02, dates<=Fin_02,NOT(feries=\"F\")),\"C\",\"\")","v":""},{"$f":"IF(AND(dates>=Début02, dates<=Fin_02,NOT(feries=\"F\")),\"C\",\"\")","v":""},{"$f":"IF(AND(dates>=Début02, dates<=Fin_02,NOT(feries=\"F\")),\"C\",\"\")","v":""},null,null,{"$f":"NETWORKDAYS(BR26,BS26,'jours Féries 2016'!$B$1:$B$14)","v":0},0,{"$f":"IF(AND(dates>=Début03, dates<=Fin_03,NOT(feries=\"F\")),\"C\",\"\")","v":""},{"$f":"IF(AND(dates>=Début03, dates<=Fin_03,NOT(feries=\"F\")),\"C\",\"\")","v":""},{"$f":"IF(AND(dates>=Début03, dates<=Fin_03,NOT(feries=\"F\")),\"C\",\"\")","v":""},{"$f":"IF(AND(dates>=Début03, dates<=Fin_03,NOT(feries=\"F\")),\"C\",\"\")","v":""},{"$f":"IF(AND(dates>=Début03, dates<=Fin_03,NOT(feries=\"F\")),\"C\",\"\")","v":""},{"$f":"IF(AND(dates>=Début03, dates<=Fin_03,NOT(feries=\"F\")),\"C\",\"\")","v":""},{"$f":"IF(AND(dates>=Début03, dates<=Fin_03,NOT(feries=\"F\")),\"C\",\"\")","v":""},{"$f":"IF(AND(dates>=Début03, dates<=Fin_03,NOT(feries=\"F\")),\"C\",\"\")","v":""},{"$f":"IF(AND(dates>=Début03, dates<=Fin_03,NOT(feries=\"F\")),\"C\",\"\")","v":""},{"$f":"IF(AND(dates>=Début03, dates<=Fin_03,NOT(feries=\"F\")),\"C\",\"\")","v":""},{"$f":"IF(AND(dates>=Début03, dates<=Fin_03,NOT(feries=\"F\")),\"C\",\"\")","v":""},{"$f":"IF(AND(dates>=Début03, dates<=Fin_03,NOT(feries=\"F\")),\"C\",\"\")","v":""},{"$f":"IF(AND(dates>=Début03, dates<=Fin_03,NOT(feries=\"F\")),\"C\",\"\")","v":""},{"$f":"IF(AND(dates>=Début03, dates<=Fin_03,NOT(feries=\"F\")),\"C\",\"\")","v":""},{"$f":"IF(AND(dates>=Début03, dates<=Fin_03,NOT(feries=\"F\")),\"C\",\"\")","v":""},{"$f":"IF(AND(dates>=Début03, dates<=Fin_03,NOT(feries=\"F\")),\"C\",\"\")","v":""},{"$f":"IF(AND(dates>=Début03, dates<=Fin_03,NOT(feries=\"F\")),\"C\",\"\")","v":""},{"$f":"IF(AND(dates>=Début03, dates<=Fin_03,NOT(feries=\"F\")),\"C\",\"\")","v":""},{"$f":"IF(AND(dates>=Début03, dates<=Fin_03,NOT(feries=\"F\")),\"C\",\"\")","v":""},{"$f":"IF(AND(dates>=Début03, dates<=Fin_03,NOT(feries=\"F\")),\"C\",\"\")","v":""},{"$f":"IF(AND(dates>=Début03, dates<=Fin_03,NOT(feries=\"F\")),\"C\",\"\")","v":""},{"$f":"IF(AND(dates>=Début03, dates<=Fin_03,NOT(feries=\"F\")),\"C\",\"\")","v":""},{"$f":"IF(AND(dates>=Début03, dates<=Fin_03,NOT(feries=\"F\")),\"C\",\"\")","v":""},{"$f":"IF(AND(dates>=Début03, dates<=Fin_03,NOT(feries=\"F\")),\"C\",\"\")","v":""},{"$f":"IF(AND(dates>=Début03, dates<=Fin_03,NOT(feries=\"F\")),\"C\",\"\")","v":""},{"$f":"IF(AND(dates>=Début03, dates<=Fin_03,NOT(feries=\"F\")),\"C\",\"\")","v":""},{"$f":"IF(AND(dates>=Début03, dates<=Fin_03,NOT(feries=\"F\")),\"C\",\"\")","v":""},{"$f":"IF(AND(dates>=Début03, dates<=Fin_03,NOT(feries=\"F\")),\"C\",\"\")","v":""},{"$f":"IF(AND(dates>=Début03, dates<=Fin_03,NOT(feries=\"F\")),\"C\",\"\")","v":""},{"$f":"IF(AND(dates>=Début03, dates<=Fin_03,NOT(feries=\"F\")),\"C\",\"\")","v":""},{"$f":"IF(AND(dates>=Début03, dates<=Fin_03,NOT(feries=\"F\")),\"C\",\"\")","v":""},null,null,{"$f":"NETWORKDAYS(DA26,DB26,'jours Féries 2016'!$B$1:$B$14)","v":0},0,{"$f":"IF(AND(dates>=Début04, dates<=Fin_04,NOT(feries=\"F\")),\"C\",\"\")","v":""},{"$f":"IF(AND(dates>=Début04, dates<=Fin_04,NOT(feries=\"F\")),\"C\",\"\")","v":""},{"$f":"IF(AND(dates>=Début04, dates<=Fin_04,NOT(feries=\"F\")),\"C\",\"\")","v":""},{"$f":"IF(AND(dates>=Début04, dates<=Fin_04,NOT(feries=\"F\")),\"C\",\"\")","v":""},{"$f":"IF(AND(dates>=Début04, dates<=Fin_04,NOT(feries=\"F\")),\"C\",\"\")","v":""},{"$f":"IF(AND(dates>=Début04, dates<=Fin_04,NOT(feries=\"F\")),\"C\",\"\")","v":""},{"$f":"IF(AND(dates>=Début04, dates<=Fin_04,NOT(feries=\"F\")),\"C\",\"\")","v":""},{"$f":"IF(AND(dates>=Début04, dates<=Fin_04,NOT(feries=\"F\")),\"C\",\"\")","v":""},{"$f":"IF(AND(dates>=Début04, dates<=Fin_04,NOT(feries=\"F\")),\"C\",\"\")","v":""},{"$f":"IF(AND(dates>=Début04, dates<=Fin_04,NOT(feries=\"F\")),\"C\",\"\")","v":""},{"$f":"IF(AND(dates>=Début04, dates<=Fin_04,NOT(feries=\"F\")),\"C\",\"\")","v":""},{"$f":"IF(AND(dates>=Début04, dates<=Fin_04,NOT(feries=\"F\")),\"C\",\"\")","v":""},{"$f":"IF(AND(dates>=Début04, dates<=Fin_04,NOT(feries=\"F\")),\"C\",\"\")","v":""},{"$f":"IF(AND(dates>=Début04, dates<=Fin_04,NOT(feries=\"F\")),\"C\",\"\")","v":""},{"$f":"IF(AND(dates>=Début04, dates<=Fin_04,NOT(feries=\"F\")),\"C\",\"\")","v":""},{"$f":"IF(AND(dates>=Début04, dates<=Fin_04,NOT(feries=\"F\")),\"C\",\"\")","v":""},{"$f":"IF(AND(dates>=Début04, dates<=Fin_04,NOT(feries=\"F\")),\"C\",\"\")","v":""},{"$f":"IF(AND(dates>=Début04, dates<=Fin_04,NOT(feries=\"F\")),\"C\",\"\")","v":""},{"$f":"IF(AND(dates>=Début04, dates<=Fin_04,NOT(feries=\"F\")),\"C\",\"\")","v":""},{"$f":"IF(AND(dates>=Début04, dates<=Fin_04,NOT(feries=\"F\")),\"C\",\"\")","v":""},{"$f":"IF(AND(dates>=Début04, dates<=Fin_04,NOT(feries=\"F\")),\"C\",\"\")","v":""},{"$f":"IF(AND(dates>=Début04, dates<=Fin_04,NOT(feries=\"F\")),\"C\",\"\")","v":""},{"$f":"IF(AND(dates>=Début04, dates<=Fin_04,NOT(feries=\"F\")),\"C\",\"\")","v":""},{"$f":"IF(AND(dates>=Début04, dates<=Fin_04,NOT(feries=\"F\")),\"C\",\"\")","v":""},{"$f":"IF(AND(dates>=Début04, dates<=Fin_04,NOT(feries=\"F\")),\"C\",\"\")","v":""},{"$f":"IF(AND(dates>=Début04, dates<=Fin_04,NOT(feries=\"F\")),\"C\",\"\")","v":""},{"$f":"IF(AND(dates>=Début04, dates<=Fin_04,NOT(feries=\"F\")),\"C\",\"\")","v":""},{"$f":"IF(AND(dates>=Début04, dates<=Fin_04,NOT(feries=\"F\")),\"C\",\"\")","v":""},{"$f":"IF(AND(dates>=Début04, dates<=Fin_04,NOT(feries=\"F\")),\"C\",\"\")","v":""},{"$f":"IF(AND(dates>=Début04, dates<=Fin_04,NOT(feries=\"F\")),\"C\",\"\")","v":""},null,null,{"$f":"NETWORKDAYS(EI26,EJ26,'jours Féries 2016'!$B$1:$B$14)","v":0},{"$f":"COUNTIF(EM26:GD26,\"C\")","v":0},"","","","","","","","","","","","","","","","","","","","","","","","","","","","","","","",null,"","","","","","","","","","","","","","","","","","","","","","","","","","","","","","","","","","","","","","","","","","","","","","","","","","","","","","","","","","","","","","","","","","","","","","","","","","","","","","","","","","","","","","","","","","","","","","","","","","","","","","","","","","","","","","","","","","","","","","","","","","","","","","","","","","","","","","","","","","","","","","","","","","","","","","","","","","","","","","","","","","","","","",{"$f":"IF(AND(dates>=Début01, dates<=Fin_01,NOT(feries=\"F\")),\"C\",\"\")","v":""},"","","","","","","","","","","","","","","","","","","","","","","","","","","","","","","","","","","","","","","","","","","","","","","",""]
["EMPLOYE21","2016-01-21","2016-01-30",{"$f":"NETWORKDAYS(B27,C27,'jours Féries 2016'!$B$1:$B$14)","v":7},7,"","","","","","","","","","","","","","","","","","","","","C","C","","","C","C","C","C","C","","",null,null,{"$f":"NETWORKDAYS(AK27,AL27,'jours Féries 2016'!$B$1:$B$14)","v":0},0,{"$f":"IF(AND(dates>=Début02, dates<=Fin_02,NOT(feries=\"F\")),\"C\",\"\")","v":""},{"$f":"IF(AND(dates>=Début02, dates<=Fin_02,NOT(feries=\"F\")),\"C\",\"\")","v":""},{"$f":"IF(AND(dates>=Début02, dates<=Fin_02,NOT(feries=\"F\")),\"C\",\"\")","v":""},{"$f":"IF(AND(dates>=Début02, dates<=Fin_02,NOT(feries=\"F\")),\"C\",\"\")","v":""},{"$f":"IF(AND(dates>=Début02, dates<=Fin_02,NOT(feries=\"F\")),\"C\",\"\")","v":""},{"$f":"IF(AND(dates>=Début02, dates<=Fin_02,NOT(feries=\"F\")),\"C\",\"\")","v":""},{"$f":"IF(AND(dates>=Début02, dates<=Fin_02,NOT(feries=\"F\")),\"C\",\"\")","v":""},{"$f":"IF(AND(dates>=Début02, dates<=Fin_02,NOT(feries=\"F\")),\"C\",\"\")","v":""},{"$f":"IF(AND(dates>=Début02, dates<=Fin_02,NOT(feries=\"F\")),\"C\",\"\")","v":""},{"$f":"IF(AND(dates>=Début02, dates<=Fin_02,NOT(feries=\"F\")),\"C\",\"\")","v":""},{"$f":"IF(AND(dates>=Début02, dates<=Fin_02,NOT(feries=\"F\")),\"C\",\"\")","v":""},{"$f":"IF(AND(dates>=Début02, dates<=Fin_02,NOT(feries=\"F\")),\"C\",\"\")","v":""},{"$f":"IF(AND(dates>=Début02, dates<=Fin_02,NOT(feries=\"F\")),\"C\",\"\")","v":""},{"$f":"IF(AND(dates>=Début02, dates<=Fin_02,NOT(feries=\"F\")),\"C\",\"\")","v":""},{"$f":"IF(AND(dates>=Début02, dates<=Fin_02,NOT(feries=\"F\")),\"C\",\"\")","v":""},{"$f":"IF(AND(dates>=Début02, dates<=Fin_02,NOT(feries=\"F\")),\"C\",\"\")","v":""},{"$f":"IF(AND(dates>=Début02, dates<=Fin_02,NOT(feries=\"F\")),\"C\",\"\")","v":""},{"$f":"IF(AND(dates>=Début02, dates<=Fin_02,NOT(feries=\"F\")),\"C\",\"\")","v":""},{"$f":"IF(AND(dates>=Début02, dates<=Fin_02,NOT(feries=\"F\")),\"C\",\"\")","v":""},{"$f":"IF(AND(dates>=Début02, dates<=Fin_02,NOT(feries=\"F\")),\"C\",\"\")","v":""},{"$f":"IF(AND(dates>=Début02, dates<=Fin_02,NOT(feries=\"F\")),\"C\",\"\")","v":""},{"$f":"IF(AND(dates>=Début02, dates<=Fin_02,NOT(feries=\"F\")),\"C\",\"\")","v":""},{"$f":"IF(AND(dates>=Début02, dates<=Fin_02,NOT(feries=\"F\")),\"C\",\"\")","v":""},{"$f":"IF(AND(dates>=Début02, dates<=Fin_02,NOT(feries=\"F\")),\"C\",\"\")","v":""},{"$f":"IF(AND(dates>=Début02, dates<=Fin_02,NOT(feries=\"F\")),\"C\",\"\")","v":""},{"$f":"IF(AND(dates>=Début02, dates<=Fin_02,NOT(feries=\"F\")),\"C\",\"\")","v":""},{"$f":"IF(AND(dates>=Début02, dates<=Fin_02,NOT(feries=\"F\")),\"C\",\"\")","v":""},{"$f":"IF(AND(dates>=Début02, dates<=Fin_02,NOT(feries=\"F\")),\"C\",\"\")","v":""},{"$f":"IF(AND(dates>=Début02, dates<=Fin_02,NOT(feries=\"F\")),\"C\",\"\")","v":""},null,null,{"$f":"NETWORKDAYS(BR27,BS27,'jours Féries 2016'!$B$1:$B$14)","v":0},0,{"$f":"IF(AND(dates>=Début03, dates<=Fin_03,NOT(feries=\"F\")),\"C\",\"\")","v":""},{"$f":"IF(AND(dates>=Début03, dates<=Fin_03,NOT(feries=\"F\")),\"C\",\"\")","v":""},{"$f":"IF(AND(dates>=Début03, dates<=Fin_03,NOT(feries=\"F\")),\"C\",\"\")","v":""},{"$f":"IF(AND(dates>=Début03, dates<=Fin_03,NOT(feries=\"F\")),\"C\",\"\")","v":""},{"$f":"IF(AND(dates>=Début03, dates<=Fin_03,NOT(feries=\"F\")),\"C\",\"\")","v":""},{"$f":"IF(AND(dates>=Début03, dates<=Fin_03,NOT(feries=\"F\")),\"C\",\"\")","v":""},{"$f":"IF(AND(dates>=Début03, dates<=Fin_03,NOT(feries=\"F\")),\"C\",\"\")","v":""},{"$f":"IF(AND(dates>=Début03, dates<=Fin_03,NOT(feries=\"F\")),\"C\",\"\")","v":""},{"$f":"IF(AND(dates>=Début03, dates<=Fin_03,NOT(feries=\"F\")),\"C\",\"\")","v":""},{"$f":"IF(AND(dates>=Début03, dates<=Fin_03,NOT(feries=\"F\")),\"C\",\"\")","v":""},{"$f":"IF(AND(dates>=Début03, dates<=Fin_03,NOT(feries=\"F\")),\"C\",\"\")","v":""},{"$f":"IF(AND(dates>=Début03, dates<=Fin_03,NOT(feries=\"F\")),\"C\",\"\")","v":""},{"$f":"IF(AND(dates>=Début03, dates<=Fin_03,NOT(feries=\"F\")),\"C\",\"\")","v":""},{"$f":"IF(AND(dates>=Début03, dates<=Fin_03,NOT(feries=\"F\")),\"C\",\"\")","v":""},{"$f":"IF(AND(dates>=Début03, dates<=Fin_03,NOT(feries=\"F\")),\"C\",\"\")","v":""},{"$f":"IF(AND(dates>=Début03, dates<=Fin_03,NOT(feries=\"F\")),\"C\",\"\")","v":""},{"$f":"IF(AND(dates>=Début03, dates<=Fin_03,NOT(feries=\"F\")),\"C\",\"\")","v":""},{"$f":"IF(AND(dates>=Début03, dates<=Fin_03,NOT(feries=\"F\")),\"C\",\"\")","v":""},{"$f":"IF(AND(dates>=Début03, dates<=Fin_03,NOT(feries=\"F\")),\"C\",\"\")","v":""},{"$f":"IF(AND(dates>=Début03, dates<=Fin_03,NOT(feries=\"F\")),\"C\",\"\")","v":""},{"$f":"IF(AND(dates>=Début03, dates<=Fin_03,NOT(feries=\"F\")),\"C\",\"\")","v":""},{"$f":"IF(AND(dates>=Début03, dates<=Fin_03,NOT(feries=\"F\")),\"C\",\"\")","v":""},{"$f":"IF(AND(dates>=Début03, dates<=Fin_03,NOT(feries=\"F\")),\"C\",\"\")","v":""},{"$f":"IF(AND(dates>=Début03, dates<=Fin_03,NOT(feries=\"F\")),\"C\",\"\")","v":""},{"$f":"IF(AND(dates>=Début03, dates<=Fin_03,NOT(feries=\"F\")),\"C\",\"\")","v":""},{"$f":"IF(AND(dates>=Début03, dates<=Fin_03,NOT(feries=\"F\")),\"C\",\"\")","v":""},{"$f":"IF(AND(dates>=Début03, dates<=Fin_03,NOT(feries=\"F\")),\"C\",\"\")","v":""},{"$f":"IF(AND(dates>=Début03, dates<=Fin_03,NOT(feries=\"F\")),\"C\",\"\")","v":""},{"$f":"IF(AND(dates>=Début03, dates<=Fin_03,NOT(feries=\"F\")),\"C\",\"\")","v":""},{"$f":"IF(AND(dates>=Début03, dates<=Fin_03,NOT(feries=\"F\")),\"C\",\"\")","v":""},{"$f":"IF(AND(dates>=Début03, dates<=Fin_03,NOT(feries=\"F\")),\"C\",\"\")","v":""},null,null,{"$f":"NETWORKDAYS(DA27,DB27,'jours Féries 2016'!$B$1:$B$14)","v":0},0,{"$f":"IF(AND(dates>=Début04, dates<=Fin_04,NOT(feries=\"F\")),\"C\",\"\")","v":""},{"$f":"IF(AND(dates>=Début04, dates<=Fin_04,NOT(feries=\"F\")),\"C\",\"\")","v":""},{"$f":"IF(AND(dates>=Début04, dates<=Fin_04,NOT(feries=\"F\")),\"C\",\"\")","v":""},{"$f":"IF(AND(dates>=Début04, dates<=Fin_04,NOT(feries=\"F\")),\"C\",\"\")","v":""},{"$f":"IF(AND(dates>=Début04, dates<=Fin_04,NOT(feries=\"F\")),\"C\",\"\")","v":""},{"$f":"IF(AND(dates>=Début04, dates<=Fin_04,NOT(feries=\"F\")),\"C\",\"\")","v":""},{"$f":"IF(AND(dates>=Début04, dates<=Fin_04,NOT(feries=\"F\")),\"C\",\"\")","v":""},{"$f":"IF(AND(dates>=Début04, dates<=Fin_04,NOT(feries=\"F\")),\"C\",\"\")","v":""},{"$f":"IF(AND(dates>=Début04, dates<=Fin_04,NOT(feries=\"F\")),\"C\",\"\")","v":""},{"$f":"IF(AND(dates>=Début04, dates<=Fin_04,NOT(feries=\"F\")),\"C\",\"\")","v":""},{"$f":"IF(AND(dates>=Début04, dates<=Fin_04,NOT(feries=\"F\")),\"C\",\"\")","v":""},{"$f":"IF(AND(dates>=Début04, dates<=Fin_04,NOT(feries=\"F\")),\"C\",\"\")","v":""},{"$f":"IF(AND(dates>=Début04, dates<=Fin_04,NOT(feries=\"F\")),\"C\",\"\")","v":""},{"$f":"IF(AND(dates>=Début04, dates<=Fin_04,NOT(feries=\"F\")),\"C\",\"\")","v":""},{"$f":"IF(AND(dates>=Début04, dates<=Fin_04,NOT(feries=\"F\")),\"C\",\"\")","v":""},{"$f":"IF(AND(dates>=Début04, dates<=Fin_04,NOT(feries=\"F\")),\"C\",\"\")","v":""},{"$f":"IF(AND(dates>=Début04, dates<=Fin_04,NOT(feries=\"F\")),\"C\",\"\")","v":""},{"$f":"IF(AND(dates>=Début04, dates<=Fin_04,NOT(feries=\"F\")),\"C\",\"\")","v":""},{"$f":"IF(AND(dates>=Début04, dates<=Fin_04,NOT(feries=\"F\")),\"C\",\"\")","v":""},{"$f":"IF(AND(dates>=Début04, dates<=Fin_04,NOT(feries=\"F\")),\"C\",\"\")","v":""},{"$f":"IF(AND(dates>=Début04, dates<=Fin_04,NOT(feries=\"F\")),\"C\",\"\")","v":""},{"$f":"IF(AND(dates>=Début04, dates<=Fin_04,NOT(feries=\"F\")),\"C\",\"\")","v":""},{"$f":"IF(AND(dates>=Début04, dates<=Fin_04,NOT(feries=\"F\")),\"C\",\"\")","v":""},{"$f":"IF(AND(dates>=Début04, dates<=Fin_04,NOT(feries=\"F\")),\"C\",\"\")","v":""},{"$f":"IF(AND(dates>=Début04, dates<=Fin_04,NOT(feries=\"F\")),\"C\",\"\")","v":""},{"$f":"IF(AND(dates>=Début04, dates<=Fin_04,NOT(feries=\"F\")),\"C\",\"\")","v":""},{"$f":"IF(AND(dates>=Début04, dates<=Fin_04,NOT(feries=\"F\")),\"C\",\"\")","v":""},{"$f":"IF(AND(dates>=Début04, dates<=Fin_04,NOT(feries=\"F\")),\"C\",\"\")","v":""},{"$f":"IF(AND(dates>=Début04, dates<=Fin_04,NOT(feries=\"F\")),\"C\",\"\")","v":""},{"$f":"IF(AND(dates>=Début04, dates<=Fin_04,NOT(feries=\"F\")),\"C\",\"\")","v":""},null,null,{"$f":"NETWORKDAYS(EI27,EJ27,'jours Féries 2016'!$B$1:$B$14)","v":0},{"$f":"COUNTIF(EM27:GD27,\"C\")","v":0},{"$f":"IF(AND(dates>=Début01, dates<=Fin_01,NOT(feries=\"F\")),\"C\",\"\")","v":""},"","","","","","","","","","","","","","","","","","","","","","","","","","","","","","",null,"","","","","","","","","","","","","","","","","","","","","","","","","","","","","","","","","","","","","","","","","",{"$f":"IF(AND(dates>=Début01, dates<=Fin_01,NOT(feries=\"F\")),\"C\",\"\")","v":""},"","","","","","","","","","","","","","","","","","","","","","","","","","","","","","","","","","","","","","","","","","","","","","","","","","","","","","","","","","","","","","","",{"$f":"IF(AND(dates>=Début01, dates<=Fin_01,NOT(feries=\"F\")),\"C\",\"\")","v":""},"","","","","","","","","","","","","","","","","","","","","","","","","","","","","","","","","","","","","","","","","","","","","","","","","","","","","","","","","","","","","","","","","","","","","","","","","","","","","","","","","","","","","","","","","","","","","","","","","","","","","","","","","","","",""]
["EMPLOYE22","2016-01-22","2016-01-31",{"$f":"NETWORKDAYS(B28,C28,'jours Féries 2016'!$B$1:$B$14)","v":6},6,"","","","","","","","","","","","","","","","","","","","","","C","","","C","C","C","C","C","","",null,null,{"$f":"NETWORKDAYS(AK28,AL28,'jours Féries 2016'!$B$1:$B$14)","v":0},0,{"$f":"IF(AND(dates>=Début02, dates<=Fin_02,NOT(feries=\"F\")),\"C\",\"\")","v":""},{"$f":"IF(AND(dates>=Début02, dates<=Fin_02,NOT(feries=\"F\")),\"C\",\"\")","v":""},{"$f":"IF(AND(dates>=Début02, dates<=Fin_02,NOT(feries=\"F\")),\"C\",\"\")","v":""},{"$f":"IF(AND(dates>=Début02, dates<=Fin_02,NOT(feries=\"F\")),\"C\",\"\")","v":""},{"$f":"IF(AND(dates>=Début02, dates<=Fin_02,NOT(feries=\"F\")),\"C\",\"\")","v":""},{"$f":"IF(AND(dates>=Début02, dates<=Fin_02,NOT(feries=\"F\")),\"C\",\"\")","v":""},{"$f":"IF(AND(dates>=Début02, dates<=Fin_02,NOT(feries=\"F\")),\"C\",\"\")","v":""},{"$f":"IF(AND(dates>=Début02, dates<=Fin_02,NOT(feries=\"F\")),\"C\",\"\")","v":""},{"$f":"IF(AND(dates>=Début02, dates<=Fin_02,NOT(feries=\"F\")),\"C\",\"\")","v":""},{"$f":"IF(AND(dates>=Début02, dates<=Fin_02,NOT(feries=\"F\")),\"C\",\"\")","v":""},{"$f":"IF(AND(dates>=Début02, dates<=Fin_02,NOT(feries=\"F\")),\"C\",\"\")","v":""},{"$f":"IF(AND(dates>=Début02, dates<=Fin_02,NOT(feries=\"F\")),\"C\",\"\")","v":""},{"$f":"IF(AND(dates>=Début02, dates<=Fin_02,NOT(feries=\"F\")),\"C\",\"\")","v":""},{"$f":"IF(AND(dates>=Début02, dates<=Fin_02,NOT(feries=\"F\")),\"C\",\"\")","v":""},{"$f":"IF(AND(dates>=Début02, dates<=Fin_02,NOT(feries=\"F\")),\"C\",\"\")","v":""},{"$f":"IF(AND(dates>=Début02, dates<=Fin_02,NOT(feries=\"F\")),\"C\",\"\")","v":""},{"$f":"IF(AND(dates>=Début02, dates<=Fin_02,NOT(feries=\"F\")),\"C\",\"\")","v":""},{"$f":"IF(AND(dates>=Début02, dates<=Fin_02,NOT(feries=\"F\")),\"C\",\"\")","v":""},{"$f":"IF(AND(dates>=Début02, dates<=Fin_02,NOT(feries=\"F\")),\"C\",\"\")","v":""},{"$f":"IF(AND(dates>=Début02, dates<=Fin_02,NOT(feries=\"F\")),\"C\",\"\")","v":""},{"$f":"IF(AND(dates>=Début02, dates<=Fin_02,NOT(feries=\"F\")),\"C\",\"\")","v":""},{"$f":"IF(AND(dates>=Début02, dates<=Fin_02,NOT(feries=\"F\")),\"C\",\"\")","v":""},{"$f":"IF(AND(dates>=Début02, dates<=Fin_02,NOT(feries=\"F\")),\"C\",\"\")","v":""},{"$f":"IF(AND(dates>=Début02, dates<=Fin_02,NOT(feries=\"F\")),\"C\",\"\")","v":""},{"$f":"IF(AND(dates>=Début02, dates<=Fin_02,NOT(feries=\"F\")),\"C\",\"\")","v":""},{"$f":"IF(AND(dates>=Début02, dates<=Fin_02,NOT(feries=\"F\")),\"C\",\"\")","v":""},{"$f":"IF(AND(dates>=Début02, dates<=Fin_02,NOT(feries=\"F\")),\"C\",\"\")","v":""},{"$f":"IF(AND(dates>=Début02, dates<=Fin_02,NOT(feries=\"F\")),\"C\",\"\")","v":""},{"$f":"IF(AND(dates>=Début02, dates<=Fin_02,NOT(feries=\"F\")),\"C\",\"\")","v":""},null,null,{"$f":"NETWORKDAYS(BR28,BS28,'jours Féries 2016'!$B$1:$B$14)","v":0},0,{"$f":"IF(AND(dates>=Début03, dates<=Fin_03,NOT(feries=\"F\")),\"C\",\"\")","v":""},{"$f":"IF(AND(dates>=Début03, dates<=Fin_03,NOT(feries=\"F\")),\"C\",\"\")","v":""},{"$f":"IF(AND(dates>=Début03, dates<=Fin_03,NOT(feries=\"F\")),\"C\",\"\")","v":""},{"$f":"IF(AND(dates>=Début03, dates<=Fin_03,NOT(feries=\"F\")),\"C\",\"\")","v":""},{"$f":"IF(AND(dates>=Début03, dates<=Fin_03,NOT(feries=\"F\")),\"C\",\"\")","v":""},{"$f":"IF(AND(dates>=Début03, dates<=Fin_03,NOT(feries=\"F\")),\"C\",\"\")","v":""},{"$f":"IF(AND(dates>=Début03, dates<=Fin_03,NOT(feries=\"F\")),\"C\",\"\")","v":""},{"$f":"IF(AND(dates>=Début03, dates<=Fin_03,NOT(feries=\"F\")),\"C\",\"\")","v":""},{"$f":"IF(AND(dates>=Début03, dates<=Fin_03,NOT(feries=\"F\")),\"C\",\"\")","v":""},{"$f":"IF(AND(dates>=Début03, dates<=Fin_03,NOT(feries=\"F\")),\"C\",\"\")","v":""},{"$f":"IF(AND(dates>=Début03, dates<=Fin_03,NOT(feries=\"F\")),\"C\",\"\")","v":""},{"$f":"IF(AND(dates>=Début03, dates<=Fin_03,NOT(feries=\"F\")),\"C\",\"\")","v":""},{"$f":"IF(AND(dates>=Début03, dates<=Fin_03,NOT(feries=\"F\")),\"C\",\"\")","v":""},{"$f":"IF(AND(dates>=Début03, dates<=Fin_03,NOT(feries=\"F\")),\"C\",\"\")","v":""},{"$f":"IF(AND(dates>=Début03, dates<=Fin_03,NOT(feries=\"F\")),\"C\",\"\")","v":""},{"$f":"IF(AND(dates>=Début03, dates<=Fin_03,NOT(feries=\"F\")),\"C\",\"\")","v":""},{"$f":"IF(AND(dates>=Début03, dates<=Fin_03,NOT(feries=\"F\")),\"C\",\"\")","v":""},{"$f":"IF(AND(dates>=Début03, dates<=Fin_03,NOT(feries=\"F\")),\"C\",\"\")","v":""},{"$f":"IF(AND(dates>=Début03, dates<=Fin_03,NOT(feries=\"F\")),\"C\",\"\")","v":""},{"$f":"IF(AND(dates>=Début03, dates<=Fin_03,NOT(feries=\"F\")),\"C\",\"\")","v":""},{"$f":"IF(AND(dates>=Début03, dates<=Fin_03,NOT(feries=\"F\")),\"C\",\"\")","v":""},{"$f":"IF(AND(dates>=Début03, dates<=Fin_03,NOT(feries=\"F\")),\"C\",\"\")","v":""},{"$f":"IF(AND(dates>=Début03, dates<=Fin_03,NOT(feries=\"F\")),\"C\",\"\")","v":""},{"$f":"IF(AND(dates>=Début03, dates<=Fin_03,NOT(feries=\"F\")),\"C\",\"\")","v":""},{"$f":"IF(AND(dates>=Début03, dates<=Fin_03,NOT(feries=\"F\")),\"C\",\"\")","v":""},{"$f":"IF(AND(dates>=Début03, dates<=Fin_03,NOT(feries=\"F\")),\"C\",\"\")","v":""},{"$f":"IF(AND(dates>=Début03, dates<=Fin_03,NOT(feries=\"F\")),\"C\",\"\")","v":""},{"$f":"IF(AND(dates>=Début03, dates<=Fin_03,NOT(feries=\"F\")),\"C\",\"\")","v":""},{"$f":"IF(AND(dates>=Début03, dates<=Fin_03,NOT(feries=\"F\")),\"C\",\"\")","v":""},{"$f":"IF(AND(dates>=Début03, dates<=Fin_03,NOT(feries=\"F\")),\"C\",\"\")","v":""},{"$f":"IF(AND(dates>=Début03, dates<=Fin_03,NOT(feries=\"F\")),\"C\",\"\")","v":""},null,null,{"$f":"NETWORKDAYS(DA28,DB28,'jours Féries 2016'!$B$1:$B$14)","v":0},0,{"$f":"IF(AND(dates>=Début04, dates<=Fin_04,NOT(feries=\"F\")),\"C\",\"\")","v":""},{"$f":"IF(AND(dates>=Début04, dates<=Fin_04,NOT(feries=\"F\")),\"C\",\"\")","v":""},{"$f":"IF(AND(dates>=Début04, dates<=Fin_04,NOT(feries=\"F\")),\"C\",\"\")","v":""},{"$f":"IF(AND(dates>=Début04, dates<=Fin_04,NOT(feries=\"F\")),\"C\",\"\")","v":""},{"$f":"IF(AND(dates>=Début04, dates<=Fin_04,NOT(feries=\"F\")),\"C\",\"\")","v":""},{"$f":"IF(AND(dates>=Début04, dates<=Fin_04,NOT(feries=\"F\")),\"C\",\"\")","v":""},{"$f":"IF(AND(dates>=Début04, dates<=Fin_04,NOT(feries=\"F\")),\"C\",\"\")","v":""},{"$f":"IF(AND(dates>=Début04, dates<=Fin_04,NOT(feries=\"F\")),\"C\",\"\")","v":""},{"$f":"IF(AND(dates>=Début04, dates<=Fin_04,NOT(feries=\"F\")),\"C\",\"\")","v":""},{"$f":"IF(AND(dates>=Début04, dates<=Fin_04,NOT(feries=\"F\")),\"C\",\"\")","v":""},{"$f":"IF(AND(dates>=Début04, dates<=Fin_04,NOT(feries=\"F\")),\"C\",\"\")","v":""},{"$f":"IF(AND(dates>=Début04, dates<=Fin_04,NOT(feries=\"F\")),\"C\",\"\")","v":""},{"$f":"IF(AND(dates>=Début04, dates<=Fin_04,NOT(feries=\"F\")),\"C\",\"\")","v":""},{"$f":"IF(AND(dates>=Début04, dates<=Fin_04,NOT(feries=\"F\")),\"C\",\"\")","v":""},{"$f":"IF(AND(dates>=Début04, dates<=Fin_04,NOT(feries=\"F\")),\"C\",\"\")","v":""},{"$f":"IF(AND(dates>=Début04, dates<=Fin_04,NOT(feries=\"F\")),\"C\",\"\")","v":""},{"$f":"IF(AND(dates>=Début04, dates<=Fin_04,NOT(feries=\"F\")),\"C\",\"\")","v":""},{"$f":"IF(AND(dates>=Début04, dates<=Fin_04,NOT(feries=\"F\")),\"C\",\"\")","v":""},{"$f":"IF(AND(dates>=Début04, dates<=Fin_04,NOT(feries=\"F\")),\"C\",\"\")","v":""},{"$f":"IF(AND(dates>=Début04, dates<=Fin_04,NOT(feries=\"F\")),\"C\",\"\")","v":""},{"$f":"IF(AND(dates>=Début04, dates<=Fin_04,NOT(feries=\"F\")),\"C\",\"\")","v":""},{"$f":"IF(AND(dates>=Début04, dates<=Fin_04,NOT(feries=\"F\")),\"C\",\"\")","v":""},{"$f":"IF(AND(dates>=Début04, dates<=Fin_04,NOT(feries=\"F\")),\"C\",\"\")","v":""},{"$f":"IF(AND(dates>=Début04, dates<=Fin_04,NOT(feries=\"F\")),\"C\",\"\")","v":""},{"$f":"IF(AND(dates>=Début04, dates<=Fin_04,NOT(feries=\"F\")),\"C\",\"\")","v":""},{"$f":"IF(AND(dates>=Début04, dates<=Fin_04,NOT(feries=\"F\")),\"C\",\"\")","v":""},{"$f":"IF(AND(dates>=Début04, dates<=Fin_04,NOT(feries=\"F\")),\"C\",\"\")","v":""},{"$f":"IF(AND(dates>=Début04, dates<=Fin_04,NOT(feries=\"F\")),\"C\",\"\")","v":""},{"$f":"IF(AND(dates>=Début04, dates<=Fin_04,NOT(feries=\"F\")),\"C\",\"\")","v":""},{"$f":"IF(AND(dates>=Début04, dates<=Fin_04,NOT(feries=\"F\")),\"C\",\"\")","v":""},null,null,{"$f":"NETWORKDAYS(EI28,EJ28,'jours Féries 2016'!$B$1:$B$14)","v":0},{"$f":"COUNTIF(EM28:GD28,\"C\")","v":0},"","","","","","",{"$f":"IF(AND(dates>=Début01, dates<=Fin_01,NOT(feries=\"F\")),\"C\",\"\")","v":""},"","","","","","","","","","","","","","","","","","","","","","","","",null,"","","","","","","","","","","","","","","","","","","","","","","","","","","","","","","","","","","","","","","",{"$f":"IF(AND(dates>=Début01, dates<=Fin_01,NOT(feries=\"F\")),\"C\",\"\")","v":""},"","","","","","","","","","","","","","","","","","","","","","","","","","","","","","","","","","","","","","","","","","","","","","","","","","","","","","","","","","","","","","","","","","","","","","","","","","","","","","","","","","","","","","","","","","","","","","","","","","","","","","","","","","","","","","","","","","","","","","","","","","","","","","","","","","","","","","","","","","","","","","","","","","","","","","","","","","","","","","","","","","","","","","","","","","","","","",""]

{"sheet":"jours Féries 2016","index":2,"n_rows":13,"n_cols":2,"rows_kept":13,"cut":false,"hidden":false,"merged":[]}
["Jour de l'an","2016-01-01"]
["vendredi saint","2016-03-25"]
["Lundi de Pâques","2016-03-28"]
["Fete du travail","2016-05-01"]
["1945-05-08","2016-05-08"]
["Jeudi de l'Ascension","2016-05-05"]
["Lundi de Pentecôte","2016-05-16"]
["abolition esclavage","2016-05-22"]
["Fête Nationale","2016-07-14"]
["Assomption","2016-08-15"]
["La Toussaint","2016-11-01"]
["Armistice","2016-11-11"]
["Noel","2016-12-25"]