{"text_format":"1","workbook":"xlsx","n_sheets":4,"sheets":["MENU","INVENTAIRE","PERTE","RATIOS"],"not_rendered":{"charts":0,"images":3,"macros":1,"external_links":0,"defined_names":13,"comments":0,"pivot_tables":0},"unopened":[],"bounds":{"document_bytes":16777216,"sheet_cells":100000,"rows_first":2000,"rows_last":500,"rows_between":2000,"halvings":0,"cell_chars":16384,"cell_head_chars":4096},"cells_cut":0,"cells_raw":0,"read":"whole","date_system":"1900"}

{"sheet":"MENU","index":0,"n_rows":3,"n_cols":9,"rows_kept":3,"cut":false,"hidden":false,"merged":[[1,1,3,5],[0,8,0,10],[2,8,3,10]]}
[null,null,null,null,null,null,null,null,"Etablissement"]
[]
[null,null,null,null,null,null,null,null,"Kyriad Beaucouzé"]

{"sheet":"INVENTAIRE","index":1,"n_rows":975,"n_cols":19,"rows_kept":975,"cut":false,"hidden":false,"merged":[[973,7,973,9],[973,10,973,11],[967,7,967,9],[966,7,966,9],[972,10,972,11],[971,10,971,11],[970,10,970,11],[969,10,969,11],[968,10,968,11],[967,10,967,11],[966,10,966,11],[972,7,972,9],[971,7,971,9],[970,7,970,9],[969,7,969,9],[968,7,968,9],[970,3,974,6],[966,3,966,4],[967,3,967,4],[968,3,968,4],[969,3,969,4],[976,4,976,5],[0,27,0,30],[0,2,0,11],[1,18,3,18],[5,2,5,11],[1,5,2,6],[3,2,4,2],[3,3,4,3],[3,4,4,4],[3,7,4,7],[3,8,4,8],[3,9,4,9],[3,10,4,10],[3,11,4,11],[3,5,4,6],[974,7,974,11]]}
[null,null,"Feuille d'inventaire",null,null,null,null,null,null,null,null,null,null,null,null,null,null,null,"Passez votre commande"]
[null,null,null,null,null,"2016-05-01",null,null,null,null,null,null,null,null,null,null,null,null,"Cliquez ici pour exporter"]
[]
[null,null,"Code Store","Type\nde produit","Fournisseur","Désignation",null,"Unité Cde (colis)","Unité","Prix unitaire","Stock final","valorisation stock final"]
[null,null,null,null,null,null,null,null,null,null,null,null,null,null,null,null,null,null,{"$f":"SUM(S7:S965)","v":0}]
[null,null,"Petit-Déjeuner"]
[null,null,null,"Surgelé","Coup de Pates","Brioche Tressée",null,1,"pièce",null,null,{"$f":"J7*K7","v":0}]
[null,null,81837,"Frais","Brake France Services","Yaourt nature lait entier bio 100g / 1 carton = 6,5 €",null,24,"pièce",0.24082999999999999,null,{"$f":"J8*K8","v":0}]
[null,null,80605,"Frais","Brake France Services","Yaourt aux fruits Danone 125g / 1 carton = 12,9 €",null,48,"pièce",0.26874999999999999,null,0]
[null,null,81888,"Frais","Brake France Services","Yaourt Panier de fruits panaché Yoplait / 1 carton = 9,10 €",null,48,"pièce",0.189583,null,0]
[null,null,17173,"Frais","Brake France Services","Compote pomme allégée 100g / 1 carton = 11,40 €",null,72,"pièce",0.15833,null,0]
[null,null,82424,"Frais","Brake France Services","Emmental tranches 7,5*7,5 cm / 1 barquette = 3,90 €",null,15,"pièce",0.26,null,0]
[null,null,10950,"Frais","Brake France Services","Jambon cuit supérieur tranché / 1 barquette = 6,10 €",null,20,"pièce",0.30499999999999999,null,0]
[null,null,41053,"Frais","Brake France Services","Coppa sel sec de savoie tranché / 1 barquette = 2,90 €",null,25,"pièce",0.11600000000000001,null,0]
[null,null,80440,"Frais","Brake France Services","Œuf brouillé cuit / boite de 500g",null,1,"boîte",2.7370000000000001,null,0]
[null,null,null,null,null,null,null,null,null,null,null,0]
[null,null,80979,"Frais","Brake France Services","Beurre demi sel 10g / 1 carton = 6,10",null,100,"pièce",6.0999999999999999E-2,null,0]
[null,null,17190,"Buffet","Brake France Services","Confiture orange 30g / 1 carton = 9 €",null,40,"pièce",0.22500000000000001,null,0]
[null,null,17189,"Buffet","Brake France Services","Confiture framboise sans prépin 30g / 1 carton = 8,90 €",null,40,"pièce",0.2225,null,0]
[null,null,17188,"Buffet","Brake France Services","Confiture figues 30g / 1 carton = 9 €",null,40,"pièce",0.22500000000000001,null,0]
[null,null,17187,"Buffet","Brake France Services","Confiture cerise noire 30g / 1 carton = 8,90 €",null,40,"pièce",0.2225,null,0]
[null,null,16759,"Buffet","Brake France Services","Nutella 15g / 1 carton = 14,90 €",null,120,"pièce",0.1241666,null,0]
[null,null,17224,"Buffet","Brake France Services","Miel en coupelle 20g / 1 carton = 17,80 €",null,120,"pièce",0.14832999999999999,null,0]
[null,null,80014,"Frais","Brake France Services","Beurre doux 10g / 1 carton = 5,40 €",null,100,"pièce",5.3999999999999999E-2,null,0]
[null,null,48796,"Buffet","Brake France Services","Pain de mie 1,1 Kg / 1 sachet de 28 tranches = 2,90 €",null,28,"pièce",9.6014000000000002E-2,null,0]
[null,null,17263,"Buffet","Brake France Services","Biscotte salée x2  15g / 1 carton = 11,90 €",null,208,"pièce",5.7211150000000002E-2,null,0]
[null,null,17153,"Buffet","Brake Epicerie","Céréales spécial K 500g / carton de 8 boites = 25,20 €",null,8,"pièce",3.15,null,0]
[null,null,17152,"Buffet","Brake France Services","Céréales chocos 600g",null,1,"boîte",3.44,null,0]
[null,null,14157,"Buffet","Brake France Services","Céréales country store 2 kg",null,1,"sachet",9.76,null,0]
[null,null,17171,"Buffet","Brake Epicerie","Thé vert à la menthe / 6 boites soit 150 sachets = 11,90 €",null,150,"pièce",7.9333000000000001E-2,null,0]
[null,null,17305,"Buffet","Brake Epicerie","Thé Earl Grey / 6 boites soit 150 sachets = 11,90 €",null,150,"pièce",7.9333000000000001E-2,null,0]
[null,null,17170,"Buffet","Brake Epicerie","Thé fruits rouges / 6 boites soit 150 sachets = 11,90 €",null,150,"pièce",7.9333000000000001E-2,null,0]
[null,null,17167,"Buffet","Brake Epicerie","Thé English Breakfast / 6 boites soit 150 sachets = 11,90 €",null,150,"pièce",7.9333000000000001E-2,null,0]
[null,null,17168,"Buffet","Brake Epicerie","Thé Yellow Label / 6 boites soit 150 sachets = 11,90 €",null,150,"pièce",7.9333000000000001E-2,null,0]
[null,null,17306,"Buffet","Brake Epicerie","Thé Citron / 6 boites soit 150 sachets = 11,90 €",null,150,"pièce",7.9333000000000001E-2,null,0]
[null,null,17218,"Buffet","Brake France Services","Thé vert Kericho / 24 boites soit 600 sachets = 30,90 € (A VERIFIER)",null,600,"pièce",5.1499999999999997E-2,null,0]
[null,null,17302,"Buffet","Brake Epicerie","Infusion Verveine / 1 boîte = 6,30 €",null,100,"pièce",6.293E-2,null,0]
[null,null,17207,"Buffet","Brake France Services","Sucre en poudre buchete / 1 carton = 4,20 €",null,500,"pièce",8.3999999999999995E-3,null,0]
[null,null,17236,"Buffet","Brake Epicerie","Edulcorant dose en poudre / 1 carton = 5,80 €",null,500,"boîte",1.1599999999999999E-2,null,0]
[null,null,15425,"Office","Brake France Services","Film étirable 300 mètres x 45 cm",null,1,"pièce",10.246,null,0]
{"$rows_left_out":936}
{"sheet":"PERTE","index":2,"n_rows":73,"n_cols":51,"rows_kept":73,"cut":false,"hidden":false,"merged":[[0,11,0,13],[0,8,0,9]]}
[null,null,null,null,null,null,null,null,"Choisir le code Store en colonne C"]
[null,null," Saisie Code Store",null,null,null,null,null,"Mettre sur la feuille de perte","Produit",null,"Unité initiale",null,"Prix unitaire",null,null,null,null,"TOTAL PERTES","COUT TOTAL","Pertes du 1er","Pertes du 2","Pertes du 3","Pertes du 4","Pertes du 5","Pertes du 6","Pertes du 7","Pertes du 8","Pertes du 9","Pertes du 10","Pertes du 11","Pertes du 12","Pertes du 13","Pertes du 14","Pertes du 15","Pertes du 16","Pertes du 17","Pertes du 18","Pertes du 19","Pertes du 20","Pertes du 21","Pertes du 22","Pertes du 23","Pertes du 24","Pertes du 25","Pertes du 26","Pertes du 27","Pertes du 28","Pertes du 29","Pertes du 30","Pertes du 31"]
[null,null,"PETIT-DEJEUNER"]
[null,null,80605,null,null,null,null,null,"oui",{"$f":"IF(ISNA(VLOOKUP(C4,Petit_Déjeuner,4,0)),\" \",VLOOKUP(C4,Petit_Déjeuner,4,0))","v":"Yaourt aux fruits Danone 125g / 1 carton = 12,9 €"},null,{"$f":"IF(ISNA(VLOOKUP(C4,Petit_Déjeuner,7,0)),\" \",VLOOKUP(C4,Petit_Déjeuner,7,0))","v":"pièce"},null,{"$f":"IF(ISNA(VLOOKUP(C4,Petit_Déjeuner,8,0)),\" \",VLOOKUP(C4,Petit_Déjeuner,8,0))","v":0.26874999999999999},null,null,null,"oui",{"$f":"SUM(U4:AY4)","v":72},{"$f":"IF(ISERR(N4*S4),\" \",N4*S4)","v":19.349999999999998}," "," ",72," "," "," "," "," "," "," "," "," "," "," "," "," "," "," "," "," "," "," "," "," "," "," "," "," "," "," "," "]
[null,null," ",null,null,null,null,null,"oui",{"$f":"IF(ISNA(VLOOKUP(C5,Petit_Déjeuner,4,0)),\" \",VLOOKUP(C5,Petit_Déjeuner,4,0))","v":" "},null," ",null," ",null,null,null,"non",0,{"$f":"IF(ISERR(N5*S5),\" \",N5*S5)","v":" "}," "," "," "," "," "," "," "," "," "," "," "," "," "," "," "," "," "," "," "," "," "," "," "," "," "," "," "," "," "," "," "]
[null,null," ",null,null,null,null,null,"oui"," ",null," ",null," ",null,null,null,null,0," "," "," "," "," "," "," "," "," "," "," "," "," "," "," "," "," "," "," "," "," "," "," "," "," "," "," "," "," "," "," "," "]
[null,null," ",null,null,null,null,null,"oui"," ",null," ",null," ",null,null,null,null,0," "," "," "," "," "," "," "," "," "," "," "," "," "," "," "," "," "," "," "," "," "," "," "," "," "," "," "," "," "," "," "," "]
[null,null," ",null,null,null,null,null,"oui"," ",null," ",null," ",null,null,null,null,0," "," "," "," "," "," "," "," "," "," "," "," "," "," "," "," "," "," "," "," "," "," "," "," "," "," "," "," "," "," "," "," "]
[null,null," ",null,null,null,null,null,"oui"," ",null," ",null," ",null,null,null,null,0," "," "," "," "," "," "," "," "," "," "," "," "," "," "," "," "," "," "," "," "," "," "," "," "," "," "," "," "," "," "," "," "]
[null,null," ",null,null,null,null,null,"oui"," ",null," ",null," ",null,null,null,null,0," "," "," "," "," "," "," "," "," "," "," "," "," "," "," "," "," "," "," "," "," "," "," "," "," "," "," "," "," "," "," "," "]
[null,null," ",null,null,null,null,null,"oui"," ",null," ",null," ",null,null,null,null,0," "," "," "," "," "," "," "," "," "," "," "," "," "," "," "," "," "," "," "," "," "," "," "," "," "," "," "," "," "," "," "," "]
[null,null," ",null,null,null,null,null,"oui"," ",null," ",null," ",null,null,null,null,0," "," "," "," "," "," "," "," "," "," "," "," "," "," "," "," "," "," "," "," "," "," "," "," "," "," "," "," "," "," "," "," "]
[null,null," ",null,null,null,null,null,"oui"," ",null," ",null," ",null,null,null,null,0," "," "," "," "," "," "," "," "," "," "," "," "," "," "," "," "," "," "," "," "," "," "," "," "," "," "," "," "," "," "," "," "]
[null,null," ",null,null,null,null,null,"oui"," ",null," ",null," ",null,null,null,null,0," "," "," "," "," "," "," "," "," "," "," "," "," "," "," "," "," "," "," "," "," "," "," "," "," "," "," "," "," "," "," "," "]
[null,null," ",null,null,null,null,null,"oui"," ",null," ",null," ",null,null,null,null,0," "," "," "," "," "," "," "," "," "," "," "," "," "," "," "," "," "," "," "," "," "," "," "," "," "," "," "," "," "," "," "," "]
[null,null," ",null,null,null,null,null,"oui"," ",null," ",null," ",null,null,null,null,0," "," "," "," "," "," "," "," "," "," "," "," "," "," "," "," "," "," "," "," "," "," "," "," "," "," "," "," "," "," "," "," "]
[null,null," ",null,null,null,null,null,"oui"," ",null," ",null," ",null,null,null,null,0," "," "," "," "," "," "," "," "," "," "," "," "," "," "," "," "," "," "," "," "," "," "," "," "," "," "," "," "," "," "," "," "]
[null,null," ",null,null,null,null,null,"oui"," ",null," ",null," ",null,null,null,null,0," "," "," "," "," "," "," "," "," "," "," "," "," "," "," "," "," "," "," "," "," "," "," "," "," "," "," "," "," "," "," "," "]
[null,null," ",null,null,null,null,null,"oui"," ",null," ",null," ",null,null,null,null,0," "," "," "," "," "," "," "," "," "," "," "," "," "," "," "," "," "," "," "," "," "," "," "," "," "," "," "," "," "," "," "," "]
[null,null,"SEMINAIRE",null,null,null,null,null,null,null,null," ",null," ",null,null,null,null,null," ",1,2,3,4,5,6,7,8,9,10,11,12,13,14,15,16,17,18,19,20,21,22,23,24,25,26,27,28,29,30,31]
[null,null,15682,null,null,null,null,null,"oui",{"$f":"IF(ISNA(VLOOKUP(C21,SEminaire,4,0)),\" \",VLOOKUP(C21,SEminaire,4,0))","v":"Sous-main K Business / 1 lot = 226,223 €"},null,{"$f":"IF(ISNA(VLOOKUP(C21,SEminaire,7,0)),\" \",VLOOKUP(C21,SEminaire,7,0))","v":"pièce"},null,{"$f":"IF(ISNA(VLOOKUP(C21,SEminaire,8,0)),\" \",VLOOKUP(C21,SEminaire,8,0))","v":4.5244600000000004},null,null,null,null,3,13.57338,null,null,3]
[null,null,null,null,null,null,null,null,"oui"," ",null," ",null," ",null,null,null,null,0," "]
[null,null,null,null,null,null,null,null,"oui"," ",null," ",null," ",null,null,null,null,0," "]
[null,null,null,null,null,null,null,null,"oui"," ",null," ",null," ",null,null,null,null,0," "]
[null,null,null,null,null,null,null,null,"oui"," ",null," ",null," ",null,null,null,null,0," "]
[null,null,null,null,null,null,null,null,"oui"," ",null," ",null," ",null,null,null,null,0," "]
[null,null,null,null,null,null,null,null,"oui"," ",null," ",null," ",null,null,null,null,0," "]
[null,null,null,null,null,null,null,null,"oui"," ",null," ",null," ",null,null,null,null,0," "]
[null,null,null,null,null,null,null,null,"oui"," ",null," ",null," ",null,null,null,null,0," "]
[null,null,null,null,null,null,null,null,"oui"," ",null," ",null," ",null,null,null,null,0," "]
[null,null,null,null,null,null,null,null,"oui"," ",null," ",null," ",null,null,null,null,0," "]
[null,null,null,null,null,null,null,null,"oui"," ",null," ",null," ",null,null,null,null,0," "]
[null,null,null,null,null,null,null,null,"oui"," ",null," ",null," ",null,null,null,null,0," "]
[null,null,null,null,null,null,null,null,"oui"," ",null," ",null," ",null,null,null,null,0," "]
[null,null,null,null,null,null,null,null,"oui"," ",null," ",null," ",null,null,null,null,0," "]
[null,null,null,null,null,null,null,null,"oui"," ",null," ",null," ",null,null,null,null,{"$f":"SUM(U36:AY36)","v":0}," "]
[null,null,"BAR BOISSONS",null,null,null,null,null,null,null,null,{"$f":"IF(ISNA(VLOOKUP(C37,Petit_Déjeuner,7,0)),\" \",VLOOKUP(C37,Petit_Déjeuner,7,0))","v":" "},null,{"$f":"IF(ISNA(VLOOKUP(C37,Petit_Déjeuner,8,0)),\" \",VLOOKUP(C37,Petit_Déjeuner,8,0))","v":" "},null,null,null,null,null," ",1,2,3,4,5,6,7,8,9,10,11,12,13,14,15,16,17,18,19,20,21,22,23,24,25,26,27,28,29,30,31]
[null,null,null,null,null,null,null,null,"oui",{"$f":"IF(ISNA(VLOOKUP(C38,BARBOISSON,4,0)),\" \",VLOOKUP(C38,BARBOISSON,4,0))","v":" "},null,{"$f":"IF(ISNA(VLOOKUP(C38,BARBOISSON,7,0)),\" \",VLOOKUP(C38,BARBOISSON,7,0))","v":" "},null,{"$f":"IF(ISNA(VLOOKUP(C38,BARBOISSON,8,0)),\" \",VLOOKUP(C38,BARBOISSON,8,0))","v":" "},null,null,null,null,0," "]
[null,null,null,null,null,null,null,null,"oui"," ",null," ",null," ",null,null,null,null,0," "]
[null,null,null,null,null,null,null,null,"oui"," ",null," ",null," ",null,null,null,null,0," "]
{"$rows_left_out":34}
{"sheet":"RATIOS","index":3,"n_rows":73,"n_cols":51,"rows_kept":73,"cut":false,"hidden":false,"merged":[[12,1,12,4],[3,0,4,4],[3,6,4,8],[0,0,1,1],[0,2,1,6],[0,7,1,8]]}
["Etablissement de : Kyriad Beaucouzé",null,{"$f":"INVENTAIRE!F2","v":"2016-05-01"}]
[]
[]
["Calcul des ratios",null,null,null,null,null,"Détail des pertes saisies sur le mois",null,null,null,null,null,null,null,null,null,null,null,null,null," "," "," "," "," "," "," "," "," "," "," "," "," "," "," "," "," "," "," "," "," "," "," "," "," "," "," "," "," "," "," "]
[null,null,null,null,null,null,null,null,null,null,null,null,null,null,null,null,null,null,null,null," "," "," "," "," "," "," "," "," "," "," "," "," "," "," "," "," "," "," "," "," "," "," "," "," "," "," "," "," "," "," "]
[null,null," ",null,null,null,null,null,null,null,null,null,null,null,null,null,null,null,null,null," "," "," "," "," "," "," "," "," "," "," "," "," "," "," "," "," "," "," "," "," "," "," "," "," "," "," "," "," "," "," "]
[null,"PDJ","Séminaire","Bar Nourriture","Bar Boisson",null,null,"Coût","en % du CA",null,null,null,null,null,null,null,null,null,null,null," "," "," "," "," "," "," "," "," "," "," "," "," "," "," "," "," "," "," "," "," "," "," "," "," "," "," "," "," "," "," "]
["STOCK INITIAL",null," ",null,null,null,"Perte Bar Boisson",{"$f":"SUM(PERTE!T38:'PERTE'!T53)","v":0},{"$f":"IF(ISERR(H8/E11),\" \",H8/E11)","v":" "},null,null,null,null,null,null,null,null,null,null,null," "," "," "," "," "," "," "," "," "," "," "," "," "," "," "," "," "," "," "," "," "," "," "," "," "," "," "," "," "," "," "]
["Achats du mois HT",{"$f":"SUM(B16:B32)","v":0},{"$f":"SUM(C16:C32)","v":0},0,0,null,"Perte Bar Nourriture",{"$f":"SUM(PERTE!T55:'PERTE'!T73)","v":0},{"$f":"IF(ISERR(H9/D11),\" \",H9/D11)","v":" "},null,null,null,null,null,null,null,null,null,null,null," "," "," "," "," "," "," "," "," "," "," "," "," "," "," "," "," "," "," "," "," "," "," "," "," "," "," "," "," "," "," "]
["STOCK FINAL",{"$f":"SUM(INVENTAIRE!L7:L89)","v":0},{"$f":"SUM(INVENTAIRE!K91:K188)","v":0},{"$f":"SUM(INVENTAIRE!L190:L332)","v":0},{"$f":"SUM(INVENTAIRE!L334:L481)","v":0},null,"Perte Séminaire",{"$f":"SUM(PERTE!T21:'PERTE'!T36)","v":13.57338},{"$f":"IF(ISERR(H10/C11),\" \",H10/C11)","v":" "},null,null,null,null,null,null,null,null,null,null,null," "," "," "," "," "," "," "," "," "," "," "," "," "," "," "," "," "," "," "," "," "," "," "," "," "," "," "," "," "," "," "]
["CA HT du mois",null,null,null,null,null,"Perte PDJ",{"$f":"SUM(PERTE!T4:T19)","v":19.349999999999998},{"$f":"IF(ISERR(H11/B11),\" \",H11/B11)","v":" "},null,null,null,null,null,null,null,null,null,null,null," "," "," "," "," "," "," "," "," "," "," "," "," "," "," "," "," "," "," "," "," "," "," "," "," "," "," "," "," "," "," "]
["Ratio",{"$f":"IF(ISERR((B8-B10+B9)/B11),\" \",(B8-B10+B9)/B11)","v":" "}," ",{"$f":"IF(ISERR((D8-D10+D9)/D11),\" \",(D8-D10+D9)/D11)","v":" "}," ",null,"TOTAL",{"$f":"SUM(H8:H11)","v":32.923379999999995},{"$f":"IF(ISERR(H12/B13),\" \",H12/B13)","v":" "},null,null,null,null,null,null,null,null,null,null,null," "," "," "," "," "," "," "," "," "," "," "," "," "," "," "," "," "," "," "," "," "," "," "," "," "," "," "," "," "," "," "]
["TOTAL CA HT DU MOIS",{"$f":"SUM(B11:E11)","v":0},null,null,null,null,null,null,null,null,null,null,null,null,null,null,null,null,null,null," "," "," "," "," "," "," "," "," "," "," "," "," "," "," "," "," "," "," "," "," "," "," "," "," "," "," "," "," "," "," "]
[null,null," ",null,null,null,null,null,null,null,null,null,null,null,null,null,null,null,null,null," "," "," "," "," "," "," "," "," "," "," "," "," "," "," "," "," "," "," "," "," "," "," "," "," "," "," "," "," "," "," "]
["Journal des achats","PDJ","Séminaire","Bar Nourriture","Bar Boisson",null,"Top 10 des pertes","Coût en €",null,null,null,null,null,null,null,null,null,null,null,null," "," "," "," "," "," "," "," "," "," "," "," "," "," "," "," "," "," "," "," "," "," "," "," "," "," "," "," "," "," "," "]
["Brake France Services",null,null,null,null,null,{"$f":"VLOOKUP(H16,PERTE!J4:T73,1,0)","v":{"$error":"#N/A"}},{"$f":"IF(ISERR(LARGE((PERTE!T4:T73),1)),\" \",LARGE((PERTE!T4:T73),1))","v":19.349999999999998},null,null,null,null,null,null,null,null,null,null,null,null," "," "," "," "," "," "," "," "," "," "," "," "," "," "," "," "," "," "," "," "," "," "," "," "," "," "," "," "," "," "," "]
["Brake Epicerie",null,null,null,null,null,null,{"$f":"IF(ISERR(LARGE((PERTE!T4:T73),2)),\" \",LARGE((PERTE!T4:T73),2))","v":13.57338},null,null,null,null,null,null,null,null,null,null,null,null," "," "," "," "," "," "," "," "," "," "," "," "," "," "," "," "," "," "," "," "," "," "," "," "," "," "," "," "," "," "," "]
["Brake Non Alimentaire",null,null,null,null,null,null,{"$f":"IF(ISERR(LARGE((PERTE!T4:T73),3)),\" \",LARGE((PERTE!T4:T73),3))","v":" "},null,null,null,null,null,null,null,null,null,null,null,null," "," "," "," "," "," "," "," "," "," "," "," "," "," "," "," "," "," "," "," "," "," "," "," "," "," "," "," "," "," "," "]
["Boulangerie",null,null,null,null,null,null,{"$f":"IF(ISERR(LARGE((PERTE!T4:T73),4)),\" \",LARGE((PERTE!T4:T73),4))","v":" "},null,null,null,null,null,null,null,null,null,null,null,null," "," "," "," "," "," "," "," "," "," "," "," "," "," "," "," "," "," "," "," "," "," "," "," "," "," "," "," "," "," "," "]
["Fruits frais"]
["Métro",null,null,null,null,null,null,{"$f":"IF(ISERR(LARGE((PERTE!T4:T73),6)),\" \",LARGE((PERTE!T4:T73),6))","v":" "},null,null,null,null,null,null,null,null,null,null,null,null," "," "," "," "," "," "," "," "," "," "," "," "," "," "," "," "," "," "," "," "," "," "," "," "," "," "," "," "," "," "," "]
["Coup de Pates",null,null,null,null,null,null,{"$f":"IF(ISERR(LARGE((PERTE!T4:T73),7)),\" \",LARGE((PERTE!T4:T73),7))","v":" "},null,null,null,null,null,null,null,null,null,null,null,null," "," "," "," "," "," "," "," "," "," "," "," "," "," "," "," "," "," "," "," "," "," "," "," "," "," "," "," "," "," "," "]
["Belle de Maine",null,null,null,null,null,null,{"$f":"IF(ISERR(LARGE((PERTE!T4:T73),8)),\" \",LARGE((PERTE!T4:T73),8))","v":" "},null,null,null,null,null,null,null,null,null,null,null,null," "," "," "," "," "," "," "," "," "," "," "," "," "," "," "," "," "," "," "," "," "," "," "," "," "," "," "," "," "," "," "]
["Giffard",null,null,null,null,null,null,{"$f":"IF(ISERR(LARGE((PERTE!T4:T73),9)),\" \",LARGE((PERTE!T4:T73),9))","v":" "},null,null,null,null,null,null,null,null,null,null,null,null," "," "," "," "," "," "," "," "," "," "," "," "," "," "," "," "," "," "," "," "," "," "," "," "," "," "," "," "," "," "," "]
["V&B",null,null,null,null,null,null,{"$f":"IF(ISERR(LARGE((PERTE!T4:T73),10)),\" \",LARGE((PERTE!T4:T73),10))","v":" "},null,null,null,null,null,null,null,null,null,null,null,null," "," "," "," "," "," "," "," "," "," "," "," "," "," "," "," "," "," "," "," "," "," "," "," "," "," "," "," "," "," "," "]
["Gaïté",null,null,null,null,null,null,null,null,null,null,null,null,null,null,null,null,null,null,null," "," "," "," "," "," "," "," "," "," "," "," "," "," "," "," "," "," "," "," "," "," "," "," "," "," "," "," "," "," "," "]
["Nespresso",null,null,null,null,null,null,null,null,null,null,null,null,null,null,null,null,null,null,null," "," "," "," "," "," "," "," "," "," "," "," "," "," "," "," "," "," "," "," "," "," "," "," "," "," "," "," "," "," "," "]
["Autres",null,null,null,null,null,null,null,null,null,null,null,null,null,null,null,null,null,null,null," "," "," "," "," "," "," "," "," "," "," "," "," "," "," "," "," "," "," "," "," "," "," "," "," "," "," "," "," "," "," "]
["Délice de Molière",null,null,null,null,null,null,null,null,null,null,null,null,null,null,null,null,null,null,null," "," "," "," "," "," "," "," "," "," "," "," "," "," "," "," "," "," "," "," "," "," "," "," "," "," "," "," "," "," "," "]
[null,null,null,null,null,null,null,null,null,null,null,null,null,null,null,null,null,null,null,null," "," "," "," "," "," "," "," "," "," "," "," "," "," "," "," "," "," "," "," "," "," "," "," "," "," "," "," "," "," "," "]
[null,null,null,null,null,null,null,null,null,null,null,null,null,null,null,null,null,null,null,null," "," "," "," "," "," "," "," "," "," "," "," "," "," "," "," "," "," "," "," "," "," "," "," "," "," "," "," "," "," "," "]
[null,null,null,null,null,null,null,null,null,null,null,null,null,null,null,null,null,null,null,null," "," "," "," "," "," "," "," "," "," "," "," "," "," "," "," "," "," "," "," "," "," "," "," "," "," "," "," "," "," "," "]
[null,null," ",null,null,null,null,null,null,null,null,null,null,null,null,null,null,null,null,null," "," "," "," "," "," "," "," "," "," "," "," "," "," "," "," "," "," "," "," "," "," "," "," "," "," "," "," "," "," "," "]
[null,null," ",null,null,null,null,null,null,null,null,null,null,null,null,null,null,null,null,null," "," "," "," "," "," "," "," "," "," "," "," "," "," "," "," "," "," "," "," "," "," "," "," "," "," "," "," "," "," "," "]
[null,null," ",null,null,null,null,null,null,null,null,null,null,null,null,null,null,null,null,null," "," "," "," "," "," "," "," "," "," "," "," "," "," "," "," "," "," "," "," "," "," "," "," "," "," "," "," "," "," "," "]
[null,null," ",null,null,null,null,null,null,null,null,null,null,null,null,null,null,null,null,null," "," "," "," "," "," "," "," "," "," "," "," "," "," "," "," "," "," "," "," "," "," "," "," "," "," "," "," "," "," "," "]
[]
[null,null," ",null,null,null,null,null,null,null,null,null,null,null,null,null,null,null,null,null," "," "," "," "," "," "," "," "," "," "," "," "," "," "," "," "," "," "," "," "," "," "," "," "," "," "," "," "," "," "," "]
[null,null," ",null,null,null,null,null,null,null,null,null,null,null,null,null,null,null,null,null," "," "," "," "," "," "," "," "," "," "," "," "," "," "," "," "," "," "," "," "," "," "," "," "," "," "," "," "," "," "," "]
[null,null," ",null,null,null,null,null,null,null,null,null,null,null,null,null,null,null,null,null," "," "," "," "," "," "," "," "," "," "," "," "," "," "," "," "," "," "," "," "," "," "," "," "," "," "," "," "," "," "," "]
{"$rows_left_out":33}