{"text_format":"1","workbook":"xlsx","n_sheets":3,"sheets":["Exemple","Demande","Feuil3"],"not_rendered":{"charts":0,"images":0,"macros":1,"external_links":1,"defined_names":1,"comments":0,"pivot_tables":0},"unopened":[],"bounds":{"document_bytes":16777216,"sheet_cells":100000,"rows_first":2000,"rows_last":500,"rows_between":2000,"halvings":0,"cell_chars":16384,"cell_head_chars":4096},"cells_cut":0,"cells_raw":0,"read":"whole","date_system":"1900"}

{"sheet":"Exemple","index":0,"n_rows":11,"n_cols":31,"rows_kept":11,"cut":false,"hidden":false,"merged":[]}
[]
[]
[]
["Ltg-Nr.","Ref (wires)","Position (left or right)","Steckerkurzname","Steckerkurzname","section","5SE31015AF001","5SE31015AF002","5SE31015AF003","5SE31015AF004","5SE31015AF005","5SE31015AF006","5SE31015AF007","5SE31015AF008","5SE31015AF009","5SE31015AF010","5SE31015AF011","5SE31015AF012","5SE31015AF013","5SE31015AF014","5SE31015AF015","5SE31015AF016","5SE31015AF017","5SE31015AF018","5SE31015AF019","5SE31015AF020","5SE31015AF021","5SE31015AF022","5SE31015AF023","5SE31015AF024"]
[994001,"3SE0290430285",{"$f":"VLOOKUP(A5,[1]Schweißliste!$B:$H,7,0)","v":"L"},"KS_2TRKMR","SN_15AF",0.35,null,null,null,null,null,null,null,null,null,"x","x","x","x","x","x","x","x","x",null,null,"x","x","x","x",994001]
[707041,"3SE0270730017",{"$f":"VLOOKUP(A6,[1]Schweißliste!$B:$H,7,0)","v":"L"},"SN_15AF","SC_RLS",0.5,"x",null,null,"x",null,null,"x",null,null,"x",null,null,"x",null,null,"x",null,null,null,null,"x",null,null,null,707041]
[707071,"3SE0270730025",{"$f":"VLOOKUP(A7,[1]Schweißliste!$B:$H,7,0)","v":"L"},"SN_15AF","SC_RLS_1",0.5,null,"x",null,null,"x",null,null,"x",null,null,"x",null,null,"x",null,null,"x",null,null,null,null,"x",null,null,707071]
[707141,"3SE0270730049",{"$f":"VLOOKUP(A8,[1]Schweißliste!$B:$H,7,0)","v":"L"},"SN_15AF","SC_RLS_2",0.5,null,null,"x",null,null,"x",null,null,"x",null,null,"x",null,null,"x",null,null,"x",null,null,null,null,"x",null,707141]
[786043,"3SE0278630010",{"$f":"VLOOKUP(A9,[1]Schweißliste!$B:$H,7,0)","v":"R"},"SN_15AF","SC_KDS",0.35,"x","x","x","x","x","x","x","x","x","x","x","x","x","x","x","x","x","x","x","x",null,null,null,"x",786043]
[786051,"3SE0278630011",{"$f":"VLOOKUP(A10,[1]Schweißliste!$B:$H,7,0)","v":"R"},"S_LGS","SN_15AF",0.5,null,null,null,"x","x","x",null,null,null,null,null,null,"x","x","x",null,null,null,"x",null,null,null,null,"x",786051]
[786061,"3SE0278630015",{"$f":"VLOOKUP(A11,[1]Schweißliste!$B:$H,7,0)","v":"R"},"SN_15AF","S_LGS_1",0.5,null,null,null,null,null,null,"x","x","x",null,null,null,null,null,null,"x","x","x",null,"x",null,null,null,null,786061]

{"sheet":"Demande","index":1,"n_rows":3,"n_cols":5,"rows_kept":3,"cut":false,"hidden":false,"merged":[]}
[]
[]
["Ref SP","Position (left or right)","section","Ref (wires)","Ltg-Nr."]

{"sheet":"Feuil3","index":2,"n_rows":0,"n_cols":0,"rows_kept":0,"cut":false,"hidden":false,"merged":[]}