{"text_format":"1","workbook":"xlsx","n_sheets":8,"sheets":["ClientCommande","CommandeJour","CommandeFacturation","Liste des produits","Liste des clients","ClientsProduits","Ref","Instructions"],"not_rendered":{"charts":0,"images":0,"macros":1,"external_links":1,"defined_names":5,"comments":0,"pivot_tables":0},"unopened":[],"bounds":{"document_bytes":16777216,"sheet_cells":100000,"rows_first":2000,"rows_last":500,"rows_between":2000,"halvings":0,"cell_chars":16384,"cell_head_chars":4096},"cells_cut":0,"cells_raw":0,"read":"whole","date_system":"1900"}

{"sheet":"ClientCommande","index":0,"n_rows":44,"n_cols":8,"rows_kept":44,"cut":false,"hidden":false,"merged":[]}
[null,null,null,null,"Commande standard"]
[]
[null,null,null,null,"Client","12 - f"]
[]
[null,null,null,null,"Date du jour",{"$f":"TODAY()","v":"2016-06-03"}]
[null,null,null,null,"Jour de livraison","2016-06-04"]
[]
[null,null,null,null,{"$f":"COUNTIF(ClientsProduits!$B$1:$B$423,$F$3)","v":5}]
[]
["Heure","No & nom Client","Date du jour","Jour de livraison","No item Std","Code et nom produit","Quantité","Commentaire"]
[{"$f":"NOW()","v":42524.518741550928},{"$f":"$F$3","v":"12 - f"},{"$f":"$F$5","v":"2016-06-03"},{"$f":"$F$6","v":"2016-06-04"},1,{"$f":"IF($E11<=$E$8,OFFSET(ClientsProduits!$B$1,MATCH($F$3,ClientsProduits!$B$1:$B$423,0)-1,2,1,1),\"\")","v":"5000 - Baguette levain (unité) (280 gr.)"},55,"test"]
[{"$f":"NOW()","v":42524.518741550928},{"$f":"$F$3","v":"12 - f"},{"$f":"$F$5","v":"2016-06-03"},{"$f":"$F$6","v":"2016-06-04"},2,{"$f":"IF($E12<=$E$8,OFFSET(ClientsProduits!$B$1,MATCH($F$3,ClientsProduits!$B$1:$B$423,0),2,1,1),\"\")","v":"4202 - Pain banique tranché  (unité) (500 gr.)"},55,1]
[42524.518741550928,"12 - f","2016-06-03","2016-06-04",3,{"$f":"IF($E13<=$E$8,OFFSET(ClientsProduits!$B$1,MATCH($F$3,ClientsProduits!$B$1:$B$423,0)+1,2,1,1),\"\")","v":"4203 - Pain banique non tranché (unité) (500 gr.)"},55,"test"]
[42524.518741550928,"12 - f","2016-06-03","2016-06-04",4,{"$f":"IF($E14<=$E$8,OFFSET(ClientsProduits!$B$1,MATCH($F$3,ClientsProduits!$B$1:$B$423,0)+2,2,1,1),\"\")","v":"6000 - Baguette levain (x 25) (280 gr.)"},55,"sdg"]
[42524.518741550928,"12 - f","2016-06-03","2016-06-04",5,{"$f":"IF($E15<=$E$8,OFFSET(ClientsProduits!$B$1,MATCH($F$3,ClientsProduits!$B$1:$B$423,0)+3,2,1,1),\"\")","v":"5201 - Grosse miche non tranchée (unité) (600 gr.)"},55,"sdg"]
{"$rows_left_out":30}
{"sheet":"CommandeJour","index":1,"n_rows":6,"n_cols":8,"rows_kept":6,"cut":false,"hidden":false,"merged":[]}
[]
[]
[]
[]
[]
["Heure","NoNomClient","Date de commande","Date de livraison","No item","Code et nom produit","Quantité","Commentaire"]

{"sheet":"CommandeFacturation","index":2,"n_rows":110,"n_cols":22,"rows_kept":110,"cut":false,"hidden":false,"merged":[]}
[]
[]
[]
[]
[]
["Heure","NoNomClient","Date de commande","Date de livraison","No item","Code et nom produit","Quantité","Commentaire","Catégorie","No client","Adresse livraison","Contact","Téléphone","Ordre livraison","Heure2","NoNomClient3","Date de commande4","Date de livraison5","No item6","Code et nom produit7","Quantité8","Commentaire9"]
[42524.516706249997,"12 - f","2016-06-03","2016-06-04",1,"5000 - Baguette levain (unité) (280 gr.)",55,"test",{"$f":"VLOOKUP(CommandeFacturation[[#This Row],[Code et nom produit]],Produits[[Code et nom produit]:[Catégorie]],3,FALSE)","v":"Frais"},{"$f":"VLOOKUP(CommandeFacturation[[#This Row],[NoNomClient]],Clients[[#All],[No et nom client]:[No client2]],2,FALSE)","v":12},{"$f":"VLOOKUP(CommandeFacturation[[#This Row],[No client]],Clients[[#All],[No Client]:[Téléphone]],4,FALSE)","v":0},{"$f":"VLOOKUP(CommandeFacturation[[#This Row],[No client]],Clients[[#All],[No Client]:[Téléphone]],3,FALSE)","v":0},{"$f":"VLOOKUP(CommandeFacturation[[#This Row],[No client]],Clients[[#All],[No Client]:[Téléphone]],7,FALSE)","v":"418 694-1030"},{"$f":"VLOOKUP(CommandeFacturation[[#This Row],[No client]],Clients[#All],10,FALSE)","v":0},42523.640241550929,"1 - Archibald - Lac-Beauport","2016-06-02","2016-06-04",1,"6000 - Baguette levain (x 25) (280 gr.)",56]
[42524.516706249997,"12 - f","2016-06-03","2016-06-04",2,"4202 - Pain banique tranché  (unité) (500 gr.)",55,1,{"$f":"VLOOKUP(CommandeFacturation[[#This Row],[Code et nom produit]],Produits[[Code et nom produit]:[Catégorie]],3,FALSE)","v":"Fait"},{"$f":"VLOOKUP(CommandeFacturation[[#This Row],[NoNomClient]],Clients[[#All],[No et nom client]:[No client2]],2,FALSE)","v":12},{"$f":"VLOOKUP(CommandeFacturation[[#This Row],[No client]],Clients[[#All],[No Client]:[Téléphone]],4,FALSE)","v":0},{"$f":"VLOOKUP(CommandeFacturation[[#This Row],[No client]],Clients[[#All],[No Client]:[Téléphone]],3,FALSE)","v":0},{"$f":"VLOOKUP(CommandeFacturation[[#This Row],[No client]],Clients[[#All],[No Client]:[Téléphone]],7,FALSE)","v":"418 694-1030"},{"$f":"VLOOKUP(CommandeFacturation[[#This Row],[No client]],Clients[#All],10,FALSE)","v":0},42523.640241550929,"1 - Archibald - Lac-Beauport","2016-06-02","2016-06-04",2,"2000 - Burger brioché nature (x 12) (65 gr.)",56]
[42524.516706249997,"12 - f","2016-06-03","2016-06-04",3,"4203 - Pain banique non tranché (unité) (500 gr.)",55,"test",{"$f":"VLOOKUP(CommandeFacturation[[#This Row],[Code et nom produit]],Produits[[Code et nom produit]:[Catégorie]],3,FALSE)","v":"Fait"},{"$f":"VLOOKUP(CommandeFacturation[[#This Row],[NoNomClient]],Clients[[#All],[No et nom client]:[No client2]],2,FALSE)","v":12},{"$f":"VLOOKUP(CommandeFacturation[[#This Row],[No client]],Clients[[#All],[No Client]:[Téléphone]],4,FALSE)","v":0},{"$f":"VLOOKUP(CommandeFacturation[[#This Row],[No client]],Clients[[#All],[No Client]:[Téléphone]],3,FALSE)","v":0},{"$f":"VLOOKUP(CommandeFacturation[[#This Row],[No client]],Clients[[#All],[No Client]:[Téléphone]],7,FALSE)","v":"418 694-1030"},{"$f":"VLOOKUP(CommandeFacturation[[#This Row],[No client]],Clients[#All],10,FALSE)","v":0},42523.640241550929,"1 - Archibald - Lac-Beauport","2016-06-02","2016-06-04",3,"4006 - Pain ménage graines autrichiennes tranché large  (unité) (90",56]
[42524.516706249997,"12 - f","2016-06-03","2016-06-04",4,"6000 - Baguette levain (x 25) (280 gr.)",55,"sdg",{"$f":"VLOOKUP(CommandeFacturation[[#This Row],[Code et nom produit]],Produits[[Code et nom produit]:[Catégorie]],3,FALSE)","v":"Congelé"},{"$f":"VLOOKUP(CommandeFacturation[[#This Row],[NoNomClient]],Clients[[#All],[No et nom client]:[No client2]],2,FALSE)","v":12},{"$f":"VLOOKUP(CommandeFacturation[[#This Row],[No client]],Clients[[#All],[No Client]:[Téléphone]],4,FALSE)","v":0},{"$f":"VLOOKUP(CommandeFacturation[[#This Row],[No client]],Clients[[#All],[No Client]:[Téléphone]],3,FALSE)","v":0},{"$f":"VLOOKUP(CommandeFacturation[[#This Row],[No client]],Clients[[#All],[No Client]:[Téléphone]],7,FALSE)","v":"418 694-1030"},{"$f":"VLOOKUP(CommandeFacturation[[#This Row],[No client]],Clients[#All],10,FALSE)","v":0},42523.639316319444,"1 - Archibald - Lac-Beauport","2016-06-02","2016-06-04",1,"6000 - Baguette levain (x 25) (280 gr.)",55]
[42524.516706249997,"12 - f","2016-06-03","2016-06-04",5,"5201 - Grosse miche non tranchée (unité) (600 gr.)",55,"sdg",{"$f":"VLOOKUP(CommandeFacturation[[#This Row],[Code et nom produit]],Produits[[Code et nom produit]:[Catégorie]],3,FALSE)","v":"Frais"},{"$f":"VLOOKUP(CommandeFacturation[[#This Row],[NoNomClient]],Clients[[#All],[No et nom client]:[No client2]],2,FALSE)","v":12},{"$f":"VLOOKUP(CommandeFacturation[[#This Row],[No client]],Clients[[#All],[No Client]:[Téléphone]],4,FALSE)","v":0},{"$f":"VLOOKUP(CommandeFacturation[[#This Row],[No client]],Clients[[#All],[No Client]:[Téléphone]],3,FALSE)","v":0},{"$f":"VLOOKUP(CommandeFacturation[[#This Row],[No client]],Clients[[#All],[No Client]:[Téléphone]],7,FALSE)","v":"418 694-1030"},{"$f":"VLOOKUP(CommandeFacturation[[#This Row],[No client]],Clients[#All],10,FALSE)","v":0},42524.479912152776,"10 - Casa Grecque - Sainte-Foy","2016-06-03","2016-06-04",1,"3500 - Baguette de blé Casa (unité) (400 gr.)",23]
[42524.500536342595,"12 - f","2016-06-03","2016-06-04",5,"5201 - Grosse miche non tranchée (unité) (600 gr.)",2,null,{"$f":"VLOOKUP(CommandeFacturation[[#This Row],[Code et nom produit]],Produits[[Code et nom produit]:[Catégorie]],3,FALSE)","v":"Frais"},{"$f":"VLOOKUP(CommandeFacturation[[#This Row],[NoNomClient]],Clients[[#All],[No et nom client]:[No client2]],2,FALSE)","v":12},{"$f":"VLOOKUP(CommandeFacturation[[#This Row],[No client]],Clients[[#All],[No Client]:[Téléphone]],4,FALSE)","v":0},{"$f":"VLOOKUP(CommandeFacturation[[#This Row],[No client]],Clients[[#All],[No Client]:[Téléphone]],3,FALSE)","v":0},{"$f":"VLOOKUP(CommandeFacturation[[#This Row],[No client]],Clients[[#All],[No Client]:[Téléphone]],7,FALSE)","v":"418 694-1030"},{"$f":"VLOOKUP(CommandeFacturation[[#This Row],[No client]],Clients[#All],10,FALSE)","v":0},42524.480209490743,"10 - Casa Grecque - Sainte-Foy","2016-06-03","2016-06-06",1,"3500 - Baguette de blé Casa (unité) (400 gr.)",23]
[null,null,null,null,null,null,null,null,{"$f":"VLOOKUP(CommandeFacturation[[#This Row],[Code et nom produit]],Produits[[Code et nom produit]:[Catégorie]],3,FALSE)","v":{"$error":"#N/A"}},{"$f":"VLOOKUP(CommandeFacturation[[#This Row],[NoNomClient]],Clients[[#All],[No et nom client]:[No client2]],2,FALSE)","v":{"$error":"#N/A"}},{"$f":"VLOOKUP(CommandeFacturation[[#This Row],[No client]],Clients[[#All],[No Client]:[Téléphone]],4,FALSE)","v":{"$error":"#N/A"}},{"$f":"VLOOKUP(CommandeFacturation[[#This Row],[No client]],Clients[[#All],[No Client]:[Téléphone]],3,FALSE)","v":{"$error":"#N/A"}},{"$f":"VLOOKUP(CommandeFacturation[[#This Row],[No client]],Clients[[#All],[No Client]:[Téléphone]],7,FALSE)","v":{"$error":"#N/A"}},{"$f":"VLOOKUP(CommandeFacturation[[#This Row],[No client]],Clients[#All],10,FALSE)","v":{"$error":"#N/A"}},42524.477647800923,"10 - Casa Grecque - Sainte-Foy","2016-06-03","2016-06-04",1,"3500 - Baguette de blé Casa (unité) (400 gr.)",22]
[null,null,null,null,null,null,null,null,{"$f":"VLOOKUP(CommandeFacturation[[#This Row],[Code et nom produit]],Produits[[Code et nom produit]:[Catégorie]],3,FALSE)","v":{"$error":"#N/A"}},{"$f":"VLOOKUP(CommandeFacturation[[#This Row],[NoNomClient]],Clients[[#All],[No et nom client]:[No client2]],2,FALSE)","v":{"$error":"#N/A"}},{"$f":"VLOOKUP(CommandeFacturation[[#This Row],[No client]],Clients[[#All],[No Client]:[Téléphone]],4,FALSE)","v":{"$error":"#N/A"}},{"$f":"VLOOKUP(CommandeFacturation[[#This Row],[No client]],Clients[[#All],[No Client]:[Téléphone]],3,FALSE)","v":{"$error":"#N/A"}},{"$f":"VLOOKUP(CommandeFacturation[[#This Row],[No client]],Clients[[#All],[No Client]:[Téléphone]],7,FALSE)","v":{"$error":"#N/A"}},{"$f":"VLOOKUP(CommandeFacturation[[#This Row],[No client]],Clients[#All],10,FALSE)","v":{"$error":"#N/A"}},42524.480064467592,"10 - Casa Grecque - Sainte-Foy","2016-06-03","2016-06-05",1,"3500 - Baguette de blé Casa (unité) (400 gr.)",22]
[null,null,null,null,null,null,null,null,{"$f":"VLOOKUP(CommandeFacturation[[#This Row],[Code et nom produit]],Produits[[Code et nom produit]:[Catégorie]],3,FALSE)","v":{"$error":"#N/A"}},{"$f":"VLOOKUP(CommandeFacturation[[#This Row],[NoNomClient]],Clients[[#All],[No et nom client]:[No client2]],2,FALSE)","v":{"$error":"#N/A"}},{"$f":"VLOOKUP(CommandeFacturation[[#This Row],[No client]],Clients[[#All],[No Client]:[Téléphone]],4,FALSE)","v":{"$error":"#N/A"}},{"$f":"VLOOKUP(CommandeFacturation[[#This Row],[No client]],Clients[[#All],[No Client]:[Téléphone]],3,FALSE)","v":{"$error":"#N/A"}},{"$f":"VLOOKUP(CommandeFacturation[[#This Row],[No client]],Clients[[#All],[No Client]:[Téléphone]],7,FALSE)","v":{"$error":"#N/A"}},{"$f":"VLOOKUP(CommandeFacturation[[#This Row],[No client]],Clients[#All],10,FALSE)","v":{"$error":"#N/A"}},42524.473952430555,"1 - Archibald - Lac-Beauport","2016-06-03","2016-06-04",1,"6000 - Baguette levain (x 25) (280 gr.)",5]
{"$rows_left_out":96}
{"sheet":"Liste des produits","index":3,"n_rows":183,"n_cols":6,"rows_kept":183,"cut":false,"hidden":false,"merged":[]}
["Code Produit","Nom Produit","Unités","Code et nom produit","Code Produit2","Catégorie"]
[1000,"Croissant (unité) (90 gr.)",1,{"$f":"CONCATENATE(Produits[[#This Row],[Code Produit]],\" - \",Produits[[#This Row],[Nom Produit]])","v":"1000 - Croissant (unité) (90 gr.)"},{"$f":"Produits[[#This Row],[Code Produit]]","v":1000},"Frais"]
[1001,"Chocolatine (unité) (100 gr.)",1,{"$f":"CONCATENATE(Produits[[#This Row],[Code Produit]],\" - \",Produits[[#This Row],[Nom Produit]])","v":"1001 - Chocolatine (unité) (100 gr.)"},{"$f":"Produits[[#This Row],[Code Produit]]","v":1001},"Frais"]
[1002,"Danoise (unité) (130 gr.)",1,{"$f":"CONCATENATE(Produits[[#This Row],[Code Produit]],\" - \",Produits[[#This Row],[Nom Produit]])","v":"1002 - Danoise (unité) (130 gr.)"},{"$f":"Produits[[#This Row],[Code Produit]]","v":1002},"Frais"]
[1003,"Carré feuilleté (x 12) (70 gr.)",12,{"$f":"CONCATENATE(Produits[[#This Row],[Code Produit]],\" - \",Produits[[#This Row],[Nom Produit]])","v":"1003 - Carré feuilleté (x 12) (70 gr.)"},{"$f":"Produits[[#This Row],[Code Produit]]","v":1003},"Frais"]
[1004,"Croissant Jambon-Fromage (unité) (145 gr.)",1,{"$f":"CONCATENATE(Produits[[#This Row],[Code Produit]],\" - \",Produits[[#This Row],[Nom Produit]])","v":"1004 - Croissant Jambon-Fromage (unité) (145 gr.)"},{"$f":"Produits[[#This Row],[Code Produit]]","v":1004},"Frais"]
[1100,"Mini-chocolatine (x 12) (30 gr.)",12,{"$f":"CONCATENATE(Produits[[#This Row],[Code Produit]],\" - \",Produits[[#This Row],[Nom Produit]])","v":"1100 - Mini-chocolatine (x 12) (30 gr.)"},{"$f":"Produits[[#This Row],[Code Produit]]","v":1100},"Frais"]
[1101,"Mini-croissant (x 12) (30 gr.)",12,{"$f":"CONCATENATE(Produits[[#This Row],[Code Produit]],\" - \",Produits[[#This Row],[Nom Produit]])","v":"1101 - Mini-croissant (x 12) (30 gr.)"},{"$f":"Produits[[#This Row],[Code Produit]]","v":1101},"Frais"]
[1102,"Mini-danoise (x 12) (30 gr.)",12,{"$f":"CONCATENATE(Produits[[#This Row],[Code Produit]],\" - \",Produits[[#This Row],[Nom Produit]])","v":"1102 - Mini-danoise (x 12) (30 gr.)"},{"$f":"Produits[[#This Row],[Code Produit]]","v":1102},"Frais"]
[1103,"Mini-feuilleté (x 12) (30 gr.)",12,{"$f":"CONCATENATE(Produits[[#This Row],[Code Produit]],\" - \",Produits[[#This Row],[Nom Produit]])","v":"1103 - Mini-feuilleté (x 12) (30 gr.)"},{"$f":"Produits[[#This Row],[Code Produit]]","v":1103},"Frais"]
[1200,"Brioche vendéenne (unité) (45 gr.)",1,{"$f":"CONCATENATE(Produits[[#This Row],[Code Produit]],\" - \",Produits[[#This Row],[Nom Produit]])","v":"1200 - Brioche vendéenne (unité) (45 gr.)"},{"$f":"Produits[[#This Row],[Code Produit]]","v":1200},"Frais"]
[1201,"Chausson aux pommes (unité) (145 gr.)",1,{"$f":"CONCATENATE(Produits[[#This Row],[Code Produit]],\" - \",Produits[[#This Row],[Nom Produit]])","v":"1201 - Chausson aux pommes (unité) (145 gr.)"},{"$f":"Produits[[#This Row],[Code Produit]]","v":1201},"Frais"]
[1202,"Palmier (unité) (65 gr.)",1,{"$f":"CONCATENATE(Produits[[#This Row],[Code Produit]],\" - \",Produits[[#This Row],[Nom Produit]])","v":"1202 - Palmier (unité) (65 gr.)"},{"$f":"Produits[[#This Row],[Code Produit]]","v":1202},"Frais"]
[1203,"Amandine (unité) (160 gr.)",1,{"$f":"CONCATENATE(Produits[[#This Row],[Code Produit]],\" - \",Produits[[#This Row],[Nom Produit]])","v":"1203 - Amandine (unité) (160 gr.)"},{"$f":"Produits[[#This Row],[Code Produit]]","v":1203},"Réfrigéré"]
[1204,"Pain brioché Victor (x 12) (60 gr.)",12,{"$f":"CONCATENATE(Produits[[#This Row],[Code Produit]],\" - \",Produits[[#This Row],[Nom Produit]])","v":"1204 - Pain brioché Victor (x 12) (60 gr.)"},{"$f":"Produits[[#This Row],[Code Produit]]","v":1204},"Réfrigéré"]
{"$rows_left_out":169}
{"sheet":"Liste des clients","index":4,"n_rows":133,"n_cols":11,"rows_kept":133,"cut":false,"hidden":false,"merged":[]}
["No Client","Nom du client","Personne ressource","Adresse","Ville","Code postal","Téléphone","No et nom client","No client2","Ordre de livraison","Client à téléphoner"]
[null,null,null,null,null,null,null,"Sélectionner un client",{"$f":"Clients[[#This Row],[No Client]]","v":0}]
[1,"a",null,null,"Lac-Beauport, Québec","G3B 0X1","418 841-2224",{"$f":"CONCATENATE(Clients[[#This Row],[No Client]],\" - \",Clients[[#This Row],[Nom du client]])","v":"1 - a"},{"$f":"Clients[[#This Row],[No Client]]","v":1}]
[2,"b",null,null,"Québec, Québec","G2G 2B5","418 877-0123",{"$f":"CONCATENATE(Clients[[#This Row],[No Client]],\" - \",Clients[[#This Row],[Nom du client]])","v":"2 - b"},{"$f":"Clients[[#This Row],[No Client]]","v":2}]
[5,"c",null,null,"Québec, Québec","G1V 2V5","418 527-9111",{"$f":"CONCATENATE(Clients[[#This Row],[No Client]],\" - \",Clients[[#This Row],[Nom du client]])","v":"5 - c"},{"$f":"Clients[[#This Row],[No Client]]","v":5},null,"oui"]
[6,"d",null,null,"Québec, Québec","G1R 4L7","418 692-1430",{"$f":"CONCATENATE(Clients[[#This Row],[No Client]],\" - \",Clients[[#This Row],[Nom du client]])","v":"6 - d"},{"$f":"Clients[[#This Row],[No Client]]","v":6}]
[10,"e",null,null,"Québec, Québec","G1X 3V2","418 656-6151",{"$f":"CONCATENATE(Clients[[#This Row],[No Client]],\" - \",Clients[[#This Row],[Nom du client]])","v":"10 - e"},{"$f":"Clients[[#This Row],[No Client]]","v":10}]
[12,"f",null,null,"Québec, Québec","G1R 4H8","418 694-1030",{"$f":"CONCATENATE(Clients[[#This Row],[No Client]],\" - \",Clients[[#This Row],[Nom du client]])","v":"12 - f"},{"$f":"Clients[[#This Row],[No Client]]","v":12},null,"oui"]
[13,"g",null,null,"Québec, Québec","G1R 2K4","418 640-0606",{"$f":"CONCATENATE(Clients[[#This Row],[No Client]],\" - \",Clients[[#This Row],[Nom du client]])","v":"13 - g"},{"$f":"Clients[[#This Row],[No Client]]","v":13}]
[14,"h",null,null,"Lévis, Québec","G6V 0B2","418 830-8888",{"$f":"CONCATENATE(Clients[[#This Row],[No Client]],\" - \",Clients[[#This Row],[Nom du client]])","v":"14 - h"},{"$f":"Clients[[#This Row],[No Client]]","v":14}]
[15,"i",null,null,"Québec, Québec","G1V 2L9","418 652-2001",{"$f":"CONCATENATE(Clients[[#This Row],[No Client]],\" - \",Clients[[#This Row],[Nom du client]])","v":"15 - i"},{"$f":"Clients[[#This Row],[No Client]]","v":15},null,"oui"]
[16,"j",null,null,"Québec, Québec","G1C 5R9","418 667-7311",{"$f":"CONCATENATE(Clients[[#This Row],[No Client]],\" - \",Clients[[#This Row],[Nom du client]])","v":"16 - j"},{"$f":"Clients[[#This Row],[No Client]]","v":16}]
[18,"a",null,null,"Lévis, Québec","G6V 8V6","418 835-6668",{"$f":"CONCATENATE(Clients[[#This Row],[No Client]],\" - \",Clients[[#This Row],[Nom du client]])","v":"18 - a"},{"$f":"Clients[[#This Row],[No Client]]","v":18}]
[19,"b",null,null,"Québec, Québec","G2E 5G3","418 871-7070",{"$f":"CONCATENATE(Clients[[#This Row],[No Client]],\" - \",Clients[[#This Row],[Nom du client]])","v":"19 - b"},{"$f":"Clients[[#This Row],[No Client]]","v":19}]
[20,"c",null,null,"Lévis, Québec","G6W 1G2","418 831-5551",{"$f":"CONCATENATE(Clients[[#This Row],[No Client]],\" - \",Clients[[#This Row],[Nom du client]])","v":"20 - c"},{"$f":"Clients[[#This Row],[No Client]]","v":20}]
{"$rows_left_out":119}
{"sheet":"ClientsProduits","index":5,"n_rows":423,"n_cols":6,"rows_kept":423,"cut":false,"hidden":false,"merged":[]}
["No Client","No et nom client","Code Produit","Code et nom produit","CodeClPr","Quantité"]
[1,{"$f":"VLOOKUP(A2,Clients[],8,FALSE)","v":"1 - a"},6000,{"$f":"VLOOKUP(C2,Produits[],4,FALSE)","v":"6000 - Baguette levain (x 25) (280 gr.)"},{"$f":"CONCATENATE(A2,\"-\",C2)","v":"1-6000"}]
[1,{"$f":"VLOOKUP(A3,Clients[],8,FALSE)","v":"1 - a"},2000,{"$f":"VLOOKUP(C3,Produits[],4,FALSE)","v":"2000 - Burger brioché nature (x 12) (65 gr.)"},"1-2000"]
[1,{"$f":"VLOOKUP(A4,Clients[],8,FALSE)","v":"1 - a"},4006,{"$f":"VLOOKUP(C4,Produits[],4,FALSE)","v":"4006 - Pain ménage graines autrichiennes tranché large  (unité) (90"},"1-4006"]
[2,{"$f":"VLOOKUP(A5,Clients[],8,FALSE)","v":"2 - b"},6000,{"$f":"VLOOKUP(C5,Produits[],4,FALSE)","v":"6000 - Baguette levain (x 25) (280 gr.)"},"2-6000"]
[2,{"$f":"VLOOKUP(A6,Clients[],8,FALSE)","v":"2 - b"},2000,{"$f":"VLOOKUP(C6,Produits[],4,FALSE)","v":"2000 - Burger brioché nature (x 12) (65 gr.)"},"2-2000"]
[2,{"$f":"VLOOKUP(A7,Clients[],8,FALSE)","v":"2 - b"},4006,{"$f":"VLOOKUP(C7,Produits[],4,FALSE)","v":"4006 - Pain ménage graines autrichiennes tranché large  (unité) (90"},"2-4006"]
[2,{"$f":"VLOOKUP(A8,Clients[],8,FALSE)","v":"2 - b"},5207,{"$f":"VLOOKUP(C8,Produits[],4,FALSE)","v":"5207 - Miche bol à soupe (unité) ( 200 gr.)"},"2-5207"]
[5,{"$f":"VLOOKUP(A9,Clients[],8,FALSE)","v":"5 - c"},2007,{"$f":"VLOOKUP(C9,Produits[],4,FALSE)","v":"2007 - Burger pavot (x 12) (65 gr.)"},"5-2007"]
[5,{"$f":"VLOOKUP(A10,Clients[],8,FALSE)","v":"5 - c"},2101,{"$f":"VLOOKUP(C10,Produits[],4,FALSE)","v":"2101 - Mini-burger pavot (x 24) (35 gr.)"},"5-2101"]
[5,{"$f":"VLOOKUP(A11,Clients[],8,FALSE)","v":"5 - c"},4101,{"$f":"VLOOKUP(C11,Produits[],4,FALSE)","v":"4101 - Petit belge blé tranché (unité) (500 gr.)"},"5-4101"]
[6,{"$f":"VLOOKUP(A12,Clients[],8,FALSE)","v":"6 - d"},5000,{"$f":"VLOOKUP(C12,Produits[],4,FALSE)","v":"5000 - Baguette levain (unité) (280 gr.)"},"6-5000"]
[6,{"$f":"VLOOKUP(A13,Clients[],8,FALSE)","v":"6 - d"},6000,{"$f":"VLOOKUP(C13,Produits[],4,FALSE)","v":"6000 - Baguette levain (x 25) (280 gr.)"},"6-6000"]
[6,{"$f":"VLOOKUP(A14,Clients[],8,FALSE)","v":"6 - d"},4204,{"$f":"VLOOKUP(C14,Produits[],4,FALSE)","v":"4204 - Pain brioché tranché (unité) (500 gr.)"},"6-4204"]
[10,{"$f":"VLOOKUP(A15,Clients[],8,FALSE)","v":"10 - e"},3500,{"$f":"VLOOKUP(C15,Produits[],4,FALSE)","v":"3500 - Baguette de blé Casa (unité) (400 gr.)"},"10-3500"]
{"$rows_left_out":409}
{"sheet":"Ref","index":6,"n_rows":12,"n_cols":3,"rows_kept":12,"cut":false,"hidden":false,"merged":[]}
["Date"]
[{"$f":"TODAY()","v":"2016-06-03"}]
[{"$f":"A2+1","v":"2016-06-04"}]
[{"$f":"A2+2","v":"2016-06-05"}]
[{"$f":"A2+3","v":"2016-06-06"},null,"Attention pour la mise èa jour client pour que les ifnormations suivent"]
[{"$f":"A2+4","v":"2016-06-07"}]
[{"$f":"A2+5","v":"2016-06-08"},null,"Épurer la liste déroulante de date de commande pour pas avoir les semaines précédentes"]
[{"$f":"A2+6","v":"2016-06-09"},null,"Avoir procédure dans un onglet"]
[null,null,"Pouvoir imprimer sa liste de commande vierge au cas qu'il y ait un bug"]
[null,null,"Pour voir modifier une commande du jour si le client rappelle"]
[null,null,"Ajouter l'heure de la prise de commande "]
[null,null,"Exemple quand Rochebelle appelle après 12h, ça va dans la run de 8h30, avatn ça va dans la run de 5h30"]

{"sheet":"Instructions","index":7,"n_rows":21,"n_cols":1,"rows_kept":21,"cut":false,"hidden":false,"merged":[]}
["Instructions"]
[]
[]
[]
[]
[]
[]
[]
[]
[]
[]
[]
["Clients-produits"]
[]
["Ajout de produit - client existant"]
{"$rows_left_out":6}