{"text_format":"1","workbook":"xlsx","n_sheets":3,"sheets":["Feuil1","Feuil2","Feuil3"],"not_rendered":{"charts":0,"images":0,"macros":0,"external_links":0,"defined_names":1,"comments":0,"pivot_tables":0},"unopened":[],"bounds":{"document_bytes":16777216,"sheet_cells":100000,"rows_first":2000,"rows_last":500,"rows_between":2000,"halvings":0,"cell_chars":16384,"cell_head_chars":4096},"cells_cut":0,"cells_raw":0,"read":"whole","date_system":"1900"}

{"sheet":"Feuil1","index":0,"n_rows":367,"n_cols":4,"rows_kept":367,"cut":false,"hidden":false,"merged":[]}
["Année","2016-2017"]
["Juillet",{"$f":"\"S \"&IF(INT(DATE(1904,1,1))=0,INT(MOD(INT((D2+1460)/7)+0.6,52+5/28))+1,INT(MOD(INT((D2-2)/7)+0.6,52+5/28))+1)","v":"S 26"},{"$f":"TEXT(D2,\"jjjj\")","v":"vendredi"},{"$f":"DATE(LEFT(B1,4),7,1)","v":"2016-07-01"}]
[{"$f":"IF(MONTH(D3)=MONTH(D2),\"\",TEXT(D3,\"mmmm\"))","v":""},{"$f":"\"S \"&IF(INT(DATE(1904,1,1))=0,INT(MOD(INT((D3+1460)/7)+0.6,52+5/28))+1,INT(MOD(INT((D3-2)/7)+0.6,52+5/28))+1)","v":"S 26"},{"$f":"TEXT(D3,\"jjjj\")","v":"samedi"},{"$f":"D2+1","v":"2016-07-02"}]
[{"$f":"IF(MONTH(D4)=MONTH(D3),\"\",TEXT(D4,\"mmmm\"))","v":""},"S 26","dimanche",{"$f":"D3+1","v":"2016-07-03"}]
["","S 27","lundi","2016-07-04"]
["","S 27","mardi","2016-07-05"]
["","S 27","mercredi","2016-07-06"]
["","S 27","jeudi","2016-07-07"]
["","S 27","vendredi","2016-07-08"]
["","S 27","samedi","2016-07-09"]
["","S 27","dimanche","2016-07-10"]
["","S 28","lundi","2016-07-11"]
["","S 28","mardi","2016-07-12"]
["","S 28","mercredi","2016-07-13"]
["","S 28","jeudi","2016-07-14"]
["","S 28","vendredi","2016-07-15"]
["","S 28","samedi","2016-07-16"]
["","S 28","dimanche","2016-07-17"]
["","S 29","lundi","2016-07-18"]
["","S 29","mardi","2016-07-19"]
["","S 29","mercredi","2016-07-20"]
["","S 29","jeudi","2016-07-21"]
["","S 29","vendredi","2016-07-22"]
["","S 29","samedi","2016-07-23"]
["","S 29","dimanche","2016-07-24"]
["","S 30","lundi","2016-07-25"]
["","S 30","mardi","2016-07-26"]
["","S 30","mercredi","2016-07-27"]
["","S 30","jeudi","2016-07-28"]
["","S 30","vendredi","2016-07-29"]
["","S 30","samedi","2016-07-30"]
["","S 30","dimanche","2016-07-31"]
["août","S 31","lundi","2016-08-01"]
["","S 31","mardi","2016-08-02"]
["","S 31","mercredi","2016-08-03"]
["","S 31","jeudi","2016-08-04"]
["","S 31","vendredi","2016-08-05"]
["","S 31","samedi","2016-08-06"]
["","S 31","dimanche","2016-08-07"]
["","S 32","lundi","2016-08-08"]
["","S 32","mardi","2016-08-09"]
["","S 32","mercredi","2016-08-10"]
["","S 32","jeudi","2016-08-11"]
["","S 32","vendredi","2016-08-12"]
["","S 32","samedi","2016-08-13"]
["","S 32","dimanche","2016-08-14"]
["","S 33","lundi","2016-08-15"]
["","S 33","mardi","2016-08-16"]
["","S 33","mercredi","2016-08-17"]
["","S 33","jeudi","2016-08-18"]
["","S 33","vendredi","2016-08-19"]
["","S 33","samedi","2016-08-20"]
["","S 33","dimanche","2016-08-21"]
["","S 34","lundi","2016-08-22"]
["","S 34","mardi","2016-08-23"]
["","S 34","mercredi","2016-08-24"]
["","S 34","jeudi","2016-08-25"]
["","S 34","vendredi","2016-08-26"]
["","S 34","samedi","2016-08-27"]
["","S 34","dimanche","2016-08-28"]
["","S 35","lundi","2016-08-29"]
["","S 35","mardi","2016-08-30"]
["","S 35","mercredi","2016-08-31"]
["septembre","S 35","jeudi","2016-09-01"]
["","S 35","vendredi","2016-09-02"]
["","S 35","samedi","2016-09-03"]
["",{"$f":"\"S \"&IF(INT(DATE(1904,1,1))=0,INT(MOD(INT((D67+1460)/7)+0.6,52+5/28))+1,INT(MOD(INT((D67-2)/7)+0.6,52+5/28))+1)","v":"S 35"},{"$f":"TEXT(D67,\"jjjj\")","v":"dimanche"},"2016-09-04"]
[{"$f":"IF(MONTH(D68)=MONTH(D67),\"\",TEXT(D68,\"mmmm\"))","v":""},"S 36","lundi",{"$f":"D67+1","v":"2016-09-05"}]
["","S 36","mardi","2016-09-06"]
["","S 36","mercredi","2016-09-07"]
["","S 36","jeudi","2016-09-08"]
["","S 36","vendredi","2016-09-09"]
["","S 36","samedi","2016-09-10"]
["","S 36","dimanche","2016-09-11"]
["","S 37","lundi","2016-09-12"]
["","S 37","mardi","2016-09-13"]
["","S 37","mercredi","2016-09-14"]
["","S 37","jeudi","2016-09-15"]
["","S 37","vendredi","2016-09-16"]
["","S 37","samedi","2016-09-17"]
["","S 37","dimanche","2016-09-18"]
["","S 38","lundi","2016-09-19"]
["","S 38","mardi","2016-09-20"]
["","S 38","mercredi","2016-09-21"]
["","S 38","jeudi","2016-09-22"]
["","S 38","vendredi","2016-09-23"]
["","S 38","samedi","2016-09-24"]
["","S 38","dimanche","2016-09-25"]
["","S 39","lundi","2016-09-26"]
["","S 39","mardi","2016-09-27"]
["","S 39","mercredi","2016-09-28"]
["","S 39","jeudi","2016-09-29"]
["","S 39","vendredi","2016-09-30"]
["octobre","S 39","samedi","2016-10-01"]
["","S 39","dimanche","2016-10-02"]
["","S 40","lundi","2016-10-03"]
["","S 40","mardi","2016-10-04"]
["","S 40","mercredi","2016-10-05"]
["","S 40","jeudi","2016-10-06"]
["","S 40","vendredi","2016-10-07"]
["","S 40","samedi","2016-10-08"]
["","S 40","dimanche","2016-10-09"]
["","S 41","lundi","2016-10-10"]
["","S 41","mardi","2016-10-11"]
["","S 41","mercredi","2016-10-12"]
["","S 41","jeudi","2016-10-13"]
["","S 41","vendredi","2016-10-14"]
["","S 41","samedi","2016-10-15"]
["","S 41","dimanche","2016-10-16"]
["","S 42","lundi","2016-10-17"]
["","S 42","mardi","2016-10-18"]
["","S 42","mercredi","2016-10-19"]
["","S 42","jeudi","2016-10-20"]
["","S 42","vendredi","2016-10-21"]
["","S 42","samedi","2016-10-22"]
["","S 42","dimanche","2016-10-23"]
["","S 43","lundi","2016-10-24"]
["","S 43","mardi","2016-10-25"]
["","S 43","mercredi","2016-10-26"]
["","S 43","jeudi","2016-10-27"]
["","S 43","vendredi","2016-10-28"]
["","S 43","samedi","2016-10-29"]
["","S 43","dimanche","2016-10-30"]
["","S 44","lundi","2016-10-31"]
["novembre","S 44","mardi","2016-11-01"]
["","S 44","mercredi","2016-11-02"]
["","S 44","jeudi","2016-11-03"]
["","S 44","vendredi","2016-11-04"]
["","S 44","samedi","2016-11-05"]
["","S 44","dimanche","2016-11-06"]
["",{"$f":"\"S \"&IF(INT(DATE(1904,1,1))=0,INT(MOD(INT((D131+1460)/7)+0.6,52+5/28))+1,INT(MOD(INT((D131-2)/7)+0.6,52+5/28))+1)","v":"S 45"},{"$f":"TEXT(D131,\"jjjj\")","v":"lundi"},"2016-11-07"]
[{"$f":"IF(MONTH(D132)=MONTH(D131),\"\",TEXT(D132,\"mmmm\"))","v":""},"S 45","mardi",{"$f":"D131+1","v":"2016-11-08"}]
["","S 45","mercredi","2016-11-09"]
["","S 45","jeudi","2016-11-10"]
["","S 45","vendredi","2016-11-11"]
["","S 45","samedi","2016-11-12"]
["","S 45","dimanche","2016-11-13"]
["","S 46","lundi","2016-11-14"]
["","S 46","mardi","2016-11-15"]
["","S 46","mercredi","2016-11-16"]
["","S 46","jeudi","2016-11-17"]
["","S 46","vendredi","2016-11-18"]
["","S 46","samedi","2016-11-19"]
["","S 46","dimanche","2016-11-20"]
["","S 47","lundi","2016-11-21"]
["","S 47","mardi","2016-11-22"]
["","S 47","mercredi","2016-11-23"]
["","S 47","jeudi","2016-11-24"]
["","S 47","vendredi","2016-11-25"]
["","S 47","samedi","2016-11-26"]
["","S 47","dimanche","2016-11-27"]
["","S 48","lundi","2016-11-28"]
["","S 48","mardi","2016-11-29"]
["","S 48","mercredi","2016-11-30"]
["décembre","S 48","jeudi","2016-12-01"]
["","S 48","vendredi","2016-12-02"]
["","S 48","samedi","2016-12-03"]
["","S 48","dimanche","2016-12-04"]
["","S 49","lundi","2016-12-05"]
["","S 49","mardi","2016-12-06"]
["","S 49","mercredi","2016-12-07"]
["","S 49","jeudi","2016-12-08"]
["","S 49","vendredi","2016-12-09"]
["","S 49","samedi","2016-12-10"]
["","S 49","dimanche","2016-12-11"]
["","S 50","lundi","2016-12-12"]
["","S 50","mardi","2016-12-13"]
["","S 50","mercredi","2016-12-14"]
["","S 50","jeudi","2016-12-15"]
["","S 50","vendredi","2016-12-16"]
["","S 50","samedi","2016-12-17"]
["","S 50","dimanche","2016-12-18"]
["","S 51","lundi","2016-12-19"]
["","S 51","mardi","2016-12-20"]
["","S 51","mercredi","2016-12-21"]
["","S 51","jeudi","2016-12-22"]
["","S 51","vendredi","2016-12-23"]
["","S 51","samedi","2016-12-24"]
[{"$f":"IF(MONTH(D179)=MONTH(D178),\"\",TEXT(D179,\"mmmm\"))","v":""},"S 51","dimanche","2016-12-25"]
[{"$f":"IF(MONTH(D180)=MONTH(D179),\"\",TEXT(D180,\"mmmm\"))","v":""},"S 52","lundi","2016-12-26"]
["","S 52","mardi","2016-12-27"]
["","S 52","mercredi","2016-12-28"]
["","S 52","jeudi","2016-12-29"]
["","S 52","vendredi","2016-12-30"]
["","S 52","samedi","2016-12-31"]
["janvier","S 52","dimanche","2017-01-01"]
["","S 1","lundi","2017-01-02"]
["","S 1","mardi","2017-01-03"]
["","S 1","mercredi","2017-01-04"]
[{"$f":"IF(MONTH(D190)=MONTH(D189),\"\",TEXT(D190,\"mmmm\"))","v":""},"S 1","jeudi","2017-01-05"]
[{"$f":"IF(MONTH(D191)=MONTH(D190),\"\",TEXT(D191,\"mmmm\"))","v":""},"S 1","vendredi","2017-01-06"]
["","S 1","samedi","2017-01-07"]
["","S 1","dimanche","2017-01-08"]
["","S 2","lundi","2017-01-09"]
["",{"$f":"\"S \"&IF(INT(DATE(1904,1,1))=0,INT(MOD(INT((D195+1460)/7)+0.6,52+5/28))+1,INT(MOD(INT((D195-2)/7)+0.6,52+5/28))+1)","v":"S 2"},{"$f":"TEXT(D195,\"jjjj\")","v":"mardi"},"2017-01-10"]
["","S 2","mercredi",{"$f":"D195+1","v":"2017-01-11"}]
["","S 2","jeudi","2017-01-12"]
["","S 2","vendredi","2017-01-13"]
["","S 2","samedi","2017-01-14"]
["","S 2","dimanche","2017-01-15"]
["","S 3","lundi","2017-01-16"]
["","S 3","mardi","2017-01-17"]
["","S 3","mercredi","2017-01-18"]
["","S 3","jeudi","2017-01-19"]
["","S 3","vendredi","2017-01-20"]
["","S 3","samedi","2017-01-21"]
["","S 3","dimanche","2017-01-22"]
["","S 4","lundi","2017-01-23"]
["","S 4","mardi","2017-01-24"]
["","S 4","mercredi","2017-01-25"]
["","S 4","jeudi","2017-01-26"]
["","S 4","vendredi","2017-01-27"]
["","S 4","samedi","2017-01-28"]
["","S 4","dimanche","2017-01-29"]
["","S 5","lundi","2017-01-30"]
["","S 5","mardi","2017-01-31"]
["février","S 5","mercredi","2017-02-01"]
["","S 5","jeudi","2017-02-02"]
["","S 5","vendredi","2017-02-03"]
["","S 5","samedi","2017-02-04"]
["","S 5","dimanche","2017-02-05"]
["","S 6","lundi","2017-02-06"]
["","S 6","mardi","2017-02-07"]
["","S 6","mercredi","2017-02-08"]
["","S 6","jeudi","2017-02-09"]
["","S 6","vendredi","2017-02-10"]
["","S 6","samedi","2017-02-11"]
["","S 6","dimanche","2017-02-12"]
["","S 7","lundi","2017-02-13"]
["","S 7","mardi","2017-02-14"]
["","S 7","mercredi","2017-02-15"]
["","S 7","jeudi","2017-02-16"]
["","S 7","vendredi","2017-02-17"]
["","S 7","samedi","2017-02-18"]
["","S 7","dimanche","2017-02-19"]
["","S 8","lundi","2017-02-20"]
["","S 8","mardi","2017-02-21"]
["","S 8","mercredi","2017-02-22"]
["","S 8","jeudi","2017-02-23"]
["","S 8","vendredi","2017-02-24"]
["","S 8","samedi","2017-02-25"]
["","S 8","dimanche","2017-02-26"]
["","S 9","lundi","2017-02-27"]
["","S 9","mardi","2017-02-28"]
["mars","S 9","mercredi","2017-03-01"]
["","S 9","jeudi","2017-03-02"]
["","S 9","vendredi","2017-03-03"]
["","S 9","samedi","2017-03-04"]
["","S 9","dimanche","2017-03-05"]
["","S 10","lundi","2017-03-06"]
["","S 10","mardi","2017-03-07"]
["","S 10","mercredi","2017-03-08"]
["","S 10","jeudi","2017-03-09"]
["","S 10","vendredi","2017-03-10"]
[{"$f":"IF(MONTH(D255)=MONTH(D254),\"\",TEXT(D255,\"mmmm\"))","v":""},"S 10","samedi","2017-03-11"]
["","S 10","dimanche","2017-03-12"]
["","S 11","lundi","2017-03-13"]
["","S 11","mardi","2017-03-14"]
["",{"$f":"\"S \"&IF(INT(DATE(1904,1,1))=0,INT(MOD(INT((D259+1460)/7)+0.6,52+5/28))+1,INT(MOD(INT((D259-2)/7)+0.6,52+5/28))+1)","v":"S 11"},{"$f":"TEXT(D259,\"jjjj\")","v":"mercredi"},"2017-03-15"]
["","S 11","jeudi",{"$f":"D259+1","v":"2017-03-16"}]
["","S 11","vendredi","2017-03-17"]
["","S 11","samedi","2017-03-18"]
["","S 11","dimanche","2017-03-19"]
["","S 12","lundi","2017-03-20"]
["","S 12","mardi","2017-03-21"]
["","S 12","mercredi","2017-03-22"]
["","S 12","jeudi","2017-03-23"]
["","S 12","vendredi","2017-03-24"]
["","S 12","samedi","2017-03-25"]
["","S 12","dimanche","2017-03-26"]
["","S 13","lundi","2017-03-27"]
["","S 13","mardi","2017-03-28"]
["","S 13","mercredi","2017-03-29"]
["","S 13","jeudi","2017-03-30"]
["","S 13","vendredi","2017-03-31"]
["avril","S 13","samedi","2017-04-01"]
["","S 13","dimanche","2017-04-02"]
["","S 14","lundi","2017-04-03"]
["","S 14","mardi","2017-04-04"]
["","S 14","mercredi","2017-04-05"]
["","S 14","jeudi","2017-04-06"]
["","S 14","vendredi","2017-04-07"]
["","S 14","samedi","2017-04-08"]
["","S 14","dimanche","2017-04-09"]
["","S 15","lundi","2017-04-10"]
["","S 15","mardi","2017-04-11"]
["","S 15","mercredi","2017-04-12"]
["","S 15","jeudi","2017-04-13"]
["","S 15","vendredi","2017-04-14"]
["","S 15","samedi","2017-04-15"]
["","S 15","dimanche","2017-04-16"]
["","S 16","lundi","2017-04-17"]
["","S 16","mardi","2017-04-18"]
["","S 16","mercredi","2017-04-19"]
["","S 16","jeudi","2017-04-20"]
["","S 16","vendredi","2017-04-21"]
["","S 16","samedi","2017-04-22"]
["","S 16","dimanche","2017-04-23"]
["","S 17","lundi","2017-04-24"]
["","S 17","mardi","2017-04-25"]
["","S 17","mercredi","2017-04-26"]
["","S 17","jeudi","2017-04-27"]
["","S 17","vendredi","2017-04-28"]
["","S 17","samedi","2017-04-29"]
["","S 17","dimanche","2017-04-30"]
["mai","S 18","lundi","2017-05-01"]
["","S 18","mardi","2017-05-02"]
["","S 18","mercredi","2017-05-03"]
["","S 18","jeudi","2017-05-04"]
["","S 18","vendredi","2017-05-05"]
["","S 18","samedi","2017-05-06"]
["","S 18","dimanche","2017-05-07"]
["","S 19","lundi","2017-05-08"]
["","S 19","mardi","2017-05-09"]
["","S 19","mercredi","2017-05-10"]
["","S 19","jeudi","2017-05-11"]
["","S 19","vendredi","2017-05-12"]
["","S 19","samedi","2017-05-13"]
[{"$f":"IF(MONTH(D319)=MONTH(D318),\"\",TEXT(D319,\"mmmm\"))","v":""},"S 19","dimanche","2017-05-14"]
["","S 20","lundi","2017-05-15"]
["","S 20","mardi","2017-05-16"]
["","S 20","mercredi","2017-05-17"]
["",{"$f":"\"S \"&IF(INT(DATE(1904,1,1))=0,INT(MOD(INT((D323+1460)/7)+0.6,52+5/28))+1,INT(MOD(INT((D323-2)/7)+0.6,52+5/28))+1)","v":"S 20"},{"$f":"TEXT(D323,\"jjjj\")","v":"jeudi"},"2017-05-18"]
["","S 20","vendredi",{"$f":"D323+1","v":"2017-05-19"}]
["","S 20","samedi","2017-05-20"]
["","S 20","dimanche","2017-05-21"]
["","S 21","lundi","2017-05-22"]
["","S 21","mardi","2017-05-23"]
["","S 21","mercredi","2017-05-24"]
["","S 21","jeudi","2017-05-25"]
["","S 21","vendredi","2017-05-26"]
["","S 21","samedi","2017-05-27"]
["","S 21","dimanche","2017-05-28"]
["","S 22","lundi","2017-05-29"]
["","S 22","mardi","2017-05-30"]
["","S 22","mercredi","2017-05-31"]
["juin","S 22","jeudi","2017-06-01"]
["","S 22","vendredi","2017-06-02"]
["","S 22","samedi","2017-06-03"]
["","S 22","dimanche","2017-06-04"]
["","S 23","lundi","2017-06-05"]
["","S 23","mardi","2017-06-06"]
["","S 23","mercredi","2017-06-07"]
["","S 23","jeudi","2017-06-08"]
["","S 23","vendredi","2017-06-09"]
["","S 23","samedi","2017-06-10"]
["","S 23","dimanche","2017-06-11"]
["","S 24","lundi","2017-06-12"]
["","S 24","mardi","2017-06-13"]
["","S 24","mercredi","2017-06-14"]
["","S 24","jeudi","2017-06-15"]
["","S 24","vendredi","2017-06-16"]
["","S 24","samedi","2017-06-17"]
["","S 24","dimanche","2017-06-18"]
["","S 25","lundi","2017-06-19"]
["","S 25","mardi","2017-06-20"]
["","S 25","mercredi","2017-06-21"]
["","S 25","jeudi","2017-06-22"]
["","S 25","vendredi","2017-06-23"]
["","S 25","samedi","2017-06-24"]
["","S 25","dimanche","2017-06-25"]
["","S 26","lundi","2017-06-26"]
["","S 26","mardi","2017-06-27"]
["","S 26","mercredi","2017-06-28"]
["","S 26","jeudi","2017-06-29"]
[{"$f":"IF(MONTH(D366)=MONTH(D365),\"\",TEXT(D366,\"mmmm\"))","v":""},"S 26","vendredi","2017-06-30"]
[null,null,null,"2017-07-01"]

{"sheet":"Feuil2","index":1,"n_rows":15,"n_cols":1,"rows_kept":15,"cut":false,"hidden":false,"merged":[]}
["2015-2016"]
["2016-2017"]
["2017-2018"]
["2018-2019"]
["2019-2020"]
["2020-2021"]
["2021-2022"]
["2022-2023"]
["2023-2024"]
["2024-2025"]
["2025-2026"]
["2026-2027"]
["2027-2028"]
["2028-2029"]
["2029-2030"]

{"sheet":"Feuil3","index":2,"n_rows":0,"n_cols":0,"rows_kept":0,"cut":false,"hidden":false,"merged":[]}