{"text_format":"1","workbook":"xlsx","n_sheets":5,"sheets":["Constats projets Entretiens","TODO LIST","suivi des dossiers","Param Constats","Concaténation"],"not_rendered":{"charts":0,"images":0,"macros":1,"external_links":0,"defined_names":5,"comments":0,"pivot_tables":1},"unopened":[],"bounds":{"document_bytes":16777216,"sheet_cells":100000,"rows_first":2000,"rows_last":500,"rows_between":2000,"halvings":0,"cell_chars":16384,"cell_head_chars":4096},"cells_cut":0,"cells_raw":0,"read":"whole","date_system":"1900"}

{"sheet":"Constats projets Entretiens","index":0,"n_rows":97,"n_cols":10,"rows_kept":97,"cut":false,"hidden":false,"merged":[]}
["Domaine","bien","composante","constat/projet","Entretien","Dates prévues","priorité","Localisation","Constat/projet ou Entretien","Loca +  Constat/Projet ou Entretien"]
["ITTRE","Extérieur","abords des bâtiments","barrière en mauvais état, à refaire",null,null,3,{"$f":"Table24[[#This Row],[Domaine]]&\" / \" &Table24[[#This Row],[bien]]&\" / \" &Table24[[#This Row],[composante]]","v":"ITTRE / Extérieur / abords des bâtiments"},{"$f":"IF(Table24[[#This Row],[constat/projet]]=\"\",Table24[[#This Row],[Entretien]],Table24[[#This Row],[constat/projet]])","v":"barrière en mauvais état, à refaire"},{"$f":"Table24[[#This Row],[Localisation]]& \" \" &IF(Table24[[#This Row],[constat/projet]]=\"\",Table24[[#This Row],[Entretien]],Table24[[#This Row],[constat/projet]])","v":"ITTRE / Extérieur / abords des bâtiments barrière en mauvais état, à refaire"}]
["ITTRE","Ensemble du domaine","chemins","eaux dévalent le chemin et entrent dans les bâtiments",null,null,1,{"$f":"Table24[[#This Row],[Domaine]]&\" / \" &Table24[[#This Row],[bien]]&\" / \" &Table24[[#This Row],[composante]]","v":"ITTRE / Ensemble du domaine / chemins"},{"$f":"IF(Table24[[#This Row],[constat/projet]]=\"\",Table24[[#This Row],[Entretien]],Table24[[#This Row],[constat/projet]])","v":"eaux dévalent le chemin et entrent dans les bâtiments"},{"$f":"Table24[[#This Row],[Localisation]]& \" \" &IF(Table24[[#This Row],[constat/projet]]=\"\",Table24[[#This Row],[Entretien]],Table24[[#This Row],[constat/projet]])","v":"ITTRE / Ensemble du domaine / chemins eaux dévalent le chemin et entrent dans les bâtiments"}]
["ITTRE","Intérieur","réfectoire","idée de faire un étage pour gagner en place",null,null,3,{"$f":"Table24[[#This Row],[Domaine]]&\" / \" &Table24[[#This Row],[bien]]&\" / \" &Table24[[#This Row],[composante]]","v":"ITTRE / Intérieur / réfectoire"},{"$f":"IF(Table24[[#This Row],[constat/projet]]=\"\",Table24[[#This Row],[Entretien]],Table24[[#This Row],[constat/projet]])","v":"idée de faire un étage pour gagner en place"},{"$f":"Table24[[#This Row],[Localisation]]& \" \" &IF(Table24[[#This Row],[constat/projet]]=\"\",Table24[[#This Row],[Entretien]],Table24[[#This Row],[constat/projet]])","v":"ITTRE / Intérieur / réfectoire idée de faire un étage pour gagner en place"}]
["ITTRE","Intérieur","sanitaires","besoin de désamianter ?",null,null,3,{"$f":"Table24[[#This Row],[Domaine]]&\" / \" &Table24[[#This Row],[bien]]&\" / \" &Table24[[#This Row],[composante]]","v":"ITTRE / Intérieur / sanitaires"},{"$f":"IF(Table24[[#This Row],[constat/projet]]=\"\",Table24[[#This Row],[Entretien]],Table24[[#This Row],[constat/projet]])","v":"besoin de désamianter ?"},{"$f":"Table24[[#This Row],[Localisation]]& \" \" &IF(Table24[[#This Row],[constat/projet]]=\"\",Table24[[#This Row],[Entretien]],Table24[[#This Row],[constat/projet]])","v":"ITTRE / Intérieur / sanitaires besoin de désamianter ?"}]
["ITTRE","Intérieur","sanitaires","retaper les douches et wc",null,null,3,{"$f":"Table24[[#This Row],[Domaine]]&\" / \" &Table24[[#This Row],[bien]]&\" / \" &Table24[[#This Row],[composante]]","v":"ITTRE / Intérieur / sanitaires"},{"$f":"IF(Table24[[#This Row],[constat/projet]]=\"\",Table24[[#This Row],[Entretien]],Table24[[#This Row],[constat/projet]])","v":"retaper les douches et wc"},{"$f":"Table24[[#This Row],[Localisation]]& \" \" &IF(Table24[[#This Row],[constat/projet]]=\"\",Table24[[#This Row],[Entretien]],Table24[[#This Row],[constat/projet]])","v":"ITTRE / Intérieur / sanitaires retaper les douches et wc"}]
["ITTRE","Intérieur","cuisine","POMPIER : placer une hotte",null,null,1,{"$f":"Table24[[#This Row],[Domaine]]&\" / \" &Table24[[#This Row],[bien]]&\" / \" &Table24[[#This Row],[composante]]","v":"ITTRE / Intérieur / cuisine"},{"$f":"IF(Table24[[#This Row],[constat/projet]]=\"\",Table24[[#This Row],[Entretien]],Table24[[#This Row],[constat/projet]])","v":"POMPIER : placer une hotte"},{"$f":"Table24[[#This Row],[Localisation]]& \" \" &IF(Table24[[#This Row],[constat/projet]]=\"\",Table24[[#This Row],[Entretien]],Table24[[#This Row],[constat/projet]])","v":"ITTRE / Intérieur / cuisine POMPIER : placer une hotte"}]
["ITTRE","Extérieur","prairie",null,"tondre ITTRE","2016-06-01",{"$f":"IF(Table24[[#This Row],[Dates prévues]]=\"\",\"\", IF(Table24[[#This Row],[Dates prévues]]-15<TODAY(),1,3) )","v":3},{"$f":"Table24[[#This Row],[Domaine]]&\" / \" &Table24[[#This Row],[bien]]&\" / \" &Table24[[#This Row],[composante]]","v":"ITTRE / Extérieur / prairie"},{"$f":"IF(Table24[[#This Row],[constat/projet]]=\"\",Table24[[#This Row],[Entretien]],Table24[[#This Row],[constat/projet]])","v":"tondre ITTRE"},{"$f":"Table24[[#This Row],[Localisation]]& \" \" &IF(Table24[[#This Row],[constat/projet]]=\"\",Table24[[#This Row],[Entretien]],Table24[[#This Row],[constat/projet]])","v":"ITTRE / Extérieur / prairie tondre ITTRE"}]
{"$rows_left_out":90}
{"sheet":"TODO LIST","index":1,"n_rows":193,"n_cols":7,"rows_kept":193,"cut":false,"hidden":false,"merged":[]}
["urgence","localisation","constat/projet/entretien","action","responsable","échéance","Loca / action"]
[{"$f":"IFERROR(IF(OFFSET(Table24[[#Headers],[Domaine]],MATCH(Table1[[#This Row],[Loca / action]],'Constats projets Entretiens'!J:J,0)-1,6,,)=0,\"\",OFFSET(Table24[[#Headers],[Domaine]],MATCH(Table1[[#This Row],[Loca / action]],'Constats projets Entretiens'!J:J,0)-1,6,,)),\"Ligne supprimée dans Constat\")","v":1},"PDH 39 / premier / cuisine","améliorer les conditions d'utilisation de la cuisine + commu",null,"greg",{"$f":"IFERROR(IF(OFFSET(Table24[[#Headers],[Domaine]],MATCH(Table1[[#This Row],[Loca / action]],'Constats projets Entretiens'!J:J,0)-1,5,,)=0,\"\",OFFSET(Table24[[#Headers],[Domaine]],MATCH(Table1[[#This Row],[Loca / action]],'Constats projets Entretiens'!J:J,0)-1,5,,)),\"Ligne supprimée dans Constat\")","v":"2016-04-30"},{"$f":"IFERROR(Table1[[#This Row],[localisation]]&\" \"&Table1[[#This Row],[constat/projet/entretien]],\"\")","v":"PDH 39 / premier / cuisine améliorer les conditions d'utilisation de la cuisine + commu"}]
[{"$f":"IFERROR(IF(OFFSET(Table24[[#Headers],[Domaine]],MATCH(Table1[[#This Row],[Loca / action]],'Constats projets Entretiens'!J:J,0)-1,6,,)=0,\"\",OFFSET(Table24[[#Headers],[Domaine]],MATCH(Table1[[#This Row],[Loca / action]],'Constats projets Entretiens'!J:J,0)-1,6,,)),\"Ligne supprimée dans Constat\")","v":1},"HEURE / Ensemble du domaine / autre","évacuer la citerne à gaz du mini-chalet","appeler atnargaz","greg",{"$f":"IFERROR(IF(OFFSET(Table24[[#Headers],[Domaine]],MATCH(Table1[[#This Row],[Loca / action]],'Constats projets Entretiens'!J:J,0)-1,5,,)=0,\"\",OFFSET(Table24[[#Headers],[Domaine]],MATCH(Table1[[#This Row],[Loca / action]],'Constats projets Entretiens'!J:J,0)-1,5,,)),\"Ligne supprimée dans Constat\")","v":"2016-04-30"},{"$f":"IFERROR(Table1[[#This Row],[localisation]]&\" \"&Table1[[#This Row],[constat/projet/entretien]],\"\")","v":"HEURE / Ensemble du domaine / autre évacuer la citerne à gaz du mini-chalet"}]
[{"$f":"IFERROR(IF(OFFSET(Table24[[#Headers],[Domaine]],MATCH(Table1[[#This Row],[Loca / action]],'Constats projets Entretiens'!J:J,0)-1,6,,)=0,\"\",OFFSET(Table24[[#Headers],[Domaine]],MATCH(Table1[[#This Row],[Loca / action]],'Constats projets Entretiens'!J:J,0)-1,6,,)),\"Ligne supprimée dans Constat\")","v":1},"PDH 39 / premier / cuisine","améliorer les conditions d'utilisation de la cuisine + commu",null,null,{"$f":"IFERROR(IF(OFFSET(Table24[[#Headers],[Domaine]],MATCH(Table1[[#This Row],[Loca / action]],'Constats projets Entretiens'!J:J,0)-1,5,,)=0,\"\",OFFSET(Table24[[#Headers],[Domaine]],MATCH(Table1[[#This Row],[Loca / action]],'Constats projets Entretiens'!J:J,0)-1,5,,)),\"Ligne supprimée dans Constat\")","v":"2016-04-30"},{"$f":"IFERROR(Table1[[#This Row],[localisation]]&\" \"&Table1[[#This Row],[constat/projet/entretien]],\"\")","v":"PDH 39 / premier / cuisine améliorer les conditions d'utilisation de la cuisine + commu"}]
[{"$f":"IFERROR(IF(OFFSET(Table24[[#Headers],[Domaine]],MATCH(Table1[[#This Row],[Loca / action]],'Constats projets Entretiens'!J:J,0)-1,6,,)=0,\"\",OFFSET(Table24[[#Headers],[Domaine]],MATCH(Table1[[#This Row],[Loca / action]],'Constats projets Entretiens'!J:J,0)-1,6,,)),\"Ligne supprimée dans Constat\")","v":1},"HEURE / Ensemble du domaine / autre","évacuer la citerne à gaz du mini-chalet",null,null,{"$f":"IFERROR(IF(OFFSET(Table24[[#Headers],[Domaine]],MATCH(Table1[[#This Row],[Loca / action]],'Constats projets Entretiens'!J:J,0)-1,5,,)=0,\"\",OFFSET(Table24[[#Headers],[Domaine]],MATCH(Table1[[#This Row],[Loca / action]],'Constats projets Entretiens'!J:J,0)-1,5,,)),\"Ligne supprimée dans Constat\")","v":"2016-04-30"},{"$f":"IFERROR(Table1[[#This Row],[localisation]]&\" \"&Table1[[#This Row],[constat/projet/entretien]],\"\")","v":"HEURE / Ensemble du domaine / autre évacuer la citerne à gaz du mini-chalet"}]
[{"$f":"IFERROR(IF(OFFSET(Table24[[#Headers],[Domaine]],MATCH(Table1[[#This Row],[Loca / action]],'Constats projets Entretiens'!J:J,0)-1,6,,)=0,\"\",OFFSET(Table24[[#Headers],[Domaine]],MATCH(Table1[[#This Row],[Loca / action]],'Constats projets Entretiens'!J:J,0)-1,6,,)),\"Ligne supprimée dans Constat\")","v":1},"HEURE / Ensemble du domaine / travail administratif","reprendre contract avec YannJacquet (photographe) pour réaliser des photos pro des domaines","appeler Yann Jacquet","greg",{"$f":"IFERROR(IF(OFFSET(Table24[[#Headers],[Domaine]],MATCH(Table1[[#This Row],[Loca / action]],'Constats projets Entretiens'!J:J,0)-1,5,,)=0,\"\",OFFSET(Table24[[#Headers],[Domaine]],MATCH(Table1[[#This Row],[Loca / action]],'Constats projets Entretiens'!J:J,0)-1,5,,)),\"Ligne supprimée dans Constat\")","v":"2016-05-10"},{"$f":"IFERROR(Table1[[#This Row],[localisation]]&\" \"&Table1[[#This Row],[constat/projet/entretien]],\"\")","v":"HEURE / Ensemble du domaine / travail administratif reprendre contract avec YannJacquet (photographe) pour réaliser des photos pro des domaines"}]
[{"$f":"IFERROR(IF(OFFSET(Table24[[#Headers],[Domaine]],MATCH(Table1[[#This Row],[Loca / action]],'Constats projets Entretiens'!J:J,0)-1,6,,)=0,\"\",OFFSET(Table24[[#Headers],[Domaine]],MATCH(Table1[[#This Row],[Loca / action]],'Constats projets Entretiens'!J:J,0)-1,6,,)),\"Ligne supprimée dans Constat\")","v":1},"HEURE / Ensemble du domaine / travail administratif","reprendre contract avec YannJacquet (photographe) pour réaliser des photos pro des domaines",null,null,{"$f":"IFERROR(IF(OFFSET(Table24[[#Headers],[Domaine]],MATCH(Table1[[#This Row],[Loca / action]],'Constats projets Entretiens'!J:J,0)-1,5,,)=0,\"\",OFFSET(Table24[[#Headers],[Domaine]],MATCH(Table1[[#This Row],[Loca / action]],'Constats projets Entretiens'!J:J,0)-1,5,,)),\"Ligne supprimée dans Constat\")","v":"2016-05-10"},{"$f":"IFERROR(Table1[[#This Row],[localisation]]&\" \"&Table1[[#This Row],[constat/projet/entretien]],\"\")","v":"HEURE / Ensemble du domaine / travail administratif reprendre contract avec YannJacquet (photographe) pour réaliser des photos pro des domaines"}]
[{"$f":"IFERROR(IF(OFFSET(Table24[[#Headers],[Domaine]],MATCH(Table1[[#This Row],[Loca / action]],'Constats projets Entretiens'!J:J,0)-1,6,,)=0,\"\",OFFSET(Table24[[#Headers],[Domaine]],MATCH(Table1[[#This Row],[Loca / action]],'Constats projets Entretiens'!J:J,0)-1,6,,)),\"Ligne supprimée dans Constat\")","v":1},"HEURE / Ensemble du domaine / travail administratif","envoyer planning location à Milos",null,null,{"$f":"IFERROR(IF(OFFSET(Table24[[#Headers],[Domaine]],MATCH(Table1[[#This Row],[Loca / action]],'Constats projets Entretiens'!J:J,0)-1,5,,)=0,\"\",OFFSET(Table24[[#Headers],[Domaine]],MATCH(Table1[[#This Row],[Loca / action]],'Constats projets Entretiens'!J:J,0)-1,5,,)),\"Ligne supprimée dans Constat\")","v":"2016-05-15"},{"$f":"IFERROR(Table1[[#This Row],[localisation]]&\" \"&Table1[[#This Row],[constat/projet/entretien]],\"\")","v":"HEURE / Ensemble du domaine / travail administratif envoyer planning location à Milos"}]
{"$rows_left_out":186}
{"sheet":"suivi des dossiers","index":2,"n_rows":85,"n_cols":100,"rows_kept":85,"cut":false,"hidden":false,"merged":[]}
["responsable","localisation","constat/projet/entretien","action","échéance","état d'avancement","infos détaillées"]
[{"$f":"IFERROR(OFFSET('TODO LIST'!$G$1,MATCH(Table4[[#This Row],[localisation]]& \" \" &Table4[[#This Row],[constat/projet/entretien]],'TODO LIST'!G:G,0)-1,-2,,),\"\")","v":""},"HEURE / Ensemble du domaine / autre","évacuer la citerner à gaz du mini-chalet",null,"2016-04-30"]
[{"$f":"IFERROR(OFFSET('TODO LIST'!$G$1,MATCH(Table4[[#This Row],[localisation]]& \" \" &Table4[[#This Row],[constat/projet/entretien]],'TODO LIST'!G:G,0)-1,-2,,),\"\")","v":""},"PDH 38 / Premier / appartement (salle de Bains)","APPART : réaménager la sdb (nouv bain et lavabo, bac de douche, repeindre,...)",null,""]
[{"$f":"IFERROR(OFFSET('TODO LIST'!$G$1,MATCH(Table4[[#This Row],[localisation]]& \" \" &Table4[[#This Row],[constat/projet/entretien]],'TODO LIST'!G:G,0)-1,-2,,),\"\")","v":""},"HEURE / Le Grand Chalet / murs extérieurs","rejointoyer et traiter les plaques des murs + remplacer mettre vis inoxydables",null,""]
[{"$f":"IFERROR(OFFSET('TODO LIST'!$G$1,MATCH(Table4[[#This Row],[localisation]]& \" \" &Table4[[#This Row],[constat/projet/entretien]],'TODO LIST'!G:G,0)-1,-2,,),\"\")","v":""},"CDS / Ensemble du domaine / travail administratif","VENTE : annoncer la vente aux potentiels repreneurs",null,""]
[{"$f":"IFERROR(OFFSET('TODO LIST'!$G$1,MATCH(Table4[[#This Row],[localisation]]& \" \" &Table4[[#This Row],[constat/projet/entretien]],'TODO LIST'!G:G,0)-1,-2,,),\"\")","v":""},"CDS / Ensemble du domaine / travail administratif","VENTE : créer annonce immoweb (si pas vente directe)",null,""]
[{"$f":"IFERROR(OFFSET('TODO LIST'!$G$1,MATCH(Table4[[#This Row],[localisation]]& \" \" &Table4[[#This Row],[constat/projet/entretien]],'TODO LIST'!G:G,0)-1,-2,,),\"\")","v":"roro"},"PDH 38 / caves / chaudière et chauffage","chaudière instable, s'éteint tout le temps",null,"",null,null,null,null,null,null,null,null,null,null,null,null,null,null,null,null,null,null,null,null,null,null,null,null,null,null,null,null,null,null,null,null,null,null,null,null,null,null,null,null,null,null,null,null,null,null,null,null,null,null,null,null,null,null,null,null,null,null,null,null,null,null,null,null,null,null,null,null,null,null,null,null,null,null,null,null,null,null,null,null,null,null,null,null,null,null,null,null,null,null,null,null,null,null,"x"]
[{"$f":"IFERROR(OFFSET('TODO LIST'!$G$1,MATCH(Table4[[#This Row],[localisation]]& \" \" &Table4[[#This Row],[constat/projet/entretien]],'TODO LIST'!G:G,0)-1,-2,,),\"\")","v":""},"ITTRE / Extérieur / évacuation des eaux de pluie","drains bouchés ?",null,"",null,null,null,null,null,null,null,null,null,null,null,null,null,null,null,null,null,null,null,null,null,null,null,null,null,null,null,null,null,null,null,null,null,null,null,null,null,null,null,null,null,null,null,null,null,null,null,null,null,null,null,null,null,null,null,null,null,null,null,null,null,null,null,null,null,null,null,null,null,null,null,null,null,null,null,null,null,null,null,null,null,null,null,null,null,null,null,null,null,null,null,null,null,null,"x"]
{"$rows_left_out":78}
{"sheet":"Param Constats","index":3,"n_rows":22,"n_cols":34,"rows_kept":22,"cut":false,"hidden":false,"merged":[]}
["Domaine",null,"HEURE","ITTRE","CDS","PDH 38","PDH 39",null,null,"HEURE Ensemble du domaine","HEURE Le Grand Chalet","HEURE La Carlingue","HEURE Bureaux","HEURE Terrains","HEURE ancien bloc sanitaire","ITTRE Ensemble du domaine","ITTRE Intérieur","ITTRE Extérieur","CDS Ensemble du domaine","CDS Intérieur","CDS Extérieur","PDH 38 Tout le bâtiment","PDH 38 caves","PDH 38 Rez","PDH 38 Premier","PDH 38 deuxième","PDH 38 troisième","PDH 39 Tout le bâtiment","PDH 39 caves","PDH 39 garages","PDH 39 rez","PDH 39 premier","PDH 39 deuxième","PDH 39 troisième"]
["HEURE",null,"Ensemble du domaine","Ensemble du domaine","Ensemble du domaine","Tout le bâtiment","Tout le bâtiment",null,null,"travail administratif","général","général","général","général","général","travail administratif","général","général","travail administratif","général","abords extérieurs du bâtiment","travail administratif","chaudière et chauffage","menuiserie","menuiserie","menuiserie","menuiserie","travail administratif","chaudière et chauffage","garage SGP","menuiserie","menuiserie","menuiserie","menuiserie"]
["ITTRE",null,"Le Grand Chalet","Intérieur","Intérieur","caves","caves",null,null,"relation aux autorités publiques","abords extérieurs","abords extérieurs","abords extérieurs","Paturins","abords extérieurs","relation aux autorités publiques","isolation","abords des bâtiments","relation aux autorités publiques","isolation","terrasse arrière","relation aux autorités publiques","archives","plomberie et évacuation des eaux","plomberie et évacuation des eaux","plomberie et évacuation des eaux","plomberie et évacuation des eaux","relation aux autorités publiques","salles de rangement","garage CEMEA","plomberie et évacuation des eaux","plomberie et évacuation des eaux","plomberie et évacuation des eaux","plomberie et évacuation des eaux"]
["CDS",null,"La Carlingue","Extérieur","Extérieur","Rez","garages",null,null,"chemins","terrasse","murs extérieurs","toiture","Epicéas","murs","chemins","menuiserie","murs extérieurs","chemins","menuiserie","murs extérieurs","projets","autre","électricité","électricité","électricité","électricité","projets","atelier","sanitaire","électricité","électricité","électricité","électricité"]
["PDH 38",null,"Bureaux",null,null,"Premier","rez",null,null,"parkings","murs extérieurs","toiture","isolation","Wood-Badge","toiture","parkings","électricité","toiture","parkings","électricité","toiture","toiture",null,"pièce à rue","bureau AISG","appartement SGP (cuisine)","projet","toiture","autre","autre","Magascout","bureau SF","grande salle de réunion","bureaux CEMEA"]
["PDH 39",null,"Terrains",null,null,"deuxième","premier",null,null,"bois","toiture","isolation","murs extérieurs","Bouleaux","dalle de béton","autre","chaudière et chauffage","prairie","autre","chaudière et chauffage","bois","murs extérieurs",null,"sanitaires","appartement (cuisine)","appartement SGP (pièce de vie)","autre","murs extérieurs",null,null,"atelier du magascout","bureau CF et graphiste","petite salle de réunion","archives CEMEA"]
[null,null,"ancien bloc sanitaire",null,null,"troisième","deuxième",null,null,"étang et abords de rivière","isolation","menuiserie","menuiserie","Daguet","projet",null,"plomberie et évacuation des eaux","citerne à gaz",null,"plomberie et évacuation des eaux","prairie","isolation",null,"pièce derrière les sanitaires","appartement (pièce de vie)","appartement SGP (dortoirs)",null,"isolation",null,null,"matériel de bureau","bureau Rédac","salle SGAB","autre"]
[null,null,null,null,null,null,"troisième",null,null,"toilettes sèches","menuiserie","électricité","électricité","Chênes","autre",null,"réfectoire","feux de camp",null,"pièce d'accueil","BBQ","cage d'escalier",null,"pièce communiquant à la cuisine SGP","appartement (chambre)","appartement SGP (salle de bains)",null,"cour",null,null,"autre","bureau SUCR et GRH","réfectoire et pièce de jeux des CEMEA"]
{"$rows_left_out":15}
{"sheet":"Concaténation","index":4,"n_rows":98,"n_cols":3,"rows_kept":98,"cut":false,"hidden":false,"merged":[]}
["Row Labels","Localisation","Constat/projet ou Entretien"]
[1,"HEURE / Ensemble du domaine / relation aux autorités publiques","dossier bourgmestre"]
[1,"HEURE / Ensemble du domaine / travail administratif","reprendre contract avec YannJacquet (photographe) pour réaliser des photos pro des domaines"]
[1,"HEURE / Ensemble du domaine / travail administratif","envoyer planning location à Milos"]
[1,"ITTRE / Ensemble du domaine / chemins","eaux dévalent le chemin et entrent dans les bâtiments"]
[1,"ITTRE / Intérieur / cuisine","POMPIER : placer une hotte"]
[1,"PDH 38 / caves / chaudière et chauffage","chaudière instable, s'éteint tout le temps"]
[1,"CDS / Ensemble du domaine / relation aux autorités publiques","COUVIN : gérer les dossiers à remettre à la commune"]
{"$rows_left_out":90}