{"text_format":"1","workbook":"xlsx","n_sheets":12,"sheets":["TENUE A JOUR","INDICATEURS","GLOBAL","FABRICANT 1","FABRICANT 2","FABRICANT 3","FABRICANT 4","FABRICANT 5","FABRICANT 6","LEXIQUE 1","LEXIQUE 2","LEXIQUE 3"],"not_rendered":{"charts":0,"images":0,"macros":1,"external_links":0,"defined_names":0,"comments":0,"pivot_tables":0},"unopened":[],"bounds":{"document_bytes":16777216,"sheet_cells":100000,"rows_first":2000,"rows_last":500,"rows_between":2000,"halvings":0,"cell_chars":16384,"cell_head_chars":4096},"cells_cut":0,"cells_raw":0,"read":"whole","date_system":"1900"}

{"sheet":"TENUE A JOUR","index":0,"n_rows":14,"n_cols":13,"rows_kept":14,"cut":false,"hidden":false,"merged":[]}
[]
[]
[]
[]
[]
[]
[]
[]
[]
[]
[]
[]
[null,null,null,null,null,null,null,null,null,"Mises à jour","Onglet concerné","Révision","Commentaire/nature de la modification"]
[null,null,null,null,null,null,null,null,null,"2016-05-29",null,0,"Création du tableau"]

{"sheet":"INDICATEURS","index":1,"n_rows":25,"n_cols":6,"rows_kept":25,"cut":false,"hidden":false,"merged":[]}
[]
[null,"Atelier ","Equipements","Références "," très élevée ","élevée"]
[null,1,"L1"]
[null,1,"L2"]
[null,1,"L3"]
[null,1,"L4"]
[null,1,"L5"]
[null,1,"L6"]
[null,1,"L7"]
[null,1,"L8"]
[null,2,"L9"]
[null,2,"L10"]
[null,2,"L11"]
[null,2,"L12"]
[null,2,"L13"]
[null,2,"L14"]
[null,2,"L15"]
[null,2,"L16"]
[null,2,"L17"]
[null,2,"L18"]
[null,3,"L19"]
[null,3,"L20"]
[null,3,"L21"]
[null,3,"L22"]
[null,3,"L23"]

{"sheet":"GLOBAL","index":2,"n_rows":356,"n_cols":40,"rows_kept":356,"cut":false,"hidden":false,"merged":[[3,15,4,24],[3,25,4,29],[2,0,2,6],[2,7,2,29],[3,0,4,6],[3,7,4,14]]}
["DATE DE REFERENCE","Année en cours","NOMBRE DE REFERENCE SIEMENS"]
["2016-05-17",{"$f":"YEAR(A2)","v":2016},{"$f":"COUNTA(A6:A147)","v":142}]
["DONNEES PIECES",null,null,null,null,null,null,"INSTALLATIONS"]
["OBSOLESCENCE",null,null,null,null,null,null,"AT 1",null,null,null,null,null,null,null,"AT 2",null,null,null,null,null,null,null,null,null,"AT 3"]
[]
["Référence","Désignation","Fabricant","Code ","Stock mini recommandé","Stock alerte choisi","Sous-équipement","L1","L2","L3","L4","L5","L6","L7","L8","L9","L10","L11","L12","L13","L14","L15","L16","L17","L18","L19","L20","L21","L22","L23","Date d'abandon \ndéfintif ","Année abandon","Actuelle","1 an","2 ans","3 ans","4 ans","Produit successeur","Informations successeur","Commentaires"]
["PR1","D1","FAB 1",null,1,null,null,null,null,null,null,null,null,null,null,null,null,null,null,null,null,null,null,null,null,null,null,null,null,null,"2016-01-10",{"$f":"IF(ISNUMBER(AE:AE),YEAR(AE:AE),AE:AE)","v":2016},{"$f":"IF(AE:AE=\"pas d'actualité\",3,IF(AE:AE=\"?\",\"?\",IF(AE:AE=\"?\",\"?\",IF($B$2-AF:AF>=0,0,IF($B$2-AF:AF>=-1,1,IF($B$2-AF:AF>=-2,2,3))))))","v":0},{"$f":"IF(AE:AE=\"pas d'actualité\",3,IF(AE:AE=\"?\",\"?\",IF(AE:AE=\"?\",\"?\",IF((($B$2+1)-AF:AF)>=0,\"0\",IF((($B$2+1)-AF:AF)>=-1,\"1\",IF((($B$2+1)-AF:AF)>=-2,\"2\",\"3\"))))))","v":"0"},{"$f":"IF(AE:AE=\"pas d'actualité\",3,IF(AE:AE=\"?\",\"?\",IF(AE:AE=\"?\",\"?\",IF((($B$2+2)-AF:AF)>=0,0,IF((($B$2+2)-AF:AF)>=-1,1,IF((($B$2+2)-AF:AF)>=-2,2,3))))))","v":0},{"$f":"IF(AE:AE=\"pas d'actualité\",3,IF(AE:AE=\"?\",\"?\",IF(AE:AE=\"?\",\"?\",IF(($B$2+3)-AF:AF>=0,0,IF(($B$2+3)-AF:AF>=-1,1,IF(($B$2+3)-AF:AF>=-2,2,3))))))","v":0},{"$f":"IF(AE:AE=\"pas d'actualité\",3,IF(AE:AE=\"?\",\"?\",IF(AE:AE=\"?\",\"?\",IF(($B$2+4)-AF:AF>=0,0,IF(($B$2+4)-AF:AF>=-1,1,IF(($B$2+4)-AF:AF>=-2,2,3))))))","v":0},"1FK7063-2AF71-1… voir catalogue Seulement en pièces détachés",null,"ARRET TOTAL FOURNITURE 01/10/2018"]
["PR2","D2","FAB 2",null,1,null,null,"X","X",null,null,"X",null,null,null,null,null,null,null,null,null,null,null,null,null,null,null,null,null,null,"2004-12-31",{"$f":"IF(ISNUMBER(AE:AE),YEAR(AE:AE),AE:AE)","v":2004},{"$f":"IF(AE:AE=\"pas d'actualité\",3,IF(AE:AE=\"?\",\"?\",IF(AE:AE=\"?\",\"?\",IF($B$2-AF:AF>=0,0,IF($B$2-AF:AF>=-1,1,IF($B$2-AF:AF>=-2,2,3))))))","v":0},{"$f":"IF(AE:AE=\"pas d'actualité\",3,IF(AE:AE=\"?\",\"?\",IF(AE:AE=\"?\",\"?\",IF((($B$2+1)-AF:AF)>=0,\"0\",IF((($B$2+1)-AF:AF)>=-1,\"1\",IF((($B$2+1)-AF:AF)>=-2,\"2\",\"3\"))))))","v":"0"},{"$f":"IF(AE:AE=\"pas d'actualité\",3,IF(AE:AE=\"?\",\"?\",IF(AE:AE=\"?\",\"?\",IF((($B$2+2)-AF:AF)>=0,0,IF((($B$2+2)-AF:AF)>=-1,1,IF((($B$2+2)-AF:AF)>=-2,2,3))))))","v":0},{"$f":"IF(AE:AE=\"pas d'actualité\",3,IF(AE:AE=\"?\",\"?\",IF(AE:AE=\"?\",\"?\",IF(($B$2+3)-AF:AF>=0,0,IF(($B$2+3)-AF:AF>=-1,1,IF(($B$2+3)-AF:AF>=-2,2,3))))))","v":0},{"$f":"IF(AE:AE=\"pas d'actualité\",3,IF(AE:AE=\"?\",\"?\",IF(AE:AE=\"?\",\"?\",IF(($B$2+4)-AF:AF>=0,0,IF(($B$2+4)-AF:AF>=-1,1,IF(($B$2+4)-AF:AF>=-2,2,3))))))","v":0},"3SE2120-1E",null,"ARRET TOTAL FOURNITURE 01/04/2005"]
["PR3","D3","FAB 3",null,1,null,null,null,null,"X",null,null,null,null,null,null,null,null,null,null,null,null,null,null,null,null,null,null,null,null,"2016-01-10",{"$f":"IF(ISNUMBER(AE:AE),YEAR(AE:AE),AE:AE)","v":2016},{"$f":"IF(AE:AE=\"pas d'actualité\",3,IF(AE:AE=\"?\",\"?\",IF(AE:AE=\"?\",\"?\",IF($B$2-AF:AF>=0,0,IF($B$2-AF:AF>=-1,1,IF($B$2-AF:AF>=-2,2,3))))))","v":0},{"$f":"IF(AE:AE=\"pas d'actualité\",3,IF(AE:AE=\"?\",\"?\",IF(AE:AE=\"?\",\"?\",IF((($B$2+1)-AF:AF)>=0,\"0\",IF((($B$2+1)-AF:AF)>=-1,\"1\",IF((($B$2+1)-AF:AF)>=-2,\"2\",\"3\"))))))","v":"0"},{"$f":"IF(AE:AE=\"pas d'actualité\",3,IF(AE:AE=\"?\",\"?\",IF(AE:AE=\"?\",\"?\",IF((($B$2+2)-AF:AF)>=0,0,IF((($B$2+2)-AF:AF)>=-1,1,IF((($B$2+2)-AF:AF)>=-2,2,3))))))","v":0},{"$f":"IF(AE:AE=\"pas d'actualité\",3,IF(AE:AE=\"?\",\"?\",IF(AE:AE=\"?\",\"?\",IF(($B$2+3)-AF:AF>=0,0,IF(($B$2+3)-AF:AF>=-1,1,IF(($B$2+3)-AF:AF>=-2,2,3))))))","v":0},{"$f":"IF(AE:AE=\"pas d'actualité\",3,IF(AE:AE=\"?\",\"?\",IF(AE:AE=\"?\",\"?\",IF(($B$2+4)-AF:AF>=0,0,IF(($B$2+4)-AF:AF>=-1,1,IF(($B$2+4)-AF:AF>=-2,2,3))))))","v":0},"6AV3607-1JC20-0AX2",null,"ARRET TOTAL FOURNITURE 01/10/2018"]
["PR4","D4","FAB 4",null,1,null,null,null,null,null,null,null,null,null,null,null,null,null,null,null,null,null,null,null,null,null,null,null,null,null,"2006-11-24",{"$f":"IF(ISNUMBER(AE:AE),YEAR(AE:AE),AE:AE)","v":2006},{"$f":"IF(AE:AE=\"pas d'actualité\",3,IF(AE:AE=\"?\",\"?\",IF(AE:AE=\"?\",\"?\",IF($B$2-AF:AF>=0,0,IF($B$2-AF:AF>=-1,1,IF($B$2-AF:AF>=-2,2,3))))))","v":0},{"$f":"IF(AE:AE=\"pas d'actualité\",3,IF(AE:AE=\"?\",\"?\",IF(AE:AE=\"?\",\"?\",IF((($B$2+1)-AF:AF)>=0,\"0\",IF((($B$2+1)-AF:AF)>=-1,\"1\",IF((($B$2+1)-AF:AF)>=-2,\"2\",\"3\"))))))","v":"0"},{"$f":"IF(AE:AE=\"pas d'actualité\",3,IF(AE:AE=\"?\",\"?\",IF(AE:AE=\"?\",\"?\",IF((($B$2+2)-AF:AF)>=0,0,IF((($B$2+2)-AF:AF)>=-1,1,IF((($B$2+2)-AF:AF)>=-2,2,3))))))","v":0},{"$f":"IF(AE:AE=\"pas d'actualité\",3,IF(AE:AE=\"?\",\"?\",IF(AE:AE=\"?\",\"?\",IF(($B$2+3)-AF:AF>=0,0,IF(($B$2+3)-AF:AF>=-1,1,IF(($B$2+3)-AF:AF>=-2,2,3))))))","v":0},{"$f":"IF(AE:AE=\"pas d'actualité\",3,IF(AE:AE=\"?\",\"?\",IF(AE:AE=\"?\",\"?\",IF(($B$2+4)-AF:AF>=0,0,IF(($B$2+4)-AF:AF>=-1,1,IF(($B$2+4)-AF:AF>=-2,2,3))))))","v":0},null,"SUBSTITUTE: 6DR5*, REFER TO CAT. FI01-7","ARRET TOTAL FOURNITURE 24/11/2006"]
["PR5","D5","FAB 5",null,1,null,null,"X","X",null,null,null,null,null,null,null,null,null,null,null,null,null,null,null,null,null,null,null,null,null,"2010-01-10",{"$f":"IF(ISNUMBER(AE:AE),YEAR(AE:AE),AE:AE)","v":2010},{"$f":"IF(AE:AE=\"pas d'actualité\",3,IF(AE:AE=\"?\",\"?\",IF(AE:AE=\"?\",\"?\",IF($B$2-AF:AF>=0,0,IF($B$2-AF:AF>=-1,1,IF($B$2-AF:AF>=-2,2,3))))))","v":0},{"$f":"IF(AE:AE=\"pas d'actualité\",3,IF(AE:AE=\"?\",\"?\",IF(AE:AE=\"?\",\"?\",IF((($B$2+1)-AF:AF)>=0,\"0\",IF((($B$2+1)-AF:AF)>=-1,\"1\",IF((($B$2+1)-AF:AF)>=-2,\"2\",\"3\"))))))","v":"0"},{"$f":"IF(AE:AE=\"pas d'actualité\",3,IF(AE:AE=\"?\",\"?\",IF(AE:AE=\"?\",\"?\",IF((($B$2+2)-AF:AF)>=0,0,IF((($B$2+2)-AF:AF)>=-1,1,IF((($B$2+2)-AF:AF)>=-2,2,3))))))","v":0},{"$f":"IF(AE:AE=\"pas d'actualité\",3,IF(AE:AE=\"?\",\"?\",IF(AE:AE=\"?\",\"?\",IF(($B$2+3)-AF:AF>=0,0,IF(($B$2+3)-AF:AF>=-1,1,IF(($B$2+3)-AF:AF>=-2,2,3))))))","v":0},{"$f":"IF(AE:AE=\"pas d'actualité\",3,IF(AE:AE=\"?\",\"?\",IF(AE:AE=\"?\",\"?\",IF(($B$2+4)-AF:AF>=0,0,IF(($B$2+4)-AF:AF>=-1,1,IF(($B$2+4)-AF:AF>=-2,2,3))))))","v":0},"6ED1052-1HB00-0BA6",null,"ARRET TOTAL FOURNITURE 01/10/2010"]
["PR6","D6","FAB 6",null,null,null,null,"X",null,null,null,null,null,null,null,null,null,null,null,null,null,null,null,null,null,null,null,null,null,null,"2011-01-10",{"$f":"IF(ISNUMBER(AE:AE),YEAR(AE:AE),AE:AE)","v":2011},{"$f":"IF(AE:AE=\"pas d'actualité\",3,IF(AE:AE=\"?\",\"?\",IF(AE:AE=\"?\",\"?\",IF($B$2-AF:AF>=0,0,IF($B$2-AF:AF>=-1,1,IF($B$2-AF:AF>=-2,2,3))))))","v":0},{"$f":"IF(AE:AE=\"pas d'actualité\",3,IF(AE:AE=\"?\",\"?\",IF(AE:AE=\"?\",\"?\",IF((($B$2+1)-AF:AF)>=0,\"0\",IF((($B$2+1)-AF:AF)>=-1,\"1\",IF((($B$2+1)-AF:AF)>=-2,\"2\",\"3\"))))))","v":"0"},{"$f":"IF(AE:AE=\"pas d'actualité\",3,IF(AE:AE=\"?\",\"?\",IF(AE:AE=\"?\",\"?\",IF((($B$2+2)-AF:AF)>=0,0,IF((($B$2+2)-AF:AF)>=-1,1,IF((($B$2+2)-AF:AF)>=-2,2,3))))))","v":0},{"$f":"IF(AE:AE=\"pas d'actualité\",3,IF(AE:AE=\"?\",\"?\",IF(AE:AE=\"?\",\"?\",IF(($B$2+3)-AF:AF>=0,0,IF(($B$2+3)-AF:AF>=-1,1,IF(($B$2+3)-AF:AF>=-2,2,3))))))","v":0},{"$f":"IF(AE:AE=\"pas d'actualité\",3,IF(AE:AE=\"?\",\"?\",IF(AE:AE=\"?\",\"?\",IF(($B$2+4)-AF:AF>=0,0,IF(($B$2+4)-AF:AF>=-1,1,IF(($B$2+4)-AF:AF>=-2,2,3))))))","v":0},"SITOP POWER24V/30A","Partiellement compatbile"]
["PR7","D7","FAB 7",null,null,null,null,null,null,null,null,null,null,null,null,null,null,null,null,null,null,null,null,null,null,null,null,null,null,null,"2008-05-15",{"$f":"IF(ISNUMBER(AE:AE),YEAR(AE:AE),AE:AE)","v":2008},{"$f":"IF(AE:AE=\"pas d'actualité\",3,IF(AE:AE=\"?\",\"?\",IF(AE:AE=\"?\",\"?\",IF($B$2-AF:AF>=0,0,IF($B$2-AF:AF>=-1,1,IF($B$2-AF:AF>=-2,2,3))))))","v":0},{"$f":"IF(AE:AE=\"pas d'actualité\",3,IF(AE:AE=\"?\",\"?\",IF(AE:AE=\"?\",\"?\",IF((($B$2+1)-AF:AF)>=0,\"0\",IF((($B$2+1)-AF:AF)>=-1,\"1\",IF((($B$2+1)-AF:AF)>=-2,\"2\",\"3\"))))))","v":"0"},{"$f":"IF(AE:AE=\"pas d'actualité\",3,IF(AE:AE=\"?\",\"?\",IF(AE:AE=\"?\",\"?\",IF((($B$2+2)-AF:AF)>=0,0,IF((($B$2+2)-AF:AF)>=-1,1,IF((($B$2+2)-AF:AF)>=-2,2,3))))))","v":0},{"$f":"IF(AE:AE=\"pas d'actualité\",3,IF(AE:AE=\"?\",\"?\",IF(AE:AE=\"?\",\"?\",IF(($B$2+3)-AF:AF>=0,0,IF(($B$2+3)-AF:AF>=-1,1,IF(($B$2+3)-AF:AF>=-2,2,3))))))","v":0},{"$f":"IF(AE:AE=\"pas d'actualité\",3,IF(AE:AE=\"?\",\"?\",IF(AE:AE=\"?\",\"?\",IF(($B$2+4)-AF:AF>=0,0,IF(($B$2+4)-AF:AF>=-1,1,IF(($B$2+4)-AF:AF>=-2,2,3))))))","v":0},"6ES5095-8MA05",null,"reparation/pièce de rechange seulement sous garantie"]
["PR8","D8","FAB 8",null,null,null,null,null,null,null,null,null,null,null,null,null,null,null,null,null,null,null,null,null,null,null,null,null,null,null,"2010-01-10",{"$f":"IF(ISNUMBER(AE:AE),YEAR(AE:AE),AE:AE)","v":2010},{"$f":"IF(AE:AE=\"pas d'actualité\",3,IF(AE:AE=\"?\",\"?\",IF(AE:AE=\"?\",\"?\",IF($B$2-AF:AF>=0,0,IF($B$2-AF:AF>=-1,1,IF($B$2-AF:AF>=-2,2,3))))))","v":0},{"$f":"IF(AE:AE=\"pas d'actualité\",3,IF(AE:AE=\"?\",\"?\",IF(AE:AE=\"?\",\"?\",IF((($B$2+1)-AF:AF)>=0,\"0\",IF((($B$2+1)-AF:AF)>=-1,\"1\",IF((($B$2+1)-AF:AF)>=-2,\"2\",\"3\"))))))","v":"0"},{"$f":"IF(AE:AE=\"pas d'actualité\",3,IF(AE:AE=\"?\",\"?\",IF(AE:AE=\"?\",\"?\",IF((($B$2+2)-AF:AF)>=0,0,IF((($B$2+2)-AF:AF)>=-1,1,IF((($B$2+2)-AF:AF)>=-2,2,3))))))","v":0},{"$f":"IF(AE:AE=\"pas d'actualité\",3,IF(AE:AE=\"?\",\"?\",IF(AE:AE=\"?\",\"?\",IF(($B$2+3)-AF:AF>=0,0,IF(($B$2+3)-AF:AF>=-1,1,IF(($B$2+3)-AF:AF>=-2,2,3))))))","v":0},{"$f":"IF(AE:AE=\"pas d'actualité\",3,IF(AE:AE=\"?\",\"?\",IF(AE:AE=\"?\",\"?\",IF(($B$2+4)-AF:AF>=0,0,IF(($B$2+4)-AF:AF>=-1,1,IF(($B$2+4)-AF:AF>=-2,2,3))))))","v":0},"6ES5095-8MA05",null,"Seulement disponible en pièces de rechange"]
["PR9","D9","FAB 9",null,null,null,null,null,null,null,null,null,null,null,null,null,null,"X",null,null,null,null,null,null,null,null,null,null,null,null,"2008-01-10",{"$f":"IF(ISNUMBER(AE:AE),YEAR(AE:AE),AE:AE)","v":2008},{"$f":"IF(AE:AE=\"pas d'actualité\",3,IF(AE:AE=\"?\",\"?\",IF(AE:AE=\"?\",\"?\",IF($B$2-AF:AF>=0,0,IF($B$2-AF:AF>=-1,1,IF($B$2-AF:AF>=-2,2,3))))))","v":0},{"$f":"IF(AE:AE=\"pas d'actualité\",3,IF(AE:AE=\"?\",\"?\",IF(AE:AE=\"?\",\"?\",IF((($B$2+1)-AF:AF)>=0,\"0\",IF((($B$2+1)-AF:AF)>=-1,\"1\",IF((($B$2+1)-AF:AF)>=-2,\"2\",\"3\"))))))","v":"0"},{"$f":"IF(AE:AE=\"pas d'actualité\",3,IF(AE:AE=\"?\",\"?\",IF(AE:AE=\"?\",\"?\",IF((($B$2+2)-AF:AF)>=0,0,IF((($B$2+2)-AF:AF)>=-1,1,IF((($B$2+2)-AF:AF)>=-2,2,3))))))","v":0},{"$f":"IF(AE:AE=\"pas d'actualité\",3,IF(AE:AE=\"?\",\"?\",IF(AE:AE=\"?\",\"?\",IF(($B$2+3)-AF:AF>=0,0,IF(($B$2+3)-AF:AF>=-1,1,IF(($B$2+3)-AF:AF>=-2,2,3))))))","v":0},{"$f":"IF(AE:AE=\"pas d'actualité\",3,IF(AE:AE=\"?\",\"?\",IF(AE:AE=\"?\",\"?\",IF(($B$2+4)-AF:AF>=0,0,IF(($B$2+4)-AF:AF>=-1,1,IF(($B$2+4)-AF:AF>=-2,2,3))))))","v":0},"SUCCESSOR IS CPU 928B: 6ES5928-3UB21","partiellement"]
["PR10","D10","FAB 10",null,1,null,null,null,null,null,null,null,null,null,null,null,null,"X",null,null,null,null,null,null,null,null,null,null,null,null,"2010-01-10",{"$f":"IF(ISNUMBER(AE:AE),YEAR(AE:AE),AE:AE)","v":2010},{"$f":"IF(AE:AE=\"pas d'actualité\",3,IF(AE:AE=\"?\",\"?\",IF(AE:AE=\"?\",\"?\",IF($B$2-AF:AF>=0,0,IF($B$2-AF:AF>=-1,1,IF($B$2-AF:AF>=-2,2,3))))))","v":0},{"$f":"IF(AE:AE=\"pas d'actualité\",3,IF(AE:AE=\"?\",\"?\",IF(AE:AE=\"?\",\"?\",IF((($B$2+1)-AF:AF)>=0,\"0\",IF((($B$2+1)-AF:AF)>=-1,\"1\",IF((($B$2+1)-AF:AF)>=-2,\"2\",\"3\"))))))","v":"0"},{"$f":"IF(AE:AE=\"pas d'actualité\",3,IF(AE:AE=\"?\",\"?\",IF(AE:AE=\"?\",\"?\",IF((($B$2+2)-AF:AF)>=0,0,IF((($B$2+2)-AF:AF)>=-1,1,IF((($B$2+2)-AF:AF)>=-2,2,3))))))","v":0},{"$f":"IF(AE:AE=\"pas d'actualité\",3,IF(AE:AE=\"?\",\"?\",IF(AE:AE=\"?\",\"?\",IF(($B$2+3)-AF:AF>=0,0,IF(($B$2+3)-AF:AF>=-1,1,IF(($B$2+3)-AF:AF>=-2,2,3))))))","v":0},{"$f":"IF(AE:AE=\"pas d'actualité\",3,IF(AE:AE=\"?\",\"?\",IF(AE:AE=\"?\",\"?\",IF(($B$2+4)-AF:AF>=0,0,IF(($B$2+4)-AF:AF>=-1,1,IF(($B$2+4)-AF:AF>=-2,2,3))))))","v":0},"6ES5955-3LC41"]
["PR11","D11","FAB 11",null,1,null,null,null,null,null,null,null,null,null,null,null,null,"X",null,null,null,null,null,null,null,null,null,null,null,null,"2008-01-10",{"$f":"IF(ISNUMBER(AE:AE),YEAR(AE:AE),AE:AE)","v":2008},{"$f":"IF(AE:AE=\"pas d'actualité\",3,IF(AE:AE=\"?\",\"?\",IF(AE:AE=\"?\",\"?\",IF($B$2-AF:AF>=0,0,IF($B$2-AF:AF>=-1,1,IF($B$2-AF:AF>=-2,2,3))))))","v":0},{"$f":"IF(AE:AE=\"pas d'actualité\",3,IF(AE:AE=\"?\",\"?\",IF(AE:AE=\"?\",\"?\",IF((($B$2+1)-AF:AF)>=0,\"0\",IF((($B$2+1)-AF:AF)>=-1,\"1\",IF((($B$2+1)-AF:AF)>=-2,\"2\",\"3\"))))))","v":"0"},{"$f":"IF(AE:AE=\"pas d'actualité\",3,IF(AE:AE=\"?\",\"?\",IF(AE:AE=\"?\",\"?\",IF((($B$2+2)-AF:AF)>=0,0,IF((($B$2+2)-AF:AF)>=-1,1,IF((($B$2+2)-AF:AF)>=-2,2,3))))))","v":0},{"$f":"IF(AE:AE=\"pas d'actualité\",3,IF(AE:AE=\"?\",\"?\",IF(AE:AE=\"?\",\"?\",IF(($B$2+3)-AF:AF>=0,0,IF(($B$2+3)-AF:AF>=-1,1,IF(($B$2+3)-AF:AF>=-2,2,3))))))","v":0},{"$f":"IF(AE:AE=\"pas d'actualité\",3,IF(AE:AE=\"?\",\"?\",IF(AE:AE=\"?\",\"?\",IF(($B$2+4)-AF:AF>=0,0,IF(($B$2+4)-AF:AF>=-1,1,IF(($B$2+4)-AF:AF>=-2,2,3))))))","v":0}]
["PR12","D12","FAB 12",null,1,null,null,"X","X",null,null,null,null,null,null,null,null,null,null,null,null,null,null,null,null,null,null,null,null,null,"2015-01-10",{"$f":"IF(ISNUMBER(AE:AE),YEAR(AE:AE),AE:AE)","v":2015},{"$f":"IF(AE:AE=\"pas d'actualité\",3,IF(AE:AE=\"?\",\"?\",IF(AE:AE=\"?\",\"?\",IF($B$2-AF:AF>=0,0,IF($B$2-AF:AF>=-1,1,IF($B$2-AF:AF>=-2,2,3))))))","v":0},{"$f":"IF(AE:AE=\"pas d'actualité\",3,IF(AE:AE=\"?\",\"?\",IF(AE:AE=\"?\",\"?\",IF((($B$2+1)-AF:AF)>=0,\"0\",IF((($B$2+1)-AF:AF)>=-1,\"1\",IF((($B$2+1)-AF:AF)>=-2,\"2\",\"3\"))))))","v":"0"},{"$f":"IF(AE:AE=\"pas d'actualité\",3,IF(AE:AE=\"?\",\"?\",IF(AE:AE=\"?\",\"?\",IF((($B$2+2)-AF:AF)>=0,0,IF((($B$2+2)-AF:AF)>=-1,1,IF((($B$2+2)-AF:AF)>=-2,2,3))))))","v":0},{"$f":"IF(AE:AE=\"pas d'actualité\",3,IF(AE:AE=\"?\",\"?\",IF(AE:AE=\"?\",\"?\",IF(($B$2+3)-AF:AF>=0,0,IF(($B$2+3)-AF:AF>=-1,1,IF(($B$2+3)-AF:AF>=-2,2,3))))))","v":0},{"$f":"IF(AE:AE=\"pas d'actualité\",3,IF(AE:AE=\"?\",\"?\",IF(AE:AE=\"?\",\"?\",IF(($B$2+4)-AF:AF>=0,0,IF(($B$2+4)-AF:AF>=-1,1,IF(($B$2+4)-AF:AF>=-2,2,3))))))","v":0},null,null,"ARRET TOTAL FOURNITURE 01/10/2017"]
["PR13","D13","FAB 13",null,1,null,null,"X","X",null,null,null,null,null,null,null,null,null,null,null,null,null,null,null,null,null,null,null,null,null,"2015-01-10",{"$f":"IF(ISNUMBER(AE:AE),YEAR(AE:AE),AE:AE)","v":2015},{"$f":"IF(AE:AE=\"pas d'actualité\",3,IF(AE:AE=\"?\",\"?\",IF(AE:AE=\"?\",\"?\",IF($B$2-AF:AF>=0,0,IF($B$2-AF:AF>=-1,1,IF($B$2-AF:AF>=-2,2,3))))))","v":0},{"$f":"IF(AE:AE=\"pas d'actualité\",3,IF(AE:AE=\"?\",\"?\",IF(AE:AE=\"?\",\"?\",IF((($B$2+1)-AF:AF)>=0,\"0\",IF((($B$2+1)-AF:AF)>=-1,\"1\",IF((($B$2+1)-AF:AF)>=-2,\"2\",\"3\"))))))","v":"0"},{"$f":"IF(AE:AE=\"pas d'actualité\",3,IF(AE:AE=\"?\",\"?\",IF(AE:AE=\"?\",\"?\",IF((($B$2+2)-AF:AF)>=0,0,IF((($B$2+2)-AF:AF)>=-1,1,IF((($B$2+2)-AF:AF)>=-2,2,3))))))","v":0},{"$f":"IF(AE:AE=\"pas d'actualité\",3,IF(AE:AE=\"?\",\"?\",IF(AE:AE=\"?\",\"?\",IF(($B$2+3)-AF:AF>=0,0,IF(($B$2+3)-AF:AF>=-1,1,IF(($B$2+3)-AF:AF>=-2,2,3))))))","v":0},{"$f":"IF(AE:AE=\"pas d'actualité\",3,IF(AE:AE=\"?\",\"?\",IF(AE:AE=\"?\",\"?\",IF(($B$2+4)-AF:AF>=0,0,IF(($B$2+4)-AF:AF>=-1,1,IF(($B$2+4)-AF:AF>=-2,2,3))))))","v":0},null,null,"ARRET TOTAL FOURNITURE 01/10/2017"]
["PR14","D14","FAB 14",null,1,null,null,"X","X",null,null,null,null,null,null,null,null,null,null,null,null,null,null,null,null,null,null,null,null,null,"2015-01-10",{"$f":"IF(ISNUMBER(AE:AE),YEAR(AE:AE),AE:AE)","v":2015},{"$f":"IF(AE:AE=\"pas d'actualité\",3,IF(AE:AE=\"?\",\"?\",IF(AE:AE=\"?\",\"?\",IF($B$2-AF:AF>=0,0,IF($B$2-AF:AF>=-1,1,IF($B$2-AF:AF>=-2,2,3))))))","v":0},{"$f":"IF(AE:AE=\"pas d'actualité\",3,IF(AE:AE=\"?\",\"?\",IF(AE:AE=\"?\",\"?\",IF((($B$2+1)-AF:AF)>=0,\"0\",IF((($B$2+1)-AF:AF)>=-1,\"1\",IF((($B$2+1)-AF:AF)>=-2,\"2\",\"3\"))))))","v":"0"},{"$f":"IF(AE:AE=\"pas d'actualité\",3,IF(AE:AE=\"?\",\"?\",IF(AE:AE=\"?\",\"?\",IF((($B$2+2)-AF:AF)>=0,0,IF((($B$2+2)-AF:AF)>=-1,1,IF((($B$2+2)-AF:AF)>=-2,2,3))))))","v":0},{"$f":"IF(AE:AE=\"pas d'actualité\",3,IF(AE:AE=\"?\",\"?\",IF(AE:AE=\"?\",\"?\",IF(($B$2+3)-AF:AF>=0,0,IF(($B$2+3)-AF:AF>=-1,1,IF(($B$2+3)-AF:AF>=-2,2,3))))))","v":0},{"$f":"IF(AE:AE=\"pas d'actualité\",3,IF(AE:AE=\"?\",\"?\",IF(AE:AE=\"?\",\"?\",IF(($B$2+4)-AF:AF>=0,0,IF(($B$2+4)-AF:AF>=-1,1,IF(($B$2+4)-AF:AF>=-2,2,3))))))","v":0},null,null,"ARRET TOTAL FOURNITURE 01/10/2017"]
["PR15","D15","FAB 15",null,1,null,null,"X","X",null,null,null,null,null,null,null,null,null,null,null,null,null,null,null,null,null,null,null,null,null,"2015-01-10",{"$f":"IF(ISNUMBER(AE:AE),YEAR(AE:AE),AE:AE)","v":2015},{"$f":"IF(AE:AE=\"pas d'actualité\",3,IF(AE:AE=\"?\",\"?\",IF(AE:AE=\"?\",\"?\",IF($B$2-AF:AF>=0,0,IF($B$2-AF:AF>=-1,1,IF($B$2-AF:AF>=-2,2,3))))))","v":0},{"$f":"IF(AE:AE=\"pas d'actualité\",3,IF(AE:AE=\"?\",\"?\",IF(AE:AE=\"?\",\"?\",IF((($B$2+1)-AF:AF)>=0,\"0\",IF((($B$2+1)-AF:AF)>=-1,\"1\",IF((($B$2+1)-AF:AF)>=-2,\"2\",\"3\"))))))","v":"0"},{"$f":"IF(AE:AE=\"pas d'actualité\",3,IF(AE:AE=\"?\",\"?\",IF(AE:AE=\"?\",\"?\",IF((($B$2+2)-AF:AF)>=0,0,IF((($B$2+2)-AF:AF)>=-1,1,IF((($B$2+2)-AF:AF)>=-2,2,3))))))","v":0},{"$f":"IF(AE:AE=\"pas d'actualité\",3,IF(AE:AE=\"?\",\"?\",IF(AE:AE=\"?\",\"?\",IF(($B$2+3)-AF:AF>=0,0,IF(($B$2+3)-AF:AF>=-1,1,IF(($B$2+3)-AF:AF>=-2,2,3))))))","v":0},{"$f":"IF(AE:AE=\"pas d'actualité\",3,IF(AE:AE=\"?\",\"?\",IF(AE:AE=\"?\",\"?\",IF(($B$2+4)-AF:AF>=0,0,IF(($B$2+4)-AF:AF>=-1,1,IF(($B$2+4)-AF:AF>=-2,2,3))))))","v":0},null,null,"cette référence Siemens est en fin de commercialisation, normalement des modules destinés à la réparation sont encore disponibles jusqu'au milieu de cette année 2015 ARRET TOTAL FOURNITURE 01/10/2017"]
["PR16","D16","FAB 16",null,1,null,null,"X","X",null,null,null,null,null,null,null,null,null,null,null,null,null,null,null,null,null,null,null,null,null,"2015-01-10",{"$f":"IF(ISNUMBER(AE:AE),YEAR(AE:AE),AE:AE)","v":2015},{"$f":"IF(AE:AE=\"pas d'actualité\",3,IF(AE:AE=\"?\",\"?\",IF(AE:AE=\"?\",\"?\",IF($B$2-AF:AF>=0,0,IF($B$2-AF:AF>=-1,1,IF($B$2-AF:AF>=-2,2,3))))))","v":0},{"$f":"IF(AE:AE=\"pas d'actualité\",3,IF(AE:AE=\"?\",\"?\",IF(AE:AE=\"?\",\"?\",IF((($B$2+1)-AF:AF)>=0,\"0\",IF((($B$2+1)-AF:AF)>=-1,\"1\",IF((($B$2+1)-AF:AF)>=-2,\"2\",\"3\"))))))","v":"0"},{"$f":"IF(AE:AE=\"pas d'actualité\",3,IF(AE:AE=\"?\",\"?\",IF(AE:AE=\"?\",\"?\",IF((($B$2+2)-AF:AF)>=0,0,IF((($B$2+2)-AF:AF)>=-1,1,IF((($B$2+2)-AF:AF)>=-2,2,3))))))","v":0},{"$f":"IF(AE:AE=\"pas d'actualité\",3,IF(AE:AE=\"?\",\"?\",IF(AE:AE=\"?\",\"?\",IF(($B$2+3)-AF:AF>=0,0,IF(($B$2+3)-AF:AF>=-1,1,IF(($B$2+3)-AF:AF>=-2,2,3))))))","v":0},{"$f":"IF(AE:AE=\"pas d'actualité\",3,IF(AE:AE=\"?\",\"?\",IF(AE:AE=\"?\",\"?\",IF(($B$2+4)-AF:AF>=0,0,IF(($B$2+4)-AF:AF>=-1,1,IF(($B$2+4)-AF:AF>=-2,2,3))))))","v":0},null,null,"ARRET TOTAL FOURNITURE 01/10/2017"]
["PR17","D17","FAB 17",null,1,null,null,"X","X",null,null,null,null,null,null,null,null,null,null,null,null,null,null,null,null,null,null,null,null,null,"2015-01-10",{"$f":"IF(ISNUMBER(AE:AE),YEAR(AE:AE),AE:AE)","v":2015},{"$f":"IF(AE:AE=\"pas d'actualité\",3,IF(AE:AE=\"?\",\"?\",IF(AE:AE=\"?\",\"?\",IF($B$2-AF:AF>=0,0,IF($B$2-AF:AF>=-1,1,IF($B$2-AF:AF>=-2,2,3))))))","v":0},{"$f":"IF(AE:AE=\"pas d'actualité\",3,IF(AE:AE=\"?\",\"?\",IF(AE:AE=\"?\",\"?\",IF((($B$2+1)-AF:AF)>=0,\"0\",IF((($B$2+1)-AF:AF)>=-1,\"1\",IF((($B$2+1)-AF:AF)>=-2,\"2\",\"3\"))))))","v":"0"},{"$f":"IF(AE:AE=\"pas d'actualité\",3,IF(AE:AE=\"?\",\"?\",IF(AE:AE=\"?\",\"?\",IF((($B$2+2)-AF:AF)>=0,0,IF((($B$2+2)-AF:AF)>=-1,1,IF((($B$2+2)-AF:AF)>=-2,2,3))))))","v":0},{"$f":"IF(AE:AE=\"pas d'actualité\",3,IF(AE:AE=\"?\",\"?\",IF(AE:AE=\"?\",\"?\",IF(($B$2+3)-AF:AF>=0,0,IF(($B$2+3)-AF:AF>=-1,1,IF(($B$2+3)-AF:AF>=-2,2,3))))))","v":0},{"$f":"IF(AE:AE=\"pas d'actualité\",3,IF(AE:AE=\"?\",\"?\",IF(AE:AE=\"?\",\"?\",IF(($B$2+4)-AF:AF>=0,0,IF(($B$2+4)-AF:AF>=-1,1,IF(($B$2+4)-AF:AF>=-2,2,3))))))","v":0},null,null,"ARRET TOTAL FOURNITURE 01/10/2017"]
["PR18","D18","FAB 18",null,null,null,null,null,null,null,null,null,null,null,null,null,null,null,null,null,null,null,null,null,null,null,null,null,null,null,"2011-01-10",{"$f":"IF(ISNUMBER(AE:AE),YEAR(AE:AE),AE:AE)","v":2011},{"$f":"IF(AE:AE=\"pas d'actualité\",3,IF(AE:AE=\"?\",\"?\",IF(AE:AE=\"?\",\"?\",IF($B$2-AF:AF>=0,0,IF($B$2-AF:AF>=-1,1,IF($B$2-AF:AF>=-2,2,3))))))","v":0},{"$f":"IF(AE:AE=\"pas d'actualité\",3,IF(AE:AE=\"?\",\"?\",IF(AE:AE=\"?\",\"?\",IF((($B$2+1)-AF:AF)>=0,\"0\",IF((($B$2+1)-AF:AF)>=-1,\"1\",IF((($B$2+1)-AF:AF)>=-2,\"2\",\"3\"))))))","v":"0"},{"$f":"IF(AE:AE=\"pas d'actualité\",3,IF(AE:AE=\"?\",\"?\",IF(AE:AE=\"?\",\"?\",IF((($B$2+2)-AF:AF)>=0,0,IF((($B$2+2)-AF:AF)>=-1,1,IF((($B$2+2)-AF:AF)>=-2,2,3))))))","v":0},{"$f":"IF(AE:AE=\"pas d'actualité\",3,IF(AE:AE=\"?\",\"?\",IF(AE:AE=\"?\",\"?\",IF(($B$2+3)-AF:AF>=0,0,IF(($B$2+3)-AF:AF>=-1,1,IF(($B$2+3)-AF:AF>=-2,2,3))))))","v":0},{"$f":"IF(AE:AE=\"pas d'actualité\",3,IF(AE:AE=\"?\",\"?\",IF(AE:AE=\"?\",\"?\",IF(($B$2+4)-AF:AF>=0,0,IF(($B$2+4)-AF:AF>=-1,1,IF(($B$2+4)-AF:AF>=-2,2,3))))))","v":0},"6ES7307-1EA01-0AA0"]
["PR19","D19","FAB 19",null,null,null,null,null,null,null,null,null,null,null,null,null,null,null,null,null,null,null,null,null,null,null,null,null,null,null,"2010-01-10",{"$f":"IF(ISNUMBER(AE:AE),YEAR(AE:AE),AE:AE)","v":2010},{"$f":"IF(AE:AE=\"pas d'actualité\",3,IF(AE:AE=\"?\",\"?\",IF(AE:AE=\"?\",\"?\",IF($B$2-AF:AF>=0,0,IF($B$2-AF:AF>=-1,1,IF($B$2-AF:AF>=-2,2,3))))))","v":0},{"$f":"IF(AE:AE=\"pas d'actualité\",3,IF(AE:AE=\"?\",\"?\",IF(AE:AE=\"?\",\"?\",IF((($B$2+1)-AF:AF)>=0,\"0\",IF((($B$2+1)-AF:AF)>=-1,\"1\",IF((($B$2+1)-AF:AF)>=-2,\"2\",\"3\"))))))","v":"0"},{"$f":"IF(AE:AE=\"pas d'actualité\",3,IF(AE:AE=\"?\",\"?\",IF(AE:AE=\"?\",\"?\",IF((($B$2+2)-AF:AF)>=0,0,IF((($B$2+2)-AF:AF)>=-1,1,IF((($B$2+2)-AF:AF)>=-2,2,3))))))","v":0},{"$f":"IF(AE:AE=\"pas d'actualité\",3,IF(AE:AE=\"?\",\"?\",IF(AE:AE=\"?\",\"?\",IF(($B$2+3)-AF:AF>=0,0,IF(($B$2+3)-AF:AF>=-1,1,IF(($B$2+3)-AF:AF>=-2,2,3))))))","v":0},{"$f":"IF(AE:AE=\"pas d'actualité\",3,IF(AE:AE=\"?\",\"?\",IF(AE:AE=\"?\",\"?\",IF(($B$2+4)-AF:AF>=0,0,IF(($B$2+4)-AF:AF>=-1,1,IF(($B$2+4)-AF:AF>=-2,2,3))))))","v":0},"6ES7313-5BG03-0AB0"]
["PR20","D20","FAB 20",null,1,null,null,"X","X",null,null,null,null,null,null,null,null,null,null,null,null,null,null,null,null,null,null,null,null,null,"2013-01-10",{"$f":"IF(ISNUMBER(AE:AE),YEAR(AE:AE),AE:AE)","v":2013},{"$f":"IF(AE:AE=\"pas d'actualité\",3,IF(AE:AE=\"?\",\"?\",IF(AE:AE=\"?\",\"?\",IF($B$2-AF:AF>=0,0,IF($B$2-AF:AF>=-1,1,IF($B$2-AF:AF>=-2,2,3))))))","v":0},{"$f":"IF(AE:AE=\"pas d'actualité\",3,IF(AE:AE=\"?\",\"?\",IF(AE:AE=\"?\",\"?\",IF((($B$2+1)-AF:AF)>=0,\"0\",IF((($B$2+1)-AF:AF)>=-1,\"1\",IF((($B$2+1)-AF:AF)>=-2,\"2\",\"3\"))))))","v":"0"},{"$f":"IF(AE:AE=\"pas d'actualité\",3,IF(AE:AE=\"?\",\"?\",IF(AE:AE=\"?\",\"?\",IF((($B$2+2)-AF:AF)>=0,0,IF((($B$2+2)-AF:AF)>=-1,1,IF((($B$2+2)-AF:AF)>=-2,2,3))))))","v":0},{"$f":"IF(AE:AE=\"pas d'actualité\",3,IF(AE:AE=\"?\",\"?\",IF(AE:AE=\"?\",\"?\",IF(($B$2+3)-AF:AF>=0,0,IF(($B$2+3)-AF:AF>=-1,1,IF(($B$2+3)-AF:AF>=-2,2,3))))))","v":0},{"$f":"IF(AE:AE=\"pas d'actualité\",3,IF(AE:AE=\"?\",\"?\",IF(AE:AE=\"?\",\"?\",IF(($B$2+4)-AF:AF>=0,0,IF(($B$2+4)-AF:AF>=-1,1,IF(($B$2+4)-AF:AF>=-2,2,3))))))","v":0},"SUCCESSOR: 6ES7315-2AG10-0AB0. COMPATABILITY NOTES SEE SERVICE&SUPPORT ENTRY ID 14845044"]
["PR21","D21","FAB 21",null,1,null,null,"X","X",null,null,null,null,null,null,null,null,null,null,null,null,null,null,null,null,null,null,null,null,null,"2007-01-10",{"$f":"IF(ISNUMBER(AE:AE),YEAR(AE:AE),AE:AE)","v":2007},{"$f":"IF(AE:AE=\"pas d'actualité\",3,IF(AE:AE=\"?\",\"?\",IF(AE:AE=\"?\",\"?\",IF($B$2-AF:AF>=0,0,IF($B$2-AF:AF>=-1,1,IF($B$2-AF:AF>=-2,2,3))))))","v":0},{"$f":"IF(AE:AE=\"pas d'actualité\",3,IF(AE:AE=\"?\",\"?\",IF(AE:AE=\"?\",\"?\",IF((($B$2+1)-AF:AF)>=0,\"0\",IF((($B$2+1)-AF:AF)>=-1,\"1\",IF((($B$2+1)-AF:AF)>=-2,\"2\",\"3\"))))))","v":"0"},{"$f":"IF(AE:AE=\"pas d'actualité\",3,IF(AE:AE=\"?\",\"?\",IF(AE:AE=\"?\",\"?\",IF((($B$2+2)-AF:AF)>=0,0,IF((($B$2+2)-AF:AF)>=-1,1,IF((($B$2+2)-AF:AF)>=-2,2,3))))))","v":0},{"$f":"IF(AE:AE=\"pas d'actualité\",3,IF(AE:AE=\"?\",\"?\",IF(AE:AE=\"?\",\"?\",IF(($B$2+3)-AF:AF>=0,0,IF(($B$2+3)-AF:AF>=-1,1,IF(($B$2+3)-AF:AF>=-2,2,3))))))","v":0},{"$f":"IF(AE:AE=\"pas d'actualité\",3,IF(AE:AE=\"?\",\"?\",IF(AE:AE=\"?\",\"?\",IF(($B$2+4)-AF:AF>=0,0,IF(($B$2+4)-AF:AF>=-1,1,IF(($B$2+4)-AF:AF>=-2,2,3))))))","v":0},"6ES7340-1AH02-0AE0",null,"reparation/pièce de rechange seulement sous garantie ARRET TOTAL FOURNITURE 01/10/2012"]
["PR22","D22","FAB 22",null,1,null,null,"X",null,null,null,null,null,null,null,null,null,null,null,null,null,null,null,null,null,null,null,null,null,null,"2013-05-11",{"$f":"IF(ISNUMBER(AE:AE),YEAR(AE:AE),AE:AE)","v":2013},{"$f":"IF(AE:AE=\"pas d'actualité\",3,IF(AE:AE=\"?\",\"?\",IF(AE:AE=\"?\",\"?\",IF($B$2-AF:AF>=0,0,IF($B$2-AF:AF>=-1,1,IF($B$2-AF:AF>=-2,2,3))))))","v":0},{"$f":"IF(AE:AE=\"pas d'actualité\",3,IF(AE:AE=\"?\",\"?\",IF(AE:AE=\"?\",\"?\",IF((($B$2+1)-AF:AF)>=0,\"0\",IF((($B$2+1)-AF:AF)>=-1,\"1\",IF((($B$2+1)-AF:AF)>=-2,\"2\",\"3\"))))))","v":"0"},{"$f":"IF(AE:AE=\"pas d'actualité\",3,IF(AE:AE=\"?\",\"?\",IF(AE:AE=\"?\",\"?\",IF((($B$2+2)-AF:AF)>=0,0,IF((($B$2+2)-AF:AF)>=-1,1,IF((($B$2+2)-AF:AF)>=-2,2,3))))))","v":0},{"$f":"IF(AE:AE=\"pas d'actualité\",3,IF(AE:AE=\"?\",\"?\",IF(AE:AE=\"?\",\"?\",IF(($B$2+3)-AF:AF>=0,0,IF(($B$2+3)-AF:AF>=-1,1,IF(($B$2+3)-AF:AF>=-2,2,3))))))","v":0},{"$f":"IF(AE:AE=\"pas d'actualité\",3,IF(AE:AE=\"?\",\"?\",IF(AE:AE=\"?\",\"?\",IF(($B$2+4)-AF:AF>=0,0,IF(($B$2+4)-AF:AF>=-1,1,IF(($B$2+4)-AF:AF>=-2,2,3))))))","v":0},"Tableau de commande/écran plat 6FC5203-0AB20-1AA3 ","Partiellement compatible"]
["PR23","D23","FAB 23",null,1,null,null,null,null,null,null,null,null,null,null,null,null,null,null,null,null,null,null,null,null,"X",null,null,null,null,"2016-09-30",{"$f":"IF(ISNUMBER(AE:AE),YEAR(AE:AE),AE:AE)","v":2016},{"$f":"IF(AE:AE=\"pas d'actualité\",3,IF(AE:AE=\"?\",\"?\",IF(AE:AE=\"?\",\"?\",IF($B$2-AF:AF>=0,0,IF($B$2-AF:AF>=-1,1,IF($B$2-AF:AF>=-2,2,3))))))","v":0},{"$f":"IF(AE:AE=\"pas d'actualité\",3,IF(AE:AE=\"?\",\"?\",IF(AE:AE=\"?\",\"?\",IF((($B$2+1)-AF:AF)>=0,\"0\",IF((($B$2+1)-AF:AF)>=-1,\"1\",IF((($B$2+1)-AF:AF)>=-2,\"2\",\"3\"))))))","v":"0"},{"$f":"IF(AE:AE=\"pas d'actualité\",3,IF(AE:AE=\"?\",\"?\",IF(AE:AE=\"?\",\"?\",IF((($B$2+2)-AF:AF)>=0,0,IF((($B$2+2)-AF:AF)>=-1,1,IF((($B$2+2)-AF:AF)>=-2,2,3))))))","v":0},{"$f":"IF(AE:AE=\"pas d'actualité\",3,IF(AE:AE=\"?\",\"?\",IF(AE:AE=\"?\",\"?\",IF(($B$2+3)-AF:AF>=0,0,IF(($B$2+3)-AF:AF>=-1,1,IF(($B$2+3)-AF:AF>=-2,2,3))))))","v":0},{"$f":"IF(AE:AE=\"pas d'actualité\",3,IF(AE:AE=\"?\",\"?\",IF(AE:AE=\"?\",\"?\",IF(($B$2+4)-AF:AF>=0,0,IF(($B$2+4)-AF:AF>=-1,1,IF(($B$2+4)-AF:AF>=-2,2,3))))))","v":0},"6FC5210-0DF31-2AB0","Partiellement compatible","Seulement sous pièces détachées ARRET TOTAL FOURNITURE 30/09/2018"]
["PR24","D24","FAB 24",null,null,null,null,"X","X",null,null,null,null,null,null,null,null,null,null,null,null,null,null,null,null,null,null,null,null,null,"2004-07-06",{"$f":"IF(ISNUMBER(AE:AE),YEAR(AE:AE),AE:AE)","v":2004},{"$f":"IF(AE:AE=\"pas d'actualité\",3,IF(AE:AE=\"?\",\"?\",IF(AE:AE=\"?\",\"?\",IF($B$2-AF:AF>=0,0,IF($B$2-AF:AF>=-1,1,IF($B$2-AF:AF>=-2,2,3))))))","v":0},{"$f":"IF(AE:AE=\"pas d'actualité\",3,IF(AE:AE=\"?\",\"?\",IF(AE:AE=\"?\",\"?\",IF((($B$2+1)-AF:AF)>=0,\"0\",IF((($B$2+1)-AF:AF)>=-1,\"1\",IF((($B$2+1)-AF:AF)>=-2,\"2\",\"3\"))))))","v":"0"},{"$f":"IF(AE:AE=\"pas d'actualité\",3,IF(AE:AE=\"?\",\"?\",IF(AE:AE=\"?\",\"?\",IF((($B$2+2)-AF:AF)>=0,0,IF((($B$2+2)-AF:AF)>=-1,1,IF((($B$2+2)-AF:AF)>=-2,2,3))))))","v":0},{"$f":"IF(AE:AE=\"pas d'actualité\",3,IF(AE:AE=\"?\",\"?\",IF(AE:AE=\"?\",\"?\",IF(($B$2+3)-AF:AF>=0,0,IF(($B$2+3)-AF:AF>=-1,1,IF(($B$2+3)-AF:AF>=-2,2,3))))))","v":0},{"$f":"IF(AE:AE=\"pas d'actualité\",3,IF(AE:AE=\"?\",\"?\",IF(AE:AE=\"?\",\"?\",IF(($B$2+4)-AF:AF>=0,0,IF(($B$2+4)-AF:AF>=-1,1,IF(($B$2+4)-AF:AF>=-2,2,3))))))","v":0},"6FC5247-0AA00-0AA3","Entièrement compatible","ARRET TOTAL FOURNITURE 06/07/2004"]
["PR25","D25","FAB 25",null,null,null,null,"X","X",null,null,null,null,null,null,null,null,null,null,null,null,null,null,null,null,null,null,null,null,null,"2016-09-30",{"$f":"IF(ISNUMBER(AE:AE),YEAR(AE:AE),AE:AE)","v":2016},{"$f":"IF(AE:AE=\"pas d'actualité\",3,IF(AE:AE=\"?\",\"?\",IF(AE:AE=\"?\",\"?\",IF($B$2-AF:AF>=0,0,IF($B$2-AF:AF>=-1,1,IF($B$2-AF:AF>=-2,2,3))))))","v":0},{"$f":"IF(AE:AE=\"pas d'actualité\",3,IF(AE:AE=\"?\",\"?\",IF(AE:AE=\"?\",\"?\",IF((($B$2+1)-AF:AF)>=0,\"0\",IF((($B$2+1)-AF:AF)>=-1,\"1\",IF((($B$2+1)-AF:AF)>=-2,\"2\",\"3\"))))))","v":"0"},{"$f":"IF(AE:AE=\"pas d'actualité\",3,IF(AE:AE=\"?\",\"?\",IF(AE:AE=\"?\",\"?\",IF((($B$2+2)-AF:AF)>=0,0,IF((($B$2+2)-AF:AF)>=-1,1,IF((($B$2+2)-AF:AF)>=-2,2,3))))))","v":0},{"$f":"IF(AE:AE=\"pas d'actualité\",3,IF(AE:AE=\"?\",\"?\",IF(AE:AE=\"?\",\"?\",IF(($B$2+3)-AF:AF>=0,0,IF(($B$2+3)-AF:AF>=-1,1,IF(($B$2+3)-AF:AF>=-2,2,3))))))","v":0},{"$f":"IF(AE:AE=\"pas d'actualité\",3,IF(AE:AE=\"?\",\"?\",IF(AE:AE=\"?\",\"?\",IF(($B$2+4)-AF:AF>=0,0,IF(($B$2+4)-AF:AF>=-1,1,IF(($B$2+4)-AF:AF>=-2,2,3))))))","v":0},"SEULEMENT PIECES DETACHEES","Pas de successeur","ARRET TOTAL FOURNITURE 30/09/2018"]
["PR26","D26","FAB 26",null,1,null,null,"X","X",null,null,null,null,null,null,null,null,null,null,null,null,null,null,null,null,null,null,null,null,null,"2015-09-30",{"$f":"IF(ISNUMBER(AE:AE),YEAR(AE:AE),AE:AE)","v":2015},{"$f":"IF(AE:AE=\"pas d'actualité\",3,IF(AE:AE=\"?\",\"?\",IF(AE:AE=\"?\",\"?\",IF($B$2-AF:AF>=0,0,IF($B$2-AF:AF>=-1,1,IF($B$2-AF:AF>=-2,2,3))))))","v":0},{"$f":"IF(AE:AE=\"pas d'actualité\",3,IF(AE:AE=\"?\",\"?\",IF(AE:AE=\"?\",\"?\",IF((($B$2+1)-AF:AF)>=0,\"0\",IF((($B$2+1)-AF:AF)>=-1,\"1\",IF((($B$2+1)-AF:AF)>=-2,\"2\",\"3\"))))))","v":"0"},{"$f":"IF(AE:AE=\"pas d'actualité\",3,IF(AE:AE=\"?\",\"?\",IF(AE:AE=\"?\",\"?\",IF((($B$2+2)-AF:AF)>=0,0,IF((($B$2+2)-AF:AF)>=-1,1,IF((($B$2+2)-AF:AF)>=-2,2,3))))))","v":0},{"$f":"IF(AE:AE=\"pas d'actualité\",3,IF(AE:AE=\"?\",\"?\",IF(AE:AE=\"?\",\"?\",IF(($B$2+3)-AF:AF>=0,0,IF(($B$2+3)-AF:AF>=-1,1,IF(($B$2+3)-AF:AF>=-2,2,3))))))","v":0},{"$f":"IF(AE:AE=\"pas d'actualité\",3,IF(AE:AE=\"?\",\"?\",IF(AE:AE=\"?\",\"?\",IF(($B$2+4)-AF:AF>=0,0,IF(($B$2+4)-AF:AF>=-1,1,IF(($B$2+4)-AF:AF>=-2,2,3))))))","v":0},"6FC5357-0BB33-0AE3","Partiellement compatible"]
["PR27","D27","FAB 27",null,null,null,null,null,null,null,null,"X",null,null,null,null,null,null,null,null,null,null,null,null,null,null,null,null,null,null,"2013-02-22",{"$f":"IF(ISNUMBER(AE:AE),YEAR(AE:AE),AE:AE)","v":2013},{"$f":"IF(AE:AE=\"pas d'actualité\",3,IF(AE:AE=\"?\",\"?\",IF(AE:AE=\"?\",\"?\",IF($B$2-AF:AF>=0,0,IF($B$2-AF:AF>=-1,1,IF($B$2-AF:AF>=-2,2,3))))))","v":0},{"$f":"IF(AE:AE=\"pas d'actualité\",3,IF(AE:AE=\"?\",\"?\",IF(AE:AE=\"?\",\"?\",IF((($B$2+1)-AF:AF)>=0,\"0\",IF((($B$2+1)-AF:AF)>=-1,\"1\",IF((($B$2+1)-AF:AF)>=-2,\"2\",\"3\"))))))","v":"0"},{"$f":"IF(AE:AE=\"pas d'actualité\",3,IF(AE:AE=\"?\",\"?\",IF(AE:AE=\"?\",\"?\",IF((($B$2+2)-AF:AF)>=0,0,IF((($B$2+2)-AF:AF)>=-1,1,IF((($B$2+2)-AF:AF)>=-2,2,3))))))","v":0},{"$f":"IF(AE:AE=\"pas d'actualité\",3,IF(AE:AE=\"?\",\"?\",IF(AE:AE=\"?\",\"?\",IF(($B$2+3)-AF:AF>=0,0,IF(($B$2+3)-AF:AF>=-1,1,IF(($B$2+3)-AF:AF>=-2,2,3))))))","v":0},{"$f":"IF(AE:AE=\"pas d'actualité\",3,IF(AE:AE=\"?\",\"?\",IF(AE:AE=\"?\",\"?\",IF(($B$2+4)-AF:AF>=0,0,IF(($B$2+4)-AF:AF>=-1,1,IF(($B$2+4)-AF:AF>=-2,2,3))))))","v":0},"6SL3100-1AE31-0AB1","Entièrement compatible"]
["PR28","D28","FAB 28",null,1,null,null,null,null,null,"X",null,"X",null,null,null,null,null,null,null,null,null,null,null,null,null,null,null,null,null,"2010-01-04",{"$f":"IF(ISNUMBER(AE:AE),YEAR(AE:AE),AE:AE)","v":2010},{"$f":"IF(AE:AE=\"pas d'actualité\",3,IF(AE:AE=\"?\",\"?\",IF(AE:AE=\"?\",\"?\",IF($B$2-AF:AF>=0,0,IF($B$2-AF:AF>=-1,1,IF($B$2-AF:AF>=-2,2,3))))))","v":0},{"$f":"IF(AE:AE=\"pas d'actualité\",3,IF(AE:AE=\"?\",\"?\",IF(AE:AE=\"?\",\"?\",IF((($B$2+1)-AF:AF)>=0,\"0\",IF((($B$2+1)-AF:AF)>=-1,\"1\",IF((($B$2+1)-AF:AF)>=-2,\"2\",\"3\"))))))","v":"0"},{"$f":"IF(AE:AE=\"pas d'actualité\",3,IF(AE:AE=\"?\",\"?\",IF(AE:AE=\"?\",\"?\",IF((($B$2+2)-AF:AF)>=0,0,IF((($B$2+2)-AF:AF)>=-1,1,IF((($B$2+2)-AF:AF)>=-2,2,3))))))","v":0},{"$f":"IF(AE:AE=\"pas d'actualité\",3,IF(AE:AE=\"?\",\"?\",IF(AE:AE=\"?\",\"?\",IF(($B$2+3)-AF:AF>=0,0,IF(($B$2+3)-AF:AF>=-1,1,IF(($B$2+3)-AF:AF>=-2,2,3))))))","v":0},{"$f":"IF(AE:AE=\"pas d'actualité\",3,IF(AE:AE=\"?\",\"?\",IF(AE:AE=\"?\",\"?\",IF(($B$2+4)-AF:AF>=0,0,IF(($B$2+4)-AF:AF>=-1,1,IF(($B$2+4)-AF:AF>=-2,2,3))))))","v":0},null,null,"REP. TYPE: 6SL3000-0BE23-6AA0(FI),6SN1111-0AA00-0CA1(DR),6SN1162-0GA00-0CA0(ADP) ARRET TOTAL FOURNITURE 01/04/2010"]
["PR29","D29","FAB 29",null,null,null,null,"X",null,null,null,null,null,null,null,null,null,null,null,null,null,null,null,null,null,null,null,null,null,null,"2006-01-04",{"$f":"IF(ISNUMBER(AE:AE),YEAR(AE:AE),AE:AE)","v":2006},{"$f":"IF(AE:AE=\"pas d'actualité\",3,IF(AE:AE=\"?\",\"?\",IF(AE:AE=\"?\",\"?\",IF($B$2-AF:AF>=0,0,IF($B$2-AF:AF>=-1,1,IF($B$2-AF:AF>=-2,2,3))))))","v":0},{"$f":"IF(AE:AE=\"pas d'actualité\",3,IF(AE:AE=\"?\",\"?\",IF(AE:AE=\"?\",\"?\",IF((($B$2+1)-AF:AF)>=0,\"0\",IF((($B$2+1)-AF:AF)>=-1,\"1\",IF((($B$2+1)-AF:AF)>=-2,\"2\",\"3\"))))))","v":"0"},{"$f":"IF(AE:AE=\"pas d'actualité\",3,IF(AE:AE=\"?\",\"?\",IF(AE:AE=\"?\",\"?\",IF((($B$2+2)-AF:AF)>=0,0,IF((($B$2+2)-AF:AF)>=-1,1,IF((($B$2+2)-AF:AF)>=-2,2,3))))))","v":0},{"$f":"IF(AE:AE=\"pas d'actualité\",3,IF(AE:AE=\"?\",\"?\",IF(AE:AE=\"?\",\"?\",IF(($B$2+3)-AF:AF>=0,0,IF(($B$2+3)-AF:AF>=-1,1,IF(($B$2+3)-AF:AF>=-2,2,3))))))","v":0},{"$f":"IF(AE:AE=\"pas d'actualité\",3,IF(AE:AE=\"?\",\"?\",IF(AE:AE=\"?\",\"?\",IF(($B$2+4)-AF:AF>=0,0,IF(($B$2+4)-AF:AF>=-1,1,IF(($B$2+4)-AF:AF>=-2,2,3))))))","v":0},"6SN1111-0AA01-1BA1",null,"plus disponible ARRET TOTAL FOURNITURE 30/04/2008"]
["PR30","D30","FAB 30",null,null,null,null,"X","X",null,null,null,null,null,null,null,null,null,null,null,null,null,null,null,null,null,null,null,null,null,"2008-09-30",{"$f":"IF(ISNUMBER(AE:AE),YEAR(AE:AE),AE:AE)","v":2008},{"$f":"IF(AE:AE=\"pas d'actualité\",3,IF(AE:AE=\"?\",\"?\",IF(AE:AE=\"?\",\"?\",IF($B$2-AF:AF>=0,0,IF($B$2-AF:AF>=-1,1,IF($B$2-AF:AF>=-2,2,3))))))","v":0},{"$f":"IF(AE:AE=\"pas d'actualité\",3,IF(AE:AE=\"?\",\"?\",IF(AE:AE=\"?\",\"?\",IF((($B$2+1)-AF:AF)>=0,\"0\",IF((($B$2+1)-AF:AF)>=-1,\"1\",IF((($B$2+1)-AF:AF)>=-2,\"2\",\"3\"))))))","v":"0"},{"$f":"IF(AE:AE=\"pas d'actualité\",3,IF(AE:AE=\"?\",\"?\",IF(AE:AE=\"?\",\"?\",IF((($B$2+2)-AF:AF)>=0,0,IF((($B$2+2)-AF:AF)>=-1,1,IF((($B$2+2)-AF:AF)>=-2,2,3))))))","v":0},{"$f":"IF(AE:AE=\"pas d'actualité\",3,IF(AE:AE=\"?\",\"?\",IF(AE:AE=\"?\",\"?\",IF(($B$2+3)-AF:AF>=0,0,IF(($B$2+3)-AF:AF>=-1,1,IF(($B$2+3)-AF:AF>=-2,2,3))))))","v":0},{"$f":"IF(AE:AE=\"pas d'actualité\",3,IF(AE:AE=\"?\",\"?\",IF(AE:AE=\"?\",\"?\",IF(($B$2+4)-AF:AF>=0,0,IF(($B$2+4)-AF:AF>=-1,1,IF(($B$2+4)-AF:AF>=-2,2,3))))))","v":0},"UPGRADE SERVICE 6SN1118-0DG21-0AA1",null,"ARRET TOTAL FOURNITURE 30/09/2010"]
["PR31","D31","FAB 31",null,1,null,null,"X","X",null,null,null,null,null,null,null,null,null,null,null,null,null,null,null,null,null,null,null,null,null,"2016-09-30",{"$f":"IF(ISNUMBER(AE:AE),YEAR(AE:AE),AE:AE)","v":2016},{"$f":"IF(AE:AE=\"pas d'actualité\",3,IF(AE:AE=\"?\",\"?\",IF(AE:AE=\"?\",\"?\",IF($B$2-AF:AF>=0,0,IF($B$2-AF:AF>=-1,1,IF($B$2-AF:AF>=-2,2,3))))))","v":0},{"$f":"IF(AE:AE=\"pas d'actualité\",3,IF(AE:AE=\"?\",\"?\",IF(AE:AE=\"?\",\"?\",IF((($B$2+1)-AF:AF)>=0,\"0\",IF((($B$2+1)-AF:AF)>=-1,\"1\",IF((($B$2+1)-AF:AF)>=-2,\"2\",\"3\"))))))","v":"0"},{"$f":"IF(AE:AE=\"pas d'actualité\",3,IF(AE:AE=\"?\",\"?\",IF(AE:AE=\"?\",\"?\",IF((($B$2+2)-AF:AF)>=0,0,IF((($B$2+2)-AF:AF)>=-1,1,IF((($B$2+2)-AF:AF)>=-2,2,3))))))","v":0},{"$f":"IF(AE:AE=\"pas d'actualité\",3,IF(AE:AE=\"?\",\"?\",IF(AE:AE=\"?\",\"?\",IF(($B$2+3)-AF:AF>=0,0,IF(($B$2+3)-AF:AF>=-1,1,IF(($B$2+3)-AF:AF>=-2,2,3))))))","v":0},{"$f":"IF(AE:AE=\"pas d'actualité\",3,IF(AE:AE=\"?\",\"?\",IF(AE:AE=\"?\",\"?\",IF(($B$2+4)-AF:AF>=0,0,IF(($B$2+4)-AF:AF>=-1,1,IF(($B$2+4)-AF:AF>=-2,2,3))))))","v":0},"6SN1118-0DJ21-0AA1, AB NC SOFTWARE 6.4.9","Entièrement compatible"]
["PR32","D32","FAB 32",null,1,null,null,"X","X",null,null,null,null,null,null,null,null,null,null,null,null,null,null,null,null,null,null,null,null,null,"2016-09-30",{"$f":"IF(ISNUMBER(AE:AE),YEAR(AE:AE),AE:AE)","v":2016},{"$f":"IF(AE:AE=\"pas d'actualité\",3,IF(AE:AE=\"?\",\"?\",IF(AE:AE=\"?\",\"?\",IF($B$2-AF:AF>=0,0,IF($B$2-AF:AF>=-1,1,IF($B$2-AF:AF>=-2,2,3))))))","v":0},{"$f":"IF(AE:AE=\"pas d'actualité\",3,IF(AE:AE=\"?\",\"?\",IF(AE:AE=\"?\",\"?\",IF((($B$2+1)-AF:AF)>=0,\"0\",IF((($B$2+1)-AF:AF)>=-1,\"1\",IF((($B$2+1)-AF:AF)>=-2,\"2\",\"3\"))))))","v":"0"},{"$f":"IF(AE:AE=\"pas d'actualité\",3,IF(AE:AE=\"?\",\"?\",IF(AE:AE=\"?\",\"?\",IF((($B$2+2)-AF:AF)>=0,0,IF((($B$2+2)-AF:AF)>=-1,1,IF((($B$2+2)-AF:AF)>=-2,2,3))))))","v":0},{"$f":"IF(AE:AE=\"pas d'actualité\",3,IF(AE:AE=\"?\",\"?\",IF(AE:AE=\"?\",\"?\",IF(($B$2+3)-AF:AF>=0,0,IF(($B$2+3)-AF:AF>=-1,1,IF(($B$2+3)-AF:AF>=-2,2,3))))))","v":0},{"$f":"IF(AE:AE=\"pas d'actualité\",3,IF(AE:AE=\"?\",\"?\",IF(AE:AE=\"?\",\"?\",IF(($B$2+4)-AF:AF>=0,0,IF(($B$2+4)-AF:AF>=-1,1,IF(($B$2+4)-AF:AF>=-2,2,3))))))","v":0},"6SN1118-0DK21-0AA1 FUER 810D/840D AB NC SW 6.4.9","Entièrement compatible"]
["PR33","D33","FAB 33",null,1,null,null,"X","X",null,null,null,null,null,null,null,null,null,null,null,null,null,null,null,null,null,null,null,null,null,"2016-09-30",{"$f":"IF(ISNUMBER(AE:AE),YEAR(AE:AE),AE:AE)","v":2016},{"$f":"IF(AE:AE=\"pas d'actualité\",3,IF(AE:AE=\"?\",\"?\",IF(AE:AE=\"?\",\"?\",IF($B$2-AF:AF>=0,0,IF($B$2-AF:AF>=-1,1,IF($B$2-AF:AF>=-2,2,3))))))","v":0},{"$f":"IF(AE:AE=\"pas d'actualité\",3,IF(AE:AE=\"?\",\"?\",IF(AE:AE=\"?\",\"?\",IF((($B$2+1)-AF:AF)>=0,\"0\",IF((($B$2+1)-AF:AF)>=-1,\"1\",IF((($B$2+1)-AF:AF)>=-2,\"2\",\"3\"))))))","v":"0"},{"$f":"IF(AE:AE=\"pas d'actualité\",3,IF(AE:AE=\"?\",\"?\",IF(AE:AE=\"?\",\"?\",IF((($B$2+2)-AF:AF)>=0,0,IF((($B$2+2)-AF:AF)>=-1,1,IF((($B$2+2)-AF:AF)>=-2,2,3))))))","v":0},{"$f":"IF(AE:AE=\"pas d'actualité\",3,IF(AE:AE=\"?\",\"?\",IF(AE:AE=\"?\",\"?\",IF(($B$2+3)-AF:AF>=0,0,IF(($B$2+3)-AF:AF>=-1,1,IF(($B$2+3)-AF:AF>=-2,2,3))))))","v":0},{"$f":"IF(AE:AE=\"pas d'actualité\",3,IF(AE:AE=\"?\",\"?\",IF(AE:AE=\"?\",\"?\",IF(($B$2+4)-AF:AF>=0,0,IF(($B$2+4)-AF:AF>=-1,1,IF(($B$2+4)-AF:AF>=-2,2,3))))))","v":0},"6SN1118-0DK23-0AA1 AB NC SOFTWARE 6.4.9","Partiellement  compatible"]
["PR34","D34","FAB 34",null,null,null,null,"X",null,null,null,null,null,null,null,null,null,null,null,null,null,null,null,null,null,null,null,null,null,null,"2015-09-30",{"$f":"IF(ISNUMBER(AE:AE),YEAR(AE:AE),AE:AE)","v":2015},{"$f":"IF(AE:AE=\"pas d'actualité\",3,IF(AE:AE=\"?\",\"?\",IF(AE:AE=\"?\",\"?\",IF($B$2-AF:AF>=0,0,IF($B$2-AF:AF>=-1,1,IF($B$2-AF:AF>=-2,2,3))))))","v":0},{"$f":"IF(AE:AE=\"pas d'actualité\",3,IF(AE:AE=\"?\",\"?\",IF(AE:AE=\"?\",\"?\",IF((($B$2+1)-AF:AF)>=0,\"0\",IF((($B$2+1)-AF:AF)>=-1,\"1\",IF((($B$2+1)-AF:AF)>=-2,\"2\",\"3\"))))))","v":"0"},{"$f":"IF(AE:AE=\"pas d'actualité\",3,IF(AE:AE=\"?\",\"?\",IF(AE:AE=\"?\",\"?\",IF((($B$2+2)-AF:AF)>=0,0,IF((($B$2+2)-AF:AF)>=-1,1,IF((($B$2+2)-AF:AF)>=-2,2,3))))))","v":0},{"$f":"IF(AE:AE=\"pas d'actualité\",3,IF(AE:AE=\"?\",\"?\",IF(AE:AE=\"?\",\"?\",IF(($B$2+3)-AF:AF>=0,0,IF(($B$2+3)-AF:AF>=-1,1,IF(($B$2+3)-AF:AF>=-2,2,3))))))","v":0},{"$f":"IF(AE:AE=\"pas d'actualité\",3,IF(AE:AE=\"?\",\"?\",IF(AE:AE=\"?\",\"?\",IF(($B$2+4)-AF:AF>=0,0,IF(($B$2+4)-AF:AF>=-1,1,IF(($B$2+4)-AF:AF>=-2,2,3))))))","v":0},"POW MOD INT 50A     ***Pièce de rechange SIMODRIVE 611-D*** 6SN1123-1AA00-0CA2",null,"ARRET TOTAL FOURNITURE 30/09/2017"]
["PR35","D35","FAB 35",null,null,null,null,"X","X",null,null,null,null,null,null,null,null,null,null,null,null,null,null,null,null,null,null,null,null,null,"2012-09-30",{"$f":"IF(ISNUMBER(AE:AE),YEAR(AE:AE),AE:AE)","v":2012},{"$f":"IF(AE:AE=\"pas d'actualité\",3,IF(AE:AE=\"?\",\"?\",IF(AE:AE=\"?\",\"?\",IF($B$2-AF:AF>=0,0,IF($B$2-AF:AF>=-1,1,IF($B$2-AF:AF>=-2,2,3))))))","v":0},{"$f":"IF(AE:AE=\"pas d'actualité\",3,IF(AE:AE=\"?\",\"?\",IF(AE:AE=\"?\",\"?\",IF((($B$2+1)-AF:AF)>=0,\"0\",IF((($B$2+1)-AF:AF)>=-1,\"1\",IF((($B$2+1)-AF:AF)>=-2,\"2\",\"3\"))))))","v":"0"},{"$f":"IF(AE:AE=\"pas d'actualité\",3,IF(AE:AE=\"?\",\"?\",IF(AE:AE=\"?\",\"?\",IF((($B$2+2)-AF:AF)>=0,0,IF((($B$2+2)-AF:AF)>=-1,1,IF((($B$2+2)-AF:AF)>=-2,2,3))))))","v":0},{"$f":"IF(AE:AE=\"pas d'actualité\",3,IF(AE:AE=\"?\",\"?\",IF(AE:AE=\"?\",\"?\",IF(($B$2+3)-AF:AF>=0,0,IF(($B$2+3)-AF:AF>=-1,1,IF(($B$2+3)-AF:AF>=-2,2,3))))))","v":0},{"$f":"IF(AE:AE=\"pas d'actualité\",3,IF(AE:AE=\"?\",\"?\",IF(AE:AE=\"?\",\"?\",IF(($B$2+4)-AF:AF>=0,0,IF(($B$2+4)-AF:AF>=-1,1,IF(($B$2+4)-AF:AF>=-2,2,3))))))","v":0},"6SN1123-1AA00-0HA2","Entièrement compatible"]
["PR36","D36","FAB 36",null,1,null,null,null,null,null,null,null,null,null,"X",null,null,null,null,null,null,null,null,null,null,null,null,null,null,null,"2012-09-30",{"$f":"IF(ISNUMBER(AE:AE),YEAR(AE:AE),AE:AE)","v":2012},{"$f":"IF(AE:AE=\"pas d'actualité\",3,IF(AE:AE=\"?\",\"?\",IF(AE:AE=\"?\",\"?\",IF($B$2-AF:AF>=0,0,IF($B$2-AF:AF>=-1,1,IF($B$2-AF:AF>=-2,2,3))))))","v":0},{"$f":"IF(AE:AE=\"pas d'actualité\",3,IF(AE:AE=\"?\",\"?\",IF(AE:AE=\"?\",\"?\",IF((($B$2+1)-AF:AF)>=0,\"0\",IF((($B$2+1)-AF:AF)>=-1,\"1\",IF((($B$2+1)-AF:AF)>=-2,\"2\",\"3\"))))))","v":"0"},{"$f":"IF(AE:AE=\"pas d'actualité\",3,IF(AE:AE=\"?\",\"?\",IF(AE:AE=\"?\",\"?\",IF((($B$2+2)-AF:AF)>=0,0,IF((($B$2+2)-AF:AF)>=-1,1,IF((($B$2+2)-AF:AF)>=-2,2,3))))))","v":0},{"$f":"IF(AE:AE=\"pas d'actualité\",3,IF(AE:AE=\"?\",\"?\",IF(AE:AE=\"?\",\"?\",IF(($B$2+3)-AF:AF>=0,0,IF(($B$2+3)-AF:AF>=-1,1,IF(($B$2+3)-AF:AF>=-2,2,3))))))","v":0},{"$f":"IF(AE:AE=\"pas d'actualité\",3,IF(AE:AE=\"?\",\"?\",IF(AE:AE=\"?\",\"?\",IF(($B$2+4)-AF:AF>=0,0,IF(($B$2+4)-AF:AF>=-1,1,IF(($B$2+4)-AF:AF>=-2,2,3))))))","v":0},"6SN1123-1AB00-0BA2"]
["PR37","D37","FAB 37",null,1,null,null,"X","X",null,null,null,null,null,null,null,null,null,null,null,null,null,null,null,null,null,null,null,null,null,"2015-09-30",{"$f":"IF(ISNUMBER(AE:AE),YEAR(AE:AE),AE:AE)","v":2015},{"$f":"IF(AE:AE=\"pas d'actualité\",3,IF(AE:AE=\"?\",\"?\",IF(AE:AE=\"?\",\"?\",IF($B$2-AF:AF>=0,0,IF($B$2-AF:AF>=-1,1,IF($B$2-AF:AF>=-2,2,3))))))","v":0},{"$f":"IF(AE:AE=\"pas d'actualité\",3,IF(AE:AE=\"?\",\"?\",IF(AE:AE=\"?\",\"?\",IF((($B$2+1)-AF:AF)>=0,\"0\",IF((($B$2+1)-AF:AF)>=-1,\"1\",IF((($B$2+1)-AF:AF)>=-2,\"2\",\"3\"))))))","v":"0"},{"$f":"IF(AE:AE=\"pas d'actualité\",3,IF(AE:AE=\"?\",\"?\",IF(AE:AE=\"?\",\"?\",IF((($B$2+2)-AF:AF)>=0,0,IF((($B$2+2)-AF:AF)>=-1,1,IF((($B$2+2)-AF:AF)>=-2,2,3))))))","v":0},{"$f":"IF(AE:AE=\"pas d'actualité\",3,IF(AE:AE=\"?\",\"?\",IF(AE:AE=\"?\",\"?\",IF(($B$2+3)-AF:AF>=0,0,IF(($B$2+3)-AF:AF>=-1,1,IF(($B$2+3)-AF:AF>=-2,2,3))))))","v":0},{"$f":"IF(AE:AE=\"pas d'actualité\",3,IF(AE:AE=\"?\",\"?\",IF(AE:AE=\"?\",\"?\",IF(($B$2+4)-AF:AF>=0,0,IF(($B$2+4)-AF:AF>=-1,1,IF(($B$2+4)-AF:AF>=-2,2,3))))))","v":0},"6SN1124-1AB00-0CA2","Entièrement compatible"]
["PR38","D38","FAB 38",null,1,null,null,null,null,null,null,null,null,null,"X",null,null,null,null,null,null,null,null,null,null,null,null,null,null,null,"2012-09-30",{"$f":"IF(ISNUMBER(AE:AE),YEAR(AE:AE),AE:AE)","v":2012},{"$f":"IF(AE:AE=\"pas d'actualité\",3,IF(AE:AE=\"?\",\"?\",IF(AE:AE=\"?\",\"?\",IF($B$2-AF:AF>=0,0,IF($B$2-AF:AF>=-1,1,IF($B$2-AF:AF>=-2,2,3))))))","v":0},{"$f":"IF(AE:AE=\"pas d'actualité\",3,IF(AE:AE=\"?\",\"?\",IF(AE:AE=\"?\",\"?\",IF((($B$2+1)-AF:AF)>=0,\"0\",IF((($B$2+1)-AF:AF)>=-1,\"1\",IF((($B$2+1)-AF:AF)>=-2,\"2\",\"3\"))))))","v":"0"},{"$f":"IF(AE:AE=\"pas d'actualité\",3,IF(AE:AE=\"?\",\"?\",IF(AE:AE=\"?\",\"?\",IF((($B$2+2)-AF:AF)>=0,0,IF((($B$2+2)-AF:AF)>=-1,1,IF((($B$2+2)-AF:AF)>=-2,2,3))))))","v":0},{"$f":"IF(AE:AE=\"pas d'actualité\",3,IF(AE:AE=\"?\",\"?\",IF(AE:AE=\"?\",\"?\",IF(($B$2+3)-AF:AF>=0,0,IF(($B$2+3)-AF:AF>=-1,1,IF(($B$2+3)-AF:AF>=-2,2,3))))))","v":0},{"$f":"IF(AE:AE=\"pas d'actualité\",3,IF(AE:AE=\"?\",\"?\",IF(AE:AE=\"?\",\"?\",IF(($B$2+4)-AF:AF>=0,0,IF(($B$2+4)-AF:AF>=-1,1,IF(($B$2+4)-AF:AF>=-2,2,3))))))","v":0}]
["PR39","D39","FAB 39",null,null,null,null,"X",null,null,null,null,null,null,null,null,null,null,null,null,null,null,null,null,null,null,null,null,null,null,"2017-09-30",{"$f":"IF(ISNUMBER(AE:AE),YEAR(AE:AE),AE:AE)","v":2017},{"$f":"IF(AE:AE=\"pas d'actualité\",3,IF(AE:AE=\"?\",\"?\",IF(AE:AE=\"?\",\"?\",IF($B$2-AF:AF>=0,0,IF($B$2-AF:AF>=-1,1,IF($B$2-AF:AF>=-2,2,3))))))","v":1},{"$f":"IF(AE:AE=\"pas d'actualité\",3,IF(AE:AE=\"?\",\"?\",IF(AE:AE=\"?\",\"?\",IF((($B$2+1)-AF:AF)>=0,\"0\",IF((($B$2+1)-AF:AF)>=-1,\"1\",IF((($B$2+1)-AF:AF)>=-2,\"2\",\"3\"))))))","v":"0"},{"$f":"IF(AE:AE=\"pas d'actualité\",3,IF(AE:AE=\"?\",\"?\",IF(AE:AE=\"?\",\"?\",IF((($B$2+2)-AF:AF)>=0,0,IF((($B$2+2)-AF:AF)>=-1,1,IF((($B$2+2)-AF:AF)>=-2,2,3))))))","v":0},{"$f":"IF(AE:AE=\"pas d'actualité\",3,IF(AE:AE=\"?\",\"?\",IF(AE:AE=\"?\",\"?\",IF(($B$2+3)-AF:AF>=0,0,IF(($B$2+3)-AF:AF>=-1,1,IF(($B$2+3)-AF:AF>=-2,2,3))))))","v":0},{"$f":"IF(AE:AE=\"pas d'actualité\",3,IF(AE:AE=\"?\",\"?\",IF(AE:AE=\"?\",\"?\",IF(($B$2+4)-AF:AF>=0,0,IF(($B$2+4)-AF:AF>=-1,1,IF(($B$2+4)-AF:AF>=-2,2,3))))))","v":0},"UPGRADESERVICE! REPLACEMENT: 6FC5210-0DA20-2AA1","Partiellement compatible","ARRET TOTAL FOURNITURE 30/09/2013"]
["PR40","D40","FAB 40",null,null,null,null,null,"X",null,null,null,null,"X",null,null,null,null,null,null,null,null,null,null,null,null,null,null,null,null,"2017-09-30",{"$f":"IF(ISNUMBER(AE:AE),YEAR(AE:AE),AE:AE)","v":2017},{"$f":"IF(AE:AE=\"pas d'actualité\",3,IF(AE:AE=\"?\",\"?\",IF(AE:AE=\"?\",\"?\",IF($B$2-AF:AF>=0,0,IF($B$2-AF:AF>=-1,1,IF($B$2-AF:AF>=-2,2,3))))))","v":1},{"$f":"IF(AE:AE=\"pas d'actualité\",3,IF(AE:AE=\"?\",\"?\",IF(AE:AE=\"?\",\"?\",IF((($B$2+1)-AF:AF)>=0,\"0\",IF((($B$2+1)-AF:AF)>=-1,\"1\",IF((($B$2+1)-AF:AF)>=-2,\"2\",\"3\"))))))","v":"0"},{"$f":"IF(AE:AE=\"pas d'actualité\",3,IF(AE:AE=\"?\",\"?\",IF(AE:AE=\"?\",\"?\",IF((($B$2+2)-AF:AF)>=0,0,IF((($B$2+2)-AF:AF)>=-1,1,IF((($B$2+2)-AF:AF)>=-2,2,3))))))","v":0},{"$f":"IF(AE:AE=\"pas d'actualité\",3,IF(AE:AE=\"?\",\"?\",IF(AE:AE=\"?\",\"?\",IF(($B$2+3)-AF:AF>=0,0,IF(($B$2+3)-AF:AF>=-1,1,IF(($B$2+3)-AF:AF>=-2,2,3))))))","v":0},{"$f":"IF(AE:AE=\"pas d'actualité\",3,IF(AE:AE=\"?\",\"?\",IF(AE:AE=\"?\",\"?\",IF(($B$2+4)-AF:AF>=0,0,IF(($B$2+4)-AF:AF>=-1,1,IF(($B$2+4)-AF:AF>=-2,2,3))))))","v":0},"SEULEMENT PIECES DETACHEES","Pas de successeur","ARRET TOTAL FOURNITURE 30/09/2019"]
["PR41","D41","FAB 41",null,0,null,null,null,null,null,null,null,null,null,null,null,null,null,null,null,null,null,null,null,null,null,null,null,null,null,"2018-09-30",{"$f":"IF(ISNUMBER(AE:AE),YEAR(AE:AE),AE:AE)","v":2018},{"$f":"IF(AE:AE=\"pas d'actualité\",3,IF(AE:AE=\"?\",\"?\",IF(AE:AE=\"?\",\"?\",IF($B$2-AF:AF>=0,0,IF($B$2-AF:AF>=-1,1,IF($B$2-AF:AF>=-2,2,3))))))","v":2},{"$f":"IF(AE:AE=\"pas d'actualité\",3,IF(AE:AE=\"?\",\"?\",IF(AE:AE=\"?\",\"?\",IF((($B$2+1)-AF:AF)>=0,\"0\",IF((($B$2+1)-AF:AF)>=-1,\"1\",IF((($B$2+1)-AF:AF)>=-2,\"2\",\"3\"))))))","v":"1"},{"$f":"IF(AE:AE=\"pas d'actualité\",3,IF(AE:AE=\"?\",\"?\",IF(AE:AE=\"?\",\"?\",IF((($B$2+2)-AF:AF)>=0,0,IF((($B$2+2)-AF:AF)>=-1,1,IF((($B$2+2)-AF:AF)>=-2,2,3))))))","v":0},{"$f":"IF(AE:AE=\"pas d'actualité\",3,IF(AE:AE=\"?\",\"?\",IF(AE:AE=\"?\",\"?\",IF(($B$2+3)-AF:AF>=0,0,IF(($B$2+3)-AF:AF>=-1,1,IF(($B$2+3)-AF:AF>=-2,2,3))))))","v":0},{"$f":"IF(AE:AE=\"pas d'actualité\",3,IF(AE:AE=\"?\",\"?\",IF(AE:AE=\"?\",\"?\",IF(($B$2+4)-AF:AF>=0,0,IF(($B$2+4)-AF:AF>=-1,1,IF(($B$2+4)-AF:AF>=-2,2,3))))))","v":0},null,null,"Seulement sous pièce détachées ARRET TOTAL FOURNITURE 30/09/2020"]
["PR42","D42","FAB 42",null,2,null,null,null,null,null,"X",null,"X",null,null,null,null,null,null,null,null,null,null,null,null,null,null,null,null,null,"2018-09-30",{"$f":"IF(ISNUMBER(AE:AE),YEAR(AE:AE),AE:AE)","v":2018},{"$f":"IF(AE:AE=\"pas d'actualité\",3,IF(AE:AE=\"?\",\"?\",IF(AE:AE=\"?\",\"?\",IF($B$2-AF:AF>=0,0,IF($B$2-AF:AF>=-1,1,IF($B$2-AF:AF>=-2,2,3))))))","v":2},{"$f":"IF(AE:AE=\"pas d'actualité\",3,IF(AE:AE=\"?\",\"?\",IF(AE:AE=\"?\",\"?\",IF((($B$2+1)-AF:AF)>=0,\"0\",IF((($B$2+1)-AF:AF)>=-1,\"1\",IF((($B$2+1)-AF:AF)>=-2,\"2\",\"3\"))))))","v":"1"},{"$f":"IF(AE:AE=\"pas d'actualité\",3,IF(AE:AE=\"?\",\"?\",IF(AE:AE=\"?\",\"?\",IF((($B$2+2)-AF:AF)>=0,0,IF((($B$2+2)-AF:AF)>=-1,1,IF((($B$2+2)-AF:AF)>=-2,2,3))))))","v":0},{"$f":"IF(AE:AE=\"pas d'actualité\",3,IF(AE:AE=\"?\",\"?\",IF(AE:AE=\"?\",\"?\",IF(($B$2+3)-AF:AF>=0,0,IF(($B$2+3)-AF:AF>=-1,1,IF(($B$2+3)-AF:AF>=-2,2,3))))))","v":0},{"$f":"IF(AE:AE=\"pas d'actualité\",3,IF(AE:AE=\"?\",\"?\",IF(AE:AE=\"?\",\"?\",IF(($B$2+4)-AF:AF>=0,0,IF(($B$2+4)-AF:AF>=-1,1,IF(($B$2+4)-AF:AF>=-2,2,3))))))","v":0},"REPLACEMENT TYPE: 611U HR 6SN1118-0NH01-0AA0 ","Partiellement compatible","ARRET TOTAL FOURNITURE 30/09/2020"]
["PR43","D43","FAB 43",null,1,null,null,null,null,null,null,null,null,null,null,null,null,null,null,null,null,null,null,null,null,"X",null,null,null,null,"pas d'actualité",{"$f":"IF(ISNUMBER(AE:AE),YEAR(AE:AE),AE:AE)","v":"pas d'actualité"},{"$f":"IF(AE:AE=\"pas d'actualité\",3,IF(AE:AE=\"?\",\"?\",IF(AE:AE=\"?\",\"?\",IF($B$2-AF:AF>=0,0,IF($B$2-AF:AF>=-1,1,IF($B$2-AF:AF>=-2,2,3))))))","v":3},{"$f":"IF(AE:AE=\"pas d'actualité\",3,IF(AE:AE=\"?\",\"?\",IF(AE:AE=\"?\",\"?\",IF((($B$2+1)-AF:AF)>=0,\"0\",IF((($B$2+1)-AF:AF)>=-1,\"1\",IF((($B$2+1)-AF:AF)>=-2,\"2\",\"3\"))))))","v":3},{"$f":"IF(AE:AE=\"pas d'actualité\",3,IF(AE:AE=\"?\",\"?\",IF(AE:AE=\"?\",\"?\",IF((($B$2+2)-AF:AF)>=0,0,IF((($B$2+2)-AF:AF)>=-1,1,IF((($B$2+2)-AF:AF)>=-2,2,3))))))","v":3},{"$f":"IF(AE:AE=\"pas d'actualité\",3,IF(AE:AE=\"?\",\"?\",IF(AE:AE=\"?\",\"?\",IF(($B$2+3)-AF:AF>=0,0,IF(($B$2+3)-AF:AF>=-1,1,IF(($B$2+3)-AF:AF>=-2,2,3))))))","v":3},{"$f":"IF(AE:AE=\"pas d'actualité\",3,IF(AE:AE=\"?\",\"?\",IF(AE:AE=\"?\",\"?\",IF(($B$2+4)-AF:AF>=0,0,IF(($B$2+4)-AF:AF>=-1,1,IF(($B$2+4)-AF:AF>=-2,2,3))))))","v":3}]
["PR44","D44","FAB 44",null,1,null,null,null,null,null,null,null,null,null,null,null,null,null,null,null,null,null,null,null,null,"X",null,null,null,null,"pas d'actualité",{"$f":"IF(ISNUMBER(AE:AE),YEAR(AE:AE),AE:AE)","v":"pas d'actualité"},{"$f":"IF(AE:AE=\"pas d'actualité\",3,IF(AE:AE=\"?\",\"?\",IF(AE:AE=\"?\",\"?\",IF($B$2-AF:AF>=0,0,IF($B$2-AF:AF>=-1,1,IF($B$2-AF:AF>=-2,2,3))))))","v":3},{"$f":"IF(AE:AE=\"pas d'actualité\",3,IF(AE:AE=\"?\",\"?\",IF(AE:AE=\"?\",\"?\",IF((($B$2+1)-AF:AF)>=0,\"0\",IF((($B$2+1)-AF:AF)>=-1,\"1\",IF((($B$2+1)-AF:AF)>=-2,\"2\",\"3\"))))))","v":3},{"$f":"IF(AE:AE=\"pas d'actualité\",3,IF(AE:AE=\"?\",\"?\",IF(AE:AE=\"?\",\"?\",IF((($B$2+2)-AF:AF)>=0,0,IF((($B$2+2)-AF:AF)>=-1,1,IF((($B$2+2)-AF:AF)>=-2,2,3))))))","v":3},{"$f":"IF(AE:AE=\"pas d'actualité\",3,IF(AE:AE=\"?\",\"?\",IF(AE:AE=\"?\",\"?\",IF(($B$2+3)-AF:AF>=0,0,IF(($B$2+3)-AF:AF>=-1,1,IF(($B$2+3)-AF:AF>=-2,2,3))))))","v":3},{"$f":"IF(AE:AE=\"pas d'actualité\",3,IF(AE:AE=\"?\",\"?\",IF(AE:AE=\"?\",\"?\",IF(($B$2+4)-AF:AF>=0,0,IF(($B$2+4)-AF:AF>=-1,1,IF(($B$2+4)-AF:AF>=-2,2,3))))))","v":3}]
["PR45","D45","FAB 45",null,null,null,null,null,"X",null,null,null,null,null,null,null,null,null,null,null,null,null,null,null,null,null,null,null,null,null,"pas d'actualité",{"$f":"IF(ISNUMBER(AE:AE),YEAR(AE:AE),AE:AE)","v":"pas d'actualité"},{"$f":"IF(AE:AE=\"pas d'actualité\",3,IF(AE:AE=\"?\",\"?\",IF(AE:AE=\"?\",\"?\",IF($B$2-AF:AF>=0,0,IF($B$2-AF:AF>=-1,1,IF($B$2-AF:AF>=-2,2,3))))))","v":3},{"$f":"IF(AE:AE=\"pas d'actualité\",3,IF(AE:AE=\"?\",\"?\",IF(AE:AE=\"?\",\"?\",IF((($B$2+1)-AF:AF)>=0,\"0\",IF((($B$2+1)-AF:AF)>=-1,\"1\",IF((($B$2+1)-AF:AF)>=-2,\"2\",\"3\"))))))","v":3},{"$f":"IF(AE:AE=\"pas d'actualité\",3,IF(AE:AE=\"?\",\"?\",IF(AE:AE=\"?\",\"?\",IF((($B$2+2)-AF:AF)>=0,0,IF((($B$2+2)-AF:AF)>=-1,1,IF((($B$2+2)-AF:AF)>=-2,2,3))))))","v":3},{"$f":"IF(AE:AE=\"pas d'actualité\",3,IF(AE:AE=\"?\",\"?\",IF(AE:AE=\"?\",\"?\",IF(($B$2+3)-AF:AF>=0,0,IF(($B$2+3)-AF:AF>=-1,1,IF(($B$2+3)-AF:AF>=-2,2,3))))))","v":3},{"$f":"IF(AE:AE=\"pas d'actualité\",3,IF(AE:AE=\"?\",\"?\",IF(AE:AE=\"?\",\"?\",IF(($B$2+4)-AF:AF>=0,0,IF(($B$2+4)-AF:AF>=-1,1,IF(($B$2+4)-AF:AF>=-2,2,3))))))","v":3}]
["PR46","D46","FAB 46",null,1,null,null,"X","X",null,null,null,null,null,null,null,null,null,null,null,null,null,null,null,null,null,null,null,null,null,"pas d'actualité",{"$f":"IF(ISNUMBER(AE:AE),YEAR(AE:AE),AE:AE)","v":"pas d'actualité"},{"$f":"IF(AE:AE=\"pas d'actualité\",3,IF(AE:AE=\"?\",\"?\",IF(AE:AE=\"?\",\"?\",IF($B$2-AF:AF>=0,0,IF($B$2-AF:AF>=-1,1,IF($B$2-AF:AF>=-2,2,3))))))","v":3},{"$f":"IF(AE:AE=\"pas d'actualité\",3,IF(AE:AE=\"?\",\"?\",IF(AE:AE=\"?\",\"?\",IF((($B$2+1)-AF:AF)>=0,\"0\",IF((($B$2+1)-AF:AF)>=-1,\"1\",IF((($B$2+1)-AF:AF)>=-2,\"2\",\"3\"))))))","v":3},{"$f":"IF(AE:AE=\"pas d'actualité\",3,IF(AE:AE=\"?\",\"?\",IF(AE:AE=\"?\",\"?\",IF((($B$2+2)-AF:AF)>=0,0,IF((($B$2+2)-AF:AF)>=-1,1,IF((($B$2+2)-AF:AF)>=-2,2,3))))))","v":3},{"$f":"IF(AE:AE=\"pas d'actualité\",3,IF(AE:AE=\"?\",\"?\",IF(AE:AE=\"?\",\"?\",IF(($B$2+3)-AF:AF>=0,0,IF(($B$2+3)-AF:AF>=-1,1,IF(($B$2+3)-AF:AF>=-2,2,3))))))","v":3},{"$f":"IF(AE:AE=\"pas d'actualité\",3,IF(AE:AE=\"?\",\"?\",IF(AE:AE=\"?\",\"?\",IF(($B$2+4)-AF:AF>=0,0,IF(($B$2+4)-AF:AF>=-1,1,IF(($B$2+4)-AF:AF>=-2,2,3))))))","v":3}]
["PR47","D47","FAB 47",null,10,null,null,"X","X",null,null,null,null,null,null,null,null,null,null,null,null,null,null,null,null,null,null,null,null,null,"pas d'actualité",{"$f":"IF(ISNUMBER(AE:AE),YEAR(AE:AE),AE:AE)","v":"pas d'actualité"},{"$f":"IF(AE:AE=\"pas d'actualité\",3,IF(AE:AE=\"?\",\"?\",IF(AE:AE=\"?\",\"?\",IF($B$2-AF:AF>=0,0,IF($B$2-AF:AF>=-1,1,IF($B$2-AF:AF>=-2,2,3))))))","v":3},{"$f":"IF(AE:AE=\"pas d'actualité\",3,IF(AE:AE=\"?\",\"?\",IF(AE:AE=\"?\",\"?\",IF((($B$2+1)-AF:AF)>=0,\"0\",IF((($B$2+1)-AF:AF)>=-1,\"1\",IF((($B$2+1)-AF:AF)>=-2,\"2\",\"3\"))))))","v":3},{"$f":"IF(AE:AE=\"pas d'actualité\",3,IF(AE:AE=\"?\",\"?\",IF(AE:AE=\"?\",\"?\",IF((($B$2+2)-AF:AF)>=0,0,IF((($B$2+2)-AF:AF)>=-1,1,IF((($B$2+2)-AF:AF)>=-2,2,3))))))","v":3},{"$f":"IF(AE:AE=\"pas d'actualité\",3,IF(AE:AE=\"?\",\"?\",IF(AE:AE=\"?\",\"?\",IF(($B$2+3)-AF:AF>=0,0,IF(($B$2+3)-AF:AF>=-1,1,IF(($B$2+3)-AF:AF>=-2,2,3))))))","v":3},{"$f":"IF(AE:AE=\"pas d'actualité\",3,IF(AE:AE=\"?\",\"?\",IF(AE:AE=\"?\",\"?\",IF(($B$2+4)-AF:AF>=0,0,IF(($B$2+4)-AF:AF>=-1,1,IF(($B$2+4)-AF:AF>=-2,2,3))))))","v":3}]
["PR48","D48","FAB 48",null,5,null,null,"X","X",null,null,null,null,null,null,null,null,null,null,null,null,null,null,null,null,null,null,null,null,null,"pas d'actualité",{"$f":"IF(ISNUMBER(AE:AE),YEAR(AE:AE),AE:AE)","v":"pas d'actualité"},{"$f":"IF(AE:AE=\"pas d'actualité\",3,IF(AE:AE=\"?\",\"?\",IF(AE:AE=\"?\",\"?\",IF($B$2-AF:AF>=0,0,IF($B$2-AF:AF>=-1,1,IF($B$2-AF:AF>=-2,2,3))))))","v":3},{"$f":"IF(AE:AE=\"pas d'actualité\",3,IF(AE:AE=\"?\",\"?\",IF(AE:AE=\"?\",\"?\",IF((($B$2+1)-AF:AF)>=0,\"0\",IF((($B$2+1)-AF:AF)>=-1,\"1\",IF((($B$2+1)-AF:AF)>=-2,\"2\",\"3\"))))))","v":3},{"$f":"IF(AE:AE=\"pas d'actualité\",3,IF(AE:AE=\"?\",\"?\",IF(AE:AE=\"?\",\"?\",IF((($B$2+2)-AF:AF)>=0,0,IF((($B$2+2)-AF:AF)>=-1,1,IF((($B$2+2)-AF:AF)>=-2,2,3))))))","v":3},{"$f":"IF(AE:AE=\"pas d'actualité\",3,IF(AE:AE=\"?\",\"?\",IF(AE:AE=\"?\",\"?\",IF(($B$2+3)-AF:AF>=0,0,IF(($B$2+3)-AF:AF>=-1,1,IF(($B$2+3)-AF:AF>=-2,2,3))))))","v":3},{"$f":"IF(AE:AE=\"pas d'actualité\",3,IF(AE:AE=\"?\",\"?\",IF(AE:AE=\"?\",\"?\",IF(($B$2+4)-AF:AF>=0,0,IF(($B$2+4)-AF:AF>=-1,1,IF(($B$2+4)-AF:AF>=-2,2,3))))))","v":3}]
["PR49","D49","FAB 49",null,0,null,null,null,null,null,null,null,null,null,null,null,null,null,null,null,null,null,null,null,null,null,null,null,null,null,"pas d'actualité",{"$f":"IF(ISNUMBER(AE:AE),YEAR(AE:AE),AE:AE)","v":"pas d'actualité"},{"$f":"IF(AE:AE=\"pas d'actualité\",3,IF(AE:AE=\"?\",\"?\",IF(AE:AE=\"?\",\"?\",IF($B$2-AF:AF>=0,0,IF($B$2-AF:AF>=-1,1,IF($B$2-AF:AF>=-2,2,3))))))","v":3},{"$f":"IF(AE:AE=\"pas d'actualité\",3,IF(AE:AE=\"?\",\"?\",IF(AE:AE=\"?\",\"?\",IF((($B$2+1)-AF:AF)>=0,\"0\",IF((($B$2+1)-AF:AF)>=-1,\"1\",IF((($B$2+1)-AF:AF)>=-2,\"2\",\"3\"))))))","v":3},{"$f":"IF(AE:AE=\"pas d'actualité\",3,IF(AE:AE=\"?\",\"?\",IF(AE:AE=\"?\",\"?\",IF((($B$2+2)-AF:AF)>=0,0,IF((($B$2+2)-AF:AF)>=-1,1,IF((($B$2+2)-AF:AF)>=-2,2,3))))))","v":3},{"$f":"IF(AE:AE=\"pas d'actualité\",3,IF(AE:AE=\"?\",\"?\",IF(AE:AE=\"?\",\"?\",IF(($B$2+3)-AF:AF>=0,0,IF(($B$2+3)-AF:AF>=-1,1,IF(($B$2+3)-AF:AF>=-2,2,3))))))","v":3},{"$f":"IF(AE:AE=\"pas d'actualité\",3,IF(AE:AE=\"?\",\"?\",IF(AE:AE=\"?\",\"?\",IF(($B$2+4)-AF:AF>=0,0,IF(($B$2+4)-AF:AF>=-1,1,IF(($B$2+4)-AF:AF>=-2,2,3))))))","v":3}]
["PR50","D50","FAB 50",null,null,null,null,null,null,null,null,null,null,null,null,null,null,null,null,null,null,null,null,null,null,null,null,null,null,null,"pas d'actualité",{"$f":"IF(ISNUMBER(AE:AE),YEAR(AE:AE),AE:AE)","v":"pas d'actualité"},{"$f":"IF(AE:AE=\"pas d'actualité\",3,IF(AE:AE=\"?\",\"?\",IF(AE:AE=\"?\",\"?\",IF($B$2-AF:AF>=0,0,IF($B$2-AF:AF>=-1,1,IF($B$2-AF:AF>=-2,2,3))))))","v":3},{"$f":"IF(AE:AE=\"pas d'actualité\",3,IF(AE:AE=\"?\",\"?\",IF(AE:AE=\"?\",\"?\",IF((($B$2+1)-AF:AF)>=0,\"0\",IF((($B$2+1)-AF:AF)>=-1,\"1\",IF((($B$2+1)-AF:AF)>=-2,\"2\",\"3\"))))))","v":3},{"$f":"IF(AE:AE=\"pas d'actualité\",3,IF(AE:AE=\"?\",\"?\",IF(AE:AE=\"?\",\"?\",IF((($B$2+2)-AF:AF)>=0,0,IF((($B$2+2)-AF:AF)>=-1,1,IF((($B$2+2)-AF:AF)>=-2,2,3))))))","v":3},{"$f":"IF(AE:AE=\"pas d'actualité\",3,IF(AE:AE=\"?\",\"?\",IF(AE:AE=\"?\",\"?\",IF(($B$2+3)-AF:AF>=0,0,IF(($B$2+3)-AF:AF>=-1,1,IF(($B$2+3)-AF:AF>=-2,2,3))))))","v":3},{"$f":"IF(AE:AE=\"pas d'actualité\",3,IF(AE:AE=\"?\",\"?\",IF(AE:AE=\"?\",\"?\",IF(($B$2+4)-AF:AF>=0,0,IF(($B$2+4)-AF:AF>=-1,1,IF(($B$2+4)-AF:AF>=-2,2,3))))))","v":3},null,null,"Annonce d'\u0092abandon du produit\n15/11/2013"]
["PR51","D51","FAB 51",null,null,null,null,null,null,null,null,null,null,null,null,null,null,null,null,null,null,null,null,null,null,null,null,null,null,null,"pas d'actualité",{"$f":"IF(ISNUMBER(AE:AE),YEAR(AE:AE),AE:AE)","v":"pas d'actualité"},{"$f":"IF(AE:AE=\"pas d'actualité\",3,IF(AE:AE=\"?\",\"?\",IF(AE:AE=\"?\",\"?\",IF($B$2-AF:AF>=0,0,IF($B$2-AF:AF>=-1,1,IF($B$2-AF:AF>=-2,2,3))))))","v":3},{"$f":"IF(AE:AE=\"pas d'actualité\",3,IF(AE:AE=\"?\",\"?\",IF(AE:AE=\"?\",\"?\",IF((($B$2+1)-AF:AF)>=0,\"0\",IF((($B$2+1)-AF:AF)>=-1,\"1\",IF((($B$2+1)-AF:AF)>=-2,\"2\",\"3\"))))))","v":3},{"$f":"IF(AE:AE=\"pas d'actualité\",3,IF(AE:AE=\"?\",\"?\",IF(AE:AE=\"?\",\"?\",IF((($B$2+2)-AF:AF)>=0,0,IF((($B$2+2)-AF:AF)>=-1,1,IF((($B$2+2)-AF:AF)>=-2,2,3))))))","v":3},{"$f":"IF(AE:AE=\"pas d'actualité\",3,IF(AE:AE=\"?\",\"?\",IF(AE:AE=\"?\",\"?\",IF(($B$2+3)-AF:AF>=0,0,IF(($B$2+3)-AF:AF>=-1,1,IF(($B$2+3)-AF:AF>=-2,2,3))))))","v":3},{"$f":"IF(AE:AE=\"pas d'actualité\",3,IF(AE:AE=\"?\",\"?\",IF(AE:AE=\"?\",\"?\",IF(($B$2+4)-AF:AF>=0,0,IF(($B$2+4)-AF:AF>=-1,1,IF(($B$2+4)-AF:AF>=-2,2,3))))))","v":3},null,null,"Annonce d'\u0092abandon du produit\n15/11/2013"]
["PR52","D52","FAB 52",null,null,null,null,null,null,null,null,null,null,null,null,null,null,null,null,null,null,null,null,null,null,null,null,null,null,null,"pas d'actualité",{"$f":"IF(ISNUMBER(AE:AE),YEAR(AE:AE),AE:AE)","v":"pas d'actualité"},{"$f":"IF(AE:AE=\"pas d'actualité\",3,IF(AE:AE=\"?\",\"?\",IF(AE:AE=\"?\",\"?\",IF($B$2-AF:AF>=0,0,IF($B$2-AF:AF>=-1,1,IF($B$2-AF:AF>=-2,2,3))))))","v":3},{"$f":"IF(AE:AE=\"pas d'actualité\",3,IF(AE:AE=\"?\",\"?\",IF(AE:AE=\"?\",\"?\",IF((($B$2+1)-AF:AF)>=0,\"0\",IF((($B$2+1)-AF:AF)>=-1,\"1\",IF((($B$2+1)-AF:AF)>=-2,\"2\",\"3\"))))))","v":3},{"$f":"IF(AE:AE=\"pas d'actualité\",3,IF(AE:AE=\"?\",\"?\",IF(AE:AE=\"?\",\"?\",IF((($B$2+2)-AF:AF)>=0,0,IF((($B$2+2)-AF:AF)>=-1,1,IF((($B$2+2)-AF:AF)>=-2,2,3))))))","v":3},{"$f":"IF(AE:AE=\"pas d'actualité\",3,IF(AE:AE=\"?\",\"?\",IF(AE:AE=\"?\",\"?\",IF(($B$2+3)-AF:AF>=0,0,IF(($B$2+3)-AF:AF>=-1,1,IF(($B$2+3)-AF:AF>=-2,2,3))))))","v":3},{"$f":"IF(AE:AE=\"pas d'actualité\",3,IF(AE:AE=\"?\",\"?\",IF(AE:AE=\"?\",\"?\",IF(($B$2+4)-AF:AF>=0,0,IF(($B$2+4)-AF:AF>=-1,1,IF(($B$2+4)-AF:AF>=-2,2,3))))))","v":3},null,null,"Annonce d'\u0092abandon du produit\n15/11/2013"]
["PR53","D53","FAB 53",null,null,null,null,null,null,null,null,null,null,null,null,null,null,null,null,null,null,null,null,null,null,null,null,null,null,null,"pas d'actualité",{"$f":"IF(ISNUMBER(AE:AE),YEAR(AE:AE),AE:AE)","v":"pas d'actualité"},{"$f":"IF(AE:AE=\"pas d'actualité\",3,IF(AE:AE=\"?\",\"?\",IF(AE:AE=\"?\",\"?\",IF($B$2-AF:AF>=0,0,IF($B$2-AF:AF>=-1,1,IF($B$2-AF:AF>=-2,2,3))))))","v":3},{"$f":"IF(AE:AE=\"pas d'actualité\",3,IF(AE:AE=\"?\",\"?\",IF(AE:AE=\"?\",\"?\",IF((($B$2+1)-AF:AF)>=0,\"0\",IF((($B$2+1)-AF:AF)>=-1,\"1\",IF((($B$2+1)-AF:AF)>=-2,\"2\",\"3\"))))))","v":3},{"$f":"IF(AE:AE=\"pas d'actualité\",3,IF(AE:AE=\"?\",\"?\",IF(AE:AE=\"?\",\"?\",IF((($B$2+2)-AF:AF)>=0,0,IF((($B$2+2)-AF:AF)>=-1,1,IF((($B$2+2)-AF:AF)>=-2,2,3))))))","v":3},{"$f":"IF(AE:AE=\"pas d'actualité\",3,IF(AE:AE=\"?\",\"?\",IF(AE:AE=\"?\",\"?\",IF(($B$2+3)-AF:AF>=0,0,IF(($B$2+3)-AF:AF>=-1,1,IF(($B$2+3)-AF:AF>=-2,2,3))))))","v":3},{"$f":"IF(AE:AE=\"pas d'actualité\",3,IF(AE:AE=\"?\",\"?\",IF(AE:AE=\"?\",\"?\",IF(($B$2+4)-AF:AF>=0,0,IF(($B$2+4)-AF:AF>=-1,1,IF(($B$2+4)-AF:AF>=-2,2,3))))))","v":3},null,null,"Annonce d'\u0092abandon du produit\n15/11/2013"]
["PR54","D54","FAB 54",null,null,null,null,null,null,null,null,null,null,null,null,null,null,null,null,null,null,null,null,null,null,null,null,null,null,null,"pas d'actualité",{"$f":"IF(ISNUMBER(AE:AE),YEAR(AE:AE),AE:AE)","v":"pas d'actualité"},{"$f":"IF(AE:AE=\"pas d'actualité\",3,IF(AE:AE=\"?\",\"?\",IF(AE:AE=\"?\",\"?\",IF($B$2-AF:AF>=0,0,IF($B$2-AF:AF>=-1,1,IF($B$2-AF:AF>=-2,2,3))))))","v":3},{"$f":"IF(AE:AE=\"pas d'actualité\",3,IF(AE:AE=\"?\",\"?\",IF(AE:AE=\"?\",\"?\",IF((($B$2+1)-AF:AF)>=0,\"0\",IF((($B$2+1)-AF:AF)>=-1,\"1\",IF((($B$2+1)-AF:AF)>=-2,\"2\",\"3\"))))))","v":3},{"$f":"IF(AE:AE=\"pas d'actualité\",3,IF(AE:AE=\"?\",\"?\",IF(AE:AE=\"?\",\"?\",IF((($B$2+2)-AF:AF)>=0,0,IF((($B$2+2)-AF:AF)>=-1,1,IF((($B$2+2)-AF:AF)>=-2,2,3))))))","v":3},{"$f":"IF(AE:AE=\"pas d'actualité\",3,IF(AE:AE=\"?\",\"?\",IF(AE:AE=\"?\",\"?\",IF(($B$2+3)-AF:AF>=0,0,IF(($B$2+3)-AF:AF>=-1,1,IF(($B$2+3)-AF:AF>=-2,2,3))))))","v":3},{"$f":"IF(AE:AE=\"pas d'actualité\",3,IF(AE:AE=\"?\",\"?\",IF(AE:AE=\"?\",\"?\",IF(($B$2+4)-AF:AF>=0,0,IF(($B$2+4)-AF:AF>=-1,1,IF(($B$2+4)-AF:AF>=-2,2,3))))))","v":3},null,null,"Annonce d'\u0092abandon du produit\n15/11/2013"]
["PR55","D55","FAB 55",null,null,null,null,null,null,null,null,null,null,null,null,null,null,null,null,null,null,null,null,null,null,null,null,null,null,null,"pas d'actualité",{"$f":"IF(ISNUMBER(AE:AE),YEAR(AE:AE),AE:AE)","v":"pas d'actualité"},{"$f":"IF(AE:AE=\"pas d'actualité\",3,IF(AE:AE=\"?\",\"?\",IF(AE:AE=\"?\",\"?\",IF($B$2-AF:AF>=0,0,IF($B$2-AF:AF>=-1,1,IF($B$2-AF:AF>=-2,2,3))))))","v":3},{"$f":"IF(AE:AE=\"pas d'actualité\",3,IF(AE:AE=\"?\",\"?\",IF(AE:AE=\"?\",\"?\",IF((($B$2+1)-AF:AF)>=0,\"0\",IF((($B$2+1)-AF:AF)>=-1,\"1\",IF((($B$2+1)-AF:AF)>=-2,\"2\",\"3\"))))))","v":3},{"$f":"IF(AE:AE=\"pas d'actualité\",3,IF(AE:AE=\"?\",\"?\",IF(AE:AE=\"?\",\"?\",IF((($B$2+2)-AF:AF)>=0,0,IF((($B$2+2)-AF:AF)>=-1,1,IF((($B$2+2)-AF:AF)>=-2,2,3))))))","v":3},{"$f":"IF(AE:AE=\"pas d'actualité\",3,IF(AE:AE=\"?\",\"?\",IF(AE:AE=\"?\",\"?\",IF(($B$2+3)-AF:AF>=0,0,IF(($B$2+3)-AF:AF>=-1,1,IF(($B$2+3)-AF:AF>=-2,2,3))))))","v":3},{"$f":"IF(AE:AE=\"pas d'actualité\",3,IF(AE:AE=\"?\",\"?\",IF(AE:AE=\"?\",\"?\",IF(($B$2+4)-AF:AF>=0,0,IF(($B$2+4)-AF:AF>=-1,1,IF(($B$2+4)-AF:AF>=-2,2,3))))))","v":3},null,null,"Annonce d'\u0092abandon du produit\n15/11/2013"]
["PR56","D56","FAB 56",null,null,null,null,null,null,null,null,null,null,null,null,null,null,null,null,null,null,null,null,null,null,null,null,null,null,null,"pas d'actualité",{"$f":"IF(ISNUMBER(AE:AE),YEAR(AE:AE),AE:AE)","v":"pas d'actualité"},{"$f":"IF(AE:AE=\"pas d'actualité\",3,IF(AE:AE=\"?\",\"?\",IF(AE:AE=\"?\",\"?\",IF($B$2-AF:AF>=0,0,IF($B$2-AF:AF>=-1,1,IF($B$2-AF:AF>=-2,2,3))))))","v":3},{"$f":"IF(AE:AE=\"pas d'actualité\",3,IF(AE:AE=\"?\",\"?\",IF(AE:AE=\"?\",\"?\",IF((($B$2+1)-AF:AF)>=0,\"0\",IF((($B$2+1)-AF:AF)>=-1,\"1\",IF((($B$2+1)-AF:AF)>=-2,\"2\",\"3\"))))))","v":3},{"$f":"IF(AE:AE=\"pas d'actualité\",3,IF(AE:AE=\"?\",\"?\",IF(AE:AE=\"?\",\"?\",IF((($B$2+2)-AF:AF)>=0,0,IF((($B$2+2)-AF:AF)>=-1,1,IF((($B$2+2)-AF:AF)>=-2,2,3))))))","v":3},{"$f":"IF(AE:AE=\"pas d'actualité\",3,IF(AE:AE=\"?\",\"?\",IF(AE:AE=\"?\",\"?\",IF(($B$2+3)-AF:AF>=0,0,IF(($B$2+3)-AF:AF>=-1,1,IF(($B$2+3)-AF:AF>=-2,2,3))))))","v":3},{"$f":"IF(AE:AE=\"pas d'actualité\",3,IF(AE:AE=\"?\",\"?\",IF(AE:AE=\"?\",\"?\",IF(($B$2+4)-AF:AF>=0,0,IF(($B$2+4)-AF:AF>=-1,1,IF(($B$2+4)-AF:AF>=-2,2,3))))))","v":3},null,null,"Annonce d'\u0092abandon du produit\n15/11/2013"]
["PR57","D57","FAB 57",null,1,null,null,null,null,null,null,null,null,null,null,null,null,null,null,null,null,null,null,null,null,null,null,"X",null,null,"2022-01-10",{"$f":"IF(ISNUMBER(AE:AE),YEAR(AE:AE),AE:AE)","v":2022},{"$f":"IF(AE:AE=\"pas d'actualité\",3,IF(AE:AE=\"?\",\"?\",IF(AE:AE=\"?\",\"?\",IF($B$2-AF:AF>=0,0,IF($B$2-AF:AF>=-1,1,IF($B$2-AF:AF>=-2,2,3))))))","v":3},{"$f":"IF(AE:AE=\"pas d'actualité\",3,IF(AE:AE=\"?\",\"?\",IF(AE:AE=\"?\",\"?\",IF((($B$2+1)-AF:AF)>=0,\"0\",IF((($B$2+1)-AF:AF)>=-1,\"1\",IF((($B$2+1)-AF:AF)>=-2,\"2\",\"3\"))))))","v":"3"},{"$f":"IF(AE:AE=\"pas d'actualité\",3,IF(AE:AE=\"?\",\"?\",IF(AE:AE=\"?\",\"?\",IF((($B$2+2)-AF:AF)>=0,0,IF((($B$2+2)-AF:AF)>=-1,1,IF((($B$2+2)-AF:AF)>=-2,2,3))))))","v":3},{"$f":"IF(AE:AE=\"pas d'actualité\",3,IF(AE:AE=\"?\",\"?\",IF(AE:AE=\"?\",\"?\",IF(($B$2+3)-AF:AF>=0,0,IF(($B$2+3)-AF:AF>=-1,1,IF(($B$2+3)-AF:AF>=-2,2,3))))))","v":3},{"$f":"IF(AE:AE=\"pas d'actualité\",3,IF(AE:AE=\"?\",\"?\",IF(AE:AE=\"?\",\"?\",IF(($B$2+4)-AF:AF>=0,0,IF(($B$2+4)-AF:AF>=-1,1,IF(($B$2+4)-AF:AF>=-2,2,3))))))","v":2},null,null,"Annonce abandon du produit 01/10/2012\nRéparation et pièces détachées garanties jusq. 01/10/2022"]
["PR58","D58","FAB 58",null,1,null,null,"X","X",null,null,null,null,null,null,null,null,null,null,null,null,null,null,null,null,null,null,null,null,null,"pas d'actualité",{"$f":"IF(ISNUMBER(AE:AE),YEAR(AE:AE),AE:AE)","v":"pas d'actualité"},{"$f":"IF(AE:AE=\"pas d'actualité\",3,IF(AE:AE=\"?\",\"?\",IF(AE:AE=\"?\",\"?\",IF($B$2-AF:AF>=0,0,IF($B$2-AF:AF>=-1,1,IF($B$2-AF:AF>=-2,2,3))))))","v":3},{"$f":"IF(AE:AE=\"pas d'actualité\",3,IF(AE:AE=\"?\",\"?\",IF(AE:AE=\"?\",\"?\",IF((($B$2+1)-AF:AF)>=0,\"0\",IF((($B$2+1)-AF:AF)>=-1,\"1\",IF((($B$2+1)-AF:AF)>=-2,\"2\",\"3\"))))))","v":3},{"$f":"IF(AE:AE=\"pas d'actualité\",3,IF(AE:AE=\"?\",\"?\",IF(AE:AE=\"?\",\"?\",IF((($B$2+2)-AF:AF)>=0,0,IF((($B$2+2)-AF:AF)>=-1,1,IF((($B$2+2)-AF:AF)>=-2,2,3))))))","v":3},{"$f":"IF(AE:AE=\"pas d'actualité\",3,IF(AE:AE=\"?\",\"?\",IF(AE:AE=\"?\",\"?\",IF(($B$2+3)-AF:AF>=0,0,IF(($B$2+3)-AF:AF>=-1,1,IF(($B$2+3)-AF:AF>=-2,2,3))))))","v":3},{"$f":"IF(AE:AE=\"pas d'actualité\",3,IF(AE:AE=\"?\",\"?\",IF(AE:AE=\"?\",\"?\",IF(($B$2+4)-AF:AF>=0,0,IF(($B$2+4)-AF:AF>=-1,1,IF(($B$2+4)-AF:AF>=-2,2,3))))))","v":3}]
["PR59","D59","FAB 59",null,1,null,null,"X",null,null,null,null,null,null,null,null,null,null,null,null,null,null,null,null,null,null,null,null,null,null,"pas d'actualité",{"$f":"IF(ISNUMBER(AE:AE),YEAR(AE:AE),AE:AE)","v":"pas d'actualité"},{"$f":"IF(AE:AE=\"pas d'actualité\",3,IF(AE:AE=\"?\",\"?\",IF(AE:AE=\"?\",\"?\",IF($B$2-AF:AF>=0,0,IF($B$2-AF:AF>=-1,1,IF($B$2-AF:AF>=-2,2,3))))))","v":3},{"$f":"IF(AE:AE=\"pas d'actualité\",3,IF(AE:AE=\"?\",\"?\",IF(AE:AE=\"?\",\"?\",IF((($B$2+1)-AF:AF)>=0,\"0\",IF((($B$2+1)-AF:AF)>=-1,\"1\",IF((($B$2+1)-AF:AF)>=-2,\"2\",\"3\"))))))","v":3},{"$f":"IF(AE:AE=\"pas d'actualité\",3,IF(AE:AE=\"?\",\"?\",IF(AE:AE=\"?\",\"?\",IF((($B$2+2)-AF:AF)>=0,0,IF((($B$2+2)-AF:AF)>=-1,1,IF((($B$2+2)-AF:AF)>=-2,2,3))))))","v":3},{"$f":"IF(AE:AE=\"pas d'actualité\",3,IF(AE:AE=\"?\",\"?\",IF(AE:AE=\"?\",\"?\",IF(($B$2+3)-AF:AF>=0,0,IF(($B$2+3)-AF:AF>=-1,1,IF(($B$2+3)-AF:AF>=-2,2,3))))))","v":3},{"$f":"IF(AE:AE=\"pas d'actualité\",3,IF(AE:AE=\"?\",\"?\",IF(AE:AE=\"?\",\"?\",IF(($B$2+4)-AF:AF>=0,0,IF(($B$2+4)-AF:AF>=-1,1,IF(($B$2+4)-AF:AF>=-2,2,3))))))","v":3}]
["PR60","D60","FAB 60",null,1,null,null,"X","X",null,null,null,null,null,null,null,null,null,null,null,null,null,null,null,null,null,null,null,null,null,"pas d'actualité",{"$f":"IF(ISNUMBER(AE:AE),YEAR(AE:AE),AE:AE)","v":"pas d'actualité"},{"$f":"IF(AE:AE=\"pas d'actualité\",3,IF(AE:AE=\"?\",\"?\",IF(AE:AE=\"?\",\"?\",IF($B$2-AF:AF>=0,0,IF($B$2-AF:AF>=-1,1,IF($B$2-AF:AF>=-2,2,3))))))","v":3},{"$f":"IF(AE:AE=\"pas d'actualité\",3,IF(AE:AE=\"?\",\"?\",IF(AE:AE=\"?\",\"?\",IF((($B$2+1)-AF:AF)>=0,\"0\",IF((($B$2+1)-AF:AF)>=-1,\"1\",IF((($B$2+1)-AF:AF)>=-2,\"2\",\"3\"))))))","v":3},{"$f":"IF(AE:AE=\"pas d'actualité\",3,IF(AE:AE=\"?\",\"?\",IF(AE:AE=\"?\",\"?\",IF((($B$2+2)-AF:AF)>=0,0,IF((($B$2+2)-AF:AF)>=-1,1,IF((($B$2+2)-AF:AF)>=-2,2,3))))))","v":3},{"$f":"IF(AE:AE=\"pas d'actualité\",3,IF(AE:AE=\"?\",\"?\",IF(AE:AE=\"?\",\"?\",IF(($B$2+3)-AF:AF>=0,0,IF(($B$2+3)-AF:AF>=-1,1,IF(($B$2+3)-AF:AF>=-2,2,3))))))","v":3},{"$f":"IF(AE:AE=\"pas d'actualité\",3,IF(AE:AE=\"?\",\"?\",IF(AE:AE=\"?\",\"?\",IF(($B$2+4)-AF:AF>=0,0,IF(($B$2+4)-AF:AF>=-1,1,IF(($B$2+4)-AF:AF>=-2,2,3))))))","v":3}]
["PR61","D61","FAB 61",null,1,null,null,null,null,null,null,null,null,null,null,null,null,null,null,null,null,null,null,null,null,null,null,null,null,null,"pas d'actualité",{"$f":"IF(ISNUMBER(AE:AE),YEAR(AE:AE),AE:AE)","v":"pas d'actualité"},{"$f":"IF(AE:AE=\"pas d'actualité\",3,IF(AE:AE=\"?\",\"?\",IF(AE:AE=\"?\",\"?\",IF($B$2-AF:AF>=0,0,IF($B$2-AF:AF>=-1,1,IF($B$2-AF:AF>=-2,2,3))))))","v":3},{"$f":"IF(AE:AE=\"pas d'actualité\",3,IF(AE:AE=\"?\",\"?\",IF(AE:AE=\"?\",\"?\",IF((($B$2+1)-AF:AF)>=0,\"0\",IF((($B$2+1)-AF:AF)>=-1,\"1\",IF((($B$2+1)-AF:AF)>=-2,\"2\",\"3\"))))))","v":3},{"$f":"IF(AE:AE=\"pas d'actualité\",3,IF(AE:AE=\"?\",\"?\",IF(AE:AE=\"?\",\"?\",IF((($B$2+2)-AF:AF)>=0,0,IF((($B$2+2)-AF:AF)>=-1,1,IF((($B$2+2)-AF:AF)>=-2,2,3))))))","v":3},{"$f":"IF(AE:AE=\"pas d'actualité\",3,IF(AE:AE=\"?\",\"?\",IF(AE:AE=\"?\",\"?\",IF(($B$2+3)-AF:AF>=0,0,IF(($B$2+3)-AF:AF>=-1,1,IF(($B$2+3)-AF:AF>=-2,2,3))))))","v":3},{"$f":"IF(AE:AE=\"pas d'actualité\",3,IF(AE:AE=\"?\",\"?\",IF(AE:AE=\"?\",\"?\",IF(($B$2+4)-AF:AF>=0,0,IF(($B$2+4)-AF:AF>=-1,1,IF(($B$2+4)-AF:AF>=-2,2,3))))))","v":3}]
["PR62","D62","FAB 62",null,1,null,null,null,null,null,null,null,null,null,null,null,null,null,null,null,null,null,null,null,null,"X",null,null,null,null,"pas d'actualité",{"$f":"IF(ISNUMBER(AE:AE),YEAR(AE:AE),AE:AE)","v":"pas d'actualité"},{"$f":"IF(AE:AE=\"pas d'actualité\",3,IF(AE:AE=\"?\",\"?\",IF(AE:AE=\"?\",\"?\",IF($B$2-AF:AF>=0,0,IF($B$2-AF:AF>=-1,1,IF($B$2-AF:AF>=-2,2,3))))))","v":3},{"$f":"IF(AE:AE=\"pas d'actualité\",3,IF(AE:AE=\"?\",\"?\",IF(AE:AE=\"?\",\"?\",IF((($B$2+1)-AF:AF)>=0,\"0\",IF((($B$2+1)-AF:AF)>=-1,\"1\",IF((($B$2+1)-AF:AF)>=-2,\"2\",\"3\"))))))","v":3},{"$f":"IF(AE:AE=\"pas d'actualité\",3,IF(AE:AE=\"?\",\"?\",IF(AE:AE=\"?\",\"?\",IF((($B$2+2)-AF:AF)>=0,0,IF((($B$2+2)-AF:AF)>=-1,1,IF((($B$2+2)-AF:AF)>=-2,2,3))))))","v":3},{"$f":"IF(AE:AE=\"pas d'actualité\",3,IF(AE:AE=\"?\",\"?\",IF(AE:AE=\"?\",\"?\",IF(($B$2+3)-AF:AF>=0,0,IF(($B$2+3)-AF:AF>=-1,1,IF(($B$2+3)-AF:AF>=-2,2,3))))))","v":3},{"$f":"IF(AE:AE=\"pas d'actualité\",3,IF(AE:AE=\"?\",\"?\",IF(AE:AE=\"?\",\"?\",IF(($B$2+4)-AF:AF>=0,0,IF(($B$2+4)-AF:AF>=-1,1,IF(($B$2+4)-AF:AF>=-2,2,3))))))","v":3}]
["PR63","D63","FAB 63",null,1,null,null,null,null,null,null,null,null,null,null,null,null,null,null,null,null,null,null,null,null,"X",null,null,null,null,"pas d'actualité",{"$f":"IF(ISNUMBER(AE:AE),YEAR(AE:AE),AE:AE)","v":"pas d'actualité"},{"$f":"IF(AE:AE=\"pas d'actualité\",3,IF(AE:AE=\"?\",\"?\",IF(AE:AE=\"?\",\"?\",IF($B$2-AF:AF>=0,0,IF($B$2-AF:AF>=-1,1,IF($B$2-AF:AF>=-2,2,3))))))","v":3},{"$f":"IF(AE:AE=\"pas d'actualité\",3,IF(AE:AE=\"?\",\"?\",IF(AE:AE=\"?\",\"?\",IF((($B$2+1)-AF:AF)>=0,\"0\",IF((($B$2+1)-AF:AF)>=-1,\"1\",IF((($B$2+1)-AF:AF)>=-2,\"2\",\"3\"))))))","v":3},{"$f":"IF(AE:AE=\"pas d'actualité\",3,IF(AE:AE=\"?\",\"?\",IF(AE:AE=\"?\",\"?\",IF((($B$2+2)-AF:AF)>=0,0,IF((($B$2+2)-AF:AF)>=-1,1,IF((($B$2+2)-AF:AF)>=-2,2,3))))))","v":3},{"$f":"IF(AE:AE=\"pas d'actualité\",3,IF(AE:AE=\"?\",\"?\",IF(AE:AE=\"?\",\"?\",IF(($B$2+3)-AF:AF>=0,0,IF(($B$2+3)-AF:AF>=-1,1,IF(($B$2+3)-AF:AF>=-2,2,3))))))","v":3},{"$f":"IF(AE:AE=\"pas d'actualité\",3,IF(AE:AE=\"?\",\"?\",IF(AE:AE=\"?\",\"?\",IF(($B$2+4)-AF:AF>=0,0,IF(($B$2+4)-AF:AF>=-1,1,IF(($B$2+4)-AF:AF>=-2,2,3))))))","v":3}]
["PR64","D64","FAB 64",null,1,null,null,null,null,null,null,null,null,null,null,null,null,"X",null,null,null,null,null,null,null,null,null,null,null,null,"pas d'actualité",{"$f":"IF(ISNUMBER(AE:AE),YEAR(AE:AE),AE:AE)","v":"pas d'actualité"},{"$f":"IF(AE:AE=\"pas d'actualité\",3,IF(AE:AE=\"?\",\"?\",IF(AE:AE=\"?\",\"?\",IF($B$2-AF:AF>=0,0,IF($B$2-AF:AF>=-1,1,IF($B$2-AF:AF>=-2,2,3))))))","v":3},{"$f":"IF(AE:AE=\"pas d'actualité\",3,IF(AE:AE=\"?\",\"?\",IF(AE:AE=\"?\",\"?\",IF((($B$2+1)-AF:AF)>=0,\"0\",IF((($B$2+1)-AF:AF)>=-1,\"1\",IF((($B$2+1)-AF:AF)>=-2,\"2\",\"3\"))))))","v":3},{"$f":"IF(AE:AE=\"pas d'actualité\",3,IF(AE:AE=\"?\",\"?\",IF(AE:AE=\"?\",\"?\",IF((($B$2+2)-AF:AF)>=0,0,IF((($B$2+2)-AF:AF)>=-1,1,IF((($B$2+2)-AF:AF)>=-2,2,3))))))","v":3},{"$f":"IF(AE:AE=\"pas d'actualité\",3,IF(AE:AE=\"?\",\"?\",IF(AE:AE=\"?\",\"?\",IF(($B$2+3)-AF:AF>=0,0,IF(($B$2+3)-AF:AF>=-1,1,IF(($B$2+3)-AF:AF>=-2,2,3))))))","v":3},{"$f":"IF(AE:AE=\"pas d'actualité\",3,IF(AE:AE=\"?\",\"?\",IF(AE:AE=\"?\",\"?\",IF(($B$2+4)-AF:AF>=0,0,IF(($B$2+4)-AF:AF>=-1,1,IF(($B$2+4)-AF:AF>=-2,2,3))))))","v":3}]
["PR65","D65","FAB 65",null,null,null,null,null,null,null,null,null,null,null,null,null,null,null,null,null,null,null,null,null,null,null,null,null,null,null,"2020-01-10",{"$f":"IF(ISNUMBER(AE:AE),YEAR(AE:AE),AE:AE)","v":2020},{"$f":"IF(AE:AE=\"pas d'actualité\",3,IF(AE:AE=\"?\",\"?\",IF(AE:AE=\"?\",\"?\",IF($B$2-AF:AF>=0,0,IF($B$2-AF:AF>=-1,1,IF($B$2-AF:AF>=-2,2,3))))))","v":3},{"$f":"IF(AE:AE=\"pas d'actualité\",3,IF(AE:AE=\"?\",\"?\",IF(AE:AE=\"?\",\"?\",IF((($B$2+1)-AF:AF)>=0,\"0\",IF((($B$2+1)-AF:AF)>=-1,\"1\",IF((($B$2+1)-AF:AF)>=-2,\"2\",\"3\"))))))","v":"3"},{"$f":"IF(AE:AE=\"pas d'actualité\",3,IF(AE:AE=\"?\",\"?\",IF(AE:AE=\"?\",\"?\",IF((($B$2+2)-AF:AF)>=0,0,IF((($B$2+2)-AF:AF)>=-1,1,IF((($B$2+2)-AF:AF)>=-2,2,3))))))","v":2},{"$f":"IF(AE:AE=\"pas d'actualité\",3,IF(AE:AE=\"?\",\"?\",IF(AE:AE=\"?\",\"?\",IF(($B$2+3)-AF:AF>=0,0,IF(($B$2+3)-AF:AF>=-1,1,IF(($B$2+3)-AF:AF>=-2,2,3))))))","v":1},{"$f":"IF(AE:AE=\"pas d'actualité\",3,IF(AE:AE=\"?\",\"?\",IF(AE:AE=\"?\",\"?\",IF(($B$2+4)-AF:AF>=0,0,IF(($B$2+4)-AF:AF>=-1,1,IF(($B$2+4)-AF:AF>=-2,2,3))))))","v":0}]
["PR66","D66","FAB 66",null,null,null,null,null,null,null,null,null,null,null,null,null,null,null,null,null,null,null,null,null,null,null,null,null,null,null,"2020-01-10",{"$f":"IF(ISNUMBER(AE:AE),YEAR(AE:AE),AE:AE)","v":2020},{"$f":"IF(AE:AE=\"pas d'actualité\",3,IF(AE:AE=\"?\",\"?\",IF(AE:AE=\"?\",\"?\",IF($B$2-AF:AF>=0,0,IF($B$2-AF:AF>=-1,1,IF($B$2-AF:AF>=-2,2,3))))))","v":3},{"$f":"IF(AE:AE=\"pas d'actualité\",3,IF(AE:AE=\"?\",\"?\",IF(AE:AE=\"?\",\"?\",IF((($B$2+1)-AF:AF)>=0,\"0\",IF((($B$2+1)-AF:AF)>=-1,\"1\",IF((($B$2+1)-AF:AF)>=-2,\"2\",\"3\"))))))","v":"3"},{"$f":"IF(AE:AE=\"pas d'actualité\",3,IF(AE:AE=\"?\",\"?\",IF(AE:AE=\"?\",\"?\",IF((($B$2+2)-AF:AF)>=0,0,IF((($B$2+2)-AF:AF)>=-1,1,IF((($B$2+2)-AF:AF)>=-2,2,3))))))","v":2},{"$f":"IF(AE:AE=\"pas d'actualité\",3,IF(AE:AE=\"?\",\"?\",IF(AE:AE=\"?\",\"?\",IF(($B$2+3)-AF:AF>=0,0,IF(($B$2+3)-AF:AF>=-1,1,IF(($B$2+3)-AF:AF>=-2,2,3))))))","v":1},{"$f":"IF(AE:AE=\"pas d'actualité\",3,IF(AE:AE=\"?\",\"?\",IF(AE:AE=\"?\",\"?\",IF(($B$2+4)-AF:AF>=0,0,IF(($B$2+4)-AF:AF>=-1,1,IF(($B$2+4)-AF:AF>=-2,2,3))))))","v":0}]
["PR67","D67","FAB 67",null,1,null,null,null,null,null,null,null,null,null,null,null,null,"X",null,null,null,null,null,null,null,null,null,null,null,null,"2020-01-10",{"$f":"IF(ISNUMBER(AE:AE),YEAR(AE:AE),AE:AE)","v":2020},{"$f":"IF(AE:AE=\"pas d'actualité\",3,IF(AE:AE=\"?\",\"?\",IF(AE:AE=\"?\",\"?\",IF($B$2-AF:AF>=0,0,IF($B$2-AF:AF>=-1,1,IF($B$2-AF:AF>=-2,2,3))))))","v":3},{"$f":"IF(AE:AE=\"pas d'actualité\",3,IF(AE:AE=\"?\",\"?\",IF(AE:AE=\"?\",\"?\",IF((($B$2+1)-AF:AF)>=0,\"0\",IF((($B$2+1)-AF:AF)>=-1,\"1\",IF((($B$2+1)-AF:AF)>=-2,\"2\",\"3\"))))))","v":"3"},{"$f":"IF(AE:AE=\"pas d'actualité\",3,IF(AE:AE=\"?\",\"?\",IF(AE:AE=\"?\",\"?\",IF((($B$2+2)-AF:AF)>=0,0,IF((($B$2+2)-AF:AF)>=-1,1,IF((($B$2+2)-AF:AF)>=-2,2,3))))))","v":2},{"$f":"IF(AE:AE=\"pas d'actualité\",3,IF(AE:AE=\"?\",\"?\",IF(AE:AE=\"?\",\"?\",IF(($B$2+3)-AF:AF>=0,0,IF(($B$2+3)-AF:AF>=-1,1,IF(($B$2+3)-AF:AF>=-2,2,3))))))","v":1},{"$f":"IF(AE:AE=\"pas d'actualité\",3,IF(AE:AE=\"?\",\"?\",IF(AE:AE=\"?\",\"?\",IF(($B$2+4)-AF:AF>=0,0,IF(($B$2+4)-AF:AF>=-1,1,IF(($B$2+4)-AF:AF>=-2,2,3))))))","v":0},null,null,"réparable"]
["PR68","D68","FAB 68",null,1,null,null,null,null,null,null,null,null,null,null,null,null,"X",null,null,null,null,null,null,null,null,null,null,null,null,"2020-01-10",{"$f":"IF(ISNUMBER(AE:AE),YEAR(AE:AE),AE:AE)","v":2020},{"$f":"IF(AE:AE=\"pas d'actualité\",3,IF(AE:AE=\"?\",\"?\",IF(AE:AE=\"?\",\"?\",IF($B$2-AF:AF>=0,0,IF($B$2-AF:AF>=-1,1,IF($B$2-AF:AF>=-2,2,3))))))","v":3},{"$f":"IF(AE:AE=\"pas d'actualité\",3,IF(AE:AE=\"?\",\"?\",IF(AE:AE=\"?\",\"?\",IF((($B$2+1)-AF:AF)>=0,\"0\",IF((($B$2+1)-AF:AF)>=-1,\"1\",IF((($B$2+1)-AF:AF)>=-2,\"2\",\"3\"))))))","v":"3"},{"$f":"IF(AE:AE=\"pas d'actualité\",3,IF(AE:AE=\"?\",\"?\",IF(AE:AE=\"?\",\"?\",IF((($B$2+2)-AF:AF)>=0,0,IF((($B$2+2)-AF:AF)>=-1,1,IF((($B$2+2)-AF:AF)>=-2,2,3))))))","v":2},{"$f":"IF(AE:AE=\"pas d'actualité\",3,IF(AE:AE=\"?\",\"?\",IF(AE:AE=\"?\",\"?\",IF(($B$2+3)-AF:AF>=0,0,IF(($B$2+3)-AF:AF>=-1,1,IF(($B$2+3)-AF:AF>=-2,2,3))))))","v":1},{"$f":"IF(AE:AE=\"pas d'actualité\",3,IF(AE:AE=\"?\",\"?\",IF(AE:AE=\"?\",\"?\",IF(($B$2+4)-AF:AF>=0,0,IF(($B$2+4)-AF:AF>=-1,1,IF(($B$2+4)-AF:AF>=-2,2,3))))))","v":0}]
["PR69","D69","FAB 69",null,1,null,null,null,null,null,null,null,null,null,null,null,null,"X",null,null,null,null,null,null,null,null,null,null,null,null,"2020-01-10",{"$f":"IF(ISNUMBER(AE:AE),YEAR(AE:AE),AE:AE)","v":2020},{"$f":"IF(AE:AE=\"pas d'actualité\",3,IF(AE:AE=\"?\",\"?\",IF(AE:AE=\"?\",\"?\",IF($B$2-AF:AF>=0,0,IF($B$2-AF:AF>=-1,1,IF($B$2-AF:AF>=-2,2,3))))))","v":3},{"$f":"IF(AE:AE=\"pas d'actualité\",3,IF(AE:AE=\"?\",\"?\",IF(AE:AE=\"?\",\"?\",IF((($B$2+1)-AF:AF)>=0,\"0\",IF((($B$2+1)-AF:AF)>=-1,\"1\",IF((($B$2+1)-AF:AF)>=-2,\"2\",\"3\"))))))","v":"3"},{"$f":"IF(AE:AE=\"pas d'actualité\",3,IF(AE:AE=\"?\",\"?\",IF(AE:AE=\"?\",\"?\",IF((($B$2+2)-AF:AF)>=0,0,IF((($B$2+2)-AF:AF)>=-1,1,IF((($B$2+2)-AF:AF)>=-2,2,3))))))","v":2},{"$f":"IF(AE:AE=\"pas d'actualité\",3,IF(AE:AE=\"?\",\"?\",IF(AE:AE=\"?\",\"?\",IF(($B$2+3)-AF:AF>=0,0,IF(($B$2+3)-AF:AF>=-1,1,IF(($B$2+3)-AF:AF>=-2,2,3))))))","v":1},{"$f":"IF(AE:AE=\"pas d'actualité\",3,IF(AE:AE=\"?\",\"?\",IF(AE:AE=\"?\",\"?\",IF(($B$2+4)-AF:AF>=0,0,IF(($B$2+4)-AF:AF>=-1,1,IF(($B$2+4)-AF:AF>=-2,2,3))))))","v":0}]
["PR70","D70","FAB 70",null,1,null,null,null,null,null,null,null,null,null,null,null,null,"X",null,null,null,null,null,null,null,null,null,null,null,null,"2020-01-10",{"$f":"IF(ISNUMBER(AE:AE),YEAR(AE:AE),AE:AE)","v":2020},{"$f":"IF(AE:AE=\"pas d'actualité\",3,IF(AE:AE=\"?\",\"?\",IF(AE:AE=\"?\",\"?\",IF($B$2-AF:AF>=0,0,IF($B$2-AF:AF>=-1,1,IF($B$2-AF:AF>=-2,2,3))))))","v":3},{"$f":"IF(AE:AE=\"pas d'actualité\",3,IF(AE:AE=\"?\",\"?\",IF(AE:AE=\"?\",\"?\",IF((($B$2+1)-AF:AF)>=0,\"0\",IF((($B$2+1)-AF:AF)>=-1,\"1\",IF((($B$2+1)-AF:AF)>=-2,\"2\",\"3\"))))))","v":"3"},{"$f":"IF(AE:AE=\"pas d'actualité\",3,IF(AE:AE=\"?\",\"?\",IF(AE:AE=\"?\",\"?\",IF((($B$2+2)-AF:AF)>=0,0,IF((($B$2+2)-AF:AF)>=-1,1,IF((($B$2+2)-AF:AF)>=-2,2,3))))))","v":2},{"$f":"IF(AE:AE=\"pas d'actualité\",3,IF(AE:AE=\"?\",\"?\",IF(AE:AE=\"?\",\"?\",IF(($B$2+3)-AF:AF>=0,0,IF(($B$2+3)-AF:AF>=-1,1,IF(($B$2+3)-AF:AF>=-2,2,3))))))","v":1},{"$f":"IF(AE:AE=\"pas d'actualité\",3,IF(AE:AE=\"?\",\"?\",IF(AE:AE=\"?\",\"?\",IF(($B$2+4)-AF:AF>=0,0,IF(($B$2+4)-AF:AF>=-1,1,IF(($B$2+4)-AF:AF>=-2,2,3))))))","v":0}]
["PR71","D71","FAB 71",null,1,null,null,null,null,null,null,null,null,null,null,null,null,null,null,null,null,null,null,null,null,null,null,null,null,null,"2020-01-10",{"$f":"IF(ISNUMBER(AE:AE),YEAR(AE:AE),AE:AE)","v":2020},{"$f":"IF(AE:AE=\"pas d'actualité\",3,IF(AE:AE=\"?\",\"?\",IF(AE:AE=\"?\",\"?\",IF($B$2-AF:AF>=0,0,IF($B$2-AF:AF>=-1,1,IF($B$2-AF:AF>=-2,2,3))))))","v":3},{"$f":"IF(AE:AE=\"pas d'actualité\",3,IF(AE:AE=\"?\",\"?\",IF(AE:AE=\"?\",\"?\",IF((($B$2+1)-AF:AF)>=0,\"0\",IF((($B$2+1)-AF:AF)>=-1,\"1\",IF((($B$2+1)-AF:AF)>=-2,\"2\",\"3\"))))))","v":"3"},{"$f":"IF(AE:AE=\"pas d'actualité\",3,IF(AE:AE=\"?\",\"?\",IF(AE:AE=\"?\",\"?\",IF((($B$2+2)-AF:AF)>=0,0,IF((($B$2+2)-AF:AF)>=-1,1,IF((($B$2+2)-AF:AF)>=-2,2,3))))))","v":2},{"$f":"IF(AE:AE=\"pas d'actualité\",3,IF(AE:AE=\"?\",\"?\",IF(AE:AE=\"?\",\"?\",IF(($B$2+3)-AF:AF>=0,0,IF(($B$2+3)-AF:AF>=-1,1,IF(($B$2+3)-AF:AF>=-2,2,3))))))","v":1},{"$f":"IF(AE:AE=\"pas d'actualité\",3,IF(AE:AE=\"?\",\"?\",IF(AE:AE=\"?\",\"?\",IF(($B$2+4)-AF:AF>=0,0,IF(($B$2+4)-AF:AF>=-1,1,IF(($B$2+4)-AF:AF>=-2,2,3))))))","v":0}]
["PR72","D72","FAB 72",null,null,null,null,null,null,null,null,"X",null,null,null,null,null,null,null,null,null,null,null,null,null,null,null,null,null,null,"pas d'actualité",{"$f":"IF(ISNUMBER(AE:AE),YEAR(AE:AE),AE:AE)","v":"pas d'actualité"},{"$f":"IF(AE:AE=\"pas d'actualité\",3,IF(AE:AE=\"?\",\"?\",IF(AE:AE=\"?\",\"?\",IF($B$2-AF:AF>=0,0,IF($B$2-AF:AF>=-1,1,IF($B$2-AF:AF>=-2,2,3))))))","v":3},{"$f":"IF(AE:AE=\"pas d'actualité\",3,IF(AE:AE=\"?\",\"?\",IF(AE:AE=\"?\",\"?\",IF((($B$2+1)-AF:AF)>=0,\"0\",IF((($B$2+1)-AF:AF)>=-1,\"1\",IF((($B$2+1)-AF:AF)>=-2,\"2\",\"3\"))))))","v":3},{"$f":"IF(AE:AE=\"pas d'actualité\",3,IF(AE:AE=\"?\",\"?\",IF(AE:AE=\"?\",\"?\",IF((($B$2+2)-AF:AF)>=0,0,IF((($B$2+2)-AF:AF)>=-1,1,IF((($B$2+2)-AF:AF)>=-2,2,3))))))","v":3},{"$f":"IF(AE:AE=\"pas d'actualité\",3,IF(AE:AE=\"?\",\"?\",IF(AE:AE=\"?\",\"?\",IF(($B$2+3)-AF:AF>=0,0,IF(($B$2+3)-AF:AF>=-1,1,IF(($B$2+3)-AF:AF>=-2,2,3))))))","v":3},{"$f":"IF(AE:AE=\"pas d'actualité\",3,IF(AE:AE=\"?\",\"?\",IF(AE:AE=\"?\",\"?\",IF(($B$2+4)-AF:AF>=0,0,IF(($B$2+4)-AF:AF>=-1,1,IF(($B$2+4)-AF:AF>=-2,2,3))))))","v":3}]
["PR73","D73","FAB 73",null,null,null,null,null,null,null,null,"X",null,null,null,null,null,null,null,null,null,null,null,null,null,null,null,null,null,null,"pas d'actualité",{"$f":"IF(ISNUMBER(AE:AE),YEAR(AE:AE),AE:AE)","v":"pas d'actualité"},{"$f":"IF(AE:AE=\"pas d'actualité\",3,IF(AE:AE=\"?\",\"?\",IF(AE:AE=\"?\",\"?\",IF($B$2-AF:AF>=0,0,IF($B$2-AF:AF>=-1,1,IF($B$2-AF:AF>=-2,2,3))))))","v":3},{"$f":"IF(AE:AE=\"pas d'actualité\",3,IF(AE:AE=\"?\",\"?\",IF(AE:AE=\"?\",\"?\",IF((($B$2+1)-AF:AF)>=0,\"0\",IF((($B$2+1)-AF:AF)>=-1,\"1\",IF((($B$2+1)-AF:AF)>=-2,\"2\",\"3\"))))))","v":3},{"$f":"IF(AE:AE=\"pas d'actualité\",3,IF(AE:AE=\"?\",\"?\",IF(AE:AE=\"?\",\"?\",IF((($B$2+2)-AF:AF)>=0,0,IF((($B$2+2)-AF:AF)>=-1,1,IF((($B$2+2)-AF:AF)>=-2,2,3))))))","v":3},{"$f":"IF(AE:AE=\"pas d'actualité\",3,IF(AE:AE=\"?\",\"?\",IF(AE:AE=\"?\",\"?\",IF(($B$2+3)-AF:AF>=0,0,IF(($B$2+3)-AF:AF>=-1,1,IF(($B$2+3)-AF:AF>=-2,2,3))))))","v":3},{"$f":"IF(AE:AE=\"pas d'actualité\",3,IF(AE:AE=\"?\",\"?\",IF(AE:AE=\"?\",\"?\",IF(($B$2+4)-AF:AF>=0,0,IF(($B$2+4)-AF:AF>=-1,1,IF(($B$2+4)-AF:AF>=-2,2,3))))))","v":3},"6ES7138-4FA05-0AB0","Partiellement compatible"]
["PR74","D74","FAB 74",null,null,null,null,null,null,null,null,"X",null,null,null,null,null,null,null,null,null,null,null,null,null,null,null,null,null,null,"pas d'actualité",{"$f":"IF(ISNUMBER(AE:AE),YEAR(AE:AE),AE:AE)","v":"pas d'actualité"},{"$f":"IF(AE:AE=\"pas d'actualité\",3,IF(AE:AE=\"?\",\"?\",IF(AE:AE=\"?\",\"?\",IF($B$2-AF:AF>=0,0,IF($B$2-AF:AF>=-1,1,IF($B$2-AF:AF>=-2,2,3))))))","v":3},{"$f":"IF(AE:AE=\"pas d'actualité\",3,IF(AE:AE=\"?\",\"?\",IF(AE:AE=\"?\",\"?\",IF((($B$2+1)-AF:AF)>=0,\"0\",IF((($B$2+1)-AF:AF)>=-1,\"1\",IF((($B$2+1)-AF:AF)>=-2,\"2\",\"3\"))))))","v":3},{"$f":"IF(AE:AE=\"pas d'actualité\",3,IF(AE:AE=\"?\",\"?\",IF(AE:AE=\"?\",\"?\",IF((($B$2+2)-AF:AF)>=0,0,IF((($B$2+2)-AF:AF)>=-1,1,IF((($B$2+2)-AF:AF)>=-2,2,3))))))","v":3},{"$f":"IF(AE:AE=\"pas d'actualité\",3,IF(AE:AE=\"?\",\"?\",IF(AE:AE=\"?\",\"?\",IF(($B$2+3)-AF:AF>=0,0,IF(($B$2+3)-AF:AF>=-1,1,IF(($B$2+3)-AF:AF>=-2,2,3))))))","v":3},{"$f":"IF(AE:AE=\"pas d'actualité\",3,IF(AE:AE=\"?\",\"?\",IF(AE:AE=\"?\",\"?\",IF(($B$2+4)-AF:AF>=0,0,IF(($B$2+4)-AF:AF>=-1,1,IF(($B$2+4)-AF:AF>=-2,2,3))))))","v":3},"6ES7138-4FB04-0AB0","Partiellement compatible"]
["PR75","D75","FAB 75",null,null,null,null,null,null,null,null,"X",null,null,null,null,null,null,null,null,null,null,null,null,null,null,null,null,null,null,"pas d'actualité",{"$f":"IF(ISNUMBER(AE:AE),YEAR(AE:AE),AE:AE)","v":"pas d'actualité"},{"$f":"IF(AE:AE=\"pas d'actualité\",3,IF(AE:AE=\"?\",\"?\",IF(AE:AE=\"?\",\"?\",IF($B$2-AF:AF>=0,0,IF($B$2-AF:AF>=-1,1,IF($B$2-AF:AF>=-2,2,3))))))","v":3},{"$f":"IF(AE:AE=\"pas d'actualité\",3,IF(AE:AE=\"?\",\"?\",IF(AE:AE=\"?\",\"?\",IF((($B$2+1)-AF:AF)>=0,\"0\",IF((($B$2+1)-AF:AF)>=-1,\"1\",IF((($B$2+1)-AF:AF)>=-2,\"2\",\"3\"))))))","v":3},{"$f":"IF(AE:AE=\"pas d'actualité\",3,IF(AE:AE=\"?\",\"?\",IF(AE:AE=\"?\",\"?\",IF((($B$2+2)-AF:AF)>=0,0,IF((($B$2+2)-AF:AF)>=-1,1,IF((($B$2+2)-AF:AF)>=-2,2,3))))))","v":3},{"$f":"IF(AE:AE=\"pas d'actualité\",3,IF(AE:AE=\"?\",\"?\",IF(AE:AE=\"?\",\"?\",IF(($B$2+3)-AF:AF>=0,0,IF(($B$2+3)-AF:AF>=-1,1,IF(($B$2+3)-AF:AF>=-2,2,3))))))","v":3},{"$f":"IF(AE:AE=\"pas d'actualité\",3,IF(AE:AE=\"?\",\"?\",IF(AE:AE=\"?\",\"?\",IF(($B$2+4)-AF:AF>=0,0,IF(($B$2+4)-AF:AF>=-1,1,IF(($B$2+4)-AF:AF>=-2,2,3))))))","v":3}]
["PR76","D76","FAB 76",null,null,null,null,null,null,null,null,"X",null,null,null,null,null,null,null,null,null,null,null,null,null,null,null,null,null,null,"pas d'actualité",{"$f":"IF(ISNUMBER(AE:AE),YEAR(AE:AE),AE:AE)","v":"pas d'actualité"},{"$f":"IF(AE:AE=\"pas d'actualité\",3,IF(AE:AE=\"?\",\"?\",IF(AE:AE=\"?\",\"?\",IF($B$2-AF:AF>=0,0,IF($B$2-AF:AF>=-1,1,IF($B$2-AF:AF>=-2,2,3))))))","v":3},{"$f":"IF(AE:AE=\"pas d'actualité\",3,IF(AE:AE=\"?\",\"?\",IF(AE:AE=\"?\",\"?\",IF((($B$2+1)-AF:AF)>=0,\"0\",IF((($B$2+1)-AF:AF)>=-1,\"1\",IF((($B$2+1)-AF:AF)>=-2,\"2\",\"3\"))))))","v":3},{"$f":"IF(AE:AE=\"pas d'actualité\",3,IF(AE:AE=\"?\",\"?\",IF(AE:AE=\"?\",\"?\",IF((($B$2+2)-AF:AF)>=0,0,IF((($B$2+2)-AF:AF)>=-1,1,IF((($B$2+2)-AF:AF)>=-2,2,3))))))","v":3},{"$f":"IF(AE:AE=\"pas d'actualité\",3,IF(AE:AE=\"?\",\"?\",IF(AE:AE=\"?\",\"?\",IF(($B$2+3)-AF:AF>=0,0,IF(($B$2+3)-AF:AF>=-1,1,IF(($B$2+3)-AF:AF>=-2,2,3))))))","v":3},{"$f":"IF(AE:AE=\"pas d'actualité\",3,IF(AE:AE=\"?\",\"?\",IF(AE:AE=\"?\",\"?\",IF(($B$2+4)-AF:AF>=0,0,IF(($B$2+4)-AF:AF>=-1,1,IF(($B$2+4)-AF:AF>=-2,2,3))))))","v":3}]
["PR77","D77","FAB 77",null,null,null,null,null,null,null,null,null,null,null,null,null,null,null,null,null,null,null,null,null,null,null,null,null,null,null,"pas d'actualité",{"$f":"IF(ISNUMBER(AE:AE),YEAR(AE:AE),AE:AE)","v":"pas d'actualité"},{"$f":"IF(AE:AE=\"pas d'actualité\",3,IF(AE:AE=\"?\",\"?\",IF(AE:AE=\"?\",\"?\",IF($B$2-AF:AF>=0,0,IF($B$2-AF:AF>=-1,1,IF($B$2-AF:AF>=-2,2,3))))))","v":3},{"$f":"IF(AE:AE=\"pas d'actualité\",3,IF(AE:AE=\"?\",\"?\",IF(AE:AE=\"?\",\"?\",IF((($B$2+1)-AF:AF)>=0,\"0\",IF((($B$2+1)-AF:AF)>=-1,\"1\",IF((($B$2+1)-AF:AF)>=-2,\"2\",\"3\"))))))","v":3},{"$f":"IF(AE:AE=\"pas d'actualité\",3,IF(AE:AE=\"?\",\"?\",IF(AE:AE=\"?\",\"?\",IF((($B$2+2)-AF:AF)>=0,0,IF((($B$2+2)-AF:AF)>=-1,1,IF((($B$2+2)-AF:AF)>=-2,2,3))))))","v":3},{"$f":"IF(AE:AE=\"pas d'actualité\",3,IF(AE:AE=\"?\",\"?\",IF(AE:AE=\"?\",\"?\",IF(($B$2+3)-AF:AF>=0,0,IF(($B$2+3)-AF:AF>=-1,1,IF(($B$2+3)-AF:AF>=-2,2,3))))))","v":3},{"$f":"IF(AE:AE=\"pas d'actualité\",3,IF(AE:AE=\"?\",\"?\",IF(AE:AE=\"?\",\"?\",IF(($B$2+4)-AF:AF>=0,0,IF(($B$2+4)-AF:AF>=-1,1,IF(($B$2+4)-AF:AF>=-2,2,3))))))","v":3}]
["PR78","D78","FAB 78",null,null,null,null,null,null,null,null,null,null,null,null,null,null,null,null,null,null,null,null,null,null,null,null,"X",null,null,"pas d'actualité",{"$f":"IF(ISNUMBER(AE:AE),YEAR(AE:AE),AE:AE)","v":"pas d'actualité"},{"$f":"IF(AE:AE=\"pas d'actualité\",3,IF(AE:AE=\"?\",\"?\",IF(AE:AE=\"?\",\"?\",IF($B$2-AF:AF>=0,0,IF($B$2-AF:AF>=-1,1,IF($B$2-AF:AF>=-2,2,3))))))","v":3},{"$f":"IF(AE:AE=\"pas d'actualité\",3,IF(AE:AE=\"?\",\"?\",IF(AE:AE=\"?\",\"?\",IF((($B$2+1)-AF:AF)>=0,\"0\",IF((($B$2+1)-AF:AF)>=-1,\"1\",IF((($B$2+1)-AF:AF)>=-2,\"2\",\"3\"))))))","v":3},{"$f":"IF(AE:AE=\"pas d'actualité\",3,IF(AE:AE=\"?\",\"?\",IF(AE:AE=\"?\",\"?\",IF((($B$2+2)-AF:AF)>=0,0,IF((($B$2+2)-AF:AF)>=-1,1,IF((($B$2+2)-AF:AF)>=-2,2,3))))))","v":3},{"$f":"IF(AE:AE=\"pas d'actualité\",3,IF(AE:AE=\"?\",\"?\",IF(AE:AE=\"?\",\"?\",IF(($B$2+3)-AF:AF>=0,0,IF(($B$2+3)-AF:AF>=-1,1,IF(($B$2+3)-AF:AF>=-2,2,3))))))","v":3},{"$f":"IF(AE:AE=\"pas d'actualité\",3,IF(AE:AE=\"?\",\"?\",IF(AE:AE=\"?\",\"?\",IF(($B$2+4)-AF:AF>=0,0,IF(($B$2+4)-AF:AF>=-1,1,IF(($B$2+4)-AF:AF>=-2,2,3))))))","v":3},"6ES7313-5BG04-0AB0"]
["PR79","D79","FAB 79",null,null,null,null,null,null,null,null,null,null,null,null,null,null,null,null,null,null,null,null,null,null,null,null,"X",null,null,"pas d'actualité",{"$f":"IF(ISNUMBER(AE:AE),YEAR(AE:AE),AE:AE)","v":"pas d'actualité"},{"$f":"IF(AE:AE=\"pas d'actualité\",3,IF(AE:AE=\"?\",\"?\",IF(AE:AE=\"?\",\"?\",IF($B$2-AF:AF>=0,0,IF($B$2-AF:AF>=-1,1,IF($B$2-AF:AF>=-2,2,3))))))","v":3},{"$f":"IF(AE:AE=\"pas d'actualité\",3,IF(AE:AE=\"?\",\"?\",IF(AE:AE=\"?\",\"?\",IF((($B$2+1)-AF:AF)>=0,\"0\",IF((($B$2+1)-AF:AF)>=-1,\"1\",IF((($B$2+1)-AF:AF)>=-2,\"2\",\"3\"))))))","v":3},{"$f":"IF(AE:AE=\"pas d'actualité\",3,IF(AE:AE=\"?\",\"?\",IF(AE:AE=\"?\",\"?\",IF((($B$2+2)-AF:AF)>=0,0,IF((($B$2+2)-AF:AF)>=-1,1,IF((($B$2+2)-AF:AF)>=-2,2,3))))))","v":3},{"$f":"IF(AE:AE=\"pas d'actualité\",3,IF(AE:AE=\"?\",\"?\",IF(AE:AE=\"?\",\"?\",IF(($B$2+3)-AF:AF>=0,0,IF(($B$2+3)-AF:AF>=-1,1,IF(($B$2+3)-AF:AF>=-2,2,3))))))","v":3},{"$f":"IF(AE:AE=\"pas d'actualité\",3,IF(AE:AE=\"?\",\"?\",IF(AE:AE=\"?\",\"?\",IF(($B$2+4)-AF:AF>=0,0,IF(($B$2+4)-AF:AF>=-1,1,IF(($B$2+4)-AF:AF>=-2,2,3))))))","v":3}]
["PR80","D80","FAB 80",null,1,null,null,null,null,null,null,null,null,null,null,null,null,null,null,null,null,null,null,null,null,null,null,"X",null,null,"pas d'actualité",{"$f":"IF(ISNUMBER(AE:AE),YEAR(AE:AE),AE:AE)","v":"pas d'actualité"},{"$f":"IF(AE:AE=\"pas d'actualité\",3,IF(AE:AE=\"?\",\"?\",IF(AE:AE=\"?\",\"?\",IF($B$2-AF:AF>=0,0,IF($B$2-AF:AF>=-1,1,IF($B$2-AF:AF>=-2,2,3))))))","v":3},{"$f":"IF(AE:AE=\"pas d'actualité\",3,IF(AE:AE=\"?\",\"?\",IF(AE:AE=\"?\",\"?\",IF((($B$2+1)-AF:AF)>=0,\"0\",IF((($B$2+1)-AF:AF)>=-1,\"1\",IF((($B$2+1)-AF:AF)>=-2,\"2\",\"3\"))))))","v":3},{"$f":"IF(AE:AE=\"pas d'actualité\",3,IF(AE:AE=\"?\",\"?\",IF(AE:AE=\"?\",\"?\",IF((($B$2+2)-AF:AF)>=0,0,IF((($B$2+2)-AF:AF)>=-1,1,IF((($B$2+2)-AF:AF)>=-2,2,3))))))","v":3},{"$f":"IF(AE:AE=\"pas d'actualité\",3,IF(AE:AE=\"?\",\"?\",IF(AE:AE=\"?\",\"?\",IF(($B$2+3)-AF:AF>=0,0,IF(($B$2+3)-AF:AF>=-1,1,IF(($B$2+3)-AF:AF>=-2,2,3))))))","v":3},{"$f":"IF(AE:AE=\"pas d'actualité\",3,IF(AE:AE=\"?\",\"?\",IF(AE:AE=\"?\",\"?\",IF(($B$2+4)-AF:AF>=0,0,IF(($B$2+4)-AF:AF>=-1,1,IF(($B$2+4)-AF:AF>=-2,2,3))))))","v":3},"6ES7313-6CG04-0AB0"]
["PR81","D81","FAB 81",null,1,null,null,null,null,null,null,null,null,null,null,null,null,null,null,null,null,null,null,null,null,null,null,"X",null,null,"pas d'actualité",{"$f":"IF(ISNUMBER(AE:AE),YEAR(AE:AE),AE:AE)","v":"pas d'actualité"},{"$f":"IF(AE:AE=\"pas d'actualité\",3,IF(AE:AE=\"?\",\"?\",IF(AE:AE=\"?\",\"?\",IF($B$2-AF:AF>=0,0,IF($B$2-AF:AF>=-1,1,IF($B$2-AF:AF>=-2,2,3))))))","v":3},{"$f":"IF(AE:AE=\"pas d'actualité\",3,IF(AE:AE=\"?\",\"?\",IF(AE:AE=\"?\",\"?\",IF((($B$2+1)-AF:AF)>=0,\"0\",IF((($B$2+1)-AF:AF)>=-1,\"1\",IF((($B$2+1)-AF:AF)>=-2,\"2\",\"3\"))))))","v":3},{"$f":"IF(AE:AE=\"pas d'actualité\",3,IF(AE:AE=\"?\",\"?\",IF(AE:AE=\"?\",\"?\",IF((($B$2+2)-AF:AF)>=0,0,IF((($B$2+2)-AF:AF)>=-1,1,IF((($B$2+2)-AF:AF)>=-2,2,3))))))","v":3},{"$f":"IF(AE:AE=\"pas d'actualité\",3,IF(AE:AE=\"?\",\"?\",IF(AE:AE=\"?\",\"?\",IF(($B$2+3)-AF:AF>=0,0,IF(($B$2+3)-AF:AF>=-1,1,IF(($B$2+3)-AF:AF>=-2,2,3))))))","v":3},{"$f":"IF(AE:AE=\"pas d'actualité\",3,IF(AE:AE=\"?\",\"?\",IF(AE:AE=\"?\",\"?\",IF(($B$2+4)-AF:AF>=0,0,IF(($B$2+4)-AF:AF>=-1,1,IF(($B$2+4)-AF:AF>=-2,2,3))))))","v":3}]
["PR82","D82","FAB 82",null,1,null,null,null,null,"X",null,null,null,null,null,null,null,null,null,null,null,null,null,null,null,null,null,null,null,null,"pas d'actualité",{"$f":"IF(ISNUMBER(AE:AE),YEAR(AE:AE),AE:AE)","v":"pas d'actualité"},{"$f":"IF(AE:AE=\"pas d'actualité\",3,IF(AE:AE=\"?\",\"?\",IF(AE:AE=\"?\",\"?\",IF($B$2-AF:AF>=0,0,IF($B$2-AF:AF>=-1,1,IF($B$2-AF:AF>=-2,2,3))))))","v":3},{"$f":"IF(AE:AE=\"pas d'actualité\",3,IF(AE:AE=\"?\",\"?\",IF(AE:AE=\"?\",\"?\",IF((($B$2+1)-AF:AF)>=0,\"0\",IF((($B$2+1)-AF:AF)>=-1,\"1\",IF((($B$2+1)-AF:AF)>=-2,\"2\",\"3\"))))))","v":3},{"$f":"IF(AE:AE=\"pas d'actualité\",3,IF(AE:AE=\"?\",\"?\",IF(AE:AE=\"?\",\"?\",IF((($B$2+2)-AF:AF)>=0,0,IF((($B$2+2)-AF:AF)>=-1,1,IF((($B$2+2)-AF:AF)>=-2,2,3))))))","v":3},{"$f":"IF(AE:AE=\"pas d'actualité\",3,IF(AE:AE=\"?\",\"?\",IF(AE:AE=\"?\",\"?\",IF(($B$2+3)-AF:AF>=0,0,IF(($B$2+3)-AF:AF>=-1,1,IF(($B$2+3)-AF:AF>=-2,2,3))))))","v":3},{"$f":"IF(AE:AE=\"pas d'actualité\",3,IF(AE:AE=\"?\",\"?\",IF(AE:AE=\"?\",\"?\",IF(($B$2+4)-AF:AF>=0,0,IF(($B$2+4)-AF:AF>=-1,1,IF(($B$2+4)-AF:AF>=-2,2,3))))))","v":3},"6ES7314-6CH04-0AB0"]
["PR83","D83","FAB 83",null,1,null,null,null,null,null,null,null,null,null,null,null,null,null,null,null,null,null,null,null,null,null,null,null,null,null,"pas d'actualité",{"$f":"IF(ISNUMBER(AE:AE),YEAR(AE:AE),AE:AE)","v":"pas d'actualité"},{"$f":"IF(AE:AE=\"pas d'actualité\",3,IF(AE:AE=\"?\",\"?\",IF(AE:AE=\"?\",\"?\",IF($B$2-AF:AF>=0,0,IF($B$2-AF:AF>=-1,1,IF($B$2-AF:AF>=-2,2,3))))))","v":3},{"$f":"IF(AE:AE=\"pas d'actualité\",3,IF(AE:AE=\"?\",\"?\",IF(AE:AE=\"?\",\"?\",IF((($B$2+1)-AF:AF)>=0,\"0\",IF((($B$2+1)-AF:AF)>=-1,\"1\",IF((($B$2+1)-AF:AF)>=-2,\"2\",\"3\"))))))","v":3},{"$f":"IF(AE:AE=\"pas d'actualité\",3,IF(AE:AE=\"?\",\"?\",IF(AE:AE=\"?\",\"?\",IF((($B$2+2)-AF:AF)>=0,0,IF((($B$2+2)-AF:AF)>=-1,1,IF((($B$2+2)-AF:AF)>=-2,2,3))))))","v":3},{"$f":"IF(AE:AE=\"pas d'actualité\",3,IF(AE:AE=\"?\",\"?\",IF(AE:AE=\"?\",\"?\",IF(($B$2+3)-AF:AF>=0,0,IF(($B$2+3)-AF:AF>=-1,1,IF(($B$2+3)-AF:AF>=-2,2,3))))))","v":3},{"$f":"IF(AE:AE=\"pas d'actualité\",3,IF(AE:AE=\"?\",\"?\",IF(AE:AE=\"?\",\"?\",IF(($B$2+4)-AF:AF>=0,0,IF(($B$2+4)-AF:AF>=-1,1,IF(($B$2+4)-AF:AF>=-2,2,3))))))","v":3}]
["PR84","D84","FAB 84",null,1,null,null,"X","X",null,"X",null,null,null,null,null,null,null,null,null,null,null,null,null,null,null,null,null,null,null,"pas d'actualité",{"$f":"IF(ISNUMBER(AE:AE),YEAR(AE:AE),AE:AE)","v":"pas d'actualité"},{"$f":"IF(AE:AE=\"pas d'actualité\",3,IF(AE:AE=\"?\",\"?\",IF(AE:AE=\"?\",\"?\",IF($B$2-AF:AF>=0,0,IF($B$2-AF:AF>=-1,1,IF($B$2-AF:AF>=-2,2,3))))))","v":3},{"$f":"IF(AE:AE=\"pas d'actualité\",3,IF(AE:AE=\"?\",\"?\",IF(AE:AE=\"?\",\"?\",IF((($B$2+1)-AF:AF)>=0,\"0\",IF((($B$2+1)-AF:AF)>=-1,\"1\",IF((($B$2+1)-AF:AF)>=-2,\"2\",\"3\"))))))","v":3},{"$f":"IF(AE:AE=\"pas d'actualité\",3,IF(AE:AE=\"?\",\"?\",IF(AE:AE=\"?\",\"?\",IF((($B$2+2)-AF:AF)>=0,0,IF((($B$2+2)-AF:AF)>=-1,1,IF((($B$2+2)-AF:AF)>=-2,2,3))))))","v":3},{"$f":"IF(AE:AE=\"pas d'actualité\",3,IF(AE:AE=\"?\",\"?\",IF(AE:AE=\"?\",\"?\",IF(($B$2+3)-AF:AF>=0,0,IF(($B$2+3)-AF:AF>=-1,1,IF(($B$2+3)-AF:AF>=-2,2,3))))))","v":3},{"$f":"IF(AE:AE=\"pas d'actualité\",3,IF(AE:AE=\"?\",\"?\",IF(AE:AE=\"?\",\"?\",IF(($B$2+4)-AF:AF>=0,0,IF(($B$2+4)-AF:AF>=-1,1,IF(($B$2+4)-AF:AF>=-2,2,3))))))","v":3},"6ES7315-2EH14-0AB0"]
["PR85","D85","FAB 85",null,1,null,null,"X","X",null,"X",null,null,null,null,null,null,null,null,null,null,null,null,null,null,null,null,null,null,null,"pas d'actualité",{"$f":"IF(ISNUMBER(AE:AE),YEAR(AE:AE),AE:AE)","v":"pas d'actualité"},{"$f":"IF(AE:AE=\"pas d'actualité\",3,IF(AE:AE=\"?\",\"?\",IF(AE:AE=\"?\",\"?\",IF($B$2-AF:AF>=0,0,IF($B$2-AF:AF>=-1,1,IF($B$2-AF:AF>=-2,2,3))))))","v":3},{"$f":"IF(AE:AE=\"pas d'actualité\",3,IF(AE:AE=\"?\",\"?\",IF(AE:AE=\"?\",\"?\",IF((($B$2+1)-AF:AF)>=0,\"0\",IF((($B$2+1)-AF:AF)>=-1,\"1\",IF((($B$2+1)-AF:AF)>=-2,\"2\",\"3\"))))))","v":3},{"$f":"IF(AE:AE=\"pas d'actualité\",3,IF(AE:AE=\"?\",\"?\",IF(AE:AE=\"?\",\"?\",IF((($B$2+2)-AF:AF)>=0,0,IF((($B$2+2)-AF:AF)>=-1,1,IF((($B$2+2)-AF:AF)>=-2,2,3))))))","v":3},{"$f":"IF(AE:AE=\"pas d'actualité\",3,IF(AE:AE=\"?\",\"?\",IF(AE:AE=\"?\",\"?\",IF(($B$2+3)-AF:AF>=0,0,IF(($B$2+3)-AF:AF>=-1,1,IF(($B$2+3)-AF:AF>=-2,2,3))))))","v":3},{"$f":"IF(AE:AE=\"pas d'actualité\",3,IF(AE:AE=\"?\",\"?\",IF(AE:AE=\"?\",\"?\",IF(($B$2+4)-AF:AF>=0,0,IF(($B$2+4)-AF:AF>=-1,1,IF(($B$2+4)-AF:AF>=-2,2,3))))))","v":3}]
["PR86","D86","FAB 86",null,1,null,null,"X","X",null,null,null,null,null,null,null,null,null,null,null,null,null,null,null,null,null,null,null,null,null,"pas d'actualité",{"$f":"IF(ISNUMBER(AE:AE),YEAR(AE:AE),AE:AE)","v":"pas d'actualité"},{"$f":"IF(AE:AE=\"pas d'actualité\",3,IF(AE:AE=\"?\",\"?\",IF(AE:AE=\"?\",\"?\",IF($B$2-AF:AF>=0,0,IF($B$2-AF:AF>=-1,1,IF($B$2-AF:AF>=-2,2,3))))))","v":3},{"$f":"IF(AE:AE=\"pas d'actualité\",3,IF(AE:AE=\"?\",\"?\",IF(AE:AE=\"?\",\"?\",IF((($B$2+1)-AF:AF)>=0,\"0\",IF((($B$2+1)-AF:AF)>=-1,\"1\",IF((($B$2+1)-AF:AF)>=-2,\"2\",\"3\"))))))","v":3},{"$f":"IF(AE:AE=\"pas d'actualité\",3,IF(AE:AE=\"?\",\"?\",IF(AE:AE=\"?\",\"?\",IF((($B$2+2)-AF:AF)>=0,0,IF((($B$2+2)-AF:AF)>=-1,1,IF((($B$2+2)-AF:AF)>=-2,2,3))))))","v":3},{"$f":"IF(AE:AE=\"pas d'actualité\",3,IF(AE:AE=\"?\",\"?\",IF(AE:AE=\"?\",\"?\",IF(($B$2+3)-AF:AF>=0,0,IF(($B$2+3)-AF:AF>=-1,1,IF(($B$2+3)-AF:AF>=-2,2,3))))))","v":3},{"$f":"IF(AE:AE=\"pas d'actualité\",3,IF(AE:AE=\"?\",\"?\",IF(AE:AE=\"?\",\"?\",IF(($B$2+4)-AF:AF>=0,0,IF(($B$2+4)-AF:AF>=-1,1,IF(($B$2+4)-AF:AF>=-2,2,3))))))","v":3}]
["PR87","D87","FAB 87",null,1,null,null,"X","X",null,null,null,null,null,null,null,null,null,null,null,null,null,null,null,null,null,null,null,null,null,"pas d'actualité",{"$f":"IF(ISNUMBER(AE:AE),YEAR(AE:AE),AE:AE)","v":"pas d'actualité"},{"$f":"IF(AE:AE=\"pas d'actualité\",3,IF(AE:AE=\"?\",\"?\",IF(AE:AE=\"?\",\"?\",IF($B$2-AF:AF>=0,0,IF($B$2-AF:AF>=-1,1,IF($B$2-AF:AF>=-2,2,3))))))","v":3},{"$f":"IF(AE:AE=\"pas d'actualité\",3,IF(AE:AE=\"?\",\"?\",IF(AE:AE=\"?\",\"?\",IF((($B$2+1)-AF:AF)>=0,\"0\",IF((($B$2+1)-AF:AF)>=-1,\"1\",IF((($B$2+1)-AF:AF)>=-2,\"2\",\"3\"))))))","v":3},{"$f":"IF(AE:AE=\"pas d'actualité\",3,IF(AE:AE=\"?\",\"?\",IF(AE:AE=\"?\",\"?\",IF((($B$2+2)-AF:AF)>=0,0,IF((($B$2+2)-AF:AF)>=-1,1,IF((($B$2+2)-AF:AF)>=-2,2,3))))))","v":3},{"$f":"IF(AE:AE=\"pas d'actualité\",3,IF(AE:AE=\"?\",\"?\",IF(AE:AE=\"?\",\"?\",IF(($B$2+3)-AF:AF>=0,0,IF(($B$2+3)-AF:AF>=-1,1,IF(($B$2+3)-AF:AF>=-2,2,3))))))","v":3},{"$f":"IF(AE:AE=\"pas d'actualité\",3,IF(AE:AE=\"?\",\"?\",IF(AE:AE=\"?\",\"?\",IF(($B$2+4)-AF:AF>=0,0,IF(($B$2+4)-AF:AF>=-1,1,IF(($B$2+4)-AF:AF>=-2,2,3))))))","v":3}]
["PR88","D88","FAB 88",null,1,null,null,"X","X","X","X","X",null,null,null,null,null,null,null,null,null,null,null,null,null,"X",null,null,null,null,"pas d'actualité",{"$f":"IF(ISNUMBER(AE:AE),YEAR(AE:AE),AE:AE)","v":"pas d'actualité"},{"$f":"IF(AE:AE=\"pas d'actualité\",3,IF(AE:AE=\"?\",\"?\",IF(AE:AE=\"?\",\"?\",IF($B$2-AF:AF>=0,0,IF($B$2-AF:AF>=-1,1,IF($B$2-AF:AF>=-2,2,3))))))","v":3},{"$f":"IF(AE:AE=\"pas d'actualité\",3,IF(AE:AE=\"?\",\"?\",IF(AE:AE=\"?\",\"?\",IF((($B$2+1)-AF:AF)>=0,\"0\",IF((($B$2+1)-AF:AF)>=-1,\"1\",IF((($B$2+1)-AF:AF)>=-2,\"2\",\"3\"))))))","v":3},{"$f":"IF(AE:AE=\"pas d'actualité\",3,IF(AE:AE=\"?\",\"?\",IF(AE:AE=\"?\",\"?\",IF((($B$2+2)-AF:AF)>=0,0,IF((($B$2+2)-AF:AF)>=-1,1,IF((($B$2+2)-AF:AF)>=-2,2,3))))))","v":3},{"$f":"IF(AE:AE=\"pas d'actualité\",3,IF(AE:AE=\"?\",\"?\",IF(AE:AE=\"?\",\"?\",IF(($B$2+3)-AF:AF>=0,0,IF(($B$2+3)-AF:AF>=-1,1,IF(($B$2+3)-AF:AF>=-2,2,3))))))","v":3},{"$f":"IF(AE:AE=\"pas d'actualité\",3,IF(AE:AE=\"?\",\"?\",IF(AE:AE=\"?\",\"?\",IF(($B$2+4)-AF:AF>=0,0,IF(($B$2+4)-AF:AF>=-1,1,IF(($B$2+4)-AF:AF>=-2,2,3))))))","v":3}]
["PR89","D89","FAB 89",null,1,null,null,null,null,null,null,null,null,null,null,null,null,null,null,null,null,null,null,null,null,null,null,"X",null,null,"pas d'actualité",{"$f":"IF(ISNUMBER(AE:AE),YEAR(AE:AE),AE:AE)","v":"pas d'actualité"},{"$f":"IF(AE:AE=\"pas d'actualité\",3,IF(AE:AE=\"?\",\"?\",IF(AE:AE=\"?\",\"?\",IF($B$2-AF:AF>=0,0,IF($B$2-AF:AF>=-1,1,IF($B$2-AF:AF>=-2,2,3))))))","v":3},{"$f":"IF(AE:AE=\"pas d'actualité\",3,IF(AE:AE=\"?\",\"?\",IF(AE:AE=\"?\",\"?\",IF((($B$2+1)-AF:AF)>=0,\"0\",IF((($B$2+1)-AF:AF)>=-1,\"1\",IF((($B$2+1)-AF:AF)>=-2,\"2\",\"3\"))))))","v":3},{"$f":"IF(AE:AE=\"pas d'actualité\",3,IF(AE:AE=\"?\",\"?\",IF(AE:AE=\"?\",\"?\",IF((($B$2+2)-AF:AF)>=0,0,IF((($B$2+2)-AF:AF)>=-1,1,IF((($B$2+2)-AF:AF)>=-2,2,3))))))","v":3},{"$f":"IF(AE:AE=\"pas d'actualité\",3,IF(AE:AE=\"?\",\"?\",IF(AE:AE=\"?\",\"?\",IF(($B$2+3)-AF:AF>=0,0,IF(($B$2+3)-AF:AF>=-1,1,IF(($B$2+3)-AF:AF>=-2,2,3))))))","v":3},{"$f":"IF(AE:AE=\"pas d'actualité\",3,IF(AE:AE=\"?\",\"?\",IF(AE:AE=\"?\",\"?\",IF(($B$2+4)-AF:AF>=0,0,IF(($B$2+4)-AF:AF>=-1,1,IF(($B$2+4)-AF:AF>=-2,2,3))))))","v":3}]
["PR90","D90","FAB 90",null,1,null,null,"X","X",null,null,null,null,null,null,null,null,null,null,null,null,null,null,null,null,null,null,null,null,null,"pas d'actualité",{"$f":"IF(ISNUMBER(AE:AE),YEAR(AE:AE),AE:AE)","v":"pas d'actualité"},{"$f":"IF(AE:AE=\"pas d'actualité\",3,IF(AE:AE=\"?\",\"?\",IF(AE:AE=\"?\",\"?\",IF($B$2-AF:AF>=0,0,IF($B$2-AF:AF>=-1,1,IF($B$2-AF:AF>=-2,2,3))))))","v":3},{"$f":"IF(AE:AE=\"pas d'actualité\",3,IF(AE:AE=\"?\",\"?\",IF(AE:AE=\"?\",\"?\",IF((($B$2+1)-AF:AF)>=0,\"0\",IF((($B$2+1)-AF:AF)>=-1,\"1\",IF((($B$2+1)-AF:AF)>=-2,\"2\",\"3\"))))))","v":3},{"$f":"IF(AE:AE=\"pas d'actualité\",3,IF(AE:AE=\"?\",\"?\",IF(AE:AE=\"?\",\"?\",IF((($B$2+2)-AF:AF)>=0,0,IF((($B$2+2)-AF:AF)>=-1,1,IF((($B$2+2)-AF:AF)>=-2,2,3))))))","v":3},{"$f":"IF(AE:AE=\"pas d'actualité\",3,IF(AE:AE=\"?\",\"?\",IF(AE:AE=\"?\",\"?\",IF(($B$2+3)-AF:AF>=0,0,IF(($B$2+3)-AF:AF>=-1,1,IF(($B$2+3)-AF:AF>=-2,2,3))))))","v":3},{"$f":"IF(AE:AE=\"pas d'actualité\",3,IF(AE:AE=\"?\",\"?\",IF(AE:AE=\"?\",\"?\",IF(($B$2+4)-AF:AF>=0,0,IF(($B$2+4)-AF:AF>=-1,1,IF(($B$2+4)-AF:AF>=-2,2,3))))))","v":3}]
["PR91","D91","FAB 91",null,null,null,null,null,null,null,null,null,null,null,null,null,null,null,null,null,null,null,null,null,null,null,null,null,null,null,"pas d'actualité",{"$f":"IF(ISNUMBER(AE:AE),YEAR(AE:AE),AE:AE)","v":"pas d'actualité"},{"$f":"IF(AE:AE=\"pas d'actualité\",3,IF(AE:AE=\"?\",\"?\",IF(AE:AE=\"?\",\"?\",IF($B$2-AF:AF>=0,0,IF($B$2-AF:AF>=-1,1,IF($B$2-AF:AF>=-2,2,3))))))","v":3},{"$f":"IF(AE:AE=\"pas d'actualité\",3,IF(AE:AE=\"?\",\"?\",IF(AE:AE=\"?\",\"?\",IF((($B$2+1)-AF:AF)>=0,\"0\",IF((($B$2+1)-AF:AF)>=-1,\"1\",IF((($B$2+1)-AF:AF)>=-2,\"2\",\"3\"))))))","v":3},{"$f":"IF(AE:AE=\"pas d'actualité\",3,IF(AE:AE=\"?\",\"?\",IF(AE:AE=\"?\",\"?\",IF((($B$2+2)-AF:AF)>=0,0,IF((($B$2+2)-AF:AF)>=-1,1,IF((($B$2+2)-AF:AF)>=-2,2,3))))))","v":3},{"$f":"IF(AE:AE=\"pas d'actualité\",3,IF(AE:AE=\"?\",\"?\",IF(AE:AE=\"?\",\"?\",IF(($B$2+3)-AF:AF>=0,0,IF(($B$2+3)-AF:AF>=-1,1,IF(($B$2+3)-AF:AF>=-2,2,3))))))","v":3},{"$f":"IF(AE:AE=\"pas d'actualité\",3,IF(AE:AE=\"?\",\"?\",IF(AE:AE=\"?\",\"?\",IF(($B$2+4)-AF:AF>=0,0,IF(($B$2+4)-AF:AF>=-1,1,IF(($B$2+4)-AF:AF>=-2,2,3))))))","v":3}]
["PR92","D92","FAB 92",null,1,null,null,"X","X",null,null,null,null,null,null,null,null,null,null,null,null,null,null,null,null,null,null,null,null,null,"2024-09-30",{"$f":"IF(ISNUMBER(AE:AE),YEAR(AE:AE),AE:AE)","v":2024},{"$f":"IF(AE:AE=\"pas d'actualité\",3,IF(AE:AE=\"?\",\"?\",IF(AE:AE=\"?\",\"?\",IF($B$2-AF:AF>=0,0,IF($B$2-AF:AF>=-1,1,IF($B$2-AF:AF>=-2,2,3))))))","v":3},{"$f":"IF(AE:AE=\"pas d'actualité\",3,IF(AE:AE=\"?\",\"?\",IF(AE:AE=\"?\",\"?\",IF((($B$2+1)-AF:AF)>=0,\"0\",IF((($B$2+1)-AF:AF)>=-1,\"1\",IF((($B$2+1)-AF:AF)>=-2,\"2\",\"3\"))))))","v":"3"},{"$f":"IF(AE:AE=\"pas d'actualité\",3,IF(AE:AE=\"?\",\"?\",IF(AE:AE=\"?\",\"?\",IF((($B$2+2)-AF:AF)>=0,0,IF((($B$2+2)-AF:AF)>=-1,1,IF((($B$2+2)-AF:AF)>=-2,2,3))))))","v":3},{"$f":"IF(AE:AE=\"pas d'actualité\",3,IF(AE:AE=\"?\",\"?\",IF(AE:AE=\"?\",\"?\",IF(($B$2+3)-AF:AF>=0,0,IF(($B$2+3)-AF:AF>=-1,1,IF(($B$2+3)-AF:AF>=-2,2,3))))))","v":3},{"$f":"IF(AE:AE=\"pas d'actualité\",3,IF(AE:AE=\"?\",\"?\",IF(AE:AE=\"?\",\"?\",IF(($B$2+4)-AF:AF>=0,0,IF(($B$2+4)-AF:AF>=-1,1,IF(($B$2+4)-AF:AF>=-2,2,3))))))","v":3}]
["PR93","D93","FAB 93",null,1,null,null,"X","X",null,null,null,null,null,null,null,null,null,null,null,null,null,null,null,null,null,null,null,null,null,"pas d'actualité",{"$f":"IF(ISNUMBER(AE:AE),YEAR(AE:AE),AE:AE)","v":"pas d'actualité"},{"$f":"IF(AE:AE=\"pas d'actualité\",3,IF(AE:AE=\"?\",\"?\",IF(AE:AE=\"?\",\"?\",IF($B$2-AF:AF>=0,0,IF($B$2-AF:AF>=-1,1,IF($B$2-AF:AF>=-2,2,3))))))","v":3},{"$f":"IF(AE:AE=\"pas d'actualité\",3,IF(AE:AE=\"?\",\"?\",IF(AE:AE=\"?\",\"?\",IF((($B$2+1)-AF:AF)>=0,\"0\",IF((($B$2+1)-AF:AF)>=-1,\"1\",IF((($B$2+1)-AF:AF)>=-2,\"2\",\"3\"))))))","v":3},{"$f":"IF(AE:AE=\"pas d'actualité\",3,IF(AE:AE=\"?\",\"?\",IF(AE:AE=\"?\",\"?\",IF((($B$2+2)-AF:AF)>=0,0,IF((($B$2+2)-AF:AF)>=-1,1,IF((($B$2+2)-AF:AF)>=-2,2,3))))))","v":3},{"$f":"IF(AE:AE=\"pas d'actualité\",3,IF(AE:AE=\"?\",\"?\",IF(AE:AE=\"?\",\"?\",IF(($B$2+3)-AF:AF>=0,0,IF(($B$2+3)-AF:AF>=-1,1,IF(($B$2+3)-AF:AF>=-2,2,3))))))","v":3},{"$f":"IF(AE:AE=\"pas d'actualité\",3,IF(AE:AE=\"?\",\"?\",IF(AE:AE=\"?\",\"?\",IF(($B$2+4)-AF:AF>=0,0,IF(($B$2+4)-AF:AF>=-1,1,IF(($B$2+4)-AF:AF>=-2,2,3))))))","v":3}]
["PR94","D94","FAB 94",null,null,null,null,null,null,null,null,"X",null,null,null,null,null,null,null,null,null,null,null,null,null,null,null,null,null,null,"pas d'actualité",{"$f":"IF(ISNUMBER(AE:AE),YEAR(AE:AE),AE:AE)","v":"pas d'actualité"},{"$f":"IF(AE:AE=\"pas d'actualité\",3,IF(AE:AE=\"?\",\"?\",IF(AE:AE=\"?\",\"?\",IF($B$2-AF:AF>=0,0,IF($B$2-AF:AF>=-1,1,IF($B$2-AF:AF>=-2,2,3))))))","v":3},{"$f":"IF(AE:AE=\"pas d'actualité\",3,IF(AE:AE=\"?\",\"?\",IF(AE:AE=\"?\",\"?\",IF((($B$2+1)-AF:AF)>=0,\"0\",IF((($B$2+1)-AF:AF)>=-1,\"1\",IF((($B$2+1)-AF:AF)>=-2,\"2\",\"3\"))))))","v":3},{"$f":"IF(AE:AE=\"pas d'actualité\",3,IF(AE:AE=\"?\",\"?\",IF(AE:AE=\"?\",\"?\",IF((($B$2+2)-AF:AF)>=0,0,IF((($B$2+2)-AF:AF)>=-1,1,IF((($B$2+2)-AF:AF)>=-2,2,3))))))","v":3},{"$f":"IF(AE:AE=\"pas d'actualité\",3,IF(AE:AE=\"?\",\"?\",IF(AE:AE=\"?\",\"?\",IF(($B$2+3)-AF:AF>=0,0,IF(($B$2+3)-AF:AF>=-1,1,IF(($B$2+3)-AF:AF>=-2,2,3))))))","v":3},{"$f":"IF(AE:AE=\"pas d'actualité\",3,IF(AE:AE=\"?\",\"?\",IF(AE:AE=\"?\",\"?\",IF(($B$2+4)-AF:AF>=0,0,IF(($B$2+4)-AF:AF>=-1,1,IF(($B$2+4)-AF:AF>=-2,2,3))))))","v":3}]
["PR95","D95","FAB 95",null,1,null,null,null,null,null,null,null,null,null,null,null,null,null,null,null,null,null,null,null,null,null,null,"X",null,null,"pas d'actualité",{"$f":"IF(ISNUMBER(AE:AE),YEAR(AE:AE),AE:AE)","v":"pas d'actualité"},{"$f":"IF(AE:AE=\"pas d'actualité\",3,IF(AE:AE=\"?\",\"?\",IF(AE:AE=\"?\",\"?\",IF($B$2-AF:AF>=0,0,IF($B$2-AF:AF>=-1,1,IF($B$2-AF:AF>=-2,2,3))))))","v":3},{"$f":"IF(AE:AE=\"pas d'actualité\",3,IF(AE:AE=\"?\",\"?\",IF(AE:AE=\"?\",\"?\",IF((($B$2+1)-AF:AF)>=0,\"0\",IF((($B$2+1)-AF:AF)>=-1,\"1\",IF((($B$2+1)-AF:AF)>=-2,\"2\",\"3\"))))))","v":3},{"$f":"IF(AE:AE=\"pas d'actualité\",3,IF(AE:AE=\"?\",\"?\",IF(AE:AE=\"?\",\"?\",IF((($B$2+2)-AF:AF)>=0,0,IF((($B$2+2)-AF:AF)>=-1,1,IF((($B$2+2)-AF:AF)>=-2,2,3))))))","v":3},{"$f":"IF(AE:AE=\"pas d'actualité\",3,IF(AE:AE=\"?\",\"?\",IF(AE:AE=\"?\",\"?\",IF(($B$2+3)-AF:AF>=0,0,IF(($B$2+3)-AF:AF>=-1,1,IF(($B$2+3)-AF:AF>=-2,2,3))))))","v":3},{"$f":"IF(AE:AE=\"pas d'actualité\",3,IF(AE:AE=\"?\",\"?\",IF(AE:AE=\"?\",\"?\",IF(($B$2+4)-AF:AF>=0,0,IF(($B$2+4)-AF:AF>=-1,1,IF(($B$2+4)-AF:AF>=-2,2,3))))))","v":3}]
["PR96","D96","FAB 96",null,null,null,null,"X",null,null,null,null,null,null,null,null,null,null,null,null,null,null,null,null,null,null,null,null,null,null,"pas d'actualité",{"$f":"IF(ISNUMBER(AE:AE),YEAR(AE:AE),AE:AE)","v":"pas d'actualité"},{"$f":"IF(AE:AE=\"pas d'actualité\",3,IF(AE:AE=\"?\",\"?\",IF(AE:AE=\"?\",\"?\",IF($B$2-AF:AF>=0,0,IF($B$2-AF:AF>=-1,1,IF($B$2-AF:AF>=-2,2,3))))))","v":3},{"$f":"IF(AE:AE=\"pas d'actualité\",3,IF(AE:AE=\"?\",\"?\",IF(AE:AE=\"?\",\"?\",IF((($B$2+1)-AF:AF)>=0,\"0\",IF((($B$2+1)-AF:AF)>=-1,\"1\",IF((($B$2+1)-AF:AF)>=-2,\"2\",\"3\"))))))","v":3},{"$f":"IF(AE:AE=\"pas d'actualité\",3,IF(AE:AE=\"?\",\"?\",IF(AE:AE=\"?\",\"?\",IF((($B$2+2)-AF:AF)>=0,0,IF((($B$2+2)-AF:AF)>=-1,1,IF((($B$2+2)-AF:AF)>=-2,2,3))))))","v":3},{"$f":"IF(AE:AE=\"pas d'actualité\",3,IF(AE:AE=\"?\",\"?\",IF(AE:AE=\"?\",\"?\",IF(($B$2+3)-AF:AF>=0,0,IF(($B$2+3)-AF:AF>=-1,1,IF(($B$2+3)-AF:AF>=-2,2,3))))))","v":3},{"$f":"IF(AE:AE=\"pas d'actualité\",3,IF(AE:AE=\"?\",\"?\",IF(AE:AE=\"?\",\"?\",IF(($B$2+4)-AF:AF>=0,0,IF(($B$2+4)-AF:AF>=-1,1,IF(($B$2+4)-AF:AF>=-2,2,3))))))","v":3},null,null,"Annonce d'\u0092abandon du produit\n01/04/2006"]
["PR97","D97","FAB 97",null,1,null,null,null,null,"X","X","X",null,null,null,null,null,null,null,null,null,null,null,null,null,null,null,null,null,null,"pas d'actualité",{"$f":"IF(ISNUMBER(AE:AE),YEAR(AE:AE),AE:AE)","v":"pas d'actualité"},{"$f":"IF(AE:AE=\"pas d'actualité\",3,IF(AE:AE=\"?\",\"?\",IF(AE:AE=\"?\",\"?\",IF($B$2-AF:AF>=0,0,IF($B$2-AF:AF>=-1,1,IF($B$2-AF:AF>=-2,2,3))))))","v":3},{"$f":"IF(AE:AE=\"pas d'actualité\",3,IF(AE:AE=\"?\",\"?\",IF(AE:AE=\"?\",\"?\",IF((($B$2+1)-AF:AF)>=0,\"0\",IF((($B$2+1)-AF:AF)>=-1,\"1\",IF((($B$2+1)-AF:AF)>=-2,\"2\",\"3\"))))))","v":3},{"$f":"IF(AE:AE=\"pas d'actualité\",3,IF(AE:AE=\"?\",\"?\",IF(AE:AE=\"?\",\"?\",IF((($B$2+2)-AF:AF)>=0,0,IF((($B$2+2)-AF:AF)>=-1,1,IF((($B$2+2)-AF:AF)>=-2,2,3))))))","v":3},{"$f":"IF(AE:AE=\"pas d'actualité\",3,IF(AE:AE=\"?\",\"?\",IF(AE:AE=\"?\",\"?\",IF(($B$2+3)-AF:AF>=0,0,IF(($B$2+3)-AF:AF>=-1,1,IF(($B$2+3)-AF:AF>=-2,2,3))))))","v":3},{"$f":"IF(AE:AE=\"pas d'actualité\",3,IF(AE:AE=\"?\",\"?\",IF(AE:AE=\"?\",\"?\",IF(($B$2+4)-AF:AF>=0,0,IF(($B$2+4)-AF:AF>=-1,1,IF(($B$2+4)-AF:AF>=-2,2,3))))))","v":3}]
["PR98","D98","FAB 98",null,null,null,null,"X",null,null,null,null,null,null,null,null,null,null,null,null,null,null,null,null,null,null,null,null,null,null,"2019-09-30",{"$f":"IF(ISNUMBER(AE:AE),YEAR(AE:AE),AE:AE)","v":2019},{"$f":"IF(AE:AE=\"pas d'actualité\",3,IF(AE:AE=\"?\",\"?\",IF(AE:AE=\"?\",\"?\",IF($B$2-AF:AF>=0,0,IF($B$2-AF:AF>=-1,1,IF($B$2-AF:AF>=-2,2,3))))))","v":3},{"$f":"IF(AE:AE=\"pas d'actualité\",3,IF(AE:AE=\"?\",\"?\",IF(AE:AE=\"?\",\"?\",IF((($B$2+1)-AF:AF)>=0,\"0\",IF((($B$2+1)-AF:AF)>=-1,\"1\",IF((($B$2+1)-AF:AF)>=-2,\"2\",\"3\"))))))","v":"2"},{"$f":"IF(AE:AE=\"pas d'actualité\",3,IF(AE:AE=\"?\",\"?\",IF(AE:AE=\"?\",\"?\",IF((($B$2+2)-AF:AF)>=0,0,IF((($B$2+2)-AF:AF)>=-1,1,IF((($B$2+2)-AF:AF)>=-2,2,3))))))","v":1},{"$f":"IF(AE:AE=\"pas d'actualité\",3,IF(AE:AE=\"?\",\"?\",IF(AE:AE=\"?\",\"?\",IF(($B$2+3)-AF:AF>=0,0,IF(($B$2+3)-AF:AF>=-1,1,IF(($B$2+3)-AF:AF>=-2,2,3))))))","v":0},{"$f":"IF(AE:AE=\"pas d'actualité\",3,IF(AE:AE=\"?\",\"?\",IF(AE:AE=\"?\",\"?\",IF(($B$2+4)-AF:AF>=0,0,IF(($B$2+4)-AF:AF>=-1,1,IF(($B$2+4)-AF:AF>=-2,2,3))))))","v":0},"CNC KEYBOARD OP32 FROM VERSION F : NOT FOR MMC 100","?"]
["PR99","D99","FAB 99",null,null,null,null,"X",null,null,null,null,null,null,null,null,null,null,null,null,null,null,null,null,null,null,null,null,null,null,"2024-09-30",{"$f":"IF(ISNUMBER(AE:AE),YEAR(AE:AE),AE:AE)","v":2024},{"$f":"IF(AE:AE=\"pas d'actualité\",3,IF(AE:AE=\"?\",\"?\",IF(AE:AE=\"?\",\"?\",IF($B$2-AF:AF>=0,0,IF($B$2-AF:AF>=-1,1,IF($B$2-AF:AF>=-2,2,3))))))","v":3},{"$f":"IF(AE:AE=\"pas d'actualité\",3,IF(AE:AE=\"?\",\"?\",IF(AE:AE=\"?\",\"?\",IF((($B$2+1)-AF:AF)>=0,\"0\",IF((($B$2+1)-AF:AF)>=-1,\"1\",IF((($B$2+1)-AF:AF)>=-2,\"2\",\"3\"))))))","v":"3"},{"$f":"IF(AE:AE=\"pas d'actualité\",3,IF(AE:AE=\"?\",\"?\",IF(AE:AE=\"?\",\"?\",IF((($B$2+2)-AF:AF)>=0,0,IF((($B$2+2)-AF:AF)>=-1,1,IF((($B$2+2)-AF:AF)>=-2,2,3))))))","v":3},{"$f":"IF(AE:AE=\"pas d'actualité\",3,IF(AE:AE=\"?\",\"?\",IF(AE:AE=\"?\",\"?\",IF(($B$2+3)-AF:AF>=0,0,IF(($B$2+3)-AF:AF>=-1,1,IF(($B$2+3)-AF:AF>=-2,2,3))))))","v":3},{"$f":"IF(AE:AE=\"pas d'actualité\",3,IF(AE:AE=\"?\",\"?\",IF(AE:AE=\"?\",\"?\",IF(($B$2+4)-AF:AF>=0,0,IF(($B$2+4)-AF:AF>=-1,1,IF(($B$2+4)-AF:AF>=-2,2,3))))))","v":3},"SINUMERIK tableau de commande O32S","Entièrement compatible"]
["PR100","D100","FAB 100",null,null,null,null,null,null,null,null,"X",null,null,null,null,null,null,null,null,null,null,null,null,null,null,null,null,null,null,"pas d'actualité",{"$f":"IF(ISNUMBER(AE:AE),YEAR(AE:AE),AE:AE)","v":"pas d'actualité"},{"$f":"IF(AE:AE=\"pas d'actualité\",3,IF(AE:AE=\"?\",\"?\",IF(AE:AE=\"?\",\"?\",IF($B$2-AF:AF>=0,0,IF($B$2-AF:AF>=-1,1,IF($B$2-AF:AF>=-2,2,3))))))","v":3},{"$f":"IF(AE:AE=\"pas d'actualité\",3,IF(AE:AE=\"?\",\"?\",IF(AE:AE=\"?\",\"?\",IF((($B$2+1)-AF:AF)>=0,\"0\",IF((($B$2+1)-AF:AF)>=-1,\"1\",IF((($B$2+1)-AF:AF)>=-2,\"2\",\"3\"))))))","v":3},{"$f":"IF(AE:AE=\"pas d'actualité\",3,IF(AE:AE=\"?\",\"?\",IF(AE:AE=\"?\",\"?\",IF((($B$2+2)-AF:AF)>=0,0,IF((($B$2+2)-AF:AF)>=-1,1,IF((($B$2+2)-AF:AF)>=-2,2,3))))))","v":3},{"$f":"IF(AE:AE=\"pas d'actualité\",3,IF(AE:AE=\"?\",\"?\",IF(AE:AE=\"?\",\"?\",IF(($B$2+3)-AF:AF>=0,0,IF(($B$2+3)-AF:AF>=-1,1,IF(($B$2+3)-AF:AF>=-2,2,3))))))","v":3},{"$f":"IF(AE:AE=\"pas d'actualité\",3,IF(AE:AE=\"?\",\"?\",IF(AE:AE=\"?\",\"?\",IF(($B$2+4)-AF:AF>=0,0,IF(($B$2+4)-AF:AF>=-1,1,IF(($B$2+4)-AF:AF>=-2,2,3))))))","v":3}]
["PR101","D101","FAB 101",null,null,null,null,null,null,null,null,"X",null,null,null,null,null,null,null,null,null,null,null,null,null,null,null,null,null,null,"2024-09-30",{"$f":"IF(ISNUMBER(AE:AE),YEAR(AE:AE),AE:AE)","v":2024},{"$f":"IF(AE:AE=\"pas d'actualité\",3,IF(AE:AE=\"?\",\"?\",IF(AE:AE=\"?\",\"?\",IF($B$2-AF:AF>=0,0,IF($B$2-AF:AF>=-1,1,IF($B$2-AF:AF>=-2,2,3))))))","v":3},{"$f":"IF(AE:AE=\"pas d'actualité\",3,IF(AE:AE=\"?\",\"?\",IF(AE:AE=\"?\",\"?\",IF((($B$2+1)-AF:AF)>=0,\"0\",IF((($B$2+1)-AF:AF)>=-1,\"1\",IF((($B$2+1)-AF:AF)>=-2,\"2\",\"3\"))))))","v":"3"},{"$f":"IF(AE:AE=\"pas d'actualité\",3,IF(AE:AE=\"?\",\"?\",IF(AE:AE=\"?\",\"?\",IF((($B$2+2)-AF:AF)>=0,0,IF((($B$2+2)-AF:AF)>=-1,1,IF((($B$2+2)-AF:AF)>=-2,2,3))))))","v":3},{"$f":"IF(AE:AE=\"pas d'actualité\",3,IF(AE:AE=\"?\",\"?\",IF(AE:AE=\"?\",\"?\",IF(($B$2+3)-AF:AF>=0,0,IF(($B$2+3)-AF:AF>=-1,1,IF(($B$2+3)-AF:AF>=-2,2,3))))))","v":3},{"$f":"IF(AE:AE=\"pas d'actualité\",3,IF(AE:AE=\"?\",\"?\",IF(AE:AE=\"?\",\"?\",IF(($B$2+4)-AF:AF>=0,0,IF(($B$2+4)-AF:AF>=-1,1,IF(($B$2+4)-AF:AF>=-2,2,3))))))","v":3}]
["PR102","D102","FAB 102",null,null,null,null,"X","X",null,null,null,null,null,null,null,null,null,null,null,null,null,null,null,null,null,null,null,null,null,"2020-09-30",{"$f":"IF(ISNUMBER(AE:AE),YEAR(AE:AE),AE:AE)","v":2020},{"$f":"IF(AE:AE=\"pas d'actualité\",3,IF(AE:AE=\"?\",\"?\",IF(AE:AE=\"?\",\"?\",IF($B$2-AF:AF>=0,0,IF($B$2-AF:AF>=-1,1,IF($B$2-AF:AF>=-2,2,3))))))","v":3},{"$f":"IF(AE:AE=\"pas d'actualité\",3,IF(AE:AE=\"?\",\"?\",IF(AE:AE=\"?\",\"?\",IF((($B$2+1)-AF:AF)>=0,\"0\",IF((($B$2+1)-AF:AF)>=-1,\"1\",IF((($B$2+1)-AF:AF)>=-2,\"2\",\"3\"))))))","v":"3"},{"$f":"IF(AE:AE=\"pas d'actualité\",3,IF(AE:AE=\"?\",\"?\",IF(AE:AE=\"?\",\"?\",IF((($B$2+2)-AF:AF)>=0,0,IF((($B$2+2)-AF:AF)>=-1,1,IF((($B$2+2)-AF:AF)>=-2,2,3))))))","v":2},{"$f":"IF(AE:AE=\"pas d'actualité\",3,IF(AE:AE=\"?\",\"?\",IF(AE:AE=\"?\",\"?\",IF(($B$2+3)-AF:AF>=0,0,IF(($B$2+3)-AF:AF>=-1,1,IF(($B$2+3)-AF:AF>=-2,2,3))))))","v":1},{"$f":"IF(AE:AE=\"pas d'actualité\",3,IF(AE:AE=\"?\",\"?\",IF(AE:AE=\"?\",\"?\",IF(($B$2+4)-AF:AF>=0,0,IF(($B$2+4)-AF:AF>=-1,1,IF(($B$2+4)-AF:AF>=-2,2,3))))))","v":0}]
["PR103","D103","FAB 103",null,0,null,null,"X","X",null,null,null,null,null,null,null,null,null,null,null,null,null,null,null,null,null,null,null,null,null,"pas d'actualité",{"$f":"IF(ISNUMBER(AE:AE),YEAR(AE:AE),AE:AE)","v":"pas d'actualité"},{"$f":"IF(AE:AE=\"pas d'actualité\",3,IF(AE:AE=\"?\",\"?\",IF(AE:AE=\"?\",\"?\",IF($B$2-AF:AF>=0,0,IF($B$2-AF:AF>=-1,1,IF($B$2-AF:AF>=-2,2,3))))))","v":3},{"$f":"IF(AE:AE=\"pas d'actualité\",3,IF(AE:AE=\"?\",\"?\",IF(AE:AE=\"?\",\"?\",IF((($B$2+1)-AF:AF)>=0,\"0\",IF((($B$2+1)-AF:AF)>=-1,\"1\",IF((($B$2+1)-AF:AF)>=-2,\"2\",\"3\"))))))","v":3},{"$f":"IF(AE:AE=\"pas d'actualité\",3,IF(AE:AE=\"?\",\"?\",IF(AE:AE=\"?\",\"?\",IF((($B$2+2)-AF:AF)>=0,0,IF((($B$2+2)-AF:AF)>=-1,1,IF((($B$2+2)-AF:AF)>=-2,2,3))))))","v":3},{"$f":"IF(AE:AE=\"pas d'actualité\",3,IF(AE:AE=\"?\",\"?\",IF(AE:AE=\"?\",\"?\",IF(($B$2+3)-AF:AF>=0,0,IF(($B$2+3)-AF:AF>=-1,1,IF(($B$2+3)-AF:AF>=-2,2,3))))))","v":3},{"$f":"IF(AE:AE=\"pas d'actualité\",3,IF(AE:AE=\"?\",\"?\",IF(AE:AE=\"?\",\"?\",IF(($B$2+4)-AF:AF>=0,0,IF(($B$2+4)-AF:AF>=-1,1,IF(($B$2+4)-AF:AF>=-2,2,3))))))","v":3}]
["PR104","D104","FAB 104",null,null,null,null,null,null,null,null,"X",null,null,null,null,null,null,null,null,null,null,null,null,null,null,null,null,null,null,"pas d'actualité",{"$f":"IF(ISNUMBER(AE:AE),YEAR(AE:AE),AE:AE)","v":"pas d'actualité"},{"$f":"IF(AE:AE=\"pas d'actualité\",3,IF(AE:AE=\"?\",\"?\",IF(AE:AE=\"?\",\"?\",IF($B$2-AF:AF>=0,0,IF($B$2-AF:AF>=-1,1,IF($B$2-AF:AF>=-2,2,3))))))","v":3},{"$f":"IF(AE:AE=\"pas d'actualité\",3,IF(AE:AE=\"?\",\"?\",IF(AE:AE=\"?\",\"?\",IF((($B$2+1)-AF:AF)>=0,\"0\",IF((($B$2+1)-AF:AF)>=-1,\"1\",IF((($B$2+1)-AF:AF)>=-2,\"2\",\"3\"))))))","v":3},{"$f":"IF(AE:AE=\"pas d'actualité\",3,IF(AE:AE=\"?\",\"?\",IF(AE:AE=\"?\",\"?\",IF((($B$2+2)-AF:AF)>=0,0,IF((($B$2+2)-AF:AF)>=-1,1,IF((($B$2+2)-AF:AF)>=-2,2,3))))))","v":3},{"$f":"IF(AE:AE=\"pas d'actualité\",3,IF(AE:AE=\"?\",\"?\",IF(AE:AE=\"?\",\"?\",IF(($B$2+3)-AF:AF>=0,0,IF(($B$2+3)-AF:AF>=-1,1,IF(($B$2+3)-AF:AF>=-2,2,3))))))","v":3},{"$f":"IF(AE:AE=\"pas d'actualité\",3,IF(AE:AE=\"?\",\"?\",IF(AE:AE=\"?\",\"?\",IF(($B$2+4)-AF:AF>=0,0,IF(($B$2+4)-AF:AF>=-1,1,IF(($B$2+4)-AF:AF>=-2,2,3))))))","v":3}]
["PR105","D105","FAB 105",null,null,null,null,null,null,null,null,"X",null,null,null,null,null,null,null,null,null,null,null,null,null,null,null,null,null,null,"pas d'actualité",{"$f":"IF(ISNUMBER(AE:AE),YEAR(AE:AE),AE:AE)","v":"pas d'actualité"},{"$f":"IF(AE:AE=\"pas d'actualité\",3,IF(AE:AE=\"?\",\"?\",IF(AE:AE=\"?\",\"?\",IF($B$2-AF:AF>=0,0,IF($B$2-AF:AF>=-1,1,IF($B$2-AF:AF>=-2,2,3))))))","v":3},{"$f":"IF(AE:AE=\"pas d'actualité\",3,IF(AE:AE=\"?\",\"?\",IF(AE:AE=\"?\",\"?\",IF((($B$2+1)-AF:AF)>=0,\"0\",IF((($B$2+1)-AF:AF)>=-1,\"1\",IF((($B$2+1)-AF:AF)>=-2,\"2\",\"3\"))))))","v":3},{"$f":"IF(AE:AE=\"pas d'actualité\",3,IF(AE:AE=\"?\",\"?\",IF(AE:AE=\"?\",\"?\",IF((($B$2+2)-AF:AF)>=0,0,IF((($B$2+2)-AF:AF)>=-1,1,IF((($B$2+2)-AF:AF)>=-2,2,3))))))","v":3},{"$f":"IF(AE:AE=\"pas d'actualité\",3,IF(AE:AE=\"?\",\"?\",IF(AE:AE=\"?\",\"?\",IF(($B$2+3)-AF:AF>=0,0,IF(($B$2+3)-AF:AF>=-1,1,IF(($B$2+3)-AF:AF>=-2,2,3))))))","v":3},{"$f":"IF(AE:AE=\"pas d'actualité\",3,IF(AE:AE=\"?\",\"?\",IF(AE:AE=\"?\",\"?\",IF(($B$2+4)-AF:AF>=0,0,IF(($B$2+4)-AF:AF>=-1,1,IF(($B$2+4)-AF:AF>=-2,2,3))))))","v":3}]
["PR106","D106","FAB 106",null,1,null,null,null,null,null,null,null,null,null,"x",null,null,null,null,null,null,null,null,null,null,"X",null,null,null,null,"2021-09-30",{"$f":"IF(ISNUMBER(AE:AE),YEAR(AE:AE),AE:AE)","v":2021},{"$f":"IF(AE:AE=\"pas d'actualité\",3,IF(AE:AE=\"?\",\"?\",IF(AE:AE=\"?\",\"?\",IF($B$2-AF:AF>=0,0,IF($B$2-AF:AF>=-1,1,IF($B$2-AF:AF>=-2,2,3))))))","v":3},{"$f":"IF(AE:AE=\"pas d'actualité\",3,IF(AE:AE=\"?\",\"?\",IF(AE:AE=\"?\",\"?\",IF((($B$2+1)-AF:AF)>=0,\"0\",IF((($B$2+1)-AF:AF)>=-1,\"1\",IF((($B$2+1)-AF:AF)>=-2,\"2\",\"3\"))))))","v":"3"},{"$f":"IF(AE:AE=\"pas d'actualité\",3,IF(AE:AE=\"?\",\"?\",IF(AE:AE=\"?\",\"?\",IF((($B$2+2)-AF:AF)>=0,0,IF((($B$2+2)-AF:AF)>=-1,1,IF((($B$2+2)-AF:AF)>=-2,2,3))))))","v":3},{"$f":"IF(AE:AE=\"pas d'actualité\",3,IF(AE:AE=\"?\",\"?\",IF(AE:AE=\"?\",\"?\",IF(($B$2+3)-AF:AF>=0,0,IF(($B$2+3)-AF:AF>=-1,1,IF(($B$2+3)-AF:AF>=-2,2,3))))))","v":2},{"$f":"IF(AE:AE=\"pas d'actualité\",3,IF(AE:AE=\"?\",\"?\",IF(AE:AE=\"?\",\"?\",IF(($B$2+4)-AF:AF>=0,0,IF(($B$2+4)-AF:AF>=-1,1,IF(($B$2+4)-AF:AF>=-2,2,3))))))","v":1}]
["PR107","D107","FAB 107",null,null,null,null,null,null,null,null,null,null,null,"x",null,null,null,null,null,null,null,null,null,null,"X",null,null,null,null,"2022-09-30",{"$f":"IF(ISNUMBER(AE:AE),YEAR(AE:AE),AE:AE)","v":2022},{"$f":"IF(AE:AE=\"pas d'actualité\",3,IF(AE:AE=\"?\",\"?\",IF(AE:AE=\"?\",\"?\",IF($B$2-AF:AF>=0,0,IF($B$2-AF:AF>=-1,1,IF($B$2-AF:AF>=-2,2,3))))))","v":3},{"$f":"IF(AE:AE=\"pas d'actualité\",3,IF(AE:AE=\"?\",\"?\",IF(AE:AE=\"?\",\"?\",IF((($B$2+1)-AF:AF)>=0,\"0\",IF((($B$2+1)-AF:AF)>=-1,\"1\",IF((($B$2+1)-AF:AF)>=-2,\"2\",\"3\"))))))","v":"3"},{"$f":"IF(AE:AE=\"pas d'actualité\",3,IF(AE:AE=\"?\",\"?\",IF(AE:AE=\"?\",\"?\",IF((($B$2+2)-AF:AF)>=0,0,IF((($B$2+2)-AF:AF)>=-1,1,IF((($B$2+2)-AF:AF)>=-2,2,3))))))","v":3},{"$f":"IF(AE:AE=\"pas d'actualité\",3,IF(AE:AE=\"?\",\"?\",IF(AE:AE=\"?\",\"?\",IF(($B$2+3)-AF:AF>=0,0,IF(($B$2+3)-AF:AF>=-1,1,IF(($B$2+3)-AF:AF>=-2,2,3))))))","v":3},{"$f":"IF(AE:AE=\"pas d'actualité\",3,IF(AE:AE=\"?\",\"?\",IF(AE:AE=\"?\",\"?\",IF(($B$2+4)-AF:AF>=0,0,IF(($B$2+4)-AF:AF>=-1,1,IF(($B$2+4)-AF:AF>=-2,2,3))))))","v":2}]
["PR108","D108","FAB 108",null,1,null,null,null,null,null,null,null,null,null,"X",null,null,null,null,null,null,null,null,null,null,null,null,null,null,null,"2022-09-30",{"$f":"IF(ISNUMBER(AE:AE),YEAR(AE:AE),AE:AE)","v":2022},{"$f":"IF(AE:AE=\"pas d'actualité\",3,IF(AE:AE=\"?\",\"?\",IF(AE:AE=\"?\",\"?\",IF($B$2-AF:AF>=0,0,IF($B$2-AF:AF>=-1,1,IF($B$2-AF:AF>=-2,2,3))))))","v":3},{"$f":"IF(AE:AE=\"pas d'actualité\",3,IF(AE:AE=\"?\",\"?\",IF(AE:AE=\"?\",\"?\",IF((($B$2+1)-AF:AF)>=0,\"0\",IF((($B$2+1)-AF:AF)>=-1,\"1\",IF((($B$2+1)-AF:AF)>=-2,\"2\",\"3\"))))))","v":"3"},{"$f":"IF(AE:AE=\"pas d'actualité\",3,IF(AE:AE=\"?\",\"?\",IF(AE:AE=\"?\",\"?\",IF((($B$2+2)-AF:AF)>=0,0,IF((($B$2+2)-AF:AF)>=-1,1,IF((($B$2+2)-AF:AF)>=-2,2,3))))))","v":3},{"$f":"IF(AE:AE=\"pas d'actualité\",3,IF(AE:AE=\"?\",\"?\",IF(AE:AE=\"?\",\"?\",IF(($B$2+3)-AF:AF>=0,0,IF(($B$2+3)-AF:AF>=-1,1,IF(($B$2+3)-AF:AF>=-2,2,3))))))","v":3},{"$f":"IF(AE:AE=\"pas d'actualité\",3,IF(AE:AE=\"?\",\"?\",IF(AE:AE=\"?\",\"?\",IF(($B$2+4)-AF:AF>=0,0,IF(($B$2+4)-AF:AF>=-1,1,IF(($B$2+4)-AF:AF>=-2,2,3))))))","v":2}]
["PR109","D109","FAB 109",null,1,null,null,null,null,null,null,null,null,null,null,null,null,"X",null,null,null,null,null,null,null,null,null,null,null,null,"2020-01-10",{"$f":"IF(ISNUMBER(AE:AE),YEAR(AE:AE),AE:AE)","v":2020},{"$f":"IF(AE:AE=\"pas d'actualité\",3,IF(AE:AE=\"?\",\"?\",IF(AE:AE=\"?\",\"?\",IF($B$2-AF:AF>=0,0,IF($B$2-AF:AF>=-1,1,IF($B$2-AF:AF>=-2,2,3))))))","v":3},{"$f":"IF(AE:AE=\"pas d'actualité\",3,IF(AE:AE=\"?\",\"?\",IF(AE:AE=\"?\",\"?\",IF((($B$2+1)-AF:AF)>=0,\"0\",IF((($B$2+1)-AF:AF)>=-1,\"1\",IF((($B$2+1)-AF:AF)>=-2,\"2\",\"3\"))))))","v":"3"},{"$f":"IF(AE:AE=\"pas d'actualité\",3,IF(AE:AE=\"?\",\"?\",IF(AE:AE=\"?\",\"?\",IF((($B$2+2)-AF:AF)>=0,0,IF((($B$2+2)-AF:AF)>=-1,1,IF((($B$2+2)-AF:AF)>=-2,2,3))))))","v":2},{"$f":"IF(AE:AE=\"pas d'actualité\",3,IF(AE:AE=\"?\",\"?\",IF(AE:AE=\"?\",\"?\",IF(($B$2+3)-AF:AF>=0,0,IF(($B$2+3)-AF:AF>=-1,1,IF(($B$2+3)-AF:AF>=-2,2,3))))))","v":1},{"$f":"IF(AE:AE=\"pas d'actualité\",3,IF(AE:AE=\"?\",\"?\",IF(AE:AE=\"?\",\"?\",IF(($B$2+4)-AF:AF>=0,0,IF(($B$2+4)-AF:AF>=-1,1,IF(($B$2+4)-AF:AF>=-2,2,3))))))","v":0}]
["PR110","D110","FAB 110",null,1,null,null,null,null,null,null,null,null,null,null,null,null,null,null,null,null,null,null,null,null,null,null,"X",null,null,"2019-01-11",{"$f":"IF(ISNUMBER(AE:AE),YEAR(AE:AE),AE:AE)","v":2019},{"$f":"IF(AE:AE=\"pas d'actualité\",3,IF(AE:AE=\"?\",\"?\",IF(AE:AE=\"?\",\"?\",IF($B$2-AF:AF>=0,0,IF($B$2-AF:AF>=-1,1,IF($B$2-AF:AF>=-2,2,3))))))","v":3},{"$f":"IF(AE:AE=\"pas d'actualité\",3,IF(AE:AE=\"?\",\"?\",IF(AE:AE=\"?\",\"?\",IF((($B$2+1)-AF:AF)>=0,\"0\",IF((($B$2+1)-AF:AF)>=-1,\"1\",IF((($B$2+1)-AF:AF)>=-2,\"2\",\"3\"))))))","v":"2"},{"$f":"IF(AE:AE=\"pas d'actualité\",3,IF(AE:AE=\"?\",\"?\",IF(AE:AE=\"?\",\"?\",IF((($B$2+2)-AF:AF)>=0,0,IF((($B$2+2)-AF:AF)>=-1,1,IF((($B$2+2)-AF:AF)>=-2,2,3))))))","v":1},{"$f":"IF(AE:AE=\"pas d'actualité\",3,IF(AE:AE=\"?\",\"?\",IF(AE:AE=\"?\",\"?\",IF(($B$2+3)-AF:AF>=0,0,IF(($B$2+3)-AF:AF>=-1,1,IF(($B$2+3)-AF:AF>=-2,2,3))))))","v":0},{"$f":"IF(AE:AE=\"pas d'actualité\",3,IF(AE:AE=\"?\",\"?\",IF(AE:AE=\"?\",\"?\",IF(($B$2+4)-AF:AF>=0,0,IF(($B$2+4)-AF:AF>=-1,1,IF(($B$2+4)-AF:AF>=-2,2,3))))))","v":0}," 6GK7343-1EX30-0XE0"]
["PR111","D111","FAB 111",null,null,null,null,null,null,null,null,null,null,null,null,null,null,null,null,null,null,null,null,null,null,null,null,"X",null,null,"pas d'actualité",{"$f":"IF(ISNUMBER(AE:AE),YEAR(AE:AE),AE:AE)","v":"pas d'actualité"},{"$f":"IF(AE:AE=\"pas d'actualité\",3,IF(AE:AE=\"?\",\"?\",IF(AE:AE=\"?\",\"?\",IF($B$2-AF:AF>=0,0,IF($B$2-AF:AF>=-1,1,IF($B$2-AF:AF>=-2,2,3))))))","v":3},{"$f":"IF(AE:AE=\"pas d'actualité\",3,IF(AE:AE=\"?\",\"?\",IF(AE:AE=\"?\",\"?\",IF((($B$2+1)-AF:AF)>=0,\"0\",IF((($B$2+1)-AF:AF)>=-1,\"1\",IF((($B$2+1)-AF:AF)>=-2,\"2\",\"3\"))))))","v":3},{"$f":"IF(AE:AE=\"pas d'actualité\",3,IF(AE:AE=\"?\",\"?\",IF(AE:AE=\"?\",\"?\",IF((($B$2+2)-AF:AF)>=0,0,IF((($B$2+2)-AF:AF)>=-1,1,IF((($B$2+2)-AF:AF)>=-2,2,3))))))","v":3},{"$f":"IF(AE:AE=\"pas d'actualité\",3,IF(AE:AE=\"?\",\"?\",IF(AE:AE=\"?\",\"?\",IF(($B$2+3)-AF:AF>=0,0,IF(($B$2+3)-AF:AF>=-1,1,IF(($B$2+3)-AF:AF>=-2,2,3))))))","v":3},{"$f":"IF(AE:AE=\"pas d'actualité\",3,IF(AE:AE=\"?\",\"?\",IF(AE:AE=\"?\",\"?\",IF(($B$2+4)-AF:AF>=0,0,IF(($B$2+4)-AF:AF>=-1,1,IF(($B$2+4)-AF:AF>=-2,2,3))))))","v":3}]
["PR112","D112","FAB 112",null,null,null,null,null,null,null,null,"X",null,null,null,null,null,null,null,null,null,null,null,null,null,null,null,null,null,null,"pas d'actualité",{"$f":"IF(ISNUMBER(AE:AE),YEAR(AE:AE),AE:AE)","v":"pas d'actualité"},{"$f":"IF(AE:AE=\"pas d'actualité\",3,IF(AE:AE=\"?\",\"?\",IF(AE:AE=\"?\",\"?\",IF($B$2-AF:AF>=0,0,IF($B$2-AF:AF>=-1,1,IF($B$2-AF:AF>=-2,2,3))))))","v":3},{"$f":"IF(AE:AE=\"pas d'actualité\",3,IF(AE:AE=\"?\",\"?\",IF(AE:AE=\"?\",\"?\",IF((($B$2+1)-AF:AF)>=0,\"0\",IF((($B$2+1)-AF:AF)>=-1,\"1\",IF((($B$2+1)-AF:AF)>=-2,\"2\",\"3\"))))))","v":3},{"$f":"IF(AE:AE=\"pas d'actualité\",3,IF(AE:AE=\"?\",\"?\",IF(AE:AE=\"?\",\"?\",IF((($B$2+2)-AF:AF)>=0,0,IF((($B$2+2)-AF:AF)>=-1,1,IF((($B$2+2)-AF:AF)>=-2,2,3))))))","v":3},{"$f":"IF(AE:AE=\"pas d'actualité\",3,IF(AE:AE=\"?\",\"?\",IF(AE:AE=\"?\",\"?\",IF(($B$2+3)-AF:AF>=0,0,IF(($B$2+3)-AF:AF>=-1,1,IF(($B$2+3)-AF:AF>=-2,2,3))))))","v":3},{"$f":"IF(AE:AE=\"pas d'actualité\",3,IF(AE:AE=\"?\",\"?\",IF(AE:AE=\"?\",\"?\",IF(($B$2+4)-AF:AF>=0,0,IF(($B$2+4)-AF:AF>=-1,1,IF(($B$2+4)-AF:AF>=-2,2,3))))))","v":3}]
["PR113","D113","FAB 113",null,null,null,null,null,null,null,null,"X",null,null,null,null,null,null,null,null,null,null,null,null,null,null,null,null,null,null,"pas d'actualité",{"$f":"IF(ISNUMBER(AE:AE),YEAR(AE:AE),AE:AE)","v":"pas d'actualité"},{"$f":"IF(AE:AE=\"pas d'actualité\",3,IF(AE:AE=\"?\",\"?\",IF(AE:AE=\"?\",\"?\",IF($B$2-AF:AF>=0,0,IF($B$2-AF:AF>=-1,1,IF($B$2-AF:AF>=-2,2,3))))))","v":3},{"$f":"IF(AE:AE=\"pas d'actualité\",3,IF(AE:AE=\"?\",\"?\",IF(AE:AE=\"?\",\"?\",IF((($B$2+1)-AF:AF)>=0,\"0\",IF((($B$2+1)-AF:AF)>=-1,\"1\",IF((($B$2+1)-AF:AF)>=-2,\"2\",\"3\"))))))","v":3},{"$f":"IF(AE:AE=\"pas d'actualité\",3,IF(AE:AE=\"?\",\"?\",IF(AE:AE=\"?\",\"?\",IF((($B$2+2)-AF:AF)>=0,0,IF((($B$2+2)-AF:AF)>=-1,1,IF((($B$2+2)-AF:AF)>=-2,2,3))))))","v":3},{"$f":"IF(AE:AE=\"pas d'actualité\",3,IF(AE:AE=\"?\",\"?\",IF(AE:AE=\"?\",\"?\",IF(($B$2+3)-AF:AF>=0,0,IF(($B$2+3)-AF:AF>=-1,1,IF(($B$2+3)-AF:AF>=-2,2,3))))))","v":3},{"$f":"IF(AE:AE=\"pas d'actualité\",3,IF(AE:AE=\"?\",\"?\",IF(AE:AE=\"?\",\"?\",IF(($B$2+4)-AF:AF>=0,0,IF(($B$2+4)-AF:AF>=-1,1,IF(($B$2+4)-AF:AF>=-2,2,3))))))","v":3}]
["PR114","D114","FAB 114",null,null,null,null,null,null,null,null,"X",null,null,null,null,null,null,null,null,null,null,null,null,null,null,null,null,null,null,"pas d'actualité",{"$f":"IF(ISNUMBER(AE:AE),YEAR(AE:AE),AE:AE)","v":"pas d'actualité"},{"$f":"IF(AE:AE=\"pas d'actualité\",3,IF(AE:AE=\"?\",\"?\",IF(AE:AE=\"?\",\"?\",IF($B$2-AF:AF>=0,0,IF($B$2-AF:AF>=-1,1,IF($B$2-AF:AF>=-2,2,3))))))","v":3},{"$f":"IF(AE:AE=\"pas d'actualité\",3,IF(AE:AE=\"?\",\"?\",IF(AE:AE=\"?\",\"?\",IF((($B$2+1)-AF:AF)>=0,\"0\",IF((($B$2+1)-AF:AF)>=-1,\"1\",IF((($B$2+1)-AF:AF)>=-2,\"2\",\"3\"))))))","v":3},{"$f":"IF(AE:AE=\"pas d'actualité\",3,IF(AE:AE=\"?\",\"?\",IF(AE:AE=\"?\",\"?\",IF((($B$2+2)-AF:AF)>=0,0,IF((($B$2+2)-AF:AF)>=-1,1,IF((($B$2+2)-AF:AF)>=-2,2,3))))))","v":3},{"$f":"IF(AE:AE=\"pas d'actualité\",3,IF(AE:AE=\"?\",\"?\",IF(AE:AE=\"?\",\"?\",IF(($B$2+3)-AF:AF>=0,0,IF(($B$2+3)-AF:AF>=-1,1,IF(($B$2+3)-AF:AF>=-2,2,3))))))","v":3},{"$f":"IF(AE:AE=\"pas d'actualité\",3,IF(AE:AE=\"?\",\"?\",IF(AE:AE=\"?\",\"?\",IF(($B$2+4)-AF:AF>=0,0,IF(($B$2+4)-AF:AF>=-1,1,IF(($B$2+4)-AF:AF>=-2,2,3))))))","v":3}]
["PR115","D115","FAB 115",null,null,null,null,null,null,null,null,"X",null,null,null,null,null,null,null,null,null,null,null,null,null,null,null,null,null,null,"pas d'actualité",{"$f":"IF(ISNUMBER(AE:AE),YEAR(AE:AE),AE:AE)","v":"pas d'actualité"},{"$f":"IF(AE:AE=\"pas d'actualité\",3,IF(AE:AE=\"?\",\"?\",IF(AE:AE=\"?\",\"?\",IF($B$2-AF:AF>=0,0,IF($B$2-AF:AF>=-1,1,IF($B$2-AF:AF>=-2,2,3))))))","v":3},{"$f":"IF(AE:AE=\"pas d'actualité\",3,IF(AE:AE=\"?\",\"?\",IF(AE:AE=\"?\",\"?\",IF((($B$2+1)-AF:AF)>=0,\"0\",IF((($B$2+1)-AF:AF)>=-1,\"1\",IF((($B$2+1)-AF:AF)>=-2,\"2\",\"3\"))))))","v":3},{"$f":"IF(AE:AE=\"pas d'actualité\",3,IF(AE:AE=\"?\",\"?\",IF(AE:AE=\"?\",\"?\",IF((($B$2+2)-AF:AF)>=0,0,IF((($B$2+2)-AF:AF)>=-1,1,IF((($B$2+2)-AF:AF)>=-2,2,3))))))","v":3},{"$f":"IF(AE:AE=\"pas d'actualité\",3,IF(AE:AE=\"?\",\"?\",IF(AE:AE=\"?\",\"?\",IF(($B$2+3)-AF:AF>=0,0,IF(($B$2+3)-AF:AF>=-1,1,IF(($B$2+3)-AF:AF>=-2,2,3))))))","v":3},{"$f":"IF(AE:AE=\"pas d'actualité\",3,IF(AE:AE=\"?\",\"?\",IF(AE:AE=\"?\",\"?\",IF(($B$2+4)-AF:AF>=0,0,IF(($B$2+4)-AF:AF>=-1,1,IF(($B$2+4)-AF:AF>=-2,2,3))))))","v":3}]
["PR116","D116","FAB 116",null,null,null,null,null,null,null,null,"X",null,null,null,null,null,null,null,null,null,null,null,null,null,null,null,null,null,null,"2023-09-30",{"$f":"IF(ISNUMBER(AE:AE),YEAR(AE:AE),AE:AE)","v":2023},{"$f":"IF(AE:AE=\"pas d'actualité\",3,IF(AE:AE=\"?\",\"?\",IF(AE:AE=\"?\",\"?\",IF($B$2-AF:AF>=0,0,IF($B$2-AF:AF>=-1,1,IF($B$2-AF:AF>=-2,2,3))))))","v":3},{"$f":"IF(AE:AE=\"pas d'actualité\",3,IF(AE:AE=\"?\",\"?\",IF(AE:AE=\"?\",\"?\",IF((($B$2+1)-AF:AF)>=0,\"0\",IF((($B$2+1)-AF:AF)>=-1,\"1\",IF((($B$2+1)-AF:AF)>=-2,\"2\",\"3\"))))))","v":"3"},{"$f":"IF(AE:AE=\"pas d'actualité\",3,IF(AE:AE=\"?\",\"?\",IF(AE:AE=\"?\",\"?\",IF((($B$2+2)-AF:AF)>=0,0,IF((($B$2+2)-AF:AF)>=-1,1,IF((($B$2+2)-AF:AF)>=-2,2,3))))))","v":3},{"$f":"IF(AE:AE=\"pas d'actualité\",3,IF(AE:AE=\"?\",\"?\",IF(AE:AE=\"?\",\"?\",IF(($B$2+3)-AF:AF>=0,0,IF(($B$2+3)-AF:AF>=-1,1,IF(($B$2+3)-AF:AF>=-2,2,3))))))","v":3},{"$f":"IF(AE:AE=\"pas d'actualité\",3,IF(AE:AE=\"?\",\"?\",IF(AE:AE=\"?\",\"?\",IF(($B$2+4)-AF:AF>=0,0,IF(($B$2+4)-AF:AF>=-1,1,IF(($B$2+4)-AF:AF>=-2,2,3))))))","v":3},"6SL3120-1TE21-8AA4","Partiellement compatible"]
["PR117","D117","FAB 117",null,null,null,null,null,null,null,null,"X",null,null,null,null,null,null,null,null,null,null,null,null,null,null,null,null,null,null,"2024-09-30",{"$f":"IF(ISNUMBER(AE:AE),YEAR(AE:AE),AE:AE)","v":2024},{"$f":"IF(AE:AE=\"pas d'actualité\",3,IF(AE:AE=\"?\",\"?\",IF(AE:AE=\"?\",\"?\",IF($B$2-AF:AF>=0,0,IF($B$2-AF:AF>=-1,1,IF($B$2-AF:AF>=-2,2,3))))))","v":3},{"$f":"IF(AE:AE=\"pas d'actualité\",3,IF(AE:AE=\"?\",\"?\",IF(AE:AE=\"?\",\"?\",IF((($B$2+1)-AF:AF)>=0,\"0\",IF((($B$2+1)-AF:AF)>=-1,\"1\",IF((($B$2+1)-AF:AF)>=-2,\"2\",\"3\"))))))","v":"3"},{"$f":"IF(AE:AE=\"pas d'actualité\",3,IF(AE:AE=\"?\",\"?\",IF(AE:AE=\"?\",\"?\",IF((($B$2+2)-AF:AF)>=0,0,IF((($B$2+2)-AF:AF)>=-1,1,IF((($B$2+2)-AF:AF)>=-2,2,3))))))","v":3},{"$f":"IF(AE:AE=\"pas d'actualité\",3,IF(AE:AE=\"?\",\"?\",IF(AE:AE=\"?\",\"?\",IF(($B$2+3)-AF:AF>=0,0,IF(($B$2+3)-AF:AF>=-1,1,IF(($B$2+3)-AF:AF>=-2,2,3))))))","v":3},{"$f":"IF(AE:AE=\"pas d'actualité\",3,IF(AE:AE=\"?\",\"?\",IF(AE:AE=\"?\",\"?\",IF(($B$2+4)-AF:AF>=0,0,IF(($B$2+4)-AF:AF>=-1,1,IF(($B$2+4)-AF:AF>=-2,2,3))))))","v":3},"6SL3120-1TE23-0AA4","Partiellement compatible"]
["PR118","D118","FAB 118",null,null,null,null,null,null,null,null,"X",null,null,null,null,null,null,null,null,null,null,null,null,null,null,null,null,null,null,"pas d'actualité",{"$f":"IF(ISNUMBER(AE:AE),YEAR(AE:AE),AE:AE)","v":"pas d'actualité"},{"$f":"IF(AE:AE=\"pas d'actualité\",3,IF(AE:AE=\"?\",\"?\",IF(AE:AE=\"?\",\"?\",IF($B$2-AF:AF>=0,0,IF($B$2-AF:AF>=-1,1,IF($B$2-AF:AF>=-2,2,3))))))","v":3},{"$f":"IF(AE:AE=\"pas d'actualité\",3,IF(AE:AE=\"?\",\"?\",IF(AE:AE=\"?\",\"?\",IF((($B$2+1)-AF:AF)>=0,\"0\",IF((($B$2+1)-AF:AF)>=-1,\"1\",IF((($B$2+1)-AF:AF)>=-2,\"2\",\"3\"))))))","v":3},{"$f":"IF(AE:AE=\"pas d'actualité\",3,IF(AE:AE=\"?\",\"?\",IF(AE:AE=\"?\",\"?\",IF((($B$2+2)-AF:AF)>=0,0,IF((($B$2+2)-AF:AF)>=-1,1,IF((($B$2+2)-AF:AF)>=-2,2,3))))))","v":3},{"$f":"IF(AE:AE=\"pas d'actualité\",3,IF(AE:AE=\"?\",\"?\",IF(AE:AE=\"?\",\"?\",IF(($B$2+3)-AF:AF>=0,0,IF(($B$2+3)-AF:AF>=-1,1,IF(($B$2+3)-AF:AF>=-2,2,3))))))","v":3},{"$f":"IF(AE:AE=\"pas d'actualité\",3,IF(AE:AE=\"?\",\"?\",IF(AE:AE=\"?\",\"?\",IF(($B$2+4)-AF:AF>=0,0,IF(($B$2+4)-AF:AF>=-1,1,IF(($B$2+4)-AF:AF>=-2,2,3))))))","v":3}]
["PR119","D119","FAB 119",null,null,null,null,null,null,null,null,"X",null,null,null,null,null,null,null,null,null,null,null,null,null,null,null,null,null,null,"pas d'actualité",{"$f":"IF(ISNUMBER(AE:AE),YEAR(AE:AE),AE:AE)","v":"pas d'actualité"},{"$f":"IF(AE:AE=\"pas d'actualité\",3,IF(AE:AE=\"?\",\"?\",IF(AE:AE=\"?\",\"?\",IF($B$2-AF:AF>=0,0,IF($B$2-AF:AF>=-1,1,IF($B$2-AF:AF>=-2,2,3))))))","v":3},{"$f":"IF(AE:AE=\"pas d'actualité\",3,IF(AE:AE=\"?\",\"?\",IF(AE:AE=\"?\",\"?\",IF((($B$2+1)-AF:AF)>=0,\"0\",IF((($B$2+1)-AF:AF)>=-1,\"1\",IF((($B$2+1)-AF:AF)>=-2,\"2\",\"3\"))))))","v":3},{"$f":"IF(AE:AE=\"pas d'actualité\",3,IF(AE:AE=\"?\",\"?\",IF(AE:AE=\"?\",\"?\",IF((($B$2+2)-AF:AF)>=0,0,IF((($B$2+2)-AF:AF)>=-1,1,IF((($B$2+2)-AF:AF)>=-2,2,3))))))","v":3},{"$f":"IF(AE:AE=\"pas d'actualité\",3,IF(AE:AE=\"?\",\"?\",IF(AE:AE=\"?\",\"?\",IF(($B$2+3)-AF:AF>=0,0,IF(($B$2+3)-AF:AF>=-1,1,IF(($B$2+3)-AF:AF>=-2,2,3))))))","v":3},{"$f":"IF(AE:AE=\"pas d'actualité\",3,IF(AE:AE=\"?\",\"?\",IF(AE:AE=\"?\",\"?\",IF(($B$2+4)-AF:AF>=0,0,IF(($B$2+4)-AF:AF>=-1,1,IF(($B$2+4)-AF:AF>=-2,2,3))))))","v":3}]
["PR120","D120","FAB 120",null,null,null,null,null,null,null,null,"X",null,null,null,null,null,null,null,null,null,null,null,null,null,null,null,null,null,null,"pas d'actualité",{"$f":"IF(ISNUMBER(AE:AE),YEAR(AE:AE),AE:AE)","v":"pas d'actualité"},{"$f":"IF(AE:AE=\"pas d'actualité\",3,IF(AE:AE=\"?\",\"?\",IF(AE:AE=\"?\",\"?\",IF($B$2-AF:AF>=0,0,IF($B$2-AF:AF>=-1,1,IF($B$2-AF:AF>=-2,2,3))))))","v":3},{"$f":"IF(AE:AE=\"pas d'actualité\",3,IF(AE:AE=\"?\",\"?\",IF(AE:AE=\"?\",\"?\",IF((($B$2+1)-AF:AF)>=0,\"0\",IF((($B$2+1)-AF:AF)>=-1,\"1\",IF((($B$2+1)-AF:AF)>=-2,\"2\",\"3\"))))))","v":3},{"$f":"IF(AE:AE=\"pas d'actualité\",3,IF(AE:AE=\"?\",\"?\",IF(AE:AE=\"?\",\"?\",IF((($B$2+2)-AF:AF)>=0,0,IF((($B$2+2)-AF:AF)>=-1,1,IF((($B$2+2)-AF:AF)>=-2,2,3))))))","v":3},{"$f":"IF(AE:AE=\"pas d'actualité\",3,IF(AE:AE=\"?\",\"?\",IF(AE:AE=\"?\",\"?\",IF(($B$2+3)-AF:AF>=0,0,IF(($B$2+3)-AF:AF>=-1,1,IF(($B$2+3)-AF:AF>=-2,2,3))))))","v":3},{"$f":"IF(AE:AE=\"pas d'actualité\",3,IF(AE:AE=\"?\",\"?\",IF(AE:AE=\"?\",\"?\",IF(($B$2+4)-AF:AF>=0,0,IF(($B$2+4)-AF:AF>=-1,1,IF(($B$2+4)-AF:AF>=-2,2,3))))))","v":3}]
["PR121","D121","FAB 121",null,null,null,null,null,null,null,null,"X",null,null,null,null,null,null,null,null,null,null,null,null,null,null,null,null,null,null,"2023-09-30",{"$f":"IF(ISNUMBER(AE:AE),YEAR(AE:AE),AE:AE)","v":2023},{"$f":"IF(AE:AE=\"pas d'actualité\",3,IF(AE:AE=\"?\",\"?\",IF(AE:AE=\"?\",\"?\",IF($B$2-AF:AF>=0,0,IF($B$2-AF:AF>=-1,1,IF($B$2-AF:AF>=-2,2,3))))))","v":3},{"$f":"IF(AE:AE=\"pas d'actualité\",3,IF(AE:AE=\"?\",\"?\",IF(AE:AE=\"?\",\"?\",IF((($B$2+1)-AF:AF)>=0,\"0\",IF((($B$2+1)-AF:AF)>=-1,\"1\",IF((($B$2+1)-AF:AF)>=-2,\"2\",\"3\"))))))","v":"3"},{"$f":"IF(AE:AE=\"pas d'actualité\",3,IF(AE:AE=\"?\",\"?\",IF(AE:AE=\"?\",\"?\",IF((($B$2+2)-AF:AF)>=0,0,IF((($B$2+2)-AF:AF)>=-1,1,IF((($B$2+2)-AF:AF)>=-2,2,3))))))","v":3},{"$f":"IF(AE:AE=\"pas d'actualité\",3,IF(AE:AE=\"?\",\"?\",IF(AE:AE=\"?\",\"?\",IF(($B$2+3)-AF:AF>=0,0,IF(($B$2+3)-AF:AF>=-1,1,IF(($B$2+3)-AF:AF>=-2,2,3))))))","v":3},{"$f":"IF(AE:AE=\"pas d'actualité\",3,IF(AE:AE=\"?\",\"?\",IF(AE:AE=\"?\",\"?\",IF(($B$2+4)-AF:AF>=0,0,IF(($B$2+4)-AF:AF>=-1,1,IF(($B$2+4)-AF:AF>=-2,2,3))))))","v":3},"6SL3120-2TE21-0AA4","Partiellement compatible"]
["PR122","D122","FAB 122",null,null,null,null,null,null,null,null,"X",null,null,null,null,null,null,null,null,null,null,null,null,null,null,null,null,null,null,"pas d'actualité",{"$f":"IF(ISNUMBER(AE:AE),YEAR(AE:AE),AE:AE)","v":"pas d'actualité"},{"$f":"IF(AE:AE=\"pas d'actualité\",3,IF(AE:AE=\"?\",\"?\",IF(AE:AE=\"?\",\"?\",IF($B$2-AF:AF>=0,0,IF($B$2-AF:AF>=-1,1,IF($B$2-AF:AF>=-2,2,3))))))","v":3},{"$f":"IF(AE:AE=\"pas d'actualité\",3,IF(AE:AE=\"?\",\"?\",IF(AE:AE=\"?\",\"?\",IF((($B$2+1)-AF:AF)>=0,\"0\",IF((($B$2+1)-AF:AF)>=-1,\"1\",IF((($B$2+1)-AF:AF)>=-2,\"2\",\"3\"))))))","v":3},{"$f":"IF(AE:AE=\"pas d'actualité\",3,IF(AE:AE=\"?\",\"?\",IF(AE:AE=\"?\",\"?\",IF((($B$2+2)-AF:AF)>=0,0,IF((($B$2+2)-AF:AF)>=-1,1,IF((($B$2+2)-AF:AF)>=-2,2,3))))))","v":3},{"$f":"IF(AE:AE=\"pas d'actualité\",3,IF(AE:AE=\"?\",\"?\",IF(AE:AE=\"?\",\"?\",IF(($B$2+3)-AF:AF>=0,0,IF(($B$2+3)-AF:AF>=-1,1,IF(($B$2+3)-AF:AF>=-2,2,3))))))","v":3},{"$f":"IF(AE:AE=\"pas d'actualité\",3,IF(AE:AE=\"?\",\"?\",IF(AE:AE=\"?\",\"?\",IF(($B$2+4)-AF:AF>=0,0,IF(($B$2+4)-AF:AF>=-1,1,IF(($B$2+4)-AF:AF>=-2,2,3))))))","v":3}]
["PR123","D123","FAB 123",null,null,null,null,null,null,null,null,null,null,null,null,null,null,null,null,null,null,null,null,null,null,null,null,null,null,null,"pas d'actualité",{"$f":"IF(ISNUMBER(AE:AE),YEAR(AE:AE),AE:AE)","v":"pas d'actualité"},{"$f":"IF(AE:AE=\"pas d'actualité\",3,IF(AE:AE=\"?\",\"?\",IF(AE:AE=\"?\",\"?\",IF($B$2-AF:AF>=0,0,IF($B$2-AF:AF>=-1,1,IF($B$2-AF:AF>=-2,2,3))))))","v":3},{"$f":"IF(AE:AE=\"pas d'actualité\",3,IF(AE:AE=\"?\",\"?\",IF(AE:AE=\"?\",\"?\",IF((($B$2+1)-AF:AF)>=0,\"0\",IF((($B$2+1)-AF:AF)>=-1,\"1\",IF((($B$2+1)-AF:AF)>=-2,\"2\",\"3\"))))))","v":3},{"$f":"IF(AE:AE=\"pas d'actualité\",3,IF(AE:AE=\"?\",\"?\",IF(AE:AE=\"?\",\"?\",IF((($B$2+2)-AF:AF)>=0,0,IF((($B$2+2)-AF:AF)>=-1,1,IF((($B$2+2)-AF:AF)>=-2,2,3))))))","v":3},{"$f":"IF(AE:AE=\"pas d'actualité\",3,IF(AE:AE=\"?\",\"?\",IF(AE:AE=\"?\",\"?\",IF(($B$2+3)-AF:AF>=0,0,IF(($B$2+3)-AF:AF>=-1,1,IF(($B$2+3)-AF:AF>=-2,2,3))))))","v":3},{"$f":"IF(AE:AE=\"pas d'actualité\",3,IF(AE:AE=\"?\",\"?\",IF(AE:AE=\"?\",\"?\",IF(($B$2+4)-AF:AF>=0,0,IF(($B$2+4)-AF:AF>=-1,1,IF(($B$2+4)-AF:AF>=-2,2,3))))))","v":3}]
["PR124","D124","FAB 124",null,1,null,null,null,null,null,null,null,null,null,null,null,null,null,null,null,null,null,null,null,null,"X",null,null,null,null,"pas d'actualité",{"$f":"IF(ISNUMBER(AE:AE),YEAR(AE:AE),AE:AE)","v":"pas d'actualité"},{"$f":"IF(AE:AE=\"pas d'actualité\",3,IF(AE:AE=\"?\",\"?\",IF(AE:AE=\"?\",\"?\",IF($B$2-AF:AF>=0,0,IF($B$2-AF:AF>=-1,1,IF($B$2-AF:AF>=-2,2,3))))))","v":3},{"$f":"IF(AE:AE=\"pas d'actualité\",3,IF(AE:AE=\"?\",\"?\",IF(AE:AE=\"?\",\"?\",IF((($B$2+1)-AF:AF)>=0,\"0\",IF((($B$2+1)-AF:AF)>=-1,\"1\",IF((($B$2+1)-AF:AF)>=-2,\"2\",\"3\"))))))","v":3},{"$f":"IF(AE:AE=\"pas d'actualité\",3,IF(AE:AE=\"?\",\"?\",IF(AE:AE=\"?\",\"?\",IF((($B$2+2)-AF:AF)>=0,0,IF((($B$2+2)-AF:AF)>=-1,1,IF((($B$2+2)-AF:AF)>=-2,2,3))))))","v":3},{"$f":"IF(AE:AE=\"pas d'actualité\",3,IF(AE:AE=\"?\",\"?\",IF(AE:AE=\"?\",\"?\",IF(($B$2+3)-AF:AF>=0,0,IF(($B$2+3)-AF:AF>=-1,1,IF(($B$2+3)-AF:AF>=-2,2,3))))))","v":3},{"$f":"IF(AE:AE=\"pas d'actualité\",3,IF(AE:AE=\"?\",\"?\",IF(AE:AE=\"?\",\"?\",IF(($B$2+4)-AF:AF>=0,0,IF(($B$2+4)-AF:AF>=-1,1,IF(($B$2+4)-AF:AF>=-2,2,3))))))","v":3},null,null,"produit qui va être intérrompu"]
["PR125","D125","FAB 125",null,1,null,null,null,"X","X","X",null,"X",null,"X",null,null,null,null,null,null,null,null,null,null,null,null,null,null,null,"2024-01-04",{"$f":"IF(ISNUMBER(AE:AE),YEAR(AE:AE),AE:AE)","v":2024},{"$f":"IF(AE:AE=\"pas d'actualité\",3,IF(AE:AE=\"?\",\"?\",IF(AE:AE=\"?\",\"?\",IF($B$2-AF:AF>=0,0,IF($B$2-AF:AF>=-1,1,IF($B$2-AF:AF>=-2,2,3))))))","v":3},{"$f":"IF(AE:AE=\"pas d'actualité\",3,IF(AE:AE=\"?\",\"?\",IF(AE:AE=\"?\",\"?\",IF((($B$2+1)-AF:AF)>=0,\"0\",IF((($B$2+1)-AF:AF)>=-1,\"1\",IF((($B$2+1)-AF:AF)>=-2,\"2\",\"3\"))))))","v":"3"},{"$f":"IF(AE:AE=\"pas d'actualité\",3,IF(AE:AE=\"?\",\"?\",IF(AE:AE=\"?\",\"?\",IF((($B$2+2)-AF:AF)>=0,0,IF((($B$2+2)-AF:AF)>=-1,1,IF((($B$2+2)-AF:AF)>=-2,2,3))))))","v":3},{"$f":"IF(AE:AE=\"pas d'actualité\",3,IF(AE:AE=\"?\",\"?\",IF(AE:AE=\"?\",\"?\",IF(($B$2+3)-AF:AF>=0,0,IF(($B$2+3)-AF:AF>=-1,1,IF(($B$2+3)-AF:AF>=-2,2,3))))))","v":3},{"$f":"IF(AE:AE=\"pas d'actualité\",3,IF(AE:AE=\"?\",\"?\",IF(AE:AE=\"?\",\"?\",IF(($B$2+4)-AF:AF>=0,0,IF(($B$2+4)-AF:AF>=-1,1,IF(($B$2+4)-AF:AF>=-2,2,3))))))","v":3},null,null,"ARRET TOTAL FOURNITURE 31/12/2030"]
["PR126","D126","FAB 126",null,null,null,null,null,null,null,null,"X",null,null,null,null,null,null,null,null,null,null,null,null,null,null,null,null,null,null,"pas d'actualité",{"$f":"IF(ISNUMBER(AE:AE),YEAR(AE:AE),AE:AE)","v":"pas d'actualité"},{"$f":"IF(AE:AE=\"pas d'actualité\",3,IF(AE:AE=\"?\",\"?\",IF(AE:AE=\"?\",\"?\",IF($B$2-AF:AF>=0,0,IF($B$2-AF:AF>=-1,1,IF($B$2-AF:AF>=-2,2,3))))))","v":3},{"$f":"IF(AE:AE=\"pas d'actualité\",3,IF(AE:AE=\"?\",\"?\",IF(AE:AE=\"?\",\"?\",IF((($B$2+1)-AF:AF)>=0,\"0\",IF((($B$2+1)-AF:AF)>=-1,\"1\",IF((($B$2+1)-AF:AF)>=-2,\"2\",\"3\"))))))","v":3},{"$f":"IF(AE:AE=\"pas d'actualité\",3,IF(AE:AE=\"?\",\"?\",IF(AE:AE=\"?\",\"?\",IF((($B$2+2)-AF:AF)>=0,0,IF((($B$2+2)-AF:AF)>=-1,1,IF((($B$2+2)-AF:AF)>=-2,2,3))))))","v":3},{"$f":"IF(AE:AE=\"pas d'actualité\",3,IF(AE:AE=\"?\",\"?\",IF(AE:AE=\"?\",\"?\",IF(($B$2+3)-AF:AF>=0,0,IF(($B$2+3)-AF:AF>=-1,1,IF(($B$2+3)-AF:AF>=-2,2,3))))))","v":3},{"$f":"IF(AE:AE=\"pas d'actualité\",3,IF(AE:AE=\"?\",\"?\",IF(AE:AE=\"?\",\"?\",IF(($B$2+4)-AF:AF>=0,0,IF(($B$2+4)-AF:AF>=-1,1,IF(($B$2+4)-AF:AF>=-2,2,3))))))","v":3}]
["PR127","D127","FAB 127",null,1,null,null,"X","X",null,null,null,null,null,null,null,null,null,null,null,null,null,null,null,null,null,null,null,null,null,"2024-01-04",{"$f":"IF(ISNUMBER(AE:AE),YEAR(AE:AE),AE:AE)","v":2024},{"$f":"IF(AE:AE=\"pas d'actualité\",3,IF(AE:AE=\"?\",\"?\",IF(AE:AE=\"?\",\"?\",IF($B$2-AF:AF>=0,0,IF($B$2-AF:AF>=-1,1,IF($B$2-AF:AF>=-2,2,3))))))","v":3},{"$f":"IF(AE:AE=\"pas d'actualité\",3,IF(AE:AE=\"?\",\"?\",IF(AE:AE=\"?\",\"?\",IF((($B$2+1)-AF:AF)>=0,\"0\",IF((($B$2+1)-AF:AF)>=-1,\"1\",IF((($B$2+1)-AF:AF)>=-2,\"2\",\"3\"))))))","v":"3"},{"$f":"IF(AE:AE=\"pas d'actualité\",3,IF(AE:AE=\"?\",\"?\",IF(AE:AE=\"?\",\"?\",IF((($B$2+2)-AF:AF)>=0,0,IF((($B$2+2)-AF:AF)>=-1,1,IF((($B$2+2)-AF:AF)>=-2,2,3))))))","v":3},{"$f":"IF(AE:AE=\"pas d'actualité\",3,IF(AE:AE=\"?\",\"?\",IF(AE:AE=\"?\",\"?\",IF(($B$2+3)-AF:AF>=0,0,IF(($B$2+3)-AF:AF>=-1,1,IF(($B$2+3)-AF:AF>=-2,2,3))))))","v":3},{"$f":"IF(AE:AE=\"pas d'actualité\",3,IF(AE:AE=\"?\",\"?\",IF(AE:AE=\"?\",\"?\",IF(($B$2+4)-AF:AF>=0,0,IF(($B$2+4)-AF:AF>=-1,1,IF(($B$2+4)-AF:AF>=-2,2,3))))))","v":3}]
["PR128","D128","FAB 128",null,2,null,null,null,null,null,"X",null,"X",null,null,null,null,null,null,null,null,null,null,null,null,null,null,null,null,null,"2024-01-04",{"$f":"IF(ISNUMBER(AE:AE),YEAR(AE:AE),AE:AE)","v":2024},{"$f":"IF(AE:AE=\"pas d'actualité\",3,IF(AE:AE=\"?\",\"?\",IF(AE:AE=\"?\",\"?\",IF($B$2-AF:AF>=0,0,IF($B$2-AF:AF>=-1,1,IF($B$2-AF:AF>=-2,2,3))))))","v":3},{"$f":"IF(AE:AE=\"pas d'actualité\",3,IF(AE:AE=\"?\",\"?\",IF(AE:AE=\"?\",\"?\",IF((($B$2+1)-AF:AF)>=0,\"0\",IF((($B$2+1)-AF:AF)>=-1,\"1\",IF((($B$2+1)-AF:AF)>=-2,\"2\",\"3\"))))))","v":"3"},{"$f":"IF(AE:AE=\"pas d'actualité\",3,IF(AE:AE=\"?\",\"?\",IF(AE:AE=\"?\",\"?\",IF((($B$2+2)-AF:AF)>=0,0,IF((($B$2+2)-AF:AF)>=-1,1,IF((($B$2+2)-AF:AF)>=-2,2,3))))))","v":3},{"$f":"IF(AE:AE=\"pas d'actualité\",3,IF(AE:AE=\"?\",\"?\",IF(AE:AE=\"?\",\"?\",IF(($B$2+3)-AF:AF>=0,0,IF(($B$2+3)-AF:AF>=-1,1,IF(($B$2+3)-AF:AF>=-2,2,3))))))","v":3},{"$f":"IF(AE:AE=\"pas d'actualité\",3,IF(AE:AE=\"?\",\"?\",IF(AE:AE=\"?\",\"?\",IF(($B$2+4)-AF:AF>=0,0,IF(($B$2+4)-AF:AF>=-1,1,IF(($B$2+4)-AF:AF>=-2,2,3))))))","v":3}]
["PR129","D129","FAB 129",null,null,null,null,null,null,null,null,null,null,null,null,null,null,null,null,null,null,null,null,null,null,null,null,null,null,null,"2025-09-30",{"$f":"IF(ISNUMBER(AE:AE),YEAR(AE:AE),AE:AE)","v":2025},{"$f":"IF(AE:AE=\"pas d'actualité\",3,IF(AE:AE=\"?\",\"?\",IF(AE:AE=\"?\",\"?\",IF($B$2-AF:AF>=0,0,IF($B$2-AF:AF>=-1,1,IF($B$2-AF:AF>=-2,2,3))))))","v":3},{"$f":"IF(AE:AE=\"pas d'actualité\",3,IF(AE:AE=\"?\",\"?\",IF(AE:AE=\"?\",\"?\",IF((($B$2+1)-AF:AF)>=0,\"0\",IF((($B$2+1)-AF:AF)>=-1,\"1\",IF((($B$2+1)-AF:AF)>=-2,\"2\",\"3\"))))))","v":"3"},{"$f":"IF(AE:AE=\"pas d'actualité\",3,IF(AE:AE=\"?\",\"?\",IF(AE:AE=\"?\",\"?\",IF((($B$2+2)-AF:AF)>=0,0,IF((($B$2+2)-AF:AF)>=-1,1,IF((($B$2+2)-AF:AF)>=-2,2,3))))))","v":3},{"$f":"IF(AE:AE=\"pas d'actualité\",3,IF(AE:AE=\"?\",\"?\",IF(AE:AE=\"?\",\"?\",IF(($B$2+3)-AF:AF>=0,0,IF(($B$2+3)-AF:AF>=-1,1,IF(($B$2+3)-AF:AF>=-2,2,3))))))","v":3},{"$f":"IF(AE:AE=\"pas d'actualité\",3,IF(AE:AE=\"?\",\"?\",IF(AE:AE=\"?\",\"?\",IF(($B$2+4)-AF:AF>=0,0,IF(($B$2+4)-AF:AF>=-1,1,IF(($B$2+4)-AF:AF>=-2,2,3))))))","v":3}]
["PR130","D130","FAB 130",null,1,null,null,null,null,null,null,null,null,null,null,null,null,null,null,null,null,null,null,null,null,"X",null,null,null,null,"2025-09-30",{"$f":"IF(ISNUMBER(AE:AE),YEAR(AE:AE),AE:AE)","v":2025},{"$f":"IF(AE:AE=\"pas d'actualité\",3,IF(AE:AE=\"?\",\"?\",IF(AE:AE=\"?\",\"?\",IF($B$2-AF:AF>=0,0,IF($B$2-AF:AF>=-1,1,IF($B$2-AF:AF>=-2,2,3))))))","v":3},{"$f":"IF(AE:AE=\"pas d'actualité\",3,IF(AE:AE=\"?\",\"?\",IF(AE:AE=\"?\",\"?\",IF((($B$2+1)-AF:AF)>=0,\"0\",IF((($B$2+1)-AF:AF)>=-1,\"1\",IF((($B$2+1)-AF:AF)>=-2,\"2\",\"3\"))))))","v":"3"},{"$f":"IF(AE:AE=\"pas d'actualité\",3,IF(AE:AE=\"?\",\"?\",IF(AE:AE=\"?\",\"?\",IF((($B$2+2)-AF:AF)>=0,0,IF((($B$2+2)-AF:AF)>=-1,1,IF((($B$2+2)-AF:AF)>=-2,2,3))))))","v":3},{"$f":"IF(AE:AE=\"pas d'actualité\",3,IF(AE:AE=\"?\",\"?\",IF(AE:AE=\"?\",\"?\",IF(($B$2+3)-AF:AF>=0,0,IF(($B$2+3)-AF:AF>=-1,1,IF(($B$2+3)-AF:AF>=-2,2,3))))))","v":3},{"$f":"IF(AE:AE=\"pas d'actualité\",3,IF(AE:AE=\"?\",\"?\",IF(AE:AE=\"?\",\"?\",IF(($B$2+4)-AF:AF>=0,0,IF(($B$2+4)-AF:AF>=-1,1,IF(($B$2+4)-AF:AF>=-2,2,3))))))","v":3}]
["PR131","D131","FAB 131",null,1,null,null,"X","X",null,null,null,null,null,null,null,null,null,null,null,null,null,null,null,null,null,null,null,null,null,"pas d'actualité",{"$f":"IF(ISNUMBER(AE:AE),YEAR(AE:AE),AE:AE)","v":"pas d'actualité"},{"$f":"IF(AE:AE=\"pas d'actualité\",3,IF(AE:AE=\"?\",\"?\",IF(AE:AE=\"?\",\"?\",IF($B$2-AF:AF>=0,0,IF($B$2-AF:AF>=-1,1,IF($B$2-AF:AF>=-2,2,3))))))","v":3},{"$f":"IF(AE:AE=\"pas d'actualité\",3,IF(AE:AE=\"?\",\"?\",IF(AE:AE=\"?\",\"?\",IF((($B$2+1)-AF:AF)>=0,\"0\",IF((($B$2+1)-AF:AF)>=-1,\"1\",IF((($B$2+1)-AF:AF)>=-2,\"2\",\"3\"))))))","v":3},{"$f":"IF(AE:AE=\"pas d'actualité\",3,IF(AE:AE=\"?\",\"?\",IF(AE:AE=\"?\",\"?\",IF((($B$2+2)-AF:AF)>=0,0,IF((($B$2+2)-AF:AF)>=-1,1,IF((($B$2+2)-AF:AF)>=-2,2,3))))))","v":3},{"$f":"IF(AE:AE=\"pas d'actualité\",3,IF(AE:AE=\"?\",\"?\",IF(AE:AE=\"?\",\"?\",IF(($B$2+3)-AF:AF>=0,0,IF(($B$2+3)-AF:AF>=-1,1,IF(($B$2+3)-AF:AF>=-2,2,3))))))","v":3},{"$f":"IF(AE:AE=\"pas d'actualité\",3,IF(AE:AE=\"?\",\"?\",IF(AE:AE=\"?\",\"?\",IF(($B$2+4)-AF:AF>=0,0,IF(($B$2+4)-AF:AF>=-1,1,IF(($B$2+4)-AF:AF>=-2,2,3))))))","v":3}]
["PR132","D132","FAB 132",null,1,null,null,null,"X",null,null,null,null,null,null,null,null,null,null,null,null,null,null,null,null,null,null,null,null,null,"pas d'actualité",{"$f":"IF(ISNUMBER(AE:AE),YEAR(AE:AE),AE:AE)","v":"pas d'actualité"},{"$f":"IF(AE:AE=\"pas d'actualité\",3,IF(AE:AE=\"?\",\"?\",IF(AE:AE=\"?\",\"?\",IF($B$2-AF:AF>=0,0,IF($B$2-AF:AF>=-1,1,IF($B$2-AF:AF>=-2,2,3))))))","v":3},{"$f":"IF(AE:AE=\"pas d'actualité\",3,IF(AE:AE=\"?\",\"?\",IF(AE:AE=\"?\",\"?\",IF((($B$2+1)-AF:AF)>=0,\"0\",IF((($B$2+1)-AF:AF)>=-1,\"1\",IF((($B$2+1)-AF:AF)>=-2,\"2\",\"3\"))))))","v":3},{"$f":"IF(AE:AE=\"pas d'actualité\",3,IF(AE:AE=\"?\",\"?\",IF(AE:AE=\"?\",\"?\",IF((($B$2+2)-AF:AF)>=0,0,IF((($B$2+2)-AF:AF)>=-1,1,IF((($B$2+2)-AF:AF)>=-2,2,3))))))","v":3},{"$f":"IF(AE:AE=\"pas d'actualité\",3,IF(AE:AE=\"?\",\"?\",IF(AE:AE=\"?\",\"?\",IF(($B$2+3)-AF:AF>=0,0,IF(($B$2+3)-AF:AF>=-1,1,IF(($B$2+3)-AF:AF>=-2,2,3))))))","v":3},{"$f":"IF(AE:AE=\"pas d'actualité\",3,IF(AE:AE=\"?\",\"?\",IF(AE:AE=\"?\",\"?\",IF(($B$2+4)-AF:AF>=0,0,IF(($B$2+4)-AF:AF>=-1,1,IF(($B$2+4)-AF:AF>=-2,2,3))))))","v":3},"6SN1124-1AA00-0CA2","Entièrement compatible"]
["PR133","D133","FAB 133",null,1,null,null,"X","X",null,null,null,null,null,null,null,null,null,null,null,null,null,null,null,null,null,null,null,null,null,"2024-01-04",{"$f":"IF(ISNUMBER(AE:AE),YEAR(AE:AE),AE:AE)","v":2024},{"$f":"IF(AE:AE=\"pas d'actualité\",3,IF(AE:AE=\"?\",\"?\",IF(AE:AE=\"?\",\"?\",IF($B$2-AF:AF>=0,0,IF($B$2-AF:AF>=-1,1,IF($B$2-AF:AF>=-2,2,3))))))","v":3},{"$f":"IF(AE:AE=\"pas d'actualité\",3,IF(AE:AE=\"?\",\"?\",IF(AE:AE=\"?\",\"?\",IF((($B$2+1)-AF:AF)>=0,\"0\",IF((($B$2+1)-AF:AF)>=-1,\"1\",IF((($B$2+1)-AF:AF)>=-2,\"2\",\"3\"))))))","v":"3"},{"$f":"IF(AE:AE=\"pas d'actualité\",3,IF(AE:AE=\"?\",\"?\",IF(AE:AE=\"?\",\"?\",IF((($B$2+2)-AF:AF)>=0,0,IF((($B$2+2)-AF:AF)>=-1,1,IF((($B$2+2)-AF:AF)>=-2,2,3))))))","v":3},{"$f":"IF(AE:AE=\"pas d'actualité\",3,IF(AE:AE=\"?\",\"?\",IF(AE:AE=\"?\",\"?\",IF(($B$2+3)-AF:AF>=0,0,IF(($B$2+3)-AF:AF>=-1,1,IF(($B$2+3)-AF:AF>=-2,2,3))))))","v":3},{"$f":"IF(AE:AE=\"pas d'actualité\",3,IF(AE:AE=\"?\",\"?\",IF(AE:AE=\"?\",\"?\",IF(($B$2+4)-AF:AF>=0,0,IF(($B$2+4)-AF:AF>=-1,1,IF(($B$2+4)-AF:AF>=-2,2,3))))))","v":3}]
["PR134","D134","FAB 134",null,1,null,null,null,null,null,null,null,null,null,null,null,null,null,null,null,null,null,null,null,null,"X",null,null,null,null,"2024-01-04",{"$f":"IF(ISNUMBER(AE:AE),YEAR(AE:AE),AE:AE)","v":2024},{"$f":"IF(AE:AE=\"pas d'actualité\",3,IF(AE:AE=\"?\",\"?\",IF(AE:AE=\"?\",\"?\",IF($B$2-AF:AF>=0,0,IF($B$2-AF:AF>=-1,1,IF($B$2-AF:AF>=-2,2,3))))))","v":3},{"$f":"IF(AE:AE=\"pas d'actualité\",3,IF(AE:AE=\"?\",\"?\",IF(AE:AE=\"?\",\"?\",IF((($B$2+1)-AF:AF)>=0,\"0\",IF((($B$2+1)-AF:AF)>=-1,\"1\",IF((($B$2+1)-AF:AF)>=-2,\"2\",\"3\"))))))","v":"3"},{"$f":"IF(AE:AE=\"pas d'actualité\",3,IF(AE:AE=\"?\",\"?\",IF(AE:AE=\"?\",\"?\",IF((($B$2+2)-AF:AF)>=0,0,IF((($B$2+2)-AF:AF)>=-1,1,IF((($B$2+2)-AF:AF)>=-2,2,3))))))","v":3},{"$f":"IF(AE:AE=\"pas d'actualité\",3,IF(AE:AE=\"?\",\"?\",IF(AE:AE=\"?\",\"?\",IF(($B$2+3)-AF:AF>=0,0,IF(($B$2+3)-AF:AF>=-1,1,IF(($B$2+3)-AF:AF>=-2,2,3))))))","v":3},{"$f":"IF(AE:AE=\"pas d'actualité\",3,IF(AE:AE=\"?\",\"?\",IF(AE:AE=\"?\",\"?\",IF(($B$2+4)-AF:AF>=0,0,IF(($B$2+4)-AF:AF>=-1,1,IF(($B$2+4)-AF:AF>=-2,2,3))))))","v":3}]
["PR135","D135","FAB 135",null,3,null,null,null,null,null,"X",null,"X",null,null,null,null,null,null,null,null,null,null,null,null,null,null,null,null,null,"2024-01-04",{"$f":"IF(ISNUMBER(AE:AE),YEAR(AE:AE),AE:AE)","v":2024},{"$f":"IF(AE:AE=\"pas d'actualité\",3,IF(AE:AE=\"?\",\"?\",IF(AE:AE=\"?\",\"?\",IF($B$2-AF:AF>=0,0,IF($B$2-AF:AF>=-1,1,IF($B$2-AF:AF>=-2,2,3))))))","v":3},{"$f":"IF(AE:AE=\"pas d'actualité\",3,IF(AE:AE=\"?\",\"?\",IF(AE:AE=\"?\",\"?\",IF((($B$2+1)-AF:AF)>=0,\"0\",IF((($B$2+1)-AF:AF)>=-1,\"1\",IF((($B$2+1)-AF:AF)>=-2,\"2\",\"3\"))))))","v":"3"},{"$f":"IF(AE:AE=\"pas d'actualité\",3,IF(AE:AE=\"?\",\"?\",IF(AE:AE=\"?\",\"?\",IF((($B$2+2)-AF:AF)>=0,0,IF((($B$2+2)-AF:AF)>=-1,1,IF((($B$2+2)-AF:AF)>=-2,2,3))))))","v":3},{"$f":"IF(AE:AE=\"pas d'actualité\",3,IF(AE:AE=\"?\",\"?\",IF(AE:AE=\"?\",\"?\",IF(($B$2+3)-AF:AF>=0,0,IF(($B$2+3)-AF:AF>=-1,1,IF(($B$2+3)-AF:AF>=-2,2,3))))))","v":3},{"$f":"IF(AE:AE=\"pas d'actualité\",3,IF(AE:AE=\"?\",\"?\",IF(AE:AE=\"?\",\"?\",IF(($B$2+4)-AF:AF>=0,0,IF(($B$2+4)-AF:AF>=-1,1,IF(($B$2+4)-AF:AF>=-2,2,3))))))","v":3}]
["PR136","D136","FAB 136",null,1,null,null,"X","X",null,null,null,null,null,null,null,null,null,null,null,null,null,null,null,null,null,null,null,null,null,"2024-01-04",{"$f":"IF(ISNUMBER(AE:AE),YEAR(AE:AE),AE:AE)","v":2024},{"$f":"IF(AE:AE=\"pas d'actualité\",3,IF(AE:AE=\"?\",\"?\",IF(AE:AE=\"?\",\"?\",IF($B$2-AF:AF>=0,0,IF($B$2-AF:AF>=-1,1,IF($B$2-AF:AF>=-2,2,3))))))","v":3},{"$f":"IF(AE:AE=\"pas d'actualité\",3,IF(AE:AE=\"?\",\"?\",IF(AE:AE=\"?\",\"?\",IF((($B$2+1)-AF:AF)>=0,\"0\",IF((($B$2+1)-AF:AF)>=-1,\"1\",IF((($B$2+1)-AF:AF)>=-2,\"2\",\"3\"))))))","v":"3"},{"$f":"IF(AE:AE=\"pas d'actualité\",3,IF(AE:AE=\"?\",\"?\",IF(AE:AE=\"?\",\"?\",IF((($B$2+2)-AF:AF)>=0,0,IF((($B$2+2)-AF:AF)>=-1,1,IF((($B$2+2)-AF:AF)>=-2,2,3))))))","v":3},{"$f":"IF(AE:AE=\"pas d'actualité\",3,IF(AE:AE=\"?\",\"?\",IF(AE:AE=\"?\",\"?\",IF(($B$2+3)-AF:AF>=0,0,IF(($B$2+3)-AF:AF>=-1,1,IF(($B$2+3)-AF:AF>=-2,2,3))))))","v":3},{"$f":"IF(AE:AE=\"pas d'actualité\",3,IF(AE:AE=\"?\",\"?\",IF(AE:AE=\"?\",\"?\",IF(($B$2+4)-AF:AF>=0,0,IF(($B$2+4)-AF:AF>=-1,1,IF(($B$2+4)-AF:AF>=-2,2,3))))))","v":3}]
["PR137","D137","FAB 137",null,null,null,null,"X","X",null,null,null,null,null,null,null,null,null,null,null,null,null,null,null,null,null,null,null,null,null,"2024-01-04",{"$f":"IF(ISNUMBER(AE:AE),YEAR(AE:AE),AE:AE)","v":2024},{"$f":"IF(AE:AE=\"pas d'actualité\",3,IF(AE:AE=\"?\",\"?\",IF(AE:AE=\"?\",\"?\",IF($B$2-AF:AF>=0,0,IF($B$2-AF:AF>=-1,1,IF($B$2-AF:AF>=-2,2,3))))))","v":3},{"$f":"IF(AE:AE=\"pas d'actualité\",3,IF(AE:AE=\"?\",\"?\",IF(AE:AE=\"?\",\"?\",IF((($B$2+1)-AF:AF)>=0,\"0\",IF((($B$2+1)-AF:AF)>=-1,\"1\",IF((($B$2+1)-AF:AF)>=-2,\"2\",\"3\"))))))","v":"3"},{"$f":"IF(AE:AE=\"pas d'actualité\",3,IF(AE:AE=\"?\",\"?\",IF(AE:AE=\"?\",\"?\",IF((($B$2+2)-AF:AF)>=0,0,IF((($B$2+2)-AF:AF)>=-1,1,IF((($B$2+2)-AF:AF)>=-2,2,3))))))","v":3},{"$f":"IF(AE:AE=\"pas d'actualité\",3,IF(AE:AE=\"?\",\"?\",IF(AE:AE=\"?\",\"?\",IF(($B$2+3)-AF:AF>=0,0,IF(($B$2+3)-AF:AF>=-1,1,IF(($B$2+3)-AF:AF>=-2,2,3))))))","v":3},{"$f":"IF(AE:AE=\"pas d'actualité\",3,IF(AE:AE=\"?\",\"?\",IF(AE:AE=\"?\",\"?\",IF(($B$2+4)-AF:AF>=0,0,IF(($B$2+4)-AF:AF>=-1,1,IF(($B$2+4)-AF:AF>=-2,2,3))))))","v":3}]
["PR138","D138","FAB 138",null,1,null,null,"X","X",null,null,null,null,null,null,null,null,null,null,null,null,null,null,null,null,null,null,null,null,null,"2024-01-04",{"$f":"IF(ISNUMBER(AE:AE),YEAR(AE:AE),AE:AE)","v":2024},{"$f":"IF(AE:AE=\"pas d'actualité\",3,IF(AE:AE=\"?\",\"?\",IF(AE:AE=\"?\",\"?\",IF($B$2-AF:AF>=0,0,IF($B$2-AF:AF>=-1,1,IF($B$2-AF:AF>=-2,2,3))))))","v":3},{"$f":"IF(AE:AE=\"pas d'actualité\",3,IF(AE:AE=\"?\",\"?\",IF(AE:AE=\"?\",\"?\",IF((($B$2+1)-AF:AF)>=0,\"0\",IF((($B$2+1)-AF:AF)>=-1,\"1\",IF((($B$2+1)-AF:AF)>=-2,\"2\",\"3\"))))))","v":"3"},{"$f":"IF(AE:AE=\"pas d'actualité\",3,IF(AE:AE=\"?\",\"?\",IF(AE:AE=\"?\",\"?\",IF((($B$2+2)-AF:AF)>=0,0,IF((($B$2+2)-AF:AF)>=-1,1,IF((($B$2+2)-AF:AF)>=-2,2,3))))))","v":3},{"$f":"IF(AE:AE=\"pas d'actualité\",3,IF(AE:AE=\"?\",\"?\",IF(AE:AE=\"?\",\"?\",IF(($B$2+3)-AF:AF>=0,0,IF(($B$2+3)-AF:AF>=-1,1,IF(($B$2+3)-AF:AF>=-2,2,3))))))","v":3},{"$f":"IF(AE:AE=\"pas d'actualité\",3,IF(AE:AE=\"?\",\"?\",IF(AE:AE=\"?\",\"?\",IF(($B$2+4)-AF:AF>=0,0,IF(($B$2+4)-AF:AF>=-1,1,IF(($B$2+4)-AF:AF>=-2,2,3))))))","v":3}]
["PR139","D139","FAB 139",null,1,null,null,null,null,null,null,null,null,null,null,null,null,null,null,null,null,null,null,null,null,null,null,null,null,null,"?",{"$f":"IF(ISNUMBER(AE:AE),YEAR(AE:AE),AE:AE)","v":"?"},{"$f":"IF(AE:AE=\"pas d'actualité\",3,IF(AE:AE=\"?\",\"?\",IF(AE:AE=\"?\",\"?\",IF($B$2-AF:AF>=0,0,IF($B$2-AF:AF>=-1,1,IF($B$2-AF:AF>=-2,2,3))))))","v":"?"},{"$f":"IF(AE:AE=\"pas d'actualité\",3,IF(AE:AE=\"?\",\"?\",IF(AE:AE=\"?\",\"?\",IF((($B$2+1)-AF:AF)>=0,\"0\",IF((($B$2+1)-AF:AF)>=-1,\"1\",IF((($B$2+1)-AF:AF)>=-2,\"2\",\"3\"))))))","v":"?"},{"$f":"IF(AE:AE=\"pas d'actualité\",3,IF(AE:AE=\"?\",\"?\",IF(AE:AE=\"?\",\"?\",IF((($B$2+2)-AF:AF)>=0,0,IF((($B$2+2)-AF:AF)>=-1,1,IF((($B$2+2)-AF:AF)>=-2,2,3))))))","v":"?"},{"$f":"IF(AE:AE=\"pas d'actualité\",3,IF(AE:AE=\"?\",\"?\",IF(AE:AE=\"?\",\"?\",IF(($B$2+3)-AF:AF>=0,0,IF(($B$2+3)-AF:AF>=-1,1,IF(($B$2+3)-AF:AF>=-2,2,3))))))","v":"?"},{"$f":"IF(AE:AE=\"pas d'actualité\",3,IF(AE:AE=\"?\",\"?\",IF(AE:AE=\"?\",\"?\",IF(($B$2+4)-AF:AF>=0,0,IF(($B$2+4)-AF:AF>=-1,1,IF(($B$2+4)-AF:AF>=-2,2,3))))))","v":"?"}]
["PR140","D140","FAB 140",null,1,null,null,null,null,null,null,null,null,null,null,null,null,null,null,null,null,null,null,null,null,null,null,null,null,null,"?",{"$f":"IF(ISNUMBER(AE:AE),YEAR(AE:AE),AE:AE)","v":"?"},{"$f":"IF(AE:AE=\"pas d'actualité\",3,IF(AE:AE=\"?\",\"?\",IF(AE:AE=\"?\",\"?\",IF($B$2-AF:AF>=0,0,IF($B$2-AF:AF>=-1,1,IF($B$2-AF:AF>=-2,2,3))))))","v":"?"},{"$f":"IF(AE:AE=\"pas d'actualité\",3,IF(AE:AE=\"?\",\"?\",IF(AE:AE=\"?\",\"?\",IF((($B$2+1)-AF:AF)>=0,\"0\",IF((($B$2+1)-AF:AF)>=-1,\"1\",IF((($B$2+1)-AF:AF)>=-2,\"2\",\"3\"))))))","v":"?"},{"$f":"IF(AE:AE=\"pas d'actualité\",3,IF(AE:AE=\"?\",\"?\",IF(AE:AE=\"?\",\"?\",IF((($B$2+2)-AF:AF)>=0,0,IF((($B$2+2)-AF:AF)>=-1,1,IF((($B$2+2)-AF:AF)>=-2,2,3))))))","v":"?"},{"$f":"IF(AE:AE=\"pas d'actualité\",3,IF(AE:AE=\"?\",\"?\",IF(AE:AE=\"?\",\"?\",IF(($B$2+3)-AF:AF>=0,0,IF(($B$2+3)-AF:AF>=-1,1,IF(($B$2+3)-AF:AF>=-2,2,3))))))","v":"?"},{"$f":"IF(AE:AE=\"pas d'actualité\",3,IF(AE:AE=\"?\",\"?\",IF(AE:AE=\"?\",\"?\",IF(($B$2+4)-AF:AF>=0,0,IF(($B$2+4)-AF:AF>=-1,1,IF(($B$2+4)-AF:AF>=-2,2,3))))))","v":"?"}]
["PR141","D141","FAB 141",null,1,null,null,null,null,null,null,null,null,null,null,null,null,null,null,null,null,null,null,null,null,null,null,null,null,null,"?",{"$f":"IF(ISNUMBER(AE:AE),YEAR(AE:AE),AE:AE)","v":"?"},{"$f":"IF(AE:AE=\"pas d'actualité\",3,IF(AE:AE=\"?\",\"?\",IF(AE:AE=\"?\",\"?\",IF($B$2-AF:AF>=0,0,IF($B$2-AF:AF>=-1,1,IF($B$2-AF:AF>=-2,2,3))))))","v":"?"},{"$f":"IF(AE:AE=\"pas d'actualité\",3,IF(AE:AE=\"?\",\"?\",IF(AE:AE=\"?\",\"?\",IF((($B$2+1)-AF:AF)>=0,\"0\",IF((($B$2+1)-AF:AF)>=-1,\"1\",IF((($B$2+1)-AF:AF)>=-2,\"2\",\"3\"))))))","v":"?"},{"$f":"IF(AE:AE=\"pas d'actualité\",3,IF(AE:AE=\"?\",\"?\",IF(AE:AE=\"?\",\"?\",IF((($B$2+2)-AF:AF)>=0,0,IF((($B$2+2)-AF:AF)>=-1,1,IF((($B$2+2)-AF:AF)>=-2,2,3))))))","v":"?"},{"$f":"IF(AE:AE=\"pas d'actualité\",3,IF(AE:AE=\"?\",\"?\",IF(AE:AE=\"?\",\"?\",IF(($B$2+3)-AF:AF>=0,0,IF(($B$2+3)-AF:AF>=-1,1,IF(($B$2+3)-AF:AF>=-2,2,3))))))","v":"?"},{"$f":"IF(AE:AE=\"pas d'actualité\",3,IF(AE:AE=\"?\",\"?\",IF(AE:AE=\"?\",\"?\",IF(($B$2+4)-AF:AF>=0,0,IF(($B$2+4)-AF:AF>=-1,1,IF(($B$2+4)-AF:AF>=-2,2,3))))))","v":"?"}]
["PR142","D142","FAB 142",null,0,null,null,null,null,null,null,null,null,null,null,null,null,"X",null,null,null,null,null,null,null,null,null,null,null,null,"?",{"$f":"IF(ISNUMBER(AE:AE),YEAR(AE:AE),AE:AE)","v":"?"},{"$f":"IF(AE:AE=\"pas d'actualité\",3,IF(AE:AE=\"?\",\"?\",IF(AE:AE=\"?\",\"?\",IF($B$2-AF:AF>=0,0,IF($B$2-AF:AF>=-1,1,IF($B$2-AF:AF>=-2,2,3))))))","v":"?"},{"$f":"IF(AE:AE=\"pas d'actualité\",3,IF(AE:AE=\"?\",\"?\",IF(AE:AE=\"?\",\"?\",IF((($B$2+1)-AF:AF)>=0,\"0\",IF((($B$2+1)-AF:AF)>=-1,\"1\",IF((($B$2+1)-AF:AF)>=-2,\"2\",\"3\"))))))","v":"?"},{"$f":"IF(AE:AE=\"pas d'actualité\",3,IF(AE:AE=\"?\",\"?\",IF(AE:AE=\"?\",\"?\",IF((($B$2+2)-AF:AF)>=0,0,IF((($B$2+2)-AF:AF)>=-1,1,IF((($B$2+2)-AF:AF)>=-2,2,3))))))","v":"?"},{"$f":"IF(AE:AE=\"pas d'actualité\",3,IF(AE:AE=\"?\",\"?\",IF(AE:AE=\"?\",\"?\",IF(($B$2+3)-AF:AF>=0,0,IF(($B$2+3)-AF:AF>=-1,1,IF(($B$2+3)-AF:AF>=-2,2,3))))))","v":"?"},{"$f":"IF(AE:AE=\"pas d'actualité\",3,IF(AE:AE=\"?\",\"?\",IF(AE:AE=\"?\",\"?\",IF(($B$2+4)-AF:AF>=0,0,IF(($B$2+4)-AF:AF>=-1,1,IF(($B$2+4)-AF:AF>=-2,2,3))))))","v":"?"}]
["PR143","D143","FAB 143",null,1,null,null,null,null,null,null,null,null,null,null,null,null,null,null,null,null,null,null,null,null,null,null,null,null,"X","pas d'actualité",{"$f":"IF(ISNUMBER(AE:AE),YEAR(AE:AE),AE:AE)","v":"pas d'actualité"},{"$f":"IF(AE:AE=\"pas d'actualité\",3,IF(AE:AE=\"?\",\"?\",IF(AE:AE=\"?\",\"?\",IF($B$2-AF:AF>=0,0,IF($B$2-AF:AF>=-1,1,IF($B$2-AF:AF>=-2,2,3))))))","v":3},{"$f":"IF(AE:AE=\"pas d'actualité\",3,IF(AE:AE=\"?\",\"?\",IF(AE:AE=\"?\",\"?\",IF((($B$2+1)-AF:AF)>=0,\"0\",IF((($B$2+1)-AF:AF)>=-1,\"1\",IF((($B$2+1)-AF:AF)>=-2,\"2\",\"3\"))))))","v":3},{"$f":"IF(AE:AE=\"pas d'actualité\",3,IF(AE:AE=\"?\",\"?\",IF(AE:AE=\"?\",\"?\",IF((($B$2+2)-AF:AF)>=0,0,IF((($B$2+2)-AF:AF)>=-1,1,IF((($B$2+2)-AF:AF)>=-2,2,3))))))","v":3},{"$f":"IF(AE:AE=\"pas d'actualité\",3,IF(AE:AE=\"?\",\"?\",IF(AE:AE=\"?\",\"?\",IF(($B$2+3)-AF:AF>=0,0,IF(($B$2+3)-AF:AF>=-1,1,IF(($B$2+3)-AF:AF>=-2,2,3))))))","v":3},{"$f":"IF(AE:AE=\"pas d'actualité\",3,IF(AE:AE=\"?\",\"?\",IF(AE:AE=\"?\",\"?\",IF(($B$2+4)-AF:AF>=0,0,IF(($B$2+4)-AF:AF>=-1,1,IF(($B$2+4)-AF:AF>=-2,2,3))))))","v":3}]
["PR144","D144","FAB 144",null,1,null,null,null,null,null,null,null,null,null,null,null,null,null,null,null,null,null,null,null,null,null,null,null,null,"X","2020-10-01",{"$f":"IF(ISNUMBER(AE:AE),YEAR(AE:AE),AE:AE)","v":2020},{"$f":"IF(AE:AE=\"pas d'actualité\",3,IF(AE:AE=\"?\",\"?\",IF(AE:AE=\"?\",\"?\",IF($B$2-AF:AF>=0,0,IF($B$2-AF:AF>=-1,1,IF($B$2-AF:AF>=-2,2,3))))))","v":3},{"$f":"IF(AE:AE=\"pas d'actualité\",3,IF(AE:AE=\"?\",\"?\",IF(AE:AE=\"?\",\"?\",IF((($B$2+1)-AF:AF)>=0,\"0\",IF((($B$2+1)-AF:AF)>=-1,\"1\",IF((($B$2+1)-AF:AF)>=-2,\"2\",\"3\"))))))","v":"3"},{"$f":"IF(AE:AE=\"pas d'actualité\",3,IF(AE:AE=\"?\",\"?\",IF(AE:AE=\"?\",\"?\",IF((($B$2+2)-AF:AF)>=0,0,IF((($B$2+2)-AF:AF)>=-1,1,IF((($B$2+2)-AF:AF)>=-2,2,3))))))","v":2},{"$f":"IF(AE:AE=\"pas d'actualité\",3,IF(AE:AE=\"?\",\"?\",IF(AE:AE=\"?\",\"?\",IF(($B$2+3)-AF:AF>=0,0,IF(($B$2+3)-AF:AF>=-1,1,IF(($B$2+3)-AF:AF>=-2,2,3))))))","v":1},{"$f":"IF(AE:AE=\"pas d'actualité\",3,IF(AE:AE=\"?\",\"?\",IF(AE:AE=\"?\",\"?\",IF(($B$2+4)-AF:AF>=0,0,IF(($B$2+4)-AF:AF>=-1,1,IF(($B$2+4)-AF:AF>=-2,2,3))))))","v":0}]
["PR145","D145","FAB 145",null,1,null,null,null,null,null,null,null,null,null,null,null,null,null,null,null,null,null,null,null,null,null,null,null,null,"X","2020-10-01",{"$f":"IF(ISNUMBER(AE:AE),YEAR(AE:AE),AE:AE)","v":2020},{"$f":"IF(AE:AE=\"pas d'actualité\",3,IF(AE:AE=\"?\",\"?\",IF(AE:AE=\"?\",\"?\",IF($B$2-AF:AF>=0,0,IF($B$2-AF:AF>=-1,1,IF($B$2-AF:AF>=-2,2,3))))))","v":3},{"$f":"IF(AE:AE=\"pas d'actualité\",3,IF(AE:AE=\"?\",\"?\",IF(AE:AE=\"?\",\"?\",IF((($B$2+1)-AF:AF)>=0,\"0\",IF((($B$2+1)-AF:AF)>=-1,\"1\",IF((($B$2+1)-AF:AF)>=-2,\"2\",\"3\"))))))","v":"3"},{"$f":"IF(AE:AE=\"pas d'actualité\",3,IF(AE:AE=\"?\",\"?\",IF(AE:AE=\"?\",\"?\",IF((($B$2+2)-AF:AF)>=0,0,IF((($B$2+2)-AF:AF)>=-1,1,IF((($B$2+2)-AF:AF)>=-2,2,3))))))","v":2},{"$f":"IF(AE:AE=\"pas d'actualité\",3,IF(AE:AE=\"?\",\"?\",IF(AE:AE=\"?\",\"?\",IF(($B$2+3)-AF:AF>=0,0,IF(($B$2+3)-AF:AF>=-1,1,IF(($B$2+3)-AF:AF>=-2,2,3))))))","v":1},{"$f":"IF(AE:AE=\"pas d'actualité\",3,IF(AE:AE=\"?\",\"?\",IF(AE:AE=\"?\",\"?\",IF(($B$2+4)-AF:AF>=0,0,IF(($B$2+4)-AF:AF>=-1,1,IF(($B$2+4)-AF:AF>=-2,2,3))))))","v":0}]
["PR146","D146","FAB 146",null,1,null,null,null,null,null,null,null,null,null,null,null,null,null,null,null,null,null,null,null,null,null,null,null,null,"X","2020-10-01",{"$f":"IF(ISNUMBER(AE:AE),YEAR(AE:AE),AE:AE)","v":2020},{"$f":"IF(AE:AE=\"pas d'actualité\",3,IF(AE:AE=\"?\",\"?\",IF(AE:AE=\"?\",\"?\",IF($B$2-AF:AF>=0,0,IF($B$2-AF:AF>=-1,1,IF($B$2-AF:AF>=-2,2,3))))))","v":3},{"$f":"IF(AE:AE=\"pas d'actualité\",3,IF(AE:AE=\"?\",\"?\",IF(AE:AE=\"?\",\"?\",IF((($B$2+1)-AF:AF)>=0,\"0\",IF((($B$2+1)-AF:AF)>=-1,\"1\",IF((($B$2+1)-AF:AF)>=-2,\"2\",\"3\"))))))","v":"3"},{"$f":"IF(AE:AE=\"pas d'actualité\",3,IF(AE:AE=\"?\",\"?\",IF(AE:AE=\"?\",\"?\",IF((($B$2+2)-AF:AF)>=0,0,IF((($B$2+2)-AF:AF)>=-1,1,IF((($B$2+2)-AF:AF)>=-2,2,3))))))","v":2},{"$f":"IF(AE:AE=\"pas d'actualité\",3,IF(AE:AE=\"?\",\"?\",IF(AE:AE=\"?\",\"?\",IF(($B$2+3)-AF:AF>=0,0,IF(($B$2+3)-AF:AF>=-1,1,IF(($B$2+3)-AF:AF>=-2,2,3))))))","v":1},{"$f":"IF(AE:AE=\"pas d'actualité\",3,IF(AE:AE=\"?\",\"?\",IF(AE:AE=\"?\",\"?\",IF(($B$2+4)-AF:AF>=0,0,IF(($B$2+4)-AF:AF>=-1,1,IF(($B$2+4)-AF:AF>=-2,2,3))))))","v":0}]
["PR147","D147","FAB 147",null,1,null,null,null,null,null,null,null,null,null,null,null,null,"X",null,null,null,null,null,null,null,null,null,null,null,null,"2020-10-01",{"$f":"IF(ISNUMBER(AE:AE),YEAR(AE:AE),AE:AE)","v":2020},{"$f":"IF(AE:AE=\"pas d'actualité\",3,IF(AE:AE=\"?\",\"?\",IF(AE:AE=\"?\",\"?\",IF($B$2-AF:AF>=0,0,IF($B$2-AF:AF>=-1,1,IF($B$2-AF:AF>=-2,2,3))))))","v":3},{"$f":"IF(AE:AE=\"pas d'actualité\",3,IF(AE:AE=\"?\",\"?\",IF(AE:AE=\"?\",\"?\",IF((($B$2+1)-AF:AF)>=0,\"0\",IF((($B$2+1)-AF:AF)>=-1,\"1\",IF((($B$2+1)-AF:AF)>=-2,\"2\",\"3\"))))))","v":"3"},{"$f":"IF(AE:AE=\"pas d'actualité\",3,IF(AE:AE=\"?\",\"?\",IF(AE:AE=\"?\",\"?\",IF((($B$2+2)-AF:AF)>=0,0,IF((($B$2+2)-AF:AF)>=-1,1,IF((($B$2+2)-AF:AF)>=-2,2,3))))))","v":2},{"$f":"IF(AE:AE=\"pas d'actualité\",3,IF(AE:AE=\"?\",\"?\",IF(AE:AE=\"?\",\"?\",IF(($B$2+3)-AF:AF>=0,0,IF(($B$2+3)-AF:AF>=-1,1,IF(($B$2+3)-AF:AF>=-2,2,3))))))","v":1},{"$f":"IF(AE:AE=\"pas d'actualité\",3,IF(AE:AE=\"?\",\"?\",IF(AE:AE=\"?\",\"?\",IF(($B$2+4)-AF:AF>=0,0,IF(($B$2+4)-AF:AF>=-1,1,IF(($B$2+4)-AF:AF>=-2,2,3))))))","v":0}]
["PR148","D148","FAB 148",null,1,null,null,null,null,null,null,null,null,null,null,null,null,"X",null,null,null,null,null,null,null,null,null,null,null,null,"2020-10-01",{"$f":"IF(ISNUMBER(AE:AE),YEAR(AE:AE),AE:AE)","v":2020},{"$f":"IF(AE:AE=\"pas d'actualité\",3,IF(AE:AE=\"?\",\"?\",IF(AE:AE=\"?\",\"?\",IF($B$2-AF:AF>=0,0,IF($B$2-AF:AF>=-1,1,IF($B$2-AF:AF>=-2,2,3))))))","v":3},{"$f":"IF(AE:AE=\"pas d'actualité\",3,IF(AE:AE=\"?\",\"?\",IF(AE:AE=\"?\",\"?\",IF((($B$2+1)-AF:AF)>=0,\"0\",IF((($B$2+1)-AF:AF)>=-1,\"1\",IF((($B$2+1)-AF:AF)>=-2,\"2\",\"3\"))))))","v":"3"},{"$f":"IF(AE:AE=\"pas d'actualité\",3,IF(AE:AE=\"?\",\"?\",IF(AE:AE=\"?\",\"?\",IF((($B$2+2)-AF:AF)>=0,0,IF((($B$2+2)-AF:AF)>=-1,1,IF((($B$2+2)-AF:AF)>=-2,2,3))))))","v":2},{"$f":"IF(AE:AE=\"pas d'actualité\",3,IF(AE:AE=\"?\",\"?\",IF(AE:AE=\"?\",\"?\",IF(($B$2+3)-AF:AF>=0,0,IF(($B$2+3)-AF:AF>=-1,1,IF(($B$2+3)-AF:AF>=-2,2,3))))))","v":1},{"$f":"IF(AE:AE=\"pas d'actualité\",3,IF(AE:AE=\"?\",\"?\",IF(AE:AE=\"?\",\"?\",IF(($B$2+4)-AF:AF>=0,0,IF(($B$2+4)-AF:AF>=-1,1,IF(($B$2+4)-AF:AF>=-2,2,3))))))","v":0}]
["PR160","D160","FAB 400",null,1,null,null,null,null,null,null,null,null,null,null,null,null,null,null,null,null,null,null,null,null,null,null,null,null,null,"2016-01-10",{"$f":"IF(ISNUMBER(AE:AE),YEAR(AE:AE),AE:AE)","v":2016},{"$f":"IF(AE:AE=\"pas d'actualité\",3,IF(AE:AE=\"?\",\"?\",IF(AE:AE=\"?\",\"?\",IF($B$2-AF:AF>=0,0,IF($B$2-AF:AF>=-1,1,IF($B$2-AF:AF>=-2,2,3))))))","v":0},{"$f":"IF(AE:AE=\"pas d'actualité\",3,IF(AE:AE=\"?\",\"?\",IF(AE:AE=\"?\",\"?\",IF((($B$2+1)-AF:AF)>=0,\"0\",IF((($B$2+1)-AF:AF)>=-1,\"1\",IF((($B$2+1)-AF:AF)>=-2,\"2\",\"3\"))))))","v":"0"},{"$f":"IF(AE:AE=\"pas d'actualité\",3,IF(AE:AE=\"?\",\"?\",IF(AE:AE=\"?\",\"?\",IF((($B$2+2)-AF:AF)>=0,0,IF((($B$2+2)-AF:AF)>=-1,1,IF((($B$2+2)-AF:AF)>=-2,2,3))))))","v":0},{"$f":"IF(AE:AE=\"pas d'actualité\",3,IF(AE:AE=\"?\",\"?\",IF(AE:AE=\"?\",\"?\",IF(($B$2+3)-AF:AF>=0,0,IF(($B$2+3)-AF:AF>=-1,1,IF(($B$2+3)-AF:AF>=-2,2,3))))))","v":0},{"$f":"IF(AE:AE=\"pas d'actualité\",3,IF(AE:AE=\"?\",\"?\",IF(AE:AE=\"?\",\"?\",IF(($B$2+4)-AF:AF>=0,0,IF(($B$2+4)-AF:AF>=-1,1,IF(($B$2+4)-AF:AF>=-2,2,3))))))","v":0},null,null,"ARRET TOTAL FOURNITURE 01/10/2018"]
["PR161","D161","FAB 401",null,1,null,null,"X","X",null,null,"X",null,null,null,null,null,null,null,null,null,null,null,null,null,null,null,null,null,null,"2004-12-31",{"$f":"IF(ISNUMBER(AE:AE),YEAR(AE:AE),AE:AE)","v":2004},{"$f":"IF(AE:AE=\"pas d'actualité\",3,IF(AE:AE=\"?\",\"?\",IF(AE:AE=\"?\",\"?\",IF($B$2-AF:AF>=0,0,IF($B$2-AF:AF>=-1,1,IF($B$2-AF:AF>=-2,2,3))))))","v":0},{"$f":"IF(AE:AE=\"pas d'actualité\",3,IF(AE:AE=\"?\",\"?\",IF(AE:AE=\"?\",\"?\",IF((($B$2+1)-AF:AF)>=0,\"0\",IF((($B$2+1)-AF:AF)>=-1,\"1\",IF((($B$2+1)-AF:AF)>=-2,\"2\",\"3\"))))))","v":"0"},{"$f":"IF(AE:AE=\"pas d'actualité\",3,IF(AE:AE=\"?\",\"?\",IF(AE:AE=\"?\",\"?\",IF((($B$2+2)-AF:AF)>=0,0,IF((($B$2+2)-AF:AF)>=-1,1,IF((($B$2+2)-AF:AF)>=-2,2,3))))))","v":0},{"$f":"IF(AE:AE=\"pas d'actualité\",3,IF(AE:AE=\"?\",\"?\",IF(AE:AE=\"?\",\"?\",IF(($B$2+3)-AF:AF>=0,0,IF(($B$2+3)-AF:AF>=-1,1,IF(($B$2+3)-AF:AF>=-2,2,3))))))","v":0},{"$f":"IF(AE:AE=\"pas d'actualité\",3,IF(AE:AE=\"?\",\"?\",IF(AE:AE=\"?\",\"?\",IF(($B$2+4)-AF:AF>=0,0,IF(($B$2+4)-AF:AF>=-1,1,IF(($B$2+4)-AF:AF>=-2,2,3))))))","v":0},null,null,"ARRET TOTAL FOURNITURE 01/04/2005"]
["PR162","D162","FAB 402",null,1,null,null,null,null,"X",null,null,null,null,null,null,null,null,null,null,null,null,null,null,null,null,null,null,null,null,"2016-01-10",{"$f":"IF(ISNUMBER(AE:AE),YEAR(AE:AE),AE:AE)","v":2016},{"$f":"IF(AE:AE=\"pas d'actualité\",3,IF(AE:AE=\"?\",\"?\",IF(AE:AE=\"?\",\"?\",IF($B$2-AF:AF>=0,0,IF($B$2-AF:AF>=-1,1,IF($B$2-AF:AF>=-2,2,3))))))","v":0},{"$f":"IF(AE:AE=\"pas d'actualité\",3,IF(AE:AE=\"?\",\"?\",IF(AE:AE=\"?\",\"?\",IF((($B$2+1)-AF:AF)>=0,\"0\",IF((($B$2+1)-AF:AF)>=-1,\"1\",IF((($B$2+1)-AF:AF)>=-2,\"2\",\"3\"))))))","v":"0"},{"$f":"IF(AE:AE=\"pas d'actualité\",3,IF(AE:AE=\"?\",\"?\",IF(AE:AE=\"?\",\"?\",IF((($B$2+2)-AF:AF)>=0,0,IF((($B$2+2)-AF:AF)>=-1,1,IF((($B$2+2)-AF:AF)>=-2,2,3))))))","v":0},{"$f":"IF(AE:AE=\"pas d'actualité\",3,IF(AE:AE=\"?\",\"?\",IF(AE:AE=\"?\",\"?\",IF(($B$2+3)-AF:AF>=0,0,IF(($B$2+3)-AF:AF>=-1,1,IF(($B$2+3)-AF:AF>=-2,2,3))))))","v":0},{"$f":"IF(AE:AE=\"pas d'actualité\",3,IF(AE:AE=\"?\",\"?\",IF(AE:AE=\"?\",\"?\",IF(($B$2+4)-AF:AF>=0,0,IF(($B$2+4)-AF:AF>=-1,1,IF(($B$2+4)-AF:AF>=-2,2,3))))))","v":0},null,null,"ARRET TOTAL FOURNITURE 01/10/2018"]
["PR163","D163","FAB 403",null,1,null,null,null,null,null,null,null,null,null,null,null,null,null,null,null,null,null,null,null,null,null,null,null,null,null,"2006-11-24",{"$f":"IF(ISNUMBER(AE:AE),YEAR(AE:AE),AE:AE)","v":2006},{"$f":"IF(AE:AE=\"pas d'actualité\",3,IF(AE:AE=\"?\",\"?\",IF(AE:AE=\"?\",\"?\",IF($B$2-AF:AF>=0,0,IF($B$2-AF:AF>=-1,1,IF($B$2-AF:AF>=-2,2,3))))))","v":0},{"$f":"IF(AE:AE=\"pas d'actualité\",3,IF(AE:AE=\"?\",\"?\",IF(AE:AE=\"?\",\"?\",IF((($B$2+1)-AF:AF)>=0,\"0\",IF((($B$2+1)-AF:AF)>=-1,\"1\",IF((($B$2+1)-AF:AF)>=-2,\"2\",\"3\"))))))","v":"0"},{"$f":"IF(AE:AE=\"pas d'actualité\",3,IF(AE:AE=\"?\",\"?\",IF(AE:AE=\"?\",\"?\",IF((($B$2+2)-AF:AF)>=0,0,IF((($B$2+2)-AF:AF)>=-1,1,IF((($B$2+2)-AF:AF)>=-2,2,3))))))","v":0},{"$f":"IF(AE:AE=\"pas d'actualité\",3,IF(AE:AE=\"?\",\"?\",IF(AE:AE=\"?\",\"?\",IF(($B$2+3)-AF:AF>=0,0,IF(($B$2+3)-AF:AF>=-1,1,IF(($B$2+3)-AF:AF>=-2,2,3))))))","v":0},{"$f":"IF(AE:AE=\"pas d'actualité\",3,IF(AE:AE=\"?\",\"?\",IF(AE:AE=\"?\",\"?\",IF(($B$2+4)-AF:AF>=0,0,IF(($B$2+4)-AF:AF>=-1,1,IF(($B$2+4)-AF:AF>=-2,2,3))))))","v":0},null,null,"ARRET TOTAL FOURNITURE 24/11/2006"]
["PR164","D164","FAB 404",null,1,null,null,"X","X",null,null,null,null,null,null,null,null,null,null,null,null,null,null,null,null,null,null,null,null,null,"2010-01-10",{"$f":"IF(ISNUMBER(AE:AE),YEAR(AE:AE),AE:AE)","v":2010},{"$f":"IF(AE:AE=\"pas d'actualité\",3,IF(AE:AE=\"?\",\"?\",IF(AE:AE=\"?\",\"?\",IF($B$2-AF:AF>=0,0,IF($B$2-AF:AF>=-1,1,IF($B$2-AF:AF>=-2,2,3))))))","v":0},{"$f":"IF(AE:AE=\"pas d'actualité\",3,IF(AE:AE=\"?\",\"?\",IF(AE:AE=\"?\",\"?\",IF((($B$2+1)-AF:AF)>=0,\"0\",IF((($B$2+1)-AF:AF)>=-1,\"1\",IF((($B$2+1)-AF:AF)>=-2,\"2\",\"3\"))))))","v":"0"},{"$f":"IF(AE:AE=\"pas d'actualité\",3,IF(AE:AE=\"?\",\"?\",IF(AE:AE=\"?\",\"?\",IF((($B$2+2)-AF:AF)>=0,0,IF((($B$2+2)-AF:AF)>=-1,1,IF((($B$2+2)-AF:AF)>=-2,2,3))))))","v":0},{"$f":"IF(AE:AE=\"pas d'actualité\",3,IF(AE:AE=\"?\",\"?\",IF(AE:AE=\"?\",\"?\",IF(($B$2+3)-AF:AF>=0,0,IF(($B$2+3)-AF:AF>=-1,1,IF(($B$2+3)-AF:AF>=-2,2,3))))))","v":0},{"$f":"IF(AE:AE=\"pas d'actualité\",3,IF(AE:AE=\"?\",\"?\",IF(AE:AE=\"?\",\"?\",IF(($B$2+4)-AF:AF>=0,0,IF(($B$2+4)-AF:AF>=-1,1,IF(($B$2+4)-AF:AF>=-2,2,3))))))","v":0},null,null,"ARRET TOTAL FOURNITURE 01/10/2010"]
["PR165","D165","FAB 405",null,null,null,null,"X",null,null,null,null,null,null,null,null,null,null,null,null,null,null,null,null,null,null,null,null,null,null,"2011-01-10",{"$f":"IF(ISNUMBER(AE:AE),YEAR(AE:AE),AE:AE)","v":2011},{"$f":"IF(AE:AE=\"pas d'actualité\",3,IF(AE:AE=\"?\",\"?\",IF(AE:AE=\"?\",\"?\",IF($B$2-AF:AF>=0,0,IF($B$2-AF:AF>=-1,1,IF($B$2-AF:AF>=-2,2,3))))))","v":0},{"$f":"IF(AE:AE=\"pas d'actualité\",3,IF(AE:AE=\"?\",\"?\",IF(AE:AE=\"?\",\"?\",IF((($B$2+1)-AF:AF)>=0,\"0\",IF((($B$2+1)-AF:AF)>=-1,\"1\",IF((($B$2+1)-AF:AF)>=-2,\"2\",\"3\"))))))","v":"0"},{"$f":"IF(AE:AE=\"pas d'actualité\",3,IF(AE:AE=\"?\",\"?\",IF(AE:AE=\"?\",\"?\",IF((($B$2+2)-AF:AF)>=0,0,IF((($B$2+2)-AF:AF)>=-1,1,IF((($B$2+2)-AF:AF)>=-2,2,3))))))","v":0},{"$f":"IF(AE:AE=\"pas d'actualité\",3,IF(AE:AE=\"?\",\"?\",IF(AE:AE=\"?\",\"?\",IF(($B$2+3)-AF:AF>=0,0,IF(($B$2+3)-AF:AF>=-1,1,IF(($B$2+3)-AF:AF>=-2,2,3))))))","v":0},{"$f":"IF(AE:AE=\"pas d'actualité\",3,IF(AE:AE=\"?\",\"?\",IF(AE:AE=\"?\",\"?\",IF(($B$2+4)-AF:AF>=0,0,IF(($B$2+4)-AF:AF>=-1,1,IF(($B$2+4)-AF:AF>=-2,2,3))))))","v":0}]
["PR166","D166","FAB 406",null,null,null,null,null,null,null,null,null,null,null,null,null,null,null,null,null,null,null,null,null,null,null,null,null,null,null,"2008-05-15",{"$f":"IF(ISNUMBER(AE:AE),YEAR(AE:AE),AE:AE)","v":2008},{"$f":"IF(AE:AE=\"pas d'actualité\",3,IF(AE:AE=\"?\",\"?\",IF(AE:AE=\"?\",\"?\",IF($B$2-AF:AF>=0,0,IF($B$2-AF:AF>=-1,1,IF($B$2-AF:AF>=-2,2,3))))))","v":0},{"$f":"IF(AE:AE=\"pas d'actualité\",3,IF(AE:AE=\"?\",\"?\",IF(AE:AE=\"?\",\"?\",IF((($B$2+1)-AF:AF)>=0,\"0\",IF((($B$2+1)-AF:AF)>=-1,\"1\",IF((($B$2+1)-AF:AF)>=-2,\"2\",\"3\"))))))","v":"0"},{"$f":"IF(AE:AE=\"pas d'actualité\",3,IF(AE:AE=\"?\",\"?\",IF(AE:AE=\"?\",\"?\",IF((($B$2+2)-AF:AF)>=0,0,IF((($B$2+2)-AF:AF)>=-1,1,IF((($B$2+2)-AF:AF)>=-2,2,3))))))","v":0},{"$f":"IF(AE:AE=\"pas d'actualité\",3,IF(AE:AE=\"?\",\"?\",IF(AE:AE=\"?\",\"?\",IF(($B$2+3)-AF:AF>=0,0,IF(($B$2+3)-AF:AF>=-1,1,IF(($B$2+3)-AF:AF>=-2,2,3))))))","v":0},{"$f":"IF(AE:AE=\"pas d'actualité\",3,IF(AE:AE=\"?\",\"?\",IF(AE:AE=\"?\",\"?\",IF(($B$2+4)-AF:AF>=0,0,IF(($B$2+4)-AF:AF>=-1,1,IF(($B$2+4)-AF:AF>=-2,2,3))))))","v":0},null,null,"reparation/pièce de rechange seulement sous garantie"]
["PR167","D167","FAB 407",null,null,null,null,null,null,null,null,null,null,null,null,null,null,null,null,null,null,null,null,null,null,null,null,null,null,null,"2010-01-10",{"$f":"IF(ISNUMBER(AE:AE),YEAR(AE:AE),AE:AE)","v":2010},{"$f":"IF(AE:AE=\"pas d'actualité\",3,IF(AE:AE=\"?\",\"?\",IF(AE:AE=\"?\",\"?\",IF($B$2-AF:AF>=0,0,IF($B$2-AF:AF>=-1,1,IF($B$2-AF:AF>=-2,2,3))))))","v":0},{"$f":"IF(AE:AE=\"pas d'actualité\",3,IF(AE:AE=\"?\",\"?\",IF(AE:AE=\"?\",\"?\",IF((($B$2+1)-AF:AF)>=0,\"0\",IF((($B$2+1)-AF:AF)>=-1,\"1\",IF((($B$2+1)-AF:AF)>=-2,\"2\",\"3\"))))))","v":"0"},{"$f":"IF(AE:AE=\"pas d'actualité\",3,IF(AE:AE=\"?\",\"?\",IF(AE:AE=\"?\",\"?\",IF((($B$2+2)-AF:AF)>=0,0,IF((($B$2+2)-AF:AF)>=-1,1,IF((($B$2+2)-AF:AF)>=-2,2,3))))))","v":0},{"$f":"IF(AE:AE=\"pas d'actualité\",3,IF(AE:AE=\"?\",\"?\",IF(AE:AE=\"?\",\"?\",IF(($B$2+3)-AF:AF>=0,0,IF(($B$2+3)-AF:AF>=-1,1,IF(($B$2+3)-AF:AF>=-2,2,3))))))","v":0},{"$f":"IF(AE:AE=\"pas d'actualité\",3,IF(AE:AE=\"?\",\"?\",IF(AE:AE=\"?\",\"?\",IF(($B$2+4)-AF:AF>=0,0,IF(($B$2+4)-AF:AF>=-1,1,IF(($B$2+4)-AF:AF>=-2,2,3))))))","v":0},null,null,"Seulement disponible en pièces de rechange"]
["PR168","D168","FAB 408",null,null,null,null,null,null,null,null,null,null,null,null,null,null,"X",null,null,null,null,null,null,null,null,null,null,null,null,"2008-01-10",{"$f":"IF(ISNUMBER(AE:AE),YEAR(AE:AE),AE:AE)","v":2008},{"$f":"IF(AE:AE=\"pas d'actualité\",3,IF(AE:AE=\"?\",\"?\",IF(AE:AE=\"?\",\"?\",IF($B$2-AF:AF>=0,0,IF($B$2-AF:AF>=-1,1,IF($B$2-AF:AF>=-2,2,3))))))","v":0},{"$f":"IF(AE:AE=\"pas d'actualité\",3,IF(AE:AE=\"?\",\"?\",IF(AE:AE=\"?\",\"?\",IF((($B$2+1)-AF:AF)>=0,\"0\",IF((($B$2+1)-AF:AF)>=-1,\"1\",IF((($B$2+1)-AF:AF)>=-2,\"2\",\"3\"))))))","v":"0"},{"$f":"IF(AE:AE=\"pas d'actualité\",3,IF(AE:AE=\"?\",\"?\",IF(AE:AE=\"?\",\"?\",IF((($B$2+2)-AF:AF)>=0,0,IF((($B$2+2)-AF:AF)>=-1,1,IF((($B$2+2)-AF:AF)>=-2,2,3))))))","v":0},{"$f":"IF(AE:AE=\"pas d'actualité\",3,IF(AE:AE=\"?\",\"?\",IF(AE:AE=\"?\",\"?\",IF(($B$2+3)-AF:AF>=0,0,IF(($B$2+3)-AF:AF>=-1,1,IF(($B$2+3)-AF:AF>=-2,2,3))))))","v":0},{"$f":"IF(AE:AE=\"pas d'actualité\",3,IF(AE:AE=\"?\",\"?\",IF(AE:AE=\"?\",\"?\",IF(($B$2+4)-AF:AF>=0,0,IF(($B$2+4)-AF:AF>=-1,1,IF(($B$2+4)-AF:AF>=-2,2,3))))))","v":0},null,"partiellement"]
["PR169","D169","FAB 409",null,1,null,null,null,null,null,null,null,null,null,null,null,null,"X",null,null,null,null,null,null,null,null,null,null,null,null,"2010-01-10",{"$f":"IF(ISNUMBER(AE:AE),YEAR(AE:AE),AE:AE)","v":2010},{"$f":"IF(AE:AE=\"pas d'actualité\",3,IF(AE:AE=\"?\",\"?\",IF(AE:AE=\"?\",\"?\",IF($B$2-AF:AF>=0,0,IF($B$2-AF:AF>=-1,1,IF($B$2-AF:AF>=-2,2,3))))))","v":0},{"$f":"IF(AE:AE=\"pas d'actualité\",3,IF(AE:AE=\"?\",\"?\",IF(AE:AE=\"?\",\"?\",IF((($B$2+1)-AF:AF)>=0,\"0\",IF((($B$2+1)-AF:AF)>=-1,\"1\",IF((($B$2+1)-AF:AF)>=-2,\"2\",\"3\"))))))","v":"0"},{"$f":"IF(AE:AE=\"pas d'actualité\",3,IF(AE:AE=\"?\",\"?\",IF(AE:AE=\"?\",\"?\",IF((($B$2+2)-AF:AF)>=0,0,IF((($B$2+2)-AF:AF)>=-1,1,IF((($B$2+2)-AF:AF)>=-2,2,3))))))","v":0},{"$f":"IF(AE:AE=\"pas d'actualité\",3,IF(AE:AE=\"?\",\"?\",IF(AE:AE=\"?\",\"?\",IF(($B$2+3)-AF:AF>=0,0,IF(($B$2+3)-AF:AF>=-1,1,IF(($B$2+3)-AF:AF>=-2,2,3))))))","v":0},{"$f":"IF(AE:AE=\"pas d'actualité\",3,IF(AE:AE=\"?\",\"?\",IF(AE:AE=\"?\",\"?\",IF(($B$2+4)-AF:AF>=0,0,IF(($B$2+4)-AF:AF>=-1,1,IF(($B$2+4)-AF:AF>=-2,2,3))))))","v":0}]
["PR170","D170","FAB 410",null,1,null,null,null,null,null,null,null,null,null,null,null,null,"X",null,null,null,null,null,null,null,null,null,null,null,null,"2008-01-10",{"$f":"IF(ISNUMBER(AE:AE),YEAR(AE:AE),AE:AE)","v":2008},{"$f":"IF(AE:AE=\"pas d'actualité\",3,IF(AE:AE=\"?\",\"?\",IF(AE:AE=\"?\",\"?\",IF($B$2-AF:AF>=0,0,IF($B$2-AF:AF>=-1,1,IF($B$2-AF:AF>=-2,2,3))))))","v":0},{"$f":"IF(AE:AE=\"pas d'actualité\",3,IF(AE:AE=\"?\",\"?\",IF(AE:AE=\"?\",\"?\",IF((($B$2+1)-AF:AF)>=0,\"0\",IF((($B$2+1)-AF:AF)>=-1,\"1\",IF((($B$2+1)-AF:AF)>=-2,\"2\",\"3\"))))))","v":"0"},{"$f":"IF(AE:AE=\"pas d'actualité\",3,IF(AE:AE=\"?\",\"?\",IF(AE:AE=\"?\",\"?\",IF((($B$2+2)-AF:AF)>=0,0,IF((($B$2+2)-AF:AF)>=-1,1,IF((($B$2+2)-AF:AF)>=-2,2,3))))))","v":0},{"$f":"IF(AE:AE=\"pas d'actualité\",3,IF(AE:AE=\"?\",\"?\",IF(AE:AE=\"?\",\"?\",IF(($B$2+3)-AF:AF>=0,0,IF(($B$2+3)-AF:AF>=-1,1,IF(($B$2+3)-AF:AF>=-2,2,3))))))","v":0},{"$f":"IF(AE:AE=\"pas d'actualité\",3,IF(AE:AE=\"?\",\"?\",IF(AE:AE=\"?\",\"?\",IF(($B$2+4)-AF:AF>=0,0,IF(($B$2+4)-AF:AF>=-1,1,IF(($B$2+4)-AF:AF>=-2,2,3))))))","v":0}]
["PR171","D171","FAB 411",null,1,null,null,"X","X",null,null,null,null,null,null,null,null,null,null,null,null,null,null,null,null,null,null,null,null,null,"2015-01-10",{"$f":"IF(ISNUMBER(AE:AE),YEAR(AE:AE),AE:AE)","v":2015},{"$f":"IF(AE:AE=\"pas d'actualité\",3,IF(AE:AE=\"?\",\"?\",IF(AE:AE=\"?\",\"?\",IF($B$2-AF:AF>=0,0,IF($B$2-AF:AF>=-1,1,IF($B$2-AF:AF>=-2,2,3))))))","v":0},{"$f":"IF(AE:AE=\"pas d'actualité\",3,IF(AE:AE=\"?\",\"?\",IF(AE:AE=\"?\",\"?\",IF((($B$2+1)-AF:AF)>=0,\"0\",IF((($B$2+1)-AF:AF)>=-1,\"1\",IF((($B$2+1)-AF:AF)>=-2,\"2\",\"3\"))))))","v":"0"},{"$f":"IF(AE:AE=\"pas d'actualité\",3,IF(AE:AE=\"?\",\"?\",IF(AE:AE=\"?\",\"?\",IF((($B$2+2)-AF:AF)>=0,0,IF((($B$2+2)-AF:AF)>=-1,1,IF((($B$2+2)-AF:AF)>=-2,2,3))))))","v":0},{"$f":"IF(AE:AE=\"pas d'actualité\",3,IF(AE:AE=\"?\",\"?\",IF(AE:AE=\"?\",\"?\",IF(($B$2+3)-AF:AF>=0,0,IF(($B$2+3)-AF:AF>=-1,1,IF(($B$2+3)-AF:AF>=-2,2,3))))))","v":0},{"$f":"IF(AE:AE=\"pas d'actualité\",3,IF(AE:AE=\"?\",\"?\",IF(AE:AE=\"?\",\"?\",IF(($B$2+4)-AF:AF>=0,0,IF(($B$2+4)-AF:AF>=-1,1,IF(($B$2+4)-AF:AF>=-2,2,3))))))","v":0},null,null,"ARRET TOTAL FOURNITURE 01/10/2017"]
["PR172","D172","FAB 412",null,1,null,null,"X","X",null,null,null,null,null,null,null,null,null,null,null,null,null,null,null,null,null,null,null,null,null,"2015-01-10",{"$f":"IF(ISNUMBER(AE:AE),YEAR(AE:AE),AE:AE)","v":2015},{"$f":"IF(AE:AE=\"pas d'actualité\",3,IF(AE:AE=\"?\",\"?\",IF(AE:AE=\"?\",\"?\",IF($B$2-AF:AF>=0,0,IF($B$2-AF:AF>=-1,1,IF($B$2-AF:AF>=-2,2,3))))))","v":0},{"$f":"IF(AE:AE=\"pas d'actualité\",3,IF(AE:AE=\"?\",\"?\",IF(AE:AE=\"?\",\"?\",IF((($B$2+1)-AF:AF)>=0,\"0\",IF((($B$2+1)-AF:AF)>=-1,\"1\",IF((($B$2+1)-AF:AF)>=-2,\"2\",\"3\"))))))","v":"0"},{"$f":"IF(AE:AE=\"pas d'actualité\",3,IF(AE:AE=\"?\",\"?\",IF(AE:AE=\"?\",\"?\",IF((($B$2+2)-AF:AF)>=0,0,IF((($B$2+2)-AF:AF)>=-1,1,IF((($B$2+2)-AF:AF)>=-2,2,3))))))","v":0},{"$f":"IF(AE:AE=\"pas d'actualité\",3,IF(AE:AE=\"?\",\"?\",IF(AE:AE=\"?\",\"?\",IF(($B$2+3)-AF:AF>=0,0,IF(($B$2+3)-AF:AF>=-1,1,IF(($B$2+3)-AF:AF>=-2,2,3))))))","v":0},{"$f":"IF(AE:AE=\"pas d'actualité\",3,IF(AE:AE=\"?\",\"?\",IF(AE:AE=\"?\",\"?\",IF(($B$2+4)-AF:AF>=0,0,IF(($B$2+4)-AF:AF>=-1,1,IF(($B$2+4)-AF:AF>=-2,2,3))))))","v":0},null,null,"ARRET TOTAL FOURNITURE 01/10/2017"]
["PR173","D173","FAB 413",null,1,null,null,"X","X",null,null,null,null,null,null,null,null,null,null,null,null,null,null,null,null,null,null,null,null,null,"2015-01-10",{"$f":"IF(ISNUMBER(AE:AE),YEAR(AE:AE),AE:AE)","v":2015},{"$f":"IF(AE:AE=\"pas d'actualité\",3,IF(AE:AE=\"?\",\"?\",IF(AE:AE=\"?\",\"?\",IF($B$2-AF:AF>=0,0,IF($B$2-AF:AF>=-1,1,IF($B$2-AF:AF>=-2,2,3))))))","v":0},{"$f":"IF(AE:AE=\"pas d'actualité\",3,IF(AE:AE=\"?\",\"?\",IF(AE:AE=\"?\",\"?\",IF((($B$2+1)-AF:AF)>=0,\"0\",IF((($B$2+1)-AF:AF)>=-1,\"1\",IF((($B$2+1)-AF:AF)>=-2,\"2\",\"3\"))))))","v":"0"},{"$f":"IF(AE:AE=\"pas d'actualité\",3,IF(AE:AE=\"?\",\"?\",IF(AE:AE=\"?\",\"?\",IF((($B$2+2)-AF:AF)>=0,0,IF((($B$2+2)-AF:AF)>=-1,1,IF((($B$2+2)-AF:AF)>=-2,2,3))))))","v":0},{"$f":"IF(AE:AE=\"pas d'actualité\",3,IF(AE:AE=\"?\",\"?\",IF(AE:AE=\"?\",\"?\",IF(($B$2+3)-AF:AF>=0,0,IF(($B$2+3)-AF:AF>=-1,1,IF(($B$2+3)-AF:AF>=-2,2,3))))))","v":0},{"$f":"IF(AE:AE=\"pas d'actualité\",3,IF(AE:AE=\"?\",\"?\",IF(AE:AE=\"?\",\"?\",IF(($B$2+4)-AF:AF>=0,0,IF(($B$2+4)-AF:AF>=-1,1,IF(($B$2+4)-AF:AF>=-2,2,3))))))","v":0},null,null,"ARRET TOTAL FOURNITURE 01/10/2017"]
["PR174","D174","FAB 414",null,1,null,null,"X","X",null,null,null,null,null,null,null,null,null,null,null,null,null,null,null,null,null,null,null,null,null,"2015-01-10",{"$f":"IF(ISNUMBER(AE:AE),YEAR(AE:AE),AE:AE)","v":2015},{"$f":"IF(AE:AE=\"pas d'actualité\",3,IF(AE:AE=\"?\",\"?\",IF(AE:AE=\"?\",\"?\",IF($B$2-AF:AF>=0,0,IF($B$2-AF:AF>=-1,1,IF($B$2-AF:AF>=-2,2,3))))))","v":0},{"$f":"IF(AE:AE=\"pas d'actualité\",3,IF(AE:AE=\"?\",\"?\",IF(AE:AE=\"?\",\"?\",IF((($B$2+1)-AF:AF)>=0,\"0\",IF((($B$2+1)-AF:AF)>=-1,\"1\",IF((($B$2+1)-AF:AF)>=-2,\"2\",\"3\"))))))","v":"0"},{"$f":"IF(AE:AE=\"pas d'actualité\",3,IF(AE:AE=\"?\",\"?\",IF(AE:AE=\"?\",\"?\",IF((($B$2+2)-AF:AF)>=0,0,IF((($B$2+2)-AF:AF)>=-1,1,IF((($B$2+2)-AF:AF)>=-2,2,3))))))","v":0},{"$f":"IF(AE:AE=\"pas d'actualité\",3,IF(AE:AE=\"?\",\"?\",IF(AE:AE=\"?\",\"?\",IF(($B$2+3)-AF:AF>=0,0,IF(($B$2+3)-AF:AF>=-1,1,IF(($B$2+3)-AF:AF>=-2,2,3))))))","v":0},{"$f":"IF(AE:AE=\"pas d'actualité\",3,IF(AE:AE=\"?\",\"?\",IF(AE:AE=\"?\",\"?\",IF(($B$2+4)-AF:AF>=0,0,IF(($B$2+4)-AF:AF>=-1,1,IF(($B$2+4)-AF:AF>=-2,2,3))))))","v":0},null,null,"cette référence Siemens est en fin de commercialisation, normalement des modules destinés à la réparation sont encore disponibles jusqu'au milieu de cette année 2015 ARRET TOTAL FOURNITURE 01/10/2017"]
["PR175","D175","FAB 415",null,1,null,null,"X","X",null,null,null,null,null,null,null,null,null,null,null,null,null,null,null,null,null,null,null,null,null,"2015-01-10",{"$f":"IF(ISNUMBER(AE:AE),YEAR(AE:AE),AE:AE)","v":2015},{"$f":"IF(AE:AE=\"pas d'actualité\",3,IF(AE:AE=\"?\",\"?\",IF(AE:AE=\"?\",\"?\",IF($B$2-AF:AF>=0,0,IF($B$2-AF:AF>=-1,1,IF($B$2-AF:AF>=-2,2,3))))))","v":0},{"$f":"IF(AE:AE=\"pas d'actualité\",3,IF(AE:AE=\"?\",\"?\",IF(AE:AE=\"?\",\"?\",IF((($B$2+1)-AF:AF)>=0,\"0\",IF((($B$2+1)-AF:AF)>=-1,\"1\",IF((($B$2+1)-AF:AF)>=-2,\"2\",\"3\"))))))","v":"0"},{"$f":"IF(AE:AE=\"pas d'actualité\",3,IF(AE:AE=\"?\",\"?\",IF(AE:AE=\"?\",\"?\",IF((($B$2+2)-AF:AF)>=0,0,IF((($B$2+2)-AF:AF)>=-1,1,IF((($B$2+2)-AF:AF)>=-2,2,3))))))","v":0},{"$f":"IF(AE:AE=\"pas d'actualité\",3,IF(AE:AE=\"?\",\"?\",IF(AE:AE=\"?\",\"?\",IF(($B$2+3)-AF:AF>=0,0,IF(($B$2+3)-AF:AF>=-1,1,IF(($B$2+3)-AF:AF>=-2,2,3))))))","v":0},{"$f":"IF(AE:AE=\"pas d'actualité\",3,IF(AE:AE=\"?\",\"?\",IF(AE:AE=\"?\",\"?\",IF(($B$2+4)-AF:AF>=0,0,IF(($B$2+4)-AF:AF>=-1,1,IF(($B$2+4)-AF:AF>=-2,2,3))))))","v":0},null,null,"ARRET TOTAL FOURNITURE 01/10/2017"]
["PR176","D176","FAB 416",null,1,null,null,"X","X",null,null,null,null,null,null,null,null,null,null,null,null,null,null,null,null,null,null,null,null,null,"2015-01-10",{"$f":"IF(ISNUMBER(AE:AE),YEAR(AE:AE),AE:AE)","v":2015},{"$f":"IF(AE:AE=\"pas d'actualité\",3,IF(AE:AE=\"?\",\"?\",IF(AE:AE=\"?\",\"?\",IF($B$2-AF:AF>=0,0,IF($B$2-AF:AF>=-1,1,IF($B$2-AF:AF>=-2,2,3))))))","v":0},{"$f":"IF(AE:AE=\"pas d'actualité\",3,IF(AE:AE=\"?\",\"?\",IF(AE:AE=\"?\",\"?\",IF((($B$2+1)-AF:AF)>=0,\"0\",IF((($B$2+1)-AF:AF)>=-1,\"1\",IF((($B$2+1)-AF:AF)>=-2,\"2\",\"3\"))))))","v":"0"},{"$f":"IF(AE:AE=\"pas d'actualité\",3,IF(AE:AE=\"?\",\"?\",IF(AE:AE=\"?\",\"?\",IF((($B$2+2)-AF:AF)>=0,0,IF((($B$2+2)-AF:AF)>=-1,1,IF((($B$2+2)-AF:AF)>=-2,2,3))))))","v":0},{"$f":"IF(AE:AE=\"pas d'actualité\",3,IF(AE:AE=\"?\",\"?\",IF(AE:AE=\"?\",\"?\",IF(($B$2+3)-AF:AF>=0,0,IF(($B$2+3)-AF:AF>=-1,1,IF(($B$2+3)-AF:AF>=-2,2,3))))))","v":0},{"$f":"IF(AE:AE=\"pas d'actualité\",3,IF(AE:AE=\"?\",\"?\",IF(AE:AE=\"?\",\"?\",IF(($B$2+4)-AF:AF>=0,0,IF(($B$2+4)-AF:AF>=-1,1,IF(($B$2+4)-AF:AF>=-2,2,3))))))","v":0},null,null,"ARRET TOTAL FOURNITURE 01/10/2017"]
["PR180","D180","FAB 180",null,1,null,null,null,null,null,null,null,null,null,null,null,null,null,null,null,null,null,null,null,null,null,null,null,null,null,"2016-01-10",{"$f":"IF(ISNUMBER(AE:AE),YEAR(AE:AE),AE:AE)","v":2016},{"$f":"IF(AE:AE=\"pas d'actualité\",3,IF(AE:AE=\"?\",\"?\",IF(AE:AE=\"?\",\"?\",IF($B$2-AF:AF>=0,0,IF($B$2-AF:AF>=-1,1,IF($B$2-AF:AF>=-2,2,3))))))","v":0},{"$f":"IF(AE:AE=\"pas d'actualité\",3,IF(AE:AE=\"?\",\"?\",IF(AE:AE=\"?\",\"?\",IF((($B$2+1)-AF:AF)>=0,\"0\",IF((($B$2+1)-AF:AF)>=-1,\"1\",IF((($B$2+1)-AF:AF)>=-2,\"2\",\"3\"))))))","v":"0"},{"$f":"IF(AE:AE=\"pas d'actualité\",3,IF(AE:AE=\"?\",\"?\",IF(AE:AE=\"?\",\"?\",IF((($B$2+2)-AF:AF)>=0,0,IF((($B$2+2)-AF:AF)>=-1,1,IF((($B$2+2)-AF:AF)>=-2,2,3))))))","v":0},{"$f":"IF(AE:AE=\"pas d'actualité\",3,IF(AE:AE=\"?\",\"?\",IF(AE:AE=\"?\",\"?\",IF(($B$2+3)-AF:AF>=0,0,IF(($B$2+3)-AF:AF>=-1,1,IF(($B$2+3)-AF:AF>=-2,2,3))))))","v":0},{"$f":"IF(AE:AE=\"pas d'actualité\",3,IF(AE:AE=\"?\",\"?\",IF(AE:AE=\"?\",\"?\",IF(($B$2+4)-AF:AF>=0,0,IF(($B$2+4)-AF:AF>=-1,1,IF(($B$2+4)-AF:AF>=-2,2,3))))))","v":0},null,null,"ARRET TOTAL FOURNITURE 01/10/2018"]
["PR181","D181","FAB 181",null,1,null,null,"X","X",null,null,"X",null,null,null,null,null,null,null,null,null,null,null,null,null,null,null,null,null,null,"2004-12-31",{"$f":"IF(ISNUMBER(AE:AE),YEAR(AE:AE),AE:AE)","v":2004},{"$f":"IF(AE:AE=\"pas d'actualité\",3,IF(AE:AE=\"?\",\"?\",IF(AE:AE=\"?\",\"?\",IF($B$2-AF:AF>=0,0,IF($B$2-AF:AF>=-1,1,IF($B$2-AF:AF>=-2,2,3))))))","v":0},{"$f":"IF(AE:AE=\"pas d'actualité\",3,IF(AE:AE=\"?\",\"?\",IF(AE:AE=\"?\",\"?\",IF((($B$2+1)-AF:AF)>=0,\"0\",IF((($B$2+1)-AF:AF)>=-1,\"1\",IF((($B$2+1)-AF:AF)>=-2,\"2\",\"3\"))))))","v":"0"},{"$f":"IF(AE:AE=\"pas d'actualité\",3,IF(AE:AE=\"?\",\"?\",IF(AE:AE=\"?\",\"?\",IF((($B$2+2)-AF:AF)>=0,0,IF((($B$2+2)-AF:AF)>=-1,1,IF((($B$2+2)-AF:AF)>=-2,2,3))))))","v":0},{"$f":"IF(AE:AE=\"pas d'actualité\",3,IF(AE:AE=\"?\",\"?\",IF(AE:AE=\"?\",\"?\",IF(($B$2+3)-AF:AF>=0,0,IF(($B$2+3)-AF:AF>=-1,1,IF(($B$2+3)-AF:AF>=-2,2,3))))))","v":0},{"$f":"IF(AE:AE=\"pas d'actualité\",3,IF(AE:AE=\"?\",\"?\",IF(AE:AE=\"?\",\"?\",IF(($B$2+4)-AF:AF>=0,0,IF(($B$2+4)-AF:AF>=-1,1,IF(($B$2+4)-AF:AF>=-2,2,3))))))","v":0},"3SE2120-1E",null,"ARRET TOTAL FOURNITURE 01/04/2005"]
["PR182","D182","FAB 182",null,1,null,null,null,null,"X",null,null,null,null,null,null,null,null,null,null,null,null,null,null,null,null,null,null,null,null,"2016-01-10",{"$f":"IF(ISNUMBER(AE:AE),YEAR(AE:AE),AE:AE)","v":2016},{"$f":"IF(AE:AE=\"pas d'actualité\",3,IF(AE:AE=\"?\",\"?\",IF(AE:AE=\"?\",\"?\",IF($B$2-AF:AF>=0,0,IF($B$2-AF:AF>=-1,1,IF($B$2-AF:AF>=-2,2,3))))))","v":0},{"$f":"IF(AE:AE=\"pas d'actualité\",3,IF(AE:AE=\"?\",\"?\",IF(AE:AE=\"?\",\"?\",IF((($B$2+1)-AF:AF)>=0,\"0\",IF((($B$2+1)-AF:AF)>=-1,\"1\",IF((($B$2+1)-AF:AF)>=-2,\"2\",\"3\"))))))","v":"0"},{"$f":"IF(AE:AE=\"pas d'actualité\",3,IF(AE:AE=\"?\",\"?\",IF(AE:AE=\"?\",\"?\",IF((($B$2+2)-AF:AF)>=0,0,IF((($B$2+2)-AF:AF)>=-1,1,IF((($B$2+2)-AF:AF)>=-2,2,3))))))","v":0},{"$f":"IF(AE:AE=\"pas d'actualité\",3,IF(AE:AE=\"?\",\"?\",IF(AE:AE=\"?\",\"?\",IF(($B$2+3)-AF:AF>=0,0,IF(($B$2+3)-AF:AF>=-1,1,IF(($B$2+3)-AF:AF>=-2,2,3))))))","v":0},{"$f":"IF(AE:AE=\"pas d'actualité\",3,IF(AE:AE=\"?\",\"?\",IF(AE:AE=\"?\",\"?\",IF(($B$2+4)-AF:AF>=0,0,IF(($B$2+4)-AF:AF>=-1,1,IF(($B$2+4)-AF:AF>=-2,2,3))))))","v":0},"6AV3607-1JC20-0AX2",null,"ARRET TOTAL FOURNITURE 01/10/2018"]
["PR183","D183","FAB 183",null,1,null,null,null,null,null,null,null,null,null,null,null,null,null,null,null,null,null,null,null,null,null,null,null,null,null,"2006-11-24",{"$f":"IF(ISNUMBER(AE:AE),YEAR(AE:AE),AE:AE)","v":2006},{"$f":"IF(AE:AE=\"pas d'actualité\",3,IF(AE:AE=\"?\",\"?\",IF(AE:AE=\"?\",\"?\",IF($B$2-AF:AF>=0,0,IF($B$2-AF:AF>=-1,1,IF($B$2-AF:AF>=-2,2,3))))))","v":0},{"$f":"IF(AE:AE=\"pas d'actualité\",3,IF(AE:AE=\"?\",\"?\",IF(AE:AE=\"?\",\"?\",IF((($B$2+1)-AF:AF)>=0,\"0\",IF((($B$2+1)-AF:AF)>=-1,\"1\",IF((($B$2+1)-AF:AF)>=-2,\"2\",\"3\"))))))","v":"0"},{"$f":"IF(AE:AE=\"pas d'actualité\",3,IF(AE:AE=\"?\",\"?\",IF(AE:AE=\"?\",\"?\",IF((($B$2+2)-AF:AF)>=0,0,IF((($B$2+2)-AF:AF)>=-1,1,IF((($B$2+2)-AF:AF)>=-2,2,3))))))","v":0},{"$f":"IF(AE:AE=\"pas d'actualité\",3,IF(AE:AE=\"?\",\"?\",IF(AE:AE=\"?\",\"?\",IF(($B$2+3)-AF:AF>=0,0,IF(($B$2+3)-AF:AF>=-1,1,IF(($B$2+3)-AF:AF>=-2,2,3))))))","v":0},{"$f":"IF(AE:AE=\"pas d'actualité\",3,IF(AE:AE=\"?\",\"?\",IF(AE:AE=\"?\",\"?\",IF(($B$2+4)-AF:AF>=0,0,IF(($B$2+4)-AF:AF>=-1,1,IF(($B$2+4)-AF:AF>=-2,2,3))))))","v":0},null,"SUBSTITUTE: 6DR5*, REFER TO CAT. FI01-7","ARRET TOTAL FOURNITURE 24/11/2006"]
["PR184","D184","FAB 184",null,1,null,null,"X","X",null,null,null,null,null,null,null,null,null,null,null,null,null,null,null,null,null,null,null,null,null,"2010-01-10",{"$f":"IF(ISNUMBER(AE:AE),YEAR(AE:AE),AE:AE)","v":2010},{"$f":"IF(AE:AE=\"pas d'actualité\",3,IF(AE:AE=\"?\",\"?\",IF(AE:AE=\"?\",\"?\",IF($B$2-AF:AF>=0,0,IF($B$2-AF:AF>=-1,1,IF($B$2-AF:AF>=-2,2,3))))))","v":0},{"$f":"IF(AE:AE=\"pas d'actualité\",3,IF(AE:AE=\"?\",\"?\",IF(AE:AE=\"?\",\"?\",IF((($B$2+1)-AF:AF)>=0,\"0\",IF((($B$2+1)-AF:AF)>=-1,\"1\",IF((($B$2+1)-AF:AF)>=-2,\"2\",\"3\"))))))","v":"0"},{"$f":"IF(AE:AE=\"pas d'actualité\",3,IF(AE:AE=\"?\",\"?\",IF(AE:AE=\"?\",\"?\",IF((($B$2+2)-AF:AF)>=0,0,IF((($B$2+2)-AF:AF)>=-1,1,IF((($B$2+2)-AF:AF)>=-2,2,3))))))","v":0},{"$f":"IF(AE:AE=\"pas d'actualité\",3,IF(AE:AE=\"?\",\"?\",IF(AE:AE=\"?\",\"?\",IF(($B$2+3)-AF:AF>=0,0,IF(($B$2+3)-AF:AF>=-1,1,IF(($B$2+3)-AF:AF>=-2,2,3))))))","v":0},{"$f":"IF(AE:AE=\"pas d'actualité\",3,IF(AE:AE=\"?\",\"?\",IF(AE:AE=\"?\",\"?\",IF(($B$2+4)-AF:AF>=0,0,IF(($B$2+4)-AF:AF>=-1,1,IF(($B$2+4)-AF:AF>=-2,2,3))))))","v":0},"6ED1052-1HB00-0BA6",null,"ARRET TOTAL FOURNITURE 01/10/2010"]
["PR185","D185","FAB 185",null,null,null,null,"X",null,null,null,null,null,null,null,null,null,null,null,null,null,null,null,null,null,null,null,null,null,null,"2011-01-10",{"$f":"IF(ISNUMBER(AE:AE),YEAR(AE:AE),AE:AE)","v":2011},{"$f":"IF(AE:AE=\"pas d'actualité\",3,IF(AE:AE=\"?\",\"?\",IF(AE:AE=\"?\",\"?\",IF($B$2-AF:AF>=0,0,IF($B$2-AF:AF>=-1,1,IF($B$2-AF:AF>=-2,2,3))))))","v":0},{"$f":"IF(AE:AE=\"pas d'actualité\",3,IF(AE:AE=\"?\",\"?\",IF(AE:AE=\"?\",\"?\",IF((($B$2+1)-AF:AF)>=0,\"0\",IF((($B$2+1)-AF:AF)>=-1,\"1\",IF((($B$2+1)-AF:AF)>=-2,\"2\",\"3\"))))))","v":"0"},{"$f":"IF(AE:AE=\"pas d'actualité\",3,IF(AE:AE=\"?\",\"?\",IF(AE:AE=\"?\",\"?\",IF((($B$2+2)-AF:AF)>=0,0,IF((($B$2+2)-AF:AF)>=-1,1,IF((($B$2+2)-AF:AF)>=-2,2,3))))))","v":0},{"$f":"IF(AE:AE=\"pas d'actualité\",3,IF(AE:AE=\"?\",\"?\",IF(AE:AE=\"?\",\"?\",IF(($B$2+3)-AF:AF>=0,0,IF(($B$2+3)-AF:AF>=-1,1,IF(($B$2+3)-AF:AF>=-2,2,3))))))","v":0},{"$f":"IF(AE:AE=\"pas d'actualité\",3,IF(AE:AE=\"?\",\"?\",IF(AE:AE=\"?\",\"?\",IF(($B$2+4)-AF:AF>=0,0,IF(($B$2+4)-AF:AF>=-1,1,IF(($B$2+4)-AF:AF>=-2,2,3))))))","v":0},null,"Partiellement compatbile"]
["PR186","D186","FAB 186",null,null,null,null,null,null,null,null,null,null,null,null,null,null,null,null,null,null,null,null,null,null,null,null,null,null,null,"2008-05-15",{"$f":"IF(ISNUMBER(AE:AE),YEAR(AE:AE),AE:AE)","v":2008},{"$f":"IF(AE:AE=\"pas d'actualité\",3,IF(AE:AE=\"?\",\"?\",IF(AE:AE=\"?\",\"?\",IF($B$2-AF:AF>=0,0,IF($B$2-AF:AF>=-1,1,IF($B$2-AF:AF>=-2,2,3))))))","v":0},{"$f":"IF(AE:AE=\"pas d'actualité\",3,IF(AE:AE=\"?\",\"?\",IF(AE:AE=\"?\",\"?\",IF((($B$2+1)-AF:AF)>=0,\"0\",IF((($B$2+1)-AF:AF)>=-1,\"1\",IF((($B$2+1)-AF:AF)>=-2,\"2\",\"3\"))))))","v":"0"},{"$f":"IF(AE:AE=\"pas d'actualité\",3,IF(AE:AE=\"?\",\"?\",IF(AE:AE=\"?\",\"?\",IF((($B$2+2)-AF:AF)>=0,0,IF((($B$2+2)-AF:AF)>=-1,1,IF((($B$2+2)-AF:AF)>=-2,2,3))))))","v":0},{"$f":"IF(AE:AE=\"pas d'actualité\",3,IF(AE:AE=\"?\",\"?\",IF(AE:AE=\"?\",\"?\",IF(($B$2+3)-AF:AF>=0,0,IF(($B$2+3)-AF:AF>=-1,1,IF(($B$2+3)-AF:AF>=-2,2,3))))))","v":0},{"$f":"IF(AE:AE=\"pas d'actualité\",3,IF(AE:AE=\"?\",\"?\",IF(AE:AE=\"?\",\"?\",IF(($B$2+4)-AF:AF>=0,0,IF(($B$2+4)-AF:AF>=-1,1,IF(($B$2+4)-AF:AF>=-2,2,3))))))","v":0},"6ES5095-8MA05",null,"reparation/pièce de rechange seulement sous garantie"]
["PR187","D187","FAB 187",null,null,null,null,null,null,null,null,null,null,null,null,null,null,null,null,null,null,null,null,null,null,null,null,null,null,null,"2010-01-10",{"$f":"IF(ISNUMBER(AE:AE),YEAR(AE:AE),AE:AE)","v":2010},{"$f":"IF(AE:AE=\"pas d'actualité\",3,IF(AE:AE=\"?\",\"?\",IF(AE:AE=\"?\",\"?\",IF($B$2-AF:AF>=0,0,IF($B$2-AF:AF>=-1,1,IF($B$2-AF:AF>=-2,2,3))))))","v":0},{"$f":"IF(AE:AE=\"pas d'actualité\",3,IF(AE:AE=\"?\",\"?\",IF(AE:AE=\"?\",\"?\",IF((($B$2+1)-AF:AF)>=0,\"0\",IF((($B$2+1)-AF:AF)>=-1,\"1\",IF((($B$2+1)-AF:AF)>=-2,\"2\",\"3\"))))))","v":"0"},{"$f":"IF(AE:AE=\"pas d'actualité\",3,IF(AE:AE=\"?\",\"?\",IF(AE:AE=\"?\",\"?\",IF((($B$2+2)-AF:AF)>=0,0,IF((($B$2+2)-AF:AF)>=-1,1,IF((($B$2+2)-AF:AF)>=-2,2,3))))))","v":0},{"$f":"IF(AE:AE=\"pas d'actualité\",3,IF(AE:AE=\"?\",\"?\",IF(AE:AE=\"?\",\"?\",IF(($B$2+3)-AF:AF>=0,0,IF(($B$2+3)-AF:AF>=-1,1,IF(($B$2+3)-AF:AF>=-2,2,3))))))","v":0},{"$f":"IF(AE:AE=\"pas d'actualité\",3,IF(AE:AE=\"?\",\"?\",IF(AE:AE=\"?\",\"?\",IF(($B$2+4)-AF:AF>=0,0,IF(($B$2+4)-AF:AF>=-1,1,IF(($B$2+4)-AF:AF>=-2,2,3))))))","v":0},"6ES5095-8MA05",null,"Seulement disponible en pièces de rechange"]
["PR188","D188","FAB 188",null,null,null,null,null,null,null,null,null,null,null,null,null,null,"X",null,null,null,null,null,null,null,null,null,null,null,null,"2008-01-10",{"$f":"IF(ISNUMBER(AE:AE),YEAR(AE:AE),AE:AE)","v":2008},{"$f":"IF(AE:AE=\"pas d'actualité\",3,IF(AE:AE=\"?\",\"?\",IF(AE:AE=\"?\",\"?\",IF($B$2-AF:AF>=0,0,IF($B$2-AF:AF>=-1,1,IF($B$2-AF:AF>=-2,2,3))))))","v":0},{"$f":"IF(AE:AE=\"pas d'actualité\",3,IF(AE:AE=\"?\",\"?\",IF(AE:AE=\"?\",\"?\",IF((($B$2+1)-AF:AF)>=0,\"0\",IF((($B$2+1)-AF:AF)>=-1,\"1\",IF((($B$2+1)-AF:AF)>=-2,\"2\",\"3\"))))))","v":"0"},{"$f":"IF(AE:AE=\"pas d'actualité\",3,IF(AE:AE=\"?\",\"?\",IF(AE:AE=\"?\",\"?\",IF((($B$2+2)-AF:AF)>=0,0,IF((($B$2+2)-AF:AF)>=-1,1,IF((($B$2+2)-AF:AF)>=-2,2,3))))))","v":0},{"$f":"IF(AE:AE=\"pas d'actualité\",3,IF(AE:AE=\"?\",\"?\",IF(AE:AE=\"?\",\"?\",IF(($B$2+3)-AF:AF>=0,0,IF(($B$2+3)-AF:AF>=-1,1,IF(($B$2+3)-AF:AF>=-2,2,3))))))","v":0},{"$f":"IF(AE:AE=\"pas d'actualité\",3,IF(AE:AE=\"?\",\"?\",IF(AE:AE=\"?\",\"?\",IF(($B$2+4)-AF:AF>=0,0,IF(($B$2+4)-AF:AF>=-1,1,IF(($B$2+4)-AF:AF>=-2,2,3))))))","v":0},"SUCCESSOR IS CPU 928B: 6ES5928-3UB21","partiellement"]
["PR189","D189","FAB 189",null,1,null,null,null,null,null,null,null,null,null,null,null,null,"X",null,null,null,null,null,null,null,null,null,null,null,null,"2010-01-10",{"$f":"IF(ISNUMBER(AE:AE),YEAR(AE:AE),AE:AE)","v":2010},{"$f":"IF(AE:AE=\"pas d'actualité\",3,IF(AE:AE=\"?\",\"?\",IF(AE:AE=\"?\",\"?\",IF($B$2-AF:AF>=0,0,IF($B$2-AF:AF>=-1,1,IF($B$2-AF:AF>=-2,2,3))))))","v":0},{"$f":"IF(AE:AE=\"pas d'actualité\",3,IF(AE:AE=\"?\",\"?\",IF(AE:AE=\"?\",\"?\",IF((($B$2+1)-AF:AF)>=0,\"0\",IF((($B$2+1)-AF:AF)>=-1,\"1\",IF((($B$2+1)-AF:AF)>=-2,\"2\",\"3\"))))))","v":"0"},{"$f":"IF(AE:AE=\"pas d'actualité\",3,IF(AE:AE=\"?\",\"?\",IF(AE:AE=\"?\",\"?\",IF((($B$2+2)-AF:AF)>=0,0,IF((($B$2+2)-AF:AF)>=-1,1,IF((($B$2+2)-AF:AF)>=-2,2,3))))))","v":0},{"$f":"IF(AE:AE=\"pas d'actualité\",3,IF(AE:AE=\"?\",\"?\",IF(AE:AE=\"?\",\"?\",IF(($B$2+3)-AF:AF>=0,0,IF(($B$2+3)-AF:AF>=-1,1,IF(($B$2+3)-AF:AF>=-2,2,3))))))","v":0},{"$f":"IF(AE:AE=\"pas d'actualité\",3,IF(AE:AE=\"?\",\"?\",IF(AE:AE=\"?\",\"?\",IF(($B$2+4)-AF:AF>=0,0,IF(($B$2+4)-AF:AF>=-1,1,IF(($B$2+4)-AF:AF>=-2,2,3))))))","v":0},"6ES5955-3LC41"]
["PR190","D190","FAB 190",null,1,null,null,null,null,null,null,null,null,null,null,null,null,"X",null,null,null,null,null,null,null,null,null,null,null,null,"2008-01-10",{"$f":"IF(ISNUMBER(AE:AE),YEAR(AE:AE),AE:AE)","v":2008},{"$f":"IF(AE:AE=\"pas d'actualité\",3,IF(AE:AE=\"?\",\"?\",IF(AE:AE=\"?\",\"?\",IF($B$2-AF:AF>=0,0,IF($B$2-AF:AF>=-1,1,IF($B$2-AF:AF>=-2,2,3))))))","v":0},{"$f":"IF(AE:AE=\"pas d'actualité\",3,IF(AE:AE=\"?\",\"?\",IF(AE:AE=\"?\",\"?\",IF((($B$2+1)-AF:AF)>=0,\"0\",IF((($B$2+1)-AF:AF)>=-1,\"1\",IF((($B$2+1)-AF:AF)>=-2,\"2\",\"3\"))))))","v":"0"},{"$f":"IF(AE:AE=\"pas d'actualité\",3,IF(AE:AE=\"?\",\"?\",IF(AE:AE=\"?\",\"?\",IF((($B$2+2)-AF:AF)>=0,0,IF((($B$2+2)-AF:AF)>=-1,1,IF((($B$2+2)-AF:AF)>=-2,2,3))))))","v":0},{"$f":"IF(AE:AE=\"pas d'actualité\",3,IF(AE:AE=\"?\",\"?\",IF(AE:AE=\"?\",\"?\",IF(($B$2+3)-AF:AF>=0,0,IF(($B$2+3)-AF:AF>=-1,1,IF(($B$2+3)-AF:AF>=-2,2,3))))))","v":0},{"$f":"IF(AE:AE=\"pas d'actualité\",3,IF(AE:AE=\"?\",\"?\",IF(AE:AE=\"?\",\"?\",IF(($B$2+4)-AF:AF>=0,0,IF(($B$2+4)-AF:AF>=-1,1,IF(($B$2+4)-AF:AF>=-2,2,3))))))","v":0}]
["PR191","D191","FAB 191",null,1,null,null,"X","X",null,null,null,null,null,null,null,null,null,null,null,null,null,null,null,null,null,null,null,null,null,"2015-01-10",{"$f":"IF(ISNUMBER(AE:AE),YEAR(AE:AE),AE:AE)","v":2015},{"$f":"IF(AE:AE=\"pas d'actualité\",3,IF(AE:AE=\"?\",\"?\",IF(AE:AE=\"?\",\"?\",IF($B$2-AF:AF>=0,0,IF($B$2-AF:AF>=-1,1,IF($B$2-AF:AF>=-2,2,3))))))","v":0},{"$f":"IF(AE:AE=\"pas d'actualité\",3,IF(AE:AE=\"?\",\"?\",IF(AE:AE=\"?\",\"?\",IF((($B$2+1)-AF:AF)>=0,\"0\",IF((($B$2+1)-AF:AF)>=-1,\"1\",IF((($B$2+1)-AF:AF)>=-2,\"2\",\"3\"))))))","v":"0"},{"$f":"IF(AE:AE=\"pas d'actualité\",3,IF(AE:AE=\"?\",\"?\",IF(AE:AE=\"?\",\"?\",IF((($B$2+2)-AF:AF)>=0,0,IF((($B$2+2)-AF:AF)>=-1,1,IF((($B$2+2)-AF:AF)>=-2,2,3))))))","v":0},{"$f":"IF(AE:AE=\"pas d'actualité\",3,IF(AE:AE=\"?\",\"?\",IF(AE:AE=\"?\",\"?\",IF(($B$2+3)-AF:AF>=0,0,IF(($B$2+3)-AF:AF>=-1,1,IF(($B$2+3)-AF:AF>=-2,2,3))))))","v":0},{"$f":"IF(AE:AE=\"pas d'actualité\",3,IF(AE:AE=\"?\",\"?\",IF(AE:AE=\"?\",\"?\",IF(($B$2+4)-AF:AF>=0,0,IF(($B$2+4)-AF:AF>=-1,1,IF(($B$2+4)-AF:AF>=-2,2,3))))))","v":0},null,null,"ARRET TOTAL FOURNITURE 01/10/2017"]
["PR192","D192","FAB 192",null,1,null,null,"X","X",null,null,null,null,null,null,null,null,null,null,null,null,null,null,null,null,null,null,null,null,null,"2015-01-10",{"$f":"IF(ISNUMBER(AE:AE),YEAR(AE:AE),AE:AE)","v":2015},{"$f":"IF(AE:AE=\"pas d'actualité\",3,IF(AE:AE=\"?\",\"?\",IF(AE:AE=\"?\",\"?\",IF($B$2-AF:AF>=0,0,IF($B$2-AF:AF>=-1,1,IF($B$2-AF:AF>=-2,2,3))))))","v":0},{"$f":"IF(AE:AE=\"pas d'actualité\",3,IF(AE:AE=\"?\",\"?\",IF(AE:AE=\"?\",\"?\",IF((($B$2+1)-AF:AF)>=0,\"0\",IF((($B$2+1)-AF:AF)>=-1,\"1\",IF((($B$2+1)-AF:AF)>=-2,\"2\",\"3\"))))))","v":"0"},{"$f":"IF(AE:AE=\"pas d'actualité\",3,IF(AE:AE=\"?\",\"?\",IF(AE:AE=\"?\",\"?\",IF((($B$2+2)-AF:AF)>=0,0,IF((($B$2+2)-AF:AF)>=-1,1,IF((($B$2+2)-AF:AF)>=-2,2,3))))))","v":0},{"$f":"IF(AE:AE=\"pas d'actualité\",3,IF(AE:AE=\"?\",\"?\",IF(AE:AE=\"?\",\"?\",IF(($B$2+3)-AF:AF>=0,0,IF(($B$2+3)-AF:AF>=-1,1,IF(($B$2+3)-AF:AF>=-2,2,3))))))","v":0},{"$f":"IF(AE:AE=\"pas d'actualité\",3,IF(AE:AE=\"?\",\"?\",IF(AE:AE=\"?\",\"?\",IF(($B$2+4)-AF:AF>=0,0,IF(($B$2+4)-AF:AF>=-1,1,IF(($B$2+4)-AF:AF>=-2,2,3))))))","v":0},null,null,"ARRET TOTAL FOURNITURE 01/10/2017"]
["PR193","D193","FAB 193",null,1,null,null,"X","X",null,null,null,null,null,null,null,null,null,null,null,null,null,null,null,null,null,null,null,null,null,"2015-01-10",{"$f":"IF(ISNUMBER(AE:AE),YEAR(AE:AE),AE:AE)","v":2015},{"$f":"IF(AE:AE=\"pas d'actualité\",3,IF(AE:AE=\"?\",\"?\",IF(AE:AE=\"?\",\"?\",IF($B$2-AF:AF>=0,0,IF($B$2-AF:AF>=-1,1,IF($B$2-AF:AF>=-2,2,3))))))","v":0},{"$f":"IF(AE:AE=\"pas d'actualité\",3,IF(AE:AE=\"?\",\"?\",IF(AE:AE=\"?\",\"?\",IF((($B$2+1)-AF:AF)>=0,\"0\",IF((($B$2+1)-AF:AF)>=-1,\"1\",IF((($B$2+1)-AF:AF)>=-2,\"2\",\"3\"))))))","v":"0"},{"$f":"IF(AE:AE=\"pas d'actualité\",3,IF(AE:AE=\"?\",\"?\",IF(AE:AE=\"?\",\"?\",IF((($B$2+2)-AF:AF)>=0,0,IF((($B$2+2)-AF:AF)>=-1,1,IF((($B$2+2)-AF:AF)>=-2,2,3))))))","v":0},{"$f":"IF(AE:AE=\"pas d'actualité\",3,IF(AE:AE=\"?\",\"?\",IF(AE:AE=\"?\",\"?\",IF(($B$2+3)-AF:AF>=0,0,IF(($B$2+3)-AF:AF>=-1,1,IF(($B$2+3)-AF:AF>=-2,2,3))))))","v":0},{"$f":"IF(AE:AE=\"pas d'actualité\",3,IF(AE:AE=\"?\",\"?\",IF(AE:AE=\"?\",\"?\",IF(($B$2+4)-AF:AF>=0,0,IF(($B$2+4)-AF:AF>=-1,1,IF(($B$2+4)-AF:AF>=-2,2,3))))))","v":0},null,null,"ARRET TOTAL FOURNITURE 01/10/2017"]
["PR194","D194","FAB 194",null,1,null,null,"X","X",null,null,null,null,null,null,null,null,null,null,null,null,null,null,null,null,null,null,null,null,null,"2015-01-10",{"$f":"IF(ISNUMBER(AE:AE),YEAR(AE:AE),AE:AE)","v":2015},{"$f":"IF(AE:AE=\"pas d'actualité\",3,IF(AE:AE=\"?\",\"?\",IF(AE:AE=\"?\",\"?\",IF($B$2-AF:AF>=0,0,IF($B$2-AF:AF>=-1,1,IF($B$2-AF:AF>=-2,2,3))))))","v":0},{"$f":"IF(AE:AE=\"pas d'actualité\",3,IF(AE:AE=\"?\",\"?\",IF(AE:AE=\"?\",\"?\",IF((($B$2+1)-AF:AF)>=0,\"0\",IF((($B$2+1)-AF:AF)>=-1,\"1\",IF((($B$2+1)-AF:AF)>=-2,\"2\",\"3\"))))))","v":"0"},{"$f":"IF(AE:AE=\"pas d'actualité\",3,IF(AE:AE=\"?\",\"?\",IF(AE:AE=\"?\",\"?\",IF((($B$2+2)-AF:AF)>=0,0,IF((($B$2+2)-AF:AF)>=-1,1,IF((($B$2+2)-AF:AF)>=-2,2,3))))))","v":0},{"$f":"IF(AE:AE=\"pas d'actualité\",3,IF(AE:AE=\"?\",\"?\",IF(AE:AE=\"?\",\"?\",IF(($B$2+3)-AF:AF>=0,0,IF(($B$2+3)-AF:AF>=-1,1,IF(($B$2+3)-AF:AF>=-2,2,3))))))","v":0},{"$f":"IF(AE:AE=\"pas d'actualité\",3,IF(AE:AE=\"?\",\"?\",IF(AE:AE=\"?\",\"?\",IF(($B$2+4)-AF:AF>=0,0,IF(($B$2+4)-AF:AF>=-1,1,IF(($B$2+4)-AF:AF>=-2,2,3))))))","v":0},null,null,"cette référence Siemens est en fin de commercialisation, normalement des modules destinés à la réparation sont encore disponibles jusqu'au milieu de cette année 2015 ARRET TOTAL FOURNITURE 01/10/2017"]
["PR195","D195","FAB 195",null,1,null,null,"X","X",null,null,null,null,null,null,null,null,null,null,null,null,null,null,null,null,null,null,null,null,null,"2015-01-10",{"$f":"IF(ISNUMBER(AE:AE),YEAR(AE:AE),AE:AE)","v":2015},{"$f":"IF(AE:AE=\"pas d'actualité\",3,IF(AE:AE=\"?\",\"?\",IF(AE:AE=\"?\",\"?\",IF($B$2-AF:AF>=0,0,IF($B$2-AF:AF>=-1,1,IF($B$2-AF:AF>=-2,2,3))))))","v":0},{"$f":"IF(AE:AE=\"pas d'actualité\",3,IF(AE:AE=\"?\",\"?\",IF(AE:AE=\"?\",\"?\",IF((($B$2+1)-AF:AF)>=0,\"0\",IF((($B$2+1)-AF:AF)>=-1,\"1\",IF((($B$2+1)-AF:AF)>=-2,\"2\",\"3\"))))))","v":"0"},{"$f":"IF(AE:AE=\"pas d'actualité\",3,IF(AE:AE=\"?\",\"?\",IF(AE:AE=\"?\",\"?\",IF((($B$2+2)-AF:AF)>=0,0,IF((($B$2+2)-AF:AF)>=-1,1,IF((($B$2+2)-AF:AF)>=-2,2,3))))))","v":0},{"$f":"IF(AE:AE=\"pas d'actualité\",3,IF(AE:AE=\"?\",\"?\",IF(AE:AE=\"?\",\"?\",IF(($B$2+3)-AF:AF>=0,0,IF(($B$2+3)-AF:AF>=-1,1,IF(($B$2+3)-AF:AF>=-2,2,3))))))","v":0},{"$f":"IF(AE:AE=\"pas d'actualité\",3,IF(AE:AE=\"?\",\"?\",IF(AE:AE=\"?\",\"?\",IF(($B$2+4)-AF:AF>=0,0,IF(($B$2+4)-AF:AF>=-1,1,IF(($B$2+4)-AF:AF>=-2,2,3))))))","v":0},null,null,"ARRET TOTAL FOURNITURE 01/10/2017"]
["PR196","D196","FAB 196",null,1,null,null,"X","X",null,null,null,null,null,null,null,null,null,null,null,null,null,null,null,null,null,null,null,null,null,"2015-01-10",{"$f":"IF(ISNUMBER(AE:AE),YEAR(AE:AE),AE:AE)","v":2015},{"$f":"IF(AE:AE=\"pas d'actualité\",3,IF(AE:AE=\"?\",\"?\",IF(AE:AE=\"?\",\"?\",IF($B$2-AF:AF>=0,0,IF($B$2-AF:AF>=-1,1,IF($B$2-AF:AF>=-2,2,3))))))","v":0},{"$f":"IF(AE:AE=\"pas d'actualité\",3,IF(AE:AE=\"?\",\"?\",IF(AE:AE=\"?\",\"?\",IF((($B$2+1)-AF:AF)>=0,\"0\",IF((($B$2+1)-AF:AF)>=-1,\"1\",IF((($B$2+1)-AF:AF)>=-2,\"2\",\"3\"))))))","v":"0"},{"$f":"IF(AE:AE=\"pas d'actualité\",3,IF(AE:AE=\"?\",\"?\",IF(AE:AE=\"?\",\"?\",IF((($B$2+2)-AF:AF)>=0,0,IF((($B$2+2)-AF:AF)>=-1,1,IF((($B$2+2)-AF:AF)>=-2,2,3))))))","v":0},{"$f":"IF(AE:AE=\"pas d'actualité\",3,IF(AE:AE=\"?\",\"?\",IF(AE:AE=\"?\",\"?\",IF(($B$2+3)-AF:AF>=0,0,IF(($B$2+3)-AF:AF>=-1,1,IF(($B$2+3)-AF:AF>=-2,2,3))))))","v":0},{"$f":"IF(AE:AE=\"pas d'actualité\",3,IF(AE:AE=\"?\",\"?\",IF(AE:AE=\"?\",\"?\",IF(($B$2+4)-AF:AF>=0,0,IF(($B$2+4)-AF:AF>=-1,1,IF(($B$2+4)-AF:AF>=-2,2,3))))))","v":0},null,null,"ARRET TOTAL FOURNITURE 01/10/2017"]
["PR197","D197","FAB 197",null,null,null,null,null,null,null,null,null,null,null,null,null,null,null,null,null,null,null,null,null,null,null,null,null,null,null,"2011-01-10",{"$f":"IF(ISNUMBER(AE:AE),YEAR(AE:AE),AE:AE)","v":2011},{"$f":"IF(AE:AE=\"pas d'actualité\",3,IF(AE:AE=\"?\",\"?\",IF(AE:AE=\"?\",\"?\",IF($B$2-AF:AF>=0,0,IF($B$2-AF:AF>=-1,1,IF($B$2-AF:AF>=-2,2,3))))))","v":0},{"$f":"IF(AE:AE=\"pas d'actualité\",3,IF(AE:AE=\"?\",\"?\",IF(AE:AE=\"?\",\"?\",IF((($B$2+1)-AF:AF)>=0,\"0\",IF((($B$2+1)-AF:AF)>=-1,\"1\",IF((($B$2+1)-AF:AF)>=-2,\"2\",\"3\"))))))","v":"0"},{"$f":"IF(AE:AE=\"pas d'actualité\",3,IF(AE:AE=\"?\",\"?\",IF(AE:AE=\"?\",\"?\",IF((($B$2+2)-AF:AF)>=0,0,IF((($B$2+2)-AF:AF)>=-1,1,IF((($B$2+2)-AF:AF)>=-2,2,3))))))","v":0},{"$f":"IF(AE:AE=\"pas d'actualité\",3,IF(AE:AE=\"?\",\"?\",IF(AE:AE=\"?\",\"?\",IF(($B$2+3)-AF:AF>=0,0,IF(($B$2+3)-AF:AF>=-1,1,IF(($B$2+3)-AF:AF>=-2,2,3))))))","v":0},{"$f":"IF(AE:AE=\"pas d'actualité\",3,IF(AE:AE=\"?\",\"?\",IF(AE:AE=\"?\",\"?\",IF(($B$2+4)-AF:AF>=0,0,IF(($B$2+4)-AF:AF>=-1,1,IF(($B$2+4)-AF:AF>=-2,2,3))))))","v":0},"6ES7307-1EA01-0AA0"]
["PR198","D198","FAB 198",null,null,null,null,null,null,null,null,null,null,null,null,null,null,null,null,null,null,null,null,null,null,null,null,null,null,null,"2010-01-10",{"$f":"IF(ISNUMBER(AE:AE),YEAR(AE:AE),AE:AE)","v":2010},{"$f":"IF(AE:AE=\"pas d'actualité\",3,IF(AE:AE=\"?\",\"?\",IF(AE:AE=\"?\",\"?\",IF($B$2-AF:AF>=0,0,IF($B$2-AF:AF>=-1,1,IF($B$2-AF:AF>=-2,2,3))))))","v":0},{"$f":"IF(AE:AE=\"pas d'actualité\",3,IF(AE:AE=\"?\",\"?\",IF(AE:AE=\"?\",\"?\",IF((($B$2+1)-AF:AF)>=0,\"0\",IF((($B$2+1)-AF:AF)>=-1,\"1\",IF((($B$2+1)-AF:AF)>=-2,\"2\",\"3\"))))))","v":"0"},{"$f":"IF(AE:AE=\"pas d'actualité\",3,IF(AE:AE=\"?\",\"?\",IF(AE:AE=\"?\",\"?\",IF((($B$2+2)-AF:AF)>=0,0,IF((($B$2+2)-AF:AF)>=-1,1,IF((($B$2+2)-AF:AF)>=-2,2,3))))))","v":0},{"$f":"IF(AE:AE=\"pas d'actualité\",3,IF(AE:AE=\"?\",\"?\",IF(AE:AE=\"?\",\"?\",IF(($B$2+3)-AF:AF>=0,0,IF(($B$2+3)-AF:AF>=-1,1,IF(($B$2+3)-AF:AF>=-2,2,3))))))","v":0},{"$f":"IF(AE:AE=\"pas d'actualité\",3,IF(AE:AE=\"?\",\"?\",IF(AE:AE=\"?\",\"?\",IF(($B$2+4)-AF:AF>=0,0,IF(($B$2+4)-AF:AF>=-1,1,IF(($B$2+4)-AF:AF>=-2,2,3))))))","v":0},"6ES7313-5BG03-0AB0"]
["PR199","D199","FAB 199",null,1,null,null,"X","X",null,null,null,null,null,null,null,null,null,null,null,null,null,null,null,null,null,null,null,null,null,"2013-01-10",{"$f":"IF(ISNUMBER(AE:AE),YEAR(AE:AE),AE:AE)","v":2013},{"$f":"IF(AE:AE=\"pas d'actualité\",3,IF(AE:AE=\"?\",\"?\",IF(AE:AE=\"?\",\"?\",IF($B$2-AF:AF>=0,0,IF($B$2-AF:AF>=-1,1,IF($B$2-AF:AF>=-2,2,3))))))","v":0},{"$f":"IF(AE:AE=\"pas d'actualité\",3,IF(AE:AE=\"?\",\"?\",IF(AE:AE=\"?\",\"?\",IF((($B$2+1)-AF:AF)>=0,\"0\",IF((($B$2+1)-AF:AF)>=-1,\"1\",IF((($B$2+1)-AF:AF)>=-2,\"2\",\"3\"))))))","v":"0"},{"$f":"IF(AE:AE=\"pas d'actualité\",3,IF(AE:AE=\"?\",\"?\",IF(AE:AE=\"?\",\"?\",IF((($B$2+2)-AF:AF)>=0,0,IF((($B$2+2)-AF:AF)>=-1,1,IF((($B$2+2)-AF:AF)>=-2,2,3))))))","v":0},{"$f":"IF(AE:AE=\"pas d'actualité\",3,IF(AE:AE=\"?\",\"?\",IF(AE:AE=\"?\",\"?\",IF(($B$2+3)-AF:AF>=0,0,IF(($B$2+3)-AF:AF>=-1,1,IF(($B$2+3)-AF:AF>=-2,2,3))))))","v":0},{"$f":"IF(AE:AE=\"pas d'actualité\",3,IF(AE:AE=\"?\",\"?\",IF(AE:AE=\"?\",\"?\",IF(($B$2+4)-AF:AF>=0,0,IF(($B$2+4)-AF:AF>=-1,1,IF(($B$2+4)-AF:AF>=-2,2,3))))))","v":0},"SUCCESSOR: 6ES7315-2AG10-0AB0. COMPATABILITY NOTES SEE SERVICE&SUPPORT ENTRY ID 14845044"]
["PR200","D200","FAB 200",null,1,null,null,"X","X",null,null,null,null,null,null,null,null,null,null,null,null,null,null,null,null,null,null,null,null,null,"2007-01-10",{"$f":"IF(ISNUMBER(AE:AE),YEAR(AE:AE),AE:AE)","v":2007},{"$f":"IF(AE:AE=\"pas d'actualité\",3,IF(AE:AE=\"?\",\"?\",IF(AE:AE=\"?\",\"?\",IF($B$2-AF:AF>=0,0,IF($B$2-AF:AF>=-1,1,IF($B$2-AF:AF>=-2,2,3))))))","v":0},{"$f":"IF(AE:AE=\"pas d'actualité\",3,IF(AE:AE=\"?\",\"?\",IF(AE:AE=\"?\",\"?\",IF((($B$2+1)-AF:AF)>=0,\"0\",IF((($B$2+1)-AF:AF)>=-1,\"1\",IF((($B$2+1)-AF:AF)>=-2,\"2\",\"3\"))))))","v":"0"},{"$f":"IF(AE:AE=\"pas d'actualité\",3,IF(AE:AE=\"?\",\"?\",IF(AE:AE=\"?\",\"?\",IF((($B$2+2)-AF:AF)>=0,0,IF((($B$2+2)-AF:AF)>=-1,1,IF((($B$2+2)-AF:AF)>=-2,2,3))))))","v":0},{"$f":"IF(AE:AE=\"pas d'actualité\",3,IF(AE:AE=\"?\",\"?\",IF(AE:AE=\"?\",\"?\",IF(($B$2+3)-AF:AF>=0,0,IF(($B$2+3)-AF:AF>=-1,1,IF(($B$2+3)-AF:AF>=-2,2,3))))))","v":0},{"$f":"IF(AE:AE=\"pas d'actualité\",3,IF(AE:AE=\"?\",\"?\",IF(AE:AE=\"?\",\"?\",IF(($B$2+4)-AF:AF>=0,0,IF(($B$2+4)-AF:AF>=-1,1,IF(($B$2+4)-AF:AF>=-2,2,3))))))","v":0},"6ES7340-1AH02-0AE0",null,"reparation/pièce de rechange seulement sous garantie ARRET TOTAL FOURNITURE 01/10/2012"]
["PR201","D201","FAB 201",null,1,null,null,"X",null,null,null,null,null,null,null,null,null,null,null,null,null,null,null,null,null,null,null,null,null,null,"2013-05-11",{"$f":"IF(ISNUMBER(AE:AE),YEAR(AE:AE),AE:AE)","v":2013},{"$f":"IF(AE:AE=\"pas d'actualité\",3,IF(AE:AE=\"?\",\"?\",IF(AE:AE=\"?\",\"?\",IF($B$2-AF:AF>=0,0,IF($B$2-AF:AF>=-1,1,IF($B$2-AF:AF>=-2,2,3))))))","v":0},{"$f":"IF(AE:AE=\"pas d'actualité\",3,IF(AE:AE=\"?\",\"?\",IF(AE:AE=\"?\",\"?\",IF((($B$2+1)-AF:AF)>=0,\"0\",IF((($B$2+1)-AF:AF)>=-1,\"1\",IF((($B$2+1)-AF:AF)>=-2,\"2\",\"3\"))))))","v":"0"},{"$f":"IF(AE:AE=\"pas d'actualité\",3,IF(AE:AE=\"?\",\"?\",IF(AE:AE=\"?\",\"?\",IF((($B$2+2)-AF:AF)>=0,0,IF((($B$2+2)-AF:AF)>=-1,1,IF((($B$2+2)-AF:AF)>=-2,2,3))))))","v":0},{"$f":"IF(AE:AE=\"pas d'actualité\",3,IF(AE:AE=\"?\",\"?\",IF(AE:AE=\"?\",\"?\",IF(($B$2+3)-AF:AF>=0,0,IF(($B$2+3)-AF:AF>=-1,1,IF(($B$2+3)-AF:AF>=-2,2,3))))))","v":0},{"$f":"IF(AE:AE=\"pas d'actualité\",3,IF(AE:AE=\"?\",\"?\",IF(AE:AE=\"?\",\"?\",IF(($B$2+4)-AF:AF>=0,0,IF(($B$2+4)-AF:AF>=-1,1,IF(($B$2+4)-AF:AF>=-2,2,3))))))","v":0},"Tableau de commande/écran plat 6FC5203-0AB20-1AA3 ","Partiellement compatible"]
["PR202","D202","FAB 202",null,1,null,null,null,null,null,null,null,null,null,null,null,null,null,null,null,null,null,null,null,null,"X",null,null,null,null,"2016-09-30",{"$f":"IF(ISNUMBER(AE:AE),YEAR(AE:AE),AE:AE)","v":2016},{"$f":"IF(AE:AE=\"pas d'actualité\",3,IF(AE:AE=\"?\",\"?\",IF(AE:AE=\"?\",\"?\",IF($B$2-AF:AF>=0,0,IF($B$2-AF:AF>=-1,1,IF($B$2-AF:AF>=-2,2,3))))))","v":0},{"$f":"IF(AE:AE=\"pas d'actualité\",3,IF(AE:AE=\"?\",\"?\",IF(AE:AE=\"?\",\"?\",IF((($B$2+1)-AF:AF)>=0,\"0\",IF((($B$2+1)-AF:AF)>=-1,\"1\",IF((($B$2+1)-AF:AF)>=-2,\"2\",\"3\"))))))","v":"0"},{"$f":"IF(AE:AE=\"pas d'actualité\",3,IF(AE:AE=\"?\",\"?\",IF(AE:AE=\"?\",\"?\",IF((($B$2+2)-AF:AF)>=0,0,IF((($B$2+2)-AF:AF)>=-1,1,IF((($B$2+2)-AF:AF)>=-2,2,3))))))","v":0},{"$f":"IF(AE:AE=\"pas d'actualité\",3,IF(AE:AE=\"?\",\"?\",IF(AE:AE=\"?\",\"?\",IF(($B$2+3)-AF:AF>=0,0,IF(($B$2+3)-AF:AF>=-1,1,IF(($B$2+3)-AF:AF>=-2,2,3))))))","v":0},{"$f":"IF(AE:AE=\"pas d'actualité\",3,IF(AE:AE=\"?\",\"?\",IF(AE:AE=\"?\",\"?\",IF(($B$2+4)-AF:AF>=0,0,IF(($B$2+4)-AF:AF>=-1,1,IF(($B$2+4)-AF:AF>=-2,2,3))))))","v":0},"6FC5210-0DF31-2AB0","Partiellement compatible","Seulement sous pièces détachées ARRET TOTAL FOURNITURE 30/09/2018"]
["PR203","D203","FAB 203",null,null,null,null,"X","X",null,null,null,null,null,null,null,null,null,null,null,null,null,null,null,null,null,null,null,null,null,"2004-07-06",{"$f":"IF(ISNUMBER(AE:AE),YEAR(AE:AE),AE:AE)","v":2004},{"$f":"IF(AE:AE=\"pas d'actualité\",3,IF(AE:AE=\"?\",\"?\",IF(AE:AE=\"?\",\"?\",IF($B$2-AF:AF>=0,0,IF($B$2-AF:AF>=-1,1,IF($B$2-AF:AF>=-2,2,3))))))","v":0},{"$f":"IF(AE:AE=\"pas d'actualité\",3,IF(AE:AE=\"?\",\"?\",IF(AE:AE=\"?\",\"?\",IF((($B$2+1)-AF:AF)>=0,\"0\",IF((($B$2+1)-AF:AF)>=-1,\"1\",IF((($B$2+1)-AF:AF)>=-2,\"2\",\"3\"))))))","v":"0"},{"$f":"IF(AE:AE=\"pas d'actualité\",3,IF(AE:AE=\"?\",\"?\",IF(AE:AE=\"?\",\"?\",IF((($B$2+2)-AF:AF)>=0,0,IF((($B$2+2)-AF:AF)>=-1,1,IF((($B$2+2)-AF:AF)>=-2,2,3))))))","v":0},{"$f":"IF(AE:AE=\"pas d'actualité\",3,IF(AE:AE=\"?\",\"?\",IF(AE:AE=\"?\",\"?\",IF(($B$2+3)-AF:AF>=0,0,IF(($B$2+3)-AF:AF>=-1,1,IF(($B$2+3)-AF:AF>=-2,2,3))))))","v":0},{"$f":"IF(AE:AE=\"pas d'actualité\",3,IF(AE:AE=\"?\",\"?\",IF(AE:AE=\"?\",\"?\",IF(($B$2+4)-AF:AF>=0,0,IF(($B$2+4)-AF:AF>=-1,1,IF(($B$2+4)-AF:AF>=-2,2,3))))))","v":0},"6FC5247-0AA00-0AA3","Entièrement compatible","ARRET TOTAL FOURNITURE 06/07/2004"]
["PR204","D204","FAB 204",null,null,null,null,"X","X",null,null,null,null,null,null,null,null,null,null,null,null,null,null,null,null,null,null,null,null,null,"2016-09-30",{"$f":"IF(ISNUMBER(AE:AE),YEAR(AE:AE),AE:AE)","v":2016},{"$f":"IF(AE:AE=\"pas d'actualité\",3,IF(AE:AE=\"?\",\"?\",IF(AE:AE=\"?\",\"?\",IF($B$2-AF:AF>=0,0,IF($B$2-AF:AF>=-1,1,IF($B$2-AF:AF>=-2,2,3))))))","v":0},{"$f":"IF(AE:AE=\"pas d'actualité\",3,IF(AE:AE=\"?\",\"?\",IF(AE:AE=\"?\",\"?\",IF((($B$2+1)-AF:AF)>=0,\"0\",IF((($B$2+1)-AF:AF)>=-1,\"1\",IF((($B$2+1)-AF:AF)>=-2,\"2\",\"3\"))))))","v":"0"},{"$f":"IF(AE:AE=\"pas d'actualité\",3,IF(AE:AE=\"?\",\"?\",IF(AE:AE=\"?\",\"?\",IF((($B$2+2)-AF:AF)>=0,0,IF((($B$2+2)-AF:AF)>=-1,1,IF((($B$2+2)-AF:AF)>=-2,2,3))))))","v":0},{"$f":"IF(AE:AE=\"pas d'actualité\",3,IF(AE:AE=\"?\",\"?\",IF(AE:AE=\"?\",\"?\",IF(($B$2+3)-AF:AF>=0,0,IF(($B$2+3)-AF:AF>=-1,1,IF(($B$2+3)-AF:AF>=-2,2,3))))))","v":0},{"$f":"IF(AE:AE=\"pas d'actualité\",3,IF(AE:AE=\"?\",\"?\",IF(AE:AE=\"?\",\"?\",IF(($B$2+4)-AF:AF>=0,0,IF(($B$2+4)-AF:AF>=-1,1,IF(($B$2+4)-AF:AF>=-2,2,3))))))","v":0},"SEULEMENT PIECES DETACHEES","Pas de successeur","ARRET TOTAL FOURNITURE 30/09/2018"]
["PR205","D205","FAB 205",null,1,null,null,"X","X",null,null,null,null,null,null,null,null,null,null,null,null,null,null,null,null,null,null,null,null,null,"2015-09-30",{"$f":"IF(ISNUMBER(AE:AE),YEAR(AE:AE),AE:AE)","v":2015},{"$f":"IF(AE:AE=\"pas d'actualité\",3,IF(AE:AE=\"?\",\"?\",IF(AE:AE=\"?\",\"?\",IF($B$2-AF:AF>=0,0,IF($B$2-AF:AF>=-1,1,IF($B$2-AF:AF>=-2,2,3))))))","v":0},{"$f":"IF(AE:AE=\"pas d'actualité\",3,IF(AE:AE=\"?\",\"?\",IF(AE:AE=\"?\",\"?\",IF((($B$2+1)-AF:AF)>=0,\"0\",IF((($B$2+1)-AF:AF)>=-1,\"1\",IF((($B$2+1)-AF:AF)>=-2,\"2\",\"3\"))))))","v":"0"},{"$f":"IF(AE:AE=\"pas d'actualité\",3,IF(AE:AE=\"?\",\"?\",IF(AE:AE=\"?\",\"?\",IF((($B$2+2)-AF:AF)>=0,0,IF((($B$2+2)-AF:AF)>=-1,1,IF((($B$2+2)-AF:AF)>=-2,2,3))))))","v":0},{"$f":"IF(AE:AE=\"pas d'actualité\",3,IF(AE:AE=\"?\",\"?\",IF(AE:AE=\"?\",\"?\",IF(($B$2+3)-AF:AF>=0,0,IF(($B$2+3)-AF:AF>=-1,1,IF(($B$2+3)-AF:AF>=-2,2,3))))))","v":0},{"$f":"IF(AE:AE=\"pas d'actualité\",3,IF(AE:AE=\"?\",\"?\",IF(AE:AE=\"?\",\"?\",IF(($B$2+4)-AF:AF>=0,0,IF(($B$2+4)-AF:AF>=-1,1,IF(($B$2+4)-AF:AF>=-2,2,3))))))","v":0},"6FC5357-0BB33-0AE3","Partiellement compatible"]
["PR206","D206","FAB 206",null,null,null,null,null,null,null,null,"X",null,null,null,null,null,null,null,null,null,null,null,null,null,null,null,null,null,null,"2013-02-22",{"$f":"IF(ISNUMBER(AE:AE),YEAR(AE:AE),AE:AE)","v":2013},{"$f":"IF(AE:AE=\"pas d'actualité\",3,IF(AE:AE=\"?\",\"?\",IF(AE:AE=\"?\",\"?\",IF($B$2-AF:AF>=0,0,IF($B$2-AF:AF>=-1,1,IF($B$2-AF:AF>=-2,2,3))))))","v":0},{"$f":"IF(AE:AE=\"pas d'actualité\",3,IF(AE:AE=\"?\",\"?\",IF(AE:AE=\"?\",\"?\",IF((($B$2+1)-AF:AF)>=0,\"0\",IF((($B$2+1)-AF:AF)>=-1,\"1\",IF((($B$2+1)-AF:AF)>=-2,\"2\",\"3\"))))))","v":"0"},{"$f":"IF(AE:AE=\"pas d'actualité\",3,IF(AE:AE=\"?\",\"?\",IF(AE:AE=\"?\",\"?\",IF((($B$2+2)-AF:AF)>=0,0,IF((($B$2+2)-AF:AF)>=-1,1,IF((($B$2+2)-AF:AF)>=-2,2,3))))))","v":0},{"$f":"IF(AE:AE=\"pas d'actualité\",3,IF(AE:AE=\"?\",\"?\",IF(AE:AE=\"?\",\"?\",IF(($B$2+3)-AF:AF>=0,0,IF(($B$2+3)-AF:AF>=-1,1,IF(($B$2+3)-AF:AF>=-2,2,3))))))","v":0},{"$f":"IF(AE:AE=\"pas d'actualité\",3,IF(AE:AE=\"?\",\"?\",IF(AE:AE=\"?\",\"?\",IF(($B$2+4)-AF:AF>=0,0,IF(($B$2+4)-AF:AF>=-1,1,IF(($B$2+4)-AF:AF>=-2,2,3))))))","v":0},"6SL3100-1AE31-0AB1","Entièrement compatible"]
["PR207","D207","FAB 207",null,1,null,null,null,null,null,"X",null,"X",null,null,null,null,null,null,null,null,null,null,null,null,null,null,null,null,null,"2010-01-04",{"$f":"IF(ISNUMBER(AE:AE),YEAR(AE:AE),AE:AE)","v":2010},{"$f":"IF(AE:AE=\"pas d'actualité\",3,IF(AE:AE=\"?\",\"?\",IF(AE:AE=\"?\",\"?\",IF($B$2-AF:AF>=0,0,IF($B$2-AF:AF>=-1,1,IF($B$2-AF:AF>=-2,2,3))))))","v":0},{"$f":"IF(AE:AE=\"pas d'actualité\",3,IF(AE:AE=\"?\",\"?\",IF(AE:AE=\"?\",\"?\",IF((($B$2+1)-AF:AF)>=0,\"0\",IF((($B$2+1)-AF:AF)>=-1,\"1\",IF((($B$2+1)-AF:AF)>=-2,\"2\",\"3\"))))))","v":"0"},{"$f":"IF(AE:AE=\"pas d'actualité\",3,IF(AE:AE=\"?\",\"?\",IF(AE:AE=\"?\",\"?\",IF((($B$2+2)-AF:AF)>=0,0,IF((($B$2+2)-AF:AF)>=-1,1,IF((($B$2+2)-AF:AF)>=-2,2,3))))))","v":0},{"$f":"IF(AE:AE=\"pas d'actualité\",3,IF(AE:AE=\"?\",\"?\",IF(AE:AE=\"?\",\"?\",IF(($B$2+3)-AF:AF>=0,0,IF(($B$2+3)-AF:AF>=-1,1,IF(($B$2+3)-AF:AF>=-2,2,3))))))","v":0},{"$f":"IF(AE:AE=\"pas d'actualité\",3,IF(AE:AE=\"?\",\"?\",IF(AE:AE=\"?\",\"?\",IF(($B$2+4)-AF:AF>=0,0,IF(($B$2+4)-AF:AF>=-1,1,IF(($B$2+4)-AF:AF>=-2,2,3))))))","v":0},null,null,"REP. TYPE: 6SL3000-0BE23-6AA0(FI),6SN1111-0AA00-0CA1(DR),6SN1162-0GA00-0CA0(ADP) ARRET TOTAL FOURNITURE 01/04/2010"]
["PR208","D208","FAB 208",null,null,null,null,"X",null,null,null,null,null,null,null,null,null,null,null,null,null,null,null,null,null,null,null,null,null,null,"2006-01-04",{"$f":"IF(ISNUMBER(AE:AE),YEAR(AE:AE),AE:AE)","v":2006},{"$f":"IF(AE:AE=\"pas d'actualité\",3,IF(AE:AE=\"?\",\"?\",IF(AE:AE=\"?\",\"?\",IF($B$2-AF:AF>=0,0,IF($B$2-AF:AF>=-1,1,IF($B$2-AF:AF>=-2,2,3))))))","v":0},{"$f":"IF(AE:AE=\"pas d'actualité\",3,IF(AE:AE=\"?\",\"?\",IF(AE:AE=\"?\",\"?\",IF((($B$2+1)-AF:AF)>=0,\"0\",IF((($B$2+1)-AF:AF)>=-1,\"1\",IF((($B$2+1)-AF:AF)>=-2,\"2\",\"3\"))))))","v":"0"},{"$f":"IF(AE:AE=\"pas d'actualité\",3,IF(AE:AE=\"?\",\"?\",IF(AE:AE=\"?\",\"?\",IF((($B$2+2)-AF:AF)>=0,0,IF((($B$2+2)-AF:AF)>=-1,1,IF((($B$2+2)-AF:AF)>=-2,2,3))))))","v":0},{"$f":"IF(AE:AE=\"pas d'actualité\",3,IF(AE:AE=\"?\",\"?\",IF(AE:AE=\"?\",\"?\",IF(($B$2+3)-AF:AF>=0,0,IF(($B$2+3)-AF:AF>=-1,1,IF(($B$2+3)-AF:AF>=-2,2,3))))))","v":0},{"$f":"IF(AE:AE=\"pas d'actualité\",3,IF(AE:AE=\"?\",\"?\",IF(AE:AE=\"?\",\"?\",IF(($B$2+4)-AF:AF>=0,0,IF(($B$2+4)-AF:AF>=-1,1,IF(($B$2+4)-AF:AF>=-2,2,3))))))","v":0},null,null,"plus disponible ARRET TOTAL FOURNITURE 30/04/2008"]
["PR209","D209","FAB 209",null,null,null,null,"X","X",null,null,null,null,null,null,null,null,null,null,null,null,null,null,null,null,null,null,null,null,null,"2008-09-30",{"$f":"IF(ISNUMBER(AE:AE),YEAR(AE:AE),AE:AE)","v":2008},{"$f":"IF(AE:AE=\"pas d'actualité\",3,IF(AE:AE=\"?\",\"?\",IF(AE:AE=\"?\",\"?\",IF($B$2-AF:AF>=0,0,IF($B$2-AF:AF>=-1,1,IF($B$2-AF:AF>=-2,2,3))))))","v":0},{"$f":"IF(AE:AE=\"pas d'actualité\",3,IF(AE:AE=\"?\",\"?\",IF(AE:AE=\"?\",\"?\",IF((($B$2+1)-AF:AF)>=0,\"0\",IF((($B$2+1)-AF:AF)>=-1,\"1\",IF((($B$2+1)-AF:AF)>=-2,\"2\",\"3\"))))))","v":"0"},{"$f":"IF(AE:AE=\"pas d'actualité\",3,IF(AE:AE=\"?\",\"?\",IF(AE:AE=\"?\",\"?\",IF((($B$2+2)-AF:AF)>=0,0,IF((($B$2+2)-AF:AF)>=-1,1,IF((($B$2+2)-AF:AF)>=-2,2,3))))))","v":0},{"$f":"IF(AE:AE=\"pas d'actualité\",3,IF(AE:AE=\"?\",\"?\",IF(AE:AE=\"?\",\"?\",IF(($B$2+3)-AF:AF>=0,0,IF(($B$2+3)-AF:AF>=-1,1,IF(($B$2+3)-AF:AF>=-2,2,3))))))","v":0},{"$f":"IF(AE:AE=\"pas d'actualité\",3,IF(AE:AE=\"?\",\"?\",IF(AE:AE=\"?\",\"?\",IF(($B$2+4)-AF:AF>=0,0,IF(($B$2+4)-AF:AF>=-1,1,IF(($B$2+4)-AF:AF>=-2,2,3))))))","v":0},null,null,"ARRET TOTAL FOURNITURE 30/09/2010"]
["PR210","D210","FAB 210",null,1,null,null,"X","X",null,null,null,null,null,null,null,null,null,null,null,null,null,null,null,null,null,null,null,null,null,"2016-09-30",{"$f":"IF(ISNUMBER(AE:AE),YEAR(AE:AE),AE:AE)","v":2016},{"$f":"IF(AE:AE=\"pas d'actualité\",3,IF(AE:AE=\"?\",\"?\",IF(AE:AE=\"?\",\"?\",IF($B$2-AF:AF>=0,0,IF($B$2-AF:AF>=-1,1,IF($B$2-AF:AF>=-2,2,3))))))","v":0},{"$f":"IF(AE:AE=\"pas d'actualité\",3,IF(AE:AE=\"?\",\"?\",IF(AE:AE=\"?\",\"?\",IF((($B$2+1)-AF:AF)>=0,\"0\",IF((($B$2+1)-AF:AF)>=-1,\"1\",IF((($B$2+1)-AF:AF)>=-2,\"2\",\"3\"))))))","v":"0"},{"$f":"IF(AE:AE=\"pas d'actualité\",3,IF(AE:AE=\"?\",\"?\",IF(AE:AE=\"?\",\"?\",IF((($B$2+2)-AF:AF)>=0,0,IF((($B$2+2)-AF:AF)>=-1,1,IF((($B$2+2)-AF:AF)>=-2,2,3))))))","v":0},{"$f":"IF(AE:AE=\"pas d'actualité\",3,IF(AE:AE=\"?\",\"?\",IF(AE:AE=\"?\",\"?\",IF(($B$2+3)-AF:AF>=0,0,IF(($B$2+3)-AF:AF>=-1,1,IF(($B$2+3)-AF:AF>=-2,2,3))))))","v":0},{"$f":"IF(AE:AE=\"pas d'actualité\",3,IF(AE:AE=\"?\",\"?\",IF(AE:AE=\"?\",\"?\",IF(($B$2+4)-AF:AF>=0,0,IF(($B$2+4)-AF:AF>=-1,1,IF(($B$2+4)-AF:AF>=-2,2,3))))))","v":0},null,"Entièrement compatible"]
["PR211","D211","FAB 211",null,1,null,null,"X","X",null,null,null,null,null,null,null,null,null,null,null,null,null,null,null,null,null,null,null,null,null,"2016-09-30",{"$f":"IF(ISNUMBER(AE:AE),YEAR(AE:AE),AE:AE)","v":2016},{"$f":"IF(AE:AE=\"pas d'actualité\",3,IF(AE:AE=\"?\",\"?\",IF(AE:AE=\"?\",\"?\",IF($B$2-AF:AF>=0,0,IF($B$2-AF:AF>=-1,1,IF($B$2-AF:AF>=-2,2,3))))))","v":0},{"$f":"IF(AE:AE=\"pas d'actualité\",3,IF(AE:AE=\"?\",\"?\",IF(AE:AE=\"?\",\"?\",IF((($B$2+1)-AF:AF)>=0,\"0\",IF((($B$2+1)-AF:AF)>=-1,\"1\",IF((($B$2+1)-AF:AF)>=-2,\"2\",\"3\"))))))","v":"0"},{"$f":"IF(AE:AE=\"pas d'actualité\",3,IF(AE:AE=\"?\",\"?\",IF(AE:AE=\"?\",\"?\",IF((($B$2+2)-AF:AF)>=0,0,IF((($B$2+2)-AF:AF)>=-1,1,IF((($B$2+2)-AF:AF)>=-2,2,3))))))","v":0},{"$f":"IF(AE:AE=\"pas d'actualité\",3,IF(AE:AE=\"?\",\"?\",IF(AE:AE=\"?\",\"?\",IF(($B$2+3)-AF:AF>=0,0,IF(($B$2+3)-AF:AF>=-1,1,IF(($B$2+3)-AF:AF>=-2,2,3))))))","v":0},{"$f":"IF(AE:AE=\"pas d'actualité\",3,IF(AE:AE=\"?\",\"?\",IF(AE:AE=\"?\",\"?\",IF(($B$2+4)-AF:AF>=0,0,IF(($B$2+4)-AF:AF>=-1,1,IF(($B$2+4)-AF:AF>=-2,2,3))))))","v":0},null,"Entièrement compatible"]
["PR212","D212","FAB 212",null,1,null,null,"X","X",null,null,null,null,null,null,null,null,null,null,null,null,null,null,null,null,null,null,null,null,null,"2016-09-30",{"$f":"IF(ISNUMBER(AE:AE),YEAR(AE:AE),AE:AE)","v":2016},{"$f":"IF(AE:AE=\"pas d'actualité\",3,IF(AE:AE=\"?\",\"?\",IF(AE:AE=\"?\",\"?\",IF($B$2-AF:AF>=0,0,IF($B$2-AF:AF>=-1,1,IF($B$2-AF:AF>=-2,2,3))))))","v":0},{"$f":"IF(AE:AE=\"pas d'actualité\",3,IF(AE:AE=\"?\",\"?\",IF(AE:AE=\"?\",\"?\",IF((($B$2+1)-AF:AF)>=0,\"0\",IF((($B$2+1)-AF:AF)>=-1,\"1\",IF((($B$2+1)-AF:AF)>=-2,\"2\",\"3\"))))))","v":"0"},{"$f":"IF(AE:AE=\"pas d'actualité\",3,IF(AE:AE=\"?\",\"?\",IF(AE:AE=\"?\",\"?\",IF((($B$2+2)-AF:AF)>=0,0,IF((($B$2+2)-AF:AF)>=-1,1,IF((($B$2+2)-AF:AF)>=-2,2,3))))))","v":0},{"$f":"IF(AE:AE=\"pas d'actualité\",3,IF(AE:AE=\"?\",\"?\",IF(AE:AE=\"?\",\"?\",IF(($B$2+3)-AF:AF>=0,0,IF(($B$2+3)-AF:AF>=-1,1,IF(($B$2+3)-AF:AF>=-2,2,3))))))","v":0},{"$f":"IF(AE:AE=\"pas d'actualité\",3,IF(AE:AE=\"?\",\"?\",IF(AE:AE=\"?\",\"?\",IF(($B$2+4)-AF:AF>=0,0,IF(($B$2+4)-AF:AF>=-1,1,IF(($B$2+4)-AF:AF>=-2,2,3))))))","v":0},null,"Partiellement  compatible"]
["PR213","D213","FAB 213",null,null,null,null,"X",null,null,null,null,null,null,null,null,null,null,null,null,null,null,null,null,null,null,null,null,null,null,"2015-09-30",{"$f":"IF(ISNUMBER(AE:AE),YEAR(AE:AE),AE:AE)","v":2015},{"$f":"IF(AE:AE=\"pas d'actualité\",3,IF(AE:AE=\"?\",\"?\",IF(AE:AE=\"?\",\"?\",IF($B$2-AF:AF>=0,0,IF($B$2-AF:AF>=-1,1,IF($B$2-AF:AF>=-2,2,3))))))","v":0},{"$f":"IF(AE:AE=\"pas d'actualité\",3,IF(AE:AE=\"?\",\"?\",IF(AE:AE=\"?\",\"?\",IF((($B$2+1)-AF:AF)>=0,\"0\",IF((($B$2+1)-AF:AF)>=-1,\"1\",IF((($B$2+1)-AF:AF)>=-2,\"2\",\"3\"))))))","v":"0"},{"$f":"IF(AE:AE=\"pas d'actualité\",3,IF(AE:AE=\"?\",\"?\",IF(AE:AE=\"?\",\"?\",IF((($B$2+2)-AF:AF)>=0,0,IF((($B$2+2)-AF:AF)>=-1,1,IF((($B$2+2)-AF:AF)>=-2,2,3))))))","v":0},{"$f":"IF(AE:AE=\"pas d'actualité\",3,IF(AE:AE=\"?\",\"?\",IF(AE:AE=\"?\",\"?\",IF(($B$2+3)-AF:AF>=0,0,IF(($B$2+3)-AF:AF>=-1,1,IF(($B$2+3)-AF:AF>=-2,2,3))))))","v":0},{"$f":"IF(AE:AE=\"pas d'actualité\",3,IF(AE:AE=\"?\",\"?\",IF(AE:AE=\"?\",\"?\",IF(($B$2+4)-AF:AF>=0,0,IF(($B$2+4)-AF:AF>=-1,1,IF(($B$2+4)-AF:AF>=-2,2,3))))))","v":0},null,null,"ARRET TOTAL FOURNITURE 30/09/2017"]
["PR214","D214","FAB 214",null,null,null,null,"X","X",null,null,null,null,null,null,null,null,null,null,null,null,null,null,null,null,null,null,null,null,null,"2012-09-30",{"$f":"IF(ISNUMBER(AE:AE),YEAR(AE:AE),AE:AE)","v":2012},{"$f":"IF(AE:AE=\"pas d'actualité\",3,IF(AE:AE=\"?\",\"?\",IF(AE:AE=\"?\",\"?\",IF($B$2-AF:AF>=0,0,IF($B$2-AF:AF>=-1,1,IF($B$2-AF:AF>=-2,2,3))))))","v":0},{"$f":"IF(AE:AE=\"pas d'actualité\",3,IF(AE:AE=\"?\",\"?\",IF(AE:AE=\"?\",\"?\",IF((($B$2+1)-AF:AF)>=0,\"0\",IF((($B$2+1)-AF:AF)>=-1,\"1\",IF((($B$2+1)-AF:AF)>=-2,\"2\",\"3\"))))))","v":"0"},{"$f":"IF(AE:AE=\"pas d'actualité\",3,IF(AE:AE=\"?\",\"?\",IF(AE:AE=\"?\",\"?\",IF((($B$2+2)-AF:AF)>=0,0,IF((($B$2+2)-AF:AF)>=-1,1,IF((($B$2+2)-AF:AF)>=-2,2,3))))))","v":0},{"$f":"IF(AE:AE=\"pas d'actualité\",3,IF(AE:AE=\"?\",\"?\",IF(AE:AE=\"?\",\"?\",IF(($B$2+3)-AF:AF>=0,0,IF(($B$2+3)-AF:AF>=-1,1,IF(($B$2+3)-AF:AF>=-2,2,3))))))","v":0},{"$f":"IF(AE:AE=\"pas d'actualité\",3,IF(AE:AE=\"?\",\"?\",IF(AE:AE=\"?\",\"?\",IF(($B$2+4)-AF:AF>=0,0,IF(($B$2+4)-AF:AF>=-1,1,IF(($B$2+4)-AF:AF>=-2,2,3))))))","v":0},null,"Entièrement compatible"]
["PR215","D215","FAB 215",null,1,null,null,null,null,null,null,null,null,null,"X",null,null,null,null,null,null,null,null,null,null,null,null,null,null,null,"2012-09-30",{"$f":"IF(ISNUMBER(AE:AE),YEAR(AE:AE),AE:AE)","v":2012},{"$f":"IF(AE:AE=\"pas d'actualité\",3,IF(AE:AE=\"?\",\"?\",IF(AE:AE=\"?\",\"?\",IF($B$2-AF:AF>=0,0,IF($B$2-AF:AF>=-1,1,IF($B$2-AF:AF>=-2,2,3))))))","v":0},{"$f":"IF(AE:AE=\"pas d'actualité\",3,IF(AE:AE=\"?\",\"?\",IF(AE:AE=\"?\",\"?\",IF((($B$2+1)-AF:AF)>=0,\"0\",IF((($B$2+1)-AF:AF)>=-1,\"1\",IF((($B$2+1)-AF:AF)>=-2,\"2\",\"3\"))))))","v":"0"},{"$f":"IF(AE:AE=\"pas d'actualité\",3,IF(AE:AE=\"?\",\"?\",IF(AE:AE=\"?\",\"?\",IF((($B$2+2)-AF:AF)>=0,0,IF((($B$2+2)-AF:AF)>=-1,1,IF((($B$2+2)-AF:AF)>=-2,2,3))))))","v":0},{"$f":"IF(AE:AE=\"pas d'actualité\",3,IF(AE:AE=\"?\",\"?\",IF(AE:AE=\"?\",\"?\",IF(($B$2+3)-AF:AF>=0,0,IF(($B$2+3)-AF:AF>=-1,1,IF(($B$2+3)-AF:AF>=-2,2,3))))))","v":0},{"$f":"IF(AE:AE=\"pas d'actualité\",3,IF(AE:AE=\"?\",\"?\",IF(AE:AE=\"?\",\"?\",IF(($B$2+4)-AF:AF>=0,0,IF(($B$2+4)-AF:AF>=-1,1,IF(($B$2+4)-AF:AF>=-2,2,3))))))","v":0}]
["PR216","D216","FAB 216",null,1,null,null,"X","X",null,null,null,null,null,null,null,null,null,null,null,null,null,null,null,null,null,null,null,null,null,"2015-09-30",{"$f":"IF(ISNUMBER(AE:AE),YEAR(AE:AE),AE:AE)","v":2015},{"$f":"IF(AE:AE=\"pas d'actualité\",3,IF(AE:AE=\"?\",\"?\",IF(AE:AE=\"?\",\"?\",IF($B$2-AF:AF>=0,0,IF($B$2-AF:AF>=-1,1,IF($B$2-AF:AF>=-2,2,3))))))","v":0},{"$f":"IF(AE:AE=\"pas d'actualité\",3,IF(AE:AE=\"?\",\"?\",IF(AE:AE=\"?\",\"?\",IF((($B$2+1)-AF:AF)>=0,\"0\",IF((($B$2+1)-AF:AF)>=-1,\"1\",IF((($B$2+1)-AF:AF)>=-2,\"2\",\"3\"))))))","v":"0"},{"$f":"IF(AE:AE=\"pas d'actualité\",3,IF(AE:AE=\"?\",\"?\",IF(AE:AE=\"?\",\"?\",IF((($B$2+2)-AF:AF)>=0,0,IF((($B$2+2)-AF:AF)>=-1,1,IF((($B$2+2)-AF:AF)>=-2,2,3))))))","v":0},{"$f":"IF(AE:AE=\"pas d'actualité\",3,IF(AE:AE=\"?\",\"?\",IF(AE:AE=\"?\",\"?\",IF(($B$2+3)-AF:AF>=0,0,IF(($B$2+3)-AF:AF>=-1,1,IF(($B$2+3)-AF:AF>=-2,2,3))))))","v":0},{"$f":"IF(AE:AE=\"pas d'actualité\",3,IF(AE:AE=\"?\",\"?\",IF(AE:AE=\"?\",\"?\",IF(($B$2+4)-AF:AF>=0,0,IF(($B$2+4)-AF:AF>=-1,1,IF(($B$2+4)-AF:AF>=-2,2,3))))))","v":0},null,"Entièrement compatible"]
["PR217","D217","FAB 217",null,1,null,null,null,null,null,null,null,null,null,"X",null,null,null,null,null,null,null,null,null,null,null,null,null,null,null,"2012-09-30",{"$f":"IF(ISNUMBER(AE:AE),YEAR(AE:AE),AE:AE)","v":2012},{"$f":"IF(AE:AE=\"pas d'actualité\",3,IF(AE:AE=\"?\",\"?\",IF(AE:AE=\"?\",\"?\",IF($B$2-AF:AF>=0,0,IF($B$2-AF:AF>=-1,1,IF($B$2-AF:AF>=-2,2,3))))))","v":0},{"$f":"IF(AE:AE=\"pas d'actualité\",3,IF(AE:AE=\"?\",\"?\",IF(AE:AE=\"?\",\"?\",IF((($B$2+1)-AF:AF)>=0,\"0\",IF((($B$2+1)-AF:AF)>=-1,\"1\",IF((($B$2+1)-AF:AF)>=-2,\"2\",\"3\"))))))","v":"0"},{"$f":"IF(AE:AE=\"pas d'actualité\",3,IF(AE:AE=\"?\",\"?\",IF(AE:AE=\"?\",\"?\",IF((($B$2+2)-AF:AF)>=0,0,IF((($B$2+2)-AF:AF)>=-1,1,IF((($B$2+2)-AF:AF)>=-2,2,3))))))","v":0},{"$f":"IF(AE:AE=\"pas d'actualité\",3,IF(AE:AE=\"?\",\"?\",IF(AE:AE=\"?\",\"?\",IF(($B$2+3)-AF:AF>=0,0,IF(($B$2+3)-AF:AF>=-1,1,IF(($B$2+3)-AF:AF>=-2,2,3))))))","v":0},{"$f":"IF(AE:AE=\"pas d'actualité\",3,IF(AE:AE=\"?\",\"?\",IF(AE:AE=\"?\",\"?\",IF(($B$2+4)-AF:AF>=0,0,IF(($B$2+4)-AF:AF>=-1,1,IF(($B$2+4)-AF:AF>=-2,2,3))))))","v":0}]
["PR218","D218","FAB 218",null,null,null,null,"X",null,null,null,null,null,null,null,null,null,null,null,null,null,null,null,null,null,null,null,null,null,null,"2017-09-30",{"$f":"IF(ISNUMBER(AE:AE),YEAR(AE:AE),AE:AE)","v":2017},{"$f":"IF(AE:AE=\"pas d'actualité\",3,IF(AE:AE=\"?\",\"?\",IF(AE:AE=\"?\",\"?\",IF($B$2-AF:AF>=0,0,IF($B$2-AF:AF>=-1,1,IF($B$2-AF:AF>=-2,2,3))))))","v":1},{"$f":"IF(AE:AE=\"pas d'actualité\",3,IF(AE:AE=\"?\",\"?\",IF(AE:AE=\"?\",\"?\",IF((($B$2+1)-AF:AF)>=0,\"0\",IF((($B$2+1)-AF:AF)>=-1,\"1\",IF((($B$2+1)-AF:AF)>=-2,\"2\",\"3\"))))))","v":"0"},{"$f":"IF(AE:AE=\"pas d'actualité\",3,IF(AE:AE=\"?\",\"?\",IF(AE:AE=\"?\",\"?\",IF((($B$2+2)-AF:AF)>=0,0,IF((($B$2+2)-AF:AF)>=-1,1,IF((($B$2+2)-AF:AF)>=-2,2,3))))))","v":0},{"$f":"IF(AE:AE=\"pas d'actualité\",3,IF(AE:AE=\"?\",\"?\",IF(AE:AE=\"?\",\"?\",IF(($B$2+3)-AF:AF>=0,0,IF(($B$2+3)-AF:AF>=-1,1,IF(($B$2+3)-AF:AF>=-2,2,3))))))","v":0},{"$f":"IF(AE:AE=\"pas d'actualité\",3,IF(AE:AE=\"?\",\"?\",IF(AE:AE=\"?\",\"?\",IF(($B$2+4)-AF:AF>=0,0,IF(($B$2+4)-AF:AF>=-1,1,IF(($B$2+4)-AF:AF>=-2,2,3))))))","v":0},null,"Partiellement compatible","ARRET TOTAL FOURNITURE 30/09/2013"]
["PR219","D219","FAB 219",null,null,null,null,null,"X",null,null,null,null,"X",null,null,null,null,null,null,null,null,null,null,null,null,null,null,null,null,"2017-09-30",{"$f":"IF(ISNUMBER(AE:AE),YEAR(AE:AE),AE:AE)","v":2017},{"$f":"IF(AE:AE=\"pas d'actualité\",3,IF(AE:AE=\"?\",\"?\",IF(AE:AE=\"?\",\"?\",IF($B$2-AF:AF>=0,0,IF($B$2-AF:AF>=-1,1,IF($B$2-AF:AF>=-2,2,3))))))","v":1},{"$f":"IF(AE:AE=\"pas d'actualité\",3,IF(AE:AE=\"?\",\"?\",IF(AE:AE=\"?\",\"?\",IF((($B$2+1)-AF:AF)>=0,\"0\",IF((($B$2+1)-AF:AF)>=-1,\"1\",IF((($B$2+1)-AF:AF)>=-2,\"2\",\"3\"))))))","v":"0"},{"$f":"IF(AE:AE=\"pas d'actualité\",3,IF(AE:AE=\"?\",\"?\",IF(AE:AE=\"?\",\"?\",IF((($B$2+2)-AF:AF)>=0,0,IF((($B$2+2)-AF:AF)>=-1,1,IF((($B$2+2)-AF:AF)>=-2,2,3))))))","v":0},{"$f":"IF(AE:AE=\"pas d'actualité\",3,IF(AE:AE=\"?\",\"?\",IF(AE:AE=\"?\",\"?\",IF(($B$2+3)-AF:AF>=0,0,IF(($B$2+3)-AF:AF>=-1,1,IF(($B$2+3)-AF:AF>=-2,2,3))))))","v":0},{"$f":"IF(AE:AE=\"pas d'actualité\",3,IF(AE:AE=\"?\",\"?\",IF(AE:AE=\"?\",\"?\",IF(($B$2+4)-AF:AF>=0,0,IF(($B$2+4)-AF:AF>=-1,1,IF(($B$2+4)-AF:AF>=-2,2,3))))))","v":0},"SEULEMENT PIECES DETACHEES","Pas de successeur","ARRET TOTAL FOURNITURE 30/09/2019"]
["PR220","D220","FAB 220",null,0,null,null,null,null,null,null,null,null,null,null,null,null,null,null,null,null,null,null,null,null,null,null,null,null,null,"2018-09-30",{"$f":"IF(ISNUMBER(AE:AE),YEAR(AE:AE),AE:AE)","v":2018},{"$f":"IF(AE:AE=\"pas d'actualité\",3,IF(AE:AE=\"?\",\"?\",IF(AE:AE=\"?\",\"?\",IF($B$2-AF:AF>=0,0,IF($B$2-AF:AF>=-1,1,IF($B$2-AF:AF>=-2,2,3))))))","v":2},{"$f":"IF(AE:AE=\"pas d'actualité\",3,IF(AE:AE=\"?\",\"?\",IF(AE:AE=\"?\",\"?\",IF((($B$2+1)-AF:AF)>=0,\"0\",IF((($B$2+1)-AF:AF)>=-1,\"1\",IF((($B$2+1)-AF:AF)>=-2,\"2\",\"3\"))))))","v":"1"},{"$f":"IF(AE:AE=\"pas d'actualité\",3,IF(AE:AE=\"?\",\"?\",IF(AE:AE=\"?\",\"?\",IF((($B$2+2)-AF:AF)>=0,0,IF((($B$2+2)-AF:AF)>=-1,1,IF((($B$2+2)-AF:AF)>=-2,2,3))))))","v":0},{"$f":"IF(AE:AE=\"pas d'actualité\",3,IF(AE:AE=\"?\",\"?\",IF(AE:AE=\"?\",\"?\",IF(($B$2+3)-AF:AF>=0,0,IF(($B$2+3)-AF:AF>=-1,1,IF(($B$2+3)-AF:AF>=-2,2,3))))))","v":0},{"$f":"IF(AE:AE=\"pas d'actualité\",3,IF(AE:AE=\"?\",\"?\",IF(AE:AE=\"?\",\"?\",IF(($B$2+4)-AF:AF>=0,0,IF(($B$2+4)-AF:AF>=-1,1,IF(($B$2+4)-AF:AF>=-2,2,3))))))","v":0},null,null,"Seulement sous pièce détachées ARRET TOTAL FOURNITURE 30/09/2020"]
["PR221","D221","FAB 221",null,2,null,null,null,null,null,"X",null,"X",null,null,null,null,null,null,null,null,null,null,null,null,null,null,null,null,null,"2018-09-30",{"$f":"IF(ISNUMBER(AE:AE),YEAR(AE:AE),AE:AE)","v":2018},{"$f":"IF(AE:AE=\"pas d'actualité\",3,IF(AE:AE=\"?\",\"?\",IF(AE:AE=\"?\",\"?\",IF($B$2-AF:AF>=0,0,IF($B$2-AF:AF>=-1,1,IF($B$2-AF:AF>=-2,2,3))))))","v":2},{"$f":"IF(AE:AE=\"pas d'actualité\",3,IF(AE:AE=\"?\",\"?\",IF(AE:AE=\"?\",\"?\",IF((($B$2+1)-AF:AF)>=0,\"0\",IF((($B$2+1)-AF:AF)>=-1,\"1\",IF((($B$2+1)-AF:AF)>=-2,\"2\",\"3\"))))))","v":"1"},{"$f":"IF(AE:AE=\"pas d'actualité\",3,IF(AE:AE=\"?\",\"?\",IF(AE:AE=\"?\",\"?\",IF((($B$2+2)-AF:AF)>=0,0,IF((($B$2+2)-AF:AF)>=-1,1,IF((($B$2+2)-AF:AF)>=-2,2,3))))))","v":0},{"$f":"IF(AE:AE=\"pas d'actualité\",3,IF(AE:AE=\"?\",\"?\",IF(AE:AE=\"?\",\"?\",IF(($B$2+3)-AF:AF>=0,0,IF(($B$2+3)-AF:AF>=-1,1,IF(($B$2+3)-AF:AF>=-2,2,3))))))","v":0},{"$f":"IF(AE:AE=\"pas d'actualité\",3,IF(AE:AE=\"?\",\"?\",IF(AE:AE=\"?\",\"?\",IF(($B$2+4)-AF:AF>=0,0,IF(($B$2+4)-AF:AF>=-1,1,IF(($B$2+4)-AF:AF>=-2,2,3))))))","v":0},null,"Partiellement compatible","ARRET TOTAL FOURNITURE 30/09/2020"]
["PR222","D222","FAB 222",null,1,null,null,null,null,null,null,null,null,null,null,null,null,null,null,null,null,null,null,null,null,"X",null,null,null,null,"pas d'actualité",{"$f":"IF(ISNUMBER(AE:AE),YEAR(AE:AE),AE:AE)","v":"pas d'actualité"},{"$f":"IF(AE:AE=\"pas d'actualité\",3,IF(AE:AE=\"?\",\"?\",IF(AE:AE=\"?\",\"?\",IF($B$2-AF:AF>=0,0,IF($B$2-AF:AF>=-1,1,IF($B$2-AF:AF>=-2,2,3))))))","v":3},{"$f":"IF(AE:AE=\"pas d'actualité\",3,IF(AE:AE=\"?\",\"?\",IF(AE:AE=\"?\",\"?\",IF((($B$2+1)-AF:AF)>=0,\"0\",IF((($B$2+1)-AF:AF)>=-1,\"1\",IF((($B$2+1)-AF:AF)>=-2,\"2\",\"3\"))))))","v":3},{"$f":"IF(AE:AE=\"pas d'actualité\",3,IF(AE:AE=\"?\",\"?\",IF(AE:AE=\"?\",\"?\",IF((($B$2+2)-AF:AF)>=0,0,IF((($B$2+2)-AF:AF)>=-1,1,IF((($B$2+2)-AF:AF)>=-2,2,3))))))","v":3},{"$f":"IF(AE:AE=\"pas d'actualité\",3,IF(AE:AE=\"?\",\"?\",IF(AE:AE=\"?\",\"?\",IF(($B$2+3)-AF:AF>=0,0,IF(($B$2+3)-AF:AF>=-1,1,IF(($B$2+3)-AF:AF>=-2,2,3))))))","v":3},{"$f":"IF(AE:AE=\"pas d'actualité\",3,IF(AE:AE=\"?\",\"?\",IF(AE:AE=\"?\",\"?\",IF(($B$2+4)-AF:AF>=0,0,IF(($B$2+4)-AF:AF>=-1,1,IF(($B$2+4)-AF:AF>=-2,2,3))))))","v":3}]
["PR223","D223","FAB 223",null,1,null,null,null,null,null,null,null,null,null,null,null,null,null,null,null,null,null,null,null,null,"X",null,null,null,null,"pas d'actualité",{"$f":"IF(ISNUMBER(AE:AE),YEAR(AE:AE),AE:AE)","v":"pas d'actualité"},{"$f":"IF(AE:AE=\"pas d'actualité\",3,IF(AE:AE=\"?\",\"?\",IF(AE:AE=\"?\",\"?\",IF($B$2-AF:AF>=0,0,IF($B$2-AF:AF>=-1,1,IF($B$2-AF:AF>=-2,2,3))))))","v":3},{"$f":"IF(AE:AE=\"pas d'actualité\",3,IF(AE:AE=\"?\",\"?\",IF(AE:AE=\"?\",\"?\",IF((($B$2+1)-AF:AF)>=0,\"0\",IF((($B$2+1)-AF:AF)>=-1,\"1\",IF((($B$2+1)-AF:AF)>=-2,\"2\",\"3\"))))))","v":3},{"$f":"IF(AE:AE=\"pas d'actualité\",3,IF(AE:AE=\"?\",\"?\",IF(AE:AE=\"?\",\"?\",IF((($B$2+2)-AF:AF)>=0,0,IF((($B$2+2)-AF:AF)>=-1,1,IF((($B$2+2)-AF:AF)>=-2,2,3))))))","v":3},{"$f":"IF(AE:AE=\"pas d'actualité\",3,IF(AE:AE=\"?\",\"?\",IF(AE:AE=\"?\",\"?\",IF(($B$2+3)-AF:AF>=0,0,IF(($B$2+3)-AF:AF>=-1,1,IF(($B$2+3)-AF:AF>=-2,2,3))))))","v":3},{"$f":"IF(AE:AE=\"pas d'actualité\",3,IF(AE:AE=\"?\",\"?\",IF(AE:AE=\"?\",\"?\",IF(($B$2+4)-AF:AF>=0,0,IF(($B$2+4)-AF:AF>=-1,1,IF(($B$2+4)-AF:AF>=-2,2,3))))))","v":3}]
["PR224","D224","FAB 224",null,null,null,null,null,"X",null,null,null,null,null,null,null,null,null,null,null,null,null,null,null,null,null,null,null,null,null,"pas d'actualité",{"$f":"IF(ISNUMBER(AE:AE),YEAR(AE:AE),AE:AE)","v":"pas d'actualité"},{"$f":"IF(AE:AE=\"pas d'actualité\",3,IF(AE:AE=\"?\",\"?\",IF(AE:AE=\"?\",\"?\",IF($B$2-AF:AF>=0,0,IF($B$2-AF:AF>=-1,1,IF($B$2-AF:AF>=-2,2,3))))))","v":3},{"$f":"IF(AE:AE=\"pas d'actualité\",3,IF(AE:AE=\"?\",\"?\",IF(AE:AE=\"?\",\"?\",IF((($B$2+1)-AF:AF)>=0,\"0\",IF((($B$2+1)-AF:AF)>=-1,\"1\",IF((($B$2+1)-AF:AF)>=-2,\"2\",\"3\"))))))","v":3},{"$f":"IF(AE:AE=\"pas d'actualité\",3,IF(AE:AE=\"?\",\"?\",IF(AE:AE=\"?\",\"?\",IF((($B$2+2)-AF:AF)>=0,0,IF((($B$2+2)-AF:AF)>=-1,1,IF((($B$2+2)-AF:AF)>=-2,2,3))))))","v":3},{"$f":"IF(AE:AE=\"pas d'actualité\",3,IF(AE:AE=\"?\",\"?\",IF(AE:AE=\"?\",\"?\",IF(($B$2+3)-AF:AF>=0,0,IF(($B$2+3)-AF:AF>=-1,1,IF(($B$2+3)-AF:AF>=-2,2,3))))))","v":3},{"$f":"IF(AE:AE=\"pas d'actualité\",3,IF(AE:AE=\"?\",\"?\",IF(AE:AE=\"?\",\"?\",IF(($B$2+4)-AF:AF>=0,0,IF(($B$2+4)-AF:AF>=-1,1,IF(($B$2+4)-AF:AF>=-2,2,3))))))","v":3}]
["PR225","D225","FAB 225",null,1,null,null,"X","X",null,null,null,null,null,null,null,null,null,null,null,null,null,null,null,null,null,null,null,null,null,"pas d'actualité",{"$f":"IF(ISNUMBER(AE:AE),YEAR(AE:AE),AE:AE)","v":"pas d'actualité"},{"$f":"IF(AE:AE=\"pas d'actualité\",3,IF(AE:AE=\"?\",\"?\",IF(AE:AE=\"?\",\"?\",IF($B$2-AF:AF>=0,0,IF($B$2-AF:AF>=-1,1,IF($B$2-AF:AF>=-2,2,3))))))","v":3},{"$f":"IF(AE:AE=\"pas d'actualité\",3,IF(AE:AE=\"?\",\"?\",IF(AE:AE=\"?\",\"?\",IF((($B$2+1)-AF:AF)>=0,\"0\",IF((($B$2+1)-AF:AF)>=-1,\"1\",IF((($B$2+1)-AF:AF)>=-2,\"2\",\"3\"))))))","v":3},{"$f":"IF(AE:AE=\"pas d'actualité\",3,IF(AE:AE=\"?\",\"?\",IF(AE:AE=\"?\",\"?\",IF((($B$2+2)-AF:AF)>=0,0,IF((($B$2+2)-AF:AF)>=-1,1,IF((($B$2+2)-AF:AF)>=-2,2,3))))))","v":3},{"$f":"IF(AE:AE=\"pas d'actualité\",3,IF(AE:AE=\"?\",\"?\",IF(AE:AE=\"?\",\"?\",IF(($B$2+3)-AF:AF>=0,0,IF(($B$2+3)-AF:AF>=-1,1,IF(($B$2+3)-AF:AF>=-2,2,3))))))","v":3},{"$f":"IF(AE:AE=\"pas d'actualité\",3,IF(AE:AE=\"?\",\"?\",IF(AE:AE=\"?\",\"?\",IF(($B$2+4)-AF:AF>=0,0,IF(($B$2+4)-AF:AF>=-1,1,IF(($B$2+4)-AF:AF>=-2,2,3))))))","v":3}]
["PR226","D226","FAB 226",null,10,null,null,"X","X",null,null,null,null,null,null,null,null,null,null,null,null,null,null,null,null,null,null,null,null,null,"pas d'actualité",{"$f":"IF(ISNUMBER(AE:AE),YEAR(AE:AE),AE:AE)","v":"pas d'actualité"},{"$f":"IF(AE:AE=\"pas d'actualité\",3,IF(AE:AE=\"?\",\"?\",IF(AE:AE=\"?\",\"?\",IF($B$2-AF:AF>=0,0,IF($B$2-AF:AF>=-1,1,IF($B$2-AF:AF>=-2,2,3))))))","v":3},{"$f":"IF(AE:AE=\"pas d'actualité\",3,IF(AE:AE=\"?\",\"?\",IF(AE:AE=\"?\",\"?\",IF((($B$2+1)-AF:AF)>=0,\"0\",IF((($B$2+1)-AF:AF)>=-1,\"1\",IF((($B$2+1)-AF:AF)>=-2,\"2\",\"3\"))))))","v":3},{"$f":"IF(AE:AE=\"pas d'actualité\",3,IF(AE:AE=\"?\",\"?\",IF(AE:AE=\"?\",\"?\",IF((($B$2+2)-AF:AF)>=0,0,IF((($B$2+2)-AF:AF)>=-1,1,IF((($B$2+2)-AF:AF)>=-2,2,3))))))","v":3},{"$f":"IF(AE:AE=\"pas d'actualité\",3,IF(AE:AE=\"?\",\"?\",IF(AE:AE=\"?\",\"?\",IF(($B$2+3)-AF:AF>=0,0,IF(($B$2+3)-AF:AF>=-1,1,IF(($B$2+3)-AF:AF>=-2,2,3))))))","v":3},{"$f":"IF(AE:AE=\"pas d'actualité\",3,IF(AE:AE=\"?\",\"?\",IF(AE:AE=\"?\",\"?\",IF(($B$2+4)-AF:AF>=0,0,IF(($B$2+4)-AF:AF>=-1,1,IF(($B$2+4)-AF:AF>=-2,2,3))))))","v":3}]
["PR227","D227","FAB 227",null,5,null,null,"X","X",null,null,null,null,null,null,null,null,null,null,null,null,null,null,null,null,null,null,null,null,null,"pas d'actualité",{"$f":"IF(ISNUMBER(AE:AE),YEAR(AE:AE),AE:AE)","v":"pas d'actualité"},{"$f":"IF(AE:AE=\"pas d'actualité\",3,IF(AE:AE=\"?\",\"?\",IF(AE:AE=\"?\",\"?\",IF($B$2-AF:AF>=0,0,IF($B$2-AF:AF>=-1,1,IF($B$2-AF:AF>=-2,2,3))))))","v":3},{"$f":"IF(AE:AE=\"pas d'actualité\",3,IF(AE:AE=\"?\",\"?\",IF(AE:AE=\"?\",\"?\",IF((($B$2+1)-AF:AF)>=0,\"0\",IF((($B$2+1)-AF:AF)>=-1,\"1\",IF((($B$2+1)-AF:AF)>=-2,\"2\",\"3\"))))))","v":3},{"$f":"IF(AE:AE=\"pas d'actualité\",3,IF(AE:AE=\"?\",\"?\",IF(AE:AE=\"?\",\"?\",IF((($B$2+2)-AF:AF)>=0,0,IF((($B$2+2)-AF:AF)>=-1,1,IF((($B$2+2)-AF:AF)>=-2,2,3))))))","v":3},{"$f":"IF(AE:AE=\"pas d'actualité\",3,IF(AE:AE=\"?\",\"?\",IF(AE:AE=\"?\",\"?\",IF(($B$2+3)-AF:AF>=0,0,IF(($B$2+3)-AF:AF>=-1,1,IF(($B$2+3)-AF:AF>=-2,2,3))))))","v":3},{"$f":"IF(AE:AE=\"pas d'actualité\",3,IF(AE:AE=\"?\",\"?\",IF(AE:AE=\"?\",\"?\",IF(($B$2+4)-AF:AF>=0,0,IF(($B$2+4)-AF:AF>=-1,1,IF(($B$2+4)-AF:AF>=-2,2,3))))))","v":3}]
["PR228","D228","FAB 228",null,0,null,null,null,null,null,null,null,null,null,null,null,null,null,null,null,null,null,null,null,null,null,null,null,null,null,"pas d'actualité",{"$f":"IF(ISNUMBER(AE:AE),YEAR(AE:AE),AE:AE)","v":"pas d'actualité"},{"$f":"IF(AE:AE=\"pas d'actualité\",3,IF(AE:AE=\"?\",\"?\",IF(AE:AE=\"?\",\"?\",IF($B$2-AF:AF>=0,0,IF($B$2-AF:AF>=-1,1,IF($B$2-AF:AF>=-2,2,3))))))","v":3},{"$f":"IF(AE:AE=\"pas d'actualité\",3,IF(AE:AE=\"?\",\"?\",IF(AE:AE=\"?\",\"?\",IF((($B$2+1)-AF:AF)>=0,\"0\",IF((($B$2+1)-AF:AF)>=-1,\"1\",IF((($B$2+1)-AF:AF)>=-2,\"2\",\"3\"))))))","v":3},{"$f":"IF(AE:AE=\"pas d'actualité\",3,IF(AE:AE=\"?\",\"?\",IF(AE:AE=\"?\",\"?\",IF((($B$2+2)-AF:AF)>=0,0,IF((($B$2+2)-AF:AF)>=-1,1,IF((($B$2+2)-AF:AF)>=-2,2,3))))))","v":3},{"$f":"IF(AE:AE=\"pas d'actualité\",3,IF(AE:AE=\"?\",\"?\",IF(AE:AE=\"?\",\"?\",IF(($B$2+3)-AF:AF>=0,0,IF(($B$2+3)-AF:AF>=-1,1,IF(($B$2+3)-AF:AF>=-2,2,3))))))","v":3},{"$f":"IF(AE:AE=\"pas d'actualité\",3,IF(AE:AE=\"?\",\"?\",IF(AE:AE=\"?\",\"?\",IF(($B$2+4)-AF:AF>=0,0,IF(($B$2+4)-AF:AF>=-1,1,IF(($B$2+4)-AF:AF>=-2,2,3))))))","v":3}]
["PR229","D229","FAB 229",null,null,null,null,null,null,null,null,null,null,null,null,null,null,null,null,null,null,null,null,null,null,null,null,null,null,null,"pas d'actualité",{"$f":"IF(ISNUMBER(AE:AE),YEAR(AE:AE),AE:AE)","v":"pas d'actualité"},{"$f":"IF(AE:AE=\"pas d'actualité\",3,IF(AE:AE=\"?\",\"?\",IF(AE:AE=\"?\",\"?\",IF($B$2-AF:AF>=0,0,IF($B$2-AF:AF>=-1,1,IF($B$2-AF:AF>=-2,2,3))))))","v":3},{"$f":"IF(AE:AE=\"pas d'actualité\",3,IF(AE:AE=\"?\",\"?\",IF(AE:AE=\"?\",\"?\",IF((($B$2+1)-AF:AF)>=0,\"0\",IF((($B$2+1)-AF:AF)>=-1,\"1\",IF((($B$2+1)-AF:AF)>=-2,\"2\",\"3\"))))))","v":3},{"$f":"IF(AE:AE=\"pas d'actualité\",3,IF(AE:AE=\"?\",\"?\",IF(AE:AE=\"?\",\"?\",IF((($B$2+2)-AF:AF)>=0,0,IF((($B$2+2)-AF:AF)>=-1,1,IF((($B$2+2)-AF:AF)>=-2,2,3))))))","v":3},{"$f":"IF(AE:AE=\"pas d'actualité\",3,IF(AE:AE=\"?\",\"?\",IF(AE:AE=\"?\",\"?\",IF(($B$2+3)-AF:AF>=0,0,IF(($B$2+3)-AF:AF>=-1,1,IF(($B$2+3)-AF:AF>=-2,2,3))))))","v":3},{"$f":"IF(AE:AE=\"pas d'actualité\",3,IF(AE:AE=\"?\",\"?\",IF(AE:AE=\"?\",\"?\",IF(($B$2+4)-AF:AF>=0,0,IF(($B$2+4)-AF:AF>=-1,1,IF(($B$2+4)-AF:AF>=-2,2,3))))))","v":3},null,null,"Annonce d'\u0092abandon du produit\n15/11/2013"]
["PR230","D230","FAB 230",null,null,null,null,null,null,null,null,null,null,null,null,null,null,null,null,null,null,null,null,null,null,null,null,null,null,null,"pas d'actualité",{"$f":"IF(ISNUMBER(AE:AE),YEAR(AE:AE),AE:AE)","v":"pas d'actualité"},{"$f":"IF(AE:AE=\"pas d'actualité\",3,IF(AE:AE=\"?\",\"?\",IF(AE:AE=\"?\",\"?\",IF($B$2-AF:AF>=0,0,IF($B$2-AF:AF>=-1,1,IF($B$2-AF:AF>=-2,2,3))))))","v":3},{"$f":"IF(AE:AE=\"pas d'actualité\",3,IF(AE:AE=\"?\",\"?\",IF(AE:AE=\"?\",\"?\",IF((($B$2+1)-AF:AF)>=0,\"0\",IF((($B$2+1)-AF:AF)>=-1,\"1\",IF((($B$2+1)-AF:AF)>=-2,\"2\",\"3\"))))))","v":3},{"$f":"IF(AE:AE=\"pas d'actualité\",3,IF(AE:AE=\"?\",\"?\",IF(AE:AE=\"?\",\"?\",IF((($B$2+2)-AF:AF)>=0,0,IF((($B$2+2)-AF:AF)>=-1,1,IF((($B$2+2)-AF:AF)>=-2,2,3))))))","v":3},{"$f":"IF(AE:AE=\"pas d'actualité\",3,IF(AE:AE=\"?\",\"?\",IF(AE:AE=\"?\",\"?\",IF(($B$2+3)-AF:AF>=0,0,IF(($B$2+3)-AF:AF>=-1,1,IF(($B$2+3)-AF:AF>=-2,2,3))))))","v":3},{"$f":"IF(AE:AE=\"pas d'actualité\",3,IF(AE:AE=\"?\",\"?\",IF(AE:AE=\"?\",\"?\",IF(($B$2+4)-AF:AF>=0,0,IF(($B$2+4)-AF:AF>=-1,1,IF(($B$2+4)-AF:AF>=-2,2,3))))))","v":3},null,null,"Annonce d'\u0092abandon du produit\n15/11/2013"]
["PR231","D231","FAB 231",null,null,null,null,null,null,null,null,null,null,null,null,null,null,null,null,null,null,null,null,null,null,null,null,null,null,null,"pas d'actualité",{"$f":"IF(ISNUMBER(AE:AE),YEAR(AE:AE),AE:AE)","v":"pas d'actualité"},{"$f":"IF(AE:AE=\"pas d'actualité\",3,IF(AE:AE=\"?\",\"?\",IF(AE:AE=\"?\",\"?\",IF($B$2-AF:AF>=0,0,IF($B$2-AF:AF>=-1,1,IF($B$2-AF:AF>=-2,2,3))))))","v":3},{"$f":"IF(AE:AE=\"pas d'actualité\",3,IF(AE:AE=\"?\",\"?\",IF(AE:AE=\"?\",\"?\",IF((($B$2+1)-AF:AF)>=0,\"0\",IF((($B$2+1)-AF:AF)>=-1,\"1\",IF((($B$2+1)-AF:AF)>=-2,\"2\",\"3\"))))))","v":3},{"$f":"IF(AE:AE=\"pas d'actualité\",3,IF(AE:AE=\"?\",\"?\",IF(AE:AE=\"?\",\"?\",IF((($B$2+2)-AF:AF)>=0,0,IF((($B$2+2)-AF:AF)>=-1,1,IF((($B$2+2)-AF:AF)>=-2,2,3))))))","v":3},{"$f":"IF(AE:AE=\"pas d'actualité\",3,IF(AE:AE=\"?\",\"?\",IF(AE:AE=\"?\",\"?\",IF(($B$2+3)-AF:AF>=0,0,IF(($B$2+3)-AF:AF>=-1,1,IF(($B$2+3)-AF:AF>=-2,2,3))))))","v":3},{"$f":"IF(AE:AE=\"pas d'actualité\",3,IF(AE:AE=\"?\",\"?\",IF(AE:AE=\"?\",\"?\",IF(($B$2+4)-AF:AF>=0,0,IF(($B$2+4)-AF:AF>=-1,1,IF(($B$2+4)-AF:AF>=-2,2,3))))))","v":3},null,null,"Annonce d'\u0092abandon du produit\n15/11/2013"]
["PR232","D232","FAB 232",null,null,null,null,null,null,null,null,null,null,null,null,null,null,null,null,null,null,null,null,null,null,null,null,null,null,null,"pas d'actualité",{"$f":"IF(ISNUMBER(AE:AE),YEAR(AE:AE),AE:AE)","v":"pas d'actualité"},{"$f":"IF(AE:AE=\"pas d'actualité\",3,IF(AE:AE=\"?\",\"?\",IF(AE:AE=\"?\",\"?\",IF($B$2-AF:AF>=0,0,IF($B$2-AF:AF>=-1,1,IF($B$2-AF:AF>=-2,2,3))))))","v":3},{"$f":"IF(AE:AE=\"pas d'actualité\",3,IF(AE:AE=\"?\",\"?\",IF(AE:AE=\"?\",\"?\",IF((($B$2+1)-AF:AF)>=0,\"0\",IF((($B$2+1)-AF:AF)>=-1,\"1\",IF((($B$2+1)-AF:AF)>=-2,\"2\",\"3\"))))))","v":3},{"$f":"IF(AE:AE=\"pas d'actualité\",3,IF(AE:AE=\"?\",\"?\",IF(AE:AE=\"?\",\"?\",IF((($B$2+2)-AF:AF)>=0,0,IF((($B$2+2)-AF:AF)>=-1,1,IF((($B$2+2)-AF:AF)>=-2,2,3))))))","v":3},{"$f":"IF(AE:AE=\"pas d'actualité\",3,IF(AE:AE=\"?\",\"?\",IF(AE:AE=\"?\",\"?\",IF(($B$2+3)-AF:AF>=0,0,IF(($B$2+3)-AF:AF>=-1,1,IF(($B$2+3)-AF:AF>=-2,2,3))))))","v":3},{"$f":"IF(AE:AE=\"pas d'actualité\",3,IF(AE:AE=\"?\",\"?\",IF(AE:AE=\"?\",\"?\",IF(($B$2+4)-AF:AF>=0,0,IF(($B$2+4)-AF:AF>=-1,1,IF(($B$2+4)-AF:AF>=-2,2,3))))))","v":3},null,null,"Annonce d'\u0092abandon du produit\n15/11/2013"]
["PR233","D233","FAB 233",null,null,null,null,null,null,null,null,null,null,null,null,null,null,null,null,null,null,null,null,null,null,null,null,null,null,null,"pas d'actualité",{"$f":"IF(ISNUMBER(AE:AE),YEAR(AE:AE),AE:AE)","v":"pas d'actualité"},{"$f":"IF(AE:AE=\"pas d'actualité\",3,IF(AE:AE=\"?\",\"?\",IF(AE:AE=\"?\",\"?\",IF($B$2-AF:AF>=0,0,IF($B$2-AF:AF>=-1,1,IF($B$2-AF:AF>=-2,2,3))))))","v":3},{"$f":"IF(AE:AE=\"pas d'actualité\",3,IF(AE:AE=\"?\",\"?\",IF(AE:AE=\"?\",\"?\",IF((($B$2+1)-AF:AF)>=0,\"0\",IF((($B$2+1)-AF:AF)>=-1,\"1\",IF((($B$2+1)-AF:AF)>=-2,\"2\",\"3\"))))))","v":3},{"$f":"IF(AE:AE=\"pas d'actualité\",3,IF(AE:AE=\"?\",\"?\",IF(AE:AE=\"?\",\"?\",IF((($B$2+2)-AF:AF)>=0,0,IF((($B$2+2)-AF:AF)>=-1,1,IF((($B$2+2)-AF:AF)>=-2,2,3))))))","v":3},{"$f":"IF(AE:AE=\"pas d'actualité\",3,IF(AE:AE=\"?\",\"?\",IF(AE:AE=\"?\",\"?\",IF(($B$2+3)-AF:AF>=0,0,IF(($B$2+3)-AF:AF>=-1,1,IF(($B$2+3)-AF:AF>=-2,2,3))))))","v":3},{"$f":"IF(AE:AE=\"pas d'actualité\",3,IF(AE:AE=\"?\",\"?\",IF(AE:AE=\"?\",\"?\",IF(($B$2+4)-AF:AF>=0,0,IF(($B$2+4)-AF:AF>=-1,1,IF(($B$2+4)-AF:AF>=-2,2,3))))))","v":3},null,null,"Annonce d'\u0092abandon du produit\n15/11/2013"]
["PR234","D234","FAB 234",null,null,null,null,null,null,null,null,null,null,null,null,null,null,null,null,null,null,null,null,null,null,null,null,null,null,null,"pas d'actualité",{"$f":"IF(ISNUMBER(AE:AE),YEAR(AE:AE),AE:AE)","v":"pas d'actualité"},{"$f":"IF(AE:AE=\"pas d'actualité\",3,IF(AE:AE=\"?\",\"?\",IF(AE:AE=\"?\",\"?\",IF($B$2-AF:AF>=0,0,IF($B$2-AF:AF>=-1,1,IF($B$2-AF:AF>=-2,2,3))))))","v":3},{"$f":"IF(AE:AE=\"pas d'actualité\",3,IF(AE:AE=\"?\",\"?\",IF(AE:AE=\"?\",\"?\",IF((($B$2+1)-AF:AF)>=0,\"0\",IF((($B$2+1)-AF:AF)>=-1,\"1\",IF((($B$2+1)-AF:AF)>=-2,\"2\",\"3\"))))))","v":3},{"$f":"IF(AE:AE=\"pas d'actualité\",3,IF(AE:AE=\"?\",\"?\",IF(AE:AE=\"?\",\"?\",IF((($B$2+2)-AF:AF)>=0,0,IF((($B$2+2)-AF:AF)>=-1,1,IF((($B$2+2)-AF:AF)>=-2,2,3))))))","v":3},{"$f":"IF(AE:AE=\"pas d'actualité\",3,IF(AE:AE=\"?\",\"?\",IF(AE:AE=\"?\",\"?\",IF(($B$2+3)-AF:AF>=0,0,IF(($B$2+3)-AF:AF>=-1,1,IF(($B$2+3)-AF:AF>=-2,2,3))))))","v":3},{"$f":"IF(AE:AE=\"pas d'actualité\",3,IF(AE:AE=\"?\",\"?\",IF(AE:AE=\"?\",\"?\",IF(($B$2+4)-AF:AF>=0,0,IF(($B$2+4)-AF:AF>=-1,1,IF(($B$2+4)-AF:AF>=-2,2,3))))))","v":3},null,null,"Annonce d'\u0092abandon du produit\n15/11/2013"]
["PR235","D235","FAB 235",null,null,null,null,null,null,null,null,null,null,null,null,null,null,null,null,null,null,null,null,null,null,null,null,null,null,null,"pas d'actualité",{"$f":"IF(ISNUMBER(AE:AE),YEAR(AE:AE),AE:AE)","v":"pas d'actualité"},{"$f":"IF(AE:AE=\"pas d'actualité\",3,IF(AE:AE=\"?\",\"?\",IF(AE:AE=\"?\",\"?\",IF($B$2-AF:AF>=0,0,IF($B$2-AF:AF>=-1,1,IF($B$2-AF:AF>=-2,2,3))))))","v":3},{"$f":"IF(AE:AE=\"pas d'actualité\",3,IF(AE:AE=\"?\",\"?\",IF(AE:AE=\"?\",\"?\",IF((($B$2+1)-AF:AF)>=0,\"0\",IF((($B$2+1)-AF:AF)>=-1,\"1\",IF((($B$2+1)-AF:AF)>=-2,\"2\",\"3\"))))))","v":3},{"$f":"IF(AE:AE=\"pas d'actualité\",3,IF(AE:AE=\"?\",\"?\",IF(AE:AE=\"?\",\"?\",IF((($B$2+2)-AF:AF)>=0,0,IF((($B$2+2)-AF:AF)>=-1,1,IF((($B$2+2)-AF:AF)>=-2,2,3))))))","v":3},{"$f":"IF(AE:AE=\"pas d'actualité\",3,IF(AE:AE=\"?\",\"?\",IF(AE:AE=\"?\",\"?\",IF(($B$2+3)-AF:AF>=0,0,IF(($B$2+3)-AF:AF>=-1,1,IF(($B$2+3)-AF:AF>=-2,2,3))))))","v":3},{"$f":"IF(AE:AE=\"pas d'actualité\",3,IF(AE:AE=\"?\",\"?\",IF(AE:AE=\"?\",\"?\",IF(($B$2+4)-AF:AF>=0,0,IF(($B$2+4)-AF:AF>=-1,1,IF(($B$2+4)-AF:AF>=-2,2,3))))))","v":3},null,null,"Annonce d'\u0092abandon du produit\n15/11/2013"]
["PR236","D236","FAB 236",null,1,null,null,null,null,null,null,null,null,null,null,null,null,null,null,null,null,null,null,null,null,null,null,"X",null,null,"2022-01-10",{"$f":"IF(ISNUMBER(AE:AE),YEAR(AE:AE),AE:AE)","v":2022},{"$f":"IF(AE:AE=\"pas d'actualité\",3,IF(AE:AE=\"?\",\"?\",IF(AE:AE=\"?\",\"?\",IF($B$2-AF:AF>=0,0,IF($B$2-AF:AF>=-1,1,IF($B$2-AF:AF>=-2,2,3))))))","v":3},{"$f":"IF(AE:AE=\"pas d'actualité\",3,IF(AE:AE=\"?\",\"?\",IF(AE:AE=\"?\",\"?\",IF((($B$2+1)-AF:AF)>=0,\"0\",IF((($B$2+1)-AF:AF)>=-1,\"1\",IF((($B$2+1)-AF:AF)>=-2,\"2\",\"3\"))))))","v":"3"},{"$f":"IF(AE:AE=\"pas d'actualité\",3,IF(AE:AE=\"?\",\"?\",IF(AE:AE=\"?\",\"?\",IF((($B$2+2)-AF:AF)>=0,0,IF((($B$2+2)-AF:AF)>=-1,1,IF((($B$2+2)-AF:AF)>=-2,2,3))))))","v":3},{"$f":"IF(AE:AE=\"pas d'actualité\",3,IF(AE:AE=\"?\",\"?\",IF(AE:AE=\"?\",\"?\",IF(($B$2+3)-AF:AF>=0,0,IF(($B$2+3)-AF:AF>=-1,1,IF(($B$2+3)-AF:AF>=-2,2,3))))))","v":3},{"$f":"IF(AE:AE=\"pas d'actualité\",3,IF(AE:AE=\"?\",\"?\",IF(AE:AE=\"?\",\"?\",IF(($B$2+4)-AF:AF>=0,0,IF(($B$2+4)-AF:AF>=-1,1,IF(($B$2+4)-AF:AF>=-2,2,3))))))","v":2},null,null,"Annonce abandon du produit 01/10/2012\nRéparation et pièces détachées garanties jusq. 01/10/2022"]
["PR237","D237","FAB 237",null,1,null,null,"X","X",null,null,null,null,null,null,null,null,null,null,null,null,null,null,null,null,null,null,null,null,null,"pas d'actualité",{"$f":"IF(ISNUMBER(AE:AE),YEAR(AE:AE),AE:AE)","v":"pas d'actualité"},{"$f":"IF(AE:AE=\"pas d'actualité\",3,IF(AE:AE=\"?\",\"?\",IF(AE:AE=\"?\",\"?\",IF($B$2-AF:AF>=0,0,IF($B$2-AF:AF>=-1,1,IF($B$2-AF:AF>=-2,2,3))))))","v":3},{"$f":"IF(AE:AE=\"pas d'actualité\",3,IF(AE:AE=\"?\",\"?\",IF(AE:AE=\"?\",\"?\",IF((($B$2+1)-AF:AF)>=0,\"0\",IF((($B$2+1)-AF:AF)>=-1,\"1\",IF((($B$2+1)-AF:AF)>=-2,\"2\",\"3\"))))))","v":3},{"$f":"IF(AE:AE=\"pas d'actualité\",3,IF(AE:AE=\"?\",\"?\",IF(AE:AE=\"?\",\"?\",IF((($B$2+2)-AF:AF)>=0,0,IF((($B$2+2)-AF:AF)>=-1,1,IF((($B$2+2)-AF:AF)>=-2,2,3))))))","v":3},{"$f":"IF(AE:AE=\"pas d'actualité\",3,IF(AE:AE=\"?\",\"?\",IF(AE:AE=\"?\",\"?\",IF(($B$2+3)-AF:AF>=0,0,IF(($B$2+3)-AF:AF>=-1,1,IF(($B$2+3)-AF:AF>=-2,2,3))))))","v":3},{"$f":"IF(AE:AE=\"pas d'actualité\",3,IF(AE:AE=\"?\",\"?\",IF(AE:AE=\"?\",\"?\",IF(($B$2+4)-AF:AF>=0,0,IF(($B$2+4)-AF:AF>=-1,1,IF(($B$2+4)-AF:AF>=-2,2,3))))))","v":3}]
["PR238","D238","FAB 238",null,1,null,null,"X",null,null,null,null,null,null,null,null,null,null,null,null,null,null,null,null,null,null,null,null,null,null,"pas d'actualité",{"$f":"IF(ISNUMBER(AE:AE),YEAR(AE:AE),AE:AE)","v":"pas d'actualité"},{"$f":"IF(AE:AE=\"pas d'actualité\",3,IF(AE:AE=\"?\",\"?\",IF(AE:AE=\"?\",\"?\",IF($B$2-AF:AF>=0,0,IF($B$2-AF:AF>=-1,1,IF($B$2-AF:AF>=-2,2,3))))))","v":3},{"$f":"IF(AE:AE=\"pas d'actualité\",3,IF(AE:AE=\"?\",\"?\",IF(AE:AE=\"?\",\"?\",IF((($B$2+1)-AF:AF)>=0,\"0\",IF((($B$2+1)-AF:AF)>=-1,\"1\",IF((($B$2+1)-AF:AF)>=-2,\"2\",\"3\"))))))","v":3},{"$f":"IF(AE:AE=\"pas d'actualité\",3,IF(AE:AE=\"?\",\"?\",IF(AE:AE=\"?\",\"?\",IF((($B$2+2)-AF:AF)>=0,0,IF((($B$2+2)-AF:AF)>=-1,1,IF((($B$2+2)-AF:AF)>=-2,2,3))))))","v":3},{"$f":"IF(AE:AE=\"pas d'actualité\",3,IF(AE:AE=\"?\",\"?\",IF(AE:AE=\"?\",\"?\",IF(($B$2+3)-AF:AF>=0,0,IF(($B$2+3)-AF:AF>=-1,1,IF(($B$2+3)-AF:AF>=-2,2,3))))))","v":3},{"$f":"IF(AE:AE=\"pas d'actualité\",3,IF(AE:AE=\"?\",\"?\",IF(AE:AE=\"?\",\"?\",IF(($B$2+4)-AF:AF>=0,0,IF(($B$2+4)-AF:AF>=-1,1,IF(($B$2+4)-AF:AF>=-2,2,3))))))","v":3}]
["PR239","D239","FAB 239",null,1,null,null,"X","X",null,null,null,null,null,null,null,null,null,null,null,null,null,null,null,null,null,null,null,null,null,"pas d'actualité",{"$f":"IF(ISNUMBER(AE:AE),YEAR(AE:AE),AE:AE)","v":"pas d'actualité"},{"$f":"IF(AE:AE=\"pas d'actualité\",3,IF(AE:AE=\"?\",\"?\",IF(AE:AE=\"?\",\"?\",IF($B$2-AF:AF>=0,0,IF($B$2-AF:AF>=-1,1,IF($B$2-AF:AF>=-2,2,3))))))","v":3},{"$f":"IF(AE:AE=\"pas d'actualité\",3,IF(AE:AE=\"?\",\"?\",IF(AE:AE=\"?\",\"?\",IF((($B$2+1)-AF:AF)>=0,\"0\",IF((($B$2+1)-AF:AF)>=-1,\"1\",IF((($B$2+1)-AF:AF)>=-2,\"2\",\"3\"))))))","v":3},{"$f":"IF(AE:AE=\"pas d'actualité\",3,IF(AE:AE=\"?\",\"?\",IF(AE:AE=\"?\",\"?\",IF((($B$2+2)-AF:AF)>=0,0,IF((($B$2+2)-AF:AF)>=-1,1,IF((($B$2+2)-AF:AF)>=-2,2,3))))))","v":3},{"$f":"IF(AE:AE=\"pas d'actualité\",3,IF(AE:AE=\"?\",\"?\",IF(AE:AE=\"?\",\"?\",IF(($B$2+3)-AF:AF>=0,0,IF(($B$2+3)-AF:AF>=-1,1,IF(($B$2+3)-AF:AF>=-2,2,3))))))","v":3},{"$f":"IF(AE:AE=\"pas d'actualité\",3,IF(AE:AE=\"?\",\"?\",IF(AE:AE=\"?\",\"?\",IF(($B$2+4)-AF:AF>=0,0,IF(($B$2+4)-AF:AF>=-1,1,IF(($B$2+4)-AF:AF>=-2,2,3))))))","v":3}]
["PR240","D240","FAB 240",null,1,null,null,null,null,null,null,null,null,null,null,null,null,null,null,null,null,null,null,null,null,null,null,null,null,null,"pas d'actualité",{"$f":"IF(ISNUMBER(AE:AE),YEAR(AE:AE),AE:AE)","v":"pas d'actualité"},{"$f":"IF(AE:AE=\"pas d'actualité\",3,IF(AE:AE=\"?\",\"?\",IF(AE:AE=\"?\",\"?\",IF($B$2-AF:AF>=0,0,IF($B$2-AF:AF>=-1,1,IF($B$2-AF:AF>=-2,2,3))))))","v":3},{"$f":"IF(AE:AE=\"pas d'actualité\",3,IF(AE:AE=\"?\",\"?\",IF(AE:AE=\"?\",\"?\",IF((($B$2+1)-AF:AF)>=0,\"0\",IF((($B$2+1)-AF:AF)>=-1,\"1\",IF((($B$2+1)-AF:AF)>=-2,\"2\",\"3\"))))))","v":3},{"$f":"IF(AE:AE=\"pas d'actualité\",3,IF(AE:AE=\"?\",\"?\",IF(AE:AE=\"?\",\"?\",IF((($B$2+2)-AF:AF)>=0,0,IF((($B$2+2)-AF:AF)>=-1,1,IF((($B$2+2)-AF:AF)>=-2,2,3))))))","v":3},{"$f":"IF(AE:AE=\"pas d'actualité\",3,IF(AE:AE=\"?\",\"?\",IF(AE:AE=\"?\",\"?\",IF(($B$2+3)-AF:AF>=0,0,IF(($B$2+3)-AF:AF>=-1,1,IF(($B$2+3)-AF:AF>=-2,2,3))))))","v":3},{"$f":"IF(AE:AE=\"pas d'actualité\",3,IF(AE:AE=\"?\",\"?\",IF(AE:AE=\"?\",\"?\",IF(($B$2+4)-AF:AF>=0,0,IF(($B$2+4)-AF:AF>=-1,1,IF(($B$2+4)-AF:AF>=-2,2,3))))))","v":3}]
["PR241","D241","FAB 241",null,1,null,null,null,null,null,null,null,null,null,null,null,null,null,null,null,null,null,null,null,null,"X",null,null,null,null,"pas d'actualité",{"$f":"IF(ISNUMBER(AE:AE),YEAR(AE:AE),AE:AE)","v":"pas d'actualité"},{"$f":"IF(AE:AE=\"pas d'actualité\",3,IF(AE:AE=\"?\",\"?\",IF(AE:AE=\"?\",\"?\",IF($B$2-AF:AF>=0,0,IF($B$2-AF:AF>=-1,1,IF($B$2-AF:AF>=-2,2,3))))))","v":3},{"$f":"IF(AE:AE=\"pas d'actualité\",3,IF(AE:AE=\"?\",\"?\",IF(AE:AE=\"?\",\"?\",IF((($B$2+1)-AF:AF)>=0,\"0\",IF((($B$2+1)-AF:AF)>=-1,\"1\",IF((($B$2+1)-AF:AF)>=-2,\"2\",\"3\"))))))","v":3},{"$f":"IF(AE:AE=\"pas d'actualité\",3,IF(AE:AE=\"?\",\"?\",IF(AE:AE=\"?\",\"?\",IF((($B$2+2)-AF:AF)>=0,0,IF((($B$2+2)-AF:AF)>=-1,1,IF((($B$2+2)-AF:AF)>=-2,2,3))))))","v":3},{"$f":"IF(AE:AE=\"pas d'actualité\",3,IF(AE:AE=\"?\",\"?\",IF(AE:AE=\"?\",\"?\",IF(($B$2+3)-AF:AF>=0,0,IF(($B$2+3)-AF:AF>=-1,1,IF(($B$2+3)-AF:AF>=-2,2,3))))))","v":3},{"$f":"IF(AE:AE=\"pas d'actualité\",3,IF(AE:AE=\"?\",\"?\",IF(AE:AE=\"?\",\"?\",IF(($B$2+4)-AF:AF>=0,0,IF(($B$2+4)-AF:AF>=-1,1,IF(($B$2+4)-AF:AF>=-2,2,3))))))","v":3}]
["PR242","D242","FAB 242",null,1,null,null,null,null,null,null,null,null,null,null,null,null,null,null,null,null,null,null,null,null,"X",null,null,null,null,"pas d'actualité",{"$f":"IF(ISNUMBER(AE:AE),YEAR(AE:AE),AE:AE)","v":"pas d'actualité"},{"$f":"IF(AE:AE=\"pas d'actualité\",3,IF(AE:AE=\"?\",\"?\",IF(AE:AE=\"?\",\"?\",IF($B$2-AF:AF>=0,0,IF($B$2-AF:AF>=-1,1,IF($B$2-AF:AF>=-2,2,3))))))","v":3},{"$f":"IF(AE:AE=\"pas d'actualité\",3,IF(AE:AE=\"?\",\"?\",IF(AE:AE=\"?\",\"?\",IF((($B$2+1)-AF:AF)>=0,\"0\",IF((($B$2+1)-AF:AF)>=-1,\"1\",IF((($B$2+1)-AF:AF)>=-2,\"2\",\"3\"))))))","v":3},{"$f":"IF(AE:AE=\"pas d'actualité\",3,IF(AE:AE=\"?\",\"?\",IF(AE:AE=\"?\",\"?\",IF((($B$2+2)-AF:AF)>=0,0,IF((($B$2+2)-AF:AF)>=-1,1,IF((($B$2+2)-AF:AF)>=-2,2,3))))))","v":3},{"$f":"IF(AE:AE=\"pas d'actualité\",3,IF(AE:AE=\"?\",\"?\",IF(AE:AE=\"?\",\"?\",IF(($B$2+3)-AF:AF>=0,0,IF(($B$2+3)-AF:AF>=-1,1,IF(($B$2+3)-AF:AF>=-2,2,3))))))","v":3},{"$f":"IF(AE:AE=\"pas d'actualité\",3,IF(AE:AE=\"?\",\"?\",IF(AE:AE=\"?\",\"?\",IF(($B$2+4)-AF:AF>=0,0,IF(($B$2+4)-AF:AF>=-1,1,IF(($B$2+4)-AF:AF>=-2,2,3))))))","v":3}]
["PR243","D243","FAB 243",null,1,null,null,null,null,null,null,null,null,null,null,null,null,"X",null,null,null,null,null,null,null,null,null,null,null,null,"pas d'actualité",{"$f":"IF(ISNUMBER(AE:AE),YEAR(AE:AE),AE:AE)","v":"pas d'actualité"},{"$f":"IF(AE:AE=\"pas d'actualité\",3,IF(AE:AE=\"?\",\"?\",IF(AE:AE=\"?\",\"?\",IF($B$2-AF:AF>=0,0,IF($B$2-AF:AF>=-1,1,IF($B$2-AF:AF>=-2,2,3))))))","v":3},{"$f":"IF(AE:AE=\"pas d'actualité\",3,IF(AE:AE=\"?\",\"?\",IF(AE:AE=\"?\",\"?\",IF((($B$2+1)-AF:AF)>=0,\"0\",IF((($B$2+1)-AF:AF)>=-1,\"1\",IF((($B$2+1)-AF:AF)>=-2,\"2\",\"3\"))))))","v":3},{"$f":"IF(AE:AE=\"pas d'actualité\",3,IF(AE:AE=\"?\",\"?\",IF(AE:AE=\"?\",\"?\",IF((($B$2+2)-AF:AF)>=0,0,IF((($B$2+2)-AF:AF)>=-1,1,IF((($B$2+2)-AF:AF)>=-2,2,3))))))","v":3},{"$f":"IF(AE:AE=\"pas d'actualité\",3,IF(AE:AE=\"?\",\"?\",IF(AE:AE=\"?\",\"?\",IF(($B$2+3)-AF:AF>=0,0,IF(($B$2+3)-AF:AF>=-1,1,IF(($B$2+3)-AF:AF>=-2,2,3))))))","v":3},{"$f":"IF(AE:AE=\"pas d'actualité\",3,IF(AE:AE=\"?\",\"?\",IF(AE:AE=\"?\",\"?\",IF(($B$2+4)-AF:AF>=0,0,IF(($B$2+4)-AF:AF>=-1,1,IF(($B$2+4)-AF:AF>=-2,2,3))))))","v":3}]
["PR244","D244","FAB 244",null,null,null,null,null,null,null,null,null,null,null,null,null,null,null,null,null,null,null,null,null,null,null,null,null,null,null,"2020-01-10",{"$f":"IF(ISNUMBER(AE:AE),YEAR(AE:AE),AE:AE)","v":2020},{"$f":"IF(AE:AE=\"pas d'actualité\",3,IF(AE:AE=\"?\",\"?\",IF(AE:AE=\"?\",\"?\",IF($B$2-AF:AF>=0,0,IF($B$2-AF:AF>=-1,1,IF($B$2-AF:AF>=-2,2,3))))))","v":3},{"$f":"IF(AE:AE=\"pas d'actualité\",3,IF(AE:AE=\"?\",\"?\",IF(AE:AE=\"?\",\"?\",IF((($B$2+1)-AF:AF)>=0,\"0\",IF((($B$2+1)-AF:AF)>=-1,\"1\",IF((($B$2+1)-AF:AF)>=-2,\"2\",\"3\"))))))","v":"3"},{"$f":"IF(AE:AE=\"pas d'actualité\",3,IF(AE:AE=\"?\",\"?\",IF(AE:AE=\"?\",\"?\",IF((($B$2+2)-AF:AF)>=0,0,IF((($B$2+2)-AF:AF)>=-1,1,IF((($B$2+2)-AF:AF)>=-2,2,3))))))","v":2},{"$f":"IF(AE:AE=\"pas d'actualité\",3,IF(AE:AE=\"?\",\"?\",IF(AE:AE=\"?\",\"?\",IF(($B$2+3)-AF:AF>=0,0,IF(($B$2+3)-AF:AF>=-1,1,IF(($B$2+3)-AF:AF>=-2,2,3))))))","v":1},{"$f":"IF(AE:AE=\"pas d'actualité\",3,IF(AE:AE=\"?\",\"?\",IF(AE:AE=\"?\",\"?\",IF(($B$2+4)-AF:AF>=0,0,IF(($B$2+4)-AF:AF>=-1,1,IF(($B$2+4)-AF:AF>=-2,2,3))))))","v":0}]
["PR245","D245","FAB 245",null,null,null,null,null,null,null,null,null,null,null,null,null,null,null,null,null,null,null,null,null,null,null,null,null,null,null,"2020-01-10",{"$f":"IF(ISNUMBER(AE:AE),YEAR(AE:AE),AE:AE)","v":2020},{"$f":"IF(AE:AE=\"pas d'actualité\",3,IF(AE:AE=\"?\",\"?\",IF(AE:AE=\"?\",\"?\",IF($B$2-AF:AF>=0,0,IF($B$2-AF:AF>=-1,1,IF($B$2-AF:AF>=-2,2,3))))))","v":3},{"$f":"IF(AE:AE=\"pas d'actualité\",3,IF(AE:AE=\"?\",\"?\",IF(AE:AE=\"?\",\"?\",IF((($B$2+1)-AF:AF)>=0,\"0\",IF((($B$2+1)-AF:AF)>=-1,\"1\",IF((($B$2+1)-AF:AF)>=-2,\"2\",\"3\"))))))","v":"3"},{"$f":"IF(AE:AE=\"pas d'actualité\",3,IF(AE:AE=\"?\",\"?\",IF(AE:AE=\"?\",\"?\",IF((($B$2+2)-AF:AF)>=0,0,IF((($B$2+2)-AF:AF)>=-1,1,IF((($B$2+2)-AF:AF)>=-2,2,3))))))","v":2},{"$f":"IF(AE:AE=\"pas d'actualité\",3,IF(AE:AE=\"?\",\"?\",IF(AE:AE=\"?\",\"?\",IF(($B$2+3)-AF:AF>=0,0,IF(($B$2+3)-AF:AF>=-1,1,IF(($B$2+3)-AF:AF>=-2,2,3))))))","v":1},{"$f":"IF(AE:AE=\"pas d'actualité\",3,IF(AE:AE=\"?\",\"?\",IF(AE:AE=\"?\",\"?\",IF(($B$2+4)-AF:AF>=0,0,IF(($B$2+4)-AF:AF>=-1,1,IF(($B$2+4)-AF:AF>=-2,2,3))))))","v":0}]
["PR246","D246","FAB 246",null,1,null,null,null,null,null,null,null,null,null,null,null,null,"X",null,null,null,null,null,null,null,null,null,null,null,null,"2020-01-10",{"$f":"IF(ISNUMBER(AE:AE),YEAR(AE:AE),AE:AE)","v":2020},{"$f":"IF(AE:AE=\"pas d'actualité\",3,IF(AE:AE=\"?\",\"?\",IF(AE:AE=\"?\",\"?\",IF($B$2-AF:AF>=0,0,IF($B$2-AF:AF>=-1,1,IF($B$2-AF:AF>=-2,2,3))))))","v":3},{"$f":"IF(AE:AE=\"pas d'actualité\",3,IF(AE:AE=\"?\",\"?\",IF(AE:AE=\"?\",\"?\",IF((($B$2+1)-AF:AF)>=0,\"0\",IF((($B$2+1)-AF:AF)>=-1,\"1\",IF((($B$2+1)-AF:AF)>=-2,\"2\",\"3\"))))))","v":"3"},{"$f":"IF(AE:AE=\"pas d'actualité\",3,IF(AE:AE=\"?\",\"?\",IF(AE:AE=\"?\",\"?\",IF((($B$2+2)-AF:AF)>=0,0,IF((($B$2+2)-AF:AF)>=-1,1,IF((($B$2+2)-AF:AF)>=-2,2,3))))))","v":2},{"$f":"IF(AE:AE=\"pas d'actualité\",3,IF(AE:AE=\"?\",\"?\",IF(AE:AE=\"?\",\"?\",IF(($B$2+3)-AF:AF>=0,0,IF(($B$2+3)-AF:AF>=-1,1,IF(($B$2+3)-AF:AF>=-2,2,3))))))","v":1},{"$f":"IF(AE:AE=\"pas d'actualité\",3,IF(AE:AE=\"?\",\"?\",IF(AE:AE=\"?\",\"?\",IF(($B$2+4)-AF:AF>=0,0,IF(($B$2+4)-AF:AF>=-1,1,IF(($B$2+4)-AF:AF>=-2,2,3))))))","v":0},null,null,"réparable"]
["PR247","D247","FAB 247",null,1,null,null,null,null,null,null,null,null,null,null,null,null,"X",null,null,null,null,null,null,null,null,null,null,null,null,"2020-01-10",{"$f":"IF(ISNUMBER(AE:AE),YEAR(AE:AE),AE:AE)","v":2020},{"$f":"IF(AE:AE=\"pas d'actualité\",3,IF(AE:AE=\"?\",\"?\",IF(AE:AE=\"?\",\"?\",IF($B$2-AF:AF>=0,0,IF($B$2-AF:AF>=-1,1,IF($B$2-AF:AF>=-2,2,3))))))","v":3},{"$f":"IF(AE:AE=\"pas d'actualité\",3,IF(AE:AE=\"?\",\"?\",IF(AE:AE=\"?\",\"?\",IF((($B$2+1)-AF:AF)>=0,\"0\",IF((($B$2+1)-AF:AF)>=-1,\"1\",IF((($B$2+1)-AF:AF)>=-2,\"2\",\"3\"))))))","v":"3"},{"$f":"IF(AE:AE=\"pas d'actualité\",3,IF(AE:AE=\"?\",\"?\",IF(AE:AE=\"?\",\"?\",IF((($B$2+2)-AF:AF)>=0,0,IF((($B$2+2)-AF:AF)>=-1,1,IF((($B$2+2)-AF:AF)>=-2,2,3))))))","v":2},{"$f":"IF(AE:AE=\"pas d'actualité\",3,IF(AE:AE=\"?\",\"?\",IF(AE:AE=\"?\",\"?\",IF(($B$2+3)-AF:AF>=0,0,IF(($B$2+3)-AF:AF>=-1,1,IF(($B$2+3)-AF:AF>=-2,2,3))))))","v":1},{"$f":"IF(AE:AE=\"pas d'actualité\",3,IF(AE:AE=\"?\",\"?\",IF(AE:AE=\"?\",\"?\",IF(($B$2+4)-AF:AF>=0,0,IF(($B$2+4)-AF:AF>=-1,1,IF(($B$2+4)-AF:AF>=-2,2,3))))))","v":0}]
["PR248","D248","FAB 248",null,1,null,null,null,null,null,null,null,null,null,null,null,null,"X",null,null,null,null,null,null,null,null,null,null,null,null,"2020-01-10",{"$f":"IF(ISNUMBER(AE:AE),YEAR(AE:AE),AE:AE)","v":2020},{"$f":"IF(AE:AE=\"pas d'actualité\",3,IF(AE:AE=\"?\",\"?\",IF(AE:AE=\"?\",\"?\",IF($B$2-AF:AF>=0,0,IF($B$2-AF:AF>=-1,1,IF($B$2-AF:AF>=-2,2,3))))))","v":3},{"$f":"IF(AE:AE=\"pas d'actualité\",3,IF(AE:AE=\"?\",\"?\",IF(AE:AE=\"?\",\"?\",IF((($B$2+1)-AF:AF)>=0,\"0\",IF((($B$2+1)-AF:AF)>=-1,\"1\",IF((($B$2+1)-AF:AF)>=-2,\"2\",\"3\"))))))","v":"3"},{"$f":"IF(AE:AE=\"pas d'actualité\",3,IF(AE:AE=\"?\",\"?\",IF(AE:AE=\"?\",\"?\",IF((($B$2+2)-AF:AF)>=0,0,IF((($B$2+2)-AF:AF)>=-1,1,IF((($B$2+2)-AF:AF)>=-2,2,3))))))","v":2},{"$f":"IF(AE:AE=\"pas d'actualité\",3,IF(AE:AE=\"?\",\"?\",IF(AE:AE=\"?\",\"?\",IF(($B$2+3)-AF:AF>=0,0,IF(($B$2+3)-AF:AF>=-1,1,IF(($B$2+3)-AF:AF>=-2,2,3))))))","v":1},{"$f":"IF(AE:AE=\"pas d'actualité\",3,IF(AE:AE=\"?\",\"?\",IF(AE:AE=\"?\",\"?\",IF(($B$2+4)-AF:AF>=0,0,IF(($B$2+4)-AF:AF>=-1,1,IF(($B$2+4)-AF:AF>=-2,2,3))))))","v":0}]
["PR249","D249","FAB 249",null,1,null,null,null,null,null,null,null,null,null,null,null,null,"X",null,null,null,null,null,null,null,null,null,null,null,null,"2020-01-10",{"$f":"IF(ISNUMBER(AE:AE),YEAR(AE:AE),AE:AE)","v":2020},{"$f":"IF(AE:AE=\"pas d'actualité\",3,IF(AE:AE=\"?\",\"?\",IF(AE:AE=\"?\",\"?\",IF($B$2-AF:AF>=0,0,IF($B$2-AF:AF>=-1,1,IF($B$2-AF:AF>=-2,2,3))))))","v":3},{"$f":"IF(AE:AE=\"pas d'actualité\",3,IF(AE:AE=\"?\",\"?\",IF(AE:AE=\"?\",\"?\",IF((($B$2+1)-AF:AF)>=0,\"0\",IF((($B$2+1)-AF:AF)>=-1,\"1\",IF((($B$2+1)-AF:AF)>=-2,\"2\",\"3\"))))))","v":"3"},{"$f":"IF(AE:AE=\"pas d'actualité\",3,IF(AE:AE=\"?\",\"?\",IF(AE:AE=\"?\",\"?\",IF((($B$2+2)-AF:AF)>=0,0,IF((($B$2+2)-AF:AF)>=-1,1,IF((($B$2+2)-AF:AF)>=-2,2,3))))))","v":2},{"$f":"IF(AE:AE=\"pas d'actualité\",3,IF(AE:AE=\"?\",\"?\",IF(AE:AE=\"?\",\"?\",IF(($B$2+3)-AF:AF>=0,0,IF(($B$2+3)-AF:AF>=-1,1,IF(($B$2+3)-AF:AF>=-2,2,3))))))","v":1},{"$f":"IF(AE:AE=\"pas d'actualité\",3,IF(AE:AE=\"?\",\"?\",IF(AE:AE=\"?\",\"?\",IF(($B$2+4)-AF:AF>=0,0,IF(($B$2+4)-AF:AF>=-1,1,IF(($B$2+4)-AF:AF>=-2,2,3))))))","v":0}]
["PR250","D250","FAB 250",null,1,null,null,null,null,null,null,null,null,null,null,null,null,null,null,null,null,null,null,null,null,null,null,null,null,null,"2020-01-10",{"$f":"IF(ISNUMBER(AE:AE),YEAR(AE:AE),AE:AE)","v":2020},{"$f":"IF(AE:AE=\"pas d'actualité\",3,IF(AE:AE=\"?\",\"?\",IF(AE:AE=\"?\",\"?\",IF($B$2-AF:AF>=0,0,IF($B$2-AF:AF>=-1,1,IF($B$2-AF:AF>=-2,2,3))))))","v":3},{"$f":"IF(AE:AE=\"pas d'actualité\",3,IF(AE:AE=\"?\",\"?\",IF(AE:AE=\"?\",\"?\",IF((($B$2+1)-AF:AF)>=0,\"0\",IF((($B$2+1)-AF:AF)>=-1,\"1\",IF((($B$2+1)-AF:AF)>=-2,\"2\",\"3\"))))))","v":"3"},{"$f":"IF(AE:AE=\"pas d'actualité\",3,IF(AE:AE=\"?\",\"?\",IF(AE:AE=\"?\",\"?\",IF((($B$2+2)-AF:AF)>=0,0,IF((($B$2+2)-AF:AF)>=-1,1,IF((($B$2+2)-AF:AF)>=-2,2,3))))))","v":2},{"$f":"IF(AE:AE=\"pas d'actualité\",3,IF(AE:AE=\"?\",\"?\",IF(AE:AE=\"?\",\"?\",IF(($B$2+3)-AF:AF>=0,0,IF(($B$2+3)-AF:AF>=-1,1,IF(($B$2+3)-AF:AF>=-2,2,3))))))","v":1},{"$f":"IF(AE:AE=\"pas d'actualité\",3,IF(AE:AE=\"?\",\"?\",IF(AE:AE=\"?\",\"?\",IF(($B$2+4)-AF:AF>=0,0,IF(($B$2+4)-AF:AF>=-1,1,IF(($B$2+4)-AF:AF>=-2,2,3))))))","v":0}]
["PR251","D251","FAB 251",null,null,null,null,null,null,null,null,"X",null,null,null,null,null,null,null,null,null,null,null,null,null,null,null,null,null,null,"pas d'actualité",{"$f":"IF(ISNUMBER(AE:AE),YEAR(AE:AE),AE:AE)","v":"pas d'actualité"},{"$f":"IF(AE:AE=\"pas d'actualité\",3,IF(AE:AE=\"?\",\"?\",IF(AE:AE=\"?\",\"?\",IF($B$2-AF:AF>=0,0,IF($B$2-AF:AF>=-1,1,IF($B$2-AF:AF>=-2,2,3))))))","v":3},{"$f":"IF(AE:AE=\"pas d'actualité\",3,IF(AE:AE=\"?\",\"?\",IF(AE:AE=\"?\",\"?\",IF((($B$2+1)-AF:AF)>=0,\"0\",IF((($B$2+1)-AF:AF)>=-1,\"1\",IF((($B$2+1)-AF:AF)>=-2,\"2\",\"3\"))))))","v":3},{"$f":"IF(AE:AE=\"pas d'actualité\",3,IF(AE:AE=\"?\",\"?\",IF(AE:AE=\"?\",\"?\",IF((($B$2+2)-AF:AF)>=0,0,IF((($B$2+2)-AF:AF)>=-1,1,IF((($B$2+2)-AF:AF)>=-2,2,3))))))","v":3},{"$f":"IF(AE:AE=\"pas d'actualité\",3,IF(AE:AE=\"?\",\"?\",IF(AE:AE=\"?\",\"?\",IF(($B$2+3)-AF:AF>=0,0,IF(($B$2+3)-AF:AF>=-1,1,IF(($B$2+3)-AF:AF>=-2,2,3))))))","v":3},{"$f":"IF(AE:AE=\"pas d'actualité\",3,IF(AE:AE=\"?\",\"?\",IF(AE:AE=\"?\",\"?\",IF(($B$2+4)-AF:AF>=0,0,IF(($B$2+4)-AF:AF>=-1,1,IF(($B$2+4)-AF:AF>=-2,2,3))))))","v":3}]
["PR252","D252","FAB 252",null,null,null,null,null,null,null,null,"X",null,null,null,null,null,null,null,null,null,null,null,null,null,null,null,null,null,null,"pas d'actualité",{"$f":"IF(ISNUMBER(AE:AE),YEAR(AE:AE),AE:AE)","v":"pas d'actualité"},{"$f":"IF(AE:AE=\"pas d'actualité\",3,IF(AE:AE=\"?\",\"?\",IF(AE:AE=\"?\",\"?\",IF($B$2-AF:AF>=0,0,IF($B$2-AF:AF>=-1,1,IF($B$2-AF:AF>=-2,2,3))))))","v":3},{"$f":"IF(AE:AE=\"pas d'actualité\",3,IF(AE:AE=\"?\",\"?\",IF(AE:AE=\"?\",\"?\",IF((($B$2+1)-AF:AF)>=0,\"0\",IF((($B$2+1)-AF:AF)>=-1,\"1\",IF((($B$2+1)-AF:AF)>=-2,\"2\",\"3\"))))))","v":3},{"$f":"IF(AE:AE=\"pas d'actualité\",3,IF(AE:AE=\"?\",\"?\",IF(AE:AE=\"?\",\"?\",IF((($B$2+2)-AF:AF)>=0,0,IF((($B$2+2)-AF:AF)>=-1,1,IF((($B$2+2)-AF:AF)>=-2,2,3))))))","v":3},{"$f":"IF(AE:AE=\"pas d'actualité\",3,IF(AE:AE=\"?\",\"?\",IF(AE:AE=\"?\",\"?\",IF(($B$2+3)-AF:AF>=0,0,IF(($B$2+3)-AF:AF>=-1,1,IF(($B$2+3)-AF:AF>=-2,2,3))))))","v":3},{"$f":"IF(AE:AE=\"pas d'actualité\",3,IF(AE:AE=\"?\",\"?\",IF(AE:AE=\"?\",\"?\",IF(($B$2+4)-AF:AF>=0,0,IF(($B$2+4)-AF:AF>=-1,1,IF(($B$2+4)-AF:AF>=-2,2,3))))))","v":3},null,"Partiellement compatible"]
["PR253","D253","FAB 253",null,null,null,null,null,null,null,null,"X",null,null,null,null,null,null,null,null,null,null,null,null,null,null,null,null,null,null,"pas d'actualité",{"$f":"IF(ISNUMBER(AE:AE),YEAR(AE:AE),AE:AE)","v":"pas d'actualité"},{"$f":"IF(AE:AE=\"pas d'actualité\",3,IF(AE:AE=\"?\",\"?\",IF(AE:AE=\"?\",\"?\",IF($B$2-AF:AF>=0,0,IF($B$2-AF:AF>=-1,1,IF($B$2-AF:AF>=-2,2,3))))))","v":3},{"$f":"IF(AE:AE=\"pas d'actualité\",3,IF(AE:AE=\"?\",\"?\",IF(AE:AE=\"?\",\"?\",IF((($B$2+1)-AF:AF)>=0,\"0\",IF((($B$2+1)-AF:AF)>=-1,\"1\",IF((($B$2+1)-AF:AF)>=-2,\"2\",\"3\"))))))","v":3},{"$f":"IF(AE:AE=\"pas d'actualité\",3,IF(AE:AE=\"?\",\"?\",IF(AE:AE=\"?\",\"?\",IF((($B$2+2)-AF:AF)>=0,0,IF((($B$2+2)-AF:AF)>=-1,1,IF((($B$2+2)-AF:AF)>=-2,2,3))))))","v":3},{"$f":"IF(AE:AE=\"pas d'actualité\",3,IF(AE:AE=\"?\",\"?\",IF(AE:AE=\"?\",\"?\",IF(($B$2+3)-AF:AF>=0,0,IF(($B$2+3)-AF:AF>=-1,1,IF(($B$2+3)-AF:AF>=-2,2,3))))))","v":3},{"$f":"IF(AE:AE=\"pas d'actualité\",3,IF(AE:AE=\"?\",\"?\",IF(AE:AE=\"?\",\"?\",IF(($B$2+4)-AF:AF>=0,0,IF(($B$2+4)-AF:AF>=-1,1,IF(($B$2+4)-AF:AF>=-2,2,3))))))","v":3},null,"Partiellement compatible"]
["PR254","D254","FAB 254",null,null,null,null,null,null,null,null,"X",null,null,null,null,null,null,null,null,null,null,null,null,null,null,null,null,null,null,"pas d'actualité",{"$f":"IF(ISNUMBER(AE:AE),YEAR(AE:AE),AE:AE)","v":"pas d'actualité"},{"$f":"IF(AE:AE=\"pas d'actualité\",3,IF(AE:AE=\"?\",\"?\",IF(AE:AE=\"?\",\"?\",IF($B$2-AF:AF>=0,0,IF($B$2-AF:AF>=-1,1,IF($B$2-AF:AF>=-2,2,3))))))","v":3},{"$f":"IF(AE:AE=\"pas d'actualité\",3,IF(AE:AE=\"?\",\"?\",IF(AE:AE=\"?\",\"?\",IF((($B$2+1)-AF:AF)>=0,\"0\",IF((($B$2+1)-AF:AF)>=-1,\"1\",IF((($B$2+1)-AF:AF)>=-2,\"2\",\"3\"))))))","v":3},{"$f":"IF(AE:AE=\"pas d'actualité\",3,IF(AE:AE=\"?\",\"?\",IF(AE:AE=\"?\",\"?\",IF((($B$2+2)-AF:AF)>=0,0,IF((($B$2+2)-AF:AF)>=-1,1,IF((($B$2+2)-AF:AF)>=-2,2,3))))))","v":3},{"$f":"IF(AE:AE=\"pas d'actualité\",3,IF(AE:AE=\"?\",\"?\",IF(AE:AE=\"?\",\"?\",IF(($B$2+3)-AF:AF>=0,0,IF(($B$2+3)-AF:AF>=-1,1,IF(($B$2+3)-AF:AF>=-2,2,3))))))","v":3},{"$f":"IF(AE:AE=\"pas d'actualité\",3,IF(AE:AE=\"?\",\"?\",IF(AE:AE=\"?\",\"?\",IF(($B$2+4)-AF:AF>=0,0,IF(($B$2+4)-AF:AF>=-1,1,IF(($B$2+4)-AF:AF>=-2,2,3))))))","v":3}]
["PR255","D255","FAB 255",null,null,null,null,null,null,null,null,"X",null,null,null,null,null,null,null,null,null,null,null,null,null,null,null,null,null,null,"pas d'actualité",{"$f":"IF(ISNUMBER(AE:AE),YEAR(AE:AE),AE:AE)","v":"pas d'actualité"},{"$f":"IF(AE:AE=\"pas d'actualité\",3,IF(AE:AE=\"?\",\"?\",IF(AE:AE=\"?\",\"?\",IF($B$2-AF:AF>=0,0,IF($B$2-AF:AF>=-1,1,IF($B$2-AF:AF>=-2,2,3))))))","v":3},{"$f":"IF(AE:AE=\"pas d'actualité\",3,IF(AE:AE=\"?\",\"?\",IF(AE:AE=\"?\",\"?\",IF((($B$2+1)-AF:AF)>=0,\"0\",IF((($B$2+1)-AF:AF)>=-1,\"1\",IF((($B$2+1)-AF:AF)>=-2,\"2\",\"3\"))))))","v":3},{"$f":"IF(AE:AE=\"pas d'actualité\",3,IF(AE:AE=\"?\",\"?\",IF(AE:AE=\"?\",\"?\",IF((($B$2+2)-AF:AF)>=0,0,IF((($B$2+2)-AF:AF)>=-1,1,IF((($B$2+2)-AF:AF)>=-2,2,3))))))","v":3},{"$f":"IF(AE:AE=\"pas d'actualité\",3,IF(AE:AE=\"?\",\"?\",IF(AE:AE=\"?\",\"?\",IF(($B$2+3)-AF:AF>=0,0,IF(($B$2+3)-AF:AF>=-1,1,IF(($B$2+3)-AF:AF>=-2,2,3))))))","v":3},{"$f":"IF(AE:AE=\"pas d'actualité\",3,IF(AE:AE=\"?\",\"?\",IF(AE:AE=\"?\",\"?\",IF(($B$2+4)-AF:AF>=0,0,IF(($B$2+4)-AF:AF>=-1,1,IF(($B$2+4)-AF:AF>=-2,2,3))))))","v":3}]
["PR256","D256","FAB 256",null,null,null,null,null,null,null,null,null,null,null,null,null,null,null,null,null,null,null,null,null,null,null,null,null,null,null,"pas d'actualité",{"$f":"IF(ISNUMBER(AE:AE),YEAR(AE:AE),AE:AE)","v":"pas d'actualité"},{"$f":"IF(AE:AE=\"pas d'actualité\",3,IF(AE:AE=\"?\",\"?\",IF(AE:AE=\"?\",\"?\",IF($B$2-AF:AF>=0,0,IF($B$2-AF:AF>=-1,1,IF($B$2-AF:AF>=-2,2,3))))))","v":3},{"$f":"IF(AE:AE=\"pas d'actualité\",3,IF(AE:AE=\"?\",\"?\",IF(AE:AE=\"?\",\"?\",IF((($B$2+1)-AF:AF)>=0,\"0\",IF((($B$2+1)-AF:AF)>=-1,\"1\",IF((($B$2+1)-AF:AF)>=-2,\"2\",\"3\"))))))","v":3},{"$f":"IF(AE:AE=\"pas d'actualité\",3,IF(AE:AE=\"?\",\"?\",IF(AE:AE=\"?\",\"?\",IF((($B$2+2)-AF:AF)>=0,0,IF((($B$2+2)-AF:AF)>=-1,1,IF((($B$2+2)-AF:AF)>=-2,2,3))))))","v":3},{"$f":"IF(AE:AE=\"pas d'actualité\",3,IF(AE:AE=\"?\",\"?\",IF(AE:AE=\"?\",\"?\",IF(($B$2+3)-AF:AF>=0,0,IF(($B$2+3)-AF:AF>=-1,1,IF(($B$2+3)-AF:AF>=-2,2,3))))))","v":3},{"$f":"IF(AE:AE=\"pas d'actualité\",3,IF(AE:AE=\"?\",\"?\",IF(AE:AE=\"?\",\"?\",IF(($B$2+4)-AF:AF>=0,0,IF(($B$2+4)-AF:AF>=-1,1,IF(($B$2+4)-AF:AF>=-2,2,3))))))","v":3}]
["PR257","D257","FAB 257",null,null,null,null,null,null,null,null,null,null,null,null,null,null,null,null,null,null,null,null,null,null,null,null,"X",null,null,"pas d'actualité",{"$f":"IF(ISNUMBER(AE:AE),YEAR(AE:AE),AE:AE)","v":"pas d'actualité"},{"$f":"IF(AE:AE=\"pas d'actualité\",3,IF(AE:AE=\"?\",\"?\",IF(AE:AE=\"?\",\"?\",IF($B$2-AF:AF>=0,0,IF($B$2-AF:AF>=-1,1,IF($B$2-AF:AF>=-2,2,3))))))","v":3},{"$f":"IF(AE:AE=\"pas d'actualité\",3,IF(AE:AE=\"?\",\"?\",IF(AE:AE=\"?\",\"?\",IF((($B$2+1)-AF:AF)>=0,\"0\",IF((($B$2+1)-AF:AF)>=-1,\"1\",IF((($B$2+1)-AF:AF)>=-2,\"2\",\"3\"))))))","v":3},{"$f":"IF(AE:AE=\"pas d'actualité\",3,IF(AE:AE=\"?\",\"?\",IF(AE:AE=\"?\",\"?\",IF((($B$2+2)-AF:AF)>=0,0,IF((($B$2+2)-AF:AF)>=-1,1,IF((($B$2+2)-AF:AF)>=-2,2,3))))))","v":3},{"$f":"IF(AE:AE=\"pas d'actualité\",3,IF(AE:AE=\"?\",\"?\",IF(AE:AE=\"?\",\"?\",IF(($B$2+3)-AF:AF>=0,0,IF(($B$2+3)-AF:AF>=-1,1,IF(($B$2+3)-AF:AF>=-2,2,3))))))","v":3},{"$f":"IF(AE:AE=\"pas d'actualité\",3,IF(AE:AE=\"?\",\"?\",IF(AE:AE=\"?\",\"?\",IF(($B$2+4)-AF:AF>=0,0,IF(($B$2+4)-AF:AF>=-1,1,IF(($B$2+4)-AF:AF>=-2,2,3))))))","v":3}]
["PR258","D258","FAB 258",null,null,null,null,null,null,null,null,null,null,null,null,null,null,null,null,null,null,null,null,null,null,null,null,"X",null,null,"pas d'actualité",{"$f":"IF(ISNUMBER(AE:AE),YEAR(AE:AE),AE:AE)","v":"pas d'actualité"},{"$f":"IF(AE:AE=\"pas d'actualité\",3,IF(AE:AE=\"?\",\"?\",IF(AE:AE=\"?\",\"?\",IF($B$2-AF:AF>=0,0,IF($B$2-AF:AF>=-1,1,IF($B$2-AF:AF>=-2,2,3))))))","v":3},{"$f":"IF(AE:AE=\"pas d'actualité\",3,IF(AE:AE=\"?\",\"?\",IF(AE:AE=\"?\",\"?\",IF((($B$2+1)-AF:AF)>=0,\"0\",IF((($B$2+1)-AF:AF)>=-1,\"1\",IF((($B$2+1)-AF:AF)>=-2,\"2\",\"3\"))))))","v":3},{"$f":"IF(AE:AE=\"pas d'actualité\",3,IF(AE:AE=\"?\",\"?\",IF(AE:AE=\"?\",\"?\",IF((($B$2+2)-AF:AF)>=0,0,IF((($B$2+2)-AF:AF)>=-1,1,IF((($B$2+2)-AF:AF)>=-2,2,3))))))","v":3},{"$f":"IF(AE:AE=\"pas d'actualité\",3,IF(AE:AE=\"?\",\"?\",IF(AE:AE=\"?\",\"?\",IF(($B$2+3)-AF:AF>=0,0,IF(($B$2+3)-AF:AF>=-1,1,IF(($B$2+3)-AF:AF>=-2,2,3))))))","v":3},{"$f":"IF(AE:AE=\"pas d'actualité\",3,IF(AE:AE=\"?\",\"?\",IF(AE:AE=\"?\",\"?\",IF(($B$2+4)-AF:AF>=0,0,IF(($B$2+4)-AF:AF>=-1,1,IF(($B$2+4)-AF:AF>=-2,2,3))))))","v":3}]
["PR259","D259","FAB 259",null,1,null,null,null,null,null,null,null,null,null,null,null,null,null,null,null,null,null,null,null,null,null,null,"X",null,null,"pas d'actualité",{"$f":"IF(ISNUMBER(AE:AE),YEAR(AE:AE),AE:AE)","v":"pas d'actualité"},{"$f":"IF(AE:AE=\"pas d'actualité\",3,IF(AE:AE=\"?\",\"?\",IF(AE:AE=\"?\",\"?\",IF($B$2-AF:AF>=0,0,IF($B$2-AF:AF>=-1,1,IF($B$2-AF:AF>=-2,2,3))))))","v":3},{"$f":"IF(AE:AE=\"pas d'actualité\",3,IF(AE:AE=\"?\",\"?\",IF(AE:AE=\"?\",\"?\",IF((($B$2+1)-AF:AF)>=0,\"0\",IF((($B$2+1)-AF:AF)>=-1,\"1\",IF((($B$2+1)-AF:AF)>=-2,\"2\",\"3\"))))))","v":3},{"$f":"IF(AE:AE=\"pas d'actualité\",3,IF(AE:AE=\"?\",\"?\",IF(AE:AE=\"?\",\"?\",IF((($B$2+2)-AF:AF)>=0,0,IF((($B$2+2)-AF:AF)>=-1,1,IF((($B$2+2)-AF:AF)>=-2,2,3))))))","v":3},{"$f":"IF(AE:AE=\"pas d'actualité\",3,IF(AE:AE=\"?\",\"?\",IF(AE:AE=\"?\",\"?\",IF(($B$2+3)-AF:AF>=0,0,IF(($B$2+3)-AF:AF>=-1,1,IF(($B$2+3)-AF:AF>=-2,2,3))))))","v":3},{"$f":"IF(AE:AE=\"pas d'actualité\",3,IF(AE:AE=\"?\",\"?\",IF(AE:AE=\"?\",\"?\",IF(($B$2+4)-AF:AF>=0,0,IF(($B$2+4)-AF:AF>=-1,1,IF(($B$2+4)-AF:AF>=-2,2,3))))))","v":3}]
["PR260","D260","FAB 260",null,1,null,null,null,null,null,null,null,null,null,null,null,null,null,null,null,null,null,null,null,null,null,null,"X",null,null,"pas d'actualité",{"$f":"IF(ISNUMBER(AE:AE),YEAR(AE:AE),AE:AE)","v":"pas d'actualité"},{"$f":"IF(AE:AE=\"pas d'actualité\",3,IF(AE:AE=\"?\",\"?\",IF(AE:AE=\"?\",\"?\",IF($B$2-AF:AF>=0,0,IF($B$2-AF:AF>=-1,1,IF($B$2-AF:AF>=-2,2,3))))))","v":3},{"$f":"IF(AE:AE=\"pas d'actualité\",3,IF(AE:AE=\"?\",\"?\",IF(AE:AE=\"?\",\"?\",IF((($B$2+1)-AF:AF)>=0,\"0\",IF((($B$2+1)-AF:AF)>=-1,\"1\",IF((($B$2+1)-AF:AF)>=-2,\"2\",\"3\"))))))","v":3},{"$f":"IF(AE:AE=\"pas d'actualité\",3,IF(AE:AE=\"?\",\"?\",IF(AE:AE=\"?\",\"?\",IF((($B$2+2)-AF:AF)>=0,0,IF((($B$2+2)-AF:AF)>=-1,1,IF((($B$2+2)-AF:AF)>=-2,2,3))))))","v":3},{"$f":"IF(AE:AE=\"pas d'actualité\",3,IF(AE:AE=\"?\",\"?\",IF(AE:AE=\"?\",\"?\",IF(($B$2+3)-AF:AF>=0,0,IF(($B$2+3)-AF:AF>=-1,1,IF(($B$2+3)-AF:AF>=-2,2,3))))))","v":3},{"$f":"IF(AE:AE=\"pas d'actualité\",3,IF(AE:AE=\"?\",\"?\",IF(AE:AE=\"?\",\"?\",IF(($B$2+4)-AF:AF>=0,0,IF(($B$2+4)-AF:AF>=-1,1,IF(($B$2+4)-AF:AF>=-2,2,3))))))","v":3}]
["PR261","D261","FAB 261",null,1,null,null,null,null,"X",null,null,null,null,null,null,null,null,null,null,null,null,null,null,null,null,null,null,null,null,"pas d'actualité",{"$f":"IF(ISNUMBER(AE:AE),YEAR(AE:AE),AE:AE)","v":"pas d'actualité"},{"$f":"IF(AE:AE=\"pas d'actualité\",3,IF(AE:AE=\"?\",\"?\",IF(AE:AE=\"?\",\"?\",IF($B$2-AF:AF>=0,0,IF($B$2-AF:AF>=-1,1,IF($B$2-AF:AF>=-2,2,3))))))","v":3},{"$f":"IF(AE:AE=\"pas d'actualité\",3,IF(AE:AE=\"?\",\"?\",IF(AE:AE=\"?\",\"?\",IF((($B$2+1)-AF:AF)>=0,\"0\",IF((($B$2+1)-AF:AF)>=-1,\"1\",IF((($B$2+1)-AF:AF)>=-2,\"2\",\"3\"))))))","v":3},{"$f":"IF(AE:AE=\"pas d'actualité\",3,IF(AE:AE=\"?\",\"?\",IF(AE:AE=\"?\",\"?\",IF((($B$2+2)-AF:AF)>=0,0,IF((($B$2+2)-AF:AF)>=-1,1,IF((($B$2+2)-AF:AF)>=-2,2,3))))))","v":3},{"$f":"IF(AE:AE=\"pas d'actualité\",3,IF(AE:AE=\"?\",\"?\",IF(AE:AE=\"?\",\"?\",IF(($B$2+3)-AF:AF>=0,0,IF(($B$2+3)-AF:AF>=-1,1,IF(($B$2+3)-AF:AF>=-2,2,3))))))","v":3},{"$f":"IF(AE:AE=\"pas d'actualité\",3,IF(AE:AE=\"?\",\"?\",IF(AE:AE=\"?\",\"?\",IF(($B$2+4)-AF:AF>=0,0,IF(($B$2+4)-AF:AF>=-1,1,IF(($B$2+4)-AF:AF>=-2,2,3))))))","v":3}]
["PR262","D262","FAB 262",null,1,null,null,null,null,null,null,null,null,null,null,null,null,null,null,null,null,null,null,null,null,null,null,null,null,null,"pas d'actualité",{"$f":"IF(ISNUMBER(AE:AE),YEAR(AE:AE),AE:AE)","v":"pas d'actualité"},{"$f":"IF(AE:AE=\"pas d'actualité\",3,IF(AE:AE=\"?\",\"?\",IF(AE:AE=\"?\",\"?\",IF($B$2-AF:AF>=0,0,IF($B$2-AF:AF>=-1,1,IF($B$2-AF:AF>=-2,2,3))))))","v":3},{"$f":"IF(AE:AE=\"pas d'actualité\",3,IF(AE:AE=\"?\",\"?\",IF(AE:AE=\"?\",\"?\",IF((($B$2+1)-AF:AF)>=0,\"0\",IF((($B$2+1)-AF:AF)>=-1,\"1\",IF((($B$2+1)-AF:AF)>=-2,\"2\",\"3\"))))))","v":3},{"$f":"IF(AE:AE=\"pas d'actualité\",3,IF(AE:AE=\"?\",\"?\",IF(AE:AE=\"?\",\"?\",IF((($B$2+2)-AF:AF)>=0,0,IF((($B$2+2)-AF:AF)>=-1,1,IF((($B$2+2)-AF:AF)>=-2,2,3))))))","v":3},{"$f":"IF(AE:AE=\"pas d'actualité\",3,IF(AE:AE=\"?\",\"?\",IF(AE:AE=\"?\",\"?\",IF(($B$2+3)-AF:AF>=0,0,IF(($B$2+3)-AF:AF>=-1,1,IF(($B$2+3)-AF:AF>=-2,2,3))))))","v":3},{"$f":"IF(AE:AE=\"pas d'actualité\",3,IF(AE:AE=\"?\",\"?\",IF(AE:AE=\"?\",\"?\",IF(($B$2+4)-AF:AF>=0,0,IF(($B$2+4)-AF:AF>=-1,1,IF(($B$2+4)-AF:AF>=-2,2,3))))))","v":3}]
["PR263","D263","FAB 263",null,1,null,null,"X","X",null,"X",null,null,null,null,null,null,null,null,null,null,null,null,null,null,null,null,null,null,null,"pas d'actualité",{"$f":"IF(ISNUMBER(AE:AE),YEAR(AE:AE),AE:AE)","v":"pas d'actualité"},{"$f":"IF(AE:AE=\"pas d'actualité\",3,IF(AE:AE=\"?\",\"?\",IF(AE:AE=\"?\",\"?\",IF($B$2-AF:AF>=0,0,IF($B$2-AF:AF>=-1,1,IF($B$2-AF:AF>=-2,2,3))))))","v":3},{"$f":"IF(AE:AE=\"pas d'actualité\",3,IF(AE:AE=\"?\",\"?\",IF(AE:AE=\"?\",\"?\",IF((($B$2+1)-AF:AF)>=0,\"0\",IF((($B$2+1)-AF:AF)>=-1,\"1\",IF((($B$2+1)-AF:AF)>=-2,\"2\",\"3\"))))))","v":3},{"$f":"IF(AE:AE=\"pas d'actualité\",3,IF(AE:AE=\"?\",\"?\",IF(AE:AE=\"?\",\"?\",IF((($B$2+2)-AF:AF)>=0,0,IF((($B$2+2)-AF:AF)>=-1,1,IF((($B$2+2)-AF:AF)>=-2,2,3))))))","v":3},{"$f":"IF(AE:AE=\"pas d'actualité\",3,IF(AE:AE=\"?\",\"?\",IF(AE:AE=\"?\",\"?\",IF(($B$2+3)-AF:AF>=0,0,IF(($B$2+3)-AF:AF>=-1,1,IF(($B$2+3)-AF:AF>=-2,2,3))))))","v":3},{"$f":"IF(AE:AE=\"pas d'actualité\",3,IF(AE:AE=\"?\",\"?\",IF(AE:AE=\"?\",\"?\",IF(($B$2+4)-AF:AF>=0,0,IF(($B$2+4)-AF:AF>=-1,1,IF(($B$2+4)-AF:AF>=-2,2,3))))))","v":3}]
["PR264","D264","FAB 264",null,1,null,null,"X","X",null,"X",null,null,null,null,null,null,null,null,null,null,null,null,null,null,null,null,null,null,null,"pas d'actualité",{"$f":"IF(ISNUMBER(AE:AE),YEAR(AE:AE),AE:AE)","v":"pas d'actualité"},{"$f":"IF(AE:AE=\"pas d'actualité\",3,IF(AE:AE=\"?\",\"?\",IF(AE:AE=\"?\",\"?\",IF($B$2-AF:AF>=0,0,IF($B$2-AF:AF>=-1,1,IF($B$2-AF:AF>=-2,2,3))))))","v":3},{"$f":"IF(AE:AE=\"pas d'actualité\",3,IF(AE:AE=\"?\",\"?\",IF(AE:AE=\"?\",\"?\",IF((($B$2+1)-AF:AF)>=0,\"0\",IF((($B$2+1)-AF:AF)>=-1,\"1\",IF((($B$2+1)-AF:AF)>=-2,\"2\",\"3\"))))))","v":3},{"$f":"IF(AE:AE=\"pas d'actualité\",3,IF(AE:AE=\"?\",\"?\",IF(AE:AE=\"?\",\"?\",IF((($B$2+2)-AF:AF)>=0,0,IF((($B$2+2)-AF:AF)>=-1,1,IF((($B$2+2)-AF:AF)>=-2,2,3))))))","v":3},{"$f":"IF(AE:AE=\"pas d'actualité\",3,IF(AE:AE=\"?\",\"?\",IF(AE:AE=\"?\",\"?\",IF(($B$2+3)-AF:AF>=0,0,IF(($B$2+3)-AF:AF>=-1,1,IF(($B$2+3)-AF:AF>=-2,2,3))))))","v":3},{"$f":"IF(AE:AE=\"pas d'actualité\",3,IF(AE:AE=\"?\",\"?\",IF(AE:AE=\"?\",\"?\",IF(($B$2+4)-AF:AF>=0,0,IF(($B$2+4)-AF:AF>=-1,1,IF(($B$2+4)-AF:AF>=-2,2,3))))))","v":3}]
["PR265","D265","FAB 265",null,1,null,null,"X","X",null,null,null,null,null,null,null,null,null,null,null,null,null,null,null,null,null,null,null,null,null,"pas d'actualité",{"$f":"IF(ISNUMBER(AE:AE),YEAR(AE:AE),AE:AE)","v":"pas d'actualité"},{"$f":"IF(AE:AE=\"pas d'actualité\",3,IF(AE:AE=\"?\",\"?\",IF(AE:AE=\"?\",\"?\",IF($B$2-AF:AF>=0,0,IF($B$2-AF:AF>=-1,1,IF($B$2-AF:AF>=-2,2,3))))))","v":3},{"$f":"IF(AE:AE=\"pas d'actualité\",3,IF(AE:AE=\"?\",\"?\",IF(AE:AE=\"?\",\"?\",IF((($B$2+1)-AF:AF)>=0,\"0\",IF((($B$2+1)-AF:AF)>=-1,\"1\",IF((($B$2+1)-AF:AF)>=-2,\"2\",\"3\"))))))","v":3},{"$f":"IF(AE:AE=\"pas d'actualité\",3,IF(AE:AE=\"?\",\"?\",IF(AE:AE=\"?\",\"?\",IF((($B$2+2)-AF:AF)>=0,0,IF((($B$2+2)-AF:AF)>=-1,1,IF((($B$2+2)-AF:AF)>=-2,2,3))))))","v":3},{"$f":"IF(AE:AE=\"pas d'actualité\",3,IF(AE:AE=\"?\",\"?\",IF(AE:AE=\"?\",\"?\",IF(($B$2+3)-AF:AF>=0,0,IF(($B$2+3)-AF:AF>=-1,1,IF(($B$2+3)-AF:AF>=-2,2,3))))))","v":3},{"$f":"IF(AE:AE=\"pas d'actualité\",3,IF(AE:AE=\"?\",\"?\",IF(AE:AE=\"?\",\"?\",IF(($B$2+4)-AF:AF>=0,0,IF(($B$2+4)-AF:AF>=-1,1,IF(($B$2+4)-AF:AF>=-2,2,3))))))","v":3}]
["PR266","D266","FAB 266",null,1,null,null,"X","X",null,null,null,null,null,null,null,null,null,null,null,null,null,null,null,null,null,null,null,null,null,"pas d'actualité",{"$f":"IF(ISNUMBER(AE:AE),YEAR(AE:AE),AE:AE)","v":"pas d'actualité"},{"$f":"IF(AE:AE=\"pas d'actualité\",3,IF(AE:AE=\"?\",\"?\",IF(AE:AE=\"?\",\"?\",IF($B$2-AF:AF>=0,0,IF($B$2-AF:AF>=-1,1,IF($B$2-AF:AF>=-2,2,3))))))","v":3},{"$f":"IF(AE:AE=\"pas d'actualité\",3,IF(AE:AE=\"?\",\"?\",IF(AE:AE=\"?\",\"?\",IF((($B$2+1)-AF:AF)>=0,\"0\",IF((($B$2+1)-AF:AF)>=-1,\"1\",IF((($B$2+1)-AF:AF)>=-2,\"2\",\"3\"))))))","v":3},{"$f":"IF(AE:AE=\"pas d'actualité\",3,IF(AE:AE=\"?\",\"?\",IF(AE:AE=\"?\",\"?\",IF((($B$2+2)-AF:AF)>=0,0,IF((($B$2+2)-AF:AF)>=-1,1,IF((($B$2+2)-AF:AF)>=-2,2,3))))))","v":3},{"$f":"IF(AE:AE=\"pas d'actualité\",3,IF(AE:AE=\"?\",\"?\",IF(AE:AE=\"?\",\"?\",IF(($B$2+3)-AF:AF>=0,0,IF(($B$2+3)-AF:AF>=-1,1,IF(($B$2+3)-AF:AF>=-2,2,3))))))","v":3},{"$f":"IF(AE:AE=\"pas d'actualité\",3,IF(AE:AE=\"?\",\"?\",IF(AE:AE=\"?\",\"?\",IF(($B$2+4)-AF:AF>=0,0,IF(($B$2+4)-AF:AF>=-1,1,IF(($B$2+4)-AF:AF>=-2,2,3))))))","v":3}]
["PR267","D267","FAB 267",null,1,null,null,"X","X","X","X","X",null,null,null,null,null,null,null,null,null,null,null,null,null,"X",null,null,null,null,"pas d'actualité",{"$f":"IF(ISNUMBER(AE:AE),YEAR(AE:AE),AE:AE)","v":"pas d'actualité"},{"$f":"IF(AE:AE=\"pas d'actualité\",3,IF(AE:AE=\"?\",\"?\",IF(AE:AE=\"?\",\"?\",IF($B$2-AF:AF>=0,0,IF($B$2-AF:AF>=-1,1,IF($B$2-AF:AF>=-2,2,3))))))","v":3},{"$f":"IF(AE:AE=\"pas d'actualité\",3,IF(AE:AE=\"?\",\"?\",IF(AE:AE=\"?\",\"?\",IF((($B$2+1)-AF:AF)>=0,\"0\",IF((($B$2+1)-AF:AF)>=-1,\"1\",IF((($B$2+1)-AF:AF)>=-2,\"2\",\"3\"))))))","v":3},{"$f":"IF(AE:AE=\"pas d'actualité\",3,IF(AE:AE=\"?\",\"?\",IF(AE:AE=\"?\",\"?\",IF((($B$2+2)-AF:AF)>=0,0,IF((($B$2+2)-AF:AF)>=-1,1,IF((($B$2+2)-AF:AF)>=-2,2,3))))))","v":3},{"$f":"IF(AE:AE=\"pas d'actualité\",3,IF(AE:AE=\"?\",\"?\",IF(AE:AE=\"?\",\"?\",IF(($B$2+3)-AF:AF>=0,0,IF(($B$2+3)-AF:AF>=-1,1,IF(($B$2+3)-AF:AF>=-2,2,3))))))","v":3},{"$f":"IF(AE:AE=\"pas d'actualité\",3,IF(AE:AE=\"?\",\"?\",IF(AE:AE=\"?\",\"?\",IF(($B$2+4)-AF:AF>=0,0,IF(($B$2+4)-AF:AF>=-1,1,IF(($B$2+4)-AF:AF>=-2,2,3))))))","v":3}]
["PR268","D268","FAB 268",null,1,null,null,null,null,null,null,null,null,null,null,null,null,null,null,null,null,null,null,null,null,null,null,"X",null,null,"pas d'actualité",{"$f":"IF(ISNUMBER(AE:AE),YEAR(AE:AE),AE:AE)","v":"pas d'actualité"},{"$f":"IF(AE:AE=\"pas d'actualité\",3,IF(AE:AE=\"?\",\"?\",IF(AE:AE=\"?\",\"?\",IF($B$2-AF:AF>=0,0,IF($B$2-AF:AF>=-1,1,IF($B$2-AF:AF>=-2,2,3))))))","v":3},{"$f":"IF(AE:AE=\"pas d'actualité\",3,IF(AE:AE=\"?\",\"?\",IF(AE:AE=\"?\",\"?\",IF((($B$2+1)-AF:AF)>=0,\"0\",IF((($B$2+1)-AF:AF)>=-1,\"1\",IF((($B$2+1)-AF:AF)>=-2,\"2\",\"3\"))))))","v":3},{"$f":"IF(AE:AE=\"pas d'actualité\",3,IF(AE:AE=\"?\",\"?\",IF(AE:AE=\"?\",\"?\",IF((($B$2+2)-AF:AF)>=0,0,IF((($B$2+2)-AF:AF)>=-1,1,IF((($B$2+2)-AF:AF)>=-2,2,3))))))","v":3},{"$f":"IF(AE:AE=\"pas d'actualité\",3,IF(AE:AE=\"?\",\"?\",IF(AE:AE=\"?\",\"?\",IF(($B$2+3)-AF:AF>=0,0,IF(($B$2+3)-AF:AF>=-1,1,IF(($B$2+3)-AF:AF>=-2,2,3))))))","v":3},{"$f":"IF(AE:AE=\"pas d'actualité\",3,IF(AE:AE=\"?\",\"?\",IF(AE:AE=\"?\",\"?\",IF(($B$2+4)-AF:AF>=0,0,IF(($B$2+4)-AF:AF>=-1,1,IF(($B$2+4)-AF:AF>=-2,2,3))))))","v":3}]
["PR269","D269","FAB 269",null,1,null,null,"X","X",null,null,null,null,null,null,null,null,null,null,null,null,null,null,null,null,null,null,null,null,null,"pas d'actualité",{"$f":"IF(ISNUMBER(AE:AE),YEAR(AE:AE),AE:AE)","v":"pas d'actualité"},{"$f":"IF(AE:AE=\"pas d'actualité\",3,IF(AE:AE=\"?\",\"?\",IF(AE:AE=\"?\",\"?\",IF($B$2-AF:AF>=0,0,IF($B$2-AF:AF>=-1,1,IF($B$2-AF:AF>=-2,2,3))))))","v":3},{"$f":"IF(AE:AE=\"pas d'actualité\",3,IF(AE:AE=\"?\",\"?\",IF(AE:AE=\"?\",\"?\",IF((($B$2+1)-AF:AF)>=0,\"0\",IF((($B$2+1)-AF:AF)>=-1,\"1\",IF((($B$2+1)-AF:AF)>=-2,\"2\",\"3\"))))))","v":3},{"$f":"IF(AE:AE=\"pas d'actualité\",3,IF(AE:AE=\"?\",\"?\",IF(AE:AE=\"?\",\"?\",IF((($B$2+2)-AF:AF)>=0,0,IF((($B$2+2)-AF:AF)>=-1,1,IF((($B$2+2)-AF:AF)>=-2,2,3))))))","v":3},{"$f":"IF(AE:AE=\"pas d'actualité\",3,IF(AE:AE=\"?\",\"?\",IF(AE:AE=\"?\",\"?\",IF(($B$2+3)-AF:AF>=0,0,IF(($B$2+3)-AF:AF>=-1,1,IF(($B$2+3)-AF:AF>=-2,2,3))))))","v":3},{"$f":"IF(AE:AE=\"pas d'actualité\",3,IF(AE:AE=\"?\",\"?\",IF(AE:AE=\"?\",\"?\",IF(($B$2+4)-AF:AF>=0,0,IF(($B$2+4)-AF:AF>=-1,1,IF(($B$2+4)-AF:AF>=-2,2,3))))))","v":3}]
["PR270","D270","FAB 270",null,null,null,null,null,null,null,null,null,null,null,null,null,null,null,null,null,null,null,null,null,null,null,null,null,null,null,"pas d'actualité",{"$f":"IF(ISNUMBER(AE:AE),YEAR(AE:AE),AE:AE)","v":"pas d'actualité"},{"$f":"IF(AE:AE=\"pas d'actualité\",3,IF(AE:AE=\"?\",\"?\",IF(AE:AE=\"?\",\"?\",IF($B$2-AF:AF>=0,0,IF($B$2-AF:AF>=-1,1,IF($B$2-AF:AF>=-2,2,3))))))","v":3},{"$f":"IF(AE:AE=\"pas d'actualité\",3,IF(AE:AE=\"?\",\"?\",IF(AE:AE=\"?\",\"?\",IF((($B$2+1)-AF:AF)>=0,\"0\",IF((($B$2+1)-AF:AF)>=-1,\"1\",IF((($B$2+1)-AF:AF)>=-2,\"2\",\"3\"))))))","v":3},{"$f":"IF(AE:AE=\"pas d'actualité\",3,IF(AE:AE=\"?\",\"?\",IF(AE:AE=\"?\",\"?\",IF((($B$2+2)-AF:AF)>=0,0,IF((($B$2+2)-AF:AF)>=-1,1,IF((($B$2+2)-AF:AF)>=-2,2,3))))))","v":3},{"$f":"IF(AE:AE=\"pas d'actualité\",3,IF(AE:AE=\"?\",\"?\",IF(AE:AE=\"?\",\"?\",IF(($B$2+3)-AF:AF>=0,0,IF(($B$2+3)-AF:AF>=-1,1,IF(($B$2+3)-AF:AF>=-2,2,3))))))","v":3},{"$f":"IF(AE:AE=\"pas d'actualité\",3,IF(AE:AE=\"?\",\"?\",IF(AE:AE=\"?\",\"?\",IF(($B$2+4)-AF:AF>=0,0,IF(($B$2+4)-AF:AF>=-1,1,IF(($B$2+4)-AF:AF>=-2,2,3))))))","v":3}]
["PR271","D271","FAB 271",null,1,null,null,"X","X",null,null,null,null,null,null,null,null,null,null,null,null,null,null,null,null,null,null,null,null,null,"2024-09-30",{"$f":"IF(ISNUMBER(AE:AE),YEAR(AE:AE),AE:AE)","v":2024},{"$f":"IF(AE:AE=\"pas d'actualité\",3,IF(AE:AE=\"?\",\"?\",IF(AE:AE=\"?\",\"?\",IF($B$2-AF:AF>=0,0,IF($B$2-AF:AF>=-1,1,IF($B$2-AF:AF>=-2,2,3))))))","v":3},{"$f":"IF(AE:AE=\"pas d'actualité\",3,IF(AE:AE=\"?\",\"?\",IF(AE:AE=\"?\",\"?\",IF((($B$2+1)-AF:AF)>=0,\"0\",IF((($B$2+1)-AF:AF)>=-1,\"1\",IF((($B$2+1)-AF:AF)>=-2,\"2\",\"3\"))))))","v":"3"},{"$f":"IF(AE:AE=\"pas d'actualité\",3,IF(AE:AE=\"?\",\"?\",IF(AE:AE=\"?\",\"?\",IF((($B$2+2)-AF:AF)>=0,0,IF((($B$2+2)-AF:AF)>=-1,1,IF((($B$2+2)-AF:AF)>=-2,2,3))))))","v":3},{"$f":"IF(AE:AE=\"pas d'actualité\",3,IF(AE:AE=\"?\",\"?\",IF(AE:AE=\"?\",\"?\",IF(($B$2+3)-AF:AF>=0,0,IF(($B$2+3)-AF:AF>=-1,1,IF(($B$2+3)-AF:AF>=-2,2,3))))))","v":3},{"$f":"IF(AE:AE=\"pas d'actualité\",3,IF(AE:AE=\"?\",\"?\",IF(AE:AE=\"?\",\"?\",IF(($B$2+4)-AF:AF>=0,0,IF(($B$2+4)-AF:AF>=-1,1,IF(($B$2+4)-AF:AF>=-2,2,3))))))","v":3}]
["PR272","D272","FAB 272",null,1,null,null,"X","X",null,null,null,null,null,null,null,null,null,null,null,null,null,null,null,null,null,null,null,null,null,"pas d'actualité",{"$f":"IF(ISNUMBER(AE:AE),YEAR(AE:AE),AE:AE)","v":"pas d'actualité"},{"$f":"IF(AE:AE=\"pas d'actualité\",3,IF(AE:AE=\"?\",\"?\",IF(AE:AE=\"?\",\"?\",IF($B$2-AF:AF>=0,0,IF($B$2-AF:AF>=-1,1,IF($B$2-AF:AF>=-2,2,3))))))","v":3},{"$f":"IF(AE:AE=\"pas d'actualité\",3,IF(AE:AE=\"?\",\"?\",IF(AE:AE=\"?\",\"?\",IF((($B$2+1)-AF:AF)>=0,\"0\",IF((($B$2+1)-AF:AF)>=-1,\"1\",IF((($B$2+1)-AF:AF)>=-2,\"2\",\"3\"))))))","v":3},{"$f":"IF(AE:AE=\"pas d'actualité\",3,IF(AE:AE=\"?\",\"?\",IF(AE:AE=\"?\",\"?\",IF((($B$2+2)-AF:AF)>=0,0,IF((($B$2+2)-AF:AF)>=-1,1,IF((($B$2+2)-AF:AF)>=-2,2,3))))))","v":3},{"$f":"IF(AE:AE=\"pas d'actualité\",3,IF(AE:AE=\"?\",\"?\",IF(AE:AE=\"?\",\"?\",IF(($B$2+3)-AF:AF>=0,0,IF(($B$2+3)-AF:AF>=-1,1,IF(($B$2+3)-AF:AF>=-2,2,3))))))","v":3},{"$f":"IF(AE:AE=\"pas d'actualité\",3,IF(AE:AE=\"?\",\"?\",IF(AE:AE=\"?\",\"?\",IF(($B$2+4)-AF:AF>=0,0,IF(($B$2+4)-AF:AF>=-1,1,IF(($B$2+4)-AF:AF>=-2,2,3))))))","v":3}]
["PR273","D273","FAB 273",null,null,null,null,null,null,null,null,"X",null,null,null,null,null,null,null,null,null,null,null,null,null,null,null,null,null,null,"pas d'actualité",{"$f":"IF(ISNUMBER(AE:AE),YEAR(AE:AE),AE:AE)","v":"pas d'actualité"},{"$f":"IF(AE:AE=\"pas d'actualité\",3,IF(AE:AE=\"?\",\"?\",IF(AE:AE=\"?\",\"?\",IF($B$2-AF:AF>=0,0,IF($B$2-AF:AF>=-1,1,IF($B$2-AF:AF>=-2,2,3))))))","v":3},{"$f":"IF(AE:AE=\"pas d'actualité\",3,IF(AE:AE=\"?\",\"?\",IF(AE:AE=\"?\",\"?\",IF((($B$2+1)-AF:AF)>=0,\"0\",IF((($B$2+1)-AF:AF)>=-1,\"1\",IF((($B$2+1)-AF:AF)>=-2,\"2\",\"3\"))))))","v":3},{"$f":"IF(AE:AE=\"pas d'actualité\",3,IF(AE:AE=\"?\",\"?\",IF(AE:AE=\"?\",\"?\",IF((($B$2+2)-AF:AF)>=0,0,IF((($B$2+2)-AF:AF)>=-1,1,IF((($B$2+2)-AF:AF)>=-2,2,3))))))","v":3},{"$f":"IF(AE:AE=\"pas d'actualité\",3,IF(AE:AE=\"?\",\"?\",IF(AE:AE=\"?\",\"?\",IF(($B$2+3)-AF:AF>=0,0,IF(($B$2+3)-AF:AF>=-1,1,IF(($B$2+3)-AF:AF>=-2,2,3))))))","v":3},{"$f":"IF(AE:AE=\"pas d'actualité\",3,IF(AE:AE=\"?\",\"?\",IF(AE:AE=\"?\",\"?\",IF(($B$2+4)-AF:AF>=0,0,IF(($B$2+4)-AF:AF>=-1,1,IF(($B$2+4)-AF:AF>=-2,2,3))))))","v":3}]
["PR274","D274","FAB 274",null,1,null,null,null,null,null,null,null,null,null,null,null,null,null,null,null,null,null,null,null,null,null,null,"X",null,null,"pas d'actualité",{"$f":"IF(ISNUMBER(AE:AE),YEAR(AE:AE),AE:AE)","v":"pas d'actualité"},{"$f":"IF(AE:AE=\"pas d'actualité\",3,IF(AE:AE=\"?\",\"?\",IF(AE:AE=\"?\",\"?\",IF($B$2-AF:AF>=0,0,IF($B$2-AF:AF>=-1,1,IF($B$2-AF:AF>=-2,2,3))))))","v":3},{"$f":"IF(AE:AE=\"pas d'actualité\",3,IF(AE:AE=\"?\",\"?\",IF(AE:AE=\"?\",\"?\",IF((($B$2+1)-AF:AF)>=0,\"0\",IF((($B$2+1)-AF:AF)>=-1,\"1\",IF((($B$2+1)-AF:AF)>=-2,\"2\",\"3\"))))))","v":3},{"$f":"IF(AE:AE=\"pas d'actualité\",3,IF(AE:AE=\"?\",\"?\",IF(AE:AE=\"?\",\"?\",IF((($B$2+2)-AF:AF)>=0,0,IF((($B$2+2)-AF:AF)>=-1,1,IF((($B$2+2)-AF:AF)>=-2,2,3))))))","v":3},{"$f":"IF(AE:AE=\"pas d'actualité\",3,IF(AE:AE=\"?\",\"?\",IF(AE:AE=\"?\",\"?\",IF(($B$2+3)-AF:AF>=0,0,IF(($B$2+3)-AF:AF>=-1,1,IF(($B$2+3)-AF:AF>=-2,2,3))))))","v":3},{"$f":"IF(AE:AE=\"pas d'actualité\",3,IF(AE:AE=\"?\",\"?\",IF(AE:AE=\"?\",\"?\",IF(($B$2+4)-AF:AF>=0,0,IF(($B$2+4)-AF:AF>=-1,1,IF(($B$2+4)-AF:AF>=-2,2,3))))))","v":3}]
["PR275","D275","FAB 275",null,null,null,null,"X",null,null,null,null,null,null,null,null,null,null,null,null,null,null,null,null,null,null,null,null,null,null,"pas d'actualité",{"$f":"IF(ISNUMBER(AE:AE),YEAR(AE:AE),AE:AE)","v":"pas d'actualité"},{"$f":"IF(AE:AE=\"pas d'actualité\",3,IF(AE:AE=\"?\",\"?\",IF(AE:AE=\"?\",\"?\",IF($B$2-AF:AF>=0,0,IF($B$2-AF:AF>=-1,1,IF($B$2-AF:AF>=-2,2,3))))))","v":3},{"$f":"IF(AE:AE=\"pas d'actualité\",3,IF(AE:AE=\"?\",\"?\",IF(AE:AE=\"?\",\"?\",IF((($B$2+1)-AF:AF)>=0,\"0\",IF((($B$2+1)-AF:AF)>=-1,\"1\",IF((($B$2+1)-AF:AF)>=-2,\"2\",\"3\"))))))","v":3},{"$f":"IF(AE:AE=\"pas d'actualité\",3,IF(AE:AE=\"?\",\"?\",IF(AE:AE=\"?\",\"?\",IF((($B$2+2)-AF:AF)>=0,0,IF((($B$2+2)-AF:AF)>=-1,1,IF((($B$2+2)-AF:AF)>=-2,2,3))))))","v":3},{"$f":"IF(AE:AE=\"pas d'actualité\",3,IF(AE:AE=\"?\",\"?\",IF(AE:AE=\"?\",\"?\",IF(($B$2+3)-AF:AF>=0,0,IF(($B$2+3)-AF:AF>=-1,1,IF(($B$2+3)-AF:AF>=-2,2,3))))))","v":3},{"$f":"IF(AE:AE=\"pas d'actualité\",3,IF(AE:AE=\"?\",\"?\",IF(AE:AE=\"?\",\"?\",IF(($B$2+4)-AF:AF>=0,0,IF(($B$2+4)-AF:AF>=-1,1,IF(($B$2+4)-AF:AF>=-2,2,3))))))","v":3},null,null,"Annonce d'\u0092abandon du produit\n01/04/2006"]
["PR276","D276","FAB 276",null,1,null,null,null,null,"X","X","X",null,null,null,null,null,null,null,null,null,null,null,null,null,null,null,null,null,null,"pas d'actualité",{"$f":"IF(ISNUMBER(AE:AE),YEAR(AE:AE),AE:AE)","v":"pas d'actualité"},{"$f":"IF(AE:AE=\"pas d'actualité\",3,IF(AE:AE=\"?\",\"?\",IF(AE:AE=\"?\",\"?\",IF($B$2-AF:AF>=0,0,IF($B$2-AF:AF>=-1,1,IF($B$2-AF:AF>=-2,2,3))))))","v":3},{"$f":"IF(AE:AE=\"pas d'actualité\",3,IF(AE:AE=\"?\",\"?\",IF(AE:AE=\"?\",\"?\",IF((($B$2+1)-AF:AF)>=0,\"0\",IF((($B$2+1)-AF:AF)>=-1,\"1\",IF((($B$2+1)-AF:AF)>=-2,\"2\",\"3\"))))))","v":3},{"$f":"IF(AE:AE=\"pas d'actualité\",3,IF(AE:AE=\"?\",\"?\",IF(AE:AE=\"?\",\"?\",IF((($B$2+2)-AF:AF)>=0,0,IF((($B$2+2)-AF:AF)>=-1,1,IF((($B$2+2)-AF:AF)>=-2,2,3))))))","v":3},{"$f":"IF(AE:AE=\"pas d'actualité\",3,IF(AE:AE=\"?\",\"?\",IF(AE:AE=\"?\",\"?\",IF(($B$2+3)-AF:AF>=0,0,IF(($B$2+3)-AF:AF>=-1,1,IF(($B$2+3)-AF:AF>=-2,2,3))))))","v":3},{"$f":"IF(AE:AE=\"pas d'actualité\",3,IF(AE:AE=\"?\",\"?\",IF(AE:AE=\"?\",\"?\",IF(($B$2+4)-AF:AF>=0,0,IF(($B$2+4)-AF:AF>=-1,1,IF(($B$2+4)-AF:AF>=-2,2,3))))))","v":3}]
["PR277","D277","FAB 277",null,null,null,null,"X",null,null,null,null,null,null,null,null,null,null,null,null,null,null,null,null,null,null,null,null,null,null,"2019-09-30",{"$f":"IF(ISNUMBER(AE:AE),YEAR(AE:AE),AE:AE)","v":2019},{"$f":"IF(AE:AE=\"pas d'actualité\",3,IF(AE:AE=\"?\",\"?\",IF(AE:AE=\"?\",\"?\",IF($B$2-AF:AF>=0,0,IF($B$2-AF:AF>=-1,1,IF($B$2-AF:AF>=-2,2,3))))))","v":3},{"$f":"IF(AE:AE=\"pas d'actualité\",3,IF(AE:AE=\"?\",\"?\",IF(AE:AE=\"?\",\"?\",IF((($B$2+1)-AF:AF)>=0,\"0\",IF((($B$2+1)-AF:AF)>=-1,\"1\",IF((($B$2+1)-AF:AF)>=-2,\"2\",\"3\"))))))","v":"2"},{"$f":"IF(AE:AE=\"pas d'actualité\",3,IF(AE:AE=\"?\",\"?\",IF(AE:AE=\"?\",\"?\",IF((($B$2+2)-AF:AF)>=0,0,IF((($B$2+2)-AF:AF)>=-1,1,IF((($B$2+2)-AF:AF)>=-2,2,3))))))","v":1},{"$f":"IF(AE:AE=\"pas d'actualité\",3,IF(AE:AE=\"?\",\"?\",IF(AE:AE=\"?\",\"?\",IF(($B$2+3)-AF:AF>=0,0,IF(($B$2+3)-AF:AF>=-1,1,IF(($B$2+3)-AF:AF>=-2,2,3))))))","v":0},{"$f":"IF(AE:AE=\"pas d'actualité\",3,IF(AE:AE=\"?\",\"?\",IF(AE:AE=\"?\",\"?\",IF(($B$2+4)-AF:AF>=0,0,IF(($B$2+4)-AF:AF>=-1,1,IF(($B$2+4)-AF:AF>=-2,2,3))))))","v":0},null,"?"]
["PR278","D278","FAB 278",null,null,null,null,"X",null,null,null,null,null,null,null,null,null,null,null,null,null,null,null,null,null,null,null,null,null,null,"2024-09-30",{"$f":"IF(ISNUMBER(AE:AE),YEAR(AE:AE),AE:AE)","v":2024},{"$f":"IF(AE:AE=\"pas d'actualité\",3,IF(AE:AE=\"?\",\"?\",IF(AE:AE=\"?\",\"?\",IF($B$2-AF:AF>=0,0,IF($B$2-AF:AF>=-1,1,IF($B$2-AF:AF>=-2,2,3))))))","v":3},{"$f":"IF(AE:AE=\"pas d'actualité\",3,IF(AE:AE=\"?\",\"?\",IF(AE:AE=\"?\",\"?\",IF((($B$2+1)-AF:AF)>=0,\"0\",IF((($B$2+1)-AF:AF)>=-1,\"1\",IF((($B$2+1)-AF:AF)>=-2,\"2\",\"3\"))))))","v":"3"},{"$f":"IF(AE:AE=\"pas d'actualité\",3,IF(AE:AE=\"?\",\"?\",IF(AE:AE=\"?\",\"?\",IF((($B$2+2)-AF:AF)>=0,0,IF((($B$2+2)-AF:AF)>=-1,1,IF((($B$2+2)-AF:AF)>=-2,2,3))))))","v":3},{"$f":"IF(AE:AE=\"pas d'actualité\",3,IF(AE:AE=\"?\",\"?\",IF(AE:AE=\"?\",\"?\",IF(($B$2+3)-AF:AF>=0,0,IF(($B$2+3)-AF:AF>=-1,1,IF(($B$2+3)-AF:AF>=-2,2,3))))))","v":3},{"$f":"IF(AE:AE=\"pas d'actualité\",3,IF(AE:AE=\"?\",\"?\",IF(AE:AE=\"?\",\"?\",IF(($B$2+4)-AF:AF>=0,0,IF(($B$2+4)-AF:AF>=-1,1,IF(($B$2+4)-AF:AF>=-2,2,3))))))","v":3},null,"Entièrement compatible"]
["PR279","D279","FAB 279",null,null,null,null,null,null,null,null,"X",null,null,null,null,null,null,null,null,null,null,null,null,null,null,null,null,null,null,"pas d'actualité",{"$f":"IF(ISNUMBER(AE:AE),YEAR(AE:AE),AE:AE)","v":"pas d'actualité"},{"$f":"IF(AE:AE=\"pas d'actualité\",3,IF(AE:AE=\"?\",\"?\",IF(AE:AE=\"?\",\"?\",IF($B$2-AF:AF>=0,0,IF($B$2-AF:AF>=-1,1,IF($B$2-AF:AF>=-2,2,3))))))","v":3},{"$f":"IF(AE:AE=\"pas d'actualité\",3,IF(AE:AE=\"?\",\"?\",IF(AE:AE=\"?\",\"?\",IF((($B$2+1)-AF:AF)>=0,\"0\",IF((($B$2+1)-AF:AF)>=-1,\"1\",IF((($B$2+1)-AF:AF)>=-2,\"2\",\"3\"))))))","v":3},{"$f":"IF(AE:AE=\"pas d'actualité\",3,IF(AE:AE=\"?\",\"?\",IF(AE:AE=\"?\",\"?\",IF((($B$2+2)-AF:AF)>=0,0,IF((($B$2+2)-AF:AF)>=-1,1,IF((($B$2+2)-AF:AF)>=-2,2,3))))))","v":3},{"$f":"IF(AE:AE=\"pas d'actualité\",3,IF(AE:AE=\"?\",\"?\",IF(AE:AE=\"?\",\"?\",IF(($B$2+3)-AF:AF>=0,0,IF(($B$2+3)-AF:AF>=-1,1,IF(($B$2+3)-AF:AF>=-2,2,3))))))","v":3},{"$f":"IF(AE:AE=\"pas d'actualité\",3,IF(AE:AE=\"?\",\"?\",IF(AE:AE=\"?\",\"?\",IF(($B$2+4)-AF:AF>=0,0,IF(($B$2+4)-AF:AF>=-1,1,IF(($B$2+4)-AF:AF>=-2,2,3))))))","v":3}]
["PR280","D280","FAB 280",null,null,null,null,null,null,null,null,"X",null,null,null,null,null,null,null,null,null,null,null,null,null,null,null,null,null,null,"2024-09-30",{"$f":"IF(ISNUMBER(AE:AE),YEAR(AE:AE),AE:AE)","v":2024},{"$f":"IF(AE:AE=\"pas d'actualité\",3,IF(AE:AE=\"?\",\"?\",IF(AE:AE=\"?\",\"?\",IF($B$2-AF:AF>=0,0,IF($B$2-AF:AF>=-1,1,IF($B$2-AF:AF>=-2,2,3))))))","v":3},{"$f":"IF(AE:AE=\"pas d'actualité\",3,IF(AE:AE=\"?\",\"?\",IF(AE:AE=\"?\",\"?\",IF((($B$2+1)-AF:AF)>=0,\"0\",IF((($B$2+1)-AF:AF)>=-1,\"1\",IF((($B$2+1)-AF:AF)>=-2,\"2\",\"3\"))))))","v":"3"},{"$f":"IF(AE:AE=\"pas d'actualité\",3,IF(AE:AE=\"?\",\"?\",IF(AE:AE=\"?\",\"?\",IF((($B$2+2)-AF:AF)>=0,0,IF((($B$2+2)-AF:AF)>=-1,1,IF((($B$2+2)-AF:AF)>=-2,2,3))))))","v":3},{"$f":"IF(AE:AE=\"pas d'actualité\",3,IF(AE:AE=\"?\",\"?\",IF(AE:AE=\"?\",\"?\",IF(($B$2+3)-AF:AF>=0,0,IF(($B$2+3)-AF:AF>=-1,1,IF(($B$2+3)-AF:AF>=-2,2,3))))))","v":3},{"$f":"IF(AE:AE=\"pas d'actualité\",3,IF(AE:AE=\"?\",\"?\",IF(AE:AE=\"?\",\"?\",IF(($B$2+4)-AF:AF>=0,0,IF(($B$2+4)-AF:AF>=-1,1,IF(($B$2+4)-AF:AF>=-2,2,3))))))","v":3}]
["PR281","D281","FAB 281",null,null,null,null,"X","X",null,null,null,null,null,null,null,null,null,null,null,null,null,null,null,null,null,null,null,null,null,"2020-09-30",{"$f":"IF(ISNUMBER(AE:AE),YEAR(AE:AE),AE:AE)","v":2020},{"$f":"IF(AE:AE=\"pas d'actualité\",3,IF(AE:AE=\"?\",\"?\",IF(AE:AE=\"?\",\"?\",IF($B$2-AF:AF>=0,0,IF($B$2-AF:AF>=-1,1,IF($B$2-AF:AF>=-2,2,3))))))","v":3},{"$f":"IF(AE:AE=\"pas d'actualité\",3,IF(AE:AE=\"?\",\"?\",IF(AE:AE=\"?\",\"?\",IF((($B$2+1)-AF:AF)>=0,\"0\",IF((($B$2+1)-AF:AF)>=-1,\"1\",IF((($B$2+1)-AF:AF)>=-2,\"2\",\"3\"))))))","v":"3"},{"$f":"IF(AE:AE=\"pas d'actualité\",3,IF(AE:AE=\"?\",\"?\",IF(AE:AE=\"?\",\"?\",IF((($B$2+2)-AF:AF)>=0,0,IF((($B$2+2)-AF:AF)>=-1,1,IF((($B$2+2)-AF:AF)>=-2,2,3))))))","v":2},{"$f":"IF(AE:AE=\"pas d'actualité\",3,IF(AE:AE=\"?\",\"?\",IF(AE:AE=\"?\",\"?\",IF(($B$2+3)-AF:AF>=0,0,IF(($B$2+3)-AF:AF>=-1,1,IF(($B$2+3)-AF:AF>=-2,2,3))))))","v":1},{"$f":"IF(AE:AE=\"pas d'actualité\",3,IF(AE:AE=\"?\",\"?\",IF(AE:AE=\"?\",\"?\",IF(($B$2+4)-AF:AF>=0,0,IF(($B$2+4)-AF:AF>=-1,1,IF(($B$2+4)-AF:AF>=-2,2,3))))))","v":0}]
["PR282","D282","FAB 282",null,0,null,null,"X","X",null,null,null,null,null,null,null,null,null,null,null,null,null,null,null,null,null,null,null,null,null,"pas d'actualité",{"$f":"IF(ISNUMBER(AE:AE),YEAR(AE:AE),AE:AE)","v":"pas d'actualité"},{"$f":"IF(AE:AE=\"pas d'actualité\",3,IF(AE:AE=\"?\",\"?\",IF(AE:AE=\"?\",\"?\",IF($B$2-AF:AF>=0,0,IF($B$2-AF:AF>=-1,1,IF($B$2-AF:AF>=-2,2,3))))))","v":3},{"$f":"IF(AE:AE=\"pas d'actualité\",3,IF(AE:AE=\"?\",\"?\",IF(AE:AE=\"?\",\"?\",IF((($B$2+1)-AF:AF)>=0,\"0\",IF((($B$2+1)-AF:AF)>=-1,\"1\",IF((($B$2+1)-AF:AF)>=-2,\"2\",\"3\"))))))","v":3},{"$f":"IF(AE:AE=\"pas d'actualité\",3,IF(AE:AE=\"?\",\"?\",IF(AE:AE=\"?\",\"?\",IF((($B$2+2)-AF:AF)>=0,0,IF((($B$2+2)-AF:AF)>=-1,1,IF((($B$2+2)-AF:AF)>=-2,2,3))))))","v":3},{"$f":"IF(AE:AE=\"pas d'actualité\",3,IF(AE:AE=\"?\",\"?\",IF(AE:AE=\"?\",\"?\",IF(($B$2+3)-AF:AF>=0,0,IF(($B$2+3)-AF:AF>=-1,1,IF(($B$2+3)-AF:AF>=-2,2,3))))))","v":3},{"$f":"IF(AE:AE=\"pas d'actualité\",3,IF(AE:AE=\"?\",\"?\",IF(AE:AE=\"?\",\"?\",IF(($B$2+4)-AF:AF>=0,0,IF(($B$2+4)-AF:AF>=-1,1,IF(($B$2+4)-AF:AF>=-2,2,3))))))","v":3}]
["PR283","D283","FAB 283",null,null,null,null,null,null,null,null,"X",null,null,null,null,null,null,null,null,null,null,null,null,null,null,null,null,null,null,"pas d'actualité",{"$f":"IF(ISNUMBER(AE:AE),YEAR(AE:AE),AE:AE)","v":"pas d'actualité"},{"$f":"IF(AE:AE=\"pas d'actualité\",3,IF(AE:AE=\"?\",\"?\",IF(AE:AE=\"?\",\"?\",IF($B$2-AF:AF>=0,0,IF($B$2-AF:AF>=-1,1,IF($B$2-AF:AF>=-2,2,3))))))","v":3},{"$f":"IF(AE:AE=\"pas d'actualité\",3,IF(AE:AE=\"?\",\"?\",IF(AE:AE=\"?\",\"?\",IF((($B$2+1)-AF:AF)>=0,\"0\",IF((($B$2+1)-AF:AF)>=-1,\"1\",IF((($B$2+1)-AF:AF)>=-2,\"2\",\"3\"))))))","v":3},{"$f":"IF(AE:AE=\"pas d'actualité\",3,IF(AE:AE=\"?\",\"?\",IF(AE:AE=\"?\",\"?\",IF((($B$2+2)-AF:AF)>=0,0,IF((($B$2+2)-AF:AF)>=-1,1,IF((($B$2+2)-AF:AF)>=-2,2,3))))))","v":3},{"$f":"IF(AE:AE=\"pas d'actualité\",3,IF(AE:AE=\"?\",\"?\",IF(AE:AE=\"?\",\"?\",IF(($B$2+3)-AF:AF>=0,0,IF(($B$2+3)-AF:AF>=-1,1,IF(($B$2+3)-AF:AF>=-2,2,3))))))","v":3},{"$f":"IF(AE:AE=\"pas d'actualité\",3,IF(AE:AE=\"?\",\"?\",IF(AE:AE=\"?\",\"?\",IF(($B$2+4)-AF:AF>=0,0,IF(($B$2+4)-AF:AF>=-1,1,IF(($B$2+4)-AF:AF>=-2,2,3))))))","v":3}]
["PR284","D284","FAB 284",null,null,null,null,null,null,null,null,"X",null,null,null,null,null,null,null,null,null,null,null,null,null,null,null,null,null,null,"pas d'actualité",{"$f":"IF(ISNUMBER(AE:AE),YEAR(AE:AE),AE:AE)","v":"pas d'actualité"},{"$f":"IF(AE:AE=\"pas d'actualité\",3,IF(AE:AE=\"?\",\"?\",IF(AE:AE=\"?\",\"?\",IF($B$2-AF:AF>=0,0,IF($B$2-AF:AF>=-1,1,IF($B$2-AF:AF>=-2,2,3))))))","v":3},{"$f":"IF(AE:AE=\"pas d'actualité\",3,IF(AE:AE=\"?\",\"?\",IF(AE:AE=\"?\",\"?\",IF((($B$2+1)-AF:AF)>=0,\"0\",IF((($B$2+1)-AF:AF)>=-1,\"1\",IF((($B$2+1)-AF:AF)>=-2,\"2\",\"3\"))))))","v":3},{"$f":"IF(AE:AE=\"pas d'actualité\",3,IF(AE:AE=\"?\",\"?\",IF(AE:AE=\"?\",\"?\",IF((($B$2+2)-AF:AF)>=0,0,IF((($B$2+2)-AF:AF)>=-1,1,IF((($B$2+2)-AF:AF)>=-2,2,3))))))","v":3},{"$f":"IF(AE:AE=\"pas d'actualité\",3,IF(AE:AE=\"?\",\"?\",IF(AE:AE=\"?\",\"?\",IF(($B$2+3)-AF:AF>=0,0,IF(($B$2+3)-AF:AF>=-1,1,IF(($B$2+3)-AF:AF>=-2,2,3))))))","v":3},{"$f":"IF(AE:AE=\"pas d'actualité\",3,IF(AE:AE=\"?\",\"?\",IF(AE:AE=\"?\",\"?\",IF(($B$2+4)-AF:AF>=0,0,IF(($B$2+4)-AF:AF>=-1,1,IF(($B$2+4)-AF:AF>=-2,2,3))))))","v":3}]
["PR285","D285","FAB 285",null,1,null,null,null,null,null,null,null,null,null,"x",null,null,null,null,null,null,null,null,null,null,"X",null,null,null,null,"2021-09-30",{"$f":"IF(ISNUMBER(AE:AE),YEAR(AE:AE),AE:AE)","v":2021},{"$f":"IF(AE:AE=\"pas d'actualité\",3,IF(AE:AE=\"?\",\"?\",IF(AE:AE=\"?\",\"?\",IF($B$2-AF:AF>=0,0,IF($B$2-AF:AF>=-1,1,IF($B$2-AF:AF>=-2,2,3))))))","v":3},{"$f":"IF(AE:AE=\"pas d'actualité\",3,IF(AE:AE=\"?\",\"?\",IF(AE:AE=\"?\",\"?\",IF((($B$2+1)-AF:AF)>=0,\"0\",IF((($B$2+1)-AF:AF)>=-1,\"1\",IF((($B$2+1)-AF:AF)>=-2,\"2\",\"3\"))))))","v":"3"},{"$f":"IF(AE:AE=\"pas d'actualité\",3,IF(AE:AE=\"?\",\"?\",IF(AE:AE=\"?\",\"?\",IF((($B$2+2)-AF:AF)>=0,0,IF((($B$2+2)-AF:AF)>=-1,1,IF((($B$2+2)-AF:AF)>=-2,2,3))))))","v":3},{"$f":"IF(AE:AE=\"pas d'actualité\",3,IF(AE:AE=\"?\",\"?\",IF(AE:AE=\"?\",\"?\",IF(($B$2+3)-AF:AF>=0,0,IF(($B$2+3)-AF:AF>=-1,1,IF(($B$2+3)-AF:AF>=-2,2,3))))))","v":2},{"$f":"IF(AE:AE=\"pas d'actualité\",3,IF(AE:AE=\"?\",\"?\",IF(AE:AE=\"?\",\"?\",IF(($B$2+4)-AF:AF>=0,0,IF(($B$2+4)-AF:AF>=-1,1,IF(($B$2+4)-AF:AF>=-2,2,3))))))","v":1}]
["PR286","D286","FAB 286",null,null,null,null,null,null,null,null,null,null,null,"x",null,null,null,null,null,null,null,null,null,null,"X",null,null,null,null,"2022-09-30",{"$f":"IF(ISNUMBER(AE:AE),YEAR(AE:AE),AE:AE)","v":2022},{"$f":"IF(AE:AE=\"pas d'actualité\",3,IF(AE:AE=\"?\",\"?\",IF(AE:AE=\"?\",\"?\",IF($B$2-AF:AF>=0,0,IF($B$2-AF:AF>=-1,1,IF($B$2-AF:AF>=-2,2,3))))))","v":3},{"$f":"IF(AE:AE=\"pas d'actualité\",3,IF(AE:AE=\"?\",\"?\",IF(AE:AE=\"?\",\"?\",IF((($B$2+1)-AF:AF)>=0,\"0\",IF((($B$2+1)-AF:AF)>=-1,\"1\",IF((($B$2+1)-AF:AF)>=-2,\"2\",\"3\"))))))","v":"3"},{"$f":"IF(AE:AE=\"pas d'actualité\",3,IF(AE:AE=\"?\",\"?\",IF(AE:AE=\"?\",\"?\",IF((($B$2+2)-AF:AF)>=0,0,IF((($B$2+2)-AF:AF)>=-1,1,IF((($B$2+2)-AF:AF)>=-2,2,3))))))","v":3},{"$f":"IF(AE:AE=\"pas d'actualité\",3,IF(AE:AE=\"?\",\"?\",IF(AE:AE=\"?\",\"?\",IF(($B$2+3)-AF:AF>=0,0,IF(($B$2+3)-AF:AF>=-1,1,IF(($B$2+3)-AF:AF>=-2,2,3))))))","v":3},{"$f":"IF(AE:AE=\"pas d'actualité\",3,IF(AE:AE=\"?\",\"?\",IF(AE:AE=\"?\",\"?\",IF(($B$2+4)-AF:AF>=0,0,IF(($B$2+4)-AF:AF>=-1,1,IF(($B$2+4)-AF:AF>=-2,2,3))))))","v":2}]
["PR287","D287","FAB 287",null,1,null,null,null,null,null,null,null,null,null,"X",null,null,null,null,null,null,null,null,null,null,null,null,null,null,null,"2022-09-30",{"$f":"IF(ISNUMBER(AE:AE),YEAR(AE:AE),AE:AE)","v":2022},{"$f":"IF(AE:AE=\"pas d'actualité\",3,IF(AE:AE=\"?\",\"?\",IF(AE:AE=\"?\",\"?\",IF($B$2-AF:AF>=0,0,IF($B$2-AF:AF>=-1,1,IF($B$2-AF:AF>=-2,2,3))))))","v":3},{"$f":"IF(AE:AE=\"pas d'actualité\",3,IF(AE:AE=\"?\",\"?\",IF(AE:AE=\"?\",\"?\",IF((($B$2+1)-AF:AF)>=0,\"0\",IF((($B$2+1)-AF:AF)>=-1,\"1\",IF((($B$2+1)-AF:AF)>=-2,\"2\",\"3\"))))))","v":"3"},{"$f":"IF(AE:AE=\"pas d'actualité\",3,IF(AE:AE=\"?\",\"?\",IF(AE:AE=\"?\",\"?\",IF((($B$2+2)-AF:AF)>=0,0,IF((($B$2+2)-AF:AF)>=-1,1,IF((($B$2+2)-AF:AF)>=-2,2,3))))))","v":3},{"$f":"IF(AE:AE=\"pas d'actualité\",3,IF(AE:AE=\"?\",\"?\",IF(AE:AE=\"?\",\"?\",IF(($B$2+3)-AF:AF>=0,0,IF(($B$2+3)-AF:AF>=-1,1,IF(($B$2+3)-AF:AF>=-2,2,3))))))","v":3},{"$f":"IF(AE:AE=\"pas d'actualité\",3,IF(AE:AE=\"?\",\"?\",IF(AE:AE=\"?\",\"?\",IF(($B$2+4)-AF:AF>=0,0,IF(($B$2+4)-AF:AF>=-1,1,IF(($B$2+4)-AF:AF>=-2,2,3))))))","v":2}]
["PR288","D288","FAB 288",null,1,null,null,null,null,null,null,null,null,null,null,null,null,"X",null,null,null,null,null,null,null,null,null,null,null,null,"2020-01-10",{"$f":"IF(ISNUMBER(AE:AE),YEAR(AE:AE),AE:AE)","v":2020},{"$f":"IF(AE:AE=\"pas d'actualité\",3,IF(AE:AE=\"?\",\"?\",IF(AE:AE=\"?\",\"?\",IF($B$2-AF:AF>=0,0,IF($B$2-AF:AF>=-1,1,IF($B$2-AF:AF>=-2,2,3))))))","v":3},{"$f":"IF(AE:AE=\"pas d'actualité\",3,IF(AE:AE=\"?\",\"?\",IF(AE:AE=\"?\",\"?\",IF((($B$2+1)-AF:AF)>=0,\"0\",IF((($B$2+1)-AF:AF)>=-1,\"1\",IF((($B$2+1)-AF:AF)>=-2,\"2\",\"3\"))))))","v":"3"},{"$f":"IF(AE:AE=\"pas d'actualité\",3,IF(AE:AE=\"?\",\"?\",IF(AE:AE=\"?\",\"?\",IF((($B$2+2)-AF:AF)>=0,0,IF((($B$2+2)-AF:AF)>=-1,1,IF((($B$2+2)-AF:AF)>=-2,2,3))))))","v":2},{"$f":"IF(AE:AE=\"pas d'actualité\",3,IF(AE:AE=\"?\",\"?\",IF(AE:AE=\"?\",\"?\",IF(($B$2+3)-AF:AF>=0,0,IF(($B$2+3)-AF:AF>=-1,1,IF(($B$2+3)-AF:AF>=-2,2,3))))))","v":1},{"$f":"IF(AE:AE=\"pas d'actualité\",3,IF(AE:AE=\"?\",\"?\",IF(AE:AE=\"?\",\"?\",IF(($B$2+4)-AF:AF>=0,0,IF(($B$2+4)-AF:AF>=-1,1,IF(($B$2+4)-AF:AF>=-2,2,3))))))","v":0}]
["PR289","D289","FAB 289",null,1,null,null,null,null,null,null,null,null,null,null,null,null,null,null,null,null,null,null,null,null,null,null,"X",null,null,"2019-01-11",{"$f":"IF(ISNUMBER(AE:AE),YEAR(AE:AE),AE:AE)","v":2019},{"$f":"IF(AE:AE=\"pas d'actualité\",3,IF(AE:AE=\"?\",\"?\",IF(AE:AE=\"?\",\"?\",IF($B$2-AF:AF>=0,0,IF($B$2-AF:AF>=-1,1,IF($B$2-AF:AF>=-2,2,3))))))","v":3},{"$f":"IF(AE:AE=\"pas d'actualité\",3,IF(AE:AE=\"?\",\"?\",IF(AE:AE=\"?\",\"?\",IF((($B$2+1)-AF:AF)>=0,\"0\",IF((($B$2+1)-AF:AF)>=-1,\"1\",IF((($B$2+1)-AF:AF)>=-2,\"2\",\"3\"))))))","v":"2"},{"$f":"IF(AE:AE=\"pas d'actualité\",3,IF(AE:AE=\"?\",\"?\",IF(AE:AE=\"?\",\"?\",IF((($B$2+2)-AF:AF)>=0,0,IF((($B$2+2)-AF:AF)>=-1,1,IF((($B$2+2)-AF:AF)>=-2,2,3))))))","v":1},{"$f":"IF(AE:AE=\"pas d'actualité\",3,IF(AE:AE=\"?\",\"?\",IF(AE:AE=\"?\",\"?\",IF(($B$2+3)-AF:AF>=0,0,IF(($B$2+3)-AF:AF>=-1,1,IF(($B$2+3)-AF:AF>=-2,2,3))))))","v":0},{"$f":"IF(AE:AE=\"pas d'actualité\",3,IF(AE:AE=\"?\",\"?\",IF(AE:AE=\"?\",\"?\",IF(($B$2+4)-AF:AF>=0,0,IF(($B$2+4)-AF:AF>=-1,1,IF(($B$2+4)-AF:AF>=-2,2,3))))))","v":0}]
["PR290","D290","FAB 290",null,null,null,null,null,null,null,null,null,null,null,null,null,null,null,null,null,null,null,null,null,null,null,null,"X",null,null,"pas d'actualité",{"$f":"IF(ISNUMBER(AE:AE),YEAR(AE:AE),AE:AE)","v":"pas d'actualité"},{"$f":"IF(AE:AE=\"pas d'actualité\",3,IF(AE:AE=\"?\",\"?\",IF(AE:AE=\"?\",\"?\",IF($B$2-AF:AF>=0,0,IF($B$2-AF:AF>=-1,1,IF($B$2-AF:AF>=-2,2,3))))))","v":3},{"$f":"IF(AE:AE=\"pas d'actualité\",3,IF(AE:AE=\"?\",\"?\",IF(AE:AE=\"?\",\"?\",IF((($B$2+1)-AF:AF)>=0,\"0\",IF((($B$2+1)-AF:AF)>=-1,\"1\",IF((($B$2+1)-AF:AF)>=-2,\"2\",\"3\"))))))","v":3},{"$f":"IF(AE:AE=\"pas d'actualité\",3,IF(AE:AE=\"?\",\"?\",IF(AE:AE=\"?\",\"?\",IF((($B$2+2)-AF:AF)>=0,0,IF((($B$2+2)-AF:AF)>=-1,1,IF((($B$2+2)-AF:AF)>=-2,2,3))))))","v":3},{"$f":"IF(AE:AE=\"pas d'actualité\",3,IF(AE:AE=\"?\",\"?\",IF(AE:AE=\"?\",\"?\",IF(($B$2+3)-AF:AF>=0,0,IF(($B$2+3)-AF:AF>=-1,1,IF(($B$2+3)-AF:AF>=-2,2,3))))))","v":3},{"$f":"IF(AE:AE=\"pas d'actualité\",3,IF(AE:AE=\"?\",\"?\",IF(AE:AE=\"?\",\"?\",IF(($B$2+4)-AF:AF>=0,0,IF(($B$2+4)-AF:AF>=-1,1,IF(($B$2+4)-AF:AF>=-2,2,3))))))","v":3}]
["PR291","D291","FAB 291",null,null,null,null,null,null,null,null,"X",null,null,null,null,null,null,null,null,null,null,null,null,null,null,null,null,null,null,"pas d'actualité",{"$f":"IF(ISNUMBER(AE:AE),YEAR(AE:AE),AE:AE)","v":"pas d'actualité"},{"$f":"IF(AE:AE=\"pas d'actualité\",3,IF(AE:AE=\"?\",\"?\",IF(AE:AE=\"?\",\"?\",IF($B$2-AF:AF>=0,0,IF($B$2-AF:AF>=-1,1,IF($B$2-AF:AF>=-2,2,3))))))","v":3},{"$f":"IF(AE:AE=\"pas d'actualité\",3,IF(AE:AE=\"?\",\"?\",IF(AE:AE=\"?\",\"?\",IF((($B$2+1)-AF:AF)>=0,\"0\",IF((($B$2+1)-AF:AF)>=-1,\"1\",IF((($B$2+1)-AF:AF)>=-2,\"2\",\"3\"))))))","v":3},{"$f":"IF(AE:AE=\"pas d'actualité\",3,IF(AE:AE=\"?\",\"?\",IF(AE:AE=\"?\",\"?\",IF((($B$2+2)-AF:AF)>=0,0,IF((($B$2+2)-AF:AF)>=-1,1,IF((($B$2+2)-AF:AF)>=-2,2,3))))))","v":3},{"$f":"IF(AE:AE=\"pas d'actualité\",3,IF(AE:AE=\"?\",\"?\",IF(AE:AE=\"?\",\"?\",IF(($B$2+3)-AF:AF>=0,0,IF(($B$2+3)-AF:AF>=-1,1,IF(($B$2+3)-AF:AF>=-2,2,3))))))","v":3},{"$f":"IF(AE:AE=\"pas d'actualité\",3,IF(AE:AE=\"?\",\"?\",IF(AE:AE=\"?\",\"?\",IF(($B$2+4)-AF:AF>=0,0,IF(($B$2+4)-AF:AF>=-1,1,IF(($B$2+4)-AF:AF>=-2,2,3))))))","v":3}]
["PR292","D292","FAB 292",null,null,null,null,null,null,null,null,"X",null,null,null,null,null,null,null,null,null,null,null,null,null,null,null,null,null,null,"pas d'actualité",{"$f":"IF(ISNUMBER(AE:AE),YEAR(AE:AE),AE:AE)","v":"pas d'actualité"},{"$f":"IF(AE:AE=\"pas d'actualité\",3,IF(AE:AE=\"?\",\"?\",IF(AE:AE=\"?\",\"?\",IF($B$2-AF:AF>=0,0,IF($B$2-AF:AF>=-1,1,IF($B$2-AF:AF>=-2,2,3))))))","v":3},{"$f":"IF(AE:AE=\"pas d'actualité\",3,IF(AE:AE=\"?\",\"?\",IF(AE:AE=\"?\",\"?\",IF((($B$2+1)-AF:AF)>=0,\"0\",IF((($B$2+1)-AF:AF)>=-1,\"1\",IF((($B$2+1)-AF:AF)>=-2,\"2\",\"3\"))))))","v":3},{"$f":"IF(AE:AE=\"pas d'actualité\",3,IF(AE:AE=\"?\",\"?\",IF(AE:AE=\"?\",\"?\",IF((($B$2+2)-AF:AF)>=0,0,IF((($B$2+2)-AF:AF)>=-1,1,IF((($B$2+2)-AF:AF)>=-2,2,3))))))","v":3},{"$f":"IF(AE:AE=\"pas d'actualité\",3,IF(AE:AE=\"?\",\"?\",IF(AE:AE=\"?\",\"?\",IF(($B$2+3)-AF:AF>=0,0,IF(($B$2+3)-AF:AF>=-1,1,IF(($B$2+3)-AF:AF>=-2,2,3))))))","v":3},{"$f":"IF(AE:AE=\"pas d'actualité\",3,IF(AE:AE=\"?\",\"?\",IF(AE:AE=\"?\",\"?\",IF(($B$2+4)-AF:AF>=0,0,IF(($B$2+4)-AF:AF>=-1,1,IF(($B$2+4)-AF:AF>=-2,2,3))))))","v":3}]
["PR293","D293","FAB 293",null,null,null,null,null,null,null,null,"X",null,null,null,null,null,null,null,null,null,null,null,null,null,null,null,null,null,null,"pas d'actualité",{"$f":"IF(ISNUMBER(AE:AE),YEAR(AE:AE),AE:AE)","v":"pas d'actualité"},{"$f":"IF(AE:AE=\"pas d'actualité\",3,IF(AE:AE=\"?\",\"?\",IF(AE:AE=\"?\",\"?\",IF($B$2-AF:AF>=0,0,IF($B$2-AF:AF>=-1,1,IF($B$2-AF:AF>=-2,2,3))))))","v":3},{"$f":"IF(AE:AE=\"pas d'actualité\",3,IF(AE:AE=\"?\",\"?\",IF(AE:AE=\"?\",\"?\",IF((($B$2+1)-AF:AF)>=0,\"0\",IF((($B$2+1)-AF:AF)>=-1,\"1\",IF((($B$2+1)-AF:AF)>=-2,\"2\",\"3\"))))))","v":3},{"$f":"IF(AE:AE=\"pas d'actualité\",3,IF(AE:AE=\"?\",\"?\",IF(AE:AE=\"?\",\"?\",IF((($B$2+2)-AF:AF)>=0,0,IF((($B$2+2)-AF:AF)>=-1,1,IF((($B$2+2)-AF:AF)>=-2,2,3))))))","v":3},{"$f":"IF(AE:AE=\"pas d'actualité\",3,IF(AE:AE=\"?\",\"?\",IF(AE:AE=\"?\",\"?\",IF(($B$2+3)-AF:AF>=0,0,IF(($B$2+3)-AF:AF>=-1,1,IF(($B$2+3)-AF:AF>=-2,2,3))))))","v":3},{"$f":"IF(AE:AE=\"pas d'actualité\",3,IF(AE:AE=\"?\",\"?\",IF(AE:AE=\"?\",\"?\",IF(($B$2+4)-AF:AF>=0,0,IF(($B$2+4)-AF:AF>=-1,1,IF(($B$2+4)-AF:AF>=-2,2,3))))))","v":3}]
["PR294","D294","FAB 294",null,null,null,null,null,null,null,null,"X",null,null,null,null,null,null,null,null,null,null,null,null,null,null,null,null,null,null,"pas d'actualité",{"$f":"IF(ISNUMBER(AE:AE),YEAR(AE:AE),AE:AE)","v":"pas d'actualité"},{"$f":"IF(AE:AE=\"pas d'actualité\",3,IF(AE:AE=\"?\",\"?\",IF(AE:AE=\"?\",\"?\",IF($B$2-AF:AF>=0,0,IF($B$2-AF:AF>=-1,1,IF($B$2-AF:AF>=-2,2,3))))))","v":3},{"$f":"IF(AE:AE=\"pas d'actualité\",3,IF(AE:AE=\"?\",\"?\",IF(AE:AE=\"?\",\"?\",IF((($B$2+1)-AF:AF)>=0,\"0\",IF((($B$2+1)-AF:AF)>=-1,\"1\",IF((($B$2+1)-AF:AF)>=-2,\"2\",\"3\"))))))","v":3},{"$f":"IF(AE:AE=\"pas d'actualité\",3,IF(AE:AE=\"?\",\"?\",IF(AE:AE=\"?\",\"?\",IF((($B$2+2)-AF:AF)>=0,0,IF((($B$2+2)-AF:AF)>=-1,1,IF((($B$2+2)-AF:AF)>=-2,2,3))))))","v":3},{"$f":"IF(AE:AE=\"pas d'actualité\",3,IF(AE:AE=\"?\",\"?\",IF(AE:AE=\"?\",\"?\",IF(($B$2+3)-AF:AF>=0,0,IF(($B$2+3)-AF:AF>=-1,1,IF(($B$2+3)-AF:AF>=-2,2,3))))))","v":3},{"$f":"IF(AE:AE=\"pas d'actualité\",3,IF(AE:AE=\"?\",\"?\",IF(AE:AE=\"?\",\"?\",IF(($B$2+4)-AF:AF>=0,0,IF(($B$2+4)-AF:AF>=-1,1,IF(($B$2+4)-AF:AF>=-2,2,3))))))","v":3}]
["PR295","D295","FAB 295",null,null,null,null,null,null,null,null,"X",null,null,null,null,null,null,null,null,null,null,null,null,null,null,null,null,null,null,"2023-09-30",{"$f":"IF(ISNUMBER(AE:AE),YEAR(AE:AE),AE:AE)","v":2023},{"$f":"IF(AE:AE=\"pas d'actualité\",3,IF(AE:AE=\"?\",\"?\",IF(AE:AE=\"?\",\"?\",IF($B$2-AF:AF>=0,0,IF($B$2-AF:AF>=-1,1,IF($B$2-AF:AF>=-2,2,3))))))","v":3},{"$f":"IF(AE:AE=\"pas d'actualité\",3,IF(AE:AE=\"?\",\"?\",IF(AE:AE=\"?\",\"?\",IF((($B$2+1)-AF:AF)>=0,\"0\",IF((($B$2+1)-AF:AF)>=-1,\"1\",IF((($B$2+1)-AF:AF)>=-2,\"2\",\"3\"))))))","v":"3"},{"$f":"IF(AE:AE=\"pas d'actualité\",3,IF(AE:AE=\"?\",\"?\",IF(AE:AE=\"?\",\"?\",IF((($B$2+2)-AF:AF)>=0,0,IF((($B$2+2)-AF:AF)>=-1,1,IF((($B$2+2)-AF:AF)>=-2,2,3))))))","v":3},{"$f":"IF(AE:AE=\"pas d'actualité\",3,IF(AE:AE=\"?\",\"?\",IF(AE:AE=\"?\",\"?\",IF(($B$2+3)-AF:AF>=0,0,IF(($B$2+3)-AF:AF>=-1,1,IF(($B$2+3)-AF:AF>=-2,2,3))))))","v":3},{"$f":"IF(AE:AE=\"pas d'actualité\",3,IF(AE:AE=\"?\",\"?\",IF(AE:AE=\"?\",\"?\",IF(($B$2+4)-AF:AF>=0,0,IF(($B$2+4)-AF:AF>=-1,1,IF(($B$2+4)-AF:AF>=-2,2,3))))))","v":3},null,"Partiellement compatible"]
["PR296","D296","FAB 296",null,null,null,null,null,null,null,null,"X",null,null,null,null,null,null,null,null,null,null,null,null,null,null,null,null,null,null,"2024-09-30",{"$f":"IF(ISNUMBER(AE:AE),YEAR(AE:AE),AE:AE)","v":2024},{"$f":"IF(AE:AE=\"pas d'actualité\",3,IF(AE:AE=\"?\",\"?\",IF(AE:AE=\"?\",\"?\",IF($B$2-AF:AF>=0,0,IF($B$2-AF:AF>=-1,1,IF($B$2-AF:AF>=-2,2,3))))))","v":3},{"$f":"IF(AE:AE=\"pas d'actualité\",3,IF(AE:AE=\"?\",\"?\",IF(AE:AE=\"?\",\"?\",IF((($B$2+1)-AF:AF)>=0,\"0\",IF((($B$2+1)-AF:AF)>=-1,\"1\",IF((($B$2+1)-AF:AF)>=-2,\"2\",\"3\"))))))","v":"3"},{"$f":"IF(AE:AE=\"pas d'actualité\",3,IF(AE:AE=\"?\",\"?\",IF(AE:AE=\"?\",\"?\",IF((($B$2+2)-AF:AF)>=0,0,IF((($B$2+2)-AF:AF)>=-1,1,IF((($B$2+2)-AF:AF)>=-2,2,3))))))","v":3},{"$f":"IF(AE:AE=\"pas d'actualité\",3,IF(AE:AE=\"?\",\"?\",IF(AE:AE=\"?\",\"?\",IF(($B$2+3)-AF:AF>=0,0,IF(($B$2+3)-AF:AF>=-1,1,IF(($B$2+3)-AF:AF>=-2,2,3))))))","v":3},{"$f":"IF(AE:AE=\"pas d'actualité\",3,IF(AE:AE=\"?\",\"?\",IF(AE:AE=\"?\",\"?\",IF(($B$2+4)-AF:AF>=0,0,IF(($B$2+4)-AF:AF>=-1,1,IF(($B$2+4)-AF:AF>=-2,2,3))))))","v":3},null,"Partiellement compatible"]
["PR297","D297","FAB 297",null,null,null,null,null,null,null,null,"X",null,null,null,null,null,null,null,null,null,null,null,null,null,null,null,null,null,null,"pas d'actualité",{"$f":"IF(ISNUMBER(AE:AE),YEAR(AE:AE),AE:AE)","v":"pas d'actualité"},{"$f":"IF(AE:AE=\"pas d'actualité\",3,IF(AE:AE=\"?\",\"?\",IF(AE:AE=\"?\",\"?\",IF($B$2-AF:AF>=0,0,IF($B$2-AF:AF>=-1,1,IF($B$2-AF:AF>=-2,2,3))))))","v":3},{"$f":"IF(AE:AE=\"pas d'actualité\",3,IF(AE:AE=\"?\",\"?\",IF(AE:AE=\"?\",\"?\",IF((($B$2+1)-AF:AF)>=0,\"0\",IF((($B$2+1)-AF:AF)>=-1,\"1\",IF((($B$2+1)-AF:AF)>=-2,\"2\",\"3\"))))))","v":3},{"$f":"IF(AE:AE=\"pas d'actualité\",3,IF(AE:AE=\"?\",\"?\",IF(AE:AE=\"?\",\"?\",IF((($B$2+2)-AF:AF)>=0,0,IF((($B$2+2)-AF:AF)>=-1,1,IF((($B$2+2)-AF:AF)>=-2,2,3))))))","v":3},{"$f":"IF(AE:AE=\"pas d'actualité\",3,IF(AE:AE=\"?\",\"?\",IF(AE:AE=\"?\",\"?\",IF(($B$2+3)-AF:AF>=0,0,IF(($B$2+3)-AF:AF>=-1,1,IF(($B$2+3)-AF:AF>=-2,2,3))))))","v":3},{"$f":"IF(AE:AE=\"pas d'actualité\",3,IF(AE:AE=\"?\",\"?\",IF(AE:AE=\"?\",\"?\",IF(($B$2+4)-AF:AF>=0,0,IF(($B$2+4)-AF:AF>=-1,1,IF(($B$2+4)-AF:AF>=-2,2,3))))))","v":3}]
["PR298","D298","FAB 298",null,null,null,null,null,null,null,null,"X",null,null,null,null,null,null,null,null,null,null,null,null,null,null,null,null,null,null,"pas d'actualité",{"$f":"IF(ISNUMBER(AE:AE),YEAR(AE:AE),AE:AE)","v":"pas d'actualité"},{"$f":"IF(AE:AE=\"pas d'actualité\",3,IF(AE:AE=\"?\",\"?\",IF(AE:AE=\"?\",\"?\",IF($B$2-AF:AF>=0,0,IF($B$2-AF:AF>=-1,1,IF($B$2-AF:AF>=-2,2,3))))))","v":3},{"$f":"IF(AE:AE=\"pas d'actualité\",3,IF(AE:AE=\"?\",\"?\",IF(AE:AE=\"?\",\"?\",IF((($B$2+1)-AF:AF)>=0,\"0\",IF((($B$2+1)-AF:AF)>=-1,\"1\",IF((($B$2+1)-AF:AF)>=-2,\"2\",\"3\"))))))","v":3},{"$f":"IF(AE:AE=\"pas d'actualité\",3,IF(AE:AE=\"?\",\"?\",IF(AE:AE=\"?\",\"?\",IF((($B$2+2)-AF:AF)>=0,0,IF((($B$2+2)-AF:AF)>=-1,1,IF((($B$2+2)-AF:AF)>=-2,2,3))))))","v":3},{"$f":"IF(AE:AE=\"pas d'actualité\",3,IF(AE:AE=\"?\",\"?\",IF(AE:AE=\"?\",\"?\",IF(($B$2+3)-AF:AF>=0,0,IF(($B$2+3)-AF:AF>=-1,1,IF(($B$2+3)-AF:AF>=-2,2,3))))))","v":3},{"$f":"IF(AE:AE=\"pas d'actualité\",3,IF(AE:AE=\"?\",\"?\",IF(AE:AE=\"?\",\"?\",IF(($B$2+4)-AF:AF>=0,0,IF(($B$2+4)-AF:AF>=-1,1,IF(($B$2+4)-AF:AF>=-2,2,3))))))","v":3}]
["PR299","D299","FAB 299",null,null,null,null,null,null,null,null,"X",null,null,null,null,null,null,null,null,null,null,null,null,null,null,null,null,null,null,"pas d'actualité",{"$f":"IF(ISNUMBER(AE:AE),YEAR(AE:AE),AE:AE)","v":"pas d'actualité"},{"$f":"IF(AE:AE=\"pas d'actualité\",3,IF(AE:AE=\"?\",\"?\",IF(AE:AE=\"?\",\"?\",IF($B$2-AF:AF>=0,0,IF($B$2-AF:AF>=-1,1,IF($B$2-AF:AF>=-2,2,3))))))","v":3},{"$f":"IF(AE:AE=\"pas d'actualité\",3,IF(AE:AE=\"?\",\"?\",IF(AE:AE=\"?\",\"?\",IF((($B$2+1)-AF:AF)>=0,\"0\",IF((($B$2+1)-AF:AF)>=-1,\"1\",IF((($B$2+1)-AF:AF)>=-2,\"2\",\"3\"))))))","v":3},{"$f":"IF(AE:AE=\"pas d'actualité\",3,IF(AE:AE=\"?\",\"?\",IF(AE:AE=\"?\",\"?\",IF((($B$2+2)-AF:AF)>=0,0,IF((($B$2+2)-AF:AF)>=-1,1,IF((($B$2+2)-AF:AF)>=-2,2,3))))))","v":3},{"$f":"IF(AE:AE=\"pas d'actualité\",3,IF(AE:AE=\"?\",\"?\",IF(AE:AE=\"?\",\"?\",IF(($B$2+3)-AF:AF>=0,0,IF(($B$2+3)-AF:AF>=-1,1,IF(($B$2+3)-AF:AF>=-2,2,3))))))","v":3},{"$f":"IF(AE:AE=\"pas d'actualité\",3,IF(AE:AE=\"?\",\"?\",IF(AE:AE=\"?\",\"?\",IF(($B$2+4)-AF:AF>=0,0,IF(($B$2+4)-AF:AF>=-1,1,IF(($B$2+4)-AF:AF>=-2,2,3))))))","v":3}]
["PR300","D300","FAB 300",null,null,null,null,null,null,null,null,"X",null,null,null,null,null,null,null,null,null,null,null,null,null,null,null,null,null,null,"2023-09-30",{"$f":"IF(ISNUMBER(AE:AE),YEAR(AE:AE),AE:AE)","v":2023},{"$f":"IF(AE:AE=\"pas d'actualité\",3,IF(AE:AE=\"?\",\"?\",IF(AE:AE=\"?\",\"?\",IF($B$2-AF:AF>=0,0,IF($B$2-AF:AF>=-1,1,IF($B$2-AF:AF>=-2,2,3))))))","v":3},{"$f":"IF(AE:AE=\"pas d'actualité\",3,IF(AE:AE=\"?\",\"?\",IF(AE:AE=\"?\",\"?\",IF((($B$2+1)-AF:AF)>=0,\"0\",IF((($B$2+1)-AF:AF)>=-1,\"1\",IF((($B$2+1)-AF:AF)>=-2,\"2\",\"3\"))))))","v":"3"},{"$f":"IF(AE:AE=\"pas d'actualité\",3,IF(AE:AE=\"?\",\"?\",IF(AE:AE=\"?\",\"?\",IF((($B$2+2)-AF:AF)>=0,0,IF((($B$2+2)-AF:AF)>=-1,1,IF((($B$2+2)-AF:AF)>=-2,2,3))))))","v":3},{"$f":"IF(AE:AE=\"pas d'actualité\",3,IF(AE:AE=\"?\",\"?\",IF(AE:AE=\"?\",\"?\",IF(($B$2+3)-AF:AF>=0,0,IF(($B$2+3)-AF:AF>=-1,1,IF(($B$2+3)-AF:AF>=-2,2,3))))))","v":3},{"$f":"IF(AE:AE=\"pas d'actualité\",3,IF(AE:AE=\"?\",\"?\",IF(AE:AE=\"?\",\"?\",IF(($B$2+4)-AF:AF>=0,0,IF(($B$2+4)-AF:AF>=-1,1,IF(($B$2+4)-AF:AF>=-2,2,3))))))","v":3},null,"Partiellement compatible"]
["PR301","D301","FAB 301",null,null,null,null,null,null,null,null,"X",null,null,null,null,null,null,null,null,null,null,null,null,null,null,null,null,null,null,"pas d'actualité",{"$f":"IF(ISNUMBER(AE:AE),YEAR(AE:AE),AE:AE)","v":"pas d'actualité"},{"$f":"IF(AE:AE=\"pas d'actualité\",3,IF(AE:AE=\"?\",\"?\",IF(AE:AE=\"?\",\"?\",IF($B$2-AF:AF>=0,0,IF($B$2-AF:AF>=-1,1,IF($B$2-AF:AF>=-2,2,3))))))","v":3},{"$f":"IF(AE:AE=\"pas d'actualité\",3,IF(AE:AE=\"?\",\"?\",IF(AE:AE=\"?\",\"?\",IF((($B$2+1)-AF:AF)>=0,\"0\",IF((($B$2+1)-AF:AF)>=-1,\"1\",IF((($B$2+1)-AF:AF)>=-2,\"2\",\"3\"))))))","v":3},{"$f":"IF(AE:AE=\"pas d'actualité\",3,IF(AE:AE=\"?\",\"?\",IF(AE:AE=\"?\",\"?\",IF((($B$2+2)-AF:AF)>=0,0,IF((($B$2+2)-AF:AF)>=-1,1,IF((($B$2+2)-AF:AF)>=-2,2,3))))))","v":3},{"$f":"IF(AE:AE=\"pas d'actualité\",3,IF(AE:AE=\"?\",\"?\",IF(AE:AE=\"?\",\"?\",IF(($B$2+3)-AF:AF>=0,0,IF(($B$2+3)-AF:AF>=-1,1,IF(($B$2+3)-AF:AF>=-2,2,3))))))","v":3},{"$f":"IF(AE:AE=\"pas d'actualité\",3,IF(AE:AE=\"?\",\"?\",IF(AE:AE=\"?\",\"?\",IF(($B$2+4)-AF:AF>=0,0,IF(($B$2+4)-AF:AF>=-1,1,IF(($B$2+4)-AF:AF>=-2,2,3))))))","v":3}]
["PR302","D302","FAB 302",null,null,null,null,null,null,null,null,null,null,null,null,null,null,null,null,null,null,null,null,null,null,null,null,null,null,null,"pas d'actualité",{"$f":"IF(ISNUMBER(AE:AE),YEAR(AE:AE),AE:AE)","v":"pas d'actualité"},{"$f":"IF(AE:AE=\"pas d'actualité\",3,IF(AE:AE=\"?\",\"?\",IF(AE:AE=\"?\",\"?\",IF($B$2-AF:AF>=0,0,IF($B$2-AF:AF>=-1,1,IF($B$2-AF:AF>=-2,2,3))))))","v":3},{"$f":"IF(AE:AE=\"pas d'actualité\",3,IF(AE:AE=\"?\",\"?\",IF(AE:AE=\"?\",\"?\",IF((($B$2+1)-AF:AF)>=0,\"0\",IF((($B$2+1)-AF:AF)>=-1,\"1\",IF((($B$2+1)-AF:AF)>=-2,\"2\",\"3\"))))))","v":3},{"$f":"IF(AE:AE=\"pas d'actualité\",3,IF(AE:AE=\"?\",\"?\",IF(AE:AE=\"?\",\"?\",IF((($B$2+2)-AF:AF)>=0,0,IF((($B$2+2)-AF:AF)>=-1,1,IF((($B$2+2)-AF:AF)>=-2,2,3))))))","v":3},{"$f":"IF(AE:AE=\"pas d'actualité\",3,IF(AE:AE=\"?\",\"?\",IF(AE:AE=\"?\",\"?\",IF(($B$2+3)-AF:AF>=0,0,IF(($B$2+3)-AF:AF>=-1,1,IF(($B$2+3)-AF:AF>=-2,2,3))))))","v":3},{"$f":"IF(AE:AE=\"pas d'actualité\",3,IF(AE:AE=\"?\",\"?\",IF(AE:AE=\"?\",\"?\",IF(($B$2+4)-AF:AF>=0,0,IF(($B$2+4)-AF:AF>=-1,1,IF(($B$2+4)-AF:AF>=-2,2,3))))))","v":3}]
["PR303","D303","FAB 303",null,1,null,null,null,null,null,null,null,null,null,null,null,null,null,null,null,null,null,null,null,null,"X",null,null,null,null,"pas d'actualité",{"$f":"IF(ISNUMBER(AE:AE),YEAR(AE:AE),AE:AE)","v":"pas d'actualité"},{"$f":"IF(AE:AE=\"pas d'actualité\",3,IF(AE:AE=\"?\",\"?\",IF(AE:AE=\"?\",\"?\",IF($B$2-AF:AF>=0,0,IF($B$2-AF:AF>=-1,1,IF($B$2-AF:AF>=-2,2,3))))))","v":3},{"$f":"IF(AE:AE=\"pas d'actualité\",3,IF(AE:AE=\"?\",\"?\",IF(AE:AE=\"?\",\"?\",IF((($B$2+1)-AF:AF)>=0,\"0\",IF((($B$2+1)-AF:AF)>=-1,\"1\",IF((($B$2+1)-AF:AF)>=-2,\"2\",\"3\"))))))","v":3},{"$f":"IF(AE:AE=\"pas d'actualité\",3,IF(AE:AE=\"?\",\"?\",IF(AE:AE=\"?\",\"?\",IF((($B$2+2)-AF:AF)>=0,0,IF((($B$2+2)-AF:AF)>=-1,1,IF((($B$2+2)-AF:AF)>=-2,2,3))))))","v":3},{"$f":"IF(AE:AE=\"pas d'actualité\",3,IF(AE:AE=\"?\",\"?\",IF(AE:AE=\"?\",\"?\",IF(($B$2+3)-AF:AF>=0,0,IF(($B$2+3)-AF:AF>=-1,1,IF(($B$2+3)-AF:AF>=-2,2,3))))))","v":3},{"$f":"IF(AE:AE=\"pas d'actualité\",3,IF(AE:AE=\"?\",\"?\",IF(AE:AE=\"?\",\"?\",IF(($B$2+4)-AF:AF>=0,0,IF(($B$2+4)-AF:AF>=-1,1,IF(($B$2+4)-AF:AF>=-2,2,3))))))","v":3},null,null,"produit qui va être intérrompu"]
["PR304","D304","FAB 304",null,1,null,null,null,"X","X","X",null,"X",null,"X",null,null,null,null,null,null,null,null,null,null,null,null,null,null,null,"2024-01-04",{"$f":"IF(ISNUMBER(AE:AE),YEAR(AE:AE),AE:AE)","v":2024},{"$f":"IF(AE:AE=\"pas d'actualité\",3,IF(AE:AE=\"?\",\"?\",IF(AE:AE=\"?\",\"?\",IF($B$2-AF:AF>=0,0,IF($B$2-AF:AF>=-1,1,IF($B$2-AF:AF>=-2,2,3))))))","v":3},{"$f":"IF(AE:AE=\"pas d'actualité\",3,IF(AE:AE=\"?\",\"?\",IF(AE:AE=\"?\",\"?\",IF((($B$2+1)-AF:AF)>=0,\"0\",IF((($B$2+1)-AF:AF)>=-1,\"1\",IF((($B$2+1)-AF:AF)>=-2,\"2\",\"3\"))))))","v":"3"},{"$f":"IF(AE:AE=\"pas d'actualité\",3,IF(AE:AE=\"?\",\"?\",IF(AE:AE=\"?\",\"?\",IF((($B$2+2)-AF:AF)>=0,0,IF((($B$2+2)-AF:AF)>=-1,1,IF((($B$2+2)-AF:AF)>=-2,2,3))))))","v":3},{"$f":"IF(AE:AE=\"pas d'actualité\",3,IF(AE:AE=\"?\",\"?\",IF(AE:AE=\"?\",\"?\",IF(($B$2+3)-AF:AF>=0,0,IF(($B$2+3)-AF:AF>=-1,1,IF(($B$2+3)-AF:AF>=-2,2,3))))))","v":3},{"$f":"IF(AE:AE=\"pas d'actualité\",3,IF(AE:AE=\"?\",\"?\",IF(AE:AE=\"?\",\"?\",IF(($B$2+4)-AF:AF>=0,0,IF(($B$2+4)-AF:AF>=-1,1,IF(($B$2+4)-AF:AF>=-2,2,3))))))","v":3},null,null,"ARRET TOTAL FOURNITURE 31/12/2030"]
["PR 350","D351","FAB 351",null,1,null,null,null,null,null,null,null,null,null,null,null,null,null,"X",null,null,null,null,null,null,null,null,null,null,null,"?",{"$f":"IF(ISNUMBER(AE:AE),YEAR(AE:AE),AE:AE)","v":"?"},{"$f":"IF(AE:AE=\"pas d'actualité\",3,IF(AE:AE=\"?\",\"?\",IF(AE:AE=\"?\",\"?\",IF($B$2-AF:AF>=0,0,IF($B$2-AF:AF>=-1,1,IF($B$2-AF:AF>=-2,2,3))))))","v":"?"},{"$f":"IF(AE:AE=\"pas d'actualité\",3,IF(AE:AE=\"?\",\"?\",IF(AE:AE=\"?\",\"?\",IF((($B$2+1)-AF:AF)>=0,\"0\",IF((($B$2+1)-AF:AF)>=-1,\"1\",IF((($B$2+1)-AF:AF)>=-2,\"2\",\"3\"))))))","v":"?"},{"$f":"IF(AE:AE=\"pas d'actualité\",3,IF(AE:AE=\"?\",\"?\",IF(AE:AE=\"?\",\"?\",IF((($B$2+2)-AF:AF)>=0,0,IF((($B$2+2)-AF:AF)>=-1,1,IF((($B$2+2)-AF:AF)>=-2,2,3))))))","v":"?"},{"$f":"IF(AE:AE=\"pas d'actualité\",3,IF(AE:AE=\"?\",\"?\",IF(AE:AE=\"?\",\"?\",IF(($B$2+3)-AF:AF>=0,0,IF(($B$2+3)-AF:AF>=-1,1,IF(($B$2+3)-AF:AF>=-2,2,3))))))","v":"?"},{"$f":"IF(AE:AE=\"pas d'actualité\",3,IF(AE:AE=\"?\",\"?\",IF(AE:AE=\"?\",\"?\",IF(($B$2+4)-AF:AF>=0,0,IF(($B$2+4)-AF:AF>=-1,1,IF(($B$2+4)-AF:AF>=-2,2,3))))))","v":"?"}]
["PR 351","D351","FAB 351",null,1,null,null,"X","X",null,null,"X",null,null,null,null,"X",null,null,null,null,null,null,"X",null,null,null,null,null,null,"?",{"$f":"IF(ISNUMBER(AE:AE),YEAR(AE:AE),AE:AE)","v":"?"},{"$f":"IF(AE:AE=\"pas d'actualité\",3,IF(AE:AE=\"?\",\"?\",IF(AE:AE=\"?\",\"?\",IF($B$2-AF:AF>=0,0,IF($B$2-AF:AF>=-1,1,IF($B$2-AF:AF>=-2,2,3))))))","v":"?"},{"$f":"IF(AE:AE=\"pas d'actualité\",3,IF(AE:AE=\"?\",\"?\",IF(AE:AE=\"?\",\"?\",IF((($B$2+1)-AF:AF)>=0,\"0\",IF((($B$2+1)-AF:AF)>=-1,\"1\",IF((($B$2+1)-AF:AF)>=-2,\"2\",\"3\"))))))","v":"?"},{"$f":"IF(AE:AE=\"pas d'actualité\",3,IF(AE:AE=\"?\",\"?\",IF(AE:AE=\"?\",\"?\",IF((($B$2+2)-AF:AF)>=0,0,IF((($B$2+2)-AF:AF)>=-1,1,IF((($B$2+2)-AF:AF)>=-2,2,3))))))","v":"?"},{"$f":"IF(AE:AE=\"pas d'actualité\",3,IF(AE:AE=\"?\",\"?\",IF(AE:AE=\"?\",\"?\",IF(($B$2+3)-AF:AF>=0,0,IF(($B$2+3)-AF:AF>=-1,1,IF(($B$2+3)-AF:AF>=-2,2,3))))))","v":"?"},{"$f":"IF(AE:AE=\"pas d'actualité\",3,IF(AE:AE=\"?\",\"?\",IF(AE:AE=\"?\",\"?\",IF(($B$2+4)-AF:AF>=0,0,IF(($B$2+4)-AF:AF>=-1,1,IF(($B$2+4)-AF:AF>=-2,2,3))))))","v":"?"}]
["PR 352","D352","FAB 352",null,1,null,null,null,null,"X",null,null,null,null,null,null,null,null,null,null,"X",null,null,null,null,null,null,null,null,null,"?",{"$f":"IF(ISNUMBER(AE:AE),YEAR(AE:AE),AE:AE)","v":"?"},{"$f":"IF(AE:AE=\"pas d'actualité\",3,IF(AE:AE=\"?\",\"?\",IF(AE:AE=\"?\",\"?\",IF($B$2-AF:AF>=0,0,IF($B$2-AF:AF>=-1,1,IF($B$2-AF:AF>=-2,2,3))))))","v":"?"},{"$f":"IF(AE:AE=\"pas d'actualité\",3,IF(AE:AE=\"?\",\"?\",IF(AE:AE=\"?\",\"?\",IF((($B$2+1)-AF:AF)>=0,\"0\",IF((($B$2+1)-AF:AF)>=-1,\"1\",IF((($B$2+1)-AF:AF)>=-2,\"2\",\"3\"))))))","v":"?"},{"$f":"IF(AE:AE=\"pas d'actualité\",3,IF(AE:AE=\"?\",\"?\",IF(AE:AE=\"?\",\"?\",IF((($B$2+2)-AF:AF)>=0,0,IF((($B$2+2)-AF:AF)>=-1,1,IF((($B$2+2)-AF:AF)>=-2,2,3))))))","v":"?"},{"$f":"IF(AE:AE=\"pas d'actualité\",3,IF(AE:AE=\"?\",\"?\",IF(AE:AE=\"?\",\"?\",IF(($B$2+3)-AF:AF>=0,0,IF(($B$2+3)-AF:AF>=-1,1,IF(($B$2+3)-AF:AF>=-2,2,3))))))","v":"?"},{"$f":"IF(AE:AE=\"pas d'actualité\",3,IF(AE:AE=\"?\",\"?\",IF(AE:AE=\"?\",\"?\",IF(($B$2+4)-AF:AF>=0,0,IF(($B$2+4)-AF:AF>=-1,1,IF(($B$2+4)-AF:AF>=-2,2,3))))))","v":"?"}]
["PR 353","D353","FAB 353",null,1,null,null,null,null,null,null,null,null,null,null,null,null,null,"X",null,null,"X",null,null,null,null,null,null,null,null,"?",{"$f":"IF(ISNUMBER(AE:AE),YEAR(AE:AE),AE:AE)","v":"?"},{"$f":"IF(AE:AE=\"pas d'actualité\",3,IF(AE:AE=\"?\",\"?\",IF(AE:AE=\"?\",\"?\",IF($B$2-AF:AF>=0,0,IF($B$2-AF:AF>=-1,1,IF($B$2-AF:AF>=-2,2,3))))))","v":"?"},{"$f":"IF(AE:AE=\"pas d'actualité\",3,IF(AE:AE=\"?\",\"?\",IF(AE:AE=\"?\",\"?\",IF((($B$2+1)-AF:AF)>=0,\"0\",IF((($B$2+1)-AF:AF)>=-1,\"1\",IF((($B$2+1)-AF:AF)>=-2,\"2\",\"3\"))))))","v":"?"},{"$f":"IF(AE:AE=\"pas d'actualité\",3,IF(AE:AE=\"?\",\"?\",IF(AE:AE=\"?\",\"?\",IF((($B$2+2)-AF:AF)>=0,0,IF((($B$2+2)-AF:AF)>=-1,1,IF((($B$2+2)-AF:AF)>=-2,2,3))))))","v":"?"},{"$f":"IF(AE:AE=\"pas d'actualité\",3,IF(AE:AE=\"?\",\"?\",IF(AE:AE=\"?\",\"?\",IF(($B$2+3)-AF:AF>=0,0,IF(($B$2+3)-AF:AF>=-1,1,IF(($B$2+3)-AF:AF>=-2,2,3))))))","v":"?"},{"$f":"IF(AE:AE=\"pas d'actualité\",3,IF(AE:AE=\"?\",\"?\",IF(AE:AE=\"?\",\"?\",IF(($B$2+4)-AF:AF>=0,0,IF(($B$2+4)-AF:AF>=-1,1,IF(($B$2+4)-AF:AF>=-2,2,3))))))","v":"?"}]
["PR 354","D354","FAB 354",null,1,null,null,"X","X",null,null,null,"X",null,null,null,"X","X",null,null,null,null,null,null,null,null,null,null,null,null,"?",{"$f":"IF(ISNUMBER(AE:AE),YEAR(AE:AE),AE:AE)","v":"?"},{"$f":"IF(AE:AE=\"pas d'actualité\",3,IF(AE:AE=\"?\",\"?\",IF(AE:AE=\"?\",\"?\",IF($B$2-AF:AF>=0,0,IF($B$2-AF:AF>=-1,1,IF($B$2-AF:AF>=-2,2,3))))))","v":"?"},{"$f":"IF(AE:AE=\"pas d'actualité\",3,IF(AE:AE=\"?\",\"?\",IF(AE:AE=\"?\",\"?\",IF((($B$2+1)-AF:AF)>=0,\"0\",IF((($B$2+1)-AF:AF)>=-1,\"1\",IF((($B$2+1)-AF:AF)>=-2,\"2\",\"3\"))))))","v":"?"},{"$f":"IF(AE:AE=\"pas d'actualité\",3,IF(AE:AE=\"?\",\"?\",IF(AE:AE=\"?\",\"?\",IF((($B$2+2)-AF:AF)>=0,0,IF((($B$2+2)-AF:AF)>=-1,1,IF((($B$2+2)-AF:AF)>=-2,2,3))))))","v":"?"},{"$f":"IF(AE:AE=\"pas d'actualité\",3,IF(AE:AE=\"?\",\"?\",IF(AE:AE=\"?\",\"?\",IF(($B$2+3)-AF:AF>=0,0,IF(($B$2+3)-AF:AF>=-1,1,IF(($B$2+3)-AF:AF>=-2,2,3))))))","v":"?"},{"$f":"IF(AE:AE=\"pas d'actualité\",3,IF(AE:AE=\"?\",\"?\",IF(AE:AE=\"?\",\"?\",IF(($B$2+4)-AF:AF>=0,0,IF(($B$2+4)-AF:AF>=-1,1,IF(($B$2+4)-AF:AF>=-2,2,3))))))","v":"?"}]
["PR 355","D355","FAB 355",null,null,null,null,"X",null,null,null,null,null,null,null,null,null,null,null,null,null,"X",null,null,null,null,null,null,null,null,"?",{"$f":"IF(ISNUMBER(AE:AE),YEAR(AE:AE),AE:AE)","v":"?"},{"$f":"IF(AE:AE=\"pas d'actualité\",3,IF(AE:AE=\"?\",\"?\",IF(AE:AE=\"?\",\"?\",IF($B$2-AF:AF>=0,0,IF($B$2-AF:AF>=-1,1,IF($B$2-AF:AF>=-2,2,3))))))","v":"?"},{"$f":"IF(AE:AE=\"pas d'actualité\",3,IF(AE:AE=\"?\",\"?\",IF(AE:AE=\"?\",\"?\",IF((($B$2+1)-AF:AF)>=0,\"0\",IF((($B$2+1)-AF:AF)>=-1,\"1\",IF((($B$2+1)-AF:AF)>=-2,\"2\",\"3\"))))))","v":"?"},{"$f":"IF(AE:AE=\"pas d'actualité\",3,IF(AE:AE=\"?\",\"?\",IF(AE:AE=\"?\",\"?\",IF((($B$2+2)-AF:AF)>=0,0,IF((($B$2+2)-AF:AF)>=-1,1,IF((($B$2+2)-AF:AF)>=-2,2,3))))))","v":"?"},{"$f":"IF(AE:AE=\"pas d'actualité\",3,IF(AE:AE=\"?\",\"?\",IF(AE:AE=\"?\",\"?\",IF(($B$2+3)-AF:AF>=0,0,IF(($B$2+3)-AF:AF>=-1,1,IF(($B$2+3)-AF:AF>=-2,2,3))))))","v":"?"},{"$f":"IF(AE:AE=\"pas d'actualité\",3,IF(AE:AE=\"?\",\"?\",IF(AE:AE=\"?\",\"?\",IF(($B$2+4)-AF:AF>=0,0,IF(($B$2+4)-AF:AF>=-1,1,IF(($B$2+4)-AF:AF>=-2,2,3))))))","v":"?"}]
["PR 356","D356","FAB 356",null,null,null,null,null,null,null,null,null,null,null,null,null,null,null,null,null,null,null,null,null,"X",null,null,null,null,null,"2008-05-15",{"$f":"IF(ISNUMBER(AE:AE),YEAR(AE:AE),AE:AE)","v":2008},{"$f":"IF(AE:AE=\"pas d'actualité\",3,IF(AE:AE=\"?\",\"?\",IF(AE:AE=\"?\",\"?\",IF($B$2-AF:AF>=0,0,IF($B$2-AF:AF>=-1,1,IF($B$2-AF:AF>=-2,2,3))))))","v":0},{"$f":"IF(AE:AE=\"pas d'actualité\",3,IF(AE:AE=\"?\",\"?\",IF(AE:AE=\"?\",\"?\",IF((($B$2+1)-AF:AF)>=0,\"0\",IF((($B$2+1)-AF:AF)>=-1,\"1\",IF((($B$2+1)-AF:AF)>=-2,\"2\",\"3\"))))))","v":"0"},{"$f":"IF(AE:AE=\"pas d'actualité\",3,IF(AE:AE=\"?\",\"?\",IF(AE:AE=\"?\",\"?\",IF((($B$2+2)-AF:AF)>=0,0,IF((($B$2+2)-AF:AF)>=-1,1,IF((($B$2+2)-AF:AF)>=-2,2,3))))))","v":0},{"$f":"IF(AE:AE=\"pas d'actualité\",3,IF(AE:AE=\"?\",\"?\",IF(AE:AE=\"?\",\"?\",IF(($B$2+3)-AF:AF>=0,0,IF(($B$2+3)-AF:AF>=-1,1,IF(($B$2+3)-AF:AF>=-2,2,3))))))","v":0},{"$f":"IF(AE:AE=\"pas d'actualité\",3,IF(AE:AE=\"?\",\"?\",IF(AE:AE=\"?\",\"?\",IF(($B$2+4)-AF:AF>=0,0,IF(($B$2+4)-AF:AF>=-1,1,IF(($B$2+4)-AF:AF>=-2,2,3))))))","v":0},"6ES5095-8MA05",null,"reparation/pièce de rechange seulement sous garantie"]
["PR 357","D357","FAB 357",null,null,null,null,null,null,null,null,null,"X",null,null,null,"X",null,null,"X",null,null,null,"XX",null,null,null,null,null,null,"2010-01-10",{"$f":"IF(ISNUMBER(AE:AE),YEAR(AE:AE),AE:AE)","v":2010},{"$f":"IF(AE:AE=\"pas d'actualité\",3,IF(AE:AE=\"?\",\"?\",IF(AE:AE=\"?\",\"?\",IF($B$2-AF:AF>=0,0,IF($B$2-AF:AF>=-1,1,IF($B$2-AF:AF>=-2,2,3))))))","v":0},{"$f":"IF(AE:AE=\"pas d'actualité\",3,IF(AE:AE=\"?\",\"?\",IF(AE:AE=\"?\",\"?\",IF((($B$2+1)-AF:AF)>=0,\"0\",IF((($B$2+1)-AF:AF)>=-1,\"1\",IF((($B$2+1)-AF:AF)>=-2,\"2\",\"3\"))))))","v":"0"},{"$f":"IF(AE:AE=\"pas d'actualité\",3,IF(AE:AE=\"?\",\"?\",IF(AE:AE=\"?\",\"?\",IF((($B$2+2)-AF:AF)>=0,0,IF((($B$2+2)-AF:AF)>=-1,1,IF((($B$2+2)-AF:AF)>=-2,2,3))))))","v":0},{"$f":"IF(AE:AE=\"pas d'actualité\",3,IF(AE:AE=\"?\",\"?\",IF(AE:AE=\"?\",\"?\",IF(($B$2+3)-AF:AF>=0,0,IF(($B$2+3)-AF:AF>=-1,1,IF(($B$2+3)-AF:AF>=-2,2,3))))))","v":0},{"$f":"IF(AE:AE=\"pas d'actualité\",3,IF(AE:AE=\"?\",\"?\",IF(AE:AE=\"?\",\"?\",IF(($B$2+4)-AF:AF>=0,0,IF(($B$2+4)-AF:AF>=-1,1,IF(($B$2+4)-AF:AF>=-2,2,3))))))","v":0},"6ES5095-8MA05",null,"Seulement disponible en pièces de rechange"]
["PR 358","D358","FAB 358",null,null,null,null,null,null,null,null,null,null,null,null,null,null,"X",null,null,null,null,null,null,null,null,null,null,null,null,"2008-01-10",{"$f":"IF(ISNUMBER(AE:AE),YEAR(AE:AE),AE:AE)","v":2008},{"$f":"IF(AE:AE=\"pas d'actualité\",3,IF(AE:AE=\"?\",\"?\",IF(AE:AE=\"?\",\"?\",IF($B$2-AF:AF>=0,0,IF($B$2-AF:AF>=-1,1,IF($B$2-AF:AF>=-2,2,3))))))","v":0},{"$f":"IF(AE:AE=\"pas d'actualité\",3,IF(AE:AE=\"?\",\"?\",IF(AE:AE=\"?\",\"?\",IF((($B$2+1)-AF:AF)>=0,\"0\",IF((($B$2+1)-AF:AF)>=-1,\"1\",IF((($B$2+1)-AF:AF)>=-2,\"2\",\"3\"))))))","v":"0"},{"$f":"IF(AE:AE=\"pas d'actualité\",3,IF(AE:AE=\"?\",\"?\",IF(AE:AE=\"?\",\"?\",IF((($B$2+2)-AF:AF)>=0,0,IF((($B$2+2)-AF:AF)>=-1,1,IF((($B$2+2)-AF:AF)>=-2,2,3))))))","v":0},{"$f":"IF(AE:AE=\"pas d'actualité\",3,IF(AE:AE=\"?\",\"?\",IF(AE:AE=\"?\",\"?\",IF(($B$2+3)-AF:AF>=0,0,IF(($B$2+3)-AF:AF>=-1,1,IF(($B$2+3)-AF:AF>=-2,2,3))))))","v":0},{"$f":"IF(AE:AE=\"pas d'actualité\",3,IF(AE:AE=\"?\",\"?\",IF(AE:AE=\"?\",\"?\",IF(($B$2+4)-AF:AF>=0,0,IF(($B$2+4)-AF:AF>=-1,1,IF(($B$2+4)-AF:AF>=-2,2,3))))))","v":0},"SUCCESSOR IS CPU 928B: 6ES5928-3UB21","partiellement"]
["PR 359","D359","FAB 359",null,1,null,null,null,null,null,null,null,null,null,null,null,null,"X",null,null,null,null,null,null,null,null,null,null,null,null,"2010-01-10",{"$f":"IF(ISNUMBER(AE:AE),YEAR(AE:AE),AE:AE)","v":2010},{"$f":"IF(AE:AE=\"pas d'actualité\",3,IF(AE:AE=\"?\",\"?\",IF(AE:AE=\"?\",\"?\",IF($B$2-AF:AF>=0,0,IF($B$2-AF:AF>=-1,1,IF($B$2-AF:AF>=-2,2,3))))))","v":0},{"$f":"IF(AE:AE=\"pas d'actualité\",3,IF(AE:AE=\"?\",\"?\",IF(AE:AE=\"?\",\"?\",IF((($B$2+1)-AF:AF)>=0,\"0\",IF((($B$2+1)-AF:AF)>=-1,\"1\",IF((($B$2+1)-AF:AF)>=-2,\"2\",\"3\"))))))","v":"0"},{"$f":"IF(AE:AE=\"pas d'actualité\",3,IF(AE:AE=\"?\",\"?\",IF(AE:AE=\"?\",\"?\",IF((($B$2+2)-AF:AF)>=0,0,IF((($B$2+2)-AF:AF)>=-1,1,IF((($B$2+2)-AF:AF)>=-2,2,3))))))","v":0},{"$f":"IF(AE:AE=\"pas d'actualité\",3,IF(AE:AE=\"?\",\"?\",IF(AE:AE=\"?\",\"?\",IF(($B$2+3)-AF:AF>=0,0,IF(($B$2+3)-AF:AF>=-1,1,IF(($B$2+3)-AF:AF>=-2,2,3))))))","v":0},{"$f":"IF(AE:AE=\"pas d'actualité\",3,IF(AE:AE=\"?\",\"?\",IF(AE:AE=\"?\",\"?\",IF(($B$2+4)-AF:AF>=0,0,IF(($B$2+4)-AF:AF>=-1,1,IF(($B$2+4)-AF:AF>=-2,2,3))))))","v":0},"6ES5955-3LC41"]
["PR 360","D360","FAB 360",null,1,null,null,null,null,null,null,null,null,null,null,null,null,"X",null,null,null,null,null,null,null,null,null,null,null,null,"2008-01-10",{"$f":"IF(ISNUMBER(AE:AE),YEAR(AE:AE),AE:AE)","v":2008},{"$f":"IF(AE:AE=\"pas d'actualité\",3,IF(AE:AE=\"?\",\"?\",IF(AE:AE=\"?\",\"?\",IF($B$2-AF:AF>=0,0,IF($B$2-AF:AF>=-1,1,IF($B$2-AF:AF>=-2,2,3))))))","v":0},{"$f":"IF(AE:AE=\"pas d'actualité\",3,IF(AE:AE=\"?\",\"?\",IF(AE:AE=\"?\",\"?\",IF((($B$2+1)-AF:AF)>=0,\"0\",IF((($B$2+1)-AF:AF)>=-1,\"1\",IF((($B$2+1)-AF:AF)>=-2,\"2\",\"3\"))))))","v":"0"},{"$f":"IF(AE:AE=\"pas d'actualité\",3,IF(AE:AE=\"?\",\"?\",IF(AE:AE=\"?\",\"?\",IF((($B$2+2)-AF:AF)>=0,0,IF((($B$2+2)-AF:AF)>=-1,1,IF((($B$2+2)-AF:AF)>=-2,2,3))))))","v":0},{"$f":"IF(AE:AE=\"pas d'actualité\",3,IF(AE:AE=\"?\",\"?\",IF(AE:AE=\"?\",\"?\",IF(($B$2+3)-AF:AF>=0,0,IF(($B$2+3)-AF:AF>=-1,1,IF(($B$2+3)-AF:AF>=-2,2,3))))))","v":0},{"$f":"IF(AE:AE=\"pas d'actualité\",3,IF(AE:AE=\"?\",\"?\",IF(AE:AE=\"?\",\"?\",IF(($B$2+4)-AF:AF>=0,0,IF(($B$2+4)-AF:AF>=-1,1,IF(($B$2+4)-AF:AF>=-2,2,3))))))","v":0}]
["PR 400","D400"," FAB 400",null,4,null,"Générateur Instrumentation Entrées/sorties ",null,null,null,null,null,null,null,null,null,null,null,null,null,null,null,null,null,null,null,null,null,null,"X","2015-12-31",{"$f":"IF(ISNUMBER(AE:AE),YEAR(AE:AE),AE:AE)","v":2015},{"$f":"IF(AE:AE=\"pas d'actualité\",3,IF(AE:AE=\"?\",\"?\",IF(AE:AE=\"?\",\"?\",IF($B$2-AF:AF>=0,0,IF($B$2-AF:AF>=-1,1,IF($B$2-AF:AF>=-2,2,3))))))","v":0},{"$f":"IF(AE:AE=\"pas d'actualité\",3,IF(AE:AE=\"?\",\"?\",IF(AE:AE=\"?\",\"?\",IF((($B$2+1)-AF:AF)>=0,\"0\",IF((($B$2+1)-AF:AF)>=-1,\"1\",IF((($B$2+1)-AF:AF)>=-2,\"2\",\"3\"))))))","v":"0"},{"$f":"IF(AE:AE=\"pas d'actualité\",3,IF(AE:AE=\"?\",\"?\",IF(AE:AE=\"?\",\"?\",IF((($B$2+2)-AF:AF)>=0,0,IF((($B$2+2)-AF:AF)>=-1,1,IF((($B$2+2)-AF:AF)>=-2,2,3))))))","v":0},{"$f":"IF(AE:AE=\"pas d'actualité\",3,IF(AE:AE=\"?\",\"?\",IF(AE:AE=\"?\",\"?\",IF(($B$2+3)-AF:AF>=0,0,IF(($B$2+3)-AF:AF>=-1,1,IF(($B$2+3)-AF:AF>=-2,2,3))))))","v":0},{"$f":"IF(AE:AE=\"pas d'actualité\",3,IF(AE:AE=\"?\",\"?\",IF(AE:AE=\"?\",\"?\",IF(($B$2+4)-AF:AF>=0,0,IF(($B$2+4)-AF:AF>=-1,1,IF(($B$2+4)-AF:AF>=-2,2,3))))))","v":0},"AF100 / S800"]
["PR 401","D401"," FAB 401",null,1,null,null,null,null,null,null,null,null,null,null,null,null,null,null,null,null,null,null,null,null,null,null,null,null,null,"?",{"$f":"IF(ISNUMBER(AE:AE),YEAR(AE:AE),AE:AE)","v":"?"},{"$f":"IF(AE:AE=\"pas d'actualité\",3,IF(AE:AE=\"?\",\"?\",IF(AE:AE=\"?\",\"?\",IF($B$2-AF:AF>=0,0,IF($B$2-AF:AF>=-1,1,IF($B$2-AF:AF>=-2,2,3))))))","v":"?"},{"$f":"IF(AE:AE=\"pas d'actualité\",3,IF(AE:AE=\"?\",\"?\",IF(AE:AE=\"?\",\"?\",IF((($B$2+1)-AF:AF)>=0,\"0\",IF((($B$2+1)-AF:AF)>=-1,\"1\",IF((($B$2+1)-AF:AF)>=-2,\"2\",\"3\"))))))","v":"?"},{"$f":"IF(AE:AE=\"pas d'actualité\",3,IF(AE:AE=\"?\",\"?\",IF(AE:AE=\"?\",\"?\",IF((($B$2+2)-AF:AF)>=0,0,IF((($B$2+2)-AF:AF)>=-1,1,IF((($B$2+2)-AF:AF)>=-2,2,3))))))","v":"?"},{"$f":"IF(AE:AE=\"pas d'actualité\",3,IF(AE:AE=\"?\",\"?\",IF(AE:AE=\"?\",\"?\",IF(($B$2+3)-AF:AF>=0,0,IF(($B$2+3)-AF:AF>=-1,1,IF(($B$2+3)-AF:AF>=-2,2,3))))))","v":"?"},{"$f":"IF(AE:AE=\"pas d'actualité\",3,IF(AE:AE=\"?\",\"?\",IF(AE:AE=\"?\",\"?\",IF(($B$2+4)-AF:AF>=0,0,IF(($B$2+4)-AF:AF>=-1,1,IF(($B$2+4)-AF:AF>=-2,2,3))))))","v":"?"},"DSBC174"]
["PR 402","D402"," FAB 402",null,2,null,null,null,null,null,null,null,null,null,null,null,null,null,null,null,null,null,null,null,null,null,null,null,null,null,"?",{"$f":"IF(ISNUMBER(AE:AE),YEAR(AE:AE),AE:AE)","v":"?"},{"$f":"IF(AE:AE=\"pas d'actualité\",3,IF(AE:AE=\"?\",\"?\",IF(AE:AE=\"?\",\"?\",IF($B$2-AF:AF>=0,0,IF($B$2-AF:AF>=-1,1,IF($B$2-AF:AF>=-2,2,3))))))","v":"?"},{"$f":"IF(AE:AE=\"pas d'actualité\",3,IF(AE:AE=\"?\",\"?\",IF(AE:AE=\"?\",\"?\",IF((($B$2+1)-AF:AF)>=0,\"0\",IF((($B$2+1)-AF:AF)>=-1,\"1\",IF((($B$2+1)-AF:AF)>=-2,\"2\",\"3\"))))))","v":"?"},{"$f":"IF(AE:AE=\"pas d'actualité\",3,IF(AE:AE=\"?\",\"?\",IF(AE:AE=\"?\",\"?\",IF((($B$2+2)-AF:AF)>=0,0,IF((($B$2+2)-AF:AF)>=-1,1,IF((($B$2+2)-AF:AF)>=-2,2,3))))))","v":"?"},{"$f":"IF(AE:AE=\"pas d'actualité\",3,IF(AE:AE=\"?\",\"?\",IF(AE:AE=\"?\",\"?\",IF(($B$2+3)-AF:AF>=0,0,IF(($B$2+3)-AF:AF>=-1,1,IF(($B$2+3)-AF:AF>=-2,2,3))))))","v":"?"},{"$f":"IF(AE:AE=\"pas d'actualité\",3,IF(AE:AE=\"?\",\"?\",IF(AE:AE=\"?\",\"?\",IF(($B$2+4)-AF:AF>=0,0,IF(($B$2+4)-AF:AF>=-1,1,IF(($B$2+4)-AF:AF>=-2,2,3))))))","v":"?"},"DSDI110AV1"]
["PR 403","D403"," FAB 403",null,1,null,null,null,null,null,null,null,null,null,null,null,null,null,null,null,null,null,null,null,null,null,null,null,null,null,"?",{"$f":"IF(ISNUMBER(AE:AE),YEAR(AE:AE),AE:AE)","v":"?"},{"$f":"IF(AE:AE=\"pas d'actualité\",3,IF(AE:AE=\"?\",\"?\",IF(AE:AE=\"?\",\"?\",IF($B$2-AF:AF>=0,0,IF($B$2-AF:AF>=-1,1,IF($B$2-AF:AF>=-2,2,3))))))","v":"?"},{"$f":"IF(AE:AE=\"pas d'actualité\",3,IF(AE:AE=\"?\",\"?\",IF(AE:AE=\"?\",\"?\",IF((($B$2+1)-AF:AF)>=0,\"0\",IF((($B$2+1)-AF:AF)>=-1,\"1\",IF((($B$2+1)-AF:AF)>=-2,\"2\",\"3\"))))))","v":"?"},{"$f":"IF(AE:AE=\"pas d'actualité\",3,IF(AE:AE=\"?\",\"?\",IF(AE:AE=\"?\",\"?\",IF((($B$2+2)-AF:AF)>=0,0,IF((($B$2+2)-AF:AF)>=-1,1,IF((($B$2+2)-AF:AF)>=-2,2,3))))))","v":"?"},{"$f":"IF(AE:AE=\"pas d'actualité\",3,IF(AE:AE=\"?\",\"?\",IF(AE:AE=\"?\",\"?\",IF(($B$2+3)-AF:AF>=0,0,IF(($B$2+3)-AF:AF>=-1,1,IF(($B$2+3)-AF:AF>=-2,2,3))))))","v":"?"},{"$f":"IF(AE:AE=\"pas d'actualité\",3,IF(AE:AE=\"?\",\"?\",IF(AE:AE=\"?\",\"?\",IF(($B$2+4)-AF:AF>=0,0,IF(($B$2+4)-AF:AF>=-1,1,IF(($B$2+4)-AF:AF>=-2,2,3))))))","v":"?"}]
["PR 404","D404"," FAB 404",null,1,null,null,null,null,null,null,null,null,null,null,null,null,null,null,null,null,null,null,null,null,null,null,null,null,null,"?",{"$f":"IF(ISNUMBER(AE:AE),YEAR(AE:AE),AE:AE)","v":"?"},{"$f":"IF(AE:AE=\"pas d'actualité\",3,IF(AE:AE=\"?\",\"?\",IF(AE:AE=\"?\",\"?\",IF($B$2-AF:AF>=0,0,IF($B$2-AF:AF>=-1,1,IF($B$2-AF:AF>=-2,2,3))))))","v":"?"},{"$f":"IF(AE:AE=\"pas d'actualité\",3,IF(AE:AE=\"?\",\"?\",IF(AE:AE=\"?\",\"?\",IF((($B$2+1)-AF:AF)>=0,\"0\",IF((($B$2+1)-AF:AF)>=-1,\"1\",IF((($B$2+1)-AF:AF)>=-2,\"2\",\"3\"))))))","v":"?"},{"$f":"IF(AE:AE=\"pas d'actualité\",3,IF(AE:AE=\"?\",\"?\",IF(AE:AE=\"?\",\"?\",IF((($B$2+2)-AF:AF)>=0,0,IF((($B$2+2)-AF:AF)>=-1,1,IF((($B$2+2)-AF:AF)>=-2,2,3))))))","v":"?"},{"$f":"IF(AE:AE=\"pas d'actualité\",3,IF(AE:AE=\"?\",\"?\",IF(AE:AE=\"?\",\"?\",IF(($B$2+3)-AF:AF>=0,0,IF(($B$2+3)-AF:AF>=-1,1,IF(($B$2+3)-AF:AF>=-2,2,3))))))","v":"?"},{"$f":"IF(AE:AE=\"pas d'actualité\",3,IF(AE:AE=\"?\",\"?\",IF(AE:AE=\"?\",\"?\",IF(($B$2+4)-AF:AF>=0,0,IF(($B$2+4)-AF:AF>=-1,1,IF(($B$2+4)-AF:AF>=-2,2,3))))))","v":"?"}]
["PR 405","D405"," FAB 405",null,1,null,null,null,null,null,null,null,null,null,null,null,null,null,null,null,null,null,null,null,null,null,null,null,null,null,"?",{"$f":"IF(ISNUMBER(AE:AE),YEAR(AE:AE),AE:AE)","v":"?"},{"$f":"IF(AE:AE=\"pas d'actualité\",3,IF(AE:AE=\"?\",\"?\",IF(AE:AE=\"?\",\"?\",IF($B$2-AF:AF>=0,0,IF($B$2-AF:AF>=-1,1,IF($B$2-AF:AF>=-2,2,3))))))","v":"?"},{"$f":"IF(AE:AE=\"pas d'actualité\",3,IF(AE:AE=\"?\",\"?\",IF(AE:AE=\"?\",\"?\",IF((($B$2+1)-AF:AF)>=0,\"0\",IF((($B$2+1)-AF:AF)>=-1,\"1\",IF((($B$2+1)-AF:AF)>=-2,\"2\",\"3\"))))))","v":"?"},{"$f":"IF(AE:AE=\"pas d'actualité\",3,IF(AE:AE=\"?\",\"?\",IF(AE:AE=\"?\",\"?\",IF((($B$2+2)-AF:AF)>=0,0,IF((($B$2+2)-AF:AF)>=-1,1,IF((($B$2+2)-AF:AF)>=-2,2,3))))))","v":"?"},{"$f":"IF(AE:AE=\"pas d'actualité\",3,IF(AE:AE=\"?\",\"?\",IF(AE:AE=\"?\",\"?\",IF(($B$2+3)-AF:AF>=0,0,IF(($B$2+3)-AF:AF>=-1,1,IF(($B$2+3)-AF:AF>=-2,2,3))))))","v":"?"},{"$f":"IF(AE:AE=\"pas d'actualité\",3,IF(AE:AE=\"?\",\"?\",IF(AE:AE=\"?\",\"?\",IF(($B$2+4)-AF:AF>=0,0,IF(($B$2+4)-AF:AF>=-1,1,IF(($B$2+4)-AF:AF>=-2,2,3))))))","v":"?"}]
["PR 406","D406"," FAB 406",null,4,null,"Entrées/sorties ",null,null,null,null,null,null,null,null,null,null,null,null,null,null,null,null,null,null,null,null,null,null,"X","2015-12-31",{"$f":"IF(ISNUMBER(AE:AE),YEAR(AE:AE),AE:AE)","v":2015},{"$f":"IF(AE:AE=\"pas d'actualité\",3,IF(AE:AE=\"?\",\"?\",IF(AE:AE=\"?\",\"?\",IF($B$2-AF:AF>=0,0,IF($B$2-AF:AF>=-1,1,IF($B$2-AF:AF>=-2,2,3))))))","v":0},{"$f":"IF(AE:AE=\"pas d'actualité\",3,IF(AE:AE=\"?\",\"?\",IF(AE:AE=\"?\",\"?\",IF((($B$2+1)-AF:AF)>=0,\"0\",IF((($B$2+1)-AF:AF)>=-1,\"1\",IF((($B$2+1)-AF:AF)>=-2,\"2\",\"3\"))))))","v":"0"},{"$f":"IF(AE:AE=\"pas d'actualité\",3,IF(AE:AE=\"?\",\"?\",IF(AE:AE=\"?\",\"?\",IF((($B$2+2)-AF:AF)>=0,0,IF((($B$2+2)-AF:AF)>=-1,1,IF((($B$2+2)-AF:AF)>=-2,2,3))))))","v":0},{"$f":"IF(AE:AE=\"pas d'actualité\",3,IF(AE:AE=\"?\",\"?\",IF(AE:AE=\"?\",\"?\",IF(($B$2+3)-AF:AF>=0,0,IF(($B$2+3)-AF:AF>=-1,1,IF(($B$2+3)-AF:AF>=-2,2,3))))))","v":0},{"$f":"IF(AE:AE=\"pas d'actualité\",3,IF(AE:AE=\"?\",\"?\",IF(AE:AE=\"?\",\"?\",IF(($B$2+4)-AF:AF>=0,0,IF(($B$2+4)-AF:AF>=-1,1,IF(($B$2+4)-AF:AF>=-2,2,3))))))","v":0},"AF100 / S800"]
["PR 407","D407"," FAB 407",null,1,null,"Entrées/sorties ",null,null,null,null,null,null,null,null,null,null,null,null,null,null,null,null,null,null,null,null,null,null,"X","2015-12-31",{"$f":"IF(ISNUMBER(AE:AE),YEAR(AE:AE),AE:AE)","v":2015},{"$f":"IF(AE:AE=\"pas d'actualité\",3,IF(AE:AE=\"?\",\"?\",IF(AE:AE=\"?\",\"?\",IF($B$2-AF:AF>=0,0,IF($B$2-AF:AF>=-1,1,IF($B$2-AF:AF>=-2,2,3))))))","v":0},{"$f":"IF(AE:AE=\"pas d'actualité\",3,IF(AE:AE=\"?\",\"?\",IF(AE:AE=\"?\",\"?\",IF((($B$2+1)-AF:AF)>=0,\"0\",IF((($B$2+1)-AF:AF)>=-1,\"1\",IF((($B$2+1)-AF:AF)>=-2,\"2\",\"3\"))))))","v":"0"},{"$f":"IF(AE:AE=\"pas d'actualité\",3,IF(AE:AE=\"?\",\"?\",IF(AE:AE=\"?\",\"?\",IF((($B$2+2)-AF:AF)>=0,0,IF((($B$2+2)-AF:AF)>=-1,1,IF((($B$2+2)-AF:AF)>=-2,2,3))))))","v":0},{"$f":"IF(AE:AE=\"pas d'actualité\",3,IF(AE:AE=\"?\",\"?\",IF(AE:AE=\"?\",\"?\",IF(($B$2+3)-AF:AF>=0,0,IF(($B$2+3)-AF:AF>=-1,1,IF(($B$2+3)-AF:AF>=-2,2,3))))))","v":0},{"$f":"IF(AE:AE=\"pas d'actualité\",3,IF(AE:AE=\"?\",\"?\",IF(AE:AE=\"?\",\"?\",IF(($B$2+4)-AF:AF>=0,0,IF(($B$2+4)-AF:AF>=-1,1,IF(($B$2+4)-AF:AF>=-2,2,3))))))","v":0},"AF100 / S800"]
["PR 408","D408"," FAB 408",null,1,null,null,null,null,null,null,null,null,null,null,null,null,null,null,null,null,null,null,null,null,null,null,null,null,null,"?",{"$f":"IF(ISNUMBER(AE:AE),YEAR(AE:AE),AE:AE)","v":"?"},{"$f":"IF(AE:AE=\"pas d'actualité\",3,IF(AE:AE=\"?\",\"?\",IF(AE:AE=\"?\",\"?\",IF($B$2-AF:AF>=0,0,IF($B$2-AF:AF>=-1,1,IF($B$2-AF:AF>=-2,2,3))))))","v":"?"},{"$f":"IF(AE:AE=\"pas d'actualité\",3,IF(AE:AE=\"?\",\"?\",IF(AE:AE=\"?\",\"?\",IF((($B$2+1)-AF:AF)>=0,\"0\",IF((($B$2+1)-AF:AF)>=-1,\"1\",IF((($B$2+1)-AF:AF)>=-2,\"2\",\"3\"))))))","v":"?"},{"$f":"IF(AE:AE=\"pas d'actualité\",3,IF(AE:AE=\"?\",\"?\",IF(AE:AE=\"?\",\"?\",IF((($B$2+2)-AF:AF)>=0,0,IF((($B$2+2)-AF:AF)>=-1,1,IF((($B$2+2)-AF:AF)>=-2,2,3))))))","v":"?"},{"$f":"IF(AE:AE=\"pas d'actualité\",3,IF(AE:AE=\"?\",\"?\",IF(AE:AE=\"?\",\"?\",IF(($B$2+3)-AF:AF>=0,0,IF(($B$2+3)-AF:AF>=-1,1,IF(($B$2+3)-AF:AF>=-2,2,3))))))","v":"?"},{"$f":"IF(AE:AE=\"pas d'actualité\",3,IF(AE:AE=\"?\",\"?\",IF(AE:AE=\"?\",\"?\",IF(($B$2+4)-AF:AF>=0,0,IF(($B$2+4)-AF:AF>=-1,1,IF(($B$2+4)-AF:AF>=-2,2,3))))))","v":"?"}]
["PR 409","D409"," FAB 409",null,1,null,null,null,null,null,null,null,null,null,null,null,null,null,null,null,null,null,null,null,null,null,null,null,null,null,"2015-12-31",{"$f":"IF(ISNUMBER(AE:AE),YEAR(AE:AE),AE:AE)","v":2015},{"$f":"IF(AE:AE=\"pas d'actualité\",3,IF(AE:AE=\"?\",\"?\",IF(AE:AE=\"?\",\"?\",IF($B$2-AF:AF>=0,0,IF($B$2-AF:AF>=-1,1,IF($B$2-AF:AF>=-2,2,3))))))","v":0},{"$f":"IF(AE:AE=\"pas d'actualité\",3,IF(AE:AE=\"?\",\"?\",IF(AE:AE=\"?\",\"?\",IF((($B$2+1)-AF:AF)>=0,\"0\",IF((($B$2+1)-AF:AF)>=-1,\"1\",IF((($B$2+1)-AF:AF)>=-2,\"2\",\"3\"))))))","v":"0"},{"$f":"IF(AE:AE=\"pas d'actualité\",3,IF(AE:AE=\"?\",\"?\",IF(AE:AE=\"?\",\"?\",IF((($B$2+2)-AF:AF)>=0,0,IF((($B$2+2)-AF:AF)>=-1,1,IF((($B$2+2)-AF:AF)>=-2,2,3))))))","v":0},{"$f":"IF(AE:AE=\"pas d'actualité\",3,IF(AE:AE=\"?\",\"?\",IF(AE:AE=\"?\",\"?\",IF(($B$2+3)-AF:AF>=0,0,IF(($B$2+3)-AF:AF>=-1,1,IF(($B$2+3)-AF:AF>=-2,2,3))))))","v":0},{"$f":"IF(AE:AE=\"pas d'actualité\",3,IF(AE:AE=\"?\",\"?\",IF(AE:AE=\"?\",\"?\",IF(($B$2+4)-AF:AF>=0,0,IF(($B$2+4)-AF:AF>=-1,1,IF(($B$2+4)-AF:AF>=-2,2,3))))))","v":0},"AF100 / S800"]
["PR 410","D410"," FAB 410",null,1,null,null,null,null,null,null,null,null,null,null,null,null,null,null,null,null,null,null,null,null,null,null,null,null,null,"?",{"$f":"IF(ISNUMBER(AE:AE),YEAR(AE:AE),AE:AE)","v":"?"},{"$f":"IF(AE:AE=\"pas d'actualité\",3,IF(AE:AE=\"?\",\"?\",IF(AE:AE=\"?\",\"?\",IF($B$2-AF:AF>=0,0,IF($B$2-AF:AF>=-1,1,IF($B$2-AF:AF>=-2,2,3))))))","v":"?"},{"$f":"IF(AE:AE=\"pas d'actualité\",3,IF(AE:AE=\"?\",\"?\",IF(AE:AE=\"?\",\"?\",IF((($B$2+1)-AF:AF)>=0,\"0\",IF((($B$2+1)-AF:AF)>=-1,\"1\",IF((($B$2+1)-AF:AF)>=-2,\"2\",\"3\"))))))","v":"?"},{"$f":"IF(AE:AE=\"pas d'actualité\",3,IF(AE:AE=\"?\",\"?\",IF(AE:AE=\"?\",\"?\",IF((($B$2+2)-AF:AF)>=0,0,IF((($B$2+2)-AF:AF)>=-1,1,IF((($B$2+2)-AF:AF)>=-2,2,3))))))","v":"?"},{"$f":"IF(AE:AE=\"pas d'actualité\",3,IF(AE:AE=\"?\",\"?\",IF(AE:AE=\"?\",\"?\",IF(($B$2+3)-AF:AF>=0,0,IF(($B$2+3)-AF:AF>=-1,1,IF(($B$2+3)-AF:AF>=-2,2,3))))))","v":"?"},{"$f":"IF(AE:AE=\"pas d'actualité\",3,IF(AE:AE=\"?\",\"?\",IF(AE:AE=\"?\",\"?\",IF(($B$2+4)-AF:AF>=0,0,IF(($B$2+4)-AF:AF>=-1,1,IF(($B$2+4)-AF:AF>=-2,2,3))))))","v":"?"}]
["PR 450","D 450","FAB 450",null,1,null,null,null,null,null,null,null,null,null,null,null,null,null,null,null,null,null,null,null,null,null,null,null,null,"X","?",{"$f":"IF(ISNUMBER(AE:AE),YEAR(AE:AE),AE:AE)","v":"?"},{"$f":"IF(AE:AE=\"pas d'actualité\",3,IF(AE:AE=\"?\",\"?\",IF(AE:AE=\"?\",\"?\",IF($B$2-AF:AF>=0,0,IF($B$2-AF:AF>=-1,1,IF($B$2-AF:AF>=-2,2,3))))))","v":"?"},{"$f":"IF(AE:AE=\"pas d'actualité\",3,IF(AE:AE=\"?\",\"?\",IF(AE:AE=\"?\",\"?\",IF((($B$2+1)-AF:AF)>=0,\"0\",IF((($B$2+1)-AF:AF)>=-1,\"1\",IF((($B$2+1)-AF:AF)>=-2,\"2\",\"3\"))))))","v":"?"},{"$f":"IF(AE:AE=\"pas d'actualité\",3,IF(AE:AE=\"?\",\"?\",IF(AE:AE=\"?\",\"?\",IF((($B$2+2)-AF:AF)>=0,0,IF((($B$2+2)-AF:AF)>=-1,1,IF((($B$2+2)-AF:AF)>=-2,2,3))))))","v":"?"},{"$f":"IF(AE:AE=\"pas d'actualité\",3,IF(AE:AE=\"?\",\"?\",IF(AE:AE=\"?\",\"?\",IF(($B$2+3)-AF:AF>=0,0,IF(($B$2+3)-AF:AF>=-1,1,IF(($B$2+3)-AF:AF>=-2,2,3))))))","v":"?"},{"$f":"IF(AE:AE=\"pas d'actualité\",3,IF(AE:AE=\"?\",\"?\",IF(AE:AE=\"?\",\"?\",IF(($B$2+4)-AF:AF>=0,0,IF(($B$2+4)-AF:AF>=-1,1,IF(($B$2+4)-AF:AF>=-2,2,3))))))","v":"?"}]
["PR 451","D 451","FAB 451",null,1,null,null,null,null,null,null,null,null,null,null,null,null,null,null,null,null,null,null,null,null,null,null,null,null,"X","?",{"$f":"IF(ISNUMBER(AE:AE),YEAR(AE:AE),AE:AE)","v":"?"},{"$f":"IF(AE:AE=\"pas d'actualité\",3,IF(AE:AE=\"?\",\"?\",IF(AE:AE=\"?\",\"?\",IF($B$2-AF:AF>=0,0,IF($B$2-AF:AF>=-1,1,IF($B$2-AF:AF>=-2,2,3))))))","v":"?"},{"$f":"IF(AE:AE=\"pas d'actualité\",3,IF(AE:AE=\"?\",\"?\",IF(AE:AE=\"?\",\"?\",IF((($B$2+1)-AF:AF)>=0,\"0\",IF((($B$2+1)-AF:AF)>=-1,\"1\",IF((($B$2+1)-AF:AF)>=-2,\"2\",\"3\"))))))","v":"?"},{"$f":"IF(AE:AE=\"pas d'actualité\",3,IF(AE:AE=\"?\",\"?\",IF(AE:AE=\"?\",\"?\",IF((($B$2+2)-AF:AF)>=0,0,IF((($B$2+2)-AF:AF)>=-1,1,IF((($B$2+2)-AF:AF)>=-2,2,3))))))","v":"?"},{"$f":"IF(AE:AE=\"pas d'actualité\",3,IF(AE:AE=\"?\",\"?\",IF(AE:AE=\"?\",\"?\",IF(($B$2+3)-AF:AF>=0,0,IF(($B$2+3)-AF:AF>=-1,1,IF(($B$2+3)-AF:AF>=-2,2,3))))))","v":"?"},{"$f":"IF(AE:AE=\"pas d'actualité\",3,IF(AE:AE=\"?\",\"?\",IF(AE:AE=\"?\",\"?\",IF(($B$2+4)-AF:AF>=0,0,IF(($B$2+4)-AF:AF>=-1,1,IF(($B$2+4)-AF:AF>=-2,2,3))))))","v":"?"}]
["PR 452","D 452","FAB 452",null,1,null,"AC450, AC410",null,null,null,null,null,null,null,null,null,null,null,null,null,null,null,null,null,null,null,null,null,null,null,"?",{"$f":"IF(ISNUMBER(AE:AE),YEAR(AE:AE),AE:AE)","v":"?"},{"$f":"IF(AE:AE=\"pas d'actualité\",3,IF(AE:AE=\"?\",\"?\",IF(AE:AE=\"?\",\"?\",IF($B$2-AF:AF>=0,0,IF($B$2-AF:AF>=-1,1,IF($B$2-AF:AF>=-2,2,3))))))","v":"?"},{"$f":"IF(AE:AE=\"pas d'actualité\",3,IF(AE:AE=\"?\",\"?\",IF(AE:AE=\"?\",\"?\",IF((($B$2+1)-AF:AF)>=0,\"0\",IF((($B$2+1)-AF:AF)>=-1,\"1\",IF((($B$2+1)-AF:AF)>=-2,\"2\",\"3\"))))))","v":"?"},{"$f":"IF(AE:AE=\"pas d'actualité\",3,IF(AE:AE=\"?\",\"?\",IF(AE:AE=\"?\",\"?\",IF((($B$2+2)-AF:AF)>=0,0,IF((($B$2+2)-AF:AF)>=-1,1,IF((($B$2+2)-AF:AF)>=-2,2,3))))))","v":"?"},{"$f":"IF(AE:AE=\"pas d'actualité\",3,IF(AE:AE=\"?\",\"?\",IF(AE:AE=\"?\",\"?\",IF(($B$2+3)-AF:AF>=0,0,IF(($B$2+3)-AF:AF>=-1,1,IF(($B$2+3)-AF:AF>=-2,2,3))))))","v":"?"},{"$f":"IF(AE:AE=\"pas d'actualité\",3,IF(AE:AE=\"?\",\"?\",IF(AE:AE=\"?\",\"?\",IF(($B$2+4)-AF:AF>=0,0,IF(($B$2+4)-AF:AF>=-1,1,IF(($B$2+4)-AF:AF>=-2,2,3))))))","v":"?"}]
["PR 453","D 453","FAB 453",null,1,null,null,null,null,null,null,null,null,null,null,null,null,null,null,null,null,null,null,null,null,null,null,null,null,null,"?",{"$f":"IF(ISNUMBER(AE:AE),YEAR(AE:AE),AE:AE)","v":"?"},{"$f":"IF(AE:AE=\"pas d'actualité\",3,IF(AE:AE=\"?\",\"?\",IF(AE:AE=\"?\",\"?\",IF($B$2-AF:AF>=0,0,IF($B$2-AF:AF>=-1,1,IF($B$2-AF:AF>=-2,2,3))))))","v":"?"},{"$f":"IF(AE:AE=\"pas d'actualité\",3,IF(AE:AE=\"?\",\"?\",IF(AE:AE=\"?\",\"?\",IF((($B$2+1)-AF:AF)>=0,\"0\",IF((($B$2+1)-AF:AF)>=-1,\"1\",IF((($B$2+1)-AF:AF)>=-2,\"2\",\"3\"))))))","v":"?"},{"$f":"IF(AE:AE=\"pas d'actualité\",3,IF(AE:AE=\"?\",\"?\",IF(AE:AE=\"?\",\"?\",IF((($B$2+2)-AF:AF)>=0,0,IF((($B$2+2)-AF:AF)>=-1,1,IF((($B$2+2)-AF:AF)>=-2,2,3))))))","v":"?"},{"$f":"IF(AE:AE=\"pas d'actualité\",3,IF(AE:AE=\"?\",\"?\",IF(AE:AE=\"?\",\"?\",IF(($B$2+3)-AF:AF>=0,0,IF(($B$2+3)-AF:AF>=-1,1,IF(($B$2+3)-AF:AF>=-2,2,3))))))","v":"?"},{"$f":"IF(AE:AE=\"pas d'actualité\",3,IF(AE:AE=\"?\",\"?\",IF(AE:AE=\"?\",\"?\",IF(($B$2+4)-AF:AF>=0,0,IF(($B$2+4)-AF:AF>=-1,1,IF(($B$2+4)-AF:AF>=-2,2,3))))))","v":"?"}]
["PR 454","D 454","FAB 454",null,1,null,null,null,null,null,null,null,null,null,null,null,null,null,null,null,null,null,null,null,null,null,null,null,null,null,"?",{"$f":"IF(ISNUMBER(AE:AE),YEAR(AE:AE),AE:AE)","v":"?"},{"$f":"IF(AE:AE=\"pas d'actualité\",3,IF(AE:AE=\"?\",\"?\",IF(AE:AE=\"?\",\"?\",IF($B$2-AF:AF>=0,0,IF($B$2-AF:AF>=-1,1,IF($B$2-AF:AF>=-2,2,3))))))","v":"?"},{"$f":"IF(AE:AE=\"pas d'actualité\",3,IF(AE:AE=\"?\",\"?\",IF(AE:AE=\"?\",\"?\",IF((($B$2+1)-AF:AF)>=0,\"0\",IF((($B$2+1)-AF:AF)>=-1,\"1\",IF((($B$2+1)-AF:AF)>=-2,\"2\",\"3\"))))))","v":"?"},{"$f":"IF(AE:AE=\"pas d'actualité\",3,IF(AE:AE=\"?\",\"?\",IF(AE:AE=\"?\",\"?\",IF((($B$2+2)-AF:AF)>=0,0,IF((($B$2+2)-AF:AF)>=-1,1,IF((($B$2+2)-AF:AF)>=-2,2,3))))))","v":"?"},{"$f":"IF(AE:AE=\"pas d'actualité\",3,IF(AE:AE=\"?\",\"?\",IF(AE:AE=\"?\",\"?\",IF(($B$2+3)-AF:AF>=0,0,IF(($B$2+3)-AF:AF>=-1,1,IF(($B$2+3)-AF:AF>=-2,2,3))))))","v":"?"},{"$f":"IF(AE:AE=\"pas d'actualité\",3,IF(AE:AE=\"?\",\"?\",IF(AE:AE=\"?\",\"?\",IF(($B$2+4)-AF:AF>=0,0,IF(($B$2+4)-AF:AF>=-1,1,IF(($B$2+4)-AF:AF>=-2,2,3))))))","v":"?"}]
["PR 455","D 455","FAB 455",null,1,null,null,null,null,null,null,null,null,null,null,null,null,null,null,null,null,null,null,null,null,null,null,null,null,"X","?",{"$f":"IF(ISNUMBER(AE:AE),YEAR(AE:AE),AE:AE)","v":"?"},{"$f":"IF(AE:AE=\"pas d'actualité\",3,IF(AE:AE=\"?\",\"?\",IF(AE:AE=\"?\",\"?\",IF($B$2-AF:AF>=0,0,IF($B$2-AF:AF>=-1,1,IF($B$2-AF:AF>=-2,2,3))))))","v":"?"},{"$f":"IF(AE:AE=\"pas d'actualité\",3,IF(AE:AE=\"?\",\"?\",IF(AE:AE=\"?\",\"?\",IF((($B$2+1)-AF:AF)>=0,\"0\",IF((($B$2+1)-AF:AF)>=-1,\"1\",IF((($B$2+1)-AF:AF)>=-2,\"2\",\"3\"))))))","v":"?"},{"$f":"IF(AE:AE=\"pas d'actualité\",3,IF(AE:AE=\"?\",\"?\",IF(AE:AE=\"?\",\"?\",IF((($B$2+2)-AF:AF)>=0,0,IF((($B$2+2)-AF:AF)>=-1,1,IF((($B$2+2)-AF:AF)>=-2,2,3))))))","v":"?"},{"$f":"IF(AE:AE=\"pas d'actualité\",3,IF(AE:AE=\"?\",\"?\",IF(AE:AE=\"?\",\"?\",IF(($B$2+3)-AF:AF>=0,0,IF(($B$2+3)-AF:AF>=-1,1,IF(($B$2+3)-AF:AF>=-2,2,3))))))","v":"?"},{"$f":"IF(AE:AE=\"pas d'actualité\",3,IF(AE:AE=\"?\",\"?\",IF(AE:AE=\"?\",\"?\",IF(($B$2+4)-AF:AF>=0,0,IF(($B$2+4)-AF:AF>=-1,1,IF(($B$2+4)-AF:AF>=-2,2,3))))))","v":"?"},null,null,"Réparable"]
["PR 456","D 456","FAB 456","X",null,null,null,null,null,null,null,null,null,null,null,null,null,null,null,null,null,null,null,null,null,null,null,null,null,null,"?",{"$f":"IF(ISNUMBER(AE:AE),YEAR(AE:AE),AE:AE)","v":"?"},{"$f":"IF(AE:AE=\"pas d'actualité\",3,IF(AE:AE=\"?\",\"?\",IF(AE:AE=\"?\",\"?\",IF($B$2-AF:AF>=0,0,IF($B$2-AF:AF>=-1,1,IF($B$2-AF:AF>=-2,2,3))))))","v":"?"},{"$f":"IF(AE:AE=\"pas d'actualité\",3,IF(AE:AE=\"?\",\"?\",IF(AE:AE=\"?\",\"?\",IF((($B$2+1)-AF:AF)>=0,\"0\",IF((($B$2+1)-AF:AF)>=-1,\"1\",IF((($B$2+1)-AF:AF)>=-2,\"2\",\"3\"))))))","v":"?"},{"$f":"IF(AE:AE=\"pas d'actualité\",3,IF(AE:AE=\"?\",\"?\",IF(AE:AE=\"?\",\"?\",IF((($B$2+2)-AF:AF)>=0,0,IF((($B$2+2)-AF:AF)>=-1,1,IF((($B$2+2)-AF:AF)>=-2,2,3))))))","v":"?"},{"$f":"IF(AE:AE=\"pas d'actualité\",3,IF(AE:AE=\"?\",\"?\",IF(AE:AE=\"?\",\"?\",IF(($B$2+3)-AF:AF>=0,0,IF(($B$2+3)-AF:AF>=-1,1,IF(($B$2+3)-AF:AF>=-2,2,3))))))","v":"?"},{"$f":"IF(AE:AE=\"pas d'actualité\",3,IF(AE:AE=\"?\",\"?\",IF(AE:AE=\"?\",\"?\",IF(($B$2+4)-AF:AF>=0,0,IF(($B$2+4)-AF:AF>=-1,1,IF(($B$2+4)-AF:AF>=-2,2,3))))))","v":"?"}]
["PR 457","D 457","FAB 457",null,1,null,null,null,null,null,null,null,null,null,null,null,null,null,null,null,null,null,null,null,null,null,null,null,null,null,"?",{"$f":"IF(ISNUMBER(AE:AE),YEAR(AE:AE),AE:AE)","v":"?"},{"$f":"IF(AE:AE=\"pas d'actualité\",3,IF(AE:AE=\"?\",\"?\",IF(AE:AE=\"?\",\"?\",IF($B$2-AF:AF>=0,0,IF($B$2-AF:AF>=-1,1,IF($B$2-AF:AF>=-2,2,3))))))","v":"?"},{"$f":"IF(AE:AE=\"pas d'actualité\",3,IF(AE:AE=\"?\",\"?\",IF(AE:AE=\"?\",\"?\",IF((($B$2+1)-AF:AF)>=0,\"0\",IF((($B$2+1)-AF:AF)>=-1,\"1\",IF((($B$2+1)-AF:AF)>=-2,\"2\",\"3\"))))))","v":"?"},{"$f":"IF(AE:AE=\"pas d'actualité\",3,IF(AE:AE=\"?\",\"?\",IF(AE:AE=\"?\",\"?\",IF((($B$2+2)-AF:AF)>=0,0,IF((($B$2+2)-AF:AF)>=-1,1,IF((($B$2+2)-AF:AF)>=-2,2,3))))))","v":"?"},{"$f":"IF(AE:AE=\"pas d'actualité\",3,IF(AE:AE=\"?\",\"?\",IF(AE:AE=\"?\",\"?\",IF(($B$2+3)-AF:AF>=0,0,IF(($B$2+3)-AF:AF>=-1,1,IF(($B$2+3)-AF:AF>=-2,2,3))))))","v":"?"},{"$f":"IF(AE:AE=\"pas d'actualité\",3,IF(AE:AE=\"?\",\"?\",IF(AE:AE=\"?\",\"?\",IF(($B$2+4)-AF:AF>=0,0,IF(($B$2+4)-AF:AF>=-1,1,IF(($B$2+4)-AF:AF>=-2,2,3))))))","v":"?"}]
["PR 458","D 458","FAB 458",null,1,null,null,null,null,null,null,null,null,null,null,null,null,null,null,null,null,null,null,null,null,null,null,null,null,null,"?",{"$f":"IF(ISNUMBER(AE:AE),YEAR(AE:AE),AE:AE)","v":"?"},{"$f":"IF(AE:AE=\"pas d'actualité\",3,IF(AE:AE=\"?\",\"?\",IF(AE:AE=\"?\",\"?\",IF($B$2-AF:AF>=0,0,IF($B$2-AF:AF>=-1,1,IF($B$2-AF:AF>=-2,2,3))))))","v":"?"},{"$f":"IF(AE:AE=\"pas d'actualité\",3,IF(AE:AE=\"?\",\"?\",IF(AE:AE=\"?\",\"?\",IF((($B$2+1)-AF:AF)>=0,\"0\",IF((($B$2+1)-AF:AF)>=-1,\"1\",IF((($B$2+1)-AF:AF)>=-2,\"2\",\"3\"))))))","v":"?"},{"$f":"IF(AE:AE=\"pas d'actualité\",3,IF(AE:AE=\"?\",\"?\",IF(AE:AE=\"?\",\"?\",IF((($B$2+2)-AF:AF)>=0,0,IF((($B$2+2)-AF:AF)>=-1,1,IF((($B$2+2)-AF:AF)>=-2,2,3))))))","v":"?"},{"$f":"IF(AE:AE=\"pas d'actualité\",3,IF(AE:AE=\"?\",\"?\",IF(AE:AE=\"?\",\"?\",IF(($B$2+3)-AF:AF>=0,0,IF(($B$2+3)-AF:AF>=-1,1,IF(($B$2+3)-AF:AF>=-2,2,3))))))","v":"?"},{"$f":"IF(AE:AE=\"pas d'actualité\",3,IF(AE:AE=\"?\",\"?\",IF(AE:AE=\"?\",\"?\",IF(($B$2+4)-AF:AF>=0,0,IF(($B$2+4)-AF:AF>=-1,1,IF(($B$2+4)-AF:AF>=-2,2,3))))))","v":"?"}]
["PR 459","D 459","FAB 459","X",null,null,null,null,null,null,null,null,null,null,null,null,null,null,null,null,null,null,null,null,null,null,null,null,null,null,"?",{"$f":"IF(ISNUMBER(AE:AE),YEAR(AE:AE),AE:AE)","v":"?"},{"$f":"IF(AE:AE=\"pas d'actualité\",3,IF(AE:AE=\"?\",\"?\",IF(AE:AE=\"?\",\"?\",IF($B$2-AF:AF>=0,0,IF($B$2-AF:AF>=-1,1,IF($B$2-AF:AF>=-2,2,3))))))","v":"?"},{"$f":"IF(AE:AE=\"pas d'actualité\",3,IF(AE:AE=\"?\",\"?\",IF(AE:AE=\"?\",\"?\",IF((($B$2+1)-AF:AF)>=0,\"0\",IF((($B$2+1)-AF:AF)>=-1,\"1\",IF((($B$2+1)-AF:AF)>=-2,\"2\",\"3\"))))))","v":"?"},{"$f":"IF(AE:AE=\"pas d'actualité\",3,IF(AE:AE=\"?\",\"?\",IF(AE:AE=\"?\",\"?\",IF((($B$2+2)-AF:AF)>=0,0,IF((($B$2+2)-AF:AF)>=-1,1,IF((($B$2+2)-AF:AF)>=-2,2,3))))))","v":"?"},{"$f":"IF(AE:AE=\"pas d'actualité\",3,IF(AE:AE=\"?\",\"?\",IF(AE:AE=\"?\",\"?\",IF(($B$2+3)-AF:AF>=0,0,IF(($B$2+3)-AF:AF>=-1,1,IF(($B$2+3)-AF:AF>=-2,2,3))))))","v":"?"},{"$f":"IF(AE:AE=\"pas d'actualité\",3,IF(AE:AE=\"?\",\"?\",IF(AE:AE=\"?\",\"?\",IF(($B$2+4)-AF:AF>=0,0,IF(($B$2+4)-AF:AF>=-1,1,IF(($B$2+4)-AF:AF>=-2,2,3))))))","v":"?"},"PM511V"]
["PR 460","D 460","FAB 460","X",null,null,null,null,null,null,null,null,null,null,null,null,null,null,null,null,null,null,null,null,null,null,null,null,null,null,"?",{"$f":"IF(ISNUMBER(AE:AE),YEAR(AE:AE),AE:AE)","v":"?"},{"$f":"IF(AE:AE=\"pas d'actualité\",3,IF(AE:AE=\"?\",\"?\",IF(AE:AE=\"?\",\"?\",IF($B$2-AF:AF>=0,0,IF($B$2-AF:AF>=-1,1,IF($B$2-AF:AF>=-2,2,3))))))","v":"?"},{"$f":"IF(AE:AE=\"pas d'actualité\",3,IF(AE:AE=\"?\",\"?\",IF(AE:AE=\"?\",\"?\",IF((($B$2+1)-AF:AF)>=0,\"0\",IF((($B$2+1)-AF:AF)>=-1,\"1\",IF((($B$2+1)-AF:AF)>=-2,\"2\",\"3\"))))))","v":"?"},{"$f":"IF(AE:AE=\"pas d'actualité\",3,IF(AE:AE=\"?\",\"?\",IF(AE:AE=\"?\",\"?\",IF((($B$2+2)-AF:AF)>=0,0,IF((($B$2+2)-AF:AF)>=-1,1,IF((($B$2+2)-AF:AF)>=-2,2,3))))))","v":"?"},{"$f":"IF(AE:AE=\"pas d'actualité\",3,IF(AE:AE=\"?\",\"?\",IF(AE:AE=\"?\",\"?\",IF(($B$2+3)-AF:AF>=0,0,IF(($B$2+3)-AF:AF>=-1,1,IF(($B$2+3)-AF:AF>=-2,2,3))))))","v":"?"},{"$f":"IF(AE:AE=\"pas d'actualité\",3,IF(AE:AE=\"?\",\"?\",IF(AE:AE=\"?\",\"?\",IF(($B$2+4)-AF:AF>=0,0,IF(($B$2+4)-AF:AF>=-1,1,IF(($B$2+4)-AF:AF>=-2,2,3))))))","v":"?"}]
["PR 461","D 461","FAB 461","X",null,null,null,null,null,null,null,null,null,null,null,null,null,null,null,null,null,null,null,null,null,null,null,null,null,null,"?",{"$f":"IF(ISNUMBER(AE:AE),YEAR(AE:AE),AE:AE)","v":"?"},{"$f":"IF(AE:AE=\"pas d'actualité\",3,IF(AE:AE=\"?\",\"?\",IF(AE:AE=\"?\",\"?\",IF($B$2-AF:AF>=0,0,IF($B$2-AF:AF>=-1,1,IF($B$2-AF:AF>=-2,2,3))))))","v":"?"},{"$f":"IF(AE:AE=\"pas d'actualité\",3,IF(AE:AE=\"?\",\"?\",IF(AE:AE=\"?\",\"?\",IF((($B$2+1)-AF:AF)>=0,\"0\",IF((($B$2+1)-AF:AF)>=-1,\"1\",IF((($B$2+1)-AF:AF)>=-2,\"2\",\"3\"))))))","v":"?"},{"$f":"IF(AE:AE=\"pas d'actualité\",3,IF(AE:AE=\"?\",\"?\",IF(AE:AE=\"?\",\"?\",IF((($B$2+2)-AF:AF)>=0,0,IF((($B$2+2)-AF:AF)>=-1,1,IF((($B$2+2)-AF:AF)>=-2,2,3))))))","v":"?"},{"$f":"IF(AE:AE=\"pas d'actualité\",3,IF(AE:AE=\"?\",\"?\",IF(AE:AE=\"?\",\"?\",IF(($B$2+3)-AF:AF>=0,0,IF(($B$2+3)-AF:AF>=-1,1,IF(($B$2+3)-AF:AF>=-2,2,3))))))","v":"?"},{"$f":"IF(AE:AE=\"pas d'actualité\",3,IF(AE:AE=\"?\",\"?\",IF(AE:AE=\"?\",\"?\",IF(($B$2+4)-AF:AF>=0,0,IF(($B$2+4)-AF:AF>=-1,1,IF(($B$2+4)-AF:AF>=-2,2,3))))))","v":"?"}]
["PR 462","D 462","FAB 462","X",null,null,null,null,null,null,null,null,null,null,null,null,null,null,null,null,null,null,null,null,null,null,null,null,null,null,"2012-01-01",{"$f":"IF(ISNUMBER(AE:AE),YEAR(AE:AE),AE:AE)","v":2012},{"$f":"IF(AE:AE=\"pas d'actualité\",3,IF(AE:AE=\"?\",\"?\",IF(AE:AE=\"?\",\"?\",IF($B$2-AF:AF>=0,0,IF($B$2-AF:AF>=-1,1,IF($B$2-AF:AF>=-2,2,3))))))","v":0},{"$f":"IF(AE:AE=\"pas d'actualité\",3,IF(AE:AE=\"?\",\"?\",IF(AE:AE=\"?\",\"?\",IF((($B$2+1)-AF:AF)>=0,\"0\",IF((($B$2+1)-AF:AF)>=-1,\"1\",IF((($B$2+1)-AF:AF)>=-2,\"2\",\"3\"))))))","v":"0"},{"$f":"IF(AE:AE=\"pas d'actualité\",3,IF(AE:AE=\"?\",\"?\",IF(AE:AE=\"?\",\"?\",IF((($B$2+2)-AF:AF)>=0,0,IF((($B$2+2)-AF:AF)>=-1,1,IF((($B$2+2)-AF:AF)>=-2,2,3))))))","v":0},{"$f":"IF(AE:AE=\"pas d'actualité\",3,IF(AE:AE=\"?\",\"?\",IF(AE:AE=\"?\",\"?\",IF(($B$2+3)-AF:AF>=0,0,IF(($B$2+3)-AF:AF>=-1,1,IF(($B$2+3)-AF:AF>=-2,2,3))))))","v":0},{"$f":"IF(AE:AE=\"pas d'actualité\",3,IF(AE:AE=\"?\",\"?\",IF(AE:AE=\"?\",\"?\",IF(($B$2+4)-AF:AF>=0,0,IF(($B$2+4)-AF:AF>=-1,1,IF(($B$2+4)-AF:AF>=-2,2,3))))))","v":0},null,null,"Date d'abandon pas certaine"]
["PR 463","D 463","FAB 463",null,1,null,null,null,null,null,null,null,null,null,null,"X","X","X","X",null,null,null,null,null,null,null,null,null,null,null,"?",{"$f":"IF(ISNUMBER(AE:AE),YEAR(AE:AE),AE:AE)","v":"?"},{"$f":"IF(AE:AE=\"pas d'actualité\",3,IF(AE:AE=\"?\",\"?\",IF(AE:AE=\"?\",\"?\",IF($B$2-AF:AF>=0,0,IF($B$2-AF:AF>=-1,1,IF($B$2-AF:AF>=-2,2,3))))))","v":"?"},{"$f":"IF(AE:AE=\"pas d'actualité\",3,IF(AE:AE=\"?\",\"?\",IF(AE:AE=\"?\",\"?\",IF((($B$2+1)-AF:AF)>=0,\"0\",IF((($B$2+1)-AF:AF)>=-1,\"1\",IF((($B$2+1)-AF:AF)>=-2,\"2\",\"3\"))))))","v":"?"},{"$f":"IF(AE:AE=\"pas d'actualité\",3,IF(AE:AE=\"?\",\"?\",IF(AE:AE=\"?\",\"?\",IF((($B$2+2)-AF:AF)>=0,0,IF((($B$2+2)-AF:AF)>=-1,1,IF((($B$2+2)-AF:AF)>=-2,2,3))))))","v":"?"},{"$f":"IF(AE:AE=\"pas d'actualité\",3,IF(AE:AE=\"?\",\"?\",IF(AE:AE=\"?\",\"?\",IF(($B$2+3)-AF:AF>=0,0,IF(($B$2+3)-AF:AF>=-1,1,IF(($B$2+3)-AF:AF>=-2,2,3))))))","v":"?"},{"$f":"IF(AE:AE=\"pas d'actualité\",3,IF(AE:AE=\"?\",\"?\",IF(AE:AE=\"?\",\"?\",IF(($B$2+4)-AF:AF>=0,0,IF(($B$2+4)-AF:AF>=-1,1,IF(($B$2+4)-AF:AF>=-2,2,3))))))","v":"?"}]
["PR 464","D 464","FAB 464","X",null,null,null,null,null,null,null,null,null,null,null,null,null,null,null,null,null,null,null,null,null,null,null,null,null,null,"2015-12-31",{"$f":"IF(ISNUMBER(AE:AE),YEAR(AE:AE),AE:AE)","v":2015},{"$f":"IF(AE:AE=\"pas d'actualité\",3,IF(AE:AE=\"?\",\"?\",IF(AE:AE=\"?\",\"?\",IF($B$2-AF:AF>=0,0,IF($B$2-AF:AF>=-1,1,IF($B$2-AF:AF>=-2,2,3))))))","v":0},{"$f":"IF(AE:AE=\"pas d'actualité\",3,IF(AE:AE=\"?\",\"?\",IF(AE:AE=\"?\",\"?\",IF((($B$2+1)-AF:AF)>=0,\"0\",IF((($B$2+1)-AF:AF)>=-1,\"1\",IF((($B$2+1)-AF:AF)>=-2,\"2\",\"3\"))))))","v":"0"},{"$f":"IF(AE:AE=\"pas d'actualité\",3,IF(AE:AE=\"?\",\"?\",IF(AE:AE=\"?\",\"?\",IF((($B$2+2)-AF:AF)>=0,0,IF((($B$2+2)-AF:AF)>=-1,1,IF((($B$2+2)-AF:AF)>=-2,2,3))))))","v":0},{"$f":"IF(AE:AE=\"pas d'actualité\",3,IF(AE:AE=\"?\",\"?\",IF(AE:AE=\"?\",\"?\",IF(($B$2+3)-AF:AF>=0,0,IF(($B$2+3)-AF:AF>=-1,1,IF(($B$2+3)-AF:AF>=-2,2,3))))))","v":0},{"$f":"IF(AE:AE=\"pas d'actualité\",3,IF(AE:AE=\"?\",\"?\",IF(AE:AE=\"?\",\"?\",IF(($B$2+4)-AF:AF>=0,0,IF(($B$2+4)-AF:AF>=-1,1,IF(($B$2+4)-AF:AF>=-2,2,3))))))","v":0},"PU410",null,"Upgrade obligatoire"]
["PR 465","D 465","FAB 465",null,1,null,null,null,null,null,null,null,null,null,null,null,null,null,null,null,null,null,null,null,null,null,null,null,null,null,"?",{"$f":"IF(ISNUMBER(AE:AE),YEAR(AE:AE),AE:AE)","v":"?"},{"$f":"IF(AE:AE=\"pas d'actualité\",3,IF(AE:AE=\"?\",\"?\",IF(AE:AE=\"?\",\"?\",IF($B$2-AF:AF>=0,0,IF($B$2-AF:AF>=-1,1,IF($B$2-AF:AF>=-2,2,3))))))","v":"?"},{"$f":"IF(AE:AE=\"pas d'actualité\",3,IF(AE:AE=\"?\",\"?\",IF(AE:AE=\"?\",\"?\",IF((($B$2+1)-AF:AF)>=0,\"0\",IF((($B$2+1)-AF:AF)>=-1,\"1\",IF((($B$2+1)-AF:AF)>=-2,\"2\",\"3\"))))))","v":"?"},{"$f":"IF(AE:AE=\"pas d'actualité\",3,IF(AE:AE=\"?\",\"?\",IF(AE:AE=\"?\",\"?\",IF((($B$2+2)-AF:AF)>=0,0,IF((($B$2+2)-AF:AF)>=-1,1,IF((($B$2+2)-AF:AF)>=-2,2,3))))))","v":"?"},{"$f":"IF(AE:AE=\"pas d'actualité\",3,IF(AE:AE=\"?\",\"?\",IF(AE:AE=\"?\",\"?\",IF(($B$2+3)-AF:AF>=0,0,IF(($B$2+3)-AF:AF>=-1,1,IF(($B$2+3)-AF:AF>=-2,2,3))))))","v":"?"},{"$f":"IF(AE:AE=\"pas d'actualité\",3,IF(AE:AE=\"?\",\"?\",IF(AE:AE=\"?\",\"?\",IF(($B$2+4)-AF:AF>=0,0,IF(($B$2+4)-AF:AF>=-1,1,IF(($B$2+4)-AF:AF>=-2,2,3))))))","v":"?"}]
["PR 466","D 466","FAB 466",null,1,null,null,null,null,null,null,null,null,null,null,null,null,null,null,null,null,null,null,null,null,null,null,null,null,null,"?",{"$f":"IF(ISNUMBER(AE:AE),YEAR(AE:AE),AE:AE)","v":"?"},{"$f":"IF(AE:AE=\"pas d'actualité\",3,IF(AE:AE=\"?\",\"?\",IF(AE:AE=\"?\",\"?\",IF($B$2-AF:AF>=0,0,IF($B$2-AF:AF>=-1,1,IF($B$2-AF:AF>=-2,2,3))))))","v":"?"},{"$f":"IF(AE:AE=\"pas d'actualité\",3,IF(AE:AE=\"?\",\"?\",IF(AE:AE=\"?\",\"?\",IF((($B$2+1)-AF:AF)>=0,\"0\",IF((($B$2+1)-AF:AF)>=-1,\"1\",IF((($B$2+1)-AF:AF)>=-2,\"2\",\"3\"))))))","v":"?"},{"$f":"IF(AE:AE=\"pas d'actualité\",3,IF(AE:AE=\"?\",\"?\",IF(AE:AE=\"?\",\"?\",IF((($B$2+2)-AF:AF)>=0,0,IF((($B$2+2)-AF:AF)>=-1,1,IF((($B$2+2)-AF:AF)>=-2,2,3))))))","v":"?"},{"$f":"IF(AE:AE=\"pas d'actualité\",3,IF(AE:AE=\"?\",\"?\",IF(AE:AE=\"?\",\"?\",IF(($B$2+3)-AF:AF>=0,0,IF(($B$2+3)-AF:AF>=-1,1,IF(($B$2+3)-AF:AF>=-2,2,3))))))","v":"?"},{"$f":"IF(AE:AE=\"pas d'actualité\",3,IF(AE:AE=\"?\",\"?\",IF(AE:AE=\"?\",\"?\",IF(($B$2+4)-AF:AF>=0,0,IF(($B$2+4)-AF:AF>=-1,1,IF(($B$2+4)-AF:AF>=-2,2,3))))))","v":"?"}]
["PR 467","D 467","FAB 467",null,1,null,null,null,null,null,null,null,null,null,null,null,null,null,null,null,null,null,null,null,null,null,null,null,null,null,"?",{"$f":"IF(ISNUMBER(AE:AE),YEAR(AE:AE),AE:AE)","v":"?"},{"$f":"IF(AE:AE=\"pas d'actualité\",3,IF(AE:AE=\"?\",\"?\",IF(AE:AE=\"?\",\"?\",IF($B$2-AF:AF>=0,0,IF($B$2-AF:AF>=-1,1,IF($B$2-AF:AF>=-2,2,3))))))","v":"?"},{"$f":"IF(AE:AE=\"pas d'actualité\",3,IF(AE:AE=\"?\",\"?\",IF(AE:AE=\"?\",\"?\",IF((($B$2+1)-AF:AF)>=0,\"0\",IF((($B$2+1)-AF:AF)>=-1,\"1\",IF((($B$2+1)-AF:AF)>=-2,\"2\",\"3\"))))))","v":"?"},{"$f":"IF(AE:AE=\"pas d'actualité\",3,IF(AE:AE=\"?\",\"?\",IF(AE:AE=\"?\",\"?\",IF((($B$2+2)-AF:AF)>=0,0,IF((($B$2+2)-AF:AF)>=-1,1,IF((($B$2+2)-AF:AF)>=-2,2,3))))))","v":"?"},{"$f":"IF(AE:AE=\"pas d'actualité\",3,IF(AE:AE=\"?\",\"?\",IF(AE:AE=\"?\",\"?\",IF(($B$2+3)-AF:AF>=0,0,IF(($B$2+3)-AF:AF>=-1,1,IF(($B$2+3)-AF:AF>=-2,2,3))))))","v":"?"},{"$f":"IF(AE:AE=\"pas d'actualité\",3,IF(AE:AE=\"?\",\"?\",IF(AE:AE=\"?\",\"?\",IF(($B$2+4)-AF:AF>=0,0,IF(($B$2+4)-AF:AF>=-1,1,IF(($B$2+4)-AF:AF>=-2,2,3))))))","v":"?"},"SA168"]
["PR 468","D 468","FAB 468",null,1,null,null,null,null,null,null,null,null,null,null,null,null,null,null,null,null,null,null,null,null,null,null,null,null,null,"?",{"$f":"IF(ISNUMBER(AE:AE),YEAR(AE:AE),AE:AE)","v":"?"},{"$f":"IF(AE:AE=\"pas d'actualité\",3,IF(AE:AE=\"?\",\"?\",IF(AE:AE=\"?\",\"?\",IF($B$2-AF:AF>=0,0,IF($B$2-AF:AF>=-1,1,IF($B$2-AF:AF>=-2,2,3))))))","v":"?"},{"$f":"IF(AE:AE=\"pas d'actualité\",3,IF(AE:AE=\"?\",\"?\",IF(AE:AE=\"?\",\"?\",IF((($B$2+1)-AF:AF)>=0,\"0\",IF((($B$2+1)-AF:AF)>=-1,\"1\",IF((($B$2+1)-AF:AF)>=-2,\"2\",\"3\"))))))","v":"?"},{"$f":"IF(AE:AE=\"pas d'actualité\",3,IF(AE:AE=\"?\",\"?\",IF(AE:AE=\"?\",\"?\",IF((($B$2+2)-AF:AF)>=0,0,IF((($B$2+2)-AF:AF)>=-1,1,IF((($B$2+2)-AF:AF)>=-2,2,3))))))","v":"?"},{"$f":"IF(AE:AE=\"pas d'actualité\",3,IF(AE:AE=\"?\",\"?\",IF(AE:AE=\"?\",\"?\",IF(($B$2+3)-AF:AF>=0,0,IF(($B$2+3)-AF:AF>=-1,1,IF(($B$2+3)-AF:AF>=-2,2,3))))))","v":"?"},{"$f":"IF(AE:AE=\"pas d'actualité\",3,IF(AE:AE=\"?\",\"?\",IF(AE:AE=\"?\",\"?\",IF(($B$2+4)-AF:AF>=0,0,IF(($B$2+4)-AF:AF>=-1,1,IF(($B$2+4)-AF:AF>=-2,2,3))))))","v":"?"}]
["PR 469","D 469","FAB 469",null,null,null,null,null,null,null,null,null,null,null,null,null,null,null,null,null,null,null,null,null,null,null,null,null,null,null,"?",{"$f":"IF(ISNUMBER(AE:AE),YEAR(AE:AE),AE:AE)","v":"?"},{"$f":"IF(AE:AE=\"pas d'actualité\",3,IF(AE:AE=\"?\",\"?\",IF(AE:AE=\"?\",\"?\",IF($B$2-AF:AF>=0,0,IF($B$2-AF:AF>=-1,1,IF($B$2-AF:AF>=-2,2,3))))))","v":"?"},{"$f":"IF(AE:AE=\"pas d'actualité\",3,IF(AE:AE=\"?\",\"?\",IF(AE:AE=\"?\",\"?\",IF((($B$2+1)-AF:AF)>=0,\"0\",IF((($B$2+1)-AF:AF)>=-1,\"1\",IF((($B$2+1)-AF:AF)>=-2,\"2\",\"3\"))))))","v":"?"},{"$f":"IF(AE:AE=\"pas d'actualité\",3,IF(AE:AE=\"?\",\"?\",IF(AE:AE=\"?\",\"?\",IF((($B$2+2)-AF:AF)>=0,0,IF((($B$2+2)-AF:AF)>=-1,1,IF((($B$2+2)-AF:AF)>=-2,2,3))))))","v":"?"},{"$f":"IF(AE:AE=\"pas d'actualité\",3,IF(AE:AE=\"?\",\"?\",IF(AE:AE=\"?\",\"?\",IF(($B$2+3)-AF:AF>=0,0,IF(($B$2+3)-AF:AF>=-1,1,IF(($B$2+3)-AF:AF>=-2,2,3))))))","v":"?"},{"$f":"IF(AE:AE=\"pas d'actualité\",3,IF(AE:AE=\"?\",\"?\",IF(AE:AE=\"?\",\"?\",IF(($B$2+4)-AF:AF>=0,0,IF(($B$2+4)-AF:AF>=-1,1,IF(($B$2+4)-AF:AF>=-2,2,3))))))","v":"?"}]
["PR 470","D 470","FAB 470",null,1,null,null,null,null,null,null,null,null,null,null,null,null,null,null,null,null,null,null,null,null,null,null,null,null,null,"?",{"$f":"IF(ISNUMBER(AE:AE),YEAR(AE:AE),AE:AE)","v":"?"},{"$f":"IF(AE:AE=\"pas d'actualité\",3,IF(AE:AE=\"?\",\"?\",IF(AE:AE=\"?\",\"?\",IF($B$2-AF:AF>=0,0,IF($B$2-AF:AF>=-1,1,IF($B$2-AF:AF>=-2,2,3))))))","v":"?"},{"$f":"IF(AE:AE=\"pas d'actualité\",3,IF(AE:AE=\"?\",\"?\",IF(AE:AE=\"?\",\"?\",IF((($B$2+1)-AF:AF)>=0,\"0\",IF((($B$2+1)-AF:AF)>=-1,\"1\",IF((($B$2+1)-AF:AF)>=-2,\"2\",\"3\"))))))","v":"?"},{"$f":"IF(AE:AE=\"pas d'actualité\",3,IF(AE:AE=\"?\",\"?\",IF(AE:AE=\"?\",\"?\",IF((($B$2+2)-AF:AF)>=0,0,IF((($B$2+2)-AF:AF)>=-1,1,IF((($B$2+2)-AF:AF)>=-2,2,3))))))","v":"?"},{"$f":"IF(AE:AE=\"pas d'actualité\",3,IF(AE:AE=\"?\",\"?\",IF(AE:AE=\"?\",\"?\",IF(($B$2+3)-AF:AF>=0,0,IF(($B$2+3)-AF:AF>=-1,1,IF(($B$2+3)-AF:AF>=-2,2,3))))))","v":"?"},{"$f":"IF(AE:AE=\"pas d'actualité\",3,IF(AE:AE=\"?\",\"?\",IF(AE:AE=\"?\",\"?\",IF(($B$2+4)-AF:AF>=0,0,IF(($B$2+4)-AF:AF>=-1,1,IF(($B$2+4)-AF:AF>=-2,2,3))))))","v":"?"}]
["PR 471","D 471","FAB 471",null,1,null,"Alimentation ",null,null,null,null,null,null,null,null,null,null,null,null,null,null,null,null,null,null,null,null,null,null,null,"?",{"$f":"IF(ISNUMBER(AE:AE),YEAR(AE:AE),AE:AE)","v":"?"},{"$f":"IF(AE:AE=\"pas d'actualité\",3,IF(AE:AE=\"?\",\"?\",IF(AE:AE=\"?\",\"?\",IF($B$2-AF:AF>=0,0,IF($B$2-AF:AF>=-1,1,IF($B$2-AF:AF>=-2,2,3))))))","v":"?"},{"$f":"IF(AE:AE=\"pas d'actualité\",3,IF(AE:AE=\"?\",\"?\",IF(AE:AE=\"?\",\"?\",IF((($B$2+1)-AF:AF)>=0,\"0\",IF((($B$2+1)-AF:AF)>=-1,\"1\",IF((($B$2+1)-AF:AF)>=-2,\"2\",\"3\"))))))","v":"?"},{"$f":"IF(AE:AE=\"pas d'actualité\",3,IF(AE:AE=\"?\",\"?\",IF(AE:AE=\"?\",\"?\",IF((($B$2+2)-AF:AF)>=0,0,IF((($B$2+2)-AF:AF)>=-1,1,IF((($B$2+2)-AF:AF)>=-2,2,3))))))","v":"?"},{"$f":"IF(AE:AE=\"pas d'actualité\",3,IF(AE:AE=\"?\",\"?\",IF(AE:AE=\"?\",\"?\",IF(($B$2+3)-AF:AF>=0,0,IF(($B$2+3)-AF:AF>=-1,1,IF(($B$2+3)-AF:AF>=-2,2,3))))))","v":"?"},{"$f":"IF(AE:AE=\"pas d'actualité\",3,IF(AE:AE=\"?\",\"?\",IF(AE:AE=\"?\",\"?\",IF(($B$2+4)-AF:AF>=0,0,IF(($B$2+4)-AF:AF>=-1,1,IF(($B$2+4)-AF:AF>=-2,2,3))))))","v":"?"},"SD831"]
["PR 472","D 472","FAB 472",null,2,null,null,null,null,null,null,null,null,null,null,null,null,null,null,null,null,null,null,null,null,null,null,null,null,null,"?",{"$f":"IF(ISNUMBER(AE:AE),YEAR(AE:AE),AE:AE)","v":"?"},{"$f":"IF(AE:AE=\"pas d'actualité\",3,IF(AE:AE=\"?\",\"?\",IF(AE:AE=\"?\",\"?\",IF($B$2-AF:AF>=0,0,IF($B$2-AF:AF>=-1,1,IF($B$2-AF:AF>=-2,2,3))))))","v":"?"},{"$f":"IF(AE:AE=\"pas d'actualité\",3,IF(AE:AE=\"?\",\"?\",IF(AE:AE=\"?\",\"?\",IF((($B$2+1)-AF:AF)>=0,\"0\",IF((($B$2+1)-AF:AF)>=-1,\"1\",IF((($B$2+1)-AF:AF)>=-2,\"2\",\"3\"))))))","v":"?"},{"$f":"IF(AE:AE=\"pas d'actualité\",3,IF(AE:AE=\"?\",\"?\",IF(AE:AE=\"?\",\"?\",IF((($B$2+2)-AF:AF)>=0,0,IF((($B$2+2)-AF:AF)>=-1,1,IF((($B$2+2)-AF:AF)>=-2,2,3))))))","v":"?"},{"$f":"IF(AE:AE=\"pas d'actualité\",3,IF(AE:AE=\"?\",\"?\",IF(AE:AE=\"?\",\"?\",IF(($B$2+3)-AF:AF>=0,0,IF(($B$2+3)-AF:AF>=-1,1,IF(($B$2+3)-AF:AF>=-2,2,3))))))","v":"?"},{"$f":"IF(AE:AE=\"pas d'actualité\",3,IF(AE:AE=\"?\",\"?\",IF(AE:AE=\"?\",\"?\",IF(($B$2+4)-AF:AF>=0,0,IF(($B$2+4)-AF:AF>=-1,1,IF(($B$2+4)-AF:AF>=-2,2,3))))))","v":"?"},"SD832"]
["PR 473","D 473","FAB 473",null,2,null,null,null,null,null,null,null,null,null,null,null,null,null,null,null,null,null,null,null,null,null,null,null,null,null,"?",{"$f":"IF(ISNUMBER(AE:AE),YEAR(AE:AE),AE:AE)","v":"?"},{"$f":"IF(AE:AE=\"pas d'actualité\",3,IF(AE:AE=\"?\",\"?\",IF(AE:AE=\"?\",\"?\",IF($B$2-AF:AF>=0,0,IF($B$2-AF:AF>=-1,1,IF($B$2-AF:AF>=-2,2,3))))))","v":"?"},{"$f":"IF(AE:AE=\"pas d'actualité\",3,IF(AE:AE=\"?\",\"?\",IF(AE:AE=\"?\",\"?\",IF((($B$2+1)-AF:AF)>=0,\"0\",IF((($B$2+1)-AF:AF)>=-1,\"1\",IF((($B$2+1)-AF:AF)>=-2,\"2\",\"3\"))))))","v":"?"},{"$f":"IF(AE:AE=\"pas d'actualité\",3,IF(AE:AE=\"?\",\"?\",IF(AE:AE=\"?\",\"?\",IF((($B$2+2)-AF:AF)>=0,0,IF((($B$2+2)-AF:AF)>=-1,1,IF((($B$2+2)-AF:AF)>=-2,2,3))))))","v":"?"},{"$f":"IF(AE:AE=\"pas d'actualité\",3,IF(AE:AE=\"?\",\"?\",IF(AE:AE=\"?\",\"?\",IF(($B$2+3)-AF:AF>=0,0,IF(($B$2+3)-AF:AF>=-1,1,IF(($B$2+3)-AF:AF>=-2,2,3))))))","v":"?"},{"$f":"IF(AE:AE=\"pas d'actualité\",3,IF(AE:AE=\"?\",\"?\",IF(AE:AE=\"?\",\"?\",IF(($B$2+4)-AF:AF>=0,0,IF(($B$2+4)-AF:AF>=-1,1,IF(($B$2+4)-AF:AF>=-2,2,3))))))","v":"?"}]
["PR 474","D 474","FAB 474",null,2,null,null,null,null,null,null,null,null,null,null,null,null,null,null,null,null,null,null,null,null,null,null,null,null,null,"?",{"$f":"IF(ISNUMBER(AE:AE),YEAR(AE:AE),AE:AE)","v":"?"},{"$f":"IF(AE:AE=\"pas d'actualité\",3,IF(AE:AE=\"?\",\"?\",IF(AE:AE=\"?\",\"?\",IF($B$2-AF:AF>=0,0,IF($B$2-AF:AF>=-1,1,IF($B$2-AF:AF>=-2,2,3))))))","v":"?"},{"$f":"IF(AE:AE=\"pas d'actualité\",3,IF(AE:AE=\"?\",\"?\",IF(AE:AE=\"?\",\"?\",IF((($B$2+1)-AF:AF)>=0,\"0\",IF((($B$2+1)-AF:AF)>=-1,\"1\",IF((($B$2+1)-AF:AF)>=-2,\"2\",\"3\"))))))","v":"?"},{"$f":"IF(AE:AE=\"pas d'actualité\",3,IF(AE:AE=\"?\",\"?\",IF(AE:AE=\"?\",\"?\",IF((($B$2+2)-AF:AF)>=0,0,IF((($B$2+2)-AF:AF)>=-1,1,IF((($B$2+2)-AF:AF)>=-2,2,3))))))","v":"?"},{"$f":"IF(AE:AE=\"pas d'actualité\",3,IF(AE:AE=\"?\",\"?\",IF(AE:AE=\"?\",\"?\",IF(($B$2+3)-AF:AF>=0,0,IF(($B$2+3)-AF:AF>=-1,1,IF(($B$2+3)-AF:AF>=-2,2,3))))))","v":"?"},{"$f":"IF(AE:AE=\"pas d'actualité\",3,IF(AE:AE=\"?\",\"?\",IF(AE:AE=\"?\",\"?\",IF(($B$2+4)-AF:AF>=0,0,IF(($B$2+4)-AF:AF>=-1,1,IF(($B$2+4)-AF:AF>=-2,2,3))))))","v":"?"}]
["PR 475","D 475","FAB 475",null,1,null,null,null,null,null,null,null,null,null,null,null,null,null,null,null,null,null,null,null,null,null,null,null,null,null,"?",{"$f":"IF(ISNUMBER(AE:AE),YEAR(AE:AE),AE:AE)","v":"?"},{"$f":"IF(AE:AE=\"pas d'actualité\",3,IF(AE:AE=\"?\",\"?\",IF(AE:AE=\"?\",\"?\",IF($B$2-AF:AF>=0,0,IF($B$2-AF:AF>=-1,1,IF($B$2-AF:AF>=-2,2,3))))))","v":"?"},{"$f":"IF(AE:AE=\"pas d'actualité\",3,IF(AE:AE=\"?\",\"?\",IF(AE:AE=\"?\",\"?\",IF((($B$2+1)-AF:AF)>=0,\"0\",IF((($B$2+1)-AF:AF)>=-1,\"1\",IF((($B$2+1)-AF:AF)>=-2,\"2\",\"3\"))))))","v":"?"},{"$f":"IF(AE:AE=\"pas d'actualité\",3,IF(AE:AE=\"?\",\"?\",IF(AE:AE=\"?\",\"?\",IF((($B$2+2)-AF:AF)>=0,0,IF((($B$2+2)-AF:AF)>=-1,1,IF((($B$2+2)-AF:AF)>=-2,2,3))))))","v":"?"},{"$f":"IF(AE:AE=\"pas d'actualité\",3,IF(AE:AE=\"?\",\"?\",IF(AE:AE=\"?\",\"?\",IF(($B$2+3)-AF:AF>=0,0,IF(($B$2+3)-AF:AF>=-1,1,IF(($B$2+3)-AF:AF>=-2,2,3))))))","v":"?"},{"$f":"IF(AE:AE=\"pas d'actualité\",3,IF(AE:AE=\"?\",\"?\",IF(AE:AE=\"?\",\"?\",IF(($B$2+4)-AF:AF>=0,0,IF(($B$2+4)-AF:AF>=-1,1,IF(($B$2+4)-AF:AF>=-2,2,3))))))","v":"?"}]
["PR 476","D 476","FAB 476",null,1,null,"ALIMENTATION ",null,null,null,null,null,null,null,null,null,null,null,null,null,null,null,null,null,null,null,null,null,null,null,"?",{"$f":"IF(ISNUMBER(AE:AE),YEAR(AE:AE),AE:AE)","v":"?"},{"$f":"IF(AE:AE=\"pas d'actualité\",3,IF(AE:AE=\"?\",\"?\",IF(AE:AE=\"?\",\"?\",IF($B$2-AF:AF>=0,0,IF($B$2-AF:AF>=-1,1,IF($B$2-AF:AF>=-2,2,3))))))","v":"?"},{"$f":"IF(AE:AE=\"pas d'actualité\",3,IF(AE:AE=\"?\",\"?\",IF(AE:AE=\"?\",\"?\",IF((($B$2+1)-AF:AF)>=0,\"0\",IF((($B$2+1)-AF:AF)>=-1,\"1\",IF((($B$2+1)-AF:AF)>=-2,\"2\",\"3\"))))))","v":"?"},{"$f":"IF(AE:AE=\"pas d'actualité\",3,IF(AE:AE=\"?\",\"?\",IF(AE:AE=\"?\",\"?\",IF((($B$2+2)-AF:AF)>=0,0,IF((($B$2+2)-AF:AF)>=-1,1,IF((($B$2+2)-AF:AF)>=-2,2,3))))))","v":"?"},{"$f":"IF(AE:AE=\"pas d'actualité\",3,IF(AE:AE=\"?\",\"?\",IF(AE:AE=\"?\",\"?\",IF(($B$2+3)-AF:AF>=0,0,IF(($B$2+3)-AF:AF>=-1,1,IF(($B$2+3)-AF:AF>=-2,2,3))))))","v":"?"},{"$f":"IF(AE:AE=\"pas d'actualité\",3,IF(AE:AE=\"?\",\"?\",IF(AE:AE=\"?\",\"?\",IF(($B$2+4)-AF:AF>=0,0,IF(($B$2+4)-AF:AF>=-1,1,IF(($B$2+4)-AF:AF>=-2,2,3))))))","v":"?"},"SS832"]
["PR 477","D 477","FAB 477",null,1,null,"ALIMENTATION ",null,null,null,null,null,null,null,null,null,null,null,null,null,null,null,null,null,null,null,null,null,null,null,"?",{"$f":"IF(ISNUMBER(AE:AE),YEAR(AE:AE),AE:AE)","v":"?"},{"$f":"IF(AE:AE=\"pas d'actualité\",3,IF(AE:AE=\"?\",\"?\",IF(AE:AE=\"?\",\"?\",IF($B$2-AF:AF>=0,0,IF($B$2-AF:AF>=-1,1,IF($B$2-AF:AF>=-2,2,3))))))","v":"?"},{"$f":"IF(AE:AE=\"pas d'actualité\",3,IF(AE:AE=\"?\",\"?\",IF(AE:AE=\"?\",\"?\",IF((($B$2+1)-AF:AF)>=0,\"0\",IF((($B$2+1)-AF:AF)>=-1,\"1\",IF((($B$2+1)-AF:AF)>=-2,\"2\",\"3\"))))))","v":"?"},{"$f":"IF(AE:AE=\"pas d'actualité\",3,IF(AE:AE=\"?\",\"?\",IF(AE:AE=\"?\",\"?\",IF((($B$2+2)-AF:AF)>=0,0,IF((($B$2+2)-AF:AF)>=-1,1,IF((($B$2+2)-AF:AF)>=-2,2,3))))))","v":"?"},{"$f":"IF(AE:AE=\"pas d'actualité\",3,IF(AE:AE=\"?\",\"?\",IF(AE:AE=\"?\",\"?\",IF(($B$2+3)-AF:AF>=0,0,IF(($B$2+3)-AF:AF>=-1,1,IF(($B$2+3)-AF:AF>=-2,2,3))))))","v":"?"},{"$f":"IF(AE:AE=\"pas d'actualité\",3,IF(AE:AE=\"?\",\"?\",IF(AE:AE=\"?\",\"?\",IF(($B$2+4)-AF:AF>=0,0,IF(($B$2+4)-AF:AF>=-1,1,IF(($B$2+4)-AF:AF>=-2,2,3))))))","v":"?"}]
["PR 478","D 478","FAB 478",null,1,null,null,null,null,null,null,null,null,null,null,null,null,null,null,null,null,null,null,null,null,null,null,null,null,null,"?",{"$f":"IF(ISNUMBER(AE:AE),YEAR(AE:AE),AE:AE)","v":"?"},{"$f":"IF(AE:AE=\"pas d'actualité\",3,IF(AE:AE=\"?\",\"?\",IF(AE:AE=\"?\",\"?\",IF($B$2-AF:AF>=0,0,IF($B$2-AF:AF>=-1,1,IF($B$2-AF:AF>=-2,2,3))))))","v":"?"},{"$f":"IF(AE:AE=\"pas d'actualité\",3,IF(AE:AE=\"?\",\"?\",IF(AE:AE=\"?\",\"?\",IF((($B$2+1)-AF:AF)>=0,\"0\",IF((($B$2+1)-AF:AF)>=-1,\"1\",IF((($B$2+1)-AF:AF)>=-2,\"2\",\"3\"))))))","v":"?"},{"$f":"IF(AE:AE=\"pas d'actualité\",3,IF(AE:AE=\"?\",\"?\",IF(AE:AE=\"?\",\"?\",IF((($B$2+2)-AF:AF)>=0,0,IF((($B$2+2)-AF:AF)>=-1,1,IF((($B$2+2)-AF:AF)>=-2,2,3))))))","v":"?"},{"$f":"IF(AE:AE=\"pas d'actualité\",3,IF(AE:AE=\"?\",\"?\",IF(AE:AE=\"?\",\"?\",IF(($B$2+3)-AF:AF>=0,0,IF(($B$2+3)-AF:AF>=-1,1,IF(($B$2+3)-AF:AF>=-2,2,3))))))","v":"?"},{"$f":"IF(AE:AE=\"pas d'actualité\",3,IF(AE:AE=\"?\",\"?\",IF(AE:AE=\"?\",\"?\",IF(($B$2+4)-AF:AF>=0,0,IF(($B$2+4)-AF:AF>=-1,1,IF(($B$2+4)-AF:AF>=-2,2,3))))))","v":"?"}]
["PR 479","D 479","FAB 479",null,1,null,null,null,null,null,null,null,null,null,null,null,null,null,null,null,null,null,null,null,null,null,null,null,null,null,"?",{"$f":"IF(ISNUMBER(AE:AE),YEAR(AE:AE),AE:AE)","v":"?"},{"$f":"IF(AE:AE=\"pas d'actualité\",3,IF(AE:AE=\"?\",\"?\",IF(AE:AE=\"?\",\"?\",IF($B$2-AF:AF>=0,0,IF($B$2-AF:AF>=-1,1,IF($B$2-AF:AF>=-2,2,3))))))","v":"?"},{"$f":"IF(AE:AE=\"pas d'actualité\",3,IF(AE:AE=\"?\",\"?\",IF(AE:AE=\"?\",\"?\",IF((($B$2+1)-AF:AF)>=0,\"0\",IF((($B$2+1)-AF:AF)>=-1,\"1\",IF((($B$2+1)-AF:AF)>=-2,\"2\",\"3\"))))))","v":"?"},{"$f":"IF(AE:AE=\"pas d'actualité\",3,IF(AE:AE=\"?\",\"?\",IF(AE:AE=\"?\",\"?\",IF((($B$2+2)-AF:AF)>=0,0,IF((($B$2+2)-AF:AF)>=-1,1,IF((($B$2+2)-AF:AF)>=-2,2,3))))))","v":"?"},{"$f":"IF(AE:AE=\"pas d'actualité\",3,IF(AE:AE=\"?\",\"?\",IF(AE:AE=\"?\",\"?\",IF(($B$2+3)-AF:AF>=0,0,IF(($B$2+3)-AF:AF>=-1,1,IF(($B$2+3)-AF:AF>=-2,2,3))))))","v":"?"},{"$f":"IF(AE:AE=\"pas d'actualité\",3,IF(AE:AE=\"?\",\"?\",IF(AE:AE=\"?\",\"?\",IF(($B$2+4)-AF:AF>=0,0,IF(($B$2+4)-AF:AF>=-1,1,IF(($B$2+4)-AF:AF>=-2,2,3))))))","v":"?"}]
["PR 480","D 480","FAB 480",null,1,null,null,null,null,null,null,null,null,null,null,null,null,null,null,null,null,null,null,null,null,null,null,null,null,null,"?",{"$f":"IF(ISNUMBER(AE:AE),YEAR(AE:AE),AE:AE)","v":"?"},{"$f":"IF(AE:AE=\"pas d'actualité\",3,IF(AE:AE=\"?\",\"?\",IF(AE:AE=\"?\",\"?\",IF($B$2-AF:AF>=0,0,IF($B$2-AF:AF>=-1,1,IF($B$2-AF:AF>=-2,2,3))))))","v":"?"},{"$f":"IF(AE:AE=\"pas d'actualité\",3,IF(AE:AE=\"?\",\"?\",IF(AE:AE=\"?\",\"?\",IF((($B$2+1)-AF:AF)>=0,\"0\",IF((($B$2+1)-AF:AF)>=-1,\"1\",IF((($B$2+1)-AF:AF)>=-2,\"2\",\"3\"))))))","v":"?"},{"$f":"IF(AE:AE=\"pas d'actualité\",3,IF(AE:AE=\"?\",\"?\",IF(AE:AE=\"?\",\"?\",IF((($B$2+2)-AF:AF)>=0,0,IF((($B$2+2)-AF:AF)>=-1,1,IF((($B$2+2)-AF:AF)>=-2,2,3))))))","v":"?"},{"$f":"IF(AE:AE=\"pas d'actualité\",3,IF(AE:AE=\"?\",\"?\",IF(AE:AE=\"?\",\"?\",IF(($B$2+3)-AF:AF>=0,0,IF(($B$2+3)-AF:AF>=-1,1,IF(($B$2+3)-AF:AF>=-2,2,3))))))","v":"?"},{"$f":"IF(AE:AE=\"pas d'actualité\",3,IF(AE:AE=\"?\",\"?\",IF(AE:AE=\"?\",\"?\",IF(($B$2+4)-AF:AF>=0,0,IF(($B$2+4)-AF:AF>=-1,1,IF(($B$2+4)-AF:AF>=-2,2,3))))))","v":"?"}]
["PR 481","D 481","FAB 481",null,1,null,null,null,null,null,null,null,null,null,null,null,null,null,null,null,null,null,null,null,null,null,null,null,null,null,"?",{"$f":"IF(ISNUMBER(AE:AE),YEAR(AE:AE),AE:AE)","v":"?"},{"$f":"IF(AE:AE=\"pas d'actualité\",3,IF(AE:AE=\"?\",\"?\",IF(AE:AE=\"?\",\"?\",IF($B$2-AF:AF>=0,0,IF($B$2-AF:AF>=-1,1,IF($B$2-AF:AF>=-2,2,3))))))","v":"?"},{"$f":"IF(AE:AE=\"pas d'actualité\",3,IF(AE:AE=\"?\",\"?\",IF(AE:AE=\"?\",\"?\",IF((($B$2+1)-AF:AF)>=0,\"0\",IF((($B$2+1)-AF:AF)>=-1,\"1\",IF((($B$2+1)-AF:AF)>=-2,\"2\",\"3\"))))))","v":"?"},{"$f":"IF(AE:AE=\"pas d'actualité\",3,IF(AE:AE=\"?\",\"?\",IF(AE:AE=\"?\",\"?\",IF((($B$2+2)-AF:AF)>=0,0,IF((($B$2+2)-AF:AF)>=-1,1,IF((($B$2+2)-AF:AF)>=-2,2,3))))))","v":"?"},{"$f":"IF(AE:AE=\"pas d'actualité\",3,IF(AE:AE=\"?\",\"?\",IF(AE:AE=\"?\",\"?\",IF(($B$2+3)-AF:AF>=0,0,IF(($B$2+3)-AF:AF>=-1,1,IF(($B$2+3)-AF:AF>=-2,2,3))))))","v":"?"},{"$f":"IF(AE:AE=\"pas d'actualité\",3,IF(AE:AE=\"?\",\"?\",IF(AE:AE=\"?\",\"?\",IF(($B$2+4)-AF:AF>=0,0,IF(($B$2+4)-AF:AF>=-1,1,IF(($B$2+4)-AF:AF>=-2,2,3))))))","v":"?"}]
["PR 482","D 482","FAB 482","X",null,null,null,null,null,null,null,null,null,null,null,null,null,null,null,null,null,null,null,null,null,null,null,null,null,null,"?",{"$f":"IF(ISNUMBER(AE:AE),YEAR(AE:AE),AE:AE)","v":"?"},{"$f":"IF(AE:AE=\"pas d'actualité\",3,IF(AE:AE=\"?\",\"?\",IF(AE:AE=\"?\",\"?\",IF($B$2-AF:AF>=0,0,IF($B$2-AF:AF>=-1,1,IF($B$2-AF:AF>=-2,2,3))))))","v":"?"},{"$f":"IF(AE:AE=\"pas d'actualité\",3,IF(AE:AE=\"?\",\"?\",IF(AE:AE=\"?\",\"?\",IF((($B$2+1)-AF:AF)>=0,\"0\",IF((($B$2+1)-AF:AF)>=-1,\"1\",IF((($B$2+1)-AF:AF)>=-2,\"2\",\"3\"))))))","v":"?"},{"$f":"IF(AE:AE=\"pas d'actualité\",3,IF(AE:AE=\"?\",\"?\",IF(AE:AE=\"?\",\"?\",IF((($B$2+2)-AF:AF)>=0,0,IF((($B$2+2)-AF:AF)>=-1,1,IF((($B$2+2)-AF:AF)>=-2,2,3))))))","v":"?"},{"$f":"IF(AE:AE=\"pas d'actualité\",3,IF(AE:AE=\"?\",\"?\",IF(AE:AE=\"?\",\"?\",IF(($B$2+3)-AF:AF>=0,0,IF(($B$2+3)-AF:AF>=-1,1,IF(($B$2+3)-AF:AF>=-2,2,3))))))","v":"?"},{"$f":"IF(AE:AE=\"pas d'actualité\",3,IF(AE:AE=\"?\",\"?\",IF(AE:AE=\"?\",\"?\",IF(($B$2+4)-AF:AF>=0,0,IF(($B$2+4)-AF:AF>=-1,1,IF(($B$2+4)-AF:AF>=-2,2,3))))))","v":"?"}]
["PR 483","D 483","FAB 483",null,1,null,null,null,null,null,null,null,null,null,null,null,null,null,null,null,null,null,null,null,null,null,null,null,null,null,"?",{"$f":"IF(ISNUMBER(AE:AE),YEAR(AE:AE),AE:AE)","v":"?"},{"$f":"IF(AE:AE=\"pas d'actualité\",3,IF(AE:AE=\"?\",\"?\",IF(AE:AE=\"?\",\"?\",IF($B$2-AF:AF>=0,0,IF($B$2-AF:AF>=-1,1,IF($B$2-AF:AF>=-2,2,3))))))","v":"?"},{"$f":"IF(AE:AE=\"pas d'actualité\",3,IF(AE:AE=\"?\",\"?\",IF(AE:AE=\"?\",\"?\",IF((($B$2+1)-AF:AF)>=0,\"0\",IF((($B$2+1)-AF:AF)>=-1,\"1\",IF((($B$2+1)-AF:AF)>=-2,\"2\",\"3\"))))))","v":"?"},{"$f":"IF(AE:AE=\"pas d'actualité\",3,IF(AE:AE=\"?\",\"?\",IF(AE:AE=\"?\",\"?\",IF((($B$2+2)-AF:AF)>=0,0,IF((($B$2+2)-AF:AF)>=-1,1,IF((($B$2+2)-AF:AF)>=-2,2,3))))))","v":"?"},{"$f":"IF(AE:AE=\"pas d'actualité\",3,IF(AE:AE=\"?\",\"?\",IF(AE:AE=\"?\",\"?\",IF(($B$2+3)-AF:AF>=0,0,IF(($B$2+3)-AF:AF>=-1,1,IF(($B$2+3)-AF:AF>=-2,2,3))))))","v":"?"},{"$f":"IF(AE:AE=\"pas d'actualité\",3,IF(AE:AE=\"?\",\"?\",IF(AE:AE=\"?\",\"?\",IF(($B$2+4)-AF:AF>=0,0,IF(($B$2+4)-AF:AF>=-1,1,IF(($B$2+4)-AF:AF>=-2,2,3))))))","v":"?"}]
["PR 484","D 484","FAB 484",null,1,null,null,null,null,null,null,null,null,null,null,null,null,null,null,null,null,null,null,null,null,null,null,null,null,null,"?",{"$f":"IF(ISNUMBER(AE:AE),YEAR(AE:AE),AE:AE)","v":"?"},{"$f":"IF(AE:AE=\"pas d'actualité\",3,IF(AE:AE=\"?\",\"?\",IF(AE:AE=\"?\",\"?\",IF($B$2-AF:AF>=0,0,IF($B$2-AF:AF>=-1,1,IF($B$2-AF:AF>=-2,2,3))))))","v":"?"},{"$f":"IF(AE:AE=\"pas d'actualité\",3,IF(AE:AE=\"?\",\"?\",IF(AE:AE=\"?\",\"?\",IF((($B$2+1)-AF:AF)>=0,\"0\",IF((($B$2+1)-AF:AF)>=-1,\"1\",IF((($B$2+1)-AF:AF)>=-2,\"2\",\"3\"))))))","v":"?"},{"$f":"IF(AE:AE=\"pas d'actualité\",3,IF(AE:AE=\"?\",\"?\",IF(AE:AE=\"?\",\"?\",IF((($B$2+2)-AF:AF)>=0,0,IF((($B$2+2)-AF:AF)>=-1,1,IF((($B$2+2)-AF:AF)>=-2,2,3))))))","v":"?"},{"$f":"IF(AE:AE=\"pas d'actualité\",3,IF(AE:AE=\"?\",\"?\",IF(AE:AE=\"?\",\"?\",IF(($B$2+3)-AF:AF>=0,0,IF(($B$2+3)-AF:AF>=-1,1,IF(($B$2+3)-AF:AF>=-2,2,3))))))","v":"?"},{"$f":"IF(AE:AE=\"pas d'actualité\",3,IF(AE:AE=\"?\",\"?\",IF(AE:AE=\"?\",\"?\",IF(($B$2+4)-AF:AF>=0,0,IF(($B$2+4)-AF:AF>=-1,1,IF(($B$2+4)-AF:AF>=-2,2,3))))))","v":"?"}]
["PR 485","D 485","FAB 485",null,1,null,null,null,null,null,null,null,null,null,null,null,null,null,null,null,null,null,null,null,null,null,null,null,null,null,"?",{"$f":"IF(ISNUMBER(AE:AE),YEAR(AE:AE),AE:AE)","v":"?"},{"$f":"IF(AE:AE=\"pas d'actualité\",3,IF(AE:AE=\"?\",\"?\",IF(AE:AE=\"?\",\"?\",IF($B$2-AF:AF>=0,0,IF($B$2-AF:AF>=-1,1,IF($B$2-AF:AF>=-2,2,3))))))","v":"?"},{"$f":"IF(AE:AE=\"pas d'actualité\",3,IF(AE:AE=\"?\",\"?\",IF(AE:AE=\"?\",\"?\",IF((($B$2+1)-AF:AF)>=0,\"0\",IF((($B$2+1)-AF:AF)>=-1,\"1\",IF((($B$2+1)-AF:AF)>=-2,\"2\",\"3\"))))))","v":"?"},{"$f":"IF(AE:AE=\"pas d'actualité\",3,IF(AE:AE=\"?\",\"?\",IF(AE:AE=\"?\",\"?\",IF((($B$2+2)-AF:AF)>=0,0,IF((($B$2+2)-AF:AF)>=-1,1,IF((($B$2+2)-AF:AF)>=-2,2,3))))))","v":"?"},{"$f":"IF(AE:AE=\"pas d'actualité\",3,IF(AE:AE=\"?\",\"?\",IF(AE:AE=\"?\",\"?\",IF(($B$2+3)-AF:AF>=0,0,IF(($B$2+3)-AF:AF>=-1,1,IF(($B$2+3)-AF:AF>=-2,2,3))))))","v":"?"},{"$f":"IF(AE:AE=\"pas d'actualité\",3,IF(AE:AE=\"?\",\"?\",IF(AE:AE=\"?\",\"?\",IF(($B$2+4)-AF:AF>=0,0,IF(($B$2+4)-AF:AF>=-1,1,IF(($B$2+4)-AF:AF>=-2,2,3))))))","v":"?"}]
["PR 486","D 486","FAB 486",null,1,null,null,null,null,null,null,null,null,null,null,null,null,null,null,null,null,null,null,null,null,null,null,null,null,null,"?",{"$f":"IF(ISNUMBER(AE:AE),YEAR(AE:AE),AE:AE)","v":"?"},{"$f":"IF(AE:AE=\"pas d'actualité\",3,IF(AE:AE=\"?\",\"?\",IF(AE:AE=\"?\",\"?\",IF($B$2-AF:AF>=0,0,IF($B$2-AF:AF>=-1,1,IF($B$2-AF:AF>=-2,2,3))))))","v":"?"},{"$f":"IF(AE:AE=\"pas d'actualité\",3,IF(AE:AE=\"?\",\"?\",IF(AE:AE=\"?\",\"?\",IF((($B$2+1)-AF:AF)>=0,\"0\",IF((($B$2+1)-AF:AF)>=-1,\"1\",IF((($B$2+1)-AF:AF)>=-2,\"2\",\"3\"))))))","v":"?"},{"$f":"IF(AE:AE=\"pas d'actualité\",3,IF(AE:AE=\"?\",\"?\",IF(AE:AE=\"?\",\"?\",IF((($B$2+2)-AF:AF)>=0,0,IF((($B$2+2)-AF:AF)>=-1,1,IF((($B$2+2)-AF:AF)>=-2,2,3))))))","v":"?"},{"$f":"IF(AE:AE=\"pas d'actualité\",3,IF(AE:AE=\"?\",\"?\",IF(AE:AE=\"?\",\"?\",IF(($B$2+3)-AF:AF>=0,0,IF(($B$2+3)-AF:AF>=-1,1,IF(($B$2+3)-AF:AF>=-2,2,3))))))","v":"?"},{"$f":"IF(AE:AE=\"pas d'actualité\",3,IF(AE:AE=\"?\",\"?\",IF(AE:AE=\"?\",\"?\",IF(($B$2+4)-AF:AF>=0,0,IF(($B$2+4)-AF:AF>=-1,1,IF(($B$2+4)-AF:AF>=-2,2,3))))))","v":"?"}]
["PR 487","D 487","FAB 487",null,1,null,null,null,null,null,null,null,null,null,null,null,null,null,null,null,null,null,null,null,null,null,null,null,null,null,"?",{"$f":"IF(ISNUMBER(AE:AE),YEAR(AE:AE),AE:AE)","v":"?"},{"$f":"IF(AE:AE=\"pas d'actualité\",3,IF(AE:AE=\"?\",\"?\",IF(AE:AE=\"?\",\"?\",IF($B$2-AF:AF>=0,0,IF($B$2-AF:AF>=-1,1,IF($B$2-AF:AF>=-2,2,3))))))","v":"?"},{"$f":"IF(AE:AE=\"pas d'actualité\",3,IF(AE:AE=\"?\",\"?\",IF(AE:AE=\"?\",\"?\",IF((($B$2+1)-AF:AF)>=0,\"0\",IF((($B$2+1)-AF:AF)>=-1,\"1\",IF((($B$2+1)-AF:AF)>=-2,\"2\",\"3\"))))))","v":"?"},{"$f":"IF(AE:AE=\"pas d'actualité\",3,IF(AE:AE=\"?\",\"?\",IF(AE:AE=\"?\",\"?\",IF((($B$2+2)-AF:AF)>=0,0,IF((($B$2+2)-AF:AF)>=-1,1,IF((($B$2+2)-AF:AF)>=-2,2,3))))))","v":"?"},{"$f":"IF(AE:AE=\"pas d'actualité\",3,IF(AE:AE=\"?\",\"?\",IF(AE:AE=\"?\",\"?\",IF(($B$2+3)-AF:AF>=0,0,IF(($B$2+3)-AF:AF>=-1,1,IF(($B$2+3)-AF:AF>=-2,2,3))))))","v":"?"},{"$f":"IF(AE:AE=\"pas d'actualité\",3,IF(AE:AE=\"?\",\"?\",IF(AE:AE=\"?\",\"?\",IF(($B$2+4)-AF:AF>=0,0,IF(($B$2+4)-AF:AF>=-1,1,IF(($B$2+4)-AF:AF>=-2,2,3))))))","v":"?"}]

{"sheet":"FABRICANT 1","index":3,"n_rows":156,"n_cols":40,"rows_kept":156,"cut":false,"hidden":false,"merged":[[2,0,2,6],[2,7,2,29],[3,0,6,6],[3,7,5,14],[3,15,5,24],[3,25,5,29]]}
["DATE DE REFERENCE","Année en cours","NOMBRE DE REFERENCE SIEMENS"]
["2016-05-17",{"$f":"YEAR(A2)","v":2016},{"$f":"COUNTA(A9:A156)","v":148}]
["DONNEES PIECES",null,null,null,null,null,null,"INSTALLATIONS"]
["OBSOLESCENCE FAB 1                               ",null,null,null,null,null,null,"AT 1",null,null,null,null,null,null,null,"AT 2",null,null,null,null,null,null,null,null,null,"AT 3"]
[]
[]
[]
["Référence","Désignation","Fabricant","Code ","Stock mini recommandé","Stock alerte choisi","Sous-équipement","L1","L2","L3","L4","L5","L6","L7","L8","L9","L10","L11","L12","L13","L14","L15","L16","L17","L18","L19","L20","L21","L22","L23","Date d'abandon \ndéfintif ","Année abandon","Actuelle","1 an","2 ans","3 ans","4 ans","Produit successeur","Informations successeur","Commentaires"]
["PR1","D1","FAB 1",null,1,null,null,null,null,null,null,null,null,null,null,null,null,null,null,null,null,null,null,null,null,null,null,null,null,null,"2016-01-10",{"$f":"IF(ISNUMBER(AE:AE),YEAR(AE:AE),AE:AE)","v":2016},{"$f":"IF(AE:AE=\"pas d'actualité\",3,IF(AE:AE=\"?\",\"?\",IF(AE:AE=\"?\",\"?\",IF($B$2-AF:AF>=0,0,IF($B$2-AF:AF>=-1,1,IF($B$2-AF:AF>=-2,2,3))))))","v":0},{"$f":"IF(AE:AE=\"pas d'actualité\",3,IF(AE:AE=\"?\",\"?\",IF(AE:AE=\"?\",\"?\",IF((($B$2+1)-AF:AF)>=0,\"0\",IF((($B$2+1)-AF:AF)>=-1,\"1\",IF((($B$2+1)-AF:AF)>=-2,\"2\",\"3\"))))))","v":"0"},{"$f":"IF(AE:AE=\"pas d'actualité\",3,IF(AE:AE=\"?\",\"?\",IF(AE:AE=\"?\",\"?\",IF((($B$2+2)-AF:AF)>=0,0,IF((($B$2+2)-AF:AF)>=-1,1,IF((($B$2+2)-AF:AF)>=-2,2,3))))))","v":0},{"$f":"IF(AE:AE=\"pas d'actualité\",3,IF(AE:AE=\"?\",\"?\",IF(AE:AE=\"?\",\"?\",IF(($B$2+3)-AF:AF>=0,0,IF(($B$2+3)-AF:AF>=-1,1,IF(($B$2+3)-AF:AF>=-2,2,3))))))","v":0},{"$f":"IF(AE:AE=\"pas d'actualité\",3,IF(AE:AE=\"?\",\"?\",IF(AE:AE=\"?\",\"?\",IF(($B$2+4)-AF:AF>=0,0,IF(($B$2+4)-AF:AF>=-1,1,IF(($B$2+4)-AF:AF>=-2,2,3))))))","v":0},"1FK7063-2AF71-1… voir catalogue Seulement en pièces détachés",null,"ARRET TOTAL FOURNITURE 01/10/2018"]
["PR2","D2","FAB 2",null,1,null,null,"X","X",null,null,"X",null,null,null,null,null,null,null,null,null,null,null,null,null,null,null,null,null,null,"2004-12-31",2004,0,"0",0,0,0,"3SE2120-1E",null,"ARRET TOTAL FOURNITURE 01/04/2005"]
["PR3","D3","FAB 3",null,1,null,null,null,null,"X",null,null,null,null,null,null,null,null,null,null,null,null,null,null,null,null,null,null,null,null,"2016-01-10",2016,0,"0",0,0,0,"6AV3607-1JC20-0AX2",null,"ARRET TOTAL FOURNITURE 01/10/2018"]
["PR4","D4","FAB 4",null,1,null,null,null,null,null,null,null,null,null,null,null,null,null,null,null,null,null,null,null,null,null,null,null,null,null,"2006-11-24",2006,0,"0",0,0,0,null,"SUBSTITUTE: 6DR5*, REFER TO CAT. FI01-7","ARRET TOTAL FOURNITURE 24/11/2006"]
["PR5","D5","FAB 5",null,1,null,null,"X","X",null,null,null,null,null,null,null,null,null,null,null,null,null,null,null,null,null,null,null,null,null,"2010-01-10",2010,0,"0",0,0,0,"6ED1052-1HB00-0BA6",null,"ARRET TOTAL FOURNITURE 01/10/2010"]
["PR6","D6","FAB 6",null,null,null,null,"X",null,null,null,null,null,null,null,null,null,null,null,null,null,null,null,null,null,null,null,null,null,null,"2011-01-10",2011,0,"0",0,0,0,"SITOP POWER24V/30A","Partiellement compatbile"]
["PR7","D7","FAB 7",null,null,null,null,null,null,null,null,null,null,null,null,null,null,null,null,null,null,null,null,null,null,null,null,null,null,null,"2008-05-15",2008,0,"0",0,0,0,"6ES5095-8MA05",null,"reparation/pièce de rechange seulement sous garantie"]
["PR8","D8","FAB 8",null,null,null,null,null,null,null,null,null,null,null,null,null,null,null,null,null,null,null,null,null,null,null,null,null,null,null,"2010-01-10",2010,0,"0",0,0,0,"6ES5095-8MA05",null,"Seulement disponible en pièces de rechange"]
["PR9","D9","FAB 9",null,null,null,null,null,null,null,null,null,null,null,null,null,null,"X",null,null,null,null,null,null,null,null,null,null,null,null,"2008-01-10",2008,0,"0",0,0,0,"SUCCESSOR IS CPU 928B: 6ES5928-3UB21","partiellement"]
["PR10","D10","FAB 10",null,1,null,null,null,null,null,null,null,null,null,null,null,null,"X",null,null,null,null,null,null,null,null,null,null,null,null,"2010-01-10",2010,0,"0",0,0,0,"6ES5955-3LC41"]
["PR11","D11","FAB 11",null,1,null,null,null,null,null,null,null,null,null,null,null,null,"X",null,null,null,null,null,null,null,null,null,null,null,null,"2008-01-10",2008,0,"0",0,0,0]
["PR12","D12","FAB 12",null,1,null,null,"X","X",null,null,null,null,null,null,null,null,null,null,null,null,null,null,null,null,null,null,null,null,null,"2015-01-10",2015,0,"0",0,0,0,null,null,"ARRET TOTAL FOURNITURE 01/10/2017"]
["PR13","D13","FAB 13",null,1,null,null,"X","X",null,null,null,null,null,null,null,null,null,null,null,null,null,null,null,null,null,null,null,null,null,"2015-01-10",2015,0,"0",0,0,0,null,null,"ARRET TOTAL FOURNITURE 01/10/2017"]
["PR14","D14","FAB 14",null,1,null,null,"X","X",null,null,null,null,null,null,null,null,null,null,null,null,null,null,null,null,null,null,null,null,null,"2015-01-10",2015,0,"0",0,0,0,null,null,"ARRET TOTAL FOURNITURE 01/10/2017"]
["PR15","D15","FAB 15",null,1,null,null,"X","X",null,null,null,null,null,null,null,null,null,null,null,null,null,null,null,null,null,null,null,null,null,"2015-01-10",2015,0,"0",0,0,0,null,null,"cette référence Siemens est en fin de commercialisation, normalement des modules destinés à la réparation sont encore disponibles jusqu'au milieu de cette année 2015 ARRET TOTAL FOURNITURE 01/10/2017"]
["PR16","D16","FAB 16",null,1,null,null,"X","X",null,null,null,null,null,null,null,null,null,null,null,null,null,null,null,null,null,null,null,null,null,"2015-01-10",2015,0,"0",0,0,0,null,null,"ARRET TOTAL FOURNITURE 01/10/2017"]
["PR17","D17","FAB 17",null,1,null,null,"X","X",null,null,null,null,null,null,null,null,null,null,null,null,null,null,null,null,null,null,null,null,null,"2015-01-10",2015,0,"0",0,0,0,null,null,"ARRET TOTAL FOURNITURE 01/10/2017"]
["PR18","D18","FAB 18",null,null,null,null,null,null,null,null,null,null,null,null,null,null,null,null,null,null,null,null,null,null,null,null,null,null,null,"2011-01-10",2011,0,"0",0,0,0,"6ES7307-1EA01-0AA0"]
["PR19","D19","FAB 19",null,null,null,null,null,null,null,null,null,null,null,null,null,null,null,null,null,null,null,null,null,null,null,null,null,null,null,"2010-01-10",2010,0,"0",0,0,0,"6ES7313-5BG03-0AB0"]
["PR20","D20","FAB 20",null,1,null,null,"X","X",null,null,null,null,null,null,null,null,null,null,null,null,null,null,null,null,null,null,null,null,null,"2013-01-10",2013,0,"0",0,0,0,"SUCCESSOR: 6ES7315-2AG10-0AB0. COMPATABILITY NOTES SEE SERVICE&SUPPORT ENTRY ID 14845044"]
["PR21","D21","FAB 21",null,1,null,null,"X","X",null,null,null,null,null,null,null,null,null,null,null,null,null,null,null,null,null,null,null,null,null,"2007-01-10",2007,0,"0",0,0,0,"6ES7340-1AH02-0AE0",null,"reparation/pièce de rechange seulement sous garantie ARRET TOTAL FOURNITURE 01/10/2012"]
["PR22","D22","FAB 22",null,1,null,null,"X",null,null,null,null,null,null,null,null,null,null,null,null,null,null,null,null,null,null,null,null,null,null,"2013-05-11",2013,0,"0",0,0,0,"Tableau de commande/écran plat 6FC5203-0AB20-1AA3 ","Partiellement compatible"]
["PR23","D23","FAB 23",null,1,null,null,null,null,null,null,null,null,null,null,null,null,null,null,null,null,null,null,null,null,"X",null,null,null,null,"2016-09-30",2016,0,"0",0,0,0,"6FC5210-0DF31-2AB0","Partiellement compatible","Seulement sous pièces détachées ARRET TOTAL FOURNITURE 30/09/2018"]
["PR24","D24","FAB 24",null,null,null,null,"X","X",null,null,null,null,null,null,null,null,null,null,null,null,null,null,null,null,null,null,null,null,null,"2004-07-06",2004,0,"0",0,0,0,"6FC5247-0AA00-0AA3","Entièrement compatible","ARRET TOTAL FOURNITURE 06/07/2004"]
["PR25","D25","FAB 25",null,null,null,null,"X","X",null,null,null,null,null,null,null,null,null,null,null,null,null,null,null,null,null,null,null,null,null,"2016-09-30",2016,0,"0",0,0,0,"SEULEMENT PIECES DETACHEES","Pas de successeur","ARRET TOTAL FOURNITURE 30/09/2018"]
["PR26","D26","FAB 26",null,1,null,null,"X","X",null,null,null,null,null,null,null,null,null,null,null,null,null,null,null,null,null,null,null,null,null,"2015-09-30",2015,0,"0",0,0,0,"6FC5357-0BB33-0AE3","Partiellement compatible"]
["PR27","D27","FAB 27",null,null,null,null,null,null,null,null,"X",null,null,null,null,null,null,null,null,null,null,null,null,null,null,null,null,null,null,"2013-02-22",2013,0,"0",0,0,0,"6SL3100-1AE31-0AB1","Entièrement compatible"]
["PR28","D28","FAB 28",null,1,null,null,null,null,null,"X",null,"X",null,null,null,null,null,null,null,null,null,null,null,null,null,null,null,null,null,"2010-01-04",2010,0,"0",0,0,0,null,null,"REP. TYPE: 6SL3000-0BE23-6AA0(FI),6SN1111-0AA00-0CA1(DR),6SN1162-0GA00-0CA0(ADP) ARRET TOTAL FOURNITURE 01/04/2010"]
["PR29","D29","FAB 29",null,null,null,null,"X",null,null,null,null,null,null,null,null,null,null,null,null,null,null,null,null,null,null,null,null,null,null,"2006-01-04",2006,0,"0",0,0,0,"6SN1111-0AA01-1BA1",null,"plus disponible ARRET TOTAL FOURNITURE 30/04/2008"]
["PR30","D30","FAB 30",null,null,null,null,"X","X",null,null,null,null,null,null,null,null,null,null,null,null,null,null,null,null,null,null,null,null,null,"2008-09-30",2008,0,"0",0,0,0,"UPGRADE SERVICE 6SN1118-0DG21-0AA1",null,"ARRET TOTAL FOURNITURE 30/09/2010"]
["PR31","D31","FAB 31",null,1,null,null,"X","X",null,null,null,null,null,null,null,null,null,null,null,null,null,null,null,null,null,null,null,null,null,"2016-09-30",2016,0,"0",0,0,0,"6SN1118-0DJ21-0AA1, AB NC SOFTWARE 6.4.9","Entièrement compatible"]
["PR32","D32","FAB 32",null,1,null,null,"X","X",null,null,null,null,null,null,null,null,null,null,null,null,null,null,null,null,null,null,null,null,null,"2016-09-30",2016,0,"0",0,0,0,"6SN1118-0DK21-0AA1 FUER 810D/840D AB NC SW 6.4.9","Entièrement compatible"]
["PR33","D33","FAB 33",null,1,null,null,"X","X",null,null,null,null,null,null,null,null,null,null,null,null,null,null,null,null,null,null,null,null,null,"2016-09-30",{"$f":"IF(ISNUMBER(AE:AE),YEAR(AE:AE),AE:AE)","v":2016},{"$f":"IF(AE:AE=\"pas d'actualité\",3,IF(AE:AE=\"?\",\"?\",IF(AE:AE=\"?\",\"?\",IF($B$2-AF:AF>=0,0,IF($B$2-AF:AF>=-1,1,IF($B$2-AF:AF>=-2,2,3))))))","v":0},{"$f":"IF(AE:AE=\"pas d'actualité\",3,IF(AE:AE=\"?\",\"?\",IF(AE:AE=\"?\",\"?\",IF((($B$2+1)-AF:AF)>=0,\"0\",IF((($B$2+1)-AF:AF)>=-1,\"1\",IF((($B$2+1)-AF:AF)>=-2,\"2\",\"3\"))))))","v":"0"},{"$f":"IF(AE:AE=\"pas d'actualité\",3,IF(AE:AE=\"?\",\"?\",IF(AE:AE=\"?\",\"?\",IF((($B$2+2)-AF:AF)>=0,0,IF((($B$2+2)-AF:AF)>=-1,1,IF((($B$2+2)-AF:AF)>=-2,2,3))))))","v":0},{"$f":"IF(AE:AE=\"pas d'actualité\",3,IF(AE:AE=\"?\",\"?\",IF(AE:AE=\"?\",\"?\",IF(($B$2+3)-AF:AF>=0,0,IF(($B$2+3)-AF:AF>=-1,1,IF(($B$2+3)-AF:AF>=-2,2,3))))))","v":0},{"$f":"IF(AE:AE=\"pas d'actualité\",3,IF(AE:AE=\"?\",\"?\",IF(AE:AE=\"?\",\"?\",IF(($B$2+4)-AF:AF>=0,0,IF(($B$2+4)-AF:AF>=-1,1,IF(($B$2+4)-AF:AF>=-2,2,3))))))","v":0},"6SN1118-0DK23-0AA1 AB NC SOFTWARE 6.4.9","Partiellement  compatible"]
["PR34","D34","FAB 34",null,null,null,null,"X",null,null,null,null,null,null,null,null,null,null,null,null,null,null,null,null,null,null,null,null,null,null,"2015-09-30",2015,0,"0",0,0,0,"POW MOD INT 50A     ***Pièce de rechange SIMODRIVE 611-D*** 6SN1123-1AA00-0CA2",null,"ARRET TOTAL FOURNITURE 30/09/2017"]
["PR35","D35","FAB 35",null,null,null,null,"X","X",null,null,null,null,null,null,null,null,null,null,null,null,null,null,null,null,null,null,null,null,null,"2012-09-30",2012,0,"0",0,0,0,"6SN1123-1AA00-0HA2","Entièrement compatible"]
["PR36","D36","FAB 36",null,1,null,null,null,null,null,null,null,null,null,"X",null,null,null,null,null,null,null,null,null,null,null,null,null,null,null,"2012-09-30",2012,0,"0",0,0,0,"6SN1123-1AB00-0BA2"]
["PR37","D37","FAB 37",null,1,null,null,"X","X",null,null,null,null,null,null,null,null,null,null,null,null,null,null,null,null,null,null,null,null,null,"2015-09-30",2015,0,"0",0,0,0,"6SN1124-1AB00-0CA2","Entièrement compatible"]
["PR38","D38","FAB 38",null,1,null,null,null,null,null,null,null,null,null,"X",null,null,null,null,null,null,null,null,null,null,null,null,null,null,null,"2012-09-30",2012,0,"0",0,0,0]
["PR39","D39","FAB 39",null,null,null,null,"X",null,null,null,null,null,null,null,null,null,null,null,null,null,null,null,null,null,null,null,null,null,null,"2017-09-30",2017,1,"0",0,0,0,"UPGRADESERVICE! REPLACEMENT: 6FC5210-0DA20-2AA1","Partiellement compatible","ARRET TOTAL FOURNITURE 30/09/2013"]
["PR40","D40","FAB 40",null,null,null,null,null,"X",null,null,null,null,"X",null,null,null,null,null,null,null,null,null,null,null,null,null,null,null,null,"2017-09-30",2017,1,"0",0,0,0,"SEULEMENT PIECES DETACHEES","Pas de successeur","ARRET TOTAL FOURNITURE 30/09/2019"]
["PR41","D41","FAB 41",null,0,null,null,null,null,null,null,null,null,null,null,null,null,null,null,null,null,null,null,null,null,null,null,null,null,null,"2018-09-30",2018,2,"1",0,0,0,null,null,"Seulement sous pièce détachées ARRET TOTAL FOURNITURE 30/09/2020"]
["PR42","D42","FAB 42",null,2,null,null,null,null,null,"X",null,"X",null,null,null,null,null,null,null,null,null,null,null,null,null,null,null,null,null,"2018-09-30",2018,2,"1",0,0,0,"REPLACEMENT TYPE: 611U HR 6SN1118-0NH01-0AA0 ","Partiellement compatible","ARRET TOTAL FOURNITURE 30/09/2020"]
["PR43","D43","FAB 43",null,1,null,null,null,null,null,null,null,null,null,null,null,null,null,null,null,null,null,null,null,null,"X",null,null,null,null,"pas d'actualité","pas d'actualité",3,3,3,3,3]
["PR44","D44","FAB 44",null,1,null,null,null,null,null,null,null,null,null,null,null,null,null,null,null,null,null,null,null,null,"X",null,null,null,null,"pas d'actualité","pas d'actualité",3,3,3,3,3]
["PR45","D45","FAB 45",null,null,null,null,null,"X",null,null,null,null,null,null,null,null,null,null,null,null,null,null,null,null,null,null,null,null,null,"pas d'actualité","pas d'actualité",3,3,3,3,3]
["PR46","D46","FAB 46",null,1,null,null,"X","X",null,null,null,null,null,null,null,null,null,null,null,null,null,null,null,null,null,null,null,null,null,"pas d'actualité","pas d'actualité",3,3,3,3,3]
["PR47","D47","FAB 47",null,10,null,null,"X","X",null,null,null,null,null,null,null,null,null,null,null,null,null,null,null,null,null,null,null,null,null,"pas d'actualité","pas d'actualité",3,3,3,3,3]
["PR48","D48","FAB 48",null,5,null,null,"X","X",null,null,null,null,null,null,null,null,null,null,null,null,null,null,null,null,null,null,null,null,null,"pas d'actualité","pas d'actualité",3,3,3,3,3]
["PR49","D49","FAB 49",null,0,null,null,null,null,null,null,null,null,null,null,null,null,null,null,null,null,null,null,null,null,null,null,null,null,null,"pas d'actualité","pas d'actualité",3,3,3,3,3]
["PR50","D50","FAB 50",null,null,null,null,null,null,null,null,null,null,null,null,null,null,null,null,null,null,null,null,null,null,null,null,null,null,null,"pas d'actualité","pas d'actualité",3,3,3,3,3,null,null,"Annonce d'\u0092abandon du produit\n15/11/2013"]
["PR51","D51","FAB 51",null,null,null,null,null,null,null,null,null,null,null,null,null,null,null,null,null,null,null,null,null,null,null,null,null,null,null,"pas d'actualité","pas d'actualité",3,3,3,3,3,null,null,"Annonce d'\u0092abandon du produit\n15/11/2013"]
["PR52","D52","FAB 52",null,null,null,null,null,null,null,null,null,null,null,null,null,null,null,null,null,null,null,null,null,null,null,null,null,null,null,"pas d'actualité","pas d'actualité",3,3,3,3,3,null,null,"Annonce d'\u0092abandon du produit\n15/11/2013"]
["PR53","D53","FAB 53",null,null,null,null,null,null,null,null,null,null,null,null,null,null,null,null,null,null,null,null,null,null,null,null,null,null,null,"pas d'actualité","pas d'actualité",3,3,3,3,3,null,null,"Annonce d'\u0092abandon du produit\n15/11/2013"]
["PR54","D54","FAB 54",null,null,null,null,null,null,null,null,null,null,null,null,null,null,null,null,null,null,null,null,null,null,null,null,null,null,null,"pas d'actualité","pas d'actualité",3,3,3,3,3,null,null,"Annonce d'\u0092abandon du produit\n15/11/2013"]
["PR55","D55","FAB 55",null,null,null,null,null,null,null,null,null,null,null,null,null,null,null,null,null,null,null,null,null,null,null,null,null,null,null,"pas d'actualité","pas d'actualité",3,3,3,3,3,null,null,"Annonce d'\u0092abandon du produit\n15/11/2013"]
["PR56","D56","FAB 56",null,null,null,null,null,null,null,null,null,null,null,null,null,null,null,null,null,null,null,null,null,null,null,null,null,null,null,"pas d'actualité","pas d'actualité",3,3,3,3,3,null,null,"Annonce d'\u0092abandon du produit\n15/11/2013"]
["PR57","D57","FAB 57",null,1,null,null,null,null,null,null,null,null,null,null,null,null,null,null,null,null,null,null,null,null,null,null,"X",null,null,"2022-01-10",2022,3,"3",3,3,2,null,null,"Annonce abandon du produit 01/10/2012\nRéparation et pièces détachées garanties jusq. 01/10/2022"]
["PR58","D58","FAB 58",null,1,null,null,"X","X",null,null,null,null,null,null,null,null,null,null,null,null,null,null,null,null,null,null,null,null,null,"pas d'actualité","pas d'actualité",3,3,3,3,3]
["PR59","D59","FAB 59",null,1,null,null,"X",null,null,null,null,null,null,null,null,null,null,null,null,null,null,null,null,null,null,null,null,null,null,"pas d'actualité","pas d'actualité",3,3,3,3,3]
["PR60","D60","FAB 60",null,1,null,null,"X","X",null,null,null,null,null,null,null,null,null,null,null,null,null,null,null,null,null,null,null,null,null,"pas d'actualité","pas d'actualité",3,3,3,3,3]
["PR61","D61","FAB 61",null,1,null,null,null,null,null,null,null,null,null,null,null,null,null,null,null,null,null,null,null,null,null,null,null,null,null,"pas d'actualité","pas d'actualité",3,3,3,3,3]
["PR62","D62","FAB 62",null,1,null,null,null,null,null,null,null,null,null,null,null,null,null,null,null,null,null,null,null,null,"X",null,null,null,null,"pas d'actualité","pas d'actualité",3,3,3,3,3]
["PR63","D63","FAB 63",null,1,null,null,null,null,null,null,null,null,null,null,null,null,null,null,null,null,null,null,null,null,"X",null,null,null,null,"pas d'actualité","pas d'actualité",3,3,3,3,3]
["PR64","D64","FAB 64",null,1,null,null,null,null,null,null,null,null,null,null,null,null,"X",null,null,null,null,null,null,null,null,null,null,null,null,"pas d'actualité","pas d'actualité",3,3,3,3,3]
["PR65","D65","FAB 65",null,null,null,null,null,null,null,null,null,null,null,null,null,null,null,null,null,null,null,null,null,null,null,null,null,null,null,"2020-01-10",{"$f":"IF(ISNUMBER(AE:AE),YEAR(AE:AE),AE:AE)","v":2020},{"$f":"IF(AE:AE=\"pas d'actualité\",3,IF(AE:AE=\"?\",\"?\",IF(AE:AE=\"?\",\"?\",IF($B$2-AF:AF>=0,0,IF($B$2-AF:AF>=-1,1,IF($B$2-AF:AF>=-2,2,3))))))","v":3},{"$f":"IF(AE:AE=\"pas d'actualité\",3,IF(AE:AE=\"?\",\"?\",IF(AE:AE=\"?\",\"?\",IF((($B$2+1)-AF:AF)>=0,\"0\",IF((($B$2+1)-AF:AF)>=-1,\"1\",IF((($B$2+1)-AF:AF)>=-2,\"2\",\"3\"))))))","v":"3"},{"$f":"IF(AE:AE=\"pas d'actualité\",3,IF(AE:AE=\"?\",\"?\",IF(AE:AE=\"?\",\"?\",IF((($B$2+2)-AF:AF)>=0,0,IF((($B$2+2)-AF:AF)>=-1,1,IF((($B$2+2)-AF:AF)>=-2,2,3))))))","v":2},{"$f":"IF(AE:AE=\"pas d'actualité\",3,IF(AE:AE=\"?\",\"?\",IF(AE:AE=\"?\",\"?\",IF(($B$2+3)-AF:AF>=0,0,IF(($B$2+3)-AF:AF>=-1,1,IF(($B$2+3)-AF:AF>=-2,2,3))))))","v":1},{"$f":"IF(AE:AE=\"pas d'actualité\",3,IF(AE:AE=\"?\",\"?\",IF(AE:AE=\"?\",\"?\",IF(($B$2+4)-AF:AF>=0,0,IF(($B$2+4)-AF:AF>=-1,1,IF(($B$2+4)-AF:AF>=-2,2,3))))))","v":0}]
["PR66","D66","FAB 66",null,null,null,null,null,null,null,null,null,null,null,null,null,null,null,null,null,null,null,null,null,null,null,null,null,null,null,"2020-01-10",2020,3,"3",2,1,0]
["PR67","D67","FAB 67",null,1,null,null,null,null,null,null,null,null,null,null,null,null,"X",null,null,null,null,null,null,null,null,null,null,null,null,"2020-01-10",2020,3,"3",2,1,0,null,null,"réparable"]
["PR68","D68","FAB 68",null,1,null,null,null,null,null,null,null,null,null,null,null,null,"X",null,null,null,null,null,null,null,null,null,null,null,null,"2020-01-10",2020,3,"3",2,1,0]
["PR69","D69","FAB 69",null,1,null,null,null,null,null,null,null,null,null,null,null,null,"X",null,null,null,null,null,null,null,null,null,null,null,null,"2020-01-10",2020,3,"3",2,1,0]
["PR70","D70","FAB 70",null,1,null,null,null,null,null,null,null,null,null,null,null,null,"X",null,null,null,null,null,null,null,null,null,null,null,null,"2020-01-10",2020,3,"3",2,1,0]
["PR71","D71","FAB 71",null,1,null,null,null,null,null,null,null,null,null,null,null,null,null,null,null,null,null,null,null,null,null,null,null,null,null,"2020-01-10",2020,3,"3",2,1,0]
["PR72","D72","FAB 72",null,null,null,null,null,null,null,null,"X",null,null,null,null,null,null,null,null,null,null,null,null,null,null,null,null,null,null,"pas d'actualité","pas d'actualité",3,3,3,3,3]
["PR73","D73","FAB 73",null,null,null,null,null,null,null,null,"X",null,null,null,null,null,null,null,null,null,null,null,null,null,null,null,null,null,null,"pas d'actualité","pas d'actualité",3,3,3,3,3,"6ES7138-4FA05-0AB0","Partiellement compatible"]
["PR74","D74","FAB 74",null,null,null,null,null,null,null,null,"X",null,null,null,null,null,null,null,null,null,null,null,null,null,null,null,null,null,null,"pas d'actualité","pas d'actualité",3,3,3,3,3,"6ES7138-4FB04-0AB0","Partiellement compatible"]
["PR75","D75","FAB 75",null,null,null,null,null,null,null,null,"X",null,null,null,null,null,null,null,null,null,null,null,null,null,null,null,null,null,null,"pas d'actualité","pas d'actualité",3,3,3,3,3]
["PR76","D76","FAB 76",null,null,null,null,null,null,null,null,"X",null,null,null,null,null,null,null,null,null,null,null,null,null,null,null,null,null,null,"pas d'actualité","pas d'actualité",3,3,3,3,3]
["PR77","D77","FAB 77",null,null,null,null,null,null,null,null,null,null,null,null,null,null,null,null,null,null,null,null,null,null,null,null,null,null,null,"pas d'actualité","pas d'actualité",3,3,3,3,3]
["PR78","D78","FAB 78",null,null,null,null,null,null,null,null,null,null,null,null,null,null,null,null,null,null,null,null,null,null,null,null,"X",null,null,"pas d'actualité","pas d'actualité",3,3,3,3,3,"6ES7313-5BG04-0AB0"]
["PR79","D79","FAB 79",null,null,null,null,null,null,null,null,null,null,null,null,null,null,null,null,null,null,null,null,null,null,null,null,"X",null,null,"pas d'actualité","pas d'actualité",3,3,3,3,3]
["PR80","D80","FAB 80",null,1,null,null,null,null,null,null,null,null,null,null,null,null,null,null,null,null,null,null,null,null,null,null,"X",null,null,"pas d'actualité","pas d'actualité",3,3,3,3,3,"6ES7313-6CG04-0AB0"]
["PR81","D81","FAB 81",null,1,null,null,null,null,null,null,null,null,null,null,null,null,null,null,null,null,null,null,null,null,null,null,"X",null,null,"pas d'actualité","pas d'actualité",3,3,3,3,3]
["PR82","D82","FAB 82",null,1,null,null,null,null,"X",null,null,null,null,null,null,null,null,null,null,null,null,null,null,null,null,null,null,null,null,"pas d'actualité","pas d'actualité",3,3,3,3,3,"6ES7314-6CH04-0AB0"]
["PR83","D83","FAB 83",null,1,null,null,null,null,null,null,null,null,null,null,null,null,null,null,null,null,null,null,null,null,null,null,null,null,null,"pas d'actualité","pas d'actualité",3,3,3,3,3]
["PR84","D84","FAB 84",null,1,null,null,"X","X",null,"X",null,null,null,null,null,null,null,null,null,null,null,null,null,null,null,null,null,null,null,"pas d'actualité","pas d'actualité",3,3,3,3,3,"6ES7315-2EH14-0AB0"]
["PR85","D85","FAB 85",null,1,null,null,"X","X",null,"X",null,null,null,null,null,null,null,null,null,null,null,null,null,null,null,null,null,null,null,"pas d'actualité","pas d'actualité",3,3,3,3,3]
["PR86","D86","FAB 86",null,1,null,null,"X","X",null,null,null,null,null,null,null,null,null,null,null,null,null,null,null,null,null,null,null,null,null,"pas d'actualité","pas d'actualité",3,3,3,3,3]
["PR87","D87","FAB 87",null,1,null,null,"X","X",null,null,null,null,null,null,null,null,null,null,null,null,null,null,null,null,null,null,null,null,null,"pas d'actualité","pas d'actualité",3,3,3,3,3]
["PR88","D88","FAB 88",null,1,null,null,"X","X","X","X","X",null,null,null,null,null,null,null,null,null,null,null,null,null,"X",null,null,null,null,"pas d'actualité","pas d'actualité",3,3,3,3,3]
["PR89","D89","FAB 89",null,1,null,null,null,null,null,null,null,null,null,null,null,null,null,null,null,null,null,null,null,null,null,null,"X",null,null,"pas d'actualité","pas d'actualité",3,3,3,3,3]
["PR90","D90","FAB 90",null,1,null,null,"X","X",null,null,null,null,null,null,null,null,null,null,null,null,null,null,null,null,null,null,null,null,null,"pas d'actualité","pas d'actualité",3,3,3,3,3]
["PR91","D91","FAB 91",null,null,null,null,null,null,null,null,null,null,null,null,null,null,null,null,null,null,null,null,null,null,null,null,null,null,null,"pas d'actualité","pas d'actualité",3,3,3,3,3]
["PR92","D92","FAB 92",null,1,null,null,"X","X",null,null,null,null,null,null,null,null,null,null,null,null,null,null,null,null,null,null,null,null,null,"2024-09-30",2024,3,"3",3,3,3]
["PR93","D93","FAB 93",null,1,null,null,"X","X",null,null,null,null,null,null,null,null,null,null,null,null,null,null,null,null,null,null,null,null,null,"pas d'actualité","pas d'actualité",3,3,3,3,3]
["PR94","D94","FAB 94",null,null,null,null,null,null,null,null,"X",null,null,null,null,null,null,null,null,null,null,null,null,null,null,null,null,null,null,"pas d'actualité","pas d'actualité",3,3,3,3,3]
["PR95","D95","FAB 95",null,1,null,null,null,null,null,null,null,null,null,null,null,null,null,null,null,null,null,null,null,null,null,null,"X",null,null,"pas d'actualité","pas d'actualité",3,3,3,3,3]
["PR96","D96","FAB 96",null,null,null,null,"X",null,null,null,null,null,null,null,null,null,null,null,null,null,null,null,null,null,null,null,null,null,null,"pas d'actualité","pas d'actualité",3,3,3,3,3,null,null,"Annonce d'\u0092abandon du produit\n01/04/2006"]
["PR97","D97","FAB 97",null,1,null,null,null,null,"X","X","X",null,null,null,null,null,null,null,null,null,null,null,null,null,null,null,null,null,null,"pas d'actualité",{"$f":"IF(ISNUMBER(AE:AE),YEAR(AE:AE),AE:AE)","v":"pas d'actualité"},{"$f":"IF(AE:AE=\"pas d'actualité\",3,IF(AE:AE=\"?\",\"?\",IF(AE:AE=\"?\",\"?\",IF($B$2-AF:AF>=0,0,IF($B$2-AF:AF>=-1,1,IF($B$2-AF:AF>=-2,2,3))))))","v":3},{"$f":"IF(AE:AE=\"pas d'actualité\",3,IF(AE:AE=\"?\",\"?\",IF(AE:AE=\"?\",\"?\",IF((($B$2+1)-AF:AF)>=0,\"0\",IF((($B$2+1)-AF:AF)>=-1,\"1\",IF((($B$2+1)-AF:AF)>=-2,\"2\",\"3\"))))))","v":3},{"$f":"IF(AE:AE=\"pas d'actualité\",3,IF(AE:AE=\"?\",\"?\",IF(AE:AE=\"?\",\"?\",IF((($B$2+2)-AF:AF)>=0,0,IF((($B$2+2)-AF:AF)>=-1,1,IF((($B$2+2)-AF:AF)>=-2,2,3))))))","v":3},{"$f":"IF(AE:AE=\"pas d'actualité\",3,IF(AE:AE=\"?\",\"?\",IF(AE:AE=\"?\",\"?\",IF(($B$2+3)-AF:AF>=0,0,IF(($B$2+3)-AF:AF>=-1,1,IF(($B$2+3)-AF:AF>=-2,2,3))))))","v":3},{"$f":"IF(AE:AE=\"pas d'actualité\",3,IF(AE:AE=\"?\",\"?\",IF(AE:AE=\"?\",\"?\",IF(($B$2+4)-AF:AF>=0,0,IF(($B$2+4)-AF:AF>=-1,1,IF(($B$2+4)-AF:AF>=-2,2,3))))))","v":3}]
["PR98","D98","FAB 98",null,null,null,null,"X",null,null,null,null,null,null,null,null,null,null,null,null,null,null,null,null,null,null,null,null,null,null,"2019-09-30",2019,3,"2",1,0,0,"CNC KEYBOARD OP32 FROM VERSION F : NOT FOR MMC 100","?"]
["PR99","D99","FAB 99",null,null,null,null,"X",null,null,null,null,null,null,null,null,null,null,null,null,null,null,null,null,null,null,null,null,null,null,"2024-09-30",2024,3,"3",3,3,3,"SINUMERIK tableau de commande O32S","Entièrement compatible"]
["PR100","D100","FAB 100",null,null,null,null,null,null,null,null,"X",null,null,null,null,null,null,null,null,null,null,null,null,null,null,null,null,null,null,"pas d'actualité","pas d'actualité",3,3,3,3,3]
["PR101","D101","FAB 101",null,null,null,null,null,null,null,null,"X",null,null,null,null,null,null,null,null,null,null,null,null,null,null,null,null,null,null,"2024-09-30",2024,3,"3",3,3,3]
["PR102","D102","FAB 102",null,null,null,null,"X","X",null,null,null,null,null,null,null,null,null,null,null,null,null,null,null,null,null,null,null,null,null,"2020-09-30",2020,3,"3",2,1,0]
["PR103","D103","FAB 103",null,0,null,null,"X","X",null,null,null,null,null,null,null,null,null,null,null,null,null,null,null,null,null,null,null,null,null,"pas d'actualité","pas d'actualité",3,3,3,3,3]
["PR104","D104","FAB 104",null,null,null,null,null,null,null,null,"X",null,null,null,null,null,null,null,null,null,null,null,null,null,null,null,null,null,null,"pas d'actualité","pas d'actualité",3,3,3,3,3]
["PR105","D105","FAB 105",null,null,null,null,null,null,null,null,"X",null,null,null,null,null,null,null,null,null,null,null,null,null,null,null,null,null,null,"pas d'actualité","pas d'actualité",3,3,3,3,3]
["PR106","D106","FAB 106",null,1,null,null,null,null,null,null,null,null,null,"x",null,null,null,null,null,null,null,null,null,null,"X",null,null,null,null,"2021-09-30",2021,3,"3",3,2,1]
["PR107","D107","FAB 107",null,null,null,null,null,null,null,null,null,null,null,"x",null,null,null,null,null,null,null,null,null,null,"X",null,null,null,null,"2022-09-30",2022,3,"3",3,3,2]
["PR108","D108","FAB 108",null,1,null,null,null,null,null,null,null,null,null,"X",null,null,null,null,null,null,null,null,null,null,null,null,null,null,null,"2022-09-30",2022,3,"3",3,3,2]
["PR109","D109","FAB 109",null,1,null,null,null,null,null,null,null,null,null,null,null,null,"X",null,null,null,null,null,null,null,null,null,null,null,null,"2020-01-10",2020,3,"3",2,1,0]
["PR110","D110","FAB 110",null,1,null,null,null,null,null,null,null,null,null,null,null,null,null,null,null,null,null,null,null,null,null,null,"X",null,null,"2019-01-11",2019,3,"2",1,0,0," 6GK7343-1EX30-0XE0"]
["PR111","D111","FAB 111",null,null,null,null,null,null,null,null,null,null,null,null,null,null,null,null,null,null,null,null,null,null,null,null,"X",null,null,"pas d'actualité","pas d'actualité",3,3,3,3,3]
["PR112","D112","FAB 112",null,null,null,null,null,null,null,null,"X",null,null,null,null,null,null,null,null,null,null,null,null,null,null,null,null,null,null,"pas d'actualité","pas d'actualité",3,3,3,3,3]
["PR113","D113","FAB 113",null,null,null,null,null,null,null,null,"X",null,null,null,null,null,null,null,null,null,null,null,null,null,null,null,null,null,null,"pas d'actualité","pas d'actualité",3,3,3,3,3]
["PR114","D114","FAB 114",null,null,null,null,null,null,null,null,"X",null,null,null,null,null,null,null,null,null,null,null,null,null,null,null,null,null,null,"pas d'actualité","pas d'actualité",3,3,3,3,3]
["PR115","D115","FAB 115",null,null,null,null,null,null,null,null,"X",null,null,null,null,null,null,null,null,null,null,null,null,null,null,null,null,null,null,"pas d'actualité","pas d'actualité",3,3,3,3,3]
["PR116","D116","FAB 116",null,null,null,null,null,null,null,null,"X",null,null,null,null,null,null,null,null,null,null,null,null,null,null,null,null,null,null,"2023-09-30",2023,3,"3",3,3,3,"6SL3120-1TE21-8AA4","Partiellement compatible"]
["PR117","D117","FAB 117",null,null,null,null,null,null,null,null,"X",null,null,null,null,null,null,null,null,null,null,null,null,null,null,null,null,null,null,"2024-09-30",2024,3,"3",3,3,3,"6SL3120-1TE23-0AA4","Partiellement compatible"]
["PR118","D118","FAB 118",null,null,null,null,null,null,null,null,"X",null,null,null,null,null,null,null,null,null,null,null,null,null,null,null,null,null,null,"pas d'actualité","pas d'actualité",3,3,3,3,3]
["PR119","D119","FAB 119",null,null,null,null,null,null,null,null,"X",null,null,null,null,null,null,null,null,null,null,null,null,null,null,null,null,null,null,"pas d'actualité","pas d'actualité",3,3,3,3,3]
["PR120","D120","FAB 120",null,null,null,null,null,null,null,null,"X",null,null,null,null,null,null,null,null,null,null,null,null,null,null,null,null,null,null,"pas d'actualité","pas d'actualité",3,3,3,3,3]
["PR121","D121","FAB 121",null,null,null,null,null,null,null,null,"X",null,null,null,null,null,null,null,null,null,null,null,null,null,null,null,null,null,null,"2023-09-30",2023,3,"3",3,3,3,"6SL3120-2TE21-0AA4","Partiellement compatible"]
["PR122","D122","FAB 122",null,null,null,null,null,null,null,null,"X",null,null,null,null,null,null,null,null,null,null,null,null,null,null,null,null,null,null,"pas d'actualité","pas d'actualité",3,3,3,3,3]
["PR123","D123","FAB 123",null,null,null,null,null,null,null,null,null,null,null,null,null,null,null,null,null,null,null,null,null,null,null,null,null,null,null,"pas d'actualité","pas d'actualité",3,3,3,3,3]
["PR124","D124","FAB 124",null,1,null,null,null,null,null,null,null,null,null,null,null,null,null,null,null,null,null,null,null,null,"X",null,null,null,null,"pas d'actualité","pas d'actualité",3,3,3,3,3,null,null,"produit qui va être intérrompu"]
["PR125","D125","FAB 125",null,1,null,null,null,"X","X","X",null,"X",null,"X",null,null,null,null,null,null,null,null,null,null,null,null,null,null,null,"2024-01-04",2024,3,"3",3,3,3,null,null,"ARRET TOTAL FOURNITURE 31/12/2030"]
["PR126","D126","FAB 126",null,null,null,null,null,null,null,null,"X",null,null,null,null,null,null,null,null,null,null,null,null,null,null,null,null,null,null,"pas d'actualité","pas d'actualité",3,3,3,3,3]
["PR127","D127","FAB 127",null,1,null,null,"X","X",null,null,null,null,null,null,null,null,null,null,null,null,null,null,null,null,null,null,null,null,null,"2024-01-04",2024,3,"3",3,3,3]
["PR128","D128","FAB 128",null,2,null,null,null,null,null,"X",null,"X",null,null,null,null,null,null,null,null,null,null,null,null,null,null,null,null,null,"2024-01-04",2024,3,"3",3,3,3]
["PR129","D129","FAB 129",null,null,null,null,null,null,null,null,null,null,null,null,null,null,null,null,null,null,null,null,null,null,null,null,null,null,null,"2025-09-30",{"$f":"IF(ISNUMBER(AE:AE),YEAR(AE:AE),AE:AE)","v":2025},{"$f":"IF(AE:AE=\"pas d'actualité\",3,IF(AE:AE=\"?\",\"?\",IF(AE:AE=\"?\",\"?\",IF($B$2-AF:AF>=0,0,IF($B$2-AF:AF>=-1,1,IF($B$2-AF:AF>=-2,2,3))))))","v":3},{"$f":"IF(AE:AE=\"pas d'actualité\",3,IF(AE:AE=\"?\",\"?\",IF(AE:AE=\"?\",\"?\",IF((($B$2+1)-AF:AF)>=0,\"0\",IF((($B$2+1)-AF:AF)>=-1,\"1\",IF((($B$2+1)-AF:AF)>=-2,\"2\",\"3\"))))))","v":"3"},{"$f":"IF(AE:AE=\"pas d'actualité\",3,IF(AE:AE=\"?\",\"?\",IF(AE:AE=\"?\",\"?\",IF((($B$2+2)-AF:AF)>=0,0,IF((($B$2+2)-AF:AF)>=-1,1,IF((($B$2+2)-AF:AF)>=-2,2,3))))))","v":3},{"$f":"IF(AE:AE=\"pas d'actualité\",3,IF(AE:AE=\"?\",\"?\",IF(AE:AE=\"?\",\"?\",IF(($B$2+3)-AF:AF>=0,0,IF(($B$2+3)-AF:AF>=-1,1,IF(($B$2+3)-AF:AF>=-2,2,3))))))","v":3},{"$f":"IF(AE:AE=\"pas d'actualité\",3,IF(AE:AE=\"?\",\"?\",IF(AE:AE=\"?\",\"?\",IF(($B$2+4)-AF:AF>=0,0,IF(($B$2+4)-AF:AF>=-1,1,IF(($B$2+4)-AF:AF>=-2,2,3))))))","v":3}]
["PR130","D130","FAB 130",null,1,null,null,null,null,null,null,null,null,null,null,null,null,null,null,null,null,null,null,null,null,"X",null,null,null,null,"2025-09-30",2025,3,"3",3,3,3]
["PR131","D131","FAB 131",null,1,null,null,"X","X",null,null,null,null,null,null,null,null,null,null,null,null,null,null,null,null,null,null,null,null,null,"pas d'actualité","pas d'actualité",3,3,3,3,3]
["PR132","D132","FAB 132",null,1,null,null,null,"X",null,null,null,null,null,null,null,null,null,null,null,null,null,null,null,null,null,null,null,null,null,"pas d'actualité","pas d'actualité",3,3,3,3,3,"6SN1124-1AA00-0CA2","Entièrement compatible"]
["PR133","D133","FAB 133",null,1,null,null,"X","X",null,null,null,null,null,null,null,null,null,null,null,null,null,null,null,null,null,null,null,null,null,"2024-01-04",2024,3,"3",3,3,3]
["PR134","D134","FAB 134",null,1,null,null,null,null,null,null,null,null,null,null,null,null,null,null,null,null,null,null,null,null,"X",null,null,null,null,"2024-01-04",2024,3,"3",3,3,3]
["PR135","D135","FAB 135",null,3,null,null,null,null,null,"X",null,"X",null,null,null,null,null,null,null,null,null,null,null,null,null,null,null,null,null,"2024-01-04",2024,3,"3",3,3,3]
["PR136","D136","FAB 136",null,1,null,null,"X","X",null,null,null,null,null,null,null,null,null,null,null,null,null,null,null,null,null,null,null,null,null,"2024-01-04",2024,3,"3",3,3,3]
["PR137","D137","FAB 137",null,null,null,null,"X","X",null,null,null,null,null,null,null,null,null,null,null,null,null,null,null,null,null,null,null,null,null,"2024-01-04",2024,3,"3",3,3,3]
["PR138","D138","FAB 138",null,1,null,null,"X","X",null,null,null,null,null,null,null,null,null,null,null,null,null,null,null,null,null,null,null,null,null,"2024-01-04",2024,3,"3",3,3,3]
["PR139","D139","FAB 139",null,1,null,null,null,null,null,null,null,null,null,null,null,null,null,null,null,null,null,null,null,null,null,null,null,null,null,"?","?","?","?","?","?","?"]
["PR140","D140","FAB 140",null,1,null,null,null,null,null,null,null,null,null,null,null,null,null,null,null,null,null,null,null,null,null,null,null,null,null,"?","?","?","?","?","?","?"]
["PR141","D141","FAB 141",null,1,null,null,null,null,null,null,null,null,null,null,null,null,null,null,null,null,null,null,null,null,null,null,null,null,null,"?","?","?","?","?","?","?"]
["PR142","D142","FAB 142",null,0,null,null,null,null,null,null,null,null,null,null,null,null,"X",null,null,null,null,null,null,null,null,null,null,null,null,"?","?","?","?","?","?","?"]
["PR143","D143","FAB 143",null,1,null,null,null,null,null,null,null,null,null,null,null,null,null,null,null,null,null,null,null,null,null,null,null,null,"X","pas d'actualité","pas d'actualité",3,3,3,3,3]
["PR144","D144","FAB 144",null,1,null,null,null,null,null,null,null,null,null,null,null,null,null,null,null,null,null,null,null,null,null,null,null,null,"X","2020-10-01",2020,3,"3",2,1,0]
["PR145","D145","FAB 145",null,1,null,null,null,null,null,null,null,null,null,null,null,null,null,null,null,null,null,null,null,null,null,null,null,null,"X","2020-10-01",2020,3,"3",2,1,0]
["PR146","D146","FAB 146",null,1,null,null,null,null,null,null,null,null,null,null,null,null,null,null,null,null,null,null,null,null,null,null,null,null,"X","2020-10-01",2020,3,"3",2,1,0]
["PR147","D147","FAB 147",null,1,null,null,null,null,null,null,null,null,null,null,null,null,"X",null,null,null,null,null,null,null,null,null,null,null,null,"2020-10-01",2020,3,"3",2,1,0]
["PR148","D148","FAB 148",null,1,null,null,null,null,null,null,null,null,null,null,null,null,"X",null,null,null,null,null,null,null,null,null,null,null,null,"2020-10-01",2020,3,"3",2,1,0]

{"sheet":"FABRICANT 2","index":4,"n_rows":25,"n_cols":40,"rows_kept":25,"cut":false,"hidden":false,"merged":[[2,0,2,6],[2,7,2,29],[3,0,6,6],[3,7,5,14],[3,15,5,24],[3,25,5,29]]}
["DATE DE REFERENCE","Année en cours","NOMBRE DE REFERENCE SIEMENS"]
["2016-05-17",{"$f":"YEAR(A2)","v":2016},{"$f":"COUNTA(A9:A25)","v":17}]
["DONNEES PIECES",null,null,null,null,null,null,"INSTALLATIONS"]
["OBSOLESCENCE FAB 2                            ",null,null,null,null,null,null,"AT 1",null,null,null,null,null,null,null,"AT 2",null,null,null,null,null,null,null,null,null,"AT 3"]
[]
[]
[]
["Référence","Désignation","Fabricant","Code","Stock mini recommandé","Stock alerte choisi","Sous-équipement","L1","L2","L3","L4","L5","L6","L7","L8","L9","L10","L11","L12","L13","L14","L15","L16","L17","L18","L19","L20","L21","L22","L23","Date d'abandon \ndéfintif ","Année abandon","Actuelle","1 an","2 ans","3 ans","4 ans","Produit successeur","Informations successeur","Commentaires"]
["PR160","D160","FAB 400",null,1,null,null,null,null,null,null,null,null,null,null,null,null,null,null,null,null,null,null,null,null,null,null,null,null,null,"2016-01-10",{"$f":"IF(ISNUMBER(AE:AE),YEAR(AE:AE),AE:AE)","v":2016},{"$f":"IF(AE:AE=\"pas d'actualité\",3,IF(AE:AE=\"?\",\"?\",IF(AE:AE=\"?\",\"?\",IF($B$2-AF:AF>=0,0,IF($B$2-AF:AF>=-1,1,IF($B$2-AF:AF>=-2,2,3))))))","v":0},{"$f":"IF(AE:AE=\"pas d'actualité\",3,IF(AE:AE=\"?\",\"?\",IF(AE:AE=\"?\",\"?\",IF((($B$2+1)-AF:AF)>=0,\"0\",IF((($B$2+1)-AF:AF)>=-1,\"1\",IF((($B$2+1)-AF:AF)>=-2,\"2\",\"3\"))))))","v":"0"},{"$f":"IF(AE:AE=\"pas d'actualité\",3,IF(AE:AE=\"?\",\"?\",IF(AE:AE=\"?\",\"?\",IF((($B$2+2)-AF:AF)>=0,0,IF((($B$2+2)-AF:AF)>=-1,1,IF((($B$2+2)-AF:AF)>=-2,2,3))))))","v":0},{"$f":"IF(AE:AE=\"pas d'actualité\",3,IF(AE:AE=\"?\",\"?\",IF(AE:AE=\"?\",\"?\",IF(($B$2+3)-AF:AF>=0,0,IF(($B$2+3)-AF:AF>=-1,1,IF(($B$2+3)-AF:AF>=-2,2,3))))))","v":0},{"$f":"IF(AE:AE=\"pas d'actualité\",3,IF(AE:AE=\"?\",\"?\",IF(AE:AE=\"?\",\"?\",IF(($B$2+4)-AF:AF>=0,0,IF(($B$2+4)-AF:AF>=-1,1,IF(($B$2+4)-AF:AF>=-2,2,3))))))","v":0},null,null,"ARRET TOTAL FOURNITURE 01/10/2018"]
["PR161","D161","FAB 401",null,1,null,null,"X","X",null,null,"X",null,null,null,null,null,null,null,null,null,null,null,null,null,null,null,null,null,null,"2004-12-31",2004,0,"0",0,0,0,null,null,"ARRET TOTAL FOURNITURE 01/04/2005"]
["PR162","D162","FAB 402",null,1,null,null,null,null,"X",null,null,null,null,null,null,null,null,null,null,null,null,null,null,null,null,null,null,null,null,"2016-01-10",2016,0,"0",0,0,0,null,null,"ARRET TOTAL FOURNITURE 01/10/2018"]
["PR163","D163","FAB 403",null,1,null,null,null,null,null,null,null,null,null,null,null,null,null,null,null,null,null,null,null,null,null,null,null,null,null,"2006-11-24",2006,0,"0",0,0,0,null,null,"ARRET TOTAL FOURNITURE 24/11/2006"]
["PR164","D164","FAB 404",null,1,null,null,"X","X",null,null,null,null,null,null,null,null,null,null,null,null,null,null,null,null,null,null,null,null,null,"2010-01-10",2010,0,"0",0,0,0,null,null,"ARRET TOTAL FOURNITURE 01/10/2010"]
["PR165","D165","FAB 405",null,null,null,null,"X",null,null,null,null,null,null,null,null,null,null,null,null,null,null,null,null,null,null,null,null,null,null,"2011-01-10",2011,0,"0",0,0,0]
["PR166","D166","FAB 406",null,null,null,null,null,null,null,null,null,null,null,null,null,null,null,null,null,null,null,null,null,null,null,null,null,null,null,"2008-05-15",2008,0,"0",0,0,0,null,null,"reparation/pièce de rechange seulement sous garantie"]
["PR167","D167","FAB 407",null,null,null,null,null,null,null,null,null,null,null,null,null,null,null,null,null,null,null,null,null,null,null,null,null,null,null,"2010-01-10",2010,0,"0",0,0,0,null,null,"Seulement disponible en pièces de rechange"]
["PR168","D168","FAB 408",null,null,null,null,null,null,null,null,null,null,null,null,null,null,"X",null,null,null,null,null,null,null,null,null,null,null,null,"2008-01-10",2008,0,"0",0,0,0,null,"partiellement"]
["PR169","D169","FAB 409",null,1,null,null,null,null,null,null,null,null,null,null,null,null,"X",null,null,null,null,null,null,null,null,null,null,null,null,"2010-01-10",2010,0,"0",0,0,0]
["PR170","D170","FAB 410",null,1,null,null,null,null,null,null,null,null,null,null,null,null,"X",null,null,null,null,null,null,null,null,null,null,null,null,"2008-01-10",2008,0,"0",0,0,0]
["PR171","D171","FAB 411",null,1,null,null,"X","X",null,null,null,null,null,null,null,null,null,null,null,null,null,null,null,null,null,null,null,null,null,"2015-01-10",2015,0,"0",0,0,0,null,null,"ARRET TOTAL FOURNITURE 01/10/2017"]
["PR172","D172","FAB 412",null,1,null,null,"X","X",null,null,null,null,null,null,null,null,null,null,null,null,null,null,null,null,null,null,null,null,null,"2015-01-10",2015,0,"0",0,0,0,null,null,"ARRET TOTAL FOURNITURE 01/10/2017"]
["PR173","D173","FAB 413",null,1,null,null,"X","X",null,null,null,null,null,null,null,null,null,null,null,null,null,null,null,null,null,null,null,null,null,"2015-01-10",2015,0,"0",0,0,0,null,null,"ARRET TOTAL FOURNITURE 01/10/2017"]
["PR174","D174","FAB 414",null,1,null,null,"X","X",null,null,null,null,null,null,null,null,null,null,null,null,null,null,null,null,null,null,null,null,null,"2015-01-10",2015,0,"0",0,0,0,null,null,"cette référence Siemens est en fin de commercialisation, normalement des modules destinés à la réparation sont encore disponibles jusqu'au milieu de cette année 2015 ARRET TOTAL FOURNITURE 01/10/2017"]
["PR175","D175","FAB 415",null,1,null,null,"X","X",null,null,null,null,null,null,null,null,null,null,null,null,null,null,null,null,null,null,null,null,null,"2015-01-10",2015,0,"0",0,0,0,null,null,"ARRET TOTAL FOURNITURE 01/10/2017"]
["PR176","D176","FAB 416",null,1,null,null,"X","X",null,null,null,null,null,null,null,null,null,null,null,null,null,null,null,null,null,null,null,null,null,"2015-01-10",2015,0,"0",0,0,0,null,null,"ARRET TOTAL FOURNITURE 01/10/2017"]

{"sheet":"FABRICANT 3","index":5,"n_rows":133,"n_cols":40,"rows_kept":133,"cut":false,"hidden":false,"merged":[[2,0,2,6],[2,7,2,29],[3,0,6,6],[3,7,5,14],[3,15,5,24],[3,25,5,29]]}
["DATE DE REFERENCE","Année en cours","NOMBRE DE REFERENCE SIEMENS"]
["2016-05-17",{"$f":"YEAR(A2)","v":2016},{"$f":"COUNTA(A9:A156)","v":125}]
["DONNEES PIECES",null,null,null,null,null,null,"INSTALLATIONS"]
["OBSOLESCENCE FAB 3                               ",null,null,null,null,null,null,"AT 1",null,null,null,null,null,null,null,"AT 2",null,null,null,null,null,null,null,null,null,"AT 3"]
[]
[]
[]
["Référence","Désignation","Fabricant","Code ","Stock mini recommandé","Stock alerte choisi","Sous-équipement","L1","L2","L3","L4","L5","L6","L7","L8","L9","L10","L11","L12","L13","L14","L15","L16","L17","L18","L19","L20","L21","L22","L23","Date d'abandon \ndéfintif ","Année abandon","Actuelle","1 an","2 ans","3 ans","4 ans","Produit successeur","Informations successeur","Commentaires"]
["PR180","D180","FAB 180",null,1,null,null,null,null,null,null,null,null,null,null,null,null,null,null,null,null,null,null,null,null,null,null,null,null,null,"2016-01-10",{"$f":"IF(ISNUMBER(AE:AE),YEAR(AE:AE),AE:AE)","v":2016},{"$f":"IF(AE:AE=\"pas d'actualité\",3,IF(AE:AE=\"?\",\"?\",IF(AE:AE=\"?\",\"?\",IF($B$2-AF:AF>=0,0,IF($B$2-AF:AF>=-1,1,IF($B$2-AF:AF>=-2,2,3))))))","v":0},{"$f":"IF(AE:AE=\"pas d'actualité\",3,IF(AE:AE=\"?\",\"?\",IF(AE:AE=\"?\",\"?\",IF((($B$2+1)-AF:AF)>=0,\"0\",IF((($B$2+1)-AF:AF)>=-1,\"1\",IF((($B$2+1)-AF:AF)>=-2,\"2\",\"3\"))))))","v":"0"},{"$f":"IF(AE:AE=\"pas d'actualité\",3,IF(AE:AE=\"?\",\"?\",IF(AE:AE=\"?\",\"?\",IF((($B$2+2)-AF:AF)>=0,0,IF((($B$2+2)-AF:AF)>=-1,1,IF((($B$2+2)-AF:AF)>=-2,2,3))))))","v":0},{"$f":"IF(AE:AE=\"pas d'actualité\",3,IF(AE:AE=\"?\",\"?\",IF(AE:AE=\"?\",\"?\",IF(($B$2+3)-AF:AF>=0,0,IF(($B$2+3)-AF:AF>=-1,1,IF(($B$2+3)-AF:AF>=-2,2,3))))))","v":0},{"$f":"IF(AE:AE=\"pas d'actualité\",3,IF(AE:AE=\"?\",\"?\",IF(AE:AE=\"?\",\"?\",IF(($B$2+4)-AF:AF>=0,0,IF(($B$2+4)-AF:AF>=-1,1,IF(($B$2+4)-AF:AF>=-2,2,3))))))","v":0},null,null,"ARRET TOTAL FOURNITURE 01/10/2018"]
["PR181","D181","FAB 181",null,1,null,null,"X","X",null,null,"X",null,null,null,null,null,null,null,null,null,null,null,null,null,null,null,null,null,null,"2004-12-31",2004,0,"0",0,0,0,"3SE2120-1E",null,"ARRET TOTAL FOURNITURE 01/04/2005"]
["PR182","D182","FAB 182",null,1,null,null,null,null,"X",null,null,null,null,null,null,null,null,null,null,null,null,null,null,null,null,null,null,null,null,"2016-01-10",2016,0,"0",0,0,0,"6AV3607-1JC20-0AX2",null,"ARRET TOTAL FOURNITURE 01/10/2018"]
["PR183","D183","FAB 183",null,1,null,null,null,null,null,null,null,null,null,null,null,null,null,null,null,null,null,null,null,null,null,null,null,null,null,"2006-11-24",2006,0,"0",0,0,0,null,"SUBSTITUTE: 6DR5*, REFER TO CAT. FI01-7","ARRET TOTAL FOURNITURE 24/11/2006"]
["PR184","D184","FAB 184",null,1,null,null,"X","X",null,null,null,null,null,null,null,null,null,null,null,null,null,null,null,null,null,null,null,null,null,"2010-01-10",2010,0,"0",0,0,0,"6ED1052-1HB00-0BA6",null,"ARRET TOTAL FOURNITURE 01/10/2010"]
["PR185","D185","FAB 185",null,null,null,null,"X",null,null,null,null,null,null,null,null,null,null,null,null,null,null,null,null,null,null,null,null,null,null,"2011-01-10",2011,0,"0",0,0,0,null,"Partiellement compatbile"]
["PR186","D186","FAB 186",null,null,null,null,null,null,null,null,null,null,null,null,null,null,null,null,null,null,null,null,null,null,null,null,null,null,null,"2008-05-15",2008,0,"0",0,0,0,"6ES5095-8MA05",null,"reparation/pièce de rechange seulement sous garantie"]
["PR187","D187","FAB 187",null,null,null,null,null,null,null,null,null,null,null,null,null,null,null,null,null,null,null,null,null,null,null,null,null,null,null,"2010-01-10",2010,0,"0",0,0,0,"6ES5095-8MA05",null,"Seulement disponible en pièces de rechange"]
["PR188","D188","FAB 188",null,null,null,null,null,null,null,null,null,null,null,null,null,null,"X",null,null,null,null,null,null,null,null,null,null,null,null,"2008-01-10",2008,0,"0",0,0,0,"SUCCESSOR IS CPU 928B: 6ES5928-3UB21","partiellement"]
["PR189","D189","FAB 189",null,1,null,null,null,null,null,null,null,null,null,null,null,null,"X",null,null,null,null,null,null,null,null,null,null,null,null,"2010-01-10",2010,0,"0",0,0,0,"6ES5955-3LC41"]
["PR190","D190","FAB 190",null,1,null,null,null,null,null,null,null,null,null,null,null,null,"X",null,null,null,null,null,null,null,null,null,null,null,null,"2008-01-10",2008,0,"0",0,0,0]
["PR191","D191","FAB 191",null,1,null,null,"X","X",null,null,null,null,null,null,null,null,null,null,null,null,null,null,null,null,null,null,null,null,null,"2015-01-10",2015,0,"0",0,0,0,null,null,"ARRET TOTAL FOURNITURE 01/10/2017"]
["PR192","D192","FAB 192",null,1,null,null,"X","X",null,null,null,null,null,null,null,null,null,null,null,null,null,null,null,null,null,null,null,null,null,"2015-01-10",2015,0,"0",0,0,0,null,null,"ARRET TOTAL FOURNITURE 01/10/2017"]
["PR193","D193","FAB 193",null,1,null,null,"X","X",null,null,null,null,null,null,null,null,null,null,null,null,null,null,null,null,null,null,null,null,null,"2015-01-10",2015,0,"0",0,0,0,null,null,"ARRET TOTAL FOURNITURE 01/10/2017"]
["PR194","D194","FAB 194",null,1,null,null,"X","X",null,null,null,null,null,null,null,null,null,null,null,null,null,null,null,null,null,null,null,null,null,"2015-01-10",2015,0,"0",0,0,0,null,null,"cette référence Siemens est en fin de commercialisation, normalement des modules destinés à la réparation sont encore disponibles jusqu'au milieu de cette année 2015 ARRET TOTAL FOURNITURE 01/10/2017"]
["PR195","D195","FAB 195",null,1,null,null,"X","X",null,null,null,null,null,null,null,null,null,null,null,null,null,null,null,null,null,null,null,null,null,"2015-01-10",2015,0,"0",0,0,0,null,null,"ARRET TOTAL FOURNITURE 01/10/2017"]
["PR196","D196","FAB 196",null,1,null,null,"X","X",null,null,null,null,null,null,null,null,null,null,null,null,null,null,null,null,null,null,null,null,null,"2015-01-10",2015,0,"0",0,0,0,null,null,"ARRET TOTAL FOURNITURE 01/10/2017"]
["PR197","D197","FAB 197",null,null,null,null,null,null,null,null,null,null,null,null,null,null,null,null,null,null,null,null,null,null,null,null,null,null,null,"2011-01-10",2011,0,"0",0,0,0,"6ES7307-1EA01-0AA0"]
["PR198","D198","FAB 198",null,null,null,null,null,null,null,null,null,null,null,null,null,null,null,null,null,null,null,null,null,null,null,null,null,null,null,"2010-01-10",2010,0,"0",0,0,0,"6ES7313-5BG03-0AB0"]
["PR199","D199","FAB 199",null,1,null,null,"X","X",null,null,null,null,null,null,null,null,null,null,null,null,null,null,null,null,null,null,null,null,null,"2013-01-10",2013,0,"0",0,0,0,"SUCCESSOR: 6ES7315-2AG10-0AB0. COMPATABILITY NOTES SEE SERVICE&SUPPORT ENTRY ID 14845044"]
["PR200","D200","FAB 200",null,1,null,null,"X","X",null,null,null,null,null,null,null,null,null,null,null,null,null,null,null,null,null,null,null,null,null,"2007-01-10",2007,0,"0",0,0,0,"6ES7340-1AH02-0AE0",null,"reparation/pièce de rechange seulement sous garantie ARRET TOTAL FOURNITURE 01/10/2012"]
["PR201","D201","FAB 201",null,1,null,null,"X",null,null,null,null,null,null,null,null,null,null,null,null,null,null,null,null,null,null,null,null,null,null,"2013-05-11",2013,0,"0",0,0,0,"Tableau de commande/écran plat 6FC5203-0AB20-1AA3 ","Partiellement compatible"]
["PR202","D202","FAB 202",null,1,null,null,null,null,null,null,null,null,null,null,null,null,null,null,null,null,null,null,null,null,"X",null,null,null,null,"2016-09-30",2016,0,"0",0,0,0,"6FC5210-0DF31-2AB0","Partiellement compatible","Seulement sous pièces détachées ARRET TOTAL FOURNITURE 30/09/2018"]
["PR203","D203","FAB 203",null,null,null,null,"X","X",null,null,null,null,null,null,null,null,null,null,null,null,null,null,null,null,null,null,null,null,null,"2004-07-06",2004,0,"0",0,0,0,"6FC5247-0AA00-0AA3","Entièrement compatible","ARRET TOTAL FOURNITURE 06/07/2004"]
["PR204","D204","FAB 204",null,null,null,null,"X","X",null,null,null,null,null,null,null,null,null,null,null,null,null,null,null,null,null,null,null,null,null,"2016-09-30",2016,0,"0",0,0,0,"SEULEMENT PIECES DETACHEES","Pas de successeur","ARRET TOTAL FOURNITURE 30/09/2018"]
["PR205","D205","FAB 205",null,1,null,null,"X","X",null,null,null,null,null,null,null,null,null,null,null,null,null,null,null,null,null,null,null,null,null,"2015-09-30",2015,0,"0",0,0,0,"6FC5357-0BB33-0AE3","Partiellement compatible"]
["PR206","D206","FAB 206",null,null,null,null,null,null,null,null,"X",null,null,null,null,null,null,null,null,null,null,null,null,null,null,null,null,null,null,"2013-02-22",2013,0,"0",0,0,0,"6SL3100-1AE31-0AB1","Entièrement compatible"]
["PR207","D207","FAB 207",null,1,null,null,null,null,null,"X",null,"X",null,null,null,null,null,null,null,null,null,null,null,null,null,null,null,null,null,"2010-01-04",2010,0,"0",0,0,0,null,null,"REP. TYPE: 6SL3000-0BE23-6AA0(FI),6SN1111-0AA00-0CA1(DR),6SN1162-0GA00-0CA0(ADP) ARRET TOTAL FOURNITURE 01/04/2010"]
["PR208","D208","FAB 208",null,null,null,null,"X",null,null,null,null,null,null,null,null,null,null,null,null,null,null,null,null,null,null,null,null,null,null,"2006-01-04",2006,0,"0",0,0,0,null,null,"plus disponible ARRET TOTAL FOURNITURE 30/04/2008"]
["PR209","D209","FAB 209",null,null,null,null,"X","X",null,null,null,null,null,null,null,null,null,null,null,null,null,null,null,null,null,null,null,null,null,"2008-09-30",2008,0,"0",0,0,0,null,null,"ARRET TOTAL FOURNITURE 30/09/2010"]
["PR210","D210","FAB 210",null,1,null,null,"X","X",null,null,null,null,null,null,null,null,null,null,null,null,null,null,null,null,null,null,null,null,null,"2016-09-30",2016,0,"0",0,0,0,null,"Entièrement compatible"]
["PR211","D211","FAB 211",null,1,null,null,"X","X",null,null,null,null,null,null,null,null,null,null,null,null,null,null,null,null,null,null,null,null,null,"2016-09-30",2016,0,"0",0,0,0,null,"Entièrement compatible"]
["PR212","D212","FAB 212",null,1,null,null,"X","X",null,null,null,null,null,null,null,null,null,null,null,null,null,null,null,null,null,null,null,null,null,"2016-09-30",{"$f":"IF(ISNUMBER(AE:AE),YEAR(AE:AE),AE:AE)","v":2016},{"$f":"IF(AE:AE=\"pas d'actualité\",3,IF(AE:AE=\"?\",\"?\",IF(AE:AE=\"?\",\"?\",IF($B$2-AF:AF>=0,0,IF($B$2-AF:AF>=-1,1,IF($B$2-AF:AF>=-2,2,3))))))","v":0},{"$f":"IF(AE:AE=\"pas d'actualité\",3,IF(AE:AE=\"?\",\"?\",IF(AE:AE=\"?\",\"?\",IF((($B$2+1)-AF:AF)>=0,\"0\",IF((($B$2+1)-AF:AF)>=-1,\"1\",IF((($B$2+1)-AF:AF)>=-2,\"2\",\"3\"))))))","v":"0"},{"$f":"IF(AE:AE=\"pas d'actualité\",3,IF(AE:AE=\"?\",\"?\",IF(AE:AE=\"?\",\"?\",IF((($B$2+2)-AF:AF)>=0,0,IF((($B$2+2)-AF:AF)>=-1,1,IF((($B$2+2)-AF:AF)>=-2,2,3))))))","v":0},{"$f":"IF(AE:AE=\"pas d'actualité\",3,IF(AE:AE=\"?\",\"?\",IF(AE:AE=\"?\",\"?\",IF(($B$2+3)-AF:AF>=0,0,IF(($B$2+3)-AF:AF>=-1,1,IF(($B$2+3)-AF:AF>=-2,2,3))))))","v":0},{"$f":"IF(AE:AE=\"pas d'actualité\",3,IF(AE:AE=\"?\",\"?\",IF(AE:AE=\"?\",\"?\",IF(($B$2+4)-AF:AF>=0,0,IF(($B$2+4)-AF:AF>=-1,1,IF(($B$2+4)-AF:AF>=-2,2,3))))))","v":0},null,"Partiellement  compatible"]
["PR213","D213","FAB 213",null,null,null,null,"X",null,null,null,null,null,null,null,null,null,null,null,null,null,null,null,null,null,null,null,null,null,null,"2015-09-30",2015,0,"0",0,0,0,null,null,"ARRET TOTAL FOURNITURE 30/09/2017"]
["PR214","D214","FAB 214",null,null,null,null,"X","X",null,null,null,null,null,null,null,null,null,null,null,null,null,null,null,null,null,null,null,null,null,"2012-09-30",2012,0,"0",0,0,0,null,"Entièrement compatible"]
["PR215","D215","FAB 215",null,1,null,null,null,null,null,null,null,null,null,"X",null,null,null,null,null,null,null,null,null,null,null,null,null,null,null,"2012-09-30",2012,0,"0",0,0,0]
["PR216","D216","FAB 216",null,1,null,null,"X","X",null,null,null,null,null,null,null,null,null,null,null,null,null,null,null,null,null,null,null,null,null,"2015-09-30",2015,0,"0",0,0,0,null,"Entièrement compatible"]
["PR217","D217","FAB 217",null,1,null,null,null,null,null,null,null,null,null,"X",null,null,null,null,null,null,null,null,null,null,null,null,null,null,null,"2012-09-30",2012,0,"0",0,0,0]
["PR218","D218","FAB 218",null,null,null,null,"X",null,null,null,null,null,null,null,null,null,null,null,null,null,null,null,null,null,null,null,null,null,null,"2017-09-30",2017,1,"0",0,0,0,null,"Partiellement compatible","ARRET TOTAL FOURNITURE 30/09/2013"]
["PR219","D219","FAB 219",null,null,null,null,null,"X",null,null,null,null,"X",null,null,null,null,null,null,null,null,null,null,null,null,null,null,null,null,"2017-09-30",2017,1,"0",0,0,0,"SEULEMENT PIECES DETACHEES","Pas de successeur","ARRET TOTAL FOURNITURE 30/09/2019"]
["PR220","D220","FAB 220",null,0,null,null,null,null,null,null,null,null,null,null,null,null,null,null,null,null,null,null,null,null,null,null,null,null,null,"2018-09-30",2018,2,"1",0,0,0,null,null,"Seulement sous pièce détachées ARRET TOTAL FOURNITURE 30/09/2020"]
["PR221","D221","FAB 221",null,2,null,null,null,null,null,"X",null,"X",null,null,null,null,null,null,null,null,null,null,null,null,null,null,null,null,null,"2018-09-30",2018,2,"1",0,0,0,null,"Partiellement compatible","ARRET TOTAL FOURNITURE 30/09/2020"]
["PR222","D222","FAB 222",null,1,null,null,null,null,null,null,null,null,null,null,null,null,null,null,null,null,null,null,null,null,"X",null,null,null,null,"pas d'actualité","pas d'actualité",3,3,3,3,3]
["PR223","D223","FAB 223",null,1,null,null,null,null,null,null,null,null,null,null,null,null,null,null,null,null,null,null,null,null,"X",null,null,null,null,"pas d'actualité","pas d'actualité",3,3,3,3,3]
["PR224","D224","FAB 224",null,null,null,null,null,"X",null,null,null,null,null,null,null,null,null,null,null,null,null,null,null,null,null,null,null,null,null,"pas d'actualité","pas d'actualité",3,3,3,3,3]
["PR225","D225","FAB 225",null,1,null,null,"X","X",null,null,null,null,null,null,null,null,null,null,null,null,null,null,null,null,null,null,null,null,null,"pas d'actualité","pas d'actualité",3,3,3,3,3]
["PR226","D226","FAB 226",null,10,null,null,"X","X",null,null,null,null,null,null,null,null,null,null,null,null,null,null,null,null,null,null,null,null,null,"pas d'actualité","pas d'actualité",3,3,3,3,3]
["PR227","D227","FAB 227",null,5,null,null,"X","X",null,null,null,null,null,null,null,null,null,null,null,null,null,null,null,null,null,null,null,null,null,"pas d'actualité","pas d'actualité",3,3,3,3,3]
["PR228","D228","FAB 228",null,0,null,null,null,null,null,null,null,null,null,null,null,null,null,null,null,null,null,null,null,null,null,null,null,null,null,"pas d'actualité","pas d'actualité",3,3,3,3,3]
["PR229","D229","FAB 229",null,null,null,null,null,null,null,null,null,null,null,null,null,null,null,null,null,null,null,null,null,null,null,null,null,null,null,"pas d'actualité","pas d'actualité",3,3,3,3,3,null,null,"Annonce d'\u0092abandon du produit\n15/11/2013"]
["PR230","D230","FAB 230",null,null,null,null,null,null,null,null,null,null,null,null,null,null,null,null,null,null,null,null,null,null,null,null,null,null,null,"pas d'actualité","pas d'actualité",3,3,3,3,3,null,null,"Annonce d'\u0092abandon du produit\n15/11/2013"]
["PR231","D231","FAB 231",null,null,null,null,null,null,null,null,null,null,null,null,null,null,null,null,null,null,null,null,null,null,null,null,null,null,null,"pas d'actualité","pas d'actualité",3,3,3,3,3,null,null,"Annonce d'\u0092abandon du produit\n15/11/2013"]
["PR232","D232","FAB 232",null,null,null,null,null,null,null,null,null,null,null,null,null,null,null,null,null,null,null,null,null,null,null,null,null,null,null,"pas d'actualité","pas d'actualité",3,3,3,3,3,null,null,"Annonce d'\u0092abandon du produit\n15/11/2013"]
["PR233","D233","FAB 233",null,null,null,null,null,null,null,null,null,null,null,null,null,null,null,null,null,null,null,null,null,null,null,null,null,null,null,"pas d'actualité","pas d'actualité",3,3,3,3,3,null,null,"Annonce d'\u0092abandon du produit\n15/11/2013"]
["PR234","D234","FAB 234",null,null,null,null,null,null,null,null,null,null,null,null,null,null,null,null,null,null,null,null,null,null,null,null,null,null,null,"pas d'actualité","pas d'actualité",3,3,3,3,3,null,null,"Annonce d'\u0092abandon du produit\n15/11/2013"]
["PR235","D235","FAB 235",null,null,null,null,null,null,null,null,null,null,null,null,null,null,null,null,null,null,null,null,null,null,null,null,null,null,null,"pas d'actualité","pas d'actualité",3,3,3,3,3,null,null,"Annonce d'\u0092abandon du produit\n15/11/2013"]
["PR236","D236","FAB 236",null,1,null,null,null,null,null,null,null,null,null,null,null,null,null,null,null,null,null,null,null,null,null,null,"X",null,null,"2022-01-10",2022,3,"3",3,3,2,null,null,"Annonce abandon du produit 01/10/2012\nRéparation et pièces détachées garanties jusq. 01/10/2022"]
["PR237","D237","FAB 237",null,1,null,null,"X","X",null,null,null,null,null,null,null,null,null,null,null,null,null,null,null,null,null,null,null,null,null,"pas d'actualité","pas d'actualité",3,3,3,3,3]
["PR238","D238","FAB 238",null,1,null,null,"X",null,null,null,null,null,null,null,null,null,null,null,null,null,null,null,null,null,null,null,null,null,null,"pas d'actualité","pas d'actualité",3,3,3,3,3]
["PR239","D239","FAB 239",null,1,null,null,"X","X",null,null,null,null,null,null,null,null,null,null,null,null,null,null,null,null,null,null,null,null,null,"pas d'actualité","pas d'actualité",3,3,3,3,3]
["PR240","D240","FAB 240",null,1,null,null,null,null,null,null,null,null,null,null,null,null,null,null,null,null,null,null,null,null,null,null,null,null,null,"pas d'actualité","pas d'actualité",3,3,3,3,3]
["PR241","D241","FAB 241",null,1,null,null,null,null,null,null,null,null,null,null,null,null,null,null,null,null,null,null,null,null,"X",null,null,null,null,"pas d'actualité","pas d'actualité",3,3,3,3,3]
["PR242","D242","FAB 242",null,1,null,null,null,null,null,null,null,null,null,null,null,null,null,null,null,null,null,null,null,null,"X",null,null,null,null,"pas d'actualité","pas d'actualité",3,3,3,3,3]
["PR243","D243","FAB 243",null,1,null,null,null,null,null,null,null,null,null,null,null,null,"X",null,null,null,null,null,null,null,null,null,null,null,null,"pas d'actualité","pas d'actualité",3,3,3,3,3]
["PR244","D244","FAB 244",null,null,null,null,null,null,null,null,null,null,null,null,null,null,null,null,null,null,null,null,null,null,null,null,null,null,null,"2020-01-10",{"$f":"IF(ISNUMBER(AE:AE),YEAR(AE:AE),AE:AE)","v":2020},{"$f":"IF(AE:AE=\"pas d'actualité\",3,IF(AE:AE=\"?\",\"?\",IF(AE:AE=\"?\",\"?\",IF($B$2-AF:AF>=0,0,IF($B$2-AF:AF>=-1,1,IF($B$2-AF:AF>=-2,2,3))))))","v":3},{"$f":"IF(AE:AE=\"pas d'actualité\",3,IF(AE:AE=\"?\",\"?\",IF(AE:AE=\"?\",\"?\",IF((($B$2+1)-AF:AF)>=0,\"0\",IF((($B$2+1)-AF:AF)>=-1,\"1\",IF((($B$2+1)-AF:AF)>=-2,\"2\",\"3\"))))))","v":"3"},{"$f":"IF(AE:AE=\"pas d'actualité\",3,IF(AE:AE=\"?\",\"?\",IF(AE:AE=\"?\",\"?\",IF((($B$2+2)-AF:AF)>=0,0,IF((($B$2+2)-AF:AF)>=-1,1,IF((($B$2+2)-AF:AF)>=-2,2,3))))))","v":2},{"$f":"IF(AE:AE=\"pas d'actualité\",3,IF(AE:AE=\"?\",\"?\",IF(AE:AE=\"?\",\"?\",IF(($B$2+3)-AF:AF>=0,0,IF(($B$2+3)-AF:AF>=-1,1,IF(($B$2+3)-AF:AF>=-2,2,3))))))","v":1},{"$f":"IF(AE:AE=\"pas d'actualité\",3,IF(AE:AE=\"?\",\"?\",IF(AE:AE=\"?\",\"?\",IF(($B$2+4)-AF:AF>=0,0,IF(($B$2+4)-AF:AF>=-1,1,IF(($B$2+4)-AF:AF>=-2,2,3))))))","v":0}]
["PR245","D245","FAB 245",null,null,null,null,null,null,null,null,null,null,null,null,null,null,null,null,null,null,null,null,null,null,null,null,null,null,null,"2020-01-10",2020,3,"3",2,1,0]
["PR246","D246","FAB 246",null,1,null,null,null,null,null,null,null,null,null,null,null,null,"X",null,null,null,null,null,null,null,null,null,null,null,null,"2020-01-10",2020,3,"3",2,1,0,null,null,"réparable"]
["PR247","D247","FAB 247",null,1,null,null,null,null,null,null,null,null,null,null,null,null,"X",null,null,null,null,null,null,null,null,null,null,null,null,"2020-01-10",2020,3,"3",2,1,0]
["PR248","D248","FAB 248",null,1,null,null,null,null,null,null,null,null,null,null,null,null,"X",null,null,null,null,null,null,null,null,null,null,null,null,"2020-01-10",2020,3,"3",2,1,0]
["PR249","D249","FAB 249",null,1,null,null,null,null,null,null,null,null,null,null,null,null,"X",null,null,null,null,null,null,null,null,null,null,null,null,"2020-01-10",2020,3,"3",2,1,0]
["PR250","D250","FAB 250",null,1,null,null,null,null,null,null,null,null,null,null,null,null,null,null,null,null,null,null,null,null,null,null,null,null,null,"2020-01-10",2020,3,"3",2,1,0]
["PR251","D251","FAB 251",null,null,null,null,null,null,null,null,"X",null,null,null,null,null,null,null,null,null,null,null,null,null,null,null,null,null,null,"pas d'actualité","pas d'actualité",3,3,3,3,3]
["PR252","D252","FAB 252",null,null,null,null,null,null,null,null,"X",null,null,null,null,null,null,null,null,null,null,null,null,null,null,null,null,null,null,"pas d'actualité","pas d'actualité",3,3,3,3,3,null,"Partiellement compatible"]
["PR253","D253","FAB 253",null,null,null,null,null,null,null,null,"X",null,null,null,null,null,null,null,null,null,null,null,null,null,null,null,null,null,null,"pas d'actualité","pas d'actualité",3,3,3,3,3,null,"Partiellement compatible"]
["PR254","D254","FAB 254",null,null,null,null,null,null,null,null,"X",null,null,null,null,null,null,null,null,null,null,null,null,null,null,null,null,null,null,"pas d'actualité","pas d'actualité",3,3,3,3,3]
["PR255","D255","FAB 255",null,null,null,null,null,null,null,null,"X",null,null,null,null,null,null,null,null,null,null,null,null,null,null,null,null,null,null,"pas d'actualité","pas d'actualité",3,3,3,3,3]
["PR256","D256","FAB 256",null,null,null,null,null,null,null,null,null,null,null,null,null,null,null,null,null,null,null,null,null,null,null,null,null,null,null,"pas d'actualité","pas d'actualité",3,3,3,3,3]
["PR257","D257","FAB 257",null,null,null,null,null,null,null,null,null,null,null,null,null,null,null,null,null,null,null,null,null,null,null,null,"X",null,null,"pas d'actualité","pas d'actualité",3,3,3,3,3]
["PR258","D258","FAB 258",null,null,null,null,null,null,null,null,null,null,null,null,null,null,null,null,null,null,null,null,null,null,null,null,"X",null,null,"pas d'actualité","pas d'actualité",3,3,3,3,3]
["PR259","D259","FAB 259",null,1,null,null,null,null,null,null,null,null,null,null,null,null,null,null,null,null,null,null,null,null,null,null,"X",null,null,"pas d'actualité","pas d'actualité",3,3,3,3,3]
["PR260","D260","FAB 260",null,1,null,null,null,null,null,null,null,null,null,null,null,null,null,null,null,null,null,null,null,null,null,null,"X",null,null,"pas d'actualité","pas d'actualité",3,3,3,3,3]
["PR261","D261","FAB 261",null,1,null,null,null,null,"X",null,null,null,null,null,null,null,null,null,null,null,null,null,null,null,null,null,null,null,null,"pas d'actualité","pas d'actualité",3,3,3,3,3]
["PR262","D262","FAB 262",null,1,null,null,null,null,null,null,null,null,null,null,null,null,null,null,null,null,null,null,null,null,null,null,null,null,null,"pas d'actualité","pas d'actualité",3,3,3,3,3]
["PR263","D263","FAB 263",null,1,null,null,"X","X",null,"X",null,null,null,null,null,null,null,null,null,null,null,null,null,null,null,null,null,null,null,"pas d'actualité","pas d'actualité",3,3,3,3,3]
["PR264","D264","FAB 264",null,1,null,null,"X","X",null,"X",null,null,null,null,null,null,null,null,null,null,null,null,null,null,null,null,null,null,null,"pas d'actualité","pas d'actualité",3,3,3,3,3]
["PR265","D265","FAB 265",null,1,null,null,"X","X",null,null,null,null,null,null,null,null,null,null,null,null,null,null,null,null,null,null,null,null,null,"pas d'actualité","pas d'actualité",3,3,3,3,3]
["PR266","D266","FAB 266",null,1,null,null,"X","X",null,null,null,null,null,null,null,null,null,null,null,null,null,null,null,null,null,null,null,null,null,"pas d'actualité","pas d'actualité",3,3,3,3,3]
["PR267","D267","FAB 267",null,1,null,null,"X","X","X","X","X",null,null,null,null,null,null,null,null,null,null,null,null,null,"X",null,null,null,null,"pas d'actualité","pas d'actualité",3,3,3,3,3]
["PR268","D268","FAB 268",null,1,null,null,null,null,null,null,null,null,null,null,null,null,null,null,null,null,null,null,null,null,null,null,"X",null,null,"pas d'actualité","pas d'actualité",3,3,3,3,3]
["PR269","D269","FAB 269",null,1,null,null,"X","X",null,null,null,null,null,null,null,null,null,null,null,null,null,null,null,null,null,null,null,null,null,"pas d'actualité","pas d'actualité",3,3,3,3,3]
["PR270","D270","FAB 270",null,null,null,null,null,null,null,null,null,null,null,null,null,null,null,null,null,null,null,null,null,null,null,null,null,null,null,"pas d'actualité","pas d'actualité",3,3,3,3,3]
["PR271","D271","FAB 271",null,1,null,null,"X","X",null,null,null,null,null,null,null,null,null,null,null,null,null,null,null,null,null,null,null,null,null,"2024-09-30",2024,3,"3",3,3,3]
["PR272","D272","FAB 272",null,1,null,null,"X","X",null,null,null,null,null,null,null,null,null,null,null,null,null,null,null,null,null,null,null,null,null,"pas d'actualité","pas d'actualité",3,3,3,3,3]
["PR273","D273","FAB 273",null,null,null,null,null,null,null,null,"X",null,null,null,null,null,null,null,null,null,null,null,null,null,null,null,null,null,null,"pas d'actualité","pas d'actualité",3,3,3,3,3]
["PR274","D274","FAB 274",null,1,null,null,null,null,null,null,null,null,null,null,null,null,null,null,null,null,null,null,null,null,null,null,"X",null,null,"pas d'actualité","pas d'actualité",3,3,3,3,3]
["PR275","D275","FAB 275",null,null,null,null,"X",null,null,null,null,null,null,null,null,null,null,null,null,null,null,null,null,null,null,null,null,null,null,"pas d'actualité","pas d'actualité",3,3,3,3,3,null,null,"Annonce d'\u0092abandon du produit\n01/04/2006"]
["PR276","D276","FAB 276",null,1,null,null,null,null,"X","X","X",null,null,null,null,null,null,null,null,null,null,null,null,null,null,null,null,null,null,"pas d'actualité",{"$f":"IF(ISNUMBER(AE:AE),YEAR(AE:AE),AE:AE)","v":"pas d'actualité"},{"$f":"IF(AE:AE=\"pas d'actualité\",3,IF(AE:AE=\"?\",\"?\",IF(AE:AE=\"?\",\"?\",IF($B$2-AF:AF>=0,0,IF($B$2-AF:AF>=-1,1,IF($B$2-AF:AF>=-2,2,3))))))","v":3},{"$f":"IF(AE:AE=\"pas d'actualité\",3,IF(AE:AE=\"?\",\"?\",IF(AE:AE=\"?\",\"?\",IF((($B$2+1)-AF:AF)>=0,\"0\",IF((($B$2+1)-AF:AF)>=-1,\"1\",IF((($B$2+1)-AF:AF)>=-2,\"2\",\"3\"))))))","v":3},{"$f":"IF(AE:AE=\"pas d'actualité\",3,IF(AE:AE=\"?\",\"?\",IF(AE:AE=\"?\",\"?\",IF((($B$2+2)-AF:AF)>=0,0,IF((($B$2+2)-AF:AF)>=-1,1,IF((($B$2+2)-AF:AF)>=-2,2,3))))))","v":3},{"$f":"IF(AE:AE=\"pas d'actualité\",3,IF(AE:AE=\"?\",\"?\",IF(AE:AE=\"?\",\"?\",IF(($B$2+3)-AF:AF>=0,0,IF(($B$2+3)-AF:AF>=-1,1,IF(($B$2+3)-AF:AF>=-2,2,3))))))","v":3},{"$f":"IF(AE:AE=\"pas d'actualité\",3,IF(AE:AE=\"?\",\"?\",IF(AE:AE=\"?\",\"?\",IF(($B$2+4)-AF:AF>=0,0,IF(($B$2+4)-AF:AF>=-1,1,IF(($B$2+4)-AF:AF>=-2,2,3))))))","v":3}]
["PR277","D277","FAB 277",null,null,null,null,"X",null,null,null,null,null,null,null,null,null,null,null,null,null,null,null,null,null,null,null,null,null,null,"2019-09-30",2019,3,"2",1,0,0,null,"?"]
["PR278","D278","FAB 278",null,null,null,null,"X",null,null,null,null,null,null,null,null,null,null,null,null,null,null,null,null,null,null,null,null,null,null,"2024-09-30",2024,3,"3",3,3,3,null,"Entièrement compatible"]
["PR279","D279","FAB 279",null,null,null,null,null,null,null,null,"X",null,null,null,null,null,null,null,null,null,null,null,null,null,null,null,null,null,null,"pas d'actualité","pas d'actualité",3,3,3,3,3]
["PR280","D280","FAB 280",null,null,null,null,null,null,null,null,"X",null,null,null,null,null,null,null,null,null,null,null,null,null,null,null,null,null,null,"2024-09-30",2024,3,"3",3,3,3]
["PR281","D281","FAB 281",null,null,null,null,"X","X",null,null,null,null,null,null,null,null,null,null,null,null,null,null,null,null,null,null,null,null,null,"2020-09-30",2020,3,"3",2,1,0]
["PR282","D282","FAB 282",null,0,null,null,"X","X",null,null,null,null,null,null,null,null,null,null,null,null,null,null,null,null,null,null,null,null,null,"pas d'actualité","pas d'actualité",3,3,3,3,3]
["PR283","D283","FAB 283",null,null,null,null,null,null,null,null,"X",null,null,null,null,null,null,null,null,null,null,null,null,null,null,null,null,null,null,"pas d'actualité","pas d'actualité",3,3,3,3,3]
["PR284","D284","FAB 284",null,null,null,null,null,null,null,null,"X",null,null,null,null,null,null,null,null,null,null,null,null,null,null,null,null,null,null,"pas d'actualité","pas d'actualité",3,3,3,3,3]
["PR285","D285","FAB 285",null,1,null,null,null,null,null,null,null,null,null,"x",null,null,null,null,null,null,null,null,null,null,"X",null,null,null,null,"2021-09-30",2021,3,"3",3,2,1]
["PR286","D286","FAB 286",null,null,null,null,null,null,null,null,null,null,null,"x",null,null,null,null,null,null,null,null,null,null,"X",null,null,null,null,"2022-09-30",2022,3,"3",3,3,2]
["PR287","D287","FAB 287",null,1,null,null,null,null,null,null,null,null,null,"X",null,null,null,null,null,null,null,null,null,null,null,null,null,null,null,"2022-09-30",2022,3,"3",3,3,2]
["PR288","D288","FAB 288",null,1,null,null,null,null,null,null,null,null,null,null,null,null,"X",null,null,null,null,null,null,null,null,null,null,null,null,"2020-01-10",2020,3,"3",2,1,0]
["PR289","D289","FAB 289",null,1,null,null,null,null,null,null,null,null,null,null,null,null,null,null,null,null,null,null,null,null,null,null,"X",null,null,"2019-01-11",2019,3,"2",1,0,0]
["PR290","D290","FAB 290",null,null,null,null,null,null,null,null,null,null,null,null,null,null,null,null,null,null,null,null,null,null,null,null,"X",null,null,"pas d'actualité","pas d'actualité",3,3,3,3,3]
["PR291","D291","FAB 291",null,null,null,null,null,null,null,null,"X",null,null,null,null,null,null,null,null,null,null,null,null,null,null,null,null,null,null,"pas d'actualité","pas d'actualité",3,3,3,3,3]
["PR292","D292","FAB 292",null,null,null,null,null,null,null,null,"X",null,null,null,null,null,null,null,null,null,null,null,null,null,null,null,null,null,null,"pas d'actualité","pas d'actualité",3,3,3,3,3]
["PR293","D293","FAB 293",null,null,null,null,null,null,null,null,"X",null,null,null,null,null,null,null,null,null,null,null,null,null,null,null,null,null,null,"pas d'actualité","pas d'actualité",3,3,3,3,3]
["PR294","D294","FAB 294",null,null,null,null,null,null,null,null,"X",null,null,null,null,null,null,null,null,null,null,null,null,null,null,null,null,null,null,"pas d'actualité","pas d'actualité",3,3,3,3,3]
["PR295","D295","FAB 295",null,null,null,null,null,null,null,null,"X",null,null,null,null,null,null,null,null,null,null,null,null,null,null,null,null,null,null,"2023-09-30",2023,3,"3",3,3,3,null,"Partiellement compatible"]
["PR296","D296","FAB 296",null,null,null,null,null,null,null,null,"X",null,null,null,null,null,null,null,null,null,null,null,null,null,null,null,null,null,null,"2024-09-30",2024,3,"3",3,3,3,null,"Partiellement compatible"]
["PR297","D297","FAB 297",null,null,null,null,null,null,null,null,"X",null,null,null,null,null,null,null,null,null,null,null,null,null,null,null,null,null,null,"pas d'actualité","pas d'actualité",3,3,3,3,3]
["PR298","D298","FAB 298",null,null,null,null,null,null,null,null,"X",null,null,null,null,null,null,null,null,null,null,null,null,null,null,null,null,null,null,"pas d'actualité","pas d'actualité",3,3,3,3,3]
["PR299","D299","FAB 299",null,null,null,null,null,null,null,null,"X",null,null,null,null,null,null,null,null,null,null,null,null,null,null,null,null,null,null,"pas d'actualité","pas d'actualité",3,3,3,3,3]
["PR300","D300","FAB 300",null,null,null,null,null,null,null,null,"X",null,null,null,null,null,null,null,null,null,null,null,null,null,null,null,null,null,null,"2023-09-30",2023,3,"3",3,3,3,null,"Partiellement compatible"]
["PR301","D301","FAB 301",null,null,null,null,null,null,null,null,"X",null,null,null,null,null,null,null,null,null,null,null,null,null,null,null,null,null,null,"pas d'actualité","pas d'actualité",3,3,3,3,3]
["PR302","D302","FAB 302",null,null,null,null,null,null,null,null,null,null,null,null,null,null,null,null,null,null,null,null,null,null,null,null,null,null,null,"pas d'actualité","pas d'actualité",3,3,3,3,3]
["PR303","D303","FAB 303",null,1,null,null,null,null,null,null,null,null,null,null,null,null,null,null,null,null,null,null,null,null,"X",null,null,null,null,"pas d'actualité","pas d'actualité",3,3,3,3,3,null,null,"produit qui va être intérrompu"]
["PR304","D304","FAB 304",null,1,null,null,null,"X","X","X",null,"X",null,"X",null,null,null,null,null,null,null,null,null,null,null,null,null,null,null,"2024-01-04",2024,3,"3",3,3,3,null,null,"ARRET TOTAL FOURNITURE 31/12/2030"]

{"sheet":"FABRICANT 4","index":6,"n_rows":19,"n_cols":40,"rows_kept":19,"cut":false,"hidden":false,"merged":[[2,0,2,6],[2,7,2,29],[3,0,6,6],[3,7,5,14],[3,15,5,24],[3,25,5,29]]}
["DATE DE REFERENCE","Année en cours","NOMBRE DE REFERENCE SIEMENS"]
["2016-05-17",{"$f":"YEAR(A2)","v":2016},{"$f":"COUNTA(A9:A156)","v":11}]
["DONNEES PIECES",null,null,null,null,null,null,"INSTALLATIONS"]
["OBSOLESCENCE FAB 4                               ",null,null,null,null,null,null,"AT 1",null,null,null,null,null,null,null,"AT 2",null,null,null,null,null,null,null,null,null,"AT 3"]
[]
[]
[]
["Référence","Désignation","Fabricant","Code ","Stock mini recommandé","Stock alerte choisi","Sous-équipement","L1","L2","L3","L4","L5","L6","L7","L8","L9","L10","L11","L12","L13","L14","L15","L16","L17","L18","L19","L20","L21","L22","L23","Date d'abandon \ndéfintif ","Année abandon","Actuelle","1 an","2 ans","3 ans","4 ans","Produit successeur","Informations successeur","Commentaires"]
["PR 350","D351","FAB 351",null,1,null,null,null,null,null,null,null,null,null,null,null,null,null,"X",null,null,null,null,null,null,null,null,null,null,null,"?",{"$f":"IF(ISNUMBER(AE:AE),YEAR(AE:AE),AE:AE)","v":"?"},{"$f":"IF(AE:AE=\"pas d'actualité\",3,IF(AE:AE=\"?\",\"?\",IF(AE:AE=\"?\",\"?\",IF($B$2-AF:AF>=0,0,IF($B$2-AF:AF>=-1,1,IF($B$2-AF:AF>=-2,2,3))))))","v":"?"},{"$f":"IF(AE:AE=\"pas d'actualité\",3,IF(AE:AE=\"?\",\"?\",IF(AE:AE=\"?\",\"?\",IF((($B$2+1)-AF:AF)>=0,\"0\",IF((($B$2+1)-AF:AF)>=-1,\"1\",IF((($B$2+1)-AF:AF)>=-2,\"2\",\"3\"))))))","v":"?"},{"$f":"IF(AE:AE=\"pas d'actualité\",3,IF(AE:AE=\"?\",\"?\",IF(AE:AE=\"?\",\"?\",IF((($B$2+2)-AF:AF)>=0,0,IF((($B$2+2)-AF:AF)>=-1,1,IF((($B$2+2)-AF:AF)>=-2,2,3))))))","v":"?"},{"$f":"IF(AE:AE=\"pas d'actualité\",3,IF(AE:AE=\"?\",\"?\",IF(AE:AE=\"?\",\"?\",IF(($B$2+3)-AF:AF>=0,0,IF(($B$2+3)-AF:AF>=-1,1,IF(($B$2+3)-AF:AF>=-2,2,3))))))","v":"?"},{"$f":"IF(AE:AE=\"pas d'actualité\",3,IF(AE:AE=\"?\",\"?\",IF(AE:AE=\"?\",\"?\",IF(($B$2+4)-AF:AF>=0,0,IF(($B$2+4)-AF:AF>=-1,1,IF(($B$2+4)-AF:AF>=-2,2,3))))))","v":"?"}]
["PR 351","D351","FAB 351",null,1,null,null,"X","X",null,null,"X",null,null,null,null,"X",null,null,null,null,null,null,"X",null,null,null,null,null,null,"?","?","?","?","?","?","?"]
["PR 352","D352","FAB 352",null,1,null,null,null,null,"X",null,null,null,null,null,null,null,null,null,null,"X",null,null,null,null,null,null,null,null,null,"?","?","?","?","?","?","?"]
["PR 353","D353","FAB 353",null,1,null,null,null,null,null,null,null,null,null,null,null,null,null,"X",null,null,"X",null,null,null,null,null,null,null,null,"?","?","?","?","?","?","?"]
["PR 354","D354","FAB 354",null,1,null,null,"X","X",null,null,null,"X",null,null,null,"X","X",null,null,null,null,null,null,null,null,null,null,null,null,"?","?","?","?","?","?","?"]
["PR 355","D355","FAB 355",null,null,null,null,"X",null,null,null,null,null,null,null,null,null,null,null,null,null,"X",null,null,null,null,null,null,null,null,"?","?","?","?","?","?","?"]
["PR 356","D356","FAB 356",null,null,null,null,null,null,null,null,null,null,null,null,null,null,null,null,null,null,null,null,null,"X",null,null,null,null,null,"2008-05-15",2008,0,"0",0,0,0,"6ES5095-8MA05",null,"reparation/pièce de rechange seulement sous garantie"]
["PR 357","D357","FAB 357",null,null,null,null,null,null,null,null,null,"X",null,null,null,"X",null,null,"X",null,null,null,"XX",null,null,null,null,null,null,"2010-01-10",2010,0,"0",0,0,0,"6ES5095-8MA05",null,"Seulement disponible en pièces de rechange"]
["PR 358","D358","FAB 358",null,null,null,null,null,null,null,null,null,null,null,null,null,null,"X",null,null,null,null,null,null,null,null,null,null,null,null,"2008-01-10",2008,0,"0",0,0,0,"SUCCESSOR IS CPU 928B: 6ES5928-3UB21","partiellement"]
["PR 359","D359","FAB 359",null,1,null,null,null,null,null,null,null,null,null,null,null,null,"X",null,null,null,null,null,null,null,null,null,null,null,null,"2010-01-10",2010,0,"0",0,0,0,"6ES5955-3LC41"]
["PR 360","D360","FAB 360",null,1,null,null,null,null,null,null,null,null,null,null,null,null,"X",null,null,null,null,null,null,null,null,null,null,null,null,"2008-01-10",2008,0,"0",0,0,0]

{"sheet":"FABRICANT 5","index":7,"n_rows":19,"n_cols":40,"rows_kept":19,"cut":false,"hidden":false,"merged":[[2,0,2,6],[2,7,2,29],[3,0,6,6],[3,7,5,14],[3,15,5,24],[3,25,5,29]]}
["DATE DE REFERENCE","Année en cours","NOMBRE DE REFERENCE SIEMENS"]
["2016-05-17",{"$f":"YEAR(A2)","v":2016},{"$f":"COUNTA(A9:A156)","v":11}]
["DONNEES PIECES",null,null,null,null,null,null,"INSTALLATIONS"]
["OBSOLESCENCE FAB 5                               ",null,null,null,null,null,null,"AT 1",null,null,null,null,null,null,null,"AT 2",null,null,null,null,null,null,null,null,null,"AT 3"]
[]
[]
[]
["Référence","Désignation","Fabricant","Code ","Stock mini recommandé","Stock alerte choisi","Sous-équipement","L1","L2","L3","L4","L5","L6","L7","L8","L9","L10","L11","L12","L13","L14","L15","L16","L17","L18","L19","L20","L21","L22","L23","Date d'abandon \ndéfintif ","Année abandon","Actuelle","1 an","2 ans","3 ans","4 ans","Produit successeur","Informations successeur","Commentaires"]
["PR 400","D400"," FAB 400",null,4,null,"Générateur Instrumentation Entrées/sorties ",null,null,null,null,null,null,null,null,null,null,null,null,null,null,null,null,null,null,null,null,null,null,"X","2015-12-31",{"$f":"IF(ISNUMBER(AE:AE),YEAR(AE:AE),AE:AE)","v":2015},{"$f":"IF(AE:AE=\"pas d'actualité\",3,IF(AE:AE=\"?\",\"?\",IF(AE:AE=\"?\",\"?\",IF($B$2-AF:AF>=0,0,IF($B$2-AF:AF>=-1,1,IF($B$2-AF:AF>=-2,2,3))))))","v":0},{"$f":"IF(AE:AE=\"pas d'actualité\",3,IF(AE:AE=\"?\",\"?\",IF(AE:AE=\"?\",\"?\",IF((($B$2+1)-AF:AF)>=0,\"0\",IF((($B$2+1)-AF:AF)>=-1,\"1\",IF((($B$2+1)-AF:AF)>=-2,\"2\",\"3\"))))))","v":"0"},{"$f":"IF(AE:AE=\"pas d'actualité\",3,IF(AE:AE=\"?\",\"?\",IF(AE:AE=\"?\",\"?\",IF((($B$2+2)-AF:AF)>=0,0,IF((($B$2+2)-AF:AF)>=-1,1,IF((($B$2+2)-AF:AF)>=-2,2,3))))))","v":0},{"$f":"IF(AE:AE=\"pas d'actualité\",3,IF(AE:AE=\"?\",\"?\",IF(AE:AE=\"?\",\"?\",IF(($B$2+3)-AF:AF>=0,0,IF(($B$2+3)-AF:AF>=-1,1,IF(($B$2+3)-AF:AF>=-2,2,3))))))","v":0},{"$f":"IF(AE:AE=\"pas d'actualité\",3,IF(AE:AE=\"?\",\"?\",IF(AE:AE=\"?\",\"?\",IF(($B$2+4)-AF:AF>=0,0,IF(($B$2+4)-AF:AF>=-1,1,IF(($B$2+4)-AF:AF>=-2,2,3))))))","v":0},"AF100 / S800"]
["PR 401","D401"," FAB 401",null,1,null,null,null,null,null,null,null,null,null,null,null,null,null,null,null,null,null,null,null,null,null,null,null,null,null,"?","?","?","?","?","?","?","DSBC174"]
["PR 402","D402"," FAB 402",null,2,null,null,null,null,null,null,null,null,null,null,null,null,null,null,null,null,null,null,null,null,null,null,null,null,null,"?","?","?","?","?","?","?","DSDI110AV1"]
["PR 403","D403"," FAB 403",null,1,null,null,null,null,null,null,null,null,null,null,null,null,null,null,null,null,null,null,null,null,null,null,null,null,null,"?","?","?","?","?","?","?"]
["PR 404","D404"," FAB 404",null,1,null,null,null,null,null,null,null,null,null,null,null,null,null,null,null,null,null,null,null,null,null,null,null,null,null,"?","?","?","?","?","?","?"]
["PR 405","D405"," FAB 405",null,1,null,null,null,null,null,null,null,null,null,null,null,null,null,null,null,null,null,null,null,null,null,null,null,null,null,"?","?","?","?","?","?","?"]
["PR 406","D406"," FAB 406",null,4,null,"Entrées/sorties ",null,null,null,null,null,null,null,null,null,null,null,null,null,null,null,null,null,null,null,null,null,null,"X","2015-12-31",2015,0,"0",0,0,0,"AF100 / S800"]
["PR 407","D407"," FAB 407",null,1,null,"Entrées/sorties ",null,null,null,null,null,null,null,null,null,null,null,null,null,null,null,null,null,null,null,null,null,null,"X","2015-12-31",2015,0,"0",0,0,0,"AF100 / S800"]
["PR 408","D408"," FAB 408",null,1,null,null,null,null,null,null,null,null,null,null,null,null,null,null,null,null,null,null,null,null,null,null,null,null,null,"?","?","?","?","?","?","?"]
["PR 409","D409"," FAB 409",null,1,null,null,null,null,null,null,null,null,null,null,null,null,null,null,null,null,null,null,null,null,null,null,null,null,null,"2015-12-31",2015,0,"0",0,0,0,"AF100 / S800"]
["PR 410","D410"," FAB 410",null,1,null,null,null,null,null,null,null,null,null,null,null,null,null,null,null,null,null,null,null,null,null,null,null,null,null,"?","?","?","?","?","?","?"]

{"sheet":"FABRICANT 6","index":8,"n_rows":46,"n_cols":40,"rows_kept":46,"cut":false,"hidden":false,"merged":[[2,0,2,6],[2,7,2,29],[3,0,6,6],[3,7,5,14],[3,15,5,24],[3,25,5,29]]}
["DATE DE REFERENCE","Année en cours","NOMBRE DE REFERENCE SIEMENS"]
["2016-05-17",{"$f":"YEAR(A2)","v":2016},{"$f":"COUNTA(A9:A156)","v":38}]
["DONNEES PIECES",null,null,null,null,null,null,"INSTALLATIONS"]
["OBSOLESCENCE FAB 6                              ",null,null,null,null,null,null,"AT 1",null,null,null,null,null,null,null,"AT 2",null,null,null,null,null,null,null,null,null,"AT 3"]
[]
[]
[]
["Référence","Désignation","Fabricant","Code ","Stock mini recommandé","Stock alerte choisi","Sous-équipement","L1","L2","L3","L4","L5","L6","L7","L8","L9","L10","L11","L12","L13","L14","L15","L16","L17","L18","L19","L20","L21","L22","L23","Date d'abandon \ndéfintif ","Année abandon","Actuelle","1 an","2 ans","3 ans","4 ans","Produit successeur","Informations successeur","Commentaires"]
["PR 450","D 450","FAB 450",null,1,null,null,null,null,null,null,null,null,null,null,null,null,null,null,null,null,null,null,null,null,null,null,null,null,"X","?",{"$f":"IF(ISNUMBER(AE:AE),YEAR(AE:AE),AE:AE)","v":"?"},{"$f":"IF(AE:AE=\"pas d'actualité\",3,IF(AE:AE=\"?\",\"?\",IF(AE:AE=\"?\",\"?\",IF($B$2-AF:AF>=0,0,IF($B$2-AF:AF>=-1,1,IF($B$2-AF:AF>=-2,2,3))))))","v":"?"},{"$f":"IF(AE:AE=\"pas d'actualité\",3,IF(AE:AE=\"?\",\"?\",IF(AE:AE=\"?\",\"?\",IF((($B$2+1)-AF:AF)>=0,\"0\",IF((($B$2+1)-AF:AF)>=-1,\"1\",IF((($B$2+1)-AF:AF)>=-2,\"2\",\"3\"))))))","v":"?"},{"$f":"IF(AE:AE=\"pas d'actualité\",3,IF(AE:AE=\"?\",\"?\",IF(AE:AE=\"?\",\"?\",IF((($B$2+2)-AF:AF)>=0,0,IF((($B$2+2)-AF:AF)>=-1,1,IF((($B$2+2)-AF:AF)>=-2,2,3))))))","v":"?"},{"$f":"IF(AE:AE=\"pas d'actualité\",3,IF(AE:AE=\"?\",\"?\",IF(AE:AE=\"?\",\"?\",IF(($B$2+3)-AF:AF>=0,0,IF(($B$2+3)-AF:AF>=-1,1,IF(($B$2+3)-AF:AF>=-2,2,3))))))","v":"?"},{"$f":"IF(AE:AE=\"pas d'actualité\",3,IF(AE:AE=\"?\",\"?\",IF(AE:AE=\"?\",\"?\",IF(($B$2+4)-AF:AF>=0,0,IF(($B$2+4)-AF:AF>=-1,1,IF(($B$2+4)-AF:AF>=-2,2,3))))))","v":"?"}]
["PR 451","D 451","FAB 451",null,1,null,null,null,null,null,null,null,null,null,null,null,null,null,null,null,null,null,null,null,null,null,null,null,null,"X","?","?","?","?","?","?","?"]
["PR 452","D 452","FAB 452",null,1,null,"AC450, AC410",null,null,null,null,null,null,null,null,null,null,null,null,null,null,null,null,null,null,null,null,null,null,null,"?","?","?","?","?","?","?"]
["PR 453","D 453","FAB 453",null,1,null,null,null,null,null,null,null,null,null,null,null,null,null,null,null,null,null,null,null,null,null,null,null,null,null,"?","?","?","?","?","?","?"]
["PR 454","D 454","FAB 454",null,1,null,null,null,null,null,null,null,null,null,null,null,null,null,null,null,null,null,null,null,null,null,null,null,null,null,"?","?","?","?","?","?","?"]
["PR 455","D 455","FAB 455",null,1,null,null,null,null,null,null,null,null,null,null,null,null,null,null,null,null,null,null,null,null,null,null,null,null,"X","?","?","?","?","?","?","?",null,null,"Réparable"]
["PR 456","D 456","FAB 456","X",null,null,null,null,null,null,null,null,null,null,null,null,null,null,null,null,null,null,null,null,null,null,null,null,null,null,"?","?","?","?","?","?","?"]
["PR 457","D 457","FAB 457",null,1,null,null,null,null,null,null,null,null,null,null,null,null,null,null,null,null,null,null,null,null,null,null,null,null,null,"?","?","?","?","?","?","?"]
["PR 458","D 458","FAB 458",null,1,null,null,null,null,null,null,null,null,null,null,null,null,null,null,null,null,null,null,null,null,null,null,null,null,null,"?","?","?","?","?","?","?"]
["PR 459","D 459","FAB 459","X",null,null,null,null,null,null,null,null,null,null,null,null,null,null,null,null,null,null,null,null,null,null,null,null,null,null,"?","?","?","?","?","?","?","PM511V"]
["PR 460","D 460","FAB 460","X",null,null,null,null,null,null,null,null,null,null,null,null,null,null,null,null,null,null,null,null,null,null,null,null,null,null,"?","?","?","?","?","?","?"]
["PR 461","D 461","FAB 461","X",null,null,null,null,null,null,null,null,null,null,null,null,null,null,null,null,null,null,null,null,null,null,null,null,null,null,"?","?","?","?","?","?","?"]
["PR 462","D 462","FAB 462","X",null,null,null,null,null,null,null,null,null,null,null,null,null,null,null,null,null,null,null,null,null,null,null,null,null,null,"2012-01-01",2012,0,"0",0,0,0,null,null,"Date d'abandon pas certaine"]
["PR 463","D 463","FAB 463",null,1,null,null,null,null,null,null,null,null,null,null,"X","X","X","X",null,null,null,null,null,null,null,null,null,null,null,"?","?","?","?","?","?","?"]
["PR 464","D 464","FAB 464","X",null,null,null,null,null,null,null,null,null,null,null,null,null,null,null,null,null,null,null,null,null,null,null,null,null,null,"2015-12-31",2015,0,"0",0,0,0,"PU410",null,"Upgrade obligatoire"]
["PR 465","D 465","FAB 465",null,1,null,null,null,null,null,null,null,null,null,null,null,null,null,null,null,null,null,null,null,null,null,null,null,null,null,"?","?","?","?","?","?","?"]
["PR 466","D 466","FAB 466",null,1,null,null,null,null,null,null,null,null,null,null,null,null,null,null,null,null,null,null,null,null,null,null,null,null,null,"?","?","?","?","?","?","?"]
["PR 467","D 467","FAB 467",null,1,null,null,null,null,null,null,null,null,null,null,null,null,null,null,null,null,null,null,null,null,null,null,null,null,null,"?","?","?","?","?","?","?","SA168"]
["PR 468","D 468","FAB 468",null,1,null,null,null,null,null,null,null,null,null,null,null,null,null,null,null,null,null,null,null,null,null,null,null,null,null,"?","?","?","?","?","?","?"]
["PR 469","D 469","FAB 469",null,null,null,null,null,null,null,null,null,null,null,null,null,null,null,null,null,null,null,null,null,null,null,null,null,null,null,"?","?","?","?","?","?","?"]
["PR 470","D 470","FAB 470",null,1,null,null,null,null,null,null,null,null,null,null,null,null,null,null,null,null,null,null,null,null,null,null,null,null,null,"?","?","?","?","?","?","?"]
["PR 471","D 471","FAB 471",null,1,null,"Alimentation ",null,null,null,null,null,null,null,null,null,null,null,null,null,null,null,null,null,null,null,null,null,null,null,"?","?","?","?","?","?","?","SD831"]
["PR 472","D 472","FAB 472",null,2,null,null,null,null,null,null,null,null,null,null,null,null,null,null,null,null,null,null,null,null,null,null,null,null,null,"?","?","?","?","?","?","?","SD832"]
["PR 473","D 473","FAB 473",null,2,null,null,null,null,null,null,null,null,null,null,null,null,null,null,null,null,null,null,null,null,null,null,null,null,null,"?","?","?","?","?","?","?"]
["PR 474","D 474","FAB 474",null,2,null,null,null,null,null,null,null,null,null,null,null,null,null,null,null,null,null,null,null,null,null,null,null,null,null,"?","?","?","?","?","?","?"]
["PR 475","D 475","FAB 475",null,1,null,null,null,null,null,null,null,null,null,null,null,null,null,null,null,null,null,null,null,null,null,null,null,null,null,"?","?","?","?","?","?","?"]
["PR 476","D 476","FAB 476",null,1,null,"ALIMENTATION ",null,null,null,null,null,null,null,null,null,null,null,null,null,null,null,null,null,null,null,null,null,null,null,"?","?","?","?","?","?","?","SS832"]
["PR 477","D 477","FAB 477",null,1,null,"ALIMENTATION ",null,null,null,null,null,null,null,null,null,null,null,null,null,null,null,null,null,null,null,null,null,null,null,"?","?","?","?","?","?","?"]
["PR 478","D 478","FAB 478",null,1,null,null,null,null,null,null,null,null,null,null,null,null,null,null,null,null,null,null,null,null,null,null,null,null,null,"?","?","?","?","?","?","?"]
["PR 479","D 479","FAB 479",null,1,null,null,null,null,null,null,null,null,null,null,null,null,null,null,null,null,null,null,null,null,null,null,null,null,null,"?","?","?","?","?","?","?"]
["PR 480","D 480","FAB 480",null,1,null,null,null,null,null,null,null,null,null,null,null,null,null,null,null,null,null,null,null,null,null,null,null,null,null,"?","?","?","?","?","?","?"]
["PR 481","D 481","FAB 481",null,1,null,null,null,null,null,null,null,null,null,null,null,null,null,null,null,null,null,null,null,null,null,null,null,null,null,"?","?","?","?","?","?","?"]
["PR 482","D 482","FAB 482","X",null,null,null,null,null,null,null,null,null,null,null,null,null,null,null,null,null,null,null,null,null,null,null,null,null,null,"?","?","?","?","?","?","?"]
["PR 483","D 483","FAB 483",null,1,null,null,null,null,null,null,null,null,null,null,null,null,null,null,null,null,null,null,null,null,null,null,null,null,null,"?","?","?","?","?","?","?"]
["PR 484","D 484","FAB 484",null,1,null,null,null,null,null,null,null,null,null,null,null,null,null,null,null,null,null,null,null,null,null,null,null,null,null,"?","?","?","?","?","?","?"]
["PR 485","D 485","FAB 485",null,1,null,null,null,null,null,null,null,null,null,null,null,null,null,null,null,null,null,null,null,null,null,null,null,null,null,"?","?","?","?","?","?","?"]
["PR 486","D 486","FAB 486",null,1,null,null,null,null,null,null,null,null,null,null,null,null,null,null,null,null,null,null,null,null,null,null,null,null,null,"?","?","?","?","?","?","?"]
["PR 487","D 487","FAB 487",null,1,null,null,null,null,null,null,null,null,null,null,null,null,null,null,null,null,null,null,null,null,null,null,null,null,null,"?","?","?","?","?","?","?"]

{"sheet":"LEXIQUE 1","index":9,"n_rows":0,"n_cols":0,"rows_kept":0,"cut":false,"hidden":false,"merged":[]}

{"sheet":"LEXIQUE 2","index":10,"n_rows":0,"n_cols":0,"rows_kept":0,"cut":false,"hidden":false,"merged":[]}

{"sheet":"LEXIQUE 3","index":11,"n_rows":0,"n_cols":0,"rows_kept":0,"cut":false,"hidden":false,"merged":[]}