{"text_format":"1","workbook":"xlsx","n_sheets":10,"sheets":["Synthèse","à corriger","Résumé","Ps-Pi","Rodney simple","Musique","Turfomania.fr","Temp","Temp2","Feuil2"],"not_rendered":{"charts":0,"images":1,"macros":1,"external_links":0,"defined_names":24,"comments":0,"pivot_tables":0},"unopened":[],"bounds":{"document_bytes":16777216,"sheet_cells":100000,"rows_first":2000,"rows_last":500,"rows_between":2000,"halvings":0,"cell_chars":16384,"cell_head_chars":4096},"cells_cut":0,"cells_raw":0,"read":"whole","date_system":"1900"}

{"sheet":"Synthèse","index":0,"n_rows":125,"n_cols":75,"rows_kept":125,"cut":false,"hidden":false,"merged":[[25,16,25,17],[25,18,25,20],[7,52,7,53],[8,52,8,53],[9,52,9,53],[10,52,10,53],[123,2,123,3],[124,2,124,3],[0,69,0,73],[22,16,22,17],[3,52,3,54],[1,52,1,54],[2,52,2,54],[11,52,11,53],[12,52,12,53],[13,52,13,53],[0,35,0,37],[118,2,118,3],[119,2,119,3],[120,2,120,3],[121,2,121,3],[122,2,122,3]]}
[null,null,null,null,null,null,null,null,null,null,"N°","P1","P2","P3","P4","P5","P6","PK","Px","LS","SF","BIN","Total","vB%","b%","N°","RH","RgRH","FHC","IdBF","FHC","Priorité","> 4","NbC","N°","Vgap",null,null,"GapForm","Ch R","MW","DC","avDC","avavDC","PW2","BO","N°","Cote / 1","% cote",null,null,null,null,null,null,null,"Manque","N°",1,2,3,4,5,0,null,null,null,null,null,"Correspondances FHC",null,null,null,null,"GapForm"]
["Bin",0,1,2,3,4,5,null,{"$f":"IF(L2=\"\",\"\",IF(AND(COUNTIF(L2:Q2,1)=0,COUNT(L2:Q2)<6),1,0))","v":0},null,{"$f":"IF(Musique!D2<>\"\",Musique!A2,\"\")","v":1},{"$f":"IF(Musique!F2=\"\",\"\",Musique!F2)","v":4},{"$f":"IF(Musique!G2=\"\",\"\",Musique!G2)","v":0},{"$f":"IF(Musique!H2=\"\",\"\",Musique!H2)","v":4},{"$f":"IF(Musique!I2=\"\",\"\",Musique!I2)","v":0},{"$f":"IF(Musique!J2=\"\",\"\",Musique!J2)","v":4},{"$f":"IF(Musique!K2=\"\",\"\",Musique!K2)","v":2},{"$f":"IF(L2=\"\",\"\",IF(I2=1,COUNT(L2:Q2)+1,IFERROR(MATCH(1,L2:Q2,0)-1,6)))","v":6},{"$f":"IF(R2<>\"\",IF(R2<6,\"Pi\",\"Ps\"),\"\")","v":"Ps"},{"$f":"IF(Musique!D2=\"\",\"\",100+COUNTIF(B26:G26,\"<7\")*7-SUMIF(B26:G26,\"<7\"))","v":114},{"$f":"IF(Musique!D2<>\"\",I49,\"\")","v":3},{"$f":"IF(L2<>\"\",SUMPRODUCT((COUNTIF(L2:Q2,{0,1,2,3,4,5})=0)*{10,1,2,3,4,5}),\"\")","v":9},{"$f":"IF(Musique!D2<>\"\",SUM(T2:V2),\"\")","v":126},{"$f":"IF(L2<>\"\",1-SUMPRODUCT((COUNTIF(L2:Q2,{1,2,3,4,5,0})=0)*{10,5,4,3,2,1})/26,\"\")","v":0.38461538461538458},{"$f":"IF(L2<>\"\",1-SUMPRODUCT((COUNTIF(L2:Q2,{1,2,3,4,5,0})=0)*{1,2,3,4,5,10})/26,\"\")","v":0.65384615384615385},{"$f":"K2","v":1},{"$f":"IF(L2=\"\",\"\",IF(R2=6,(H26*10)+AS2,(H26*10)+I26))","v":40},{"$f":"IF(S2<>\"\",COUNTIFS(Px,S2)-COUNTIFS(Px,S2,$AA$2:$AA$21,\"<=\"&AA2)+COUNTIFS($S$2:S2,S2,$AA$2:AA2,AA2),\"\")","v":1},{"$f":"IFERROR(BM2,\"\")","v":"ODE_3"},{"$f":"IF(BF2<>\"\",COUNTIF($AC$2:$AC$21,AC2),\"\")","v":3},{"$f":"IFERROR(BN2,\"\")","v":"OUTSIDER DÉGRADÉ"},{"$f":"IF(K2=\"\",\"\",IF(BO2=0,\"\",BO2))","v":""},{"$f":"IF(Musique!D2=\"\",\"\",COUNTIF(L2:Q2,\">4\")+COUNTIF(L2:Q2,\"=0\"))","v":2},{"$f":"Musique!R2","v":6},{"$f":"K2","v":1},{"$f":"IF(K2<>\"\",(COUNTIF(L2:Q2,\">4\")+COUNTIF(L2:Q2,\"=0\")&Musique!R2),\"\")","v":"26"},{"$f":"IF(K2<>\"\",VALUE(AJ2),\"\")","v":26},{"$f":"IF(AI2<>\"\",INDEX($B$119:$C$125,MATCH(VALUE(AG2),$B$119:$B$125,0),2),\"\")","v":"Très bon_3"},{"$f":"IF(K2=\"\",\"\",IF(BP2=0,\"\",BP2))","v":102},{"$f":"IF(COUNTIF($R$2:$R$21,R2)=1,K2,\"\")","v":""},{"$f":"IF(K2=\"\",\"\",SUM(B97:G97)-AVERAGE(B97:G97))","v":28.333333333333332},{"$f":"IF(L2=1,9,IF(L2=2,6,IF(L2=3,3,\"\")))","v":""},{"$f":"IF(M2=1,6,IF(M2=2,4,IF(M2=3,2,\"\")))","v":""},{"$f":"IF(N2=1,3,IF(N2=2,2,IF(N2=3,1,\"\")))","v":""},{"$f":"SUM(AP2:AR2)","v":0},{"$f":"IF(K2=\"\",\"\",IF(COUNTIF(L2:Q2,\"<4\")-COUNTIF(L2:Q2,\"=0\")>=4,\"FAV\",\"OUT\"))","v":"OUT"},{"$f":"K2","v":1},null,{"$f":"IF(AV2<>\"\",1/(AV2+1),\"\")","v":""},null,null,"DC",{"$f":"BA8 & IF(BA8<>\"\",\".\" & BA9,BA9) & IF(BA9<>\"\",\".\" & BA10,BA10) & IF(BA10<>\"\",\".\" & BA11,BA11) & IF(BA11<>\"\",\".\" & BA12,BA12) & IF(BA12<>\"\",\".\" & BA13,BA13) & IF(BA13<>\"\",\".\" & BA14,BA14)","v":"66666.2.111.0"},null,null,null,{"$f":"BG2&BH2&BI2&BJ2&BK2&BL2","v":"135"},{"$f":"K2","v":1},{"$f":"IF(BF2<>\"\",IF(C3=0,1,\"\"),\"\")","v":1},{"$f":"IF(BF2<>\"\",IF(D3=0,2,\"\"),\"\")","v":""},{"$f":"IF(BF2<>\"\",IF(E3=0,3,\"\"),\"\")","v":3},{"$f":"IF(BF2<>\"\",IF(F3=0,4,\"\"),\"\")","v":""},{"$f":"IF(BF2<>\"\",IF(G3=0,5,\"\"),\"\")","v":5},{"$f":"IF(BF2<>\"\",IF(B3=0,0,\"\"),\"\")","v":""},{"$f":"IF(BF2<>\"\",INDEX($BR$2:$BV$64,MATCH(VALUE(BE2),$BR$2:$BR$64,0),3),\"\")","v":"ODE_3"},{"$f":"IF(BF2<>\"\",INDEX($BR$2:$BV$64,MATCH(VALUE(BE2),$BR$2:$BR$64,0),4),\"\")","v":"OUTSIDER DÉGRADÉ"},{"$f":"IF(BF2<>\"\",INDEX($BR$2:$BV$64,MATCH(VALUE(BE2),$BR$2:$BR$64,0),5),\"\")","v":0},{"$f":"IF(BF2<>\"\",INDEX($BR$2:$BW$64,MATCH(VALUE(BE2),$BR$2:$BR$64,0),6),\"\")","v":102},null,0,"0","FBS","CAS SPÉCIAL","CAS SPÉCIAL",17]
[1,{"$f":"IF(Musique!D2<>\"\",COUNTIF(L2:Q2,$B$2),\"\")","v":2},{"$f":"IF(Musique!D2<>\"\",COUNTIF(L2:Q2,$C$2),\"\")","v":0},{"$f":"IF(Musique!D2<>\"\",COUNTIF(L2:Q2,$D$2),\"\")","v":1},{"$f":"IF(Musique!D2<>\"\",COUNTIF(L2:Q2,$E$2),\"\")","v":0},{"$f":"IF(Musique!D2<>\"\",COUNTIF(L2:Q2,$F$2),\"\")","v":3},{"$f":"IF(Musique!D2<>\"\",COUNTIF(L2:Q2,$G$2),\"\")","v":0},null,{"$f":"IF(L3=\"\",\"\",IF(AND(COUNTIF(L3:Q3,1)=0,COUNT(L3:Q3)<6),1,0))","v":0},null,{"$f":"IF(Musique!D3<>\"\",Musique!A3,\"\")","v":2},{"$f":"IF(Musique!F3=\"\",\"\",Musique!F3)","v":0},{"$f":"IF(Musique!G3=\"\",\"\",Musique!G3)","v":1},{"$f":"IF(Musique!H3=\"\",\"\",Musique!H3)","v":9},{"$f":"IF(Musique!I3=\"\",\"\",Musique!I3)","v":7},{"$f":"IF(Musique!J3=\"\",\"\",Musique!J3)","v":3},{"$f":"IF(Musique!K3=\"\",\"\",Musique!K3)","v":3},{"$f":"IF(L3=\"\",\"\",IF(I3=1,COUNT(L3:Q3)+1,IFERROR(MATCH(1,L3:Q3,0)-1,6)))","v":1},"Pi",{"$f":"IF(Musique!D3=\"\",\"\",100+COUNTIF(B27:G27,\"<7\")*7-SUMIF(B27:G27,\"<7\"))","v":114},{"$f":"IF(Musique!D3<>\"\",I50,\"\")","v":7},{"$f":"IF(L3<>\"\",SUMPRODUCT((COUNTIF(L3:Q3,{0,1,2,3,4,5})=0)*{10,1,2,3,4,5}),\"\")","v":11},{"$f":"IF(Musique!D3<>\"\",SUM(T3:V3),\"\")","v":132},{"$f":"IF(L3<>\"\",1-SUMPRODUCT((COUNTIF(L3:Q3,{1,2,3,4,5,0})=0)*{10,5,4,3,2,1})/26,\"\")","v":0.61538461538461542},{"$f":"IF(L3<>\"\",1-SUMPRODUCT((COUNTIF(L3:Q3,{1,2,3,4,5,0})=0)*{1,2,3,4,5,10})/26,\"\")","v":0.57692307692307687},2,{"$f":"IF(L3=\"\",\"\",IF(R3=6,(H27*10)+AS3,(H27*10)+I27))","v":31},{"$f":"IF(S3<>\"\",COUNTIFS(Px,S3)-COUNTIFS(Px,S3,$AA$2:$AA$21,\"<=\"&AA3)+COUNTIFS($S$2:S3,S3,$AA$2:AA3,AA3),\"\")","v":2},{"$f":"IFERROR(BM3,\"\")","v":"FOF_2"},2,{"$f":"IFERROR(BN3,\"\")","v":"FAVORI SUR OUT OF FORM"},"MÉDIUM",{"$f":"IF(Musique!D3=\"\",\"\",COUNTIF(L3:Q3,\">4\")+COUNTIF(L3:Q3,\"=0\"))","v":3},{"$f":"Musique!R3","v":6},2,{"$f":"IF(K3<>\"\",(COUNTIF(L3:Q3,\">4\")+COUNTIF(L3:Q3,\"=0\")&Musique!R3),\"\")","v":"36"},36,"Semi-tocard_1",{"$f":"IF(K3=\"\",\"\",IF(BP3=0,\"\",BP3))","v":153},"",27.5,"",6,"",{"$f":"SUM(AP3:AR3)","v":6},"OUT",2,null,{"$f":"IF(AV3<>\"\",1/(AV3+1),\"\")","v":""},null,null,"Pi",{"$f":"IF($S$2=\"Pi\",$K$2 & \" - \",\"\") & IF($S$3=\"Pi\",$K$3 & \" - \",\"\") & IF($S$4=\"Pi\",$K$4 & \" - \",\"\") & IF($S$5=\"Pi\",$K$5 & \" - \",\"\") & IF($S$6=\"Pi\",$K$6 & \" - \",\"\") & IF($S$7=\"Pi\",$K$7 & \" - \",\"\") & IF($S$8=\"Pi\",$K$8 & \" - \",\"\") & IF($S$9=\"Pi\",$K$9 & \" - \",\"\") & IF($S$10=\"Pi\",$K$10 & \" - \",\"\") & IF($S$11=\"Pi\",$K$11 & \" - \",\"\") & IF($S$12=\"Pi\",$K$12 & \" - \",\"\") & IF($S$13=\"Pi\",$K$13 & \" - \",\"\") & IF($S$14=\"Pi\",$K$14 & \" - \",\"\") & IF($S$15=\"Pi\",$K$15 & \" - \",\"\") & IF($S$16=\"Pi\",$K$16 & \" - \",\"\") & IF($S$17=\"Pi\",$K$17 & \" - \",\"\") & IF($S$18=\"Pi\",$K$18 & \" - \",\"\") & IF($S$19=\"Pi\",$K$19 & \" - \",\"\") & IF($S$20=\"Pi\",$K$20 & \" - \",\"\") & IF($S$21=\"Pi\",$K$21 & \" - \",\"\")","v":"2 - 5 - 7 - 8 - 9 - "},null,null,null,{"$f":"BG3&BH3&BI3&BJ3&BK3&BL3","v":"245"},2,"",2,"",4,5,"","FOF_2","FAVORI SUR OUT OF FORM","MÉDIUM",{"$f":"IF(BF3<>\"\",INDEX($BR$2:$BW$64,MATCH(VALUE(BE3),$BR$2:$BR$64,0),6),\"\")","v":153},null,1,"1","OFB_2","OUTSIDER FAVORIS","BANQUIER",31]
[2,{"$f":"IF(Musique!D3<>\"\",COUNTIF(L3:Q3,$B$2),\"\")","v":1},{"$f":"IF(Musique!D3<>\"\",COUNTIF(L3:Q3,$C$2),\"\")","v":1},{"$f":"IF(Musique!D3<>\"\",COUNTIF(L3:Q3,$D$2),\"\")","v":0},{"$f":"IF(Musique!D3<>\"\",COUNTIF(L3:Q3,$E$2),\"\")","v":2},{"$f":"IF(Musique!D3<>\"\",COUNTIF(L3:Q3,$F$2),\"\")","v":0},{"$f":"IF(Musique!D3<>\"\",COUNTIF(L3:Q3,$G$2),\"\")","v":0},null,0,null,{"$f":"IF(Musique!D4<>\"\",Musique!A4,\"\")","v":3},{"$f":"IF(Musique!F4=\"\",\"\",Musique!F4)","v":7},{"$f":"IF(Musique!G4=\"\",\"\",Musique!G4)","v":5},{"$f":"IF(Musique!H4=\"\",\"\",Musique!H4)","v":0},{"$f":"IF(Musique!I4=\"\",\"\",Musique!I4)","v":3},{"$f":"IF(Musique!J4=\"\",\"\",Musique!J4)","v":6},{"$f":"IF(Musique!K4=\"\",\"\",Musique!K4)","v":4},6,"Ps",{"$f":"IF(Musique!D4=\"\",\"\",100+COUNTIF(B28:G28,\"<7\")*7-SUMIF(B28:G28,\"<7\"))","v":110},{"$f":"IF(Musique!D4<>\"\",I51,\"\")","v":0},{"$f":"IF(L4<>\"\",SUMPRODUCT((COUNTIF(L4:Q4,{0,1,2,3,4,5})=0)*{10,1,2,3,4,5}),\"\")","v":3},{"$f":"IF(Musique!D4<>\"\",SUM(T4:V4),\"\")","v":113},{"$f":"IF(L4<>\"\",1-SUMPRODUCT((COUNTIF(L4:Q4,{1,2,3,4,5,0})=0)*{10,5,4,3,2,1})/26,\"\")","v":0.42307692307692313},{"$f":"IF(L4<>\"\",1-SUMPRODUCT((COUNTIF(L4:Q4,{1,2,3,4,5,0})=0)*{1,2,3,4,5,10})/26,\"\")","v":0.88461538461538458},3,{"$f":"IF(L4=\"\",\"\",IF(R4=6,(H28*10)+AS4,(H28*10)+I28))","v":30},{"$f":"IF(S4<>\"\",COUNTIFS(Px,S4)-COUNTIFS(Px,S4,$AA$2:$AA$21,\"<=\"&AA4)+COUNTIFS($S$2:S4,S4,$AA$2:AA4,AA4),\"\")","v":4},"OFV",1,"OUTSIDERS FAVORIS","MÉDIUM",{"$f":"IF(Musique!D4=\"\",\"\",COUNTIF(L4:Q4,\">4\")+COUNTIF(L4:Q4,\"=0\"))","v":4},{"$f":"Musique!R4","v":6},3,{"$f":"IF(K4<>\"\",(COUNTIF(L4:Q4,\">4\")+COUNTIF(L4:Q4,\"=0\")&Musique!R4),\"\")","v":"46"},46,"Semi-tocard_2",58,"",29.166666666666668,"","","",0,"OUT",3,null,"",null,null,"Ps",{"$f":"IF($S$2=\"Ps\",$K$2 & \" - \",\"\") & IF($S$3=\"Ps\",$K$3 & \" - \",\"\") & IF($S$4=\"Ps\",$K$4 & \" - \",\"\") & IF($S$5=\"Ps\",$K$5 & \" - \",\"\") & IF($S$6=\"Ps\",$K$6 & \" - \",\"\") & IF($S$7=\"Ps\",$K$7 & \" - \",\"\") & IF($S$8=\"Ps\",$K$8 & \" - \",\"\") & IF($S$9=\"Ps\",$K$9 & \" - \",\"\") & IF($S$10=\"Ps\",$K$10 & \" - \",\"\") & IF($S$11=\"Ps\",$K$11 & \" - \",\"\") & IF($S$12=\"Ps\",$K$12 & \" - \",\"\") & IF($S$13=\"Ps\",$K$13 & \" - \",\"\") & IF($S$14=\"Ps\",$K$14 & \" - \",\"\") & IF($S$15=\"Ps\",$K$15 & \" - \",\"\") & IF($S$16=\"Ps\",$K$16 & \" - \",\"\") & IF($S$17=\"Ps\",$K$17 & \" - \",\"\") & IF($S$18=\"Ps\",$K$18 & \" - \",\"\") & IF($S$19=\"Ps\",$K$19 & \" - \",\"\") & IF($S$20=\"Ps\",$K$20 & \" - \",\"\") & IF($S$21=\"Ps\",$K$21 & \" - \",\"\")","v":"1 - 3 - 4 - 6 - 10 - "},null,null,null,"12",3,1,2,"","","","","OFV","OUTSIDERS FAVORIS","MÉDIUM",58,null,2,"2","FOF_1","FAVORI SUR OUT OF FORM","MINORANT",23]
[3,{"$f":"IF(Musique!D4<>\"\",COUNTIF(L4:Q4,$B$2),\"\")","v":1},{"$f":"IF(Musique!D4<>\"\",COUNTIF(L4:Q4,$C$2),\"\")","v":0},{"$f":"IF(Musique!D4<>\"\",COUNTIF(L4:Q4,$D$2),\"\")","v":0},{"$f":"IF(Musique!D4<>\"\",COUNTIF(L4:Q4,$E$2),\"\")","v":1},{"$f":"IF(Musique!D4<>\"\",COUNTIF(L4:Q4,$F$2),\"\")","v":1},{"$f":"IF(Musique!D4<>\"\",COUNTIF(L4:Q4,$G$2),\"\")","v":1},null,0,null,{"$f":"IF(Musique!D5<>\"\",Musique!A5,\"\")","v":4},{"$f":"IF(Musique!F5=\"\",\"\",Musique!F5)","v":3},{"$f":"IF(Musique!G5=\"\",\"\",Musique!G5)","v":2},{"$f":"IF(Musique!H5=\"\",\"\",Musique!H5)","v":0},{"$f":"IF(Musique!I5=\"\",\"\",Musique!I5)","v":2},{"$f":"IF(Musique!J5=\"\",\"\",Musique!J5)","v":0},{"$f":"IF(Musique!K5=\"\",\"\",Musique!K5)","v":6},6,"Ps",{"$f":"IF(Musique!D5=\"\",\"\",100+COUNTIF(B29:G29,\"<7\")*7-SUMIF(B29:G29,\"<7\"))","v":115},{"$f":"IF(Musique!D5<>\"\",I52,\"\")","v":7},{"$f":"IF(L5<>\"\",SUMPRODUCT((COUNTIF(L5:Q5,{0,1,2,3,4,5})=0)*{10,1,2,3,4,5}),\"\")","v":10},{"$f":"IF(Musique!D5<>\"\",SUM(T5:V5),\"\")","v":132},{"$f":"IF(L5<>\"\",1-SUMPRODUCT((COUNTIF(L5:Q5,{1,2,3,4,5,0})=0)*{10,5,4,3,2,1})/26,\"\")","v":0.42307692307692313},{"$f":"IF(L5<>\"\",1-SUMPRODUCT((COUNTIF(L5:Q5,{1,2,3,4,5,0})=0)*{1,2,3,4,5,10})/26,\"\")","v":0.61538461538461542},4,37,{"$f":"IF(S5<>\"\",COUNTIFS(Px,S5)-COUNTIFS(Px,S5,$AA$2:$AA$21,\"<=\"&AA5)+COUNTIFS($S$2:S5,S5,$AA$2:AA5,AA5),\"\")","v":2},"ODE_3",3,"OUTSIDER DÉGRADÉ","",{"$f":"IF(Musique!D5=\"\",\"\",COUNTIF(L5:Q5,\">4\")+COUNTIF(L5:Q5,\"=0\"))","v":3},{"$f":"Musique!R5","v":6},4,{"$f":"IF(K5<>\"\",(COUNTIF(L5:Q5,\">4\")+COUNTIF(L5:Q5,\"=0\")&Musique!R5),\"\")","v":"36"},36,"Semi-tocard_1",143,"",27.5,3,4,"",7,"OUT",4,null,"",null,null,"Nbre Pi",{"$f":"COUNTIF(S2:S21,\"Pi\")","v":5},null,null,null,"145",4,1,"","",4,5,"","ODE_3","OUTSIDER DÉGRADÉ",0,143,null,3,"3","FAV","FAVORI","AUTRE",22]
[4,{"$f":"IF(Musique!D5<>\"\",COUNTIF(L5:Q5,$B$2),\"\")","v":2},{"$f":"IF(Musique!D5<>\"\",COUNTIF(L5:Q5,$C$2),\"\")","v":0},{"$f":"IF(Musique!D5<>\"\",COUNTIF(L5:Q5,$D$2),\"\")","v":2},{"$f":"IF(Musique!D5<>\"\",COUNTIF(L5:Q5,$E$2),\"\")","v":1},{"$f":"IF(Musique!D5<>\"\",COUNTIF(L5:Q5,$F$2),\"\")","v":0},{"$f":"IF(Musique!D5<>\"\",COUNTIF(L5:Q5,$G$2),\"\")","v":0},null,0,null,{"$f":"IF(Musique!D6<>\"\",Musique!A6,\"\")","v":5},{"$f":"IF(Musique!F6=\"\",\"\",Musique!F6)","v":1},{"$f":"IF(Musique!G6=\"\",\"\",Musique!G6)","v":0},{"$f":"IF(Musique!H6=\"\",\"\",Musique!H6)","v":7},{"$f":"IF(Musique!I6=\"\",\"\",Musique!I6)","v":0},{"$f":"IF(Musique!J6=\"\",\"\",Musique!J6)","v":7},{"$f":"IF(Musique!K6=\"\",\"\",Musique!K6)","v":1},0,"Pi",{"$f":"IF(Musique!D6=\"\",\"\",100+COUNTIF(B30:G30,\"<7\")*7-SUMIF(B30:G30,\"<7\"))","v":112},{"$f":"IF(Musique!D6<>\"\",I53,\"\")","v":7},{"$f":"IF(L6<>\"\",SUMPRODUCT((COUNTIF(L6:Q6,{0,1,2,3,4,5})=0)*{10,1,2,3,4,5}),\"\")","v":14},{"$f":"IF(Musique!D6<>\"\",SUM(T6:V6),\"\")","v":133},{"$f":"IF(L6<>\"\",1-SUMPRODUCT((COUNTIF(L6:Q6,{1,2,3,4,5,0})=0)*{10,5,4,3,2,1})/26,\"\")","v":0.46153846153846156},{"$f":"IF(L6<>\"\",1-SUMPRODUCT((COUNTIF(L6:Q6,{1,2,3,4,5,0})=0)*{1,2,3,4,5,10})/26,\"\")","v":0.46153846153846156},5,22,{"$f":"IF(S6<>\"\",COUNTIFS(Px,S6)-COUNTIFS(Px,S6,$AA$2:$AA$21,\"<=\"&AA6)+COUNTIFS($S$2:S6,S6,$AA$2:AA6,AA6),\"\")","v":4},"FGO_2",1,"FAVORI GROS OUTSIDERS","MÉDIUM",{"$f":"IF(Musique!D6=\"\",\"\",COUNTIF(L6:Q6,\">4\")+COUNTIF(L6:Q6,\"=0\"))","v":4},{"$f":"Musique!R6","v":6},5,{"$f":"IF(K6<>\"\",(COUNTIF(L6:Q6,\">4\")+COUNTIF(L6:Q6,\"=0\")&Musique!R6),\"\")","v":"46"},46,"Semi-tocard_2",224,5,30,9,"","",9,"OUT",5,null,"",null,null,"Nbre Ps",{"$f":"COUNTIF(S2:S21,\"Ps\")","v":5},null,null,null,"2345",5,"",2,3,4,5,"","FGO_2","FAVORI GROS OUTSIDERS","MÉDIUM",224,null,4,"4","FAV","FAVORI","AUTRE",35]
[5,{"$f":"IF(Musique!D6<>\"\",COUNTIF(L6:Q6,$B$2),\"\")","v":2},{"$f":"IF(Musique!D6<>\"\",COUNTIF(L6:Q6,$C$2),\"\")","v":2},{"$f":"IF(Musique!D6<>\"\",COUNTIF(L6:Q6,$D$2),\"\")","v":0},{"$f":"IF(Musique!D6<>\"\",COUNTIF(L6:Q6,$E$2),\"\")","v":0},{"$f":"IF(Musique!D6<>\"\",COUNTIF(L6:Q6,$F$2),\"\")","v":0},{"$f":"IF(Musique!D6<>\"\",COUNTIF(L6:Q6,$G$2),\"\")","v":0},null,0,null,{"$f":"IF(Musique!D7<>\"\",Musique!A7,\"\")","v":6},{"$f":"IF(Musique!F7=\"\",\"\",Musique!F7)","v":2},{"$f":"IF(Musique!G7=\"\",\"\",Musique!G7)","v":0},{"$f":"IF(Musique!H7=\"\",\"\",Musique!H7)","v":6},{"$f":"IF(Musique!I7=\"\",\"\",Musique!I7)","v":0},{"$f":"IF(Musique!J7=\"\",\"\",Musique!J7)","v":7},{"$f":"IF(Musique!K7=\"\",\"\",Musique!K7)","v":9},6,"Ps",{"$f":"IF(Musique!D7=\"\",\"\",100+COUNTIF(B31:G31,\"<7\")*7-SUMIF(B31:G31,\"<7\"))","v":106},{"$f":"IF(Musique!D7<>\"\",I54,\"\")","v":5},{"$f":"IF(L7<>\"\",SUMPRODUCT((COUNTIF(L7:Q7,{0,1,2,3,4,5})=0)*{10,1,2,3,4,5}),\"\")","v":13},{"$f":"IF(Musique!D7<>\"\",SUM(T7:V7),\"\")","v":124},{"$f":"IF(L7<>\"\",1-SUMPRODUCT((COUNTIF(L7:Q7,{1,2,3,4,5,0})=0)*{10,5,4,3,2,1})/26,\"\")","v":0.26923076923076927},{"$f":"IF(L7<>\"\",1-SUMPRODUCT((COUNTIF(L7:Q7,{1,2,3,4,5,0})=0)*{1,2,3,4,5,10})/26,\"\")","v":0.5},6,16,{"$f":"IF(S7<>\"\",COUNTIFS(Px,S7)-COUNTIFS(Px,S7,$AA$2:$AA$21,\"<=\"&AA7)+COUNTIFS($S$2:S7,S7,$AA$2:AA7,AA7),\"\")","v":5},"ODE_1",1,"OUTSIDER DÉGRADÉ","AUTRE",{"$f":"IF(Musique!D7=\"\",\"\",COUNTIF(L7:Q7,\">4\")+COUNTIF(L7:Q7,\"=0\"))","v":5},{"$f":"Musique!R7","v":6},6,{"$f":"IF(K7<>\"\",(COUNTIF(L7:Q7,\">4\")+COUNTIF(L7:Q7,\"=0\")&Musique!R7),\"\")","v":"56"},56,"Tocard_1",151,"",36.666666666666664,6,"","",6,"OUT",6,null,"",null,null,null,null,null,"Chevaux",null,"1345",6,1,"",3,4,5,"","ODE_1","OUTSIDER DÉGRADÉ","AUTRE",151,null,5,"5","FAV","FAVORI","AUTRE",44]
[6,{"$f":"IF(Musique!D7<>\"\",COUNTIF(L7:Q7,$B$2),\"\")","v":2},{"$f":"IF(Musique!D7<>\"\",COUNTIF(L7:Q7,$C$2),\"\")","v":0},{"$f":"IF(Musique!D7<>\"\",COUNTIF(L7:Q7,$D$2),\"\")","v":1},{"$f":"IF(Musique!D7<>\"\",COUNTIF(L7:Q7,$E$2),\"\")","v":0},{"$f":"IF(Musique!D7<>\"\",COUNTIF(L7:Q7,$F$2),\"\")","v":0},{"$f":"IF(Musique!D7<>\"\",COUNTIF(L7:Q7,$G$2),\"\")","v":0},null,0,null,{"$f":"IF(Musique!D8<>\"\",Musique!A8,\"\")","v":7},{"$f":"IF(Musique!F8=\"\",\"\",Musique!F8)","v":0},{"$f":"IF(Musique!G8=\"\",\"\",Musique!G8)","v":1},{"$f":"IF(Musique!H8=\"\",\"\",Musique!H8)","v":0},{"$f":"IF(Musique!I8=\"\",\"\",Musique!I8)","v":3},{"$f":"IF(Musique!J8=\"\",\"\",Musique!J8)","v":0},{"$f":"IF(Musique!K8=\"\",\"\",Musique!K8)","v":6},1,"Pi",{"$f":"IF(Musique!D8=\"\",\"\",100+COUNTIF(B32:G32,\"<7\")*7-SUMIF(B32:G32,\"<7\"))","v":111},{"$f":"IF(Musique!D8<>\"\",I55,\"\")","v":7},{"$f":"IF(L8<>\"\",SUMPRODUCT((COUNTIF(L8:Q8,{0,1,2,3,4,5})=0)*{10,1,2,3,4,5}),\"\")","v":11},{"$f":"IF(Musique!D8<>\"\",SUM(T8:V8),\"\")","v":129},{"$f":"IF(L8<>\"\",1-SUMPRODUCT((COUNTIF(L8:Q8,{1,2,3,4,5,0})=0)*{10,5,4,3,2,1})/26,\"\")","v":0.61538461538461542},{"$f":"IF(L8<>\"\",1-SUMPRODUCT((COUNTIF(L8:Q8,{1,2,3,4,5,0})=0)*{1,2,3,4,5,10})/26,\"\")","v":0.57692307692307687},7,21,{"$f":"IF(S8<>\"\",COUNTIFS(Px,S8)-COUNTIFS(Px,S8,$AA$2:$AA$21,\"<=\"&AA8)+COUNTIFS($S$2:S8,S8,$AA$2:AA8,AA8),\"\")","v":5},"FOF_2",2,"FAVORI SUR OUT OF FORM","MÉDIUM",{"$f":"IF(Musique!D8=\"\",\"\",COUNTIF(L8:Q8,\">4\")+COUNTIF(L8:Q8,\"=0\"))","v":4},{"$f":"Musique!R8","v":6},7,{"$f":"IF(K8<>\"\",(COUNTIF(L8:Q8,\">4\")+COUNTIF(L8:Q8,\"=0\")&Musique!R8),\"\")","v":"46"},46,"Semi-tocard_2",153,"",33.333333333333336,"",6,"",6,"OUT",7,null,"",null,"PK6",{"$f":"COUNTIF($R$2:$R$21,6)","v":5},{"$f":"IF($R$2=6,\"6\",\"\") & IF($R$3=6,\"6\",\"\") & IF($R$4=6,\"6\",\"\") & IF($R$5=6,\"6\",\"\") & IF($R$6=6,\"6\",\"\") & IF($R$7=6,\"6\",\"\") & IF($R$8=6,\"6\",\"\") & IF($R$9=6,\"6\",\"\") & IF($R$10=6,\"6\",\"\") & IF($R$11=6,\"6\",\"\") & IF($R$12=6,\"6\",\"\") & IF($R$13=6,\"6\",\"\") & IF($R$14=6,\"6\",\"\") & IF($R$15=6,\"6\",\"\") & IF($R$16=6,\"6\",\"\") & IF($R$17=6,\"6\",\"\") & IF($R$18=6,\"6\",\"\") & IF($R$19=6,\"6\",\"\") & IF($R$20=6,\"6\",\"\") & IF($R$21=6,\"6\",\"\")","v":"66666"},null,{"$f":"IF($R$2=6,$K$2 & \"-\",\"\") & IF($R$3=6,$K$3 & \"-\",\"\") & IF($R$4=6,$K$4 & \"-\",\"\") & IF($R$5=6,$K$5 & \"-\",\"\") & IF($R$6=6,$K$6 & \"-\",\"\") & IF($R$7=6,$K$7 & \"-\",\"\") & IF($R$8=6,$K$8 & \"-\",\"\") & IF($R$9=6,$K$9 & \"-\",\"\") & IF($R$10=6,$K$10 & \"-\",\"\") & IF($R$11=6,$K$11 & \"-\",\"\") & IF($R$12=6,$K$12 & \"-\",\"\") & IF($R$13=6,$K$13 & \"-\",\"\") & IF($R$14=6,$K$14 & \"-\",\"\") & IF($R$15=6,$K$15 & \"-\",\"\") & IF($R$16=6,$K$16 & \"-\",\"\") & IF($R$17=6,$K$17 & \"-\",\"\") & IF($R$18=6,$K$18 & \"-\",\"\") & IF($R$19=6,$K$19 & \"-\",\"\") & IF($R$20=6,$K$20 & \"-\",\"\") & IF($R$21=6,$K$21 & \"-\",\"\")","v":"1-3-4-6-10-"},null,"245",7,"",2,"",4,5,"","FOF_2","FAVORI SUR OUT OF FORM","MÉDIUM",153,null,10,"0 1","OFV","OUTSIDERS FAVORIS",null,40]
[7,{"$f":"IF(Musique!D8<>\"\",COUNTIF(L8:Q8,$B$2),\"\")","v":3},{"$f":"IF(Musique!D8<>\"\",COUNTIF(L8:Q8,$C$2),\"\")","v":1},{"$f":"IF(Musique!D8<>\"\",COUNTIF(L8:Q8,$D$2),\"\")","v":0},{"$f":"IF(Musique!D8<>\"\",COUNTIF(L8:Q8,$E$2),\"\")","v":1},{"$f":"IF(Musique!D8<>\"\",COUNTIF(L8:Q8,$F$2),\"\")","v":0},{"$f":"IF(Musique!D8<>\"\",COUNTIF(L8:Q8,$G$2),\"\")","v":0},null,0,null,{"$f":"IF(Musique!D9<>\"\",Musique!A9,\"\")","v":8},{"$f":"IF(Musique!F9=\"\",\"\",Musique!F9)","v":0},{"$f":"IF(Musique!G9=\"\",\"\",Musique!G9)","v":0},{"$f":"IF(Musique!H9=\"\",\"\",Musique!H9)","v":1},{"$f":"IF(Musique!I9=\"\",\"\",Musique!I9)","v":2},{"$f":"IF(Musique!J9=\"\",\"\",Musique!J9)","v":0},{"$f":"IF(Musique!K9=\"\",\"\",Musique!K9)","v":4},2,"Pi",{"$f":"IF(Musique!D9=\"\",\"\",100+COUNTIF(B33:G33,\"<7\")*7-SUMIF(B33:G33,\"<7\"))","v":114},{"$f":"IF(Musique!D9<>\"\",I56,\"\")","v":0},{"$f":"IF(L9<>\"\",SUMPRODUCT((COUNTIF(L9:Q9,{0,1,2,3,4,5})=0)*{10,1,2,3,4,5}),\"\")","v":8},{"$f":"IF(Musique!D9<>\"\",SUM(T9:V9),\"\")","v":122},{"$f":"IF(L9<>\"\",1-SUMPRODUCT((COUNTIF(L9:Q9,{1,2,3,4,5,0})=0)*{10,5,4,3,2,1})/26,\"\")","v":0.76923076923076916},{"$f":"IF(L9<>\"\",1-SUMPRODUCT((COUNTIF(L9:Q9,{1,2,3,4,5,0})=0)*{1,2,3,4,5,10})/26,\"\")","v":0.69230769230769229},8,31,{"$f":"IF(S9<>\"\",COUNTIFS(Px,S9)-COUNTIFS(Px,S9,$AA$2:$AA$21,\"<=\"&AA9)+COUNTIFS($S$2:S9,S9,$AA$2:AA9,AA9),\"\")","v":3},"FAV",2,"FAVORI","AUTRE",{"$f":"IF(Musique!D9=\"\",\"\",COUNTIF(L9:Q9,\">4\")+COUNTIF(L9:Q9,\"=0\"))","v":3},{"$f":"Musique!R9","v":6},8,{"$f":"IF(K9<>\"\",(COUNTIF(L9:Q9,\">4\")+COUNTIF(L9:Q9,\"=0\")&Musique!R9),\"\")","v":"36"},36,"Semi-tocard_1",135,8,30.833333333333332,"","",3,3,"OUT",8,null,"",null,"PK5",{"$f":"COUNTIF($R$2:$R$21,5)","v":0},{"$f":"IF($R$2=5,\"5\",\"\") & IF($R$3=5,\"5\",\"\") & IF($R$4=5,\"5\",\"\") & IF($R$5=5,\"5\",\"\") & IF($R$6=5,\"5\",\"\") & IF($R$7=5,\"5\",\"\") & IF($R$8=5,\"5\",\"\") & IF($R$9=5,\"5\",\"\") & IF($R$10=5,\"5\",\"\") & IF($R$11=5,\"5\",\"\") & IF($R$12=5,\"5\",\"\") & IF($R$13=5,\"5\",\"\") & IF($R$14=5,\"5\",\"\") & IF($R$15=5,\"5\",\"\") & IF($R$16=5,\"5\",\"\") & IF($R$17=5,\"5\",\"\") & IF($R$18=5,\"5\",\"\") & IF($R$19=5,\"5\",\"\") & IF($R$20=5,\"5\",\"\") & IF($R$21=5,\"5\",\"\")","v":""},null,{"$f":"IF($R$2=5,$K$2 & \"-\",\"\") & IF($R$3=5,$K$3 & \"-\",\"\") & IF($R$4=5,$K$4 & \"-\",\"\") & IF($R$5=5,$K$5 & \"-\",\"\") & IF($R$6=5,$K$6 & \"-\",\"\") & IF($R$7=5,$K$7 & \"-\",\"\") & IF($R$8=5,$K$8 & \"-\",\"\") & IF($R$9=5,$K$9 & \"-\",\"\") & IF($R$10=5,$K$10 & \"-\",\"\") & IF($R$11=5,$K$11 & \"-\",\"\") & IF($R$12=5,$K$12 & \"-\",\"\") & IF($R$13=5,$K$13 & \"-\",\"\") & IF($R$14=5,$K$14 & \"-\",\"\") & IF($R$15=5,$K$15 & \"-\",\"\") & IF($R$16=5,$K$16 & \"-\",\"\") & IF($R$17=5,$K$17 & \"-\",\"\") & IF($R$18=5,$K$18 & \"-\",\"\") & IF($R$19=5,$K$19 & \"-\",\"\") & IF($R$20=5,$K$20 & \"-\",\"\") & IF($R$21=5,$K$21 & \"-\",\"\")","v":""},null,"35",8,"","",3,"",5,"","FAV","FAVORI","AUTRE",135,null,12,"1 2","OFV","OUTSIDERS FAVORIS","MÉDIUM",58]
[8,{"$f":"IF(Musique!D9<>\"\",COUNTIF(L9:Q9,$B$2),\"\")","v":3},{"$f":"IF(Musique!D9<>\"\",COUNTIF(L9:Q9,$C$2),\"\")","v":1},{"$f":"IF(Musique!D9<>\"\",COUNTIF(L9:Q9,$D$2),\"\")","v":1},{"$f":"IF(Musique!D9<>\"\",COUNTIF(L9:Q9,$E$2),\"\")","v":0},{"$f":"IF(Musique!D9<>\"\",COUNTIF(L9:Q9,$F$2),\"\")","v":1},{"$f":"IF(Musique!D9<>\"\",COUNTIF(L9:Q9,$G$2),\"\")","v":0},null,0,null,{"$f":"IF(Musique!D10<>\"\",Musique!A10,\"\")","v":9},{"$f":"IF(Musique!F10=\"\",\"\",Musique!F10)","v":2},{"$f":"IF(Musique!G10=\"\",\"\",Musique!G10)","v":1},{"$f":"IF(Musique!H10=\"\",\"\",Musique!H10)","v":0},{"$f":"IF(Musique!I10=\"\",\"\",Musique!I10)","v":0},{"$f":"IF(Musique!J10=\"\",\"\",Musique!J10)","v":3},{"$f":"IF(Musique!K10=\"\",\"\",Musique!K10)","v":1},1,"Pi",{"$f":"IF(Musique!D10=\"\",\"\",100+COUNTIF(B34:G34,\"<7\")*7-SUMIF(B34:G34,\"<7\"))","v":121},{"$f":"IF(Musique!D10<>\"\",I57,\"\")","v":9},{"$f":"IF(L10<>\"\",SUMPRODUCT((COUNTIF(L10:Q10,{0,1,2,3,4,5})=0)*{10,1,2,3,4,5}),\"\")","v":9},{"$f":"IF(Musique!D10<>\"\",SUM(T10:V10),\"\")","v":139},{"$f":"IF(L10<>\"\",1-SUMPRODUCT((COUNTIF(L10:Q10,{1,2,3,4,5,0})=0)*{10,5,4,3,2,1})/26,\"\")","v":0.80769230769230771},{"$f":"IF(L10<>\"\",1-SUMPRODUCT((COUNTIF(L10:Q10,{1,2,3,4,5,0})=0)*{1,2,3,4,5,10})/26,\"\")","v":0.65384615384615385},9,42,{"$f":"IF(S10<>\"\",COUNTIFS(Px,S10)-COUNTIFS(Px,S10,$AA$2:$AA$21,\"<=\"&AA10)+COUNTIFS($S$2:S10,S10,$AA$2:AA10,AA10),\"\")","v":1},"FAV",2,"AUTRE","AUTRE",{"$f":"IF(Musique!D10=\"\",\"\",COUNTIF(L10:Q10,\">4\")+COUNTIF(L10:Q10,\"=0\"))","v":2},{"$f":"Musique!R10","v":6},9,{"$f":"IF(K10<>\"\",(COUNTIF(L10:Q10,\">4\")+COUNTIF(L10:Q10,\"=0\")&Musique!R10),\"\")","v":"26"},26,"Très bon_3",122,"",22.5,6,6,"",12,"FAV",9,null,"",null,"PK4",{"$f":"COUNTIF($R$2:$R$21,4)","v":0},{"$f":"IF($R$2=4,\"4\",\"\") & IF($R$3=4,\"4\",\"\") & IF($R$4=4,\"4\",\"\") & IF($R$5=4,\"4\",\"\") & IF($R$6=4,\"4\",\"\") & IF($R$7=4,\"4\",\"\") & IF($R$8=4,\"4\",\"\") & IF($R$9=4,\"4\",\"\") & IF($R$10=4,\"4\",\"\") & IF($R$11=4,\"4\",\"\") & IF($R$12=4,\"4\",\"\") & IF($R$13=4,\"4\",\"\") & IF($R$14=4,\"4\",\"\") & IF($R$15=4,\"4\",\"\") & IF($R$16=4,\"4\",\"\") & IF($R$17=4,\"4\",\"\") & IF($R$18=4,\"4\",\"\") & IF($R$19=4,\"4\",\"\") & IF($R$20=4,\"4\",\"\") & IF($R$21=4,\"4\",\"\")","v":""},null,{"$f":"IF($R$2=4,$K$2 & \"-\",\"\") & IF($R$3=4,$K$3 & \"-\",\"\") & IF($R$4=4,$K$4 & \"-\",\"\") & IF($R$5=4,$K$5 & \"-\",\"\") & IF($R$6=4,$K$6 & \"-\",\"\") & IF($R$7=4,$K$7 & \"-\",\"\") & IF($R$8=4,$K$8 & \"-\",\"\") & IF($R$9=4,$K$9 & \"-\",\"\") & IF($R$10=4,$K$10 & \"-\",\"\") & IF($R$11=4,$K$11 & \"-\",\"\") & IF($R$12=4,$K$12 & \"-\",\"\") & IF($R$13=4,$K$13 & \"-\",\"\") & IF($R$14=4,$K$14 & \"-\",\"\") & IF($R$15=4,$K$15 & \"-\",\"\") & IF($R$16=4,$K$16 & \"-\",\"\") & IF($R$17=4,$K$17 & \"-\",\"\") & IF($R$18=4,$K$18 & \"-\",\"\") & IF($R$19=4,$K$19 & \"-\",\"\") & IF($R$20=4,$K$20 & \"-\",\"\") & IF($R$21=4,$K$21 & \"-\",\"\")","v":""},null,"45",9,"","","",4,5,"","FAV","AUTRE","AUTRE",122,null,13,"1 3","OFV","OUTSIDERS FAVORIS",null,53]
[9,{"$f":"IF(Musique!D10<>\"\",COUNTIF(L10:Q10,$B$2),\"\")","v":2},{"$f":"IF(Musique!D10<>\"\",COUNTIF(L10:Q10,$C$2),\"\")","v":2},{"$f":"IF(Musique!D10<>\"\",COUNTIF(L10:Q10,$D$2),\"\")","v":1},{"$f":"IF(Musique!D10<>\"\",COUNTIF(L10:Q10,$E$2),\"\")","v":1},{"$f":"IF(Musique!D10<>\"\",COUNTIF(L10:Q10,$F$2),\"\")","v":0},{"$f":"IF(Musique!D10<>\"\",COUNTIF(L10:Q10,$G$2),\"\")","v":0},null,0,null,{"$f":"IF(Musique!D11<>\"\",Musique!A11,\"\")","v":10},{"$f":"IF(Musique!F11=\"\",\"\",Musique!F11)","v":4},{"$f":"IF(Musique!G11=\"\",\"\",Musique!G11)","v":3},{"$f":"IF(Musique!H11=\"\",\"\",Musique!H11)","v":6},{"$f":"IF(Musique!I11=\"\",\"\",Musique!I11)","v":0},{"$f":"IF(Musique!J11=\"\",\"\",Musique!J11)","v":4},{"$f":"IF(Musique!K11=\"\",\"\",Musique!K11)","v":8},6,"Ps",{"$f":"IF(Musique!D11=\"\",\"\",100+COUNTIF(B35:G35,\"<7\")*7-SUMIF(B35:G35,\"<7\"))","v":111},{"$f":"IF(Musique!D11<>\"\",I58,\"\")","v":5},{"$f":"IF(L11<>\"\",SUMPRODUCT((COUNTIF(L11:Q11,{0,1,2,3,4,5})=0)*{10,1,2,3,4,5}),\"\")","v":8},{"$f":"IF(Musique!D11<>\"\",SUM(T11:V11),\"\")","v":124},{"$f":"IF(L11<>\"\",1-SUMPRODUCT((COUNTIF(L11:Q11,{1,2,3,4,5,0})=0)*{10,5,4,3,2,1})/26,\"\")","v":0.34615384615384615},{"$f":"IF(L11<>\"\",1-SUMPRODUCT((COUNTIF(L11:Q11,{1,2,3,4,5,0})=0)*{1,2,3,4,5,10})/26,\"\")","v":0.69230769230769229},10,32,{"$f":"IF(S11<>\"\",COUNTIFS(Px,S11)-COUNTIFS(Px,S11,$AA$2:$AA$21,\"<=\"&AA11)+COUNTIFS($S$2:S11,S11,$AA$2:AA11,AA11),\"\")","v":3},"ODE_3",3,"OUTSIDER DÉGRADÉ","",{"$f":"IF(Musique!D11=\"\",\"\",COUNTIF(L11:Q11,\">4\")+COUNTIF(L11:Q11,\"=0\"))","v":3},{"$f":"Musique!R11","v":6},10,{"$f":"IF(K11<>\"\",(COUNTIF(L11:Q11,\">4\")+COUNTIF(L11:Q11,\"=0\")&Musique!R11),\"\")","v":"36"},36,"Semi-tocard_1",112,"",29.166666666666668,"",2,"",2,"OUT",10,null,"",null,"PK3",{"$f":"COUNTIF($R$2:$R$21,3)","v":0},{"$f":"IF($R$2=3,\"3\",\"\") & IF($R$3=3,\"3\",\"\") & IF($R$4=3,\"3\",\"\") & IF($R$5=3,\"3\",\"\") & IF($R$6=3,\"3\",\"\") & IF($R$7=3,\"3\",\"\") & IF($R$8=3,\"3\",\"\") & IF($R$9=3,\"3\",\"\") & IF($R$10=3,\"3\",\"\") & IF($R$11=3,\"3\",\"\") & IF($R$12=3,\"3\",\"\") & IF($R$13=3,\"3\",\"\") & IF($R$14=3,\"3\",\"\") & IF($R$15=3,\"3\",\"\") & IF($R$16=3,\"3\",\"\") & IF($R$17=3,\"3\",\"\") & IF($R$18=3,\"3\",\"\") & IF($R$19=3,\"3\",\"\") & IF($R$20=3,\"3\",\"\") & IF($R$21=3,\"3\",\"\")","v":""},null,{"$f":"IF($R$2=3,$K$2 & \"-\",\"\") & IF($R$3=3,$K$3 & \"-\",\"\") & IF($R$4=3,$K$4 & \"-\",\"\") & IF($R$5=3,$K$5 & \"-\",\"\") & IF($R$6=3,$K$6 & \"-\",\"\") & IF($R$7=3,$K$7 & \"-\",\"\") & IF($R$8=3,$K$8 & \"-\",\"\") & IF($R$9=3,$K$9 & \"-\",\"\") & IF($R$10=3,$K$10 & \"-\",\"\") & IF($R$11=3,$K$11 & \"-\",\"\") & IF($R$12=3,$K$12 & \"-\",\"\") & IF($R$13=3,$K$13 & \"-\",\"\") & IF($R$14=3,$K$14 & \"-\",\"\") & IF($R$15=3,$K$15 & \"-\",\"\") & IF($R$16=3,$K$16 & \"-\",\"\") & IF($R$17=3,$K$17 & \"-\",\"\") & IF($R$18=3,$K$18 & \"-\",\"\") & IF($R$19=3,$K$19 & \"-\",\"\") & IF($R$20=3,$K$20 & \"-\",\"\") & IF($R$21=3,$K$21 & \"-\",\"\")","v":""},null,"125",10,1,2,"","",5,"","ODE_3","OUTSIDER DÉGRADÉ",0,112,null,14,"1 4","OFV","OUTSIDERS FAVORIS","AUTRE",84]
[10,{"$f":"IF(Musique!D11<>\"\",COUNTIF(L11:Q11,$B$2),\"\")","v":1},{"$f":"IF(Musique!D11<>\"\",COUNTIF(L11:Q11,$C$2),\"\")","v":0},{"$f":"IF(Musique!D11<>\"\",COUNTIF(L11:Q11,$D$2),\"\")","v":0},{"$f":"IF(Musique!D11<>\"\",COUNTIF(L11:Q11,$E$2),\"\")","v":1},{"$f":"IF(Musique!D11<>\"\",COUNTIF(L11:Q11,$F$2),\"\")","v":2},{"$f":"IF(Musique!D11<>\"\",COUNTIF(L11:Q11,$G$2),\"\")","v":0},null,"",null,{"$f":"IF(Musique!D12<>\"\",Musique!A12,\"\")","v":""},{"$f":"IF(Musique!F12=\"\",\"\",Musique!F12)","v":""},{"$f":"IF(Musique!G12=\"\",\"\",Musique!G12)","v":""},{"$f":"IF(Musique!H12=\"\",\"\",Musique!H12)","v":""},{"$f":"IF(Musique!I12=\"\",\"\",Musique!I12)","v":""},{"$f":"IF(Musique!J12=\"\",\"\",Musique!J12)","v":""},{"$f":"IF(Musique!K12=\"\",\"\",Musique!K12)","v":""},"","",{"$f":"IF(Musique!D12=\"\",\"\",100+COUNTIF(B36:G36,\"<7\")*7-SUMIF(B36:G36,\"<7\"))","v":""},{"$f":"IF(Musique!D12<>\"\",I59,\"\")","v":""},{"$f":"IF(L12<>\"\",SUMPRODUCT((COUNTIF(L12:Q12,{0,1,2,3,4,5})=0)*{10,1,2,3,4,5}),\"\")","v":""},{"$f":"IF(Musique!D12<>\"\",SUM(T12:V12),\"\")","v":""},{"$f":"IF(L12<>\"\",1-SUMPRODUCT((COUNTIF(L12:Q12,{1,2,3,4,5,0})=0)*{10,5,4,3,2,1})/26,\"\")","v":""},{"$f":"IF(L12<>\"\",1-SUMPRODUCT((COUNTIF(L12:Q12,{1,2,3,4,5,0})=0)*{1,2,3,4,5,10})/26,\"\")","v":""},"","",{"$f":"IF(S12<>\"\",COUNTIFS(Px,S12)-COUNTIFS(Px,S12,$AA$2:$AA$21,\"<=\"&AA12)+COUNTIFS($S$2:S12,S12,$AA$2:AA12,AA12),\"\")","v":""},"","","","",{"$f":"IF(Musique!D12=\"\",\"\",COUNTIF(L12:Q12,\">4\")+COUNTIF(L12:Q12,\"=0\"))","v":""},{"$f":"Musique!R12","v":""},"",{"$f":"IF(K12<>\"\",(COUNTIF(L12:Q12,\">4\")+COUNTIF(L12:Q12,\"=0\")&Musique!R12),\"\")","v":""},"","","","","","","","",0,"","",null,"",null,"PK2",{"$f":"COUNTIF($R$2:$R$21,2)","v":1},{"$f":"IF($R$2=2,\"2\",\"\") & IF($R$3=2,\"2\",\"\") & IF($R$4=2,\"2\",\"\") & IF($R$5=2,\"2\",\"\") & IF($R$6=2,\"2\",\"\") & IF($R$7=2,\"2\",\"\") & IF($R$8=2,\"2\",\"\") & IF($R$9=2,\"2\",\"\") & IF($R$10=2,\"2\",\"\") & IF($R$11=2,\"2\",\"\") & IF($R$12=2,\"2\",\"\") & IF($R$13=2,\"2\",\"\") & IF($R$14=2,\"2\",\"\") & IF($R$15=2,\"2\",\"\") & IF($R$16=2,\"2\",\"\") & IF($R$17=2,\"2\",\"\") & IF($R$18=2,\"2\",\"\") & IF($R$19=2,\"2\",\"\") & IF($R$20=2,\"2\",\"\") & IF($R$21=2,\"2\",\"\")","v":"2"},null,{"$f":"IF($R$2=2,$K$2 & \"-\",\"\") & IF($R$3=2,$K$3 & \"-\",\"\") & IF($R$4=2,$K$4 & \"-\",\"\") & IF($R$5=2,$K$5 & \"-\",\"\") & IF($R$6=2,$K$6 & \"-\",\"\") & IF($R$7=2,$K$7 & \"-\",\"\") & IF($R$8=2,$K$8 & \"-\",\"\") & IF($R$9=2,$K$9 & \"-\",\"\") & IF($R$10=2,$K$10 & \"-\",\"\") & IF($R$11=2,$K$11 & \"-\",\"\") & IF($R$12=2,$K$12 & \"-\",\"\") & IF($R$13=2,$K$13 & \"-\",\"\") & IF($R$14=2,$K$14 & \"-\",\"\") & IF($R$15=2,$K$15 & \"-\",\"\") & IF($R$16=2,$K$16 & \"-\",\"\") & IF($R$17=2,$K$17 & \"-\",\"\") & IF($R$18=2,$K$18 & \"-\",\"\") & IF($R$19=2,$K$19 & \"-\",\"\") & IF($R$20=2,$K$20 & \"-\",\"\") & IF($R$21=2,$K$21 & \"-\",\"\")","v":"8-"},null,"","","","","","","","","","","","",null,15,"1 5","OFV","OUTSIDERS FAVORIS",null,98]
[11,{"$f":"IF(Musique!D12<>\"\",COUNTIF(L12:Q12,$B$2),\"\")","v":""},{"$f":"IF(Musique!D12<>\"\",COUNTIF(L12:Q12,$C$2),\"\")","v":""},{"$f":"IF(Musique!D12<>\"\",COUNTIF(L12:Q12,$D$2),\"\")","v":""},{"$f":"IF(Musique!D12<>\"\",COUNTIF(L12:Q12,$E$2),\"\")","v":""},{"$f":"IF(Musique!D12<>\"\",COUNTIF(L12:Q12,$F$2),\"\")","v":""},{"$f":"IF(Musique!D12<>\"\",COUNTIF(L12:Q12,$G$2),\"\")","v":""},null,"",null,{"$f":"IF(Musique!D13<>\"\",Musique!A13,\"\")","v":""},{"$f":"IF(Musique!F13=\"\",\"\",Musique!F13)","v":""},{"$f":"IF(Musique!G13=\"\",\"\",Musique!G13)","v":""},{"$f":"IF(Musique!H13=\"\",\"\",Musique!H13)","v":""},{"$f":"IF(Musique!I13=\"\",\"\",Musique!I13)","v":""},{"$f":"IF(Musique!J13=\"\",\"\",Musique!J13)","v":""},{"$f":"IF(Musique!K13=\"\",\"\",Musique!K13)","v":""},"","",{"$f":"IF(Musique!D13=\"\",\"\",100+COUNTIF(B37:G37,\"<7\")*7-SUMIF(B37:G37,\"<7\"))","v":""},{"$f":"IF(Musique!D13<>\"\",I60,\"\")","v":""},{"$f":"IF(L13<>\"\",SUMPRODUCT((COUNTIF(L13:Q13,{0,1,2,3,4,5})=0)*{10,1,2,3,4,5}),\"\")","v":""},{"$f":"IF(Musique!D13<>\"\",SUM(T13:V13),\"\")","v":""},{"$f":"IF(L13<>\"\",1-SUMPRODUCT((COUNTIF(L13:Q13,{1,2,3,4,5,0})=0)*{10,5,4,3,2,1})/26,\"\")","v":""},{"$f":"IF(L13<>\"\",1-SUMPRODUCT((COUNTIF(L13:Q13,{1,2,3,4,5,0})=0)*{1,2,3,4,5,10})/26,\"\")","v":""},"","",{"$f":"IF(S13<>\"\",COUNTIFS(Px,S13)-COUNTIFS(Px,S13,$AA$2:$AA$21,\"<=\"&AA13)+COUNTIFS($S$2:S13,S13,$AA$2:AA13,AA13),\"\")","v":""},"","","","",{"$f":"IF(Musique!D13=\"\",\"\",COUNTIF(L13:Q13,\">4\")+COUNTIF(L13:Q13,\"=0\"))","v":""},{"$f":"Musique!R13","v":""},"",{"$f":"IF(K13<>\"\",(COUNTIF(L13:Q13,\">4\")+COUNTIF(L13:Q13,\"=0\")&Musique!R13),\"\")","v":""},"","","","","","","","",0,"","",null,"",null,"PK1",{"$f":"COUNTIF($R$2:$R$21,1)","v":3},{"$f":"IF($R$2=1,\"1\",\"\") & IF($R$3=1,\"1\",\"\") & IF($R$4=1,\"1\",\"\") & IF($R$5=1,\"1\",\"\") & IF($R$6=1,\"1\",\"\") & IF($R$7=1,\"1\",\"\") & IF($R$8=1,\"1\",\"\") & IF($R$9=1,\"1\",\"\") & IF($R$10=1,\"1\",\"\") & IF($R$11=1,\"1\",\"\") & IF($R$12=1,\"1\",\"\") & IF($R$13=1,\"1\",\"\") & IF($R$14=1,\"1\",\"\") & IF($R$15=1,\"1\",\"\") & IF($R$16=1,\"1\",\"\") & IF($R$17=1,\"1\",\"\") & IF($R$18=1,\"1\",\"\") & IF($R$19=1,\"1\",\"\") & IF($R$20=1,\"1\",\"\") & IF($R$21=1,\"1\",\"\")","v":"111"},null,{"$f":"IF($R$2=1,$K$2 & \"-\",\"\") & IF($R$3=1,$K$3 & \"-\",\"\") & IF($R$4=1,$K$4 & \"-\",\"\") & IF($R$5=1,$K$5 & \"-\",\"\") & IF($R$6=1,$K$6 & \"-\",\"\") & IF($R$7=1,$K$7 & \"-\",\"\") & IF($R$8=1,$K$8 & \"-\",\"\") & IF($R$9=1,$K$9 & \"-\",\"\") & IF($R$10=1,$K$10 & \"-\",\"\") & IF($R$11=1,$K$11 & \"-\",\"\") & IF($R$12=1,$K$12 & \"-\",\"\") & IF($R$13=1,$K$13 & \"-\",\"\") & IF($R$14=1,$K$14 & \"-\",\"\") & IF($R$15=1,$K$15 & \"-\",\"\") & IF($R$16=1,$K$16 & \"-\",\"\") & IF($R$17=1,$K$17 & \"-\",\"\") & IF($R$18=1,$K$18 & \"-\",\"\") & IF($R$19=1,$K$19 & \"-\",\"\") & IF($R$20=1,$K$20 & \"-\",\"\") & IF($R$21=1,$K$21 & \"-\",\"\")","v":"2-7-9-"},null,"","","","","","","","","","","","",null,20,"0 2","FBB","FAVORI BANQUIER",null,31]
[12,{"$f":"IF(Musique!D13<>\"\",COUNTIF(L13:Q13,$B$2),\"\")","v":""},{"$f":"IF(Musique!D13<>\"\",COUNTIF(L13:Q13,$C$2),\"\")","v":""},{"$f":"IF(Musique!D13<>\"\",COUNTIF(L13:Q13,$D$2),\"\")","v":""},{"$f":"IF(Musique!D13<>\"\",COUNTIF(L13:Q13,$E$2),\"\")","v":""},{"$f":"IF(Musique!D13<>\"\",COUNTIF(L13:Q13,$F$2),\"\")","v":""},{"$f":"IF(Musique!D13<>\"\",COUNTIF(L13:Q13,$G$2),\"\")","v":""},null,"",null,{"$f":"IF(Musique!D14<>\"\",Musique!A14,\"\")","v":""},{"$f":"IF(Musique!F14=\"\",\"\",Musique!F14)","v":""},{"$f":"IF(Musique!G14=\"\",\"\",Musique!G14)","v":""},{"$f":"IF(Musique!H14=\"\",\"\",Musique!H14)","v":""},{"$f":"IF(Musique!I14=\"\",\"\",Musique!I14)","v":""},{"$f":"IF(Musique!J14=\"\",\"\",Musique!J14)","v":""},{"$f":"IF(Musique!K14=\"\",\"\",Musique!K14)","v":""},"","",{"$f":"IF(Musique!D14=\"\",\"\",100+COUNTIF(B38:G38,\"<7\")*7-SUMIF(B38:G38,\"<7\"))","v":""},{"$f":"IF(Musique!D14<>\"\",I61,\"\")","v":""},{"$f":"IF(L14<>\"\",SUMPRODUCT((COUNTIF(L14:Q14,{0,1,2,3,4,5})=0)*{10,1,2,3,4,5}),\"\")","v":""},{"$f":"IF(Musique!D14<>\"\",SUM(T14:V14),\"\")","v":""},{"$f":"IF(L14<>\"\",1-SUMPRODUCT((COUNTIF(L14:Q14,{1,2,3,4,5,0})=0)*{10,5,4,3,2,1})/26,\"\")","v":""},{"$f":"IF(L14<>\"\",1-SUMPRODUCT((COUNTIF(L14:Q14,{1,2,3,4,5,0})=0)*{1,2,3,4,5,10})/26,\"\")","v":""},"","",{"$f":"IF(S14<>\"\",COUNTIFS(Px,S14)-COUNTIFS(Px,S14,$AA$2:$AA$21,\"<=\"&AA14)+COUNTIFS($S$2:S14,S14,$AA$2:AA14,AA14),\"\")","v":""},"","","","",{"$f":"IF(Musique!D14=\"\",\"\",COUNTIF(L14:Q14,\">4\")+COUNTIF(L14:Q14,\"=0\"))","v":""},{"$f":"Musique!R14","v":""},"",{"$f":"IF(K14<>\"\",(COUNTIF(L14:Q14,\">4\")+COUNTIF(L14:Q14,\"=0\")&Musique!R14),\"\")","v":""},"","","","","","","","",0,"","",null,"",null,"PK0",{"$f":"COUNTIF($R$2:$R$21,0)","v":1},{"$f":"IF($R$2=0,\"0\",\"\") & IF($R$3=0,\"0\",\"\") & IF($R$4=0,\"0\",\"\") & IF($R$5=0,\"0\",\"\") & IF($R$6=0,\"0\",\"\") & IF($R$7=0,\"0\",\"\") & IF($R$8=0,\"0\",\"\") & IF($R$9=0,\"0\",\"\") & IF($R$10=0,\"0\",\"\") & IF($R$11=0,\"0\",\"\") & IF($R$12=0,\"0\",\"\") & IF($R$13=0,\"0\",\"\") & IF($R$14=0,\"0\",\"\") & IF($R$15=0,\"0\",\"\") & IF($R$16=0,\"0\",\"\") & IF($R$17=0,\"0\",\"\") & IF($R$18=0,\"0\",\"\") & IF($R$19=0,\"0\",\"\") & IF($R$20=0,\"0\",\"\") & IF($R$21=0,\"0\",\"\")","v":"0"},null,{"$f":"IF($R$2=0,$K$2 & \"-\",\"\") & IF($R$3=0,$K$3 & \"-\",\"\") & IF($R$4=0,$K$4 & \"-\",\"\") & IF($R$5=0,$K$5 & \"-\",\"\") & IF($R$6=0,$K$6 & \"-\",\"\") & IF($R$7=0,$K$7 & \"-\",\"\") & IF($R$8=0,$K$8 & \"-\",\"\") & IF($R$9=0,$K$9 & \"-\",\"\") & IF($R$10=0,$K$10 & \"-\",\"\") & IF($R$11=0,$K$11 & \"-\",\"\") & IF($R$12=0,$K$12 & \"-\",\"\") & IF($R$13=0,$K$13 & \"-\",\"\") & IF($R$14=0,$K$14 & \"-\",\"\") & IF($R$15=0,$K$15 & \"-\",\"\") & IF($R$16=0,$K$16 & \"-\",\"\") & IF($R$17=0,$K$17 & \"-\",\"\") & IF($R$18=0,$K$18 & \"-\",\"\") & IF($R$19=0,$K$19 & \"-\",\"\") & IF($R$20=0,$K$20 & \"-\",\"\") & IF($R$21=0,$K$21 & \"-\",\"\")","v":"5-"},null,"","","","","","","","","","","","",null,23,"2 3","FGO_1","FAVORI GROS OUTSIDERS","MINORANT",69]
[13,{"$f":"IF(Musique!D14<>\"\",COUNTIF(L14:Q14,$B$2),\"\")","v":""},{"$f":"IF(Musique!D14<>\"\",COUNTIF(L14:Q14,$C$2),\"\")","v":""},{"$f":"IF(Musique!D14<>\"\",COUNTIF(L14:Q14,$D$2),\"\")","v":""},{"$f":"IF(Musique!D14<>\"\",COUNTIF(L14:Q14,$E$2),\"\")","v":""},{"$f":"IF(Musique!D14<>\"\",COUNTIF(L14:Q14,$F$2),\"\")","v":""},{"$f":"IF(Musique!D14<>\"\",COUNTIF(L14:Q14,$G$2),\"\")","v":""},null,"",null,{"$f":"IF(Musique!D15<>\"\",Musique!A15,\"\")","v":""},{"$f":"IF(Musique!F15=\"\",\"\",Musique!F15)","v":""},{"$f":"IF(Musique!G15=\"\",\"\",Musique!G15)","v":""},{"$f":"IF(Musique!H15=\"\",\"\",Musique!H15)","v":""},{"$f":"IF(Musique!I15=\"\",\"\",Musique!I15)","v":""},{"$f":"IF(Musique!J15=\"\",\"\",Musique!J15)","v":""},{"$f":"IF(Musique!K15=\"\",\"\",Musique!K15)","v":""},"","",{"$f":"IF(Musique!D15=\"\",\"\",100+COUNTIF(B39:G39,\"<7\")*7-SUMIF(B39:G39,\"<7\"))","v":""},{"$f":"IF(Musique!D15<>\"\",I62,\"\")","v":""},{"$f":"IF(L15<>\"\",SUMPRODUCT((COUNTIF(L15:Q15,{0,1,2,3,4,5})=0)*{10,1,2,3,4,5}),\"\")","v":""},{"$f":"IF(Musique!D15<>\"\",SUM(T15:V15),\"\")","v":""},{"$f":"IF(L15<>\"\",1-SUMPRODUCT((COUNTIF(L15:Q15,{1,2,3,4,5,0})=0)*{10,5,4,3,2,1})/26,\"\")","v":""},{"$f":"IF(L15<>\"\",1-SUMPRODUCT((COUNTIF(L15:Q15,{1,2,3,4,5,0})=0)*{1,2,3,4,5,10})/26,\"\")","v":""},"","",{"$f":"IF(S15<>\"\",COUNTIFS(Px,S15)-COUNTIFS(Px,S15,$AA$2:$AA$21,\"<=\"&AA15)+COUNTIFS($S$2:S15,S15,$AA$2:AA15,AA15),\"\")","v":""},"","","","",{"$f":"IF(Musique!D15=\"\",\"\",COUNTIF(L15:Q15,\">4\")+COUNTIF(L15:Q15,\"=0\"))","v":""},{"$f":"Musique!R15","v":""},"",{"$f":"IF(K15<>\"\",(COUNTIF(L15:Q15,\">4\")+COUNTIF(L15:Q15,\"=0\")&Musique!R15),\"\")","v":""},"","","","","","","","",0,"","",null,"",null,null,null,null,null,null,null,"","","","","","","","","","","","",null,24,"2 4","FOF_2","FAVORI SUR OUT OF FORM","MÉDIUM",63]
[14,{"$f":"IF(Musique!D15<>\"\",COUNTIF(L15:Q15,$B$2),\"\")","v":""},{"$f":"IF(Musique!D15<>\"\",COUNTIF(L15:Q15,$C$2),\"\")","v":""},{"$f":"IF(Musique!D15<>\"\",COUNTIF(L15:Q15,$D$2),\"\")","v":""},{"$f":"IF(Musique!D15<>\"\",COUNTIF(L15:Q15,$E$2),\"\")","v":""},{"$f":"IF(Musique!D15<>\"\",COUNTIF(L15:Q15,$F$2),\"\")","v":""},{"$f":"IF(Musique!D15<>\"\",COUNTIF(L15:Q15,$G$2),\"\")","v":""},null,"",null,{"$f":"IF(Musique!D16<>\"\",Musique!A16,\"\")","v":""},{"$f":"IF(Musique!F16=\"\",\"\",Musique!F16)","v":""},{"$f":"IF(Musique!G16=\"\",\"\",Musique!G16)","v":""},{"$f":"IF(Musique!H16=\"\",\"\",Musique!H16)","v":""},{"$f":"IF(Musique!I16=\"\",\"\",Musique!I16)","v":""},{"$f":"IF(Musique!J16=\"\",\"\",Musique!J16)","v":""},{"$f":"IF(Musique!K16=\"\",\"\",Musique!K16)","v":""},"","",{"$f":"IF(Musique!D16=\"\",\"\",100+COUNTIF(B40:G40,\"<7\")*7-SUMIF(B40:G40,\"<7\"))","v":""},{"$f":"IF(Musique!D16<>\"\",I63,\"\")","v":""},{"$f":"IF(L16<>\"\",SUMPRODUCT((COUNTIF(L16:Q16,{0,1,2,3,4,5})=0)*{10,1,2,3,4,5}),\"\")","v":""},{"$f":"IF(Musique!D16<>\"\",SUM(T16:V16),\"\")","v":""},{"$f":"IF(L16<>\"\",1-SUMPRODUCT((COUNTIF(L16:Q16,{1,2,3,4,5,0})=0)*{10,5,4,3,2,1})/26,\"\")","v":""},{"$f":"IF(L16<>\"\",1-SUMPRODUCT((COUNTIF(L16:Q16,{1,2,3,4,5,0})=0)*{1,2,3,4,5,10})/26,\"\")","v":""},"","",{"$f":"IF(S16<>\"\",COUNTIFS(Px,S16)-COUNTIFS(Px,S16,$AA$2:$AA$21,\"<=\"&AA16)+COUNTIFS($S$2:S16,S16,$AA$2:AA16,AA16),\"\")","v":""},"","","","",{"$f":"IF(Musique!D16=\"\",\"\",COUNTIF(L16:Q16,\">4\")+COUNTIF(L16:Q16,\"=0\"))","v":""},{"$f":"Musique!R16","v":""},"",{"$f":"IF(K16<>\"\",(COUNTIF(L16:Q16,\">4\")+COUNTIF(L16:Q16,\"=0\")&Musique!R16),\"\")","v":""},"","","","","","","","",0,"","",null,"",null,null,null,null,null,null,null,"","","","","","","","","","","","",null,25,"2 5","FOF_2","FAVORI SUR OUT OF FORM","MÉDIUM",88]
[15,{"$f":"IF(Musique!D16<>\"\",COUNTIF(L16:Q16,$B$2),\"\")","v":""},{"$f":"IF(Musique!D16<>\"\",COUNTIF(L16:Q16,$C$2),\"\")","v":""},{"$f":"IF(Musique!D16<>\"\",COUNTIF(L16:Q16,$D$2),\"\")","v":""},{"$f":"IF(Musique!D16<>\"\",COUNTIF(L16:Q16,$E$2),\"\")","v":""},{"$f":"IF(Musique!D16<>\"\",COUNTIF(L16:Q16,$F$2),\"\")","v":""},{"$f":"IF(Musique!D16<>\"\",COUNTIF(L16:Q16,$G$2),\"\")","v":""},null,"",null,{"$f":"IF(Musique!D17<>\"\",Musique!A17,\"\")","v":""},{"$f":"IF(Musique!F17=\"\",\"\",Musique!F17)","v":""},{"$f":"IF(Musique!G17=\"\",\"\",Musique!G17)","v":""},{"$f":"IF(Musique!H17=\"\",\"\",Musique!H17)","v":""},{"$f":"IF(Musique!I17=\"\",\"\",Musique!I17)","v":""},{"$f":"IF(Musique!J17=\"\",\"\",Musique!J17)","v":""},{"$f":"IF(Musique!K17=\"\",\"\",Musique!K17)","v":""},"","",{"$f":"IF(Musique!D17=\"\",\"\",100+COUNTIF(B41:G41,\"<7\")*7-SUMIF(B41:G41,\"<7\"))","v":""},{"$f":"IF(Musique!D17<>\"\",I64,\"\")","v":""},{"$f":"IF(L17<>\"\",SUMPRODUCT((COUNTIF(L17:Q17,{0,1,2,3,4,5})=0)*{10,1,2,3,4,5}),\"\")","v":""},{"$f":"IF(Musique!D17<>\"\",SUM(T17:V17),\"\")","v":""},{"$f":"IF(L17<>\"\",1-SUMPRODUCT((COUNTIF(L17:Q17,{1,2,3,4,5,0})=0)*{10,5,4,3,2,1})/26,\"\")","v":""},{"$f":"IF(L17<>\"\",1-SUMPRODUCT((COUNTIF(L17:Q17,{1,2,3,4,5,0})=0)*{1,2,3,4,5,10})/26,\"\")","v":""},"","",{"$f":"IF(S17<>\"\",COUNTIFS(Px,S17)-COUNTIFS(Px,S17,$AA$2:$AA$21,\"<=\"&AA17)+COUNTIFS($S$2:S17,S17,$AA$2:AA17,AA17),\"\")","v":""},"","","","",{"$f":"IF(Musique!D17=\"\",\"\",COUNTIF(L17:Q17,\">4\")+COUNTIF(L17:Q17,\"=0\"))","v":""},{"$f":"Musique!R17","v":""},"",{"$f":"IF(K17<>\"\",(COUNTIF(L17:Q17,\">4\")+COUNTIF(L17:Q17,\"=0\")&Musique!R17),\"\")","v":""},"","","","","","","","",0,"","",null,"",null,null,null,null,null,null,null,"","","","","","","","","","","","",null,30,"0 3","FBB","FAVORI BANQUIER","AUTRE",56]
[16,{"$f":"IF(Musique!D17<>\"\",COUNTIF(L17:Q17,$B$2),\"\")","v":""},{"$f":"IF(Musique!D17<>\"\",COUNTIF(L17:Q17,$C$2),\"\")","v":""},{"$f":"IF(Musique!D17<>\"\",COUNTIF(L17:Q17,$D$2),\"\")","v":""},{"$f":"IF(Musique!D17<>\"\",COUNTIF(L17:Q17,$E$2),\"\")","v":""},{"$f":"IF(Musique!D17<>\"\",COUNTIF(L17:Q17,$F$2),\"\")","v":""},{"$f":"IF(Musique!D17<>\"\",COUNTIF(L17:Q17,$G$2),\"\")","v":""},null,"",null,{"$f":"IF(Musique!D18<>\"\",Musique!A18,\"\")","v":""},{"$f":"IF(Musique!F18=\"\",\"\",Musique!F18)","v":""},{"$f":"IF(Musique!G18=\"\",\"\",Musique!G18)","v":""},{"$f":"IF(Musique!H18=\"\",\"\",Musique!H18)","v":""},{"$f":"IF(Musique!I18=\"\",\"\",Musique!I18)","v":""},{"$f":"IF(Musique!J18=\"\",\"\",Musique!J18)","v":""},{"$f":"IF(Musique!K18=\"\",\"\",Musique!K18)","v":""},"","",{"$f":"IF(Musique!D18=\"\",\"\",100+COUNTIF(B42:G42,\"<7\")*7-SUMIF(B42:G42,\"<7\"))","v":""},{"$f":"IF(Musique!D18<>\"\",I65,\"\")","v":""},{"$f":"IF(L18<>\"\",SUMPRODUCT((COUNTIF(L18:Q18,{0,1,2,3,4,5})=0)*{10,1,2,3,4,5}),\"\")","v":""},{"$f":"IF(Musique!D18<>\"\",SUM(T18:V18),\"\")","v":""},{"$f":"IF(L18<>\"\",1-SUMPRODUCT((COUNTIF(L18:Q18,{1,2,3,4,5,0})=0)*{10,5,4,3,2,1})/26,\"\")","v":""},{"$f":"IF(L18<>\"\",1-SUMPRODUCT((COUNTIF(L18:Q18,{1,2,3,4,5,0})=0)*{1,2,3,4,5,10})/26,\"\")","v":""},"","",{"$f":"IF(S18<>\"\",COUNTIFS(Px,S18)-COUNTIFS(Px,S18,$AA$2:$AA$21,\"<=\"&AA18)+COUNTIFS($S$2:S18,S18,$AA$2:AA18,AA18),\"\")","v":""},"","","","",{"$f":"IF(Musique!D18=\"\",\"\",COUNTIF(L18:Q18,\">4\")+COUNTIF(L18:Q18,\"=0\"))","v":""},{"$f":"Musique!R18","v":""},"",{"$f":"IF(K18<>\"\",(COUNTIF(L18:Q18,\">4\")+COUNTIF(L18:Q18,\"=0\")&Musique!R18),\"\")","v":""},"","","","","","","","",0,"","",null,"",null,null,null,null,null,null,null,"","","","","","","","","","","","",null,34,"3 4","FAV","FAVORI","AUTRE",96]
[17,{"$f":"IF(Musique!D18<>\"\",COUNTIF(L18:Q18,$B$2),\"\")","v":""},{"$f":"IF(Musique!D18<>\"\",COUNTIF(L18:Q18,$C$2),\"\")","v":""},{"$f":"IF(Musique!D18<>\"\",COUNTIF(L18:Q18,$D$2),\"\")","v":""},{"$f":"IF(Musique!D18<>\"\",COUNTIF(L18:Q18,$E$2),\"\")","v":""},{"$f":"IF(Musique!D18<>\"\",COUNTIF(L18:Q18,$F$2),\"\")","v":""},{"$f":"IF(Musique!D18<>\"\",COUNTIF(L18:Q18,$G$2),\"\")","v":""},null,"",null,{"$f":"IF(Musique!D19<>\"\",Musique!A19,\"\")","v":""},{"$f":"IF(Musique!F19=\"\",\"\",Musique!F19)","v":""},{"$f":"IF(Musique!G19=\"\",\"\",Musique!G19)","v":""},{"$f":"IF(Musique!H19=\"\",\"\",Musique!H19)","v":""},{"$f":"IF(Musique!I19=\"\",\"\",Musique!I19)","v":""},{"$f":"IF(Musique!J19=\"\",\"\",Musique!J19)","v":""},{"$f":"IF(Musique!K19=\"\",\"\",Musique!K19)","v":""},"","",{"$f":"IF(Musique!D19=\"\",\"\",100+COUNTIF(B43:G43,\"<7\")*7-SUMIF(B43:G43,\"<7\"))","v":""},{"$f":"IF(Musique!D19<>\"\",I66,\"\")","v":""},{"$f":"IF(L19<>\"\",SUMPRODUCT((COUNTIF(L19:Q19,{0,1,2,3,4,5})=0)*{10,1,2,3,4,5}),\"\")","v":""},{"$f":"IF(Musique!D19<>\"\",SUM(T19:V19),\"\")","v":""},{"$f":"IF(L19<>\"\",1-SUMPRODUCT((COUNTIF(L19:Q19,{1,2,3,4,5,0})=0)*{10,5,4,3,2,1})/26,\"\")","v":""},{"$f":"IF(L19<>\"\",1-SUMPRODUCT((COUNTIF(L19:Q19,{1,2,3,4,5,0})=0)*{1,2,3,4,5,10})/26,\"\")","v":""},"","",{"$f":"IF(S19<>\"\",COUNTIFS(Px,S19)-COUNTIFS(Px,S19,$AA$2:$AA$21,\"<=\"&AA19)+COUNTIFS($S$2:S19,S19,$AA$2:AA19,AA19),\"\")","v":""},"","","","",{"$f":"IF(Musique!D19=\"\",\"\",COUNTIF(L19:Q19,\">4\")+COUNTIF(L19:Q19,\"=0\"))","v":""},{"$f":"Musique!R19","v":""},"",{"$f":"IF(K19<>\"\",(COUNTIF(L19:Q19,\">4\")+COUNTIF(L19:Q19,\"=0\")&Musique!R19),\"\")","v":""},"","","","","","","","",0,"","",null,"",null,null,null,null,null,null,null,"","","","","","","","","","","","",null,35,"3 5","FAV","FAVORI","AUTRE",135]
[18,{"$f":"IF(Musique!D19<>\"\",COUNTIF(L19:Q19,$B$2),\"\")","v":""},{"$f":"IF(Musique!D19<>\"\",COUNTIF(L19:Q19,$C$2),\"\")","v":""},{"$f":"IF(Musique!D19<>\"\",COUNTIF(L19:Q19,$D$2),\"\")","v":""},{"$f":"IF(Musique!D19<>\"\",COUNTIF(L19:Q19,$E$2),\"\")","v":""},{"$f":"IF(Musique!D19<>\"\",COUNTIF(L19:Q19,$F$2),\"\")","v":""},{"$f":"IF(Musique!D19<>\"\",COUNTIF(L19:Q19,$G$2),\"\")","v":""},null,"",null,{"$f":"IF(Musique!D20<>\"\",Musique!A20,\"\")","v":""},{"$f":"IF(Musique!F20=\"\",\"\",Musique!F20)","v":""},{"$f":"IF(Musique!G20=\"\",\"\",Musique!G20)","v":""},{"$f":"IF(Musique!H20=\"\",\"\",Musique!H20)","v":""},{"$f":"IF(Musique!I20=\"\",\"\",Musique!I20)","v":""},{"$f":"IF(Musique!J20=\"\",\"\",Musique!J20)","v":""},{"$f":"IF(Musique!K20=\"\",\"\",Musique!K20)","v":""},"","",{"$f":"IF(Musique!D20=\"\",\"\",100+COUNTIF(B44:G44,\"<7\")*7-SUMIF(B44:G44,\"<7\"))","v":""},{"$f":"IF(Musique!D20<>\"\",I67,\"\")","v":""},{"$f":"IF(L20<>\"\",SUMPRODUCT((COUNTIF(L20:Q20,{0,1,2,3,4,5})=0)*{10,1,2,3,4,5}),\"\")","v":""},{"$f":"IF(Musique!D20<>\"\",SUM(T20:V20),\"\")","v":""},{"$f":"IF(L20<>\"\",1-SUMPRODUCT((COUNTIF(L20:Q20,{1,2,3,4,5,0})=0)*{10,5,4,3,2,1})/26,\"\")","v":""},{"$f":"IF(L20<>\"\",1-SUMPRODUCT((COUNTIF(L20:Q20,{1,2,3,4,5,0})=0)*{1,2,3,4,5,10})/26,\"\")","v":""},"","",{"$f":"IF(S20<>\"\",COUNTIFS(Px,S20)-COUNTIFS(Px,S20,$AA$2:$AA$21,\"<=\"&AA20)+COUNTIFS($S$2:S20,S20,$AA$2:AA20,AA20),\"\")","v":""},"","","","",{"$f":"IF(Musique!D20=\"\",\"\",COUNTIF(L20:Q20,\">4\")+COUNTIF(L20:Q20,\"=0\"))","v":""},{"$f":"Musique!R20","v":""},"",{"$f":"IF(K20<>\"\",(COUNTIF(L20:Q20,\">4\")+COUNTIF(L20:Q20,\"=0\")&Musique!R20),\"\")","v":""},"","","","","","","","",0,"","",null,"",null,null,null,null,null,null,null,"","","","","","","","","","","","",null,40,"0 4","FBB","FAVORI BANQUIER","AUTRE",57]
[19,{"$f":"IF(Musique!D20<>\"\",COUNTIF(L20:Q20,$B$2),\"\")","v":""},{"$f":"IF(Musique!D20<>\"\",COUNTIF(L20:Q20,$C$2),\"\")","v":""},{"$f":"IF(Musique!D20<>\"\",COUNTIF(L20:Q20,$D$2),\"\")","v":""},{"$f":"IF(Musique!D20<>\"\",COUNTIF(L20:Q20,$E$2),\"\")","v":""},{"$f":"IF(Musique!D20<>\"\",COUNTIF(L20:Q20,$F$2),\"\")","v":""},{"$f":"IF(Musique!D20<>\"\",COUNTIF(L20:Q20,$G$2),\"\")","v":""},null,"",null,{"$f":"IF(Musique!D21<>\"\",Musique!A21,\"\")","v":""},{"$f":"IF(Musique!F21=\"\",\"\",Musique!F21)","v":""},{"$f":"IF(Musique!G21=\"\",\"\",Musique!G21)","v":""},{"$f":"IF(Musique!H21=\"\",\"\",Musique!H21)","v":""},{"$f":"IF(Musique!I21=\"\",\"\",Musique!I21)","v":""},{"$f":"IF(Musique!J21=\"\",\"\",Musique!J21)","v":""},{"$f":"IF(Musique!K21=\"\",\"\",Musique!K21)","v":""},"","",{"$f":"IF(Musique!D21=\"\",\"\",100+COUNTIF(B45:G45,\"<7\")*7-SUMIF(B45:G45,\"<7\"))","v":""},{"$f":"IF(Musique!D21<>\"\",I68,\"\")","v":""},{"$f":"IF(L21<>\"\",SUMPRODUCT((COUNTIF(L21:Q21,{0,1,2,3,4,5})=0)*{10,1,2,3,4,5}),\"\")","v":""},{"$f":"IF(Musique!D21<>\"\",SUM(T21:V21),\"\")","v":""},{"$f":"IF(L21<>\"\",1-SUMPRODUCT((COUNTIF(L21:Q21,{1,2,3,4,5,0})=0)*{10,5,4,3,2,1})/26,\"\")","v":""},{"$f":"IF(L21<>\"\",1-SUMPRODUCT((COUNTIF(L21:Q21,{1,2,3,4,5,0})=0)*{1,2,3,4,5,10})/26,\"\")","v":""},"","",{"$f":"IF(S21<>\"\",COUNTIFS(Px,S21)-COUNTIFS(Px,S21,$AA$2:$AA$21,\"<=\"&AA21)+COUNTIFS($S$2:S21,S21,$AA$2:AA21,AA21),\"\")","v":""},"","","","",{"$f":"IF(Musique!D21=\"\",\"\",COUNTIF(L21:Q21,\">4\")+COUNTIF(L21:Q21,\"=0\"))","v":""},{"$f":"Musique!R21","v":""},"",{"$f":"IF(K21<>\"\",(COUNTIF(L21:Q21,\">4\")+COUNTIF(L21:Q21,\"=0\")&Musique!R21),\"\")","v":""},"","","","","","","","",0,"","",null,"",null,null,null,null,null,null,null,"","","","","","","","","","","","",null,45,"4 5","FAV","AUTRE","AUTRE",122]
[20,{"$f":"IF(Musique!D21<>\"\",COUNTIF(L21:Q21,$B$2),\"\")","v":""},{"$f":"IF(Musique!D21<>\"\",COUNTIF(L21:Q21,$C$2),\"\")","v":""},{"$f":"IF(Musique!D21<>\"\",COUNTIF(L21:Q21,$D$2),\"\")","v":""},{"$f":"IF(Musique!D21<>\"\",COUNTIF(L21:Q21,$E$2),\"\")","v":""},{"$f":"IF(Musique!D21<>\"\",COUNTIF(L21:Q21,$F$2),\"\")","v":""},{"$f":"IF(Musique!D21<>\"\",COUNTIF(L21:Q21,$G$2),\"\")","v":""},null,null,null,null,null,null,null,null,null,null,null,null,null,null,null,null,null,null,null,null,null,null,null,null,null,null,null,null,null,null,null,null,null,null,null,null,null,null,null,null,"Total :",{"$f":"IF(AV2<>\"\",SUM(AW2:AW21),\"\")","v":""},null,null,null,null,null,null,null,null,null,null,null,null,null,null,null,null,null,null,null,null,50,"0 5","FBB","FAVORI BANQUIER","AUTRE",36]
[null,null,null,null,null,null,null,null,null,null,null,null,null,null,null,null,"Arrivée :",null,null,null,null,null,null,null,null,null,null,null,null,null,null,null,null,null,null,null,null,null,null,null,null,null,null,null,null,null,null,null,null,null,null,null,null,null,null,null,null,null,null,null,null,null,null,null,null,null,null,null,null,120,"0 1 2","OFB_1","OUTSIDER DÉGRADÉ","MINORANT",24]
[null,null,null,null,null,null,null,null,null,null,null,null,null,null,null,null,null,null,null,null,null,null,null,null,null,null,null,null,null,null,null,null,null,null,null,null,null,null,null,null,null,null,null,null,null,null,null,null,null,null,null,null,null,null,null,null,null,null,null,null,null,null,null,null,null,null,null,null,null,123,"1 2 3","OGO_2","GROS OUTSIDERS ","MAJORANT",96]
["LS",null,null,null,null,null,null,null,null,null,null,null,null,null,null,null,null,null,null,null,null,"R","C",null,null,null,null,null,null,null,null,null,null,null,null,null,null,null,null,null,null,null,null,null,null,null,null,null,null,null,null,null,null,null,null,null,null,null,null,null,null,null,null,null,null,null,null,null,null,124,"1 2 4","ODE_1","OUTSIDER DÉGRADÉ","MINORANT",87]
[1,{"$f":"IF(Musique!F2=\"\",\"\",IF(Musique!F2=0,10,Musique!F2))","v":4},{"$f":"IF(Musique!G2=\"\",\"\",IF(Musique!G2=0,10,Musique!G2))","v":10},{"$f":"IF(Musique!H2=\"\",\"\",IF(Musique!H2=0,10,Musique!H2))","v":4},{"$f":"IF(Musique!I2=\"\",\"\",IF(Musique!I2=0,10,Musique!I2))","v":10},{"$f":"IF(Musique!J2=\"\",\"\",IF(Musique!J2=0,10,Musique!J2))","v":4},{"$f":"IF(Musique!K2=\"\",\"\",IF(Musique!K2=0,10,Musique!K2))","v":2},{"$f":"IF(B26=\"\",\"\",COUNTIF(B26:G26,\"<=5\"))","v":4},{"$f":"IF(B26=\"\",\"\",COUNTIF(B26:G26,\"=1\"))","v":0},null,null,null,null,null,null,null,"Date :",null,null,null,null,null,null,null,null,null,null,null,null,null,null,null,null,null,null,null,null,null,null,null,null,null,null,null,null,null,null,null,null,null,null,null,null,null,null,null,null,null,null,null,null,null,null,null,null,null,null,null,null,125,"1 2 5","ODE_3","OUTSIDER DÉGRADÉ",null,112]
[2,{"$f":"IF(Musique!F3=\"\",\"\",IF(Musique!F3=0,10,Musique!F3))","v":10},{"$f":"IF(Musique!G3=\"\",\"\",IF(Musique!G3=0,10,Musique!G3))","v":1},{"$f":"IF(Musique!H3=\"\",\"\",IF(Musique!H3=0,10,Musique!H3))","v":9},{"$f":"IF(Musique!I3=\"\",\"\",IF(Musique!I3=0,10,Musique!I3))","v":7},{"$f":"IF(Musique!J3=\"\",\"\",IF(Musique!J3=0,10,Musique!J3))","v":3},{"$f":"IF(Musique!K3=\"\",\"\",IF(Musique!K3=0,10,Musique!K3))","v":3},{"$f":"IF(B27=\"\",\"\",COUNTIF(B27:G27,\"<=5\"))","v":3},1,null,null,null,null,null,null,null,null,null,null,null,null,null,null,null,null,null,null,null,null,null,null,null,null,null,null,null,null,null,null,null,null,null,null,null,null,null,null,null,null,null,null,null,null,null,null,null,null,null,null,null,null,null,null,null,null,null,null,null,null,130,"0 1 3","OFB_1","OUTSIDERS FAVORIS",null,35]
[3,{"$f":"IF(Musique!F4=\"\",\"\",IF(Musique!F4=0,10,Musique!F4))","v":7},{"$f":"IF(Musique!G4=\"\",\"\",IF(Musique!G4=0,10,Musique!G4))","v":5},{"$f":"IF(Musique!H4=\"\",\"\",IF(Musique!H4=0,10,Musique!H4))","v":10},{"$f":"IF(Musique!I4=\"\",\"\",IF(Musique!I4=0,10,Musique!I4))","v":3},{"$f":"IF(Musique!J4=\"\",\"\",IF(Musique!J4=0,10,Musique!J4))","v":6},{"$f":"IF(Musique!K4=\"\",\"\",IF(Musique!K4=0,10,Musique!K4))","v":4},3,0,null,null,null,null,null,null,null,null,null,null,null,null,null,null,null,null,null,null,null,null,null,null,null,null,null,null,null,null,null,null,null,null,null,null,null,null,null,null,null,null,null,null,null,null,null,null,null,null,null,null,null,null,null,null,null,null,null,null,null,null,134,"1 3 4","ODE_1","OUTSIDER DÉGRADÉ","MINORANT",83]
[4,{"$f":"IF(Musique!F5=\"\",\"\",IF(Musique!F5=0,10,Musique!F5))","v":3},{"$f":"IF(Musique!G5=\"\",\"\",IF(Musique!G5=0,10,Musique!G5))","v":2},{"$f":"IF(Musique!H5=\"\",\"\",IF(Musique!H5=0,10,Musique!H5))","v":10},{"$f":"IF(Musique!I5=\"\",\"\",IF(Musique!I5=0,10,Musique!I5))","v":2},{"$f":"IF(Musique!J5=\"\",\"\",IF(Musique!J5=0,10,Musique!J5))","v":10},{"$f":"IF(Musique!K5=\"\",\"\",IF(Musique!K5=0,10,Musique!K5))","v":6},3,0,null,null,null,null,null,null,null,null,null,null,null,null,null,null,null,null,null,null,null,null,null,null,null,null,null,null,null,null,null,null,null,null,null,null,null,null,null,null,null,null,null,null,null,null,null,null,null,null,null,null,null,null,null,null,null,null,null,null,null,null,135,"1 3 5","ODE_3","OUTSIDER DÉGRADÉ",null,102]
[5,{"$f":"IF(Musique!F6=\"\",\"\",IF(Musique!F6=0,10,Musique!F6))","v":1},{"$f":"IF(Musique!G6=\"\",\"\",IF(Musique!G6=0,10,Musique!G6))","v":10},{"$f":"IF(Musique!H6=\"\",\"\",IF(Musique!H6=0,10,Musique!H6))","v":7},{"$f":"IF(Musique!I6=\"\",\"\",IF(Musique!I6=0,10,Musique!I6))","v":10},{"$f":"IF(Musique!J6=\"\",\"\",IF(Musique!J6=0,10,Musique!J6))","v":7},{"$f":"IF(Musique!K6=\"\",\"\",IF(Musique!K6=0,10,Musique!K6))","v":1},2,2,null,null,null,null,null,null,null,null,null,null,null,null,null,null,null,null,null,null,null,null,null,null,null,null,null,null,null,null,null,null,null,null,null,null,null,null,null,null,null,null,null,null,null,null,null,null,null,null,null,null,null,null,null,null,null,null,null,null,null,null,140,"0 1 4","OFB_1","OUTSIDERS FAVORIS",null,37]
[6,{"$f":"IF(Musique!F7=\"\",\"\",IF(Musique!F7=0,10,Musique!F7))","v":2},{"$f":"IF(Musique!G7=\"\",\"\",IF(Musique!G7=0,10,Musique!G7))","v":10},{"$f":"IF(Musique!H7=\"\",\"\",IF(Musique!H7=0,10,Musique!H7))","v":6},{"$f":"IF(Musique!I7=\"\",\"\",IF(Musique!I7=0,10,Musique!I7))","v":10},{"$f":"IF(Musique!J7=\"\",\"\",IF(Musique!J7=0,10,Musique!J7))","v":7},{"$f":"IF(Musique!K7=\"\",\"\",IF(Musique!K7=0,10,Musique!K7))","v":9},1,0,null,null,null,null,null,null,null,null,null,null,null,null,null,null,null,null,null,null,null,null,null,null,null,null,null,null,null,null,null,null,null,null,null,null,null,null,null,null,null,null,null,null,null,null,null,null,null,null,null,null,null,null,null,null,null,null,null,null,null,null,145,"1 4 5","ODE_3","OUTSIDER DÉGRADÉ",null,143]
[7,{"$f":"IF(Musique!F8=\"\",\"\",IF(Musique!F8=0,10,Musique!F8))","v":10},{"$f":"IF(Musique!G8=\"\",\"\",IF(Musique!G8=0,10,Musique!G8))","v":1},{"$f":"IF(Musique!H8=\"\",\"\",IF(Musique!H8=0,10,Musique!H8))","v":10},{"$f":"IF(Musique!I8=\"\",\"\",IF(Musique!I8=0,10,Musique!I8))","v":3},{"$f":"IF(Musique!J8=\"\",\"\",IF(Musique!J8=0,10,Musique!J8))","v":10},{"$f":"IF(Musique!K8=\"\",\"\",IF(Musique!K8=0,10,Musique!K8))","v":6},2,1,null,null,null,null,null,null,null,null,null,null,null,null,null,null,null,null,null,null,null,null,null,null,null,null,null,null,null,null,null,null,null,null,null,null,null,null,null,null,null,null,null,null,null,null,null,null,null,null,null,null,null,null,null,null,null,null,null,null,null,null,150,"0 1 5","OFB_1","OUTSIDERS FAVORIS",null,50]
[8,{"$f":"IF(Musique!F9=\"\",\"\",IF(Musique!F9=0,10,Musique!F9))","v":10},{"$f":"IF(Musique!G9=\"\",\"\",IF(Musique!G9=0,10,Musique!G9))","v":10},{"$f":"IF(Musique!H9=\"\",\"\",IF(Musique!H9=0,10,Musique!H9))","v":1},{"$f":"IF(Musique!I9=\"\",\"\",IF(Musique!I9=0,10,Musique!I9))","v":2},{"$f":"IF(Musique!J9=\"\",\"\",IF(Musique!J9=0,10,Musique!J9))","v":10},{"$f":"IF(Musique!K9=\"\",\"\",IF(Musique!K9=0,10,Musique!K9))","v":4},3,1,null,null,null,null,null,null,null,null,null,null,null,null,null,null,null,null,null,null,null,null,null,null,null,null,null,null,null,null,null,null,null,null,null,null,null,null,null,null,null,null,null,null,null,null,null,null,null,null,null,null,null,null,null,null,null,null,null,null,null,null,230,"0 2 3","FBB","FAVORI BANQUIER","HAUTE",26]
[9,{"$f":"IF(Musique!F10=\"\",\"\",IF(Musique!F10=0,10,Musique!F10))","v":2},{"$f":"IF(Musique!G10=\"\",\"\",IF(Musique!G10=0,10,Musique!G10))","v":1},{"$f":"IF(Musique!H10=\"\",\"\",IF(Musique!H10=0,10,Musique!H10))","v":10},{"$f":"IF(Musique!I10=\"\",\"\",IF(Musique!I10=0,10,Musique!I10))","v":10},{"$f":"IF(Musique!J10=\"\",\"\",IF(Musique!J10=0,10,Musique!J10))","v":3},{"$f":"IF(Musique!K10=\"\",\"\",IF(Musique!K10=0,10,Musique!K10))","v":1},4,2,null,null,null,null,null,null,null,null,null,null,null,null,null,null,null,null,null,null,null,null,null,null,null,null,null,null,null,null,null,null,null,null,null,null,null,null,null,null,null,null,null,null,null,null,null,null,null,null,null,null,null,null,null,null,null,null,null,null,null,null,234,"2 3 4","FGO_2","FAVORI GROS OUTSIDERS","MÉDIUM",95]
[10,{"$f":"IF(Musique!F11=\"\",\"\",IF(Musique!F11=0,10,Musique!F11))","v":4},{"$f":"IF(Musique!G11=\"\",\"\",IF(Musique!G11=0,10,Musique!G11))","v":3},{"$f":"IF(Musique!H11=\"\",\"\",IF(Musique!H11=0,10,Musique!H11))","v":6},{"$f":"IF(Musique!I11=\"\",\"\",IF(Musique!I11=0,10,Musique!I11))","v":10},{"$f":"IF(Musique!J11=\"\",\"\",IF(Musique!J11=0,10,Musique!J11))","v":4},{"$f":"IF(Musique!K11=\"\",\"\",IF(Musique!K11=0,10,Musique!K11))","v":8},3,0,null,null,null,null,null,null,null,null,null,null,null,null,null,null,null,null,null,null,null,null,null,null,null,null,null,null,null,null,null,null,null,null,null,null,null,null,null,null,null,null,null,null,null,null,null,null,null,null,null,null,null,null,null,null,null,null,null,null,null,null,235,"2 3 5","FGO_2","FAVORI GROS OUTSIDERS","MÉDIUM",117]
[11,{"$f":"IF(Musique!F12=\"\",\"\",IF(Musique!F12=0,10,Musique!F12))","v":""},{"$f":"IF(Musique!G12=\"\",\"\",IF(Musique!G12=0,10,Musique!G12))","v":""},{"$f":"IF(Musique!H12=\"\",\"\",IF(Musique!H12=0,10,Musique!H12))","v":""},{"$f":"IF(Musique!I12=\"\",\"\",IF(Musique!I12=0,10,Musique!I12))","v":""},{"$f":"IF(Musique!J12=\"\",\"\",IF(Musique!J12=0,10,Musique!J12))","v":""},{"$f":"IF(Musique!K12=\"\",\"\",IF(Musique!K12=0,10,Musique!K12))","v":""},"","",null,null,null,null,null,null,null,null,null,null,null,null,null,null,null,null,null,null,null,null,null,null,null,null,null,null,null,null,null,null,null,null,null,null,null,null,null,null,null,null,null,null,null,null,null,null,null,null,null,null,null,null,null,null,null,null,null,null,null,null,240,"0 2 4","FBB","FAVORI BANQUIER","HAUTE",56]
[12,{"$f":"IF(Musique!F13=\"\",\"\",IF(Musique!F13=0,10,Musique!F13))","v":""},{"$f":"IF(Musique!G13=\"\",\"\",IF(Musique!G13=0,10,Musique!G13))","v":""},{"$f":"IF(Musique!H13=\"\",\"\",IF(Musique!H13=0,10,Musique!H13))","v":""},{"$f":"IF(Musique!I13=\"\",\"\",IF(Musique!I13=0,10,Musique!I13))","v":""},{"$f":"IF(Musique!J13=\"\",\"\",IF(Musique!J13=0,10,Musique!J13))","v":""},{"$f":"IF(Musique!K13=\"\",\"\",IF(Musique!K13=0,10,Musique!K13))","v":""},"","",null,null,null,null,null,null,null,null,null,null,null,null,null,null,null,null,null,null,null,null,null,null,null,null,null,null,null,null,null,null,null,null,null,null,null,null,null,null,null,null,null,null,null,null,null,null,null,null,null,null,null,null,null,null,null,null,null,null,null,null,245,"2 4 5","FOF_2","FAVORI SUR OUT OF FORM","MÉDIUM",153]
[13,{"$f":"IF(Musique!F14=\"\",\"\",IF(Musique!F14=0,10,Musique!F14))","v":""},{"$f":"IF(Musique!G14=\"\",\"\",IF(Musique!G14=0,10,Musique!G14))","v":""},{"$f":"IF(Musique!H14=\"\",\"\",IF(Musique!H14=0,10,Musique!H14))","v":""},{"$f":"IF(Musique!I14=\"\",\"\",IF(Musique!I14=0,10,Musique!I14))","v":""},{"$f":"IF(Musique!J14=\"\",\"\",IF(Musique!J14=0,10,Musique!J14))","v":""},{"$f":"IF(Musique!K14=\"\",\"\",IF(Musique!K14=0,10,Musique!K14))","v":""},"","",null,null,null,null,null,null,null,null,null,null,null,null,null,null,null,null,null,null,null,null,null,null,null,null,null,null,null,null,null,null,null,null,null,null,null,null,null,null,null,null,null,null,null,null,null,null,null,null,null,null,null,null,null,null,null,null,null,null,null,null,250,"0 2 5","FBB","FAVORI BANQUIER",null,56]
[14,{"$f":"IF(Musique!F15=\"\",\"\",IF(Musique!F15=0,10,Musique!F15))","v":""},{"$f":"IF(Musique!G15=\"\",\"\",IF(Musique!G15=0,10,Musique!G15))","v":""},{"$f":"IF(Musique!H15=\"\",\"\",IF(Musique!H15=0,10,Musique!H15))","v":""},{"$f":"IF(Musique!I15=\"\",\"\",IF(Musique!I15=0,10,Musique!I15))","v":""},{"$f":"IF(Musique!J15=\"\",\"\",IF(Musique!J15=0,10,Musique!J15))","v":""},{"$f":"IF(Musique!K15=\"\",\"\",IF(Musique!K15=0,10,Musique!K15))","v":""},"","",null,null,null,null,null,null,null,null,null,null,null,null,null,null,null,null,null,null,null,null,null,null,null,null,null,null,null,null,null,null,null,null,null,null,null,null,null,null,null,null,null,null,null,null,null,null,null,null,null,null,null,null,null,null,null,null,null,null,null,null,340,"0 3 4","FBB","FAVORI BANQUIER",null,58]
[15,{"$f":"IF(Musique!F16=\"\",\"\",IF(Musique!F16=0,10,Musique!F16))","v":""},{"$f":"IF(Musique!G16=\"\",\"\",IF(Musique!G16=0,10,Musique!G16))","v":""},{"$f":"IF(Musique!H16=\"\",\"\",IF(Musique!H16=0,10,Musique!H16))","v":""},{"$f":"IF(Musique!I16=\"\",\"\",IF(Musique!I16=0,10,Musique!I16))","v":""},{"$f":"IF(Musique!J16=\"\",\"\",IF(Musique!J16=0,10,Musique!J16))","v":""},{"$f":"IF(Musique!K16=\"\",\"\",IF(Musique!K16=0,10,Musique!K16))","v":""},"","",null,null,null,null,null,null,null,null,null,null,null,null,null,null,null,null,null,null,null,null,null,null,null,null,null,null,null,null,null,null,null,null,null,null,null,null,null,null,null,null,null,null,null,null,null,null,null,null,null,null,null,null,null,null,null,null,null,null,null,null,345,"3 4 5","FAV","FAVORI MAJORANT","HAUTE",220]
[16,{"$f":"IF(Musique!F17=\"\",\"\",IF(Musique!F17=0,10,Musique!F17))","v":""},{"$f":"IF(Musique!G17=\"\",\"\",IF(Musique!G17=0,10,Musique!G17))","v":""},{"$f":"IF(Musique!H17=\"\",\"\",IF(Musique!H17=0,10,Musique!H17))","v":""},{"$f":"IF(Musique!I17=\"\",\"\",IF(Musique!I17=0,10,Musique!I17))","v":""},{"$f":"IF(Musique!J17=\"\",\"\",IF(Musique!J17=0,10,Musique!J17))","v":""},{"$f":"IF(Musique!K17=\"\",\"\",IF(Musique!K17=0,10,Musique!K17))","v":""},"","",null,null,null,null,null,null,null,null,null,null,null,null,null,null,null,null,null,null,null,null,null,null,null,null,null,null,null,null,null,null,null,null,null,null,null,null,null,null,null,null,null,null,null,null,null,null,null,null,null,null,null,null,null,null,null,null,null,null,null,null,350,"0 3 5","FBB","FAVORI BANQUIER","MAJORANT",68]
[17,{"$f":"IF(Musique!F18=\"\",\"\",IF(Musique!F18=0,10,Musique!F18))","v":""},{"$f":"IF(Musique!G18=\"\",\"\",IF(Musique!G18=0,10,Musique!G18))","v":""},{"$f":"IF(Musique!H18=\"\",\"\",IF(Musique!H18=0,10,Musique!H18))","v":""},{"$f":"IF(Musique!I18=\"\",\"\",IF(Musique!I18=0,10,Musique!I18))","v":""},{"$f":"IF(Musique!J18=\"\",\"\",IF(Musique!J18=0,10,Musique!J18))","v":""},{"$f":"IF(Musique!K18=\"\",\"\",IF(Musique!K18=0,10,Musique!K18))","v":""},"","",null,null,null,null,null,null,null,null,null,null,null,null,null,null,null,null,null,null,null,null,null,null,null,null,null,null,null,null,null,null,null,null,null,null,null,null,null,null,null,null,null,null,null,null,null,null,null,null,null,null,null,null,null,null,null,null,null,null,null,null,450,"0 4 5","FBB","FAVORI BANQUIER","AUTRE",118]
[18,{"$f":"IF(Musique!F19=\"\",\"\",IF(Musique!F19=0,10,Musique!F19))","v":""},{"$f":"IF(Musique!G19=\"\",\"\",IF(Musique!G19=0,10,Musique!G19))","v":""},{"$f":"IF(Musique!H19=\"\",\"\",IF(Musique!H19=0,10,Musique!H19))","v":""},{"$f":"IF(Musique!I19=\"\",\"\",IF(Musique!I19=0,10,Musique!I19))","v":""},{"$f":"IF(Musique!J19=\"\",\"\",IF(Musique!J19=0,10,Musique!J19))","v":""},{"$f":"IF(Musique!K19=\"\",\"\",IF(Musique!K19=0,10,Musique!K19))","v":""},"","",null,null,null,null,null,null,null,null,null,null,null,null,null,null,null,null,null,null,null,null,null,null,null,null,null,null,null,null,null,null,null,null,null,null,null,null,null,null,null,null,null,null,null,null,null,null,null,null,null,null,null,null,null,null,null,null,null,null,null,null,1230,"0 1 2 3","OGO_2","GROS OUTSIDERS ",null,96]
[19,{"$f":"IF(Musique!F20=\"\",\"\",IF(Musique!F20=0,10,Musique!F20))","v":""},{"$f":"IF(Musique!G20=\"\",\"\",IF(Musique!G20=0,10,Musique!G20))","v":""},{"$f":"IF(Musique!H20=\"\",\"\",IF(Musique!H20=0,10,Musique!H20))","v":""},{"$f":"IF(Musique!I20=\"\",\"\",IF(Musique!I20=0,10,Musique!I20))","v":""},{"$f":"IF(Musique!J20=\"\",\"\",IF(Musique!J20=0,10,Musique!J20))","v":""},{"$f":"IF(Musique!K20=\"\",\"\",IF(Musique!K20=0,10,Musique!K20))","v":""},"","",null,null,null,null,null,null,null,null,null,null,null,null,null,null,null,null,null,null,null,null,null,null,null,null,null,null,null,null,null,null,null,null,null,null,null,null,null,null,null,null,null,null,null,null,null,null,null,null,null,null,null,null,null,null,null,null,null,null,null,null,1234,"1 2 3 4","OGO_1","GROS OUTSIDERS ",null,124]
[20,{"$f":"IF(Musique!F21=\"\",\"\",IF(Musique!F21=0,10,Musique!F21))","v":""},{"$f":"IF(Musique!G21=\"\",\"\",IF(Musique!G21=0,10,Musique!G21))","v":""},{"$f":"IF(Musique!H21=\"\",\"\",IF(Musique!H21=0,10,Musique!H21))","v":""},{"$f":"IF(Musique!I21=\"\",\"\",IF(Musique!I21=0,10,Musique!I21))","v":""},{"$f":"IF(Musique!J21=\"\",\"\",IF(Musique!J21=0,10,Musique!J21))","v":""},{"$f":"IF(Musique!K21=\"\",\"\",IF(Musique!K21=0,10,Musique!K21))","v":""},"","",null,null,null,null,null,null,null,null,null,null,null,null,null,null,null,null,null,null,null,null,null,null,null,null,null,null,null,null,null,null,null,null,null,null,null,null,null,null,null,null,null,null,null,null,null,null,null,null,null,null,null,null,null,null,null,null,null,null,null,null,1235,"1 2 3 5","ODE_2","OUTSIDER DÉGRADÉ","MAJORANT",129]
[null,null,null,null,null,null,null,null,null,null,null,null,null,null,null,null,null,null,null,null,null,null,null,null,null,null,null,null,null,null,null,null,null,null,null,null,null,null,null,null,null,null,null,null,null,null,null,null,null,null,null,null,null,null,null,null,null,null,null,null,null,null,null,null,null,null,null,null,null,1240,"0 1 2 4","OFB_1","OUTSIDER DÉGRADÉ","MINORANT",25]
[null,null,null,null,null,null,null,null,null,null,null,null,null,null,null,null,null,null,null,null,null,null,null,null,null,null,null,null,null,null,null,null,null,null,null,null,null,null,null,null,null,null,null,null,null,null,null,null,null,null,null,null,null,null,null,null,null,null,null,null,null,null,null,null,null,null,null,null,null,1245,"1 2 4 5","ODE_1","AUTRE","AUTRE",126]
["SF",null,null,null,null,null,null,null,null,null,null,null,null,null,null,null,null,null,null,null,null,null,null,null,null,null,null,null,null,null,null,null,null,null,null,null,null,null,null,null,null,null,null,null,null,null,null,null,null,null,null,null,null,null,null,null,null,null,null,null,null,null,null,null,null,null,null,null,null,1250,"0 1 2 5","OFB_1","OUTSIDERS FAVORIS",null,46]
[1,{"$f":"IF(L2>4,0,L2)","v":4},{"$f":"IF(M2>4,0,M2)","v":0},{"$f":"IF(N2>4,0,N2)","v":4},{"$f":"IF(O2>4,0,O2)","v":0},{"$f":"IF(P2>4,0,P2)","v":4},{"$f":"IF(Q2>4,0,Q2)","v":2},{"$f":"B49&C49","v":"40"},{"$f":"INDEX($C$71:$D$95,MATCH(VALUE(H49),$C$71:$C$95,0),2)","v":3},null,null,null,null,null,null,null,null,null,null,null,null,null,null,null,null,null,null,null,null,null,null,null,null,null,null,null,null,null,null,null,null,null,null,null,null,null,null,null,null,null,null,null,null,null,null,null,null,null,null,null,null,null,null,null,null,null,null,null,null,1340,"0 1 3 4","OFB_1","OUTSIDERS FAVORIS","AUTRE",31]
[2,0,1,0,0,3,3,{"$f":"B50&C50","v":"01"},{"$f":"INDEX($C$71:$D$95,MATCH(VALUE(H50),$C$71:$C$95,0),2)","v":7},null,null,null,null,null,null,null,null,null,null,null,null,null,null,null,null,null,null,null,null,null,null,null,null,null,null,null,null,null,null,null,null,null,null,null,null,null,null,null,null,null,null,null,null,null,null,null,null,null,null,null,null,null,null,null,null,null,null,null,null,1345,"1 3 4 5","ODE_1","OUTSIDER DÉGRADÉ","AUTRE",151]
[3,0,0,0,3,0,4,"00",0,null,null,null,null,null,null,null,null,null,null,null,null,null,null,null,null,null,null,null,null,null,null,null,null,null,null,null,null,null,null,null,null,null,null,null,null,null,null,null,null,null,null,null,null,null,null,null,null,null,null,null,null,null,null,null,null,null,null,null,null,1350,"0 1 3 5","OFB_1","OUTSIDER DÉGRADÉ",null,34]
[4,3,2,0,2,0,0,"32",7,null,null,null,null,null,null,null,null,null,null,null,null,null,null,null,null,null,null,null,null,null,null,null,null,null,null,null,null,null,null,null,null,null,null,null,null,null,null,null,null,null,null,null,null,null,null,null,null,null,null,null,null,null,null,null,null,null,null,null,null,1450,"0 1 4 5","OFB_1","OUTSIDER DÉGRADÉ",null,57]
[5,1,0,0,0,0,1,"10",7,null,null,null,null,null,null,null,null,null,null,null,null,null,null,null,null,null,null,null,null,null,null,null,null,null,null,null,null,null,null,null,null,null,null,null,null,null,null,null,null,null,null,null,null,null,null,null,null,null,null,null,null,null,null,null,null,null,null,null,null,2340,"0 2 3 4","FBB","FAVORI BANQUIER","HAUTE",118]
[6,2,0,0,0,0,0,"20",5,null,null,null,null,null,null,null,null,null,null,null,null,null,null,null,null,null,null,null,null,null,null,null,null,null,null,null,null,null,null,null,null,null,null,null,null,null,null,null,null,null,null,null,null,null,null,null,null,null,null,null,null,null,null,null,null,null,null,null,null,2345,"2 3 4 5","FGO_2","FAVORI GROS OUTSIDERS","MÉDIUM",224]
[7,0,1,0,3,0,0,"01",7,null,null,null,null,null,null,null,null,null,null,null,null,null,null,null,null,null,null,null,null,null,null,null,null,null,null,null,null,null,null,null,null,null,null,null,null,null,null,null,null,null,null,null,null,null,null,null,null,null,null,null,null,null,null,null,null,null,null,null,null,2350,"0 2 3 5","FBB","FAVORI BANQUIER",null,50]
[8,0,0,1,2,0,4,"00",0,null,null,null,null,null,null,null,null,null,null,null,null,null,null,null,null,null,null,null,null,null,null,null,null,null,null,null,null,null,null,null,null,null,null,null,null,null,null,null,null,null,null,null,null,null,null,null,null,null,null,null,null,null,null,null,null,null,null,null,null,2450,"0 2 4 5","FBB","FAVORI BANQUIER",null,58]
[9,2,1,0,0,3,1,"21",9,null,null,null,null,null,null,null,null,null,null,null,null,null,null,null,null,null,null,null,null,null,null,null,null,null,null,null,null,null,null,null,null,null,null,null,null,null,null,null,null,null,null,null,null,null,null,null,null,null,null,null,null,null,null,null,null,null,null,null,null,3450,"0 3 4 5","FBB","FAVORI BANQUIER","AUTRE",111]
[10,4,3,0,0,4,0,"43",5,null,null,null,null,null,null,null,null,null,null,null,null,null,null,null,null,null,null,null,null,null,null,null,null,null,null,null,null,null,null,null,null,null,null,null,null,null,null,null,null,null,null,null,null,null,null,null,null,null,null,null,null,null,null,null,null,null,null,null,null,12340,"0 1 2 3 4","OGB","GROS OUTSIDERS ",null,48]
[11,0,0,0,0,0,0,"00",0,null,null,null,null,null,null,null,null,null,null,null,null,null,null,null,null,null,null,null,null,null,null,null,null,null,null,null,null,null,null,null,null,null,null,null,null,null,null,null,null,null,null,null,null,null,null,null,null,null,null,null,null,null,null,null,null,null,null,null,null,12345,"1 2 3 4 5","OGO_0","GROS OUTSIDERS ","MAJORANT",196]
[12,0,0,0,0,0,0,"00",0,null,null,null,null,null,null,null,null,null,null,null,null,null,null,null,null,null,null,null,null,null,null,null,null,null,null,null,null,null,null,null,null,null,null,null,null,null,null,null,null,null,null,null,null,null,null,null,null,null,null,null,null,null,null,null,null,null,null,null,null,12350,"0 1 2 3 5","OGB","FAVORI BANQUIER",null,50]
[13,0,0,0,0,0,0,"00",0,null,null,null,null,null,null,null,null,null,null,null,null,null,null,null,null,null,null,null,null,null,null,null,null,null,null,null,null,null,null,null,null,null,null,null,null,null,null,null,null,null,null,null,null,null,null,null,null,null,null,null,null,null,null,null,null,null,null,null,null,12450,"0 1 2 4 5","OFB_1","OUTSIDERS FAVORIS",null,48]
[14,0,0,0,0,0,0,"00",0,null,null,null,null,null,null,null,null,null,null,null,null,null,null,null,null,null,null,null,null,null,null,null,null,null,null,null,null,null,null,null,null,null,null,null,null,null,null,null,null,null,null,null,null,null,null,null,null,null,null,null,null,null,null,null,null,null,null,null,null,13450,"0 1 3 4 5","OFB_1","OUTSIDER DÉGRADÉ","MINORANT",66]
[15,0,0,0,0,0,0,"00",0,null,null,null,null,null,null,null,null,null,null,null,null,null,null,null,null,null,null,null,null,null,null,null,null,null,null,null,null,null,null,null,null,null,null,null,null,null,null,null,null,null,null,null,null,null,null,null,null,null,null,null,null,null,null,null,null,null,null,null,null,23450,"0 2 3 4 5","FBB","FAVORI BANQUIER","HAUTE",104]
[16,0,0,0,0,0,0,"00",0,null,null,null,null,null,null,null,null,null,null,null,null,null,null,null,null,null,null,null,null,null,null,null,null,null,null,null,null,null,null,null,null,null,null,null,null,null,null,null,null,null,null,null,null,null,null,null,null,null,null,null,null,null,null,null,null,null,null,null,null,123450,"0 1 2 3 4 5","OGO_0","GROS OUTSIDERS ","HAUTE",142]
[17,0,0,0,0,0,0,"00",0]
[18,0,0,0,0,0,0,"00",0]
[19,0,0,0,0,0,0,"00",0]
[20,0,0,0,0,0,0,"00",0]
[]
[]
[null,1,11,10]
[null,2,21,9]
[null,3,12,9]
[null,4,31,8]
[null,5,13,8]
[null,6,41,8]
[null,7,14,8]
[null,8,22,8]
[null,9,1,7]
[null,10,10,7]
[null,11,32,7]
[null,12,23,7]
[null,13,42,6]
[null,14,24,6]
[null,15,33,6]
[null,16,2,5]
[null,17,20,5]
[null,18,43,5]
[null,19,34,5]
[null,20,3,4]
[null,21,30,4]
[null,22,44,4]
[null,23,4,3]
[null,24,40,3]
[null,25,0,0]
[]
[null,{"$f":"IF(L2=\"\",\"\",IF(L2=0,10,L2))","v":4},10,4,10,4,2]
[null,{"$f":"IF(L3=\"\",\"\",IF(L3=0,10,L3))","v":10},{"$f":"IF(M3=\"\",\"\",IF(M3=0,10,M3))","v":1},{"$f":"IF(N3=\"\",\"\",IF(N3=0,10,N3))","v":9},{"$f":"IF(O3=\"\",\"\",IF(O3=0,10,O3))","v":7},{"$f":"IF(P3=\"\",\"\",IF(P3=0,10,P3))","v":3},{"$f":"IF(Q3=\"\",\"\",IF(Q3=0,10,Q3))","v":3}]
[null,7,5,10,3,6,4]
[null,3,2,10,2,10,6]
[null,1,10,7,10,7,1]
[null,2,10,6,10,7,9]
[null,10,1,10,3,10,6]
[null,10,10,1,2,10,4]
[null,2,1,10,10,3,1]
[null,4,3,6,10,4,8]
[null,"","","","","",""]
[null,"","","","","",""]
[null,"","","","","",""]
[null,"","","","","",""]
[null,"","","","","",""]
[null,{"$f":"IF(L17=\"\",\"\",IF(L17=0,10,L17))","v":""},"","","","",""]
[null,"","","","","",""]
[null,"","","","","",""]
[null,"","","","","",""]
[null,"","","","","",""]
[null,"","","","","",""]
[null,"Vgap"]
[null,0,"Très bon_1"]
[null,1,"Très bon_2"]
[null,2,"Très bon_3"]
[null,3,"Semi-tocard_1"]
[null,4,"Semi-tocard_2"]
[null,5,"Tocard_1"]
[null,6,"Tocard_2"]

{"sheet":"à corriger","index":1,"n_rows":65,"n_cols":24,"rows_kept":65,"cut":false,"hidden":false,"merged":[[0,1,0,5],[0,9,0,13],[0,17,0,21]]}
[null,"Correspondances FHC",null,null,null,null,"GapForm","Bin ","Bin","Correspondances FHC",null,null,null,null,"GapForm","Bin ",null,"Correspondances FHC",null,null,null,null,"GapForm","Bin "]
[null,0,"0","FBS","CAS SPÉCIAL","CAS SPÉCIAL",17,10]
[null,1,"1","OFV","OUTSIDER FAVORIS","BANQUIER",40,11,null,1,"1","OFB_2","OUTSIDER FAVORIS","BANQUIER",31,1]
[null,2,"2","FOF_1","FAVORI SUR OUT OF FORM","MINORANT",23,2,null,2,"2","FBB","FAVORI","MINORANT",31,12]
[null,3,"3","FAV","FAVORI","AUTRE",22,3,null,3,"3","FBB","FAVORI","AUTRE",56,13]
[null,4,"4","FAV","FAVORI","AUTRE",35,4,null,4,"4","FBB","FAVORI","AUTRE",57,14]
[null,5,"5","FBB","FAVORI","AUTRE",78,15,17,5,"5","FAV","FAVORI","AUTRE",44,5]
[null,10,"0 1","OFV","OUTSIDERS FAVORIS",null,40,11]
[null,12,"1 2","OFV","OUTSIDERS FAVORIS","MÉDIUM",58,3,null,12,12,"OFB_1",null,null,null,24,13]
[null,13,"1 3","OFB-1","OUTSIDERS FAVORIS",null,35,14,null,13,"1 3","OFV","OUTSIDERS FAVORIS",null,56,4,null,13,"1 3","OFV","OUTSIDERS FAVORIS",null,53,4]
[null,14,"1 4","OFV","OUTSIDERS FAVORIS","AUTRE",84,5,null,14,"1 4","OFB_1","OUTSIDERS FAVORIS","AUTRE",37,6,15]
[null,15,"1 5","FBB","OUTSIDERS FAVORIS",null,78,6,null,15,"1 5","OFV","OUTSIDERS FAVORIS",null,98,6,null,15,"1 5","OFB_1","OUTSIDERS FAVORIS",null,50,16]
[null,20,"0 2","FBB","FAVORI BANQUIER",null,31,12]
[null,23,"2 3","FBB","FAVORI GROS OUTSIDERS","MINORANT",26,15,null,23,"2 3","FGO_1","FAVORI GROS OUTSIDERS","MINORANT",69,5]
[null,24,"2 4","FBB","FAVORI SUR OUT OF FORM","MÉDIUM",39,16,null,24,"2 4","FOF_2","FAVORI SUR OUT OF FORM","MÉDIUM",63,6]
[null,25,"2 5","FBB","FAVORI SUR OUT OF FORM","MÉDIUM",56,17,null,25,"2 5","FOF_2","FAVORI SUR OUT OF FORM","MÉDIUM",88,7]
[null,30,"0 3","FBB","FAVORI BANQUIER","AUTRE",56,13]
[null,34,"3 4","FAV","FAVORI","AUTRE",96,7,null,34,"3 4","FBB","FAVORI","AUTRE",58,17]
[null,35,"3 5","FAV","FAVORI","AUTRE",135,8,null,35,"3 5","FBB","FAVORI","AUTRE",68,18,17]
[null,40,"0 4","FBB","FAVORI BANQUIER","AUTRE",57,14]
[null,45,"4 5","FBB","AUTRE","AUTRE",118,19,null,45,"4 5","FAV","AUTRE","AUTRE",122,9]
[null,50,"0 5","FBB","FAVORI BANQUIER","AUTRE",118,19,9,50,"0 5","FBB","FAVORI BANQUIER","AUTRE",78,15]
[null,120,"0 1 2","OFB_1","OUTSIDER DÉGRADÉ","MINORANT",24,13]
[null,123,"1 2 3","OGO_2","GROS OUTSIDERS ","MAJORANT",96,6,null,123,"1 2 3","OGO_2","GROS OUTSIDERS ","MAJORANT",32,16]
[null,124,"1 2 4","OFB-1","OUTSIDER DÉGRADÉ","MINORANT",25,17,null,124,"1 2 4","ODE_1","OUTSIDER DÉGRADÉ","MINORANT",87,7]
[null,125,"1 2 5","ODE_3","OUTSIDER DÉGRADÉ",null,112,8,null,125,"1 2 5","OFB_1","OUTSIDER DÉGRADÉ",null,46,18]
[null,130,"0 1 3","OFB_1","OUTSIDERS FAVORIS",null,35]
[null,134,"1 3 4","ODE_1","OUTSIDER DÉGRADÉ","MINORANT",83,8,null,134,"1 3 4","OFB_1","OUTSIDER DÉGRADÉ","MINORANT",31,18]
[null,135,"1 3 5","ODE_3","OUTSIDER DÉGRADÉ",null,102,9,null,135,"1 3 5","OFB_1","OUTSIDER DÉGRADÉ",null,34,19]
[null,140,"0 1 4","OFB_1","OUTSIDERS FAVORIS",null,37,15]
[null,145,"1 4 5","ODE_3","OUTSIDER DÉGRADÉ",null,143,10,null,145,"1 4 5","OFB_1","OUTSIDER DÉGRADÉ",null,57,20]
[null,150,"0 1 5","OFB_1","OUTSIDERS FAVORIS",null,50,16]
[null,230,"0 2 3","FBB","FAVORI BANQUIER","HAUTE",26]
[null,234,"2 3 4","FGO_2","FAVORI GROS OUTSIDERS","MÉDIUM",95,9,null,234,"2 3 4","FBB","FAVORI GROS OUTSIDERS","MÉDIUM",36,19]
[null,235,"2 3 5","FGO_2","FAVORI GROS OUTSIDERS","MÉDIUM",117,10,null,235,"2 3 5","FBB","FAVORI GROS OUTSIDERS","MÉDIUM",50,20]
[null,240,"0 2 4","FBB","FAVORI BANQUIER","HAUTE",39,16]
[null,245,"2 4 5","FOF_2","FAVORI SUR OUT OF FORM","MÉDIUM",153,11,null,245,"2 4 5","FBB","FAVORI SUR OUT OF FORM","MÉDIUM",58,21]
[null,250,"0 2 5","FBB","FAVORI BANQUIER",null,56]
[null,340,"0 3 4","FBB","FAVORI BANQUIER",null,58,17]
[null,345,"3 4 5","FAV","FAVORI MAJORANT","HAUTE",220,12,null,345,"3 4 5","FBB","FAVORI MAJORANT","HAUTE",111,22]
[null,350,"0 3 5","FGO-2","FAVORI BANQUIER","MAJORANT",224,18]
[null,450,"0 4 5","FBB","FAVORI BANQUIER","AUTRE",118,19]
[null,1230,"0 1 2 3","OGO_2","GROS OUTSIDERS ",null,96]
[null,1234,"1 2 3 4","OGB","GROS OUTSIDERS ",null,48,20,null,1234,"1 2 3 4","OGO_1","GROS OUTSIDERS ",null,124,10]
[null,1235,"1 2 3 5","ODE_2","OUTSIDER DÉGRADÉ","MAJORANT",129,11]
[null,1240,"0 1 2 4","OFB_1","OUTSIDER DÉGRADÉ","MINORANT",25]
[null,1245,"1 2 4 5","ODE_1","AUTRE","AUTRE",126,12,null,1245,"1 2 4 5","OFB_1","AUTRE","AUTRE",46,22]
[null,1250,"0 1 2 5","OFB_1","OUTSIDERS FAVORIS",null,46]
[null,1340,"0 1 3 4","OFB_1","OUTSIDERS FAVORIS","AUTRE",31]
[null,1345,"1 3 4 5","ODE_1","OUTSIDER DÉGRADÉ","AUTRE",151,13]
[null,1350,"0 1 3 5","OFB_1","OUTSIDER DÉGRADÉ",null,34,19]
[null,1450,"0 1 4 5","OFB_1","OUTSIDER DÉGRADÉ",null,57]
[null,2340,"0 2 3 4","FBB","FAVORI BANQUIER","HAUTE",118]
[null,2345,"2 3 4 5","FGO_2","FAVORI GROS OUTSIDERS","MÉDIUM",224,14,null,2345,"2 3 4 5","????",null,null,"????",24]
[null,2350,"0 2 3 5","FBB","FAVORI BANQUIER",null,50]
[null,2450,"0 2 4 5","FBB","FAVORI BANQUIER",null,58]
[null,3450,"0 3 4 5","FBB","FAVORI BANQUIER","AUTRE",111]
[null,12340,"0 1 2 3 4","OGB","GROS OUTSIDERS ",null,48]
[null,12345,"1 2 3 4 5","OGO_0","GROS OUTSIDERS ","MAJORANT",196,15,null,12345,"1 2 3 4 5","OGO_0","GROS OUTSIDERS ","MAJORANT",142,25]
[null,12350,"0 1 2 3 5","OFB_1","FAVORI BANQUIER",null,50,21]
[null,12450,"0 1 2 4 5","OFB_1","OUTSIDERS FAVORIS",null,48]
[null,13450,"0 1 3 4 5","OFB_1","OUTSIDER DÉGRADÉ","MINORANT",66,23]
[null,23450,"0 2 3 4 5","FBB","FAVORI BANQUIER","HAUTE",104,24]
[null,123450,"0 1 2 3 4 5","OGO_0","GROS OUTSIDERS ","HAUTE",142,25,null,null,"SURTOUT CHEZ LES INEDIT"]
[null,"RIEN","RIEN","FBS",null,null,17,10,null,"RIEN","RIEN","FBB",null,null,2,0]

{"sheet":"Résumé","index":2,"n_rows":164,"n_cols":29,"rows_kept":164,"cut":false,"hidden":false,"merged":[[1,17,1,18],[1,21,1,22],[1,25,1,26]]}
[null,null,null,null,null,null,null,null,null,null,null,null,null,null,null,null,null,{"$f":"IF(SUM(AB2,X2,T2)=0,\"\",SUM(AB2,X2,T2))","v":55}]
[null,"N°","Px","Cote","Sag","FHC","IdBF","RH","PW","GV","Bin","GF","LS","N°","Cheval",null,null,"Pi/Pi :",null,{"$f":"COUNTIF(R3:R150,\"*\")","v":36},null,"Pi/Ps :",null,{"$f":"COUNTIF(V3:V150,\"*\")","v":18},null,"Ps/Ps :",null,{"$f":"COUNTIF(Z3:Z150,\"*\")","v":1}]
[null,{"$f":"N3","v":3},{"$f":"IF(Musique!B4<>\"\",Synthèse!$R4,\"\")","v":6},{"$f":"IF(Musique!B4<>\"\",Synthèse!AV4,\"\")","v":0},{"$f":"IF(Musique!B4<>\"\",Musique!C4,\"\")","v":2875},{"$f":"IF(Musique!B4<>\"\",Synthèse!AC4,\"\")","v":"OFV"},{"$f":"IF(Musique!B4<>\"\",Synthèse!AD4,\"\")","v":1},{"$f":"IF(Musique!B4<>\"\",Synthèse!AA4,\"\")","v":30},{"$f":"IF(Musique!B4<>\"\",Synthèse!AS4,\"\")","v":0},{"$f":"IF(Musique!B4<>\"\",VALUE(Synthèse!$AJ4),\"\")","v":46},{"$f":"IF(Musique!B4<>\"\",Synthèse!V4,\"\")","v":3},{"$f":"Synthèse!AM4","v":58},{"$f":"IF(Musique!B4<>\"\",Synthèse!$T4,\"\")","v":110},{"$f":"Synthèse!$K4","v":3},{"$f":"IF(Musique!B4<>\"\",Musique!B4,\"\")","v":"ALTARE SI"},null,null,"8*6","51 + 52","FBB-FBB",103,"6*11","52 + 30","FBB-OGO_2",82,"11*3","30 + 10","OGO_2-ODE_1",40]
[null,1,{"$f":"IF(Musique!B2<>\"\",Synthèse!$R2,\"\")","v":6},{"$f":"IF(Musique!B2<>\"\",Synthèse!AV2,\"\")","v":0},{"$f":"IF(Musique!B2<>\"\",Musique!C2,\"\")","v":2875},{"$f":"IF(Musique!B2<>\"\",Synthèse!AC2,\"\")","v":"ODE_3"},{"$f":"IF(Musique!B2<>\"\",Synthèse!AD2,\"\")","v":3},{"$f":"IF(Musique!B2<>\"\",Synthèse!$AA$2,\"\")","v":40},{"$f":"IF(Musique!B2<>\"\",Synthèse!AS2,\"\")","v":0},{"$f":"IF(Musique!B2<>\"\",VALUE(Synthèse!$AJ2),\"\")","v":26},{"$f":"IF(Musique!B2<>\"\",Synthèse!V2,\"\")","v":9},{"$f":"Synthèse!AM2","v":102},{"$f":"IF(Musique!B2<>\"\",Synthèse!$T2,\"\")","v":114},{"$f":"Synthèse!$K2","v":1},{"$f":"IF(Musique!B2<>\"\",Musique!B2,\"\")","v":"SAON SECRET"},null,null,"6*5","52 + 51","FBB-FBB",103,"8*11","51 + 30","FBB-OGO_2",81]
[null,10,{"$f":"IF(Musique!B11<>\"\",Synthèse!$R11,\"\")","v":6},{"$f":"IF(Musique!B11<>\"\",Synthèse!AV11,\"\")","v":0},{"$f":"IF(Musique!B11<>\"\",Musique!C11,\"\")","v":2875},{"$f":"IF(Musique!B11<>\"\",Synthèse!AC11,\"\")","v":"ODE_3"},{"$f":"IF(Musique!B11<>\"\",Synthèse!AD11,\"\")","v":3},{"$f":"IF(Musique!B11<>\"\",Synthèse!AA11,\"\")","v":32},{"$f":"IF(Musique!B11<>\"\",Synthèse!AS11,\"\")","v":2},{"$f":"IF(Musique!B11<>\"\",VALUE(Synthèse!$AJ11),\"\")","v":36},{"$f":"IF(Musique!B11<>\"\",Synthèse!V11,\"\")","v":8},{"$f":"Synthèse!AM11","v":112},{"$f":"IF(Musique!B11<>\"\",Synthèse!$T11,\"\")","v":111},{"$f":"Synthèse!$K11","v":10},{"$f":"IF(Musique!B11<>\"\",Musique!B11,\"\")","v":"LE VALENTIN"},null,null,"6*1","52 + 51","FBB-FAV",103,"5*11","51 + 30","FBB-OGO_2",81]
[null,6,{"$f":"IF(Musique!B7<>\"\",Synthèse!$R7,\"\")","v":6},{"$f":"IF(Musique!B7<>\"\",Synthèse!AV7,\"\")","v":0},{"$f":"IF(Musique!B7<>\"\",Musique!C7,\"\")","v":2875},{"$f":"IF(Musique!B7<>\"\",Synthèse!AC7,\"\")","v":"ODE_1"},{"$f":"IF(Musique!B7<>\"\",Synthèse!AD7,\"\")","v":1},{"$f":"IF(Musique!B7<>\"\",Synthèse!AA7,\"\")","v":16},{"$f":"IF(Musique!B7<>\"\",Synthèse!AS7,\"\")","v":6},{"$f":"IF(Musique!B7<>\"\",VALUE(Synthèse!$AJ7),\"\")","v":56},{"$f":"IF(Musique!B7<>\"\",Synthèse!V7,\"\")","v":13},{"$f":"Synthèse!AM7","v":151},{"$f":"IF(Musique!B7<>\"\",Synthèse!$T7,\"\")","v":106},{"$f":"Synthèse!$K7","v":6},{"$f":"IF(Musique!B7<>\"\",Musique!B7,\"\")","v":"ORANGEFIELD"},null,null,"8*5","51 + 51","FBB-FBB",102,"1*11","51 + 30","FAV-OGO_2",81]
[null,4,{"$f":"IF(Musique!B5<>\"\",Synthèse!$R5,\"\")","v":6},{"$f":"IF(Musique!B5<>\"\",Synthèse!AV5,\"\")","v":0},{"$f":"IF(Musique!B5<>\"\",Musique!C5,\"\")","v":2875},{"$f":"IF(Musique!B5<>\"\",Synthèse!AC5,\"\")","v":"ODE_3"},{"$f":"IF(Musique!B5<>\"\",Synthèse!AD5,\"\")","v":3},{"$f":"IF(Musique!B5<>\"\",Synthèse!AA5,\"\")","v":37},{"$f":"IF(Musique!B5<>\"\",Synthèse!AS5,\"\")","v":7},{"$f":"IF(Musique!B5<>\"\",VALUE(Synthèse!$AJ5),\"\")","v":36},{"$f":"IF(Musique!B5<>\"\",Synthèse!V5,\"\")","v":10},{"$f":"Synthèse!AM5","v":143},{"$f":"IF(Musique!B5<>\"\",Synthèse!$T5,\"\")","v":115},{"$f":"Synthèse!$K5","v":4},{"$f":"IF(Musique!B5<>\"\",Musique!B5,\"\")","v":"LAIA CHOPE"},null,null,"8*1","51 + 51","FBB-FAV",102,"4*11","41 + 30","FAV-OGO_2",71]
[null,8,{"$f":"IF(Musique!B9<>\"\",Synthèse!$R9,\"\")","v":2},{"$f":"IF(Musique!B9<>\"\",Synthèse!AV9,\"\")","v":0},{"$f":"IF(Musique!B9<>\"\",Musique!C9,\"\")","v":2875},{"$f":"IF(Musique!B9<>\"\",Synthèse!AC9,\"\")","v":"FAV"},{"$f":"IF(Musique!B9<>\"\",Synthèse!AD9,\"\")","v":2},{"$f":"IF(Musique!B9<>\"\",Synthèse!AA9,\"\")","v":31},{"$f":"IF(Musique!B9<>\"\",Synthèse!AS9,\"\")","v":3},{"$f":"IF(Musique!B9<>\"\",VALUE(Synthèse!$AJ9),\"\")","v":36},{"$f":"IF(Musique!B9<>\"\",Synthèse!V9,\"\")","v":8},{"$f":"Synthèse!AM9","v":135},{"$f":"IF(Musique!B9<>\"\",Synthèse!$T9,\"\")","v":114},{"$f":"Synthèse!$K9","v":8},{"$f":"IF(Musique!B9<>\"\",Musique!B9,\"\")","v":"FRED LALLOUPET"},null,null,"5*1","51 + 51","FBB-FAV",102,"10*11","41 + 30","FAV-OGO_2",71]
[null,7,{"$f":"IF(Musique!B8<>\"\",Synthèse!$R8,\"\")","v":1},{"$f":"IF(Musique!B8<>\"\",Synthèse!AV8,\"\")","v":0},{"$f":"IF(Musique!B8<>\"\",Musique!C8,\"\")","v":2875},{"$f":"IF(Musique!B8<>\"\",Synthèse!AC8,\"\")","v":"FOF_2"},{"$f":"IF(Musique!B8<>\"\",Synthèse!AD8,\"\")","v":2},{"$f":"IF(Musique!B8<>\"\",Synthèse!AA8,\"\")","v":21},{"$f":"IF(Musique!B8<>\"\",Synthèse!AS8,\"\")","v":6},{"$f":"IF(Musique!B8<>\"\",VALUE(Synthèse!$AJ8),\"\")","v":46},{"$f":"IF(Musique!B8<>\"\",Synthèse!V8,\"\")","v":11},{"$f":"Synthèse!AM8","v":153},{"$f":"IF(Musique!B8<>\"\",Synthèse!$T8,\"\")","v":111},{"$f":"Synthèse!$K8","v":7},{"$f":"IF(Musique!B8<>\"\",Musique!B8,\"\")","v":"PUPA DI SARONNO"},null,null,"4*6","41 + 52","FAV-FBB",93,"9*11","33 + 30","FGO_2-OGO_2",63]
[null,2,{"$f":"IF(Musique!B3<>\"\",Synthèse!$R3,\"\")","v":1},{"$f":"IF(Musique!B3<>\"\",Synthèse!AV3,\"\")","v":0},{"$f":"IF(Musique!B3<>\"\",Musique!C3,\"\")","v":2875},{"$f":"IF(Musique!B3<>\"\",Synthèse!AC3,\"\")","v":"FOF_2"},{"$f":"IF(Musique!B3<>\"\",Synthèse!AD3,\"\")","v":2},{"$f":"IF(Musique!B3<>\"\",Synthèse!AA3,\"\")","v":31},{"$f":"IF(Musique!B3<>\"\",Synthèse!AS3,\"\")","v":6},{"$f":"IF(Musique!B3<>\"\",VALUE(Synthèse!$AJ3),\"\")","v":36},{"$f":"IF(Musique!B3<>\"\",Synthèse!V3,\"\")","v":11},{"$f":"Synthèse!AM3","v":153},{"$f":"IF(Musique!B3<>\"\",Synthèse!$T3,\"\")","v":114},{"$f":"Synthèse!$K3","v":2},{"$f":"IF(Musique!B3<>\"\",Musique!B3,\"\")","v":"SEA TRIAL"},null,null,"10*6","41 + 52","FAV-FBB",93,"6*3","52 + 10","FBB-ODE_1",62]
[null,9,{"$f":"IF(Musique!B10<>\"\",Synthèse!$R10,\"\")","v":1},{"$f":"IF(Musique!B10<>\"\",Synthèse!AV10,\"\")","v":0},{"$f":"IF(Musique!B10<>\"\",Musique!C10,\"\")","v":2875},{"$f":"IF(Musique!B10<>\"\",Synthèse!AC10,\"\")","v":"FAV"},{"$f":"IF(Musique!B10<>\"\",Synthèse!AD10,\"\")","v":2},{"$f":"IF(Musique!B10<>\"\",Synthèse!AA10,\"\")","v":42},{"$f":"IF(Musique!B10<>\"\",Synthèse!AS10,\"\")","v":12},{"$f":"IF(Musique!B10<>\"\",VALUE(Synthèse!$AJ10),\"\")","v":26},{"$f":"IF(Musique!B10<>\"\",Synthèse!V10,\"\")","v":9},{"$f":"Synthèse!AM10","v":122},{"$f":"IF(Musique!B10<>\"\",Synthèse!$T10,\"\")","v":121},{"$f":"Synthèse!$K10","v":9},{"$f":"IF(Musique!B10<>\"\",Musique!B10,\"\")","v":"PROPOSAL"},null,null,"4*8","41 + 51","FAV-FBB",92,"8*3","51 + 10","FBB-ODE_1",61]
[null,5,{"$f":"IF(Musique!B6<>\"\",Synthèse!$R6,\"\")","v":0},{"$f":"IF(Musique!B6<>\"\",Synthèse!AV6,\"\")","v":0},{"$f":"IF(Musique!B6<>\"\",Musique!C6,\"\")","v":2875},{"$f":"IF(Musique!B6<>\"\",Synthèse!AC6,\"\")","v":"FGO_2"},{"$f":"IF(Musique!B6<>\"\",Synthèse!AD6,\"\")","v":1},{"$f":"IF(Musique!B6<>\"\",Synthèse!AA6,\"\")","v":22},{"$f":"IF(Musique!B6<>\"\",Synthèse!AS6,\"\")","v":9},{"$f":"IF(Musique!B6<>\"\",VALUE(Synthèse!$AJ6),\"\")","v":46},{"$f":"IF(Musique!B6<>\"\",Synthèse!V6,\"\")","v":14},{"$f":"Synthèse!AM6","v":224},{"$f":"IF(Musique!B6<>\"\",Synthèse!$T6,\"\")","v":112},{"$f":"Synthèse!$K6","v":5},{"$f":"IF(Musique!B6<>\"\",Musique!B6,\"\")","v":"RUBY WEDDING"},null,null,"4*5","41 + 51","FAV-FBB",92,"2*11","31 + 30","FOF_2-OGO_2",61]
[null,"",{"$f":"IF(Musique!B12<>\"\",Synthèse!$R12,\"\")","v":""},{"$f":"IF(Musique!B12<>\"\",Synthèse!AV12,\"\")","v":""},{"$f":"IF(Musique!B12<>\"\",Musique!C12,\"\")","v":""},{"$f":"IF(Musique!B12<>\"\",Synthèse!AC12,\"\")","v":""},{"$f":"IF(Musique!B12<>\"\",Synthèse!AD12,\"\")","v":""},{"$f":"IF(Musique!B12<>\"\",Synthèse!AA12,\"\")","v":""},{"$f":"IF(Musique!B12<>\"\",Synthèse!AS12,\"\")","v":""},{"$f":"IF(Musique!B12<>\"\",VALUE(Synthèse!$AJ12),\"\")","v":""},{"$f":"IF(Musique!B12<>\"\",Synthèse!V12,\"\")","v":""},{"$f":"Synthèse!AM12","v":""},{"$f":"IF(Musique!B12<>\"\",Synthèse!$T12,\"\")","v":""},{"$f":"Synthèse!$K12","v":""},{"$f":"IF(Musique!B12<>\"\",Musique!B12,\"\")","v":""},null,null,"4*1","41 + 51","FAV-FAV",92,"5*3","51 + 10","FBB-ODE_1",61]
[null,"",{"$f":"IF(Musique!B20<>\"\",Synthèse!$R20,\"\")","v":""},{"$f":"IF(Musique!B20<>\"\",Synthèse!AV20,\"\")","v":""},{"$f":"IF(Musique!B20<>\"\",Musique!C20,\"\")","v":""},{"$f":"IF(Musique!B20<>\"\",Synthèse!AC20,\"\")","v":""},{"$f":"IF(Musique!B20<>\"\",Synthèse!AD20,\"\")","v":""},{"$f":"IF(Musique!B20<>\"\",Synthèse!AA20,\"\")","v":""},{"$f":"IF(Musique!B20<>\"\",Synthèse!AS20,\"\")","v":""},{"$f":"IF(Musique!B20<>\"\",VALUE(Synthèse!$AJ20),\"\")","v":""},{"$f":"IF(Musique!B20<>\"\",Synthèse!V20,\"\")","v":""},{"$f":"Synthèse!AM20","v":""},{"$f":"IF(Musique!B20<>\"\",Synthèse!$T20,\"\")","v":""},{"$f":"Synthèse!$K20","v":""},{"$f":"IF(Musique!B20<>\"\",Musique!B20,\"\")","v":""},null,null,"10*8","41 + 51","FAV-FBB",92,"1*3","51 + 10","FAV-ODE_1",61]
[null,"",{"$f":"IF(Musique!B21<>\"\",Synthèse!$R21,\"\")","v":""},{"$f":"IF(Musique!B21<>\"\",Synthèse!AV21,\"\")","v":""},{"$f":"IF(Musique!B21<>\"\",Musique!C21,\"\")","v":""},{"$f":"IF(Musique!B21<>\"\",Synthèse!AC21,\"\")","v":""},{"$f":"IF(Musique!B21<>\"\",Synthèse!AD21,\"\")","v":""},{"$f":"IF(Musique!B21<>\"\",Synthèse!AA21,\"\")","v":""},{"$f":"IF(Musique!B21<>\"\",Synthèse!AS21,\"\")","v":""},{"$f":"IF(Musique!B21<>\"\",VALUE(Synthèse!$AJ21),\"\")","v":""},{"$f":"IF(Musique!B21<>\"\",Synthèse!V21,\"\")","v":""},{"$f":"Synthèse!AM21","v":""},{"$f":"IF(Musique!B21<>\"\",Synthèse!$T21,\"\")","v":""},{"$f":"Synthèse!$K21","v":""},{"$f":"IF(Musique!B21<>\"\",Musique!B21,\"\")","v":""},null,null,"10*5","41 + 51","FAV-FBB",92,"7*11","31 + 30","FAV-OGO_2",61]
[null,"",{"$f":"IF(Musique!B19<>\"\",Synthèse!$R19,\"\")","v":""},{"$f":"IF(Musique!B19<>\"\",Synthèse!AV19,\"\")","v":""},{"$f":"IF(Musique!B19<>\"\",Musique!C19,\"\")","v":""},{"$f":"IF(Musique!B19<>\"\",Synthèse!AC19,\"\")","v":""},{"$f":"IF(Musique!B19<>\"\",Synthèse!AD19,\"\")","v":""},{"$f":"IF(Musique!B19<>\"\",Synthèse!AA19,\"\")","v":""},{"$f":"IF(Musique!B19<>\"\",Synthèse!AS19,\"\")","v":""},{"$f":"IF(Musique!B19<>\"\",VALUE(Synthèse!$AJ19),\"\")","v":""},{"$f":"IF(Musique!B19<>\"\",Synthèse!V19,\"\")","v":""},{"$f":"Synthèse!AM19","v":""},{"$f":"IF(Musique!B19<>\"\",Synthèse!$T19,\"\")","v":""},{"$f":"Synthèse!$K19","v":""},{"$f":"IF(Musique!B19<>\"\",Musique!B19,\"\")","v":""},null,null,"10*1","41 + 51","FAV-FAV",92,"4*3","41 + 10","FAV-ODE_1",51]
[null,"",{"$f":"IF(Musique!B18<>\"\",Synthèse!$R18,\"\")","v":""},{"$f":"IF(Musique!B18<>\"\",Synthèse!AV18,\"\")","v":""},{"$f":"IF(Musique!B18<>\"\",Musique!C18,\"\")","v":""},{"$f":"IF(Musique!B18<>\"\",Synthèse!AC18,\"\")","v":""},{"$f":"IF(Musique!B18<>\"\",Synthèse!AD18,\"\")","v":""},{"$f":"IF(Musique!B18<>\"\",Synthèse!AA18,\"\")","v":""},{"$f":"IF(Musique!B18<>\"\",Synthèse!AS18,\"\")","v":""},{"$f":"IF(Musique!B18<>\"\",VALUE(Synthèse!$AJ18),\"\")","v":""},{"$f":"IF(Musique!B18<>\"\",Synthèse!V18,\"\")","v":""},{"$f":"Synthèse!AM18","v":""},{"$f":"IF(Musique!B18<>\"\",Synthèse!$T18,\"\")","v":""},{"$f":"Synthèse!$K18","v":""},{"$f":"IF(Musique!B18<>\"\",Musique!B18,\"\")","v":""},null,null,"6*9","52 + 33","FBB-FGO_2",85,"10*3","41 + 10","FAV-ODE_1",51]
[null,"",{"$f":"IF(Musique!B17<>\"\",Synthèse!$R17,\"\")","v":""},{"$f":"IF(Musique!B17<>\"\",Synthèse!AV17,\"\")","v":""},{"$f":"IF(Musique!B17<>\"\",Musique!C17,\"\")","v":""},{"$f":"IF(Musique!B17<>\"\",Synthèse!AC17,\"\")","v":""},{"$f":"IF(Musique!B17<>\"\",Synthèse!AD17,\"\")","v":""},{"$f":"IF(Musique!B17<>\"\",Synthèse!AA17,\"\")","v":""},{"$f":"IF(Musique!B17<>\"\",Synthèse!AS17,\"\")","v":""},{"$f":"IF(Musique!B17<>\"\",VALUE(Synthèse!$AJ17),\"\")","v":""},{"$f":"IF(Musique!B17<>\"\",Synthèse!V17,\"\")","v":""},{"$f":"Synthèse!AM17","v":""},{"$f":"IF(Musique!B17<>\"\",Synthèse!$T17,\"\")","v":""},{"$f":"Synthèse!$K17","v":""},{"$f":"IF(Musique!B17<>\"\",Musique!B17,\"\")","v":""},null,null,"8*9","51 + 33","FBB-FGO_2",84,"9*3","33 + 10","FGO_2-ODE_1",43]
[null,"",{"$f":"IF(Musique!B16<>\"\",Synthèse!$R16,\"\")","v":""},{"$f":"IF(Musique!B16<>\"\",Synthèse!AV16,\"\")","v":""},{"$f":"IF(Musique!B16<>\"\",Musique!C16,\"\")","v":""},{"$f":"IF(Musique!B16<>\"\",Synthèse!AC16,\"\")","v":""},{"$f":"IF(Musique!B16<>\"\",Synthèse!AD16,\"\")","v":""},{"$f":"IF(Musique!B16<>\"\",Synthèse!AA16,\"\")","v":""},{"$f":"IF(Musique!B16<>\"\",Synthèse!AS16,\"\")","v":""},{"$f":"IF(Musique!B16<>\"\",VALUE(Synthèse!$AJ16),\"\")","v":""},{"$f":"IF(Musique!B16<>\"\",Synthèse!V16,\"\")","v":""},{"$f":"Synthèse!AM16","v":""},{"$f":"IF(Musique!B16<>\"\",Synthèse!$T16,\"\")","v":""},{"$f":"Synthèse!$K16","v":""},{"$f":"IF(Musique!B16<>\"\",Musique!B16,\"\")","v":""},null,null,"5*9","51 + 33","FBB-FGO_2",84,"2*3","31 + 10","FOF_2-ODE_1",41]
[null,"",{"$f":"IF(Musique!B15<>\"\",Synthèse!$R15,\"\")","v":""},{"$f":"IF(Musique!B15<>\"\",Synthèse!AV15,\"\")","v":""},{"$f":"IF(Musique!B15<>\"\",Musique!C15,\"\")","v":""},{"$f":"IF(Musique!B15<>\"\",Synthèse!AC15,\"\")","v":""},{"$f":"IF(Musique!B15<>\"\",Synthèse!AD15,\"\")","v":""},{"$f":"IF(Musique!B15<>\"\",Synthèse!AA15,\"\")","v":""},{"$f":"IF(Musique!B15<>\"\",Synthèse!AS15,\"\")","v":""},{"$f":"IF(Musique!B15<>\"\",VALUE(Synthèse!$AJ15),\"\")","v":""},{"$f":"IF(Musique!B15<>\"\",Synthèse!V15,\"\")","v":""},{"$f":"Synthèse!AM15","v":""},{"$f":"IF(Musique!B15<>\"\",Synthèse!$T15,\"\")","v":""},{"$f":"Synthèse!$K15","v":""},{"$f":"IF(Musique!B15<>\"\",Musique!B15,\"\")","v":""},null,null,"9*1","33 + 51","FGO_2-FAV",84,"7*3","31 + 10","FAV-ODE_1",41]
[null,"",{"$f":"IF(Musique!B14<>\"\",Synthèse!$R14,\"\")","v":""},{"$f":"IF(Musique!B14<>\"\",Synthèse!AV14,\"\")","v":""},{"$f":"IF(Musique!B14<>\"\",Musique!C14,\"\")","v":""},{"$f":"IF(Musique!B14<>\"\",Synthèse!AC14,\"\")","v":""},{"$f":"IF(Musique!B14<>\"\",Synthèse!AD14,\"\")","v":""},{"$f":"IF(Musique!B14<>\"\",Synthèse!AA14,\"\")","v":""},{"$f":"IF(Musique!B14<>\"\",Synthèse!AS14,\"\")","v":""},{"$f":"IF(Musique!B14<>\"\",VALUE(Synthèse!$AJ14),\"\")","v":""},{"$f":"IF(Musique!B14<>\"\",Synthèse!V14,\"\")","v":""},{"$f":"Synthèse!AM14","v":""},{"$f":"IF(Musique!B14<>\"\",Synthèse!$T14,\"\")","v":""},{"$f":"Synthèse!$K14","v":""},{"$f":"IF(Musique!B14<>\"\",Musique!B14,\"\")","v":""},null,null,"2*6","31 + 52","FOF_2-FBB",83]
[null,"",{"$f":"IF(Musique!B13<>\"\",Synthèse!$R13,\"\")","v":""},{"$f":"IF(Musique!B13<>\"\",Synthèse!AV13,\"\")","v":""},{"$f":"IF(Musique!B13<>\"\",Musique!C13,\"\")","v":""},{"$f":"IF(Musique!B13<>\"\",Synthèse!AC13,\"\")","v":""},{"$f":"IF(Musique!B13<>\"\",Synthèse!AD13,\"\")","v":""},{"$f":"IF(Musique!B13<>\"\",Synthèse!AA13,\"\")","v":""},{"$f":"IF(Musique!B13<>\"\",Synthèse!AS13,\"\")","v":""},{"$f":"IF(Musique!B13<>\"\",VALUE(Synthèse!$AJ13),\"\")","v":""},{"$f":"IF(Musique!B13<>\"\",Synthèse!V13,\"\")","v":""},{"$f":"Synthèse!AM13","v":""},{"$f":"IF(Musique!B13<>\"\",Synthèse!$T13,\"\")","v":""},{"$f":"Synthèse!$K13","v":""},{"$f":"IF(Musique!B13<>\"\",Musique!B13,\"\")","v":""},null,null,"6*7","52 + 31","FBB-FAV",83]
[null,null,null,null,null,null,null,null,null,null,null,null,null,null,null,null,null,"4*10","41 + 41","FAV-FAV",82]
[null,null,null,null,null,null,null,null,null,null,null,null,null,null,null,null,null,"8*2","51 + 31","FBB-FOF_2",82]
[null,null,null,null,null,"Arrivée :",{"$f":"IF(Synthèse!S23<>\"\",Synthèse!S23,\"\")","v":""},{"$f":"IF(Synthèse!T23<>\"\",Synthèse!T23,\"\")","v":""},{"$f":"IF(Synthèse!U23<>\"\",Synthèse!U23,\"\")","v":""},{"$f":"IF(Synthèse!V23<>\"\",Synthèse!V23,\"\")","v":""},{"$f":"IF(Synthèse!W23<>\"\",Synthèse!W23,\"\")","v":""},null,null,null,null,null,null,"8*7","51 + 31","FBB-FAV",82]
[null,null,null,null,null,null,null,null,null,null,null,null,null,null,null,null,null,"2*5","31 + 51","FOF_2-FBB",82]
[null,null,null,null,null,null,null,null,null,null,null,null,null,null,null,null,null,"2*1","31 + 51","FOF_2-FAV",82]
[null,null,null,null,null,null,null,null,null,null,null,null,null,null,null,null,null,"5*7","51 + 31","FBB-FAV",82]
[null,null,null,null,null,null,null,null,null,null,null,null,null,null,null,null,null,"1*7","51 + 31","FAV-FAV",82]
[null,null,null,null,null,null,null,null,null,null,null,null,null,null,null,null,null,"4*9","41 + 33","FAV-FGO_2",74]
[null,null,null,null,null,null,null,null,null,null,null,null,null,null,null,null,null,"10*9","41 + 33","FAV-FGO_2",74]
[null,null,null,null,null,null,null,null,null,null,null,null,null,null,null,null,null,"4*2","41 + 31","FAV-FOF_2",72]
[null,null,null,null,null,null,null,null,null,null,null,null,null,null,null,null,null,"4*7","41 + 31","FAV-FAV",72]
[null,null,null,null,null,null,null,null,null,null,null,null,null,null,null,null,null,"10*2","41 + 31","FAV-FOF_2",72]
[null,null,null,null,null,null,null,null,null,null,null,null,null,null,null,null,null,"10*7","41 + 31","FAV-FAV",72]
[null,null,null,null,null,null,null,null,null,null,null,null,null,null,null,null,null,"2*9","31 + 33","FOF_2-FGO_2",64]
[null,null,null,null,null,null,null,null,null,null,null,null,null,null,null,null,null,"9*7","33 + 31","FGO_2-FAV",64]
[null,null,null,null,null,null,null,null,null,null,null,null,null,null,null,null,null,"2*7","31 + 31","FOF_2-FAV",62]
[]
[]
[]
[]
[]
[]
[]
[]
[]
[]
[]
[]
[]
[]
[]
[]
[]
[]
[]
[]
[]
[]
[]
[]
[]
[]
[]
[]
[]
[]
[]
[]
[]
[]
[]
[]
[]
[]
[]
[]
[]
[]
[]
[]
[]
[]
[]
[]
[]
[]
[]
[]
[]
[]
[]
[]
[]
[]
[]
[]
[]
[]
[]
[]
[]
[]
[]
[]
[]
[]
[]
[]
[]
[]
[]
[]
[]
[]
[]
[]
[]
[]
[]
[]
[]
[]
[]
[]
[]
[]
[]
[]
[]
[]
[]
[]
[]
[]
[]
[]
[]
[]
[]
[]
[]
[]
[]
[]
[]
[]
[]
[]
[]
[null,null,"Px",null,null,null,null,null,null,null,"Px"]
[null,null,6,null,null,null,null,null,null,null,"<6"]
[]
[null,"N°","Px","Cote","Sag","FHC","IdBF","RH",null,"N°","Px","Cote","Sag","FHC","IdBF","RH"]
[null,11,6,0,"F6","OGO_2",1,30,null,4,5,0,"F5","FAV",4,41]
[null,3,6,0,"H4","ODE_1",1,10,null,10,5,0,"H6","FAV",4,41]
[null,null,null,null,null,null,null,null,null,8,2,0,"H7","FBB",3,51]
[null,null,null,null,null,null,null,null,null,2,2,0,"F4","FOF_2",1,31]
[null,null,null,null,null,null,null,null,null,6,1,0,"H8","FBB",3,52]
[null,null,null,null,null,null,null,null,null,5,1,0,"H7","FBB",3,51]
[null,null,null,null,null,null,null,null,null,9,0,0,"H4","FGO_2",1,33]
[null,null,null,null,null,null,null,null,null,1,0,0,"H8","FAV",4,51]
[null,null,null,null,null,null,null,null,null,7,0,0,"H7","FAV",4,31]

{"sheet":"Ps-Pi","index":3,"n_rows":27,"n_cols":26,"rows_kept":27,"cut":false,"hidden":false,"merged":[]}
[null,null,null,null,null,null,null,null,null,null,null,null,null,null,null,null,null,null,null,null,null,null,null,null,null,1]
[null,"Px","PK","N°","RH","Rg RH","FHC","ID","PW","vB%","S","   Pour une utilisation optimale de ce classeur,"]
[null,{"$f":"IF(C3=\"\",\"\",IF(C3=6,\"Ps\",\"Pi\"))","v":"Ps"},{"$f":"Résumé!C3","v":6},{"$f":"Résumé!B3","v":3},{"$f":"Résumé!H3","v":30},{"$f":"IF(D3<>\"\",VLOOKUP(D3,Synthèse!$Z$2:$AB$21,3,0),\"\")","v":4},{"$f":"Résumé!F3","v":"OFV"},{"$f":"Résumé!G3","v":1},{"$f":"Résumé!I3","v":0},{"$f":"IF(Résumé!K3<>\"\",1-(Résumé!K3/25),\"\")","v":0.88},{"$f":"LEFT(Résumé!E3,1)","v":"2"},"   veuillez cliquer sur le bouton « Nouvelle course »,"]
[null,{"$f":"IF(C4=\"\",\"\",IF(C4=6,\"Ps\",\"Pi\"))","v":"Ps"},{"$f":"Résumé!C4","v":6},{"$f":"Résumé!B4","v":1},{"$f":"Résumé!H4","v":40},{"$f":"IF(D4<>\"\",VLOOKUP(D4,Synthèse!$Z$2:$AB$21,3,0),\"\")","v":1},{"$f":"Résumé!F4","v":"ODE_3"},{"$f":"Résumé!G4","v":3},{"$f":"Résumé!I4","v":0},{"$f":"IF(Résumé!K4<>\"\",1-(Résumé!K4/25),\"\")","v":0.64},{"$f":"LEFT(Résumé!E4,1)","v":"2"},"   dans la feuille « Synthèse » ou dans la feuille « Musique »,"]
[]
[null,"Ps",{"$f":"Résumé!C5","v":6},{"$f":"Résumé!B5","v":10},{"$f":"Résumé!H5","v":32},{"$f":"IF(D6<>\"\",VLOOKUP(D6,Synthèse!$Z$2:$AB$21,3,0),\"\")","v":3},{"$f":"Résumé!F5","v":"ODE_3"},{"$f":"Résumé!G5","v":3},{"$f":"Résumé!I5","v":2},{"$f":"IF(Résumé!K5<>\"\",1-(Résumé!K5/25),\"\")","v":0.67999999999999994},{"$f":"LEFT(Résumé!E5,1)","v":"2"},"   avant toute nouvelle étude."]
[null,"Ps",{"$f":"Résumé!C6","v":6},{"$f":"Résumé!B6","v":6},{"$f":"Résumé!H6","v":16},{"$f":"IF(D7<>\"\",VLOOKUP(D7,Synthèse!$Z$2:$AB$21,3,0),\"\")","v":5},{"$f":"Résumé!F6","v":"ODE_1"},{"$f":"Résumé!G6","v":1},{"$f":"Résumé!I6","v":6},{"$f":"IF(Résumé!K6<>\"\",1-(Résumé!K6/25),\"\")","v":0.48},{"$f":"LEFT(Résumé!E6,1)","v":"2"}]
[]
[null,"Ps",{"$f":"Résumé!C7","v":6},{"$f":"Résumé!B7","v":4},{"$f":"Résumé!H7","v":37},{"$f":"IF(D9<>\"\",VLOOKUP(D9,Synthèse!$Z$2:$AB$21,3,0),\"\")","v":2},{"$f":"Résumé!F7","v":"ODE_3"},{"$f":"Résumé!G7","v":3},{"$f":"Résumé!I7","v":7},{"$f":"IF(Résumé!K7<>\"\",1-(Résumé!K7/25),\"\")","v":0.6},{"$f":"LEFT(Résumé!E7,1)","v":"2"}]
[null,"Pi",{"$f":"Résumé!C8","v":2},{"$f":"Résumé!B8","v":8},{"$f":"Résumé!H8","v":31},{"$f":"IF(D10<>\"\",VLOOKUP(D10,Synthèse!$Z$2:$AB$21,3,0),\"\")","v":3},{"$f":"Résumé!F8","v":"FAV"},{"$f":"Résumé!G8","v":2},{"$f":"Résumé!I8","v":3},{"$f":"IF(Résumé!K8<>\"\",1-(Résumé!K8/25),\"\")","v":0.67999999999999994},{"$f":"LEFT(Résumé!E8,1)","v":"2"}]
[]
[null,"Pi",{"$f":"Résumé!C9","v":1},{"$f":"Résumé!B9","v":7},{"$f":"Résumé!H9","v":21},{"$f":"IF(D12<>\"\",VLOOKUP(D12,Synthèse!$Z$2:$AB$21,3,0),\"\")","v":5},{"$f":"Résumé!F9","v":"FOF_2"},{"$f":"Résumé!G9","v":2},{"$f":"Résumé!I9","v":6},{"$f":"IF(Résumé!K9<>\"\",1-(Résumé!K9/25),\"\")","v":0.56000000000000005},{"$f":"LEFT(Résumé!E9,1)","v":"2"}]
[null,"Pi",{"$f":"Résumé!C10","v":1},{"$f":"Résumé!B10","v":2},{"$f":"Résumé!H10","v":31},{"$f":"IF(D13<>\"\",VLOOKUP(D13,Synthèse!$Z$2:$AB$21,3,0),\"\")","v":2},{"$f":"Résumé!F10","v":"FOF_2"},{"$f":"Résumé!G10","v":2},{"$f":"Résumé!I10","v":6},{"$f":"IF(Résumé!K10<>\"\",1-(Résumé!K10/25),\"\")","v":0.56000000000000005},{"$f":"LEFT(Résumé!E10,1)","v":"2"}]
[]
[null,"Pi",{"$f":"Résumé!C11","v":1},{"$f":"Résumé!B11","v":9},{"$f":"Résumé!H11","v":42},{"$f":"IF(D15<>\"\",VLOOKUP(D15,Synthèse!$Z$2:$AB$21,3,0),\"\")","v":1},{"$f":"Résumé!F11","v":"FAV"},{"$f":"Résumé!G11","v":2},{"$f":"Résumé!I11","v":12},{"$f":"IF(Résumé!K11<>\"\",1-(Résumé!K11/25),\"\")","v":0.64},{"$f":"LEFT(Résumé!E11,1)","v":"2"}]
[null,"Pi",{"$f":"Résumé!C12","v":0},{"$f":"Résumé!B12","v":5},{"$f":"Résumé!H12","v":22},{"$f":"IF(D16<>\"\",VLOOKUP(D16,Synthèse!$Z$2:$AB$21,3,0),\"\")","v":4},{"$f":"Résumé!F12","v":"FGO_2"},{"$f":"Résumé!G12","v":1},{"$f":"Résumé!I12","v":9},{"$f":"IF(Résumé!K12<>\"\",1-(Résumé!K12/25),\"\")","v":0.43999999999999995},{"$f":"LEFT(Résumé!E12,1)","v":"2"}]
[null,"",{"$f":"Résumé!C13","v":""},{"$f":"Résumé!B13","v":""},{"$f":"Résumé!H13","v":""},{"$f":"IF(D17<>\"\",VLOOKUP(D17,Synthèse!$Z$2:$AB$21,3,0),\"\")","v":""},{"$f":"Résumé!F13","v":""},{"$f":"Résumé!G13","v":""},{"$f":"Résumé!I13","v":""},{"$f":"IF(Résumé!K13<>\"\",1-(Résumé!K13/25),\"\")","v":""},{"$f":"LEFT(Résumé!E13,1)","v":""}]
[]
[null,"",{"$f":"Résumé!C14","v":""},{"$f":"Résumé!B14","v":""},{"$f":"Résumé!H14","v":""},{"$f":"IF(D19<>\"\",VLOOKUP(D19,Synthèse!$Z$2:$AB$21,3,0),\"\")","v":""},{"$f":"Résumé!F14","v":""},{"$f":"Résumé!G14","v":""},{"$f":"Résumé!I14","v":""},{"$f":"IF(Résumé!K14<>\"\",1-(Résumé!K14/25),\"\")","v":""},{"$f":"LEFT(Résumé!E14,1)","v":""}]
[null,"",{"$f":"Résumé!C15","v":""},{"$f":"Résumé!B15","v":""},{"$f":"Résumé!H15","v":""},{"$f":"IF(D20<>\"\",VLOOKUP(D20,Synthèse!$Z$2:$AB$21,3,0),\"\")","v":""},{"$f":"Résumé!F15","v":""},{"$f":"Résumé!G15","v":""},{"$f":"Résumé!I15","v":""},{"$f":"IF(Résumé!K15<>\"\",1-(Résumé!K15/25),\"\")","v":""},{"$f":"LEFT(Résumé!E15,1)","v":""}]
[null,"",{"$f":"Résumé!C16","v":""},{"$f":"Résumé!B16","v":""},{"$f":"Résumé!H16","v":""},{"$f":"IF(D21<>\"\",VLOOKUP(D21,Synthèse!$Z$2:$AB$21,3,0),\"\")","v":""},{"$f":"Résumé!F16","v":""},{"$f":"Résumé!G16","v":""},{"$f":"Résumé!I16","v":""},{"$f":"IF(Résumé!K16<>\"\",1-(Résumé!K16/25),\"\")","v":""},{"$f":"LEFT(Résumé!E16,1)","v":""}]
[null,"",{"$f":"Résumé!C17","v":""},{"$f":"Résumé!B17","v":""},{"$f":"Résumé!H17","v":""},{"$f":"IF(D22<>\"\",VLOOKUP(D22,Synthèse!$Z$2:$AB$21,3,0),\"\")","v":""},{"$f":"Résumé!F17","v":""},{"$f":"Résumé!G17","v":""},{"$f":"Résumé!I17","v":""},{"$f":"IF(Résumé!K17<>\"\",1-(Résumé!K17/25),\"\")","v":""},{"$f":"LEFT(Résumé!E17,1)","v":""}]
[null,"",{"$f":"Résumé!C18","v":""},{"$f":"Résumé!B18","v":""},{"$f":"Résumé!H18","v":""},{"$f":"IF(D23<>\"\",VLOOKUP(D23,Synthèse!$Z$2:$AB$21,3,0),\"\")","v":""},{"$f":"Résumé!F18","v":""},{"$f":"Résumé!G18","v":""},{"$f":"Résumé!I18","v":""},{"$f":"IF(Résumé!K18<>\"\",1-(Résumé!K18/25),\"\")","v":""},{"$f":"LEFT(Résumé!E18,1)","v":""}]
[null,"",{"$f":"Résumé!C19","v":""},{"$f":"Résumé!B19","v":""},{"$f":"Résumé!H19","v":""},{"$f":"IF(D24<>\"\",VLOOKUP(D24,Synthèse!$Z$2:$AB$21,3,0),\"\")","v":""},{"$f":"Résumé!F19","v":""},{"$f":"Résumé!G19","v":""},{"$f":"Résumé!I19","v":""},{"$f":"IF(Résumé!K19<>\"\",1-(Résumé!K19/25),\"\")","v":""},{"$f":"LEFT(Résumé!E19,1)","v":""}]
[null,"",{"$f":"Résumé!C20","v":""},{"$f":"Résumé!B20","v":""},{"$f":"Résumé!H20","v":""},{"$f":"IF(D25<>\"\",VLOOKUP(D25,Synthèse!$Z$2:$AB$21,3,0),\"\")","v":""},{"$f":"Résumé!F20","v":""},{"$f":"Résumé!G20","v":""},{"$f":"Résumé!I20","v":""},{"$f":"IF(Résumé!K20<>\"\",1-(Résumé!K20/25),\"\")","v":""},{"$f":"LEFT(Résumé!E20,1)","v":""}]
[null,"",{"$f":"Résumé!C21","v":""},{"$f":"Résumé!B21","v":""},{"$f":"Résumé!H21","v":""},{"$f":"IF(D26<>\"\",VLOOKUP(D26,Synthèse!$Z$2:$AB$21,3,0),\"\")","v":""},{"$f":"Résumé!F21","v":""},{"$f":"Résumé!G21","v":""},{"$f":"Résumé!I21","v":""},{"$f":"IF(Résumé!K21<>\"\",1-(Résumé!K21/25),\"\")","v":""},{"$f":"LEFT(Résumé!E21,1)","v":""}]
[null,"",{"$f":"Résumé!C22","v":""},{"$f":"Résumé!B22","v":""},{"$f":"Résumé!H22","v":""},{"$f":"IF(D27<>\"\",VLOOKUP(D27,Synthèse!$Z$2:$AB$21,3,0),\"\")","v":""},{"$f":"Résumé!F22","v":""},{"$f":"Résumé!G22","v":""},{"$f":"Résumé!I22","v":""},{"$f":"IF(Résumé!K22<>\"\",1-(Résumé!K22/25),\"\")","v":""},{"$f":"LEFT(Résumé!E22,1)","v":""}]

{"sheet":"Rodney simple","index":4,"n_rows":22,"n_cols":14,"rows_kept":22,"cut":false,"hidden":false,"merged":[]}
["Numéro du cheval","Musique – Course 1","Musique – Course 2","Musique – Course 3","Musique – Course 4","Musique – Course 5","Musique – Course 6",null,"Écart type","PI","PI mank","%R PI","%R PI Mank","R+2"]
[1,{"$f":"IF(Musique!F2=0,10,Musique!F2)","v":4},{"$f":"IF(Musique!G2=0,10,Musique!G2)","v":10},{"$f":"IF(Musique!H2=0,10,Musique!H2)","v":4},{"$f":"IF(Musique!I2=0,10,Musique!I2)","v":10},{"$f":"IF(Musique!J2=0,10,Musique!J2)","v":4},{"$f":"IF(Musique!K2=0,10,Musique!K2)","v":2},null,{"$f":"IF(B2=\"\",\"\",ROUND(STDEVP(B2:G2),2))","v":3.14},{"$f":"IF(B2=\"\",\"\",COUNTIF(B2:G2,\"<10\"))","v":4},{"$f":"IF(B2=\"\",\"\",9-((IF((COUNTIF(B2:G2,\"1\"))>=1,1,0))+(IF((COUNTIF(B2:G2,\"2\"))>=1,1,0))+(IF((COUNTIF(B2:G2,\"3\"))>=1,1,0))+(IF((COUNTIF(B2:G2,\"4\"))>=1,1,0))+(IF((COUNTIF(B2:G2,\"5\"))>=1,1,0))+(IF((COUNTIF(B2:G2,\"6\"))>=1,1,0))+(IF((COUNTIF(B2:G2,\"7\"))>=1,1,0))+(IF((COUNTIF(B2:G2,\"8\"))>=1,1,0))+(IF((COUNTIF(B2:G2,\"9\"))>=1,1,0))))","v":7},{"$f":"IF(B2=\"\",\"\",I2*(J2/J22)*100)","v":30.634146341463421},{"$f":"IF(B2=\"\",\"\",I2*(K2/K22)*100)","v":38.561403508771932},{"$f":"IF(B2=\"\",\"\",(L2/M2)*100)","v":79.442508710801405}]
[2,{"$f":"IF(Musique!F3=0,10,Musique!F3)","v":10},{"$f":"IF(Musique!G3=0,10,Musique!G3)","v":1},{"$f":"IF(Musique!H3=0,10,Musique!H3)","v":9},{"$f":"IF(Musique!I3=0,10,Musique!I3)","v":7},{"$f":"IF(Musique!J3=0,10,Musique!J3)","v":3},{"$f":"IF(Musique!K3=0,10,Musique!K3)","v":3},null,3.35,{"$f":"IF(B3=\"\",\"\",COUNTIF(B3:G3,\"<10\"))","v":5},5,{"$f":"IF(B3=\"\",\"\",I3*(J3/J22)*100)","v":40.853658536585364},{"$f":"IF(B3=\"\",\"\",I3*(K3/K22)*100)","v":29.385964912280699},139.02439024390245]
[3,{"$f":"IF(Musique!F4=0,10,Musique!F4)","v":7},{"$f":"IF(Musique!G4=0,10,Musique!G4)","v":5},{"$f":"IF(Musique!H4=0,10,Musique!H4)","v":10},{"$f":"IF(Musique!I4=0,10,Musique!I4)","v":3},{"$f":"IF(Musique!J4=0,10,Musique!J4)","v":6},{"$f":"IF(Musique!K4=0,10,Musique!K4)","v":4},null,2.27,5,4,{"$f":"IF(B4=\"\",\"\",I4*(J4/J22)*100)","v":27.68292682926829},{"$f":"IF(B4=\"\",\"\",I4*(K4/K22)*100)","v":15.929824561403509},173.78048780487802]
[4,{"$f":"IF(Musique!F5=0,10,Musique!F5)","v":3},{"$f":"IF(Musique!G5=0,10,Musique!G5)","v":2},{"$f":"IF(Musique!H5=0,10,Musique!H5)","v":10},{"$f":"IF(Musique!I5=0,10,Musique!I5)","v":2},{"$f":"IF(Musique!J5=0,10,Musique!J5)","v":10},{"$f":"IF(Musique!K5=0,10,Musique!K5)","v":6},null,3.45,4,6,{"$f":"IF(B5=\"\",\"\",I5*(J5/J22)*100)","v":33.658536585365859},{"$f":"IF(B5=\"\",\"\",I5*(K5/K22)*100)","v":36.315789473684212},92.682926829268297]
[5,{"$f":"IF(Musique!F6=0,10,Musique!F6)","v":1},{"$f":"IF(Musique!G6=0,10,Musique!G6)","v":10},{"$f":"IF(Musique!H6=0,10,Musique!H6)","v":7},{"$f":"IF(Musique!I6=0,10,Musique!I6)","v":10},{"$f":"IF(Musique!J6=0,10,Musique!J6)","v":7},{"$f":"IF(Musique!K6=0,10,Musique!K6)","v":1},null,3.74,4,7,{"$f":"IF(B6=\"\",\"\",I6*(J6/J22)*100)","v":36.487804878048784},{"$f":"IF(B6=\"\",\"\",I6*(K6/K22)*100)","v":45.929824561403507},79.442508710801405]
[6,{"$f":"IF(Musique!F7=0,10,Musique!F7)","v":2},{"$f":"IF(Musique!G7=0,10,Musique!G7)","v":10},{"$f":"IF(Musique!H7=0,10,Musique!H7)","v":6},{"$f":"IF(Musique!I7=0,10,Musique!I7)","v":10},{"$f":"IF(Musique!J7=0,10,Musique!J7)","v":7},{"$f":"IF(Musique!K7=0,10,Musique!K7)","v":9},null,2.81,4,5,{"$f":"IF(B7=\"\",\"\",I7*(J7/J22)*100)","v":27.414634146341466},{"$f":"IF(B7=\"\",\"\",I7*(K7/K22)*100)","v":24.649122807017541},111.21951219512198]
[7,{"$f":"IF(Musique!F8=0,10,Musique!F8)","v":10},{"$f":"IF(Musique!G8=0,10,Musique!G8)","v":1},{"$f":"IF(Musique!H8=0,10,Musique!H8)","v":10},{"$f":"IF(Musique!I8=0,10,Musique!I8)","v":3},{"$f":"IF(Musique!J8=0,10,Musique!J8)","v":10},{"$f":"IF(Musique!K8=0,10,Musique!K8)","v":6},null,3.64,3,6,{"$f":"IF(B8=\"\",\"\",I8*(J8/J22)*100)","v":26.634146341463417},{"$f":"IF(B8=\"\",\"\",I8*(K8/K22)*100)","v":38.315789473684205},69.512195121951237]
[8,{"$f":"IF(Musique!F9=0,10,Musique!F9)","v":10},{"$f":"IF(Musique!G9=0,10,Musique!G9)","v":10},{"$f":"IF(Musique!H9=0,10,Musique!H9)","v":1},{"$f":"IF(Musique!I9=0,10,Musique!I9)","v":2},{"$f":"IF(Musique!J9=0,10,Musique!J9)","v":10},{"$f":"IF(Musique!K9=0,10,Musique!K9)","v":4},null,3.93,3,6,{"$f":"IF(B9=\"\",\"\",I9*(J9/J22)*100)","v":28.756097560975608},{"$f":"IF(B9=\"\",\"\",I9*(K9/K22)*100)","v":41.368421052631575},69.512195121951223]
[9,{"$f":"IF(Musique!F10=0,10,Musique!F10)","v":2},{"$f":"IF(Musique!G10=0,10,Musique!G10)","v":1},{"$f":"IF(Musique!H10=0,10,Musique!H10)","v":10},{"$f":"IF(Musique!I10=0,10,Musique!I10)","v":10},{"$f":"IF(Musique!J10=0,10,Musique!J10)","v":3},{"$f":"IF(Musique!K10=0,10,Musique!K10)","v":1},null,3.95,4,6,{"$f":"IF(B10=\"\",\"\",I10*(J10/J22)*100)","v":38.536585365853661},{"$f":"IF(B10=\"\",\"\",I10*(K10/K22)*100)","v":41.578947368421055},92.682926829268297]
[10,{"$f":"IF(Musique!F11=0,10,Musique!F11)","v":4},{"$f":"IF(Musique!G11=0,10,Musique!G11)","v":3},{"$f":"IF(Musique!H11=0,10,Musique!H11)","v":6},{"$f":"IF(Musique!I11=0,10,Musique!I11)","v":10},{"$f":"IF(Musique!J11=0,10,Musique!J11)","v":4},{"$f":"IF(Musique!K11=0,10,Musique!K11)","v":8},null,2.48,5,5,{"$f":"IF(B11=\"\",\"\",I11*(J11/J22)*100)","v":30.243902439024389},{"$f":"IF(B11=\"\",\"\",I11*(K11/K22)*100)","v":21.754385964912277},139.02439024390245]
[11,{"$f":"IF(Musique!F12=0,10,Musique!F12)","v":""},{"$f":"IF(Musique!G12=0,10,Musique!G12)","v":""},{"$f":"IF(Musique!H12=0,10,Musique!H12)","v":""},{"$f":"IF(Musique!I12=0,10,Musique!I12)","v":""},{"$f":"IF(Musique!J12=0,10,Musique!J12)","v":""},{"$f":"IF(Musique!K12=0,10,Musique!K12)","v":""},null,"","","",{"$f":"IF(B12=\"\",\"\",I12*(J12/J22)*100)","v":""},{"$f":"IF(B12=\"\",\"\",I12*(K12/K22)*100)","v":""},""]
[12,{"$f":"IF(Musique!F13=0,10,Musique!F13)","v":""},{"$f":"IF(Musique!G13=0,10,Musique!G13)","v":""},{"$f":"IF(Musique!H13=0,10,Musique!H13)","v":""},{"$f":"IF(Musique!I13=0,10,Musique!I13)","v":""},{"$f":"IF(Musique!J13=0,10,Musique!J13)","v":""},{"$f":"IF(Musique!K13=0,10,Musique!K13)","v":""},null,"","","",{"$f":"IF(B13=\"\",\"\",I13*(J13/J22)*100)","v":""},{"$f":"IF(B13=\"\",\"\",I13*(K13/K22)*100)","v":""},""]
[13,{"$f":"IF(Musique!F14=0,10,Musique!F14)","v":""},{"$f":"IF(Musique!G14=0,10,Musique!G14)","v":""},{"$f":"IF(Musique!H14=0,10,Musique!H14)","v":""},{"$f":"IF(Musique!I14=0,10,Musique!I14)","v":""},{"$f":"IF(Musique!J14=0,10,Musique!J14)","v":""},{"$f":"IF(Musique!K14=0,10,Musique!K14)","v":""},null,"","","",{"$f":"IF(B14=\"\",\"\",I14*(J14/J22)*100)","v":""},{"$f":"IF(B14=\"\",\"\",I14*(K14/K22)*100)","v":""},""]
[14,{"$f":"IF(Musique!F15=0,10,Musique!F15)","v":""},{"$f":"IF(Musique!G15=0,10,Musique!G15)","v":""},{"$f":"IF(Musique!H15=0,10,Musique!H15)","v":""},{"$f":"IF(Musique!I15=0,10,Musique!I15)","v":""},{"$f":"IF(Musique!J15=0,10,Musique!J15)","v":""},{"$f":"IF(Musique!K15=0,10,Musique!K15)","v":""},null,"","","",{"$f":"IF(B15=\"\",\"\",I15*(J15/J22)*100)","v":""},{"$f":"IF(B15=\"\",\"\",I15*(K15/K22)*100)","v":""},""]
[15,{"$f":"IF(Musique!F16=0,10,Musique!F16)","v":""},{"$f":"IF(Musique!G16=0,10,Musique!G16)","v":""},{"$f":"IF(Musique!H16=0,10,Musique!H16)","v":""},{"$f":"IF(Musique!I16=0,10,Musique!I16)","v":""},{"$f":"IF(Musique!J16=0,10,Musique!J16)","v":""},{"$f":"IF(Musique!K16=0,10,Musique!K16)","v":""},null,"","","",{"$f":"IF(B16=\"\",\"\",I16*(J16/J22)*100)","v":""},{"$f":"IF(B16=\"\",\"\",I16*(K16/K22)*100)","v":""},""]
[16,{"$f":"IF(Musique!F17=0,10,Musique!F17)","v":""},{"$f":"IF(Musique!G17=0,10,Musique!G17)","v":""},{"$f":"IF(Musique!H17=0,10,Musique!H17)","v":""},{"$f":"IF(Musique!I17=0,10,Musique!I17)","v":""},{"$f":"IF(Musique!J17=0,10,Musique!J17)","v":""},{"$f":"IF(Musique!K17=0,10,Musique!K17)","v":""},null,"","","",{"$f":"IF(B17=\"\",\"\",I17*(J17/J22)*100)","v":""},{"$f":"IF(B17=\"\",\"\",I17*(K17/K22)*100)","v":""},""]
[17,{"$f":"IF(Musique!F18=0,10,Musique!F18)","v":""},{"$f":"IF(Musique!G18=0,10,Musique!G18)","v":""},{"$f":"IF(Musique!H18=0,10,Musique!H18)","v":""},{"$f":"IF(Musique!I18=0,10,Musique!I18)","v":""},{"$f":"IF(Musique!J18=0,10,Musique!J18)","v":""},{"$f":"IF(Musique!K18=0,10,Musique!K18)","v":""},null,"","","",{"$f":"IF(B18=\"\",\"\",I18*(J18/J22)*100)","v":""},{"$f":"IF(B18=\"\",\"\",I18*(K18/K22)*100)","v":""},""]
[18,{"$f":"IF(Musique!F19=0,10,Musique!F19)","v":""},{"$f":"IF(Musique!G19=0,10,Musique!G19)","v":""},{"$f":"IF(Musique!H19=0,10,Musique!H19)","v":""},{"$f":"IF(Musique!I19=0,10,Musique!I19)","v":""},{"$f":"IF(Musique!J19=0,10,Musique!J19)","v":""},{"$f":"IF(Musique!K19=0,10,Musique!K19)","v":""},null,"","","",{"$f":"IF(B19=\"\",\"\",I19*(J19/J22)*100)","v":""},{"$f":"IF(B19=\"\",\"\",I19*(K19/K22)*100)","v":""},""]
[19,{"$f":"IF(Musique!F20=0,10,Musique!F20)","v":""},{"$f":"IF(Musique!G20=0,10,Musique!G20)","v":""},{"$f":"IF(Musique!H20=0,10,Musique!H20)","v":""},{"$f":"IF(Musique!I20=0,10,Musique!I20)","v":""},{"$f":"IF(Musique!J20=0,10,Musique!J20)","v":""},{"$f":"IF(Musique!K20=0,10,Musique!K20)","v":""},null,"","","",{"$f":"IF(B20=\"\",\"\",I20*(J20/J22)*100)","v":""},{"$f":"IF(B20=\"\",\"\",I20*(K20/K22)*100)","v":""},""]
[20,{"$f":"IF(Musique!F21=0,10,Musique!F21)","v":""},{"$f":"IF(Musique!G21=0,10,Musique!G21)","v":""},{"$f":"IF(Musique!H21=0,10,Musique!H21)","v":""},{"$f":"IF(Musique!I21=0,10,Musique!I21)","v":""},{"$f":"IF(Musique!J21=0,10,Musique!J21)","v":""},{"$f":"IF(Musique!K21=0,10,Musique!K21)","v":""},null,"","","",{"$f":"IF(B21=\"\",\"\",I21*(J21/J22)*100)","v":""},{"$f":"IF(B21=\"\",\"\",I21*(K21/K22)*100)","v":""},""]
[null,null,null,null,null,null,null,null,null,{"$f":"SUM(J2:J21)","v":41},{"$f":"SUM(K2:K21)","v":57}]

{"sheet":"Musique","index":5,"n_rows":21,"n_cols":18,"rows_kept":21,"cut":false,"hidden":false,"merged":[]}
["N°","Cheval","Sag","Musique","Musique épurée","P1","P2","P3","P4","P5","P6","P7","P8","P9","P10","P11","P12","Nbre de courses"]
[1,"SAON SECRET",2875,"4m Da 4m 0a 4m 2m 3m 1m 3m Dm Da (14) 5m",{"$f":"MusiqueEpuree(D2)","v":"404042313005"},{"$f":"IF($D2=\"\",\"\",ABS(LEFT($E2,1)))","v":4},{"$f":"IF($D2=\"\",\"\",IF(LEN($E2)<2,\"\",ABS(RIGHT((LEFT($E2,2)),1))))","v":0},{"$f":"IF($D2=\"\",\"\",IF(LEN($E2)<3,\"\",ABS(RIGHT((LEFT($E2,3)),1))))","v":4},{"$f":"IF($D2=\"\",\"\",IF(LEN($E2)<4,\"\",ABS(RIGHT((LEFT($E2,4)),1))))","v":0},{"$f":"IF($D2=\"\",\"\",IF(LEN($E2)<5,\"\",ABS(RIGHT((LEFT($E2,5)),1))))","v":4},{"$f":"IF($D2=\"\",\"\",IF(LEN($E2)<6,\"\",ABS(RIGHT((LEFT($E2,6)),1))))","v":2},{"$f":"IF($D2=\"\",\"\",IF(LEN($E2)<6,\"\",ABS(RIGHT((LEFT($E2,7)),1))))","v":3},{"$f":"IF($D2=\"\",\"\",IF(LEN($E2)<6,\"\",ABS(RIGHT((LEFT($E2,8)),1))))","v":1},{"$f":"IF($D2=\"\",\"\",IF(LEN($E2)<6,\"\",ABS(RIGHT((LEFT($E2,9)),1))))","v":3},{"$f":"IF($D2=\"\",\"\",IF(LEN($E2)<6,\"\",ABS(RIGHT((LEFT($E2,10)),1))))","v":0},{"$f":"IF($D2=\"\",\"\",IF(LEN($E2)<6,\"\",ABS(RIGHT((LEFT($E2,11)),1))))","v":0},{"$f":"IF($D2=\"\",\"\",IF(LEN($E2)<6,\"\",ABS(RIGHT((LEFT($E2,12)),1))))","v":5},{"$f":"IF($D2=\"\",\"\",IF(LEN($E2)<6,LEN($E2),6))","v":6}]
[2,"SEA TRIAL",2875,"0a 1m 9a (14) 7m 3m 3m 3m 8a 3m 3m 1m 2m",{"$f":"MusiqueEpuree(D3)","v":"019733383312"},0,1,9,7,3,3,{"$f":"IF($D3=\"\",\"\",IF(LEN($E3)<6,\"\",ABS(RIGHT((LEFT($E3,7)),1))))","v":3},{"$f":"IF($D3=\"\",\"\",IF(LEN($E3)<6,\"\",ABS(RIGHT((LEFT($E3,8)),1))))","v":8},{"$f":"IF($D3=\"\",\"\",IF(LEN($E3)<6,\"\",ABS(RIGHT((LEFT($E3,9)),1))))","v":3},{"$f":"IF($D3=\"\",\"\",IF(LEN($E3)<6,\"\",ABS(RIGHT((LEFT($E3,10)),1))))","v":3},{"$f":"IF($D3=\"\",\"\",IF(LEN($E3)<6,\"\",ABS(RIGHT((LEFT($E3,11)),1))))","v":1},{"$f":"IF($D3=\"\",\"\",IF(LEN($E3)<6,\"\",ABS(RIGHT((LEFT($E3,12)),1))))","v":2},6]
[3,"ALTARE SI",2875,"7a 5a Da 3a 6a 4a Da 6a 7a 4a 6a 4a","750364067464",7,5,0,3,6,4,0,6,7,4,6,4,6]
[4,"LAIA CHOPE",2875,"3a 2a Da 2a 0a 6a Dm 2a Dm 7a 3a Dm","320206020730",3,2,0,2,0,6,0,2,0,7,3,0,6]
[5,"RUBY WEDDING",2875,"1a Dm 7a Dm 7m 1m 7a 4a Da (14) 1a Da 2a",{"$f":"MusiqueEpuree(D6)","v":"107071740102"},1,0,7,0,7,1,7,4,0,1,0,2,6]
[6,"ORANGEFIELD",2875,"2m Da 6m 0a 7a 9a 6m 3m 3m 3m Dm 0a","206079633300",2,0,6,0,7,9,6,3,3,3,0,0,6]
[7,"PUPA DI SARONNO",2875,"Da 1m 0a 3m 0a 6m 4m 7m 1m Dm 4m Dm","010306471040",0,1,0,3,0,6,4,7,1,0,4,0,6]
[8,"FRED LALLOUPET",2875,"Dm Da 1m 2m Da (14) 4m 3m 1m 2m 1m Dm 1m","001204312101",0,0,1,2,0,4,3,1,2,1,0,1,6]
[9,"PROPOSAL",2875,"2m 1m 0a 0a 3m 1m 1m 2m Da Da 2m 0a","210031120020",2,1,0,0,3,1,1,2,0,0,2,0,6]
[10,"LE VALENTIN",2875,"4m 3m 6a Da 4a 8m 7m 4m 4a 3m 1m 3a","436048744313",4,3,6,0,4,8,7,4,4,3,1,3,6]
[11,null,null,null,"","","","","","","","","","","","","",""]
[12,null,null,null,"","","","","","","","","","","","","",""]
[13,null,null,null,"","","","","","","","","","","","","",""]
[14,null,null,null,"","","","","","","","","","","","","",""]
[15,null,null,null,"","","","","","","","","","","","","",""]
[16,null,null,null,"","","","","","","","","","","","","",""]
[17,null,null,null,"","","","","","","","","","","","","",""]
[18,null,null,null,"","","","","","","","","","","","","",""]
[19,null,null,null,"","","","","","","","","","","","","",""]
[20,null,null,null,"","","","","","","","","","","","","",""]

{"sheet":"Turfomania.fr","index":6,"n_rows":241,"n_cols":12,"rows_kept":241,"cut":false,"hidden":false,"merged":[[19,3,19,11],[101,3,101,11],[122,3,122,11],[160,3,160,11]]}
[]
[]
[]
[]
[]
[]
[]
[null,"Course n°1 - PRIX LE PACHA"]
[]
[null,"Plat - 3 ans - 1200 mètres, Ligne Droite - départ vers 12h15"]
[]
[null,"COURSE A CONDITIONS , PLAT, 1.200 mètres, Ligne DROITE.- Pour poulains entiers, hongres et pouliches de 3 ans , n'ayant pas, depuis le 15 septembre 2014 inclus, gagné u ne Listed Race ni, depuis le 15 juin 2015 inclus, gagné une course B. P oi ds :57 k. Les chevaux ayant, depuis le 15 mars 2015 inclus, gagné une course B ou, depuis le 15 juin 2015 inc lus, été classés 2ème d'une Listed Ra ce porteront 2 k. Les chevaux n'ayant jamais gagné recevront 1 k.1/2 ceu x n'ayant jamais couru, 3 k."]
[]
[null,"Allocations : 17000 6800 5100 3400 1700"]
[]
[null,"SimpleCoupléTrio"]
[]
[null,"N°","Cheval","Poids","Corde","S/A","Jockey","Entraîneur","Record","Gain","Oeill.","Dernières performances"]
[null,1,"SALLAL",57,4,"M3","BENOIST G.","FABRE (S) A. (E1)",null,49400,null,"1p 4p 8p 1p (14) 1p 2p"]
[null,2,"CITY MONEY","Non Partant"]
[null,3,"JASNIN",57,9,"M3","THOMAS R.","PHELIPPON JUL.",null,85800,null,"7p 3p 2p 4p 5p 3p 1p 2p 1p 4p 1p 0p"]
[null,4,"DUQUESA PENGUIN",57,3,"H3","SOUMILLON C.","PROD'HOMME D.",null,41300,null,"2p 1p 3p 2p (14) 3p 3p 3p 3p 15p"]
[null,5,"SHAMAL",57,5,"M3","CHEMINAUD V.","PORZIER (S) YM.",null,47937,null,"2p 4p 1p 4p 3p (14) 9p 1p 1p"]
[null,6,"FINSBURY SQUARE",57,1,"M3","DEMURO C.","CHAPPET F.",null,111100,"X","4p 6p 4p 4p 2p 2p 1p 2p (14) 3p 1p 4p 2p"]
[null,7,"UM TAGAH","55.5",6,"F3","RISPOLI U.","DELZANGLES M. (E1)",null,13400,null,"1p 5p"]
[null,8,"PRECIOUSLY","55.5",7,"F3","PICCONE T.","CHEREL G.",null,63400,null,"7p 1p 4p 6p 6p 1p (14) 5p 5p 3p 1p 1p"]
[null,9,"KENOUSKA","55.5",2,"F3","PESLIER O.","SOGORB P.",null,100800,null,"5p 1p 2p 3p 0p 5p 9p (14) 3p 5p 5p 8p 1p"]
[]
[null,"Haut de page Pronostics Arrivées et rapports"]
[]
[]
[null,"Course n°2 - PRIX DE MAISONS SUR SEINE"]
[]
[null,"Plat - femelles - A Réclamer Course F - 2 ans - 1600 mètres, Corde à gauche - départ vers 12h45"]
[]
[null,"A RECLAMER , PLAT, 1.600 mètres, corde à GAUCHE.- Pour pouliches de 2 ans , mises à réc lamer pour 11.000, 14.000 ou 17.000. Poids : 56 k . Les pouliches mises à réclamer pour 14.000 porteront 1 k.1/ 2 pour 17.000, 3 k. En outre , les pouliches ayant, depuis le 1er avril 2015 inclus, reçu une allocation de 8 .500 ou gagné un e course F porteront 2 k. plusieurs allocations de 8.500 ou gagné plusieurs courses F, 4 k."]
[]
[null,"Allocations : 9500 3800 2850 1900 950"]
[]
[null,"SimpleCoupléTrio2 sur 4Multi"]
[]
[null,"N°","Cheval","Poids","Corde","S/A","Jockey","Entraîneur","Record","Gain","Oeill.","Dernières performances"]
[null,1,"SIRTEMA",59,5,"F2","GAMBART V.","BOUTIN (S) M.",null,7100,null,"5p 3p 3p 5p"]
[null,2,"NEVER SAY NEVER",59,4,"F2","PASQUIER S.","GOURRAUD (S) Y.",null,null,"X","8p 0p 8p"]
[null,3,"DES ANNEES FOLLES",59,6,"F2","MOREAU A.","BARBEROT (S) Y.",null,3900,null,"4p 6p 6p 5p 4p 7p"]
[null,4,"LA FIESTA",59,9,"F2","LERNER M.","GREWE H.",null,6000,null,"7p 1p"]
[null,5,"CONSTANTINA",59,1,"F2","SOUMILLON C.","ROSSI CH.",null,9100,null,"5p 2p 2p 0p"]
[null,6,"ZIRIATT",59,7,"F2","RISPOLI U.","BIETOLINI G."]
[null,7,"LIPSIE",59,2,"F2","PELLETAN M.","BIETOLINI G.",null,16750,"A","2p 2p 6p 5p 2p 0p 7p 2p"]
[null,8,"YUBRIS",59,3,"F2","DEMURO C.","ZARROLI D."]
[null,9,"NAOUSA","57.5",12,"F2","GUYON M.","BERTRAN DE BALANDA (S) J.",null,8900,null,"4p 2p 4p"]
[null,10,"SNAPPY DOO","57.5",11,"F2","BREUX D.","BOTTI (S) A&G."]
[null,11,"GAEA",56,10,"F2","HARDOUIN E.","JESUS S.",null,null,null,"6p 0p 8p 0p"]
[null,12,"WHYPPEE",56,8,"F2","BOISSEAU L.","COLLET (S) ROB.",null,8800,"A","6p 2p 7p 0p 8p 7p 4p 4p 9p 9p"]
[]
[null,"Haut de page Pronostics Arrivées et rapports"]
[]
[]
[null,"Course n°3 - PRIX SARACA"]
[]
[null,"Plat - Listed - 2 ans - 1300 mètres, Ligne Droite - départ vers 13h15"]
[]
[null,"COURSE A CONDITIONS , PLAT, 1.300 mètres, Ligne DROITE.- Pour poulains entiers, hongres et pouliches de 2 ans , n'ayant pas gagné u ne Listed Race, n i été classés 2ème d'une course de Groupe. Poids : 58 k . Versement à la poule des propriétai res :210 à l'engagement ou 1.980 à l 'engagement supplémentaire."]
[]
[null,"Allocations : 27500 11000 8250 5500 2750"]
[]
[null,"Simple"]
[]
[null,"N°","Cheval","Poids","Corde","S/A","Jockey","Entraîneur","Record","Gain","Oeill.","Dernières performances"]
[null,1,"INSOLITO",58,7,"M2","RISPOLI U.","BONIN (S) A.",null,46200,null,"3p 3p 1p 3p 4p 1p 5p"]
[null,2,"KIDMENEVER",58,1,"M2","JARNET T.","NAKKACHDJI X.",null,18012,"A","1p 4p 6p 2p 5p"]
[null,3,"MAXIMUM AURELIUS",58,2,"M2","BOUDOT PC.","GRAFFARD (S) FH.",null,13000,null,"1p 2p 6p"]
[null,4,"NADINO",58,4,"M2","PESLIER O.","NIGGE (S) M&S.",null,19000,null,"1p 3p 2p 3p"]
[null,5,"ABOULIE","56.5",3,"F2","SOUMILLON C.","ROUGET (S) JC.",null,12500,null,"1p 4p"]
[null,6,"DRESSED IN FUR","56.5",6,"F2","GUYON M.","BRANDT MME P.",null,18416,null,"4p 1p 4p 1p 5p Tp"]
[null,7,"DAMILA","56.5",5,"F2","VERON F.","PANTALL HA.",null,26250,null,"1p 3p 2p 2p 2p"]
[]
[null,"Haut de page Pronostics Arrivées et rapports"]
[]
[]
[null,"Course n°4 - PRIX DE L'HIPPODROME DE MAISONS-LAFFITTE"]
[]
[null,"Plat - Handicap Course D - 4 ans et Plus - 1200 mètres, Ligne Droite - Ref: +18,5 - départ vers 13h50"]
[]
[null,"HANDICAP DIVISE, Réf. +185 , PLAT, 1.200 mètres, Ligne DROITE.- Pour chevaux entiers, hongres et jume nts de 4 ans et au-dessus, ayant cour u depuis le 1er mars 2015 inclus. Un souvenir sera offert au propriétaire du cheval gagnant par FRANCE GALOP."]
[]
[null,"Allocations : 24440 9880 7280 4680 2860 1820 1040"]
[]
[null,"SimpleCoupléTrioTiercéQuartéQuinté2 sur 4Multi"]
[]
[null,"N°","Cheval","Poids","Corde","S/A","Jockey","Entraîneur","Record","Gain","Oeill.","Dernières performances"]
[null,1,"MINISTRE D'ETAT",60,4,"H8","GUYON M.","CARDENNE MLLE C.",null,196325,null,"4p 1p 1p 7p 2p 4p 7p 3p (14) 3p 0p 6p 2p"]
[null,2,"WINSHINE",60,7,"F4","SANTIAGO MLLE D.","SMRCZEK S.",null,143810,null,"0p 6p 7p 2p 3p 6p 5p 7p 8p (14) 0p 3p 1p"]
[null,3,"QUIRINUS",60,9,"H8","BACHELOT T.","SMRCZEK S.",null,266680,"X","7p 0p 5p 3p 8p 3p 6p 2p 3p 2p 7p (14) 0p"]
[]
[null,"SimpleCoupléTrio"]
[]
[null,"N°","Cheval","Poids","Corde","S/A","Jockey","Entraîneur","Record","Gain","Oeill.","Dernières performances"]
[null,1,"TITUS MILLS",63,6,"H7","BERNADET MLLE MA.","BRAEM L.",null,123693,null,"1p 3p 4p 9p 1p 3p 4p 8p 0p 9p (14) 0p 1p"]
[null,2,"MENEAS","59.5",7,"H5","DOMINOIS MLLE P.","SMAGA D.",null,115350,null,"4p 1p 3p 4p 3p (13) 4p 7p (12) 1p 1p 1p"]
[null,3,"VALIDOR",59,9,"H9","SANTIAGO MLLE D.","NICOT G.",null,281390,null,"7p 0p 5p 7p 1p 1p 6p (14) 1p 1p 0p 6p 0p"]
[null,4,"STORM MAN","Non Partant"]
[null,5,"AGAMON LAKE","57.5",3,"H4","EON MLLE M.","SEPULCHRE (S) D.",null,2700,"X","0p 3p 7p 6p 4p (14) 0p"]
[null,6,"COOL STAR",56,4,"H10","BOUVIER MLLE A.","BONIN (S) A.",null,252280,null,"0p 3p 9p 4p 3p 0p 3p 8p 0p 0p (14) 0p 0p"]
[null,7,"ZIMRI",56,5,"H11","MARCIALIS MLLE J.","BOLLACK-BADEL M.",null,333100,null,"0p 5p 3p 2p 5p 2p 5p (14) 2p 4p 7p 5p 0p"]
[null,8,"SOULSIDE",56,1,"H6","GROSSO MLLE L.","CAULLERY N.",null,97550,"X","3p 3p 0p 4p 5p 8p 5p 4p 7p 2p 2p 1p"]
[null,9,"TRES CONFIDENTIEL","54.5",2,"F5","PIETRASIEWICZ MLLE J.","HENDRIKS MME J.",null,16450,null,"0p 6p 0p 0p (14) 9p 9p 7p 0p 8p 3p (13) 6p 0p"]
[]
[null,"Haut de page Pronostics Arrivées et rapports"]
[]
[]
[null,"Course n°8 - PRIX DE LA PRAIRIE DU PARC"]
[]
[null,"Plat - Handicap Course D - 4 ans et Plus - 1200 mètres, Ligne Droite - Ref: +26 - départ vers 15h55"]
[]
[null,"HANDICAP DIVISE, Réf. +260 , PLAT, 1.200 mètres, Ligne DROITE.- Pour chevaux entiers, hongres et jume nts de 4 ans et au-dessus, ayant cour u depuis le 1er mars 2015 inclus."]
[]
[null,"Allocations : 13000 5200 3900 2600 1300"]
[]
[null,"SimpleCoupléTrio2 sur 4Multi"]
[]
[null,"N°","Cheval","Poids","Corde","S/A","Jockey","Entraîneur","Record","Gain","Oeill.","Dernières performances"]
[null,1,"SAON SECRET","Non Partant"]
[null,2,"SEA TRIAL",59,1,"H6","PESLIER O.","NICOT MLLE C. (E1)",null,221660,null,"5p 3p 2p 0p 5p 4p 0p 1p 0p 3p 5p (14) 1p"]
[null,3,"ALTARE SI",59,6,"H7","BOUDOT PC.","GOUDOT (S) B.",null,163640,null,"0p 8p 0p 3p 0p 8p 1p 2p 4p 0p 8p 0p"]
[null,4,"LAIA CHOPE",59,12,"F4","BADEL ALXI.","PROD'HOMME D.",null,46300,null,"0p 7p 0p 0p 0p (14) 4p 7p (13) 3p 2p 3p 5p 4p"]
[null,5,"RUBY WEDDING","58.5",4,"F5","HARDOUIN E.","NICOT G.",null,98050,null,"2p 4p 8p 4p 4p 9p 0p 4p 0p 4p 0p (14) 0p"]
[null,6,"ORANGEFIELD",58,5,"H4","BARZALONA M.","MONFORT (S) P&F.",null,52300,null,"6p 7p 1p 0p 6p 1p 3p 9p 9p (14) 0p 0p 0p"]
[null,7,"PUPA DI SARONNO",58,2,"F4","VERON F.","PANTALL HA.",null,22714,null,"4p 2p 6p 1p 6p 1p 0p 7p (14) 9p (13) 6p 2p"]
[null,8,"FRED LALLOUPET",57,9,"M8","BENOIST G.","SMAGA D.",null,251260,null,"0p 6p 0p 0p 6p 0p (14) 6p 7p 7p 5p 0p 9p"]
[null,9,"PROPOSAL","56.5",15,"H5","BEUZELIN LP.","HAMMOND (S) J.",null,63350,null,"6p 1p 7p (14) 8p 2p 1p 7p 3p 3p 8p 8p 0p"]
[null,10,"LE VALENTIN",56,3,"H9","CHEMINAUD V.","NICOT MLLE C. (E1)",null,250930,null,"8p 0p 8p 5p 2p 7p 2p (14) 0p 0p 0p 0p 2p"]
[null,11,"COLOR CODE",55,17,"H4","DEMURO C.","BOUTIN (S) M.",null,88400,null,"3p 0p 1p 9p 2p 0p 4p 6p 3p 6p 4p 8p"]
[null,12,"LEODERPROFI",55,13,"H8","HELLYN S.","GEISLER G.",null,81191,null,"3p 8p 4p 6p 9p 2p (14) 3p 1p 1p 3p 6p 2p"]
[null,13,"VIANELLO",55,14,"H8","GUYON M.","CAPITTE (S) JM.",null,175475,"X","4p 0p (14) 4p 3p 0p 1p 0p 6p 7p 2p 8p 7p"]
[null,14,"DRAGOSLAV","54.5",16,"M7","HAMELIN A.","SCHUTZ W.",null,69450,null,"4p 4p 7p 4p 4p 5p 2p 0p 7p 2p 6p 2p"]
[null,15,"MAZARIEGOS","54.5",8,"H4","CRASTUS A.","DELCHER SANCHEZ M.",null,25000,null,"1p 2p 5p 4p 8p 5p 0p (14) 5p 1p 5p 2p 2p"]
[null,16,"AGNES CHAMP","53.5",10,"H9","LEMAITRE A.","BOUTIN (S) M.",null,294350,"X","5p 1p 3p 6p 3p 0p 9p 0p 6p 3p 9p 2p"]
[null,17,"ZEMIRO","53.5",7,"H7","GAMBART V.","BOUTIN (S) M.",null,148150,"A","6p 8p 9p 7p 9p 5p 0p 4p 1p 8p 0p 3p"]
[null,18,"CRUEL SUMMER","53.5",11,"F6","BERTO M.","HENDRIKS MME J.",null,78575,null,"1p 6p 1p 3p 5p 2p (14) 7p 2p 3p 3p 3p 9p"]
[]
[null,"Haut de page Pronostics Arrivées et rapports"]
[]
[]
[null,"Course n°9 - PRIX DE LA PORTE DU PARC"]
[]
[null,"Plat - Handicap Course E - 4 ans et Plus - 1200 mètres, Ligne Droite - Ref: +33 - départ vers 16h25"]
[]
[null,"HANDICAP DIVISE, Réf. +330 , PLAT, 1.200 mètres, Ligne DROITE.- Pour chevaux entiers, hongres et jume nts de 4 ans et au-dessus, ayant cour u depuis le 1er mars 2015 inclus."]
[]
[null,"Allocations : 9000 3600 2700 1800 900"]
[]
[null,"SimpleCoupléTrio2 sur 4Multi"]
[]
[null,"N°","Cheval","Poids","Corde","S/A","Jockey","Entraîneur","Record","Gain","Oeill.","Dernières performances"]
[null,1,"UMA MIA",60,16,"F4","BERTO M.","PALUSSIERE M.",null,64650,"X","2p 5p 0p 1p 5p 7p 5p 9p 5p 0p 9p 4p"]
[null,2,"LLOYDMINSTER",60,4,"H5","BREUX D.","CARDENNE MLLE C.",null,18400,null,"1p 7p 3p 8p 0p 5p (14) 2p 6p 0p 4p 6p 8p"]
[null,3,"MUSICAL VALLEY",60,2,"H6","SANTIAGO MLLE D.","SCHOOF R.",null,55854,"A","0p 0p (14) 9p 20p 0p (13) 2p 1p 2p 2p 5p 1p 0p"]
[null,4,"RHYTHM OF LIFE","59.5",9,"M6","MARCHELLI R.","ECURIE DES PLAGES (E1)",null,114750,"X","3p 9p 0p 0p 6p 7p 0p 2p 6p 2p 5p 5p"]
[null,5,"AS D'ARTOIS","59.5",15,"H5","HARDOUIN E.","FERRAT MME V.",null,54800,"X","4p 1p 1p 4p 8p 8p 0p (14) 0p 0p 0p 8p 4p"]
[null,6,"DONDARGENT","Non Partant"]
[null,7,"LADY HARTWOOD",58,5,"F8","LEFEBVRE F.","DISSAUX MLLE V.",null,138600,"X","0p 0p 6p 2p 0p 6p 6p 1p 6p 1p 7p 0p"]
[null,8,"MISS DUNANERIE",56,1,"F8","HAMELIN A.","FOUIN (S) Y.",null,77480,"X","4p 6p 2p 0p 3p 2p 1p 3p 0p 0p 5p 3p"]
[null,9,"BLUSTER",56,6,"H9","BENOIST G.","COLLET (S) ROB.",null,292490,"X","6p 0p 2p 3p 4p 9p 8p 0p 9p 3p 7p 8p"]
[null,10,"AUENDON",56,17,"H8","SARAIVA W.","FRACAS ALEX.",null,77620,"X","8p 0p 4p (14) 1p 5p 0p 0p 0p 5p 0p (13) 0p 3p"]
[null,11,"COLUNGA","54.5",7,"F7","CONGIU G.","AZZOPARDI P.",null,33350,"X","1p 6p 2p 0p 0p 0p (14) 0p 0p 9p 6p 0p 8p"]
[null,12,"MARANGU","54.5",8,"H9","DELALANDE M.","PEDRONO F.",null,90125,null,"0p 6p 0p 2p 0p 0p (14) 0p 20p 8p 0p 0p 0p"]
[null,13,"FIRST MENANTIE",54,3,"H4","VERON F.","BAUER C.",null,9600,"A","0p 0p 0p 0p 0p 1p 5p 0p 7p 0p 0p 0p"]
[null,14,"HAMARKHIS",53,10,"M4","BREUX S.","BERNAUD G.",null,8150,"A","6p 0p 7p 3p 9p 0p 6p (14) 8p 2p 1p 9p 0p"]
[null,15,"MY DELIGHT",53,14,"H8","COUTIER A.","SAGOT A.",null,43550,null,"0p 5p 0p 0p 5p (14) 0p 4p 0p 0p 0p 8p 7p"]
[null,16,"SUN SEA BIRD",53,11,"H7","MAILLOT S.","ECURIE DES PLAGES (E1)",null,219860,"X","0p 0p 0p 0p 4p 9p 0p 7p 7p 4p 8p 0p"]
[null,17,"NILSON",53,12,"H6","KASZTELAN N.","ECURIE DES PLAGES (E1)",null,86900,null,"0p 8p 3p 8p 8p 0p 0p 0p (14) 0p 8p 0p 7p"]
[]
[null,"Haut de page Pronostics Arrivées et rapports"]
[]
[null,"Site mobile"]
[null,"Application iPhone"]
[null,"Application Androïd"]
[null,"footer-picto1"]
[null,"Courses"]
[null,"Partants PMU"]
[null,"Courses pmu Hippiques"]
[null,"Quinté du jour"]
[null,"Pronostic Quinté +"]
[null,"Résultats PMU"]
[null,"footer-picto2"]
[null,"Actualités des courses"]
[null,"Turf actualités"]
[null,"PMU Résultats"]
[null,"Flux RSS des actualités"]
[null,"footer-picto3"]
[null,"Aides & Guides"]
[null,"Guide du Turfiste"]
[null,"PMU en ligne"]
[null,"Gagner aux courses"]
[null,"Lexique hippique"]
[null,"FAQ"]
[null,"footer-picto4"]
[null,"Les grands Evènements"]
[null,"Grand Prix d'Amérique"]
[null,"Qatar - Prix de l'Arc de Triomphe"]
[null,"Prix de Diane"]
[null,"Prix du Jockey Club"]
[null,"footer-picto5"]
[null,"Jouer en ligne"]
[null,"Tiercé"]
[null,"Quinté"]
[null,"PMU Poker"]
[null,"Opérateurs Hippiques"]
[null,"Jouer la cote"]
[null,"Prix des jeux"]
[null,"Partenariat Cashback"]
[null,"footer-picto6"]
[null,"Fiches Hippodromes"]
[null,"MAISONS LAFFITTE"]
[null,"COMPIEGNE"]
[null,"LAVAL"]
[null,"VICHY"]
[null,"PARIS VINCENNES"]
[null,"LA PLATA (ARG)"]
[null,"footer-picto7"]
[null,"+ de sites eliraweb"]
[null,"Banque en ligne"]
[null,"Bourses en ligne"]
[null,"Forfait Mobile"]
[null,"Prime énergie - kelenergie.fr"]
[null,"EliraCash"]
[null,"footer-picto8"]
[null,"Infos légales"]
[null,"Conditions générales de vente"]
[null,"Mentions légales"]
[null,"Données personnelles et cookies"]
[null,"Nous contacter"]
[null,"W3C"]
[null,"TURFOMANIA © Copyright 2003 - 2015 : Turfomania.fr - Tous Droits Réservés. Le Site Turfomania.fr est édité par Eliraweb"]
[null,"Turfomania.fr n'est pas un site de prise de paris hippiques, c'est un site communautaire pour gagner plus souvent aux courses !"]
[null,"« Jouer comporte des risques : dépendance, isolement... Appelez le 09 74 75 13 13 »"]
[null,"Cookies"]
[null,"En poursuivant votre navigation sur ce site, vous acceptez l'utilisation de cookies pour vous proposer des services et offres adaptés."]
[]
[null,"Pour en savoir plus et paramétrer les cookies. "]

{"sheet":"Temp","index":7,"n_rows":174,"n_cols":9,"rows_kept":174,"cut":false,"hidden":true,"merged":[]}
[]
[]
[]
[null,"Devenir membre"]
[null,"Des pronostics professionnels quotidiens sur toutes les courses pmu"]
[null,"Espace communautaire (fiche membre, participation aux forums, t'chat ...)"]
[null,"Paris virtuels : devenez l'as des courses !"]
[null,"Alertes SMS lorsque le cheval que vous suivez est engagé dans une course"]
[null,"Accès aux pronostics Turf Machine"]
[null,"S'inscrire gratuitement"]
[null,"Gratuit"]
[null,"Club Premium"]
[null,"Les fonctionnalités de l'espace gratuit +"]
[null,"Le journal quotidien de TURFOMANIA"]
[null,"Des bons coups gagnants tous les jours"]
[null,"Un coup sûr à jouer tous les jours"]
[null,"Le Scan premium de Turfomania le nouvel outil des joueurs experts sur toutes les courses pmu"]
[null,"Suppression des publicités sur tout le site et webmobile"]
[null,"Devenir Membre Premium"]
[null,"à partir de 1,80€"]
[null,"Déjà membre ?"]
[null,"Login"]
[null,"Mot de passe"]
[null,"Mot de passe perdu ?"]
[null,"Identifiez-vous"]
[null,"Turfomania"]
[null,"Pour gagner plus"]
[null,"souvent aux courses !"]
[null,"Le journal de Turfomania"]
[null,"Pour + de fonctionnalités sur Turfomania, connectez-vous à votre"]
[null,"Espace membre"]
[null,"Home"]
[null,"S'identifier"]
[null,"Déjà membre ?"]
[null,"Login"]
[null,"Mot de passe"]
[null,"Mot de passe perdu ?"]
[null,"Nouveau membre ?"]
[null,"Devenez Membre Gratuit"]
[null,"Devenez Membre Premium"]
[null,"Parier"]
[null,"Partants"]
[null,"Pronostics"]
[null,"Arrivées & rapports"]
[null,"Actualités"]
[null,"Forums"]
[null,"Betclic"]
[null,"Devenir Premium"]
[null,"1 Parier avec BetClicParier avec BetClic"]
[null,"200 € de bonus offerts Parier avec BetClic"]
[null,"2 Parier avec PMUParier avec PMU"]
[null,"170 € de bonus offerts Parier avec PMU"]
[null,"3 Parier avec GenybetParier avec Genybet"]
[null,"250 € de bonus offerts Parier avec Genybet"]
[null,"Pronostics"]
[null,"Spécial Quinté +"]
[null,"Pronostics courses"]
[null,"Statistiques/bilans"]
[null,"Club Premium"]
[null,"Abonnement"]
[null,"Pronostics premium"]
[null,"Le journal"]
[null,"Fiches"]
[null,"Chevaux"]
[null,"Jockeys"]
[null,"Entraineurs"]
[null,"Propriétaires"]
[null,"Hippodromes"]
[null,"Paris virtuels"]
[null,"Jouer en ligne"]
[null,"Acheter des points"]
[null,"Comment jouer ?"]
[null,"Règles du jeu"]
[]
[null,"Partants & Programmes PMU"]
[null,"Accueil > Partants & Programmes PMU"]
[]
[null,"PMU PMH Toutes les réunions"]
[]
[null,"Spécialité","Jour","Réunion","Heure","Courses",null,"Hippodromme","PMU/PMH"]
[null,"Acourse","Jeudi 17 Septembre 2015","Réunion 1","12h15","8 courses","Q+","PARIS VINCENNES","PMU"]
[null,"coursecourse","Jeudi 17 Septembre 2015","Réunion 2","11h10","9 courses",null,"NANCY","PMU"]
[null,"course","Jeudi 17 Septembre 2015","Réunion 3","15h40","8 courses",null,"SAINT CLOUD","PMU"]
[null,"coursecourse","Jeudi 17 Septembre 2015","Réunion 4","15h50","8 courses",null,"NANTES","PMU"]
[null,"Acourse","Mercredi 16 Septembre 2015","Réunion 1","13h20","8 courses","Q+","AMIENS","PMU"]
[null,"course","Mercredi 16 Septembre 2015","Réunion 2","11h40","8 courses",null,"FONTAINEBLEAU","PMU"]
[null,"course","Mercredi 16 Septembre 2015","Réunion 3","15h50","8 courses",null,"AUTEUIL","PMU"]
[null,"Acourse","Mercredi 16 Septembre 2015","Réunion 4","17h25","8 courses",null,"CABOURG","PMU"]
[null,"A","Mercredi 16 Septembre 2015","Réunion PMU","13h30","7 courses",null,"MARSEILLE BORELY","PMU/PMH"]
[null,"course","Mardi 15 Septembre 2015","Réunion 1","11h55","9 courses","Q+","MAISONS LAFFITTE","PMU"]
[null,"course","Mardi 15 Septembre 2015","Réunion 2","11h40","8 courses",null,"COMPIEGNE","PMU"]
[null,"Acourse","Mardi 15 Septembre 2015","Réunion 3","15h40","7 courses",null,"LAVAL","PMU"]
[null,"Acourse","Mardi 15 Septembre 2015","Réunion 4","16h30","8 courses",null,"VICHY","PMU"]
[null,"Acourse","Mardi 15 Septembre 2015","Réunion 5","19h25","7 courses",null,"PARIS VINCENNES","PMU"]
[null,"course","Mardi 15 Septembre 2015","Réunion 6","20h35","5 courses",null,"LA PLATA","PMU"]
[null,"Acourse","Lundi 14 Septembre 2015","Réunion 1","13h20","8 courses","Q+","PARIS VINCENNES","PMU"]
[null,"coursecourse","Lundi 14 Septembre 2015","Réunion 2","11h10","9 courses",null,"MOULINS","PMU"]
[null,"course","Lundi 14 Septembre 2015","Réunion 3","15h45","8 courses",null,"SAINT CLOUD","PMU"]
[null,"course","Lundi 14 Septembre 2015","Réunion 4","17h20","6 courses",null,"CASABLANCA","PMU"]
[null,"Acourse","Lundi 14 Septembre 2015","Réunion PMU","18h20","7 courses",null,"LE CROISE LAROCHE","PMU/PMH"]
[]
[null,1]
[null,2]
[null,3]
[null,4]
[null,5]
[null,6]
[null,">>"]
[null,"Site mobile"]
[null,"Application iPhone"]
[null,"Application Androïd"]
[null,"footer-picto1"]
[null,"Courses"]
[null,"Partants PMU"]
[null,"Courses pmu Hippiques"]
[null,"Quinté du jour"]
[null,"Pronostic Quinté +"]
[null,"Résultats PMU"]
[null,"footer-picto2"]
[null,"Actualités des courses"]
[null,"Turf actualités"]
[null,"PMU Résultats"]
[null,"Flux RSS des actualités"]
[null,"footer-picto3"]
[null,"Aides & Guides"]
[null,"Guide du Turfiste"]
[null,"PMU en ligne"]
[null,"Gagner aux courses"]
[null,"Lexique hippique"]
[null,"FAQ"]
[null,"footer-picto4"]
[null,"Les grands Evènements"]
[null,"Grand Prix d'Amérique"]
[null,"Qatar - Prix de l'Arc de Triomphe"]
[null,"Prix de Diane"]
[null,"Prix du Jockey Club"]
[null,"footer-picto5"]
[null,"Jouer en ligne"]
[null,"Tiercé"]
[null,"Quinté"]
[null,"PMU Poker"]
[null,"Opérateurs Hippiques"]
[null,"Jouer la cote"]
[null,"Prix des jeux"]
[null,"Partenariat Cashback"]
[null,"footer-picto6"]
[null,"Fiches Hippodromes"]
[null,"MAISONS LAFFITTE"]
[null,"COMPIEGNE"]
[null,"LAVAL"]
[null,"VICHY"]
[null,"PARIS VINCENNES"]
[null,"LA PLATA (ARG)"]
[null,"footer-picto7"]
[null,"+ de sites eliraweb"]
[null,"Banque en ligne"]
[null,"Bourses en ligne"]
[null,"Forfait Mobile"]
[null,"Prime énergie - kelenergie.fr"]
[null,"EliraCash"]
[null,"footer-picto8"]
[null,"Infos légales"]
[null,"Conditions générales de vente"]
[null,"Mentions légales"]
[null,"Données personnelles et cookies"]
[null,"Nous contacter"]
[null,"W3C"]
[null,"TURFOMANIA © Copyright 2003 - 2015 : Turfomania.fr - Tous Droits Réservés. Le Site Turfomania.fr est édité par Eliraweb"]
[null,"Turfomania.fr n'est pas un site de prise de paris hippiques, c'est un site communautaire pour gagner plus souvent aux courses !"]
[null,"« Jouer comporte des risques : dépendance, isolement... Appelez le 09 74 75 13 13 »"]
[null,"Cookies"]
[null,"En poursuivant votre navigation sur ce site, vous acceptez l'utilisation de cookies pour vous proposer des services et offres adaptés."]
[]
[null,"Pour en savoir plus et paramétrer les cookies. "]

{"sheet":"Temp2","index":8,"n_rows":175,"n_cols":9,"rows_kept":175,"cut":false,"hidden":true,"merged":[]}
[]
[]
[]
[null,"Devenir membre"]
[null,"Des pronostics professionnels quotidiens sur toutes les courses pmu"]
[null,"Espace communautaire (fiche membre, participation aux forums, t'chat ...)"]
[null,"Paris virtuels : devenez l'as des courses !"]
[null,"Alertes SMS lorsque le cheval que vous suivez est engagé dans une course"]
[null,"Accès aux pronostics Turf Machine"]
[null,"S'inscrire gratuitement"]
[null,"Gratuit"]
[null,"Club Premium"]
[null,"Les fonctionnalités de l'espace gratuit +"]
[null,"Le journal quotidien de TURFOMANIA"]
[null,"Des bons coups gagnants tous les jours"]
[null,"Un coup sûr à jouer tous les jours"]
[null,"Le Scan premium de Turfomania le nouvel outil des joueurs experts sur toutes les courses pmu"]
[null,"Suppression des publicités sur tout le site et webmobile"]
[null,"Devenir Membre Premium"]
[null,"à partir de 1,80€"]
[null,"Déjà membre ?"]
[null,"Login"]
[null,"Mot de passe"]
[null,"Mot de passe perdu ?"]
[null,"Identifiez-vous"]
[null,"Turfomania"]
[null,"Pour gagner plus"]
[null,"souvent aux courses !"]
[null,"Le journal de Turfomania"]
[null,"Pour + de fonctionnalités sur Turfomania, connectez-vous à votre"]
[null,"Espace membre"]
[null,"Home"]
[null,"S'identifier"]
[null,"Déjà membre ?"]
[null,"Login"]
[null,"Mot de passe"]
[null,"Mot de passe perdu ?"]
[null,"Nouveau membre ?"]
[null,"Devenez Membre Gratuit"]
[null,"Devenez Membre Premium"]
[null,"Parier"]
[null,"Partants"]
[null,"Pronostics"]
[null,"Arrivées & rapports"]
[null,"Actualités"]
[null,"Forums"]
[null,"Betclic"]
[null,"Devenir Premium"]
[null,"1 Parier avec BetClicParier avec BetClic"]
[null,"200 € de bonus offerts Parier avec BetClic"]
[null,"2 Parier avec PMUParier avec PMU"]
[null,"170 € de bonus offerts Parier avec PMU"]
[null,"3 Parier avec GenybetParier avec Genybet"]
[null,"250 € de bonus offerts Parier avec Genybet"]
[null,"Pronostics"]
[null,"Spécial Quinté +"]
[null,"Pronostics courses"]
[null,"Statistiques/bilans"]
[null,"Club Premium"]
[null,"Abonnement"]
[null,"Pronostics premium"]
[null,"Le journal"]
[null,"Fiches"]
[null,"Chevaux"]
[null,"Jockeys"]
[null,"Entraineurs"]
[null,"Propriétaires"]
[null,"Hippodromes"]
[null,"Paris virtuels"]
[null,"Jouer en ligne"]
[null,"Acheter des points"]
[null,"Comment jouer ?"]
[null,"Règles du jeu"]
[]
[null,"Partants & Programmes PMU"]
[null,"Accueil > Partants & Programmes PMU"]
[]
[null,"PMU PMH Toutes les réunions"]
[]
[null,"Spécialité","Jour","Réunion","Heure","Courses",null,"Hippodromme","PMU/PMH"]
[null,"Acoursecourse","Lundi 14 Septembre 2015","Réunion PMU","14h10","6 courses",null,"HYERES","PMU/PMH"]
[null,"course","Dimanche 13 Septembre 2015","Réunion 1","13h40","9 courses","Q+","LONGCHAMP","PMU"]
[null,"course","Dimanche 13 Septembre 2015","Réunion 2","10h55","8 courses",null,"MONT DE MARSAN","PMU"]
[null,"Acourse","Dimanche 13 Septembre 2015","Réunion 3","14h55","8 courses",null,"MAUQUENCHY","PMU"]
[null,"Acourse","Dimanche 13 Septembre 2015","Réunion 4","12h00","7 courses",null,"AUCH","PMU/PMH"]
[null,"A","Dimanche 13 Septembre 2015","Réunion 5","14h00","8 courses",null,"MONS","PMU/PMH"]
[null,"A","Dimanche 13 Septembre 2015","Réunion 6","14h00","2 courses",null,"BJERKE","PMU"]
[null,"course","Dimanche 13 Septembre 2015","Réunion 7","14h30","8 courses",null,"CURRAGH","PMU/PMH"]
[null,"Acoursecourse","Dimanche 13 Septembre 2015","Réunion PMU","14h00","8 courses",null,"LYON PARILLY","PMU/PMH"]
[null,"Acourse","Dimanche 13 Septembre 2015","Réunion PMU","14h10","7 courses",null,"CARPENTRAS","PMU/PMH"]
[null,"Acourse","Samedi 12 Septembre 2015","Réunion 1","13h00","9 courses","Q+","PARIS VINCENNES","PMU"]
[null,"coursecourse","Samedi 12 Septembre 2015","Réunion 2","11h55","7 courses",null,"CHOLET","PMU"]
[null,"course","Samedi 12 Septembre 2015","Réunion 3","15h35","8 courses",null,"FONTAINEBLEAU","PMU"]
[null,"Acourse","Samedi 12 Septembre 2015","Réunion 4","17h40","8 courses",null,"VICHY","PMU"]
[null,"A","Samedi 12 Septembre 2015","Réunion 5","11h00","8 courses",null,"WOLVEGA","PMU/PMH"]
[null,"course","Samedi 12 Septembre 2015","Réunion 6","14h30","7 courses",null,"DONCASTER","PMU/PMH"]
[null,"course","Samedi 12 Septembre 2015","Réunion 7","16h00","8 courses",null,"LEOPARDSTOWN","PMU/PMH"]
[null,"Acourse","Samedi 12 Septembre 2015","Réunion PMU","13h30","9 courses",null,"AVIGNON","PMU/PMH"]
[null,"coursecourse","Vendredi 11 Septembre 2015","Réunion 1","13h30","8 courses",null,"LYON PARILLY","PMU"]
[null,"course","Vendredi 11 Septembre 2015","Réunion 2","11h40","8 courses",null,"ENGHIEN SOISY","PMU"]
[]
[null,1]
[null,2]
[null,3]
[null,4]
[null,5]
[null,6]
[null,7]
[null,">>"]
[null,"Site mobile"]
[null,"Application iPhone"]
[null,"Application Androïd"]
[null,"footer-picto1"]
[null,"Courses"]
[null,"Partants PMU"]
[null,"Courses pmu Hippiques"]
[null,"Quinté du jour"]
[null,"Pronostic Quinté +"]
[null,"Résultats PMU"]
[null,"footer-picto2"]
[null,"Actualités des courses"]
[null,"Turf actualités"]
[null,"PMU Résultats"]
[null,"Flux RSS des actualités"]
[null,"footer-picto3"]
[null,"Aides & Guides"]
[null,"Guide du Turfiste"]
[null,"PMU en ligne"]
[null,"Gagner aux courses"]
[null,"Lexique hippique"]
[null,"FAQ"]
[null,"footer-picto4"]
[null,"Les grands Evènements"]
[null,"Grand Prix d'Amérique"]
[null,"Qatar - Prix de l'Arc de Triomphe"]
[null,"Prix de Diane"]
[null,"Prix du Jockey Club"]
[null,"footer-picto5"]
[null,"Jouer en ligne"]
[null,"Tiercé"]
[null,"Quinté"]
[null,"PMU Poker"]
[null,"Opérateurs Hippiques"]
[null,"Jouer la cote"]
[null,"Prix des jeux"]
[null,"Partenariat Cashback"]
[null,"footer-picto6"]
[null,"Fiches Hippodromes"]
[null,"MAISONS LAFFITTE"]
[null,"COMPIEGNE"]
[null,"LAVAL"]
[null,"VICHY"]
[null,"PARIS VINCENNES"]
[null,"LA PLATA (ARG)"]
[null,"footer-picto7"]
[null,"+ de sites eliraweb"]
[null,"Banque en ligne"]
[null,"Bourses en ligne"]
[null,"Forfait Mobile"]
[null,"Prime énergie - kelenergie.fr"]
[null,"EliraCash"]
[null,"footer-picto8"]
[null,"Infos légales"]
[null,"Conditions générales de vente"]
[null,"Mentions légales"]
[null,"Données personnelles et cookies"]
[null,"Nous contacter"]
[null,"W3C"]
[null,"TURFOMANIA © Copyright 2003 - 2015 : Turfomania.fr - Tous Droits Réservés. Le Site Turfomania.fr est édité par Eliraweb"]
[null,"Turfomania.fr n'est pas un site de prise de paris hippiques, c'est un site communautaire pour gagner plus souvent aux courses !"]
[null,"« Jouer comporte des risques : dépendance, isolement... Appelez le 09 74 75 13 13 »"]
[null,"Cookies"]
[null,"En poursuivant votre navigation sur ce site, vous acceptez l'utilisation de cookies pour vous proposer des services et offres adaptés."]
[]
[null,"Pour en savoir plus et paramétrer les cookies. "]

{"sheet":"Feuil2","index":9,"n_rows":0,"n_cols":0,"rows_kept":0,"cut":false,"hidden":false,"merged":[]}