{"text_format":"1","workbook":"xlsx","n_sheets":6,"sheets":["Codes Projet","Codes Société","Codes TVA","Codes O","Codes CO","Fichier de saisie"],"not_rendered":{"charts":0,"images":1,"macros":1,"external_links":0,"defined_names":18,"comments":0,"pivot_tables":0},"unopened":[],"bounds":{"document_bytes":16777216,"sheet_cells":100000,"rows_first":2000,"rows_last":500,"rows_between":2000,"halvings":0,"cell_chars":16384,"cell_head_chars":4096},"cells_cut":0,"cells_raw":0,"read":"whole","date_system":"1900"}

{"sheet":"Codes Projet","index":0,"n_rows":3664,"n_cols":2,"rows_kept":3664,"cut":false,"hidden":false,"merged":[]}
["Projet","Libellé long Projet"]
["PROJ1","PROJET 1"]
["PROJ2","PROJET 2"]
["PROJ3","PROJET 3"]
["PROJ4","PROJET 4"]
["PROJ5","PROJET 5"]
["PROJ6","PROJET 6"]
["PROJ7","PROJET 7"]
["PROJ8","PROJET 8"]
["PROJ9","PROJET 9"]
["PROJ10","PROJET 10"]
["PROJ11","PROJET 11"]
["PROJ12","PROJET 12"]
["PROJ13","PROJET 13"]
["PROJ14","PROJET 14"]
["PROJ15","PROJET 15"]
["PROJ16","PROJET 16"]
["PROJ17","PROJET 17"]
["PROJ18","PROJET 18"]
["PROJ19","PROJET 19"]
["PROJ20","PROJET 20"]
["PROJ21","PROJET 21"]
["PROJ22","PROJET 22"]
["PROJ23","PROJET 23"]
["PROJ24","PROJET 24"]
["PROJ25","PROJET 25"]
["PROJ26","PROJET 26"]
["PROJ27","PROJET 27"]
["PROJ28","PROJET 28"]
["PROJ29","PROJET 29"]
["PROJ30","PROJET 30"]
["PROJ31","PROJET 31"]
["PROJ32","PROJET 32"]
["PROJ33","PROJET 33"]
["PROJ34","PROJET 34"]
["PROJ35","PROJET 35"]
["PROJ36","PROJET 36"]
["PROJ37","PROJET 37"]
["PROJ38","PROJET 38"]
["PROJ39","PROJET 39"]
["PROJ40","PROJET 40"]
["PROJ41","PROJET 41"]
["PROJ42","PROJET 42"]
["PROJ43","PROJET 43"]
["PROJ44","PROJET 44"]
["PROJ45","PROJET 45"]
["PROJ46","PROJET 46"]
["PROJ47","PROJET 47"]
["PROJ48","PROJET 48"]
["PROJ49","PROJET 49"]
["PROJ50","PROJET 50"]
["PROJ51","PROJET 51"]
["PROJ52","PROJET 52"]
["PROJ53","PROJET 53"]
["PROJ54","PROJET 54"]
["PROJ55","PROJET 55"]
["PROJ56","PROJET 56"]
["PROJ57","PROJET 57"]
["PROJ58","PROJET 58"]
["PROJ59","PROJET 59"]
["PROJ60","PROJET 60"]
["PROJ61","PROJET 61"]
["PROJ62","PROJET 62"]
["PROJ63","PROJET 63"]
["PROJ64","PROJET 64"]
["PROJ65","PROJET 65"]
["PROJ66","PROJET 66"]
["PROJ67","PROJET 67"]
["PROJ68","PROJET 68"]
["PROJ69","PROJET 69"]
["PROJ70","PROJET 70"]
["PROJ71","PROJET 71"]
["PROJ72","PROJET 72"]
["PROJ73","PROJET 73"]
["PROJ74","PROJET 74"]
["PROJ75","PROJET 75"]
["PROJ76","PROJET 76"]
["PROJ77","PROJET 77"]
["PROJ78","PROJET 78"]
["PROJ79","PROJET 79"]
["PROJ80","PROJET 80"]
["PROJ81","PROJET 81"]
["PROJ82","PROJET 82"]
["PROJ83","PROJET 83"]
["PROJ84","PROJET 84"]
["PROJ85","PROJET 85"]
["PROJ86","PROJET 86"]
["PROJ87","PROJET 87"]
["PROJ88","PROJET 88"]
["PROJ89","PROJET 89"]
["PROJ90","PROJET 90"]
["PROJ91","PROJET 91"]
["PROJ92","PROJET 92"]
["PROJ93","PROJET 93"]
["PROJ94","PROJET 94"]
["PROJ95","PROJET 95"]
["PROJ96","PROJET 96"]
["PROJ97","PROJET 97"]
["PROJ98","PROJET 98"]
["PROJ99","PROJET 99"]
["PROJ100","PROJET 100"]
["PROJ101","PROJET 101"]
["PROJ102","PROJET 102"]
["PROJ103","PROJET 103"]
["PROJ104","PROJET 104"]
["PROJ105","PROJET 105"]
["PROJ106","PROJET 106"]
["PROJ107","PROJET 107"]
["PROJ108","PROJET 108"]
["PROJ109","PROJET 109"]
["PROJ110","PROJET 110"]
["PROJ111","PROJET 111"]
["PROJ112","PROJET 112"]
["PROJ113","PROJET 113"]
["PROJ114","PROJET 114"]
["PROJ115","PROJET 115"]
["PROJ116","PROJET 116"]
["PROJ117","PROJET 117"]
["PROJ118","PROJET 118"]
["PROJ119","PROJET 119"]
["PROJ120","PROJET 120"]
["PROJ121","PROJET 121"]
["PROJ122","PROJET 122"]
["PROJ123","PROJET 123"]
["PROJ124","PROJET 124"]
["PROJ125","PROJET 125"]
["PROJ126","PROJET 126"]
["PROJ127","PROJET 127"]
["PROJ128","PROJET 128"]
["PROJ129","PROJET 129"]
["PROJ130","PROJET 130"]
["PROJ131","PROJET 131"]
["PROJ132","PROJET 132"]
["PROJ133","PROJET 133"]
["PROJ134","PROJET 134"]
["PROJ135","PROJET 135"]
["PROJ136","PROJET 136"]
["PROJ137","PROJET 137"]
["PROJ138","PROJET 138"]
["PROJ139","PROJET 139"]
["PROJ140","PROJET 140"]
["PROJ141","PROJET 141"]
["PROJ142","PROJET 142"]
["PROJ143","PROJET 143"]
["PROJ144","PROJET 144"]
["PROJ145","PROJET 145"]
["PROJ146","PROJET 146"]
["PROJ147","PROJET 147"]
["PROJ148","PROJET 148"]
["PROJ149","PROJET 149"]
["PROJ150","PROJET 150"]
["PROJ151","PROJET 151"]
["PROJ152","PROJET 152"]
["PROJ153","PROJET 153"]
["PROJ154","PROJET 154"]
["PROJ155","PROJET 155"]
["PROJ156","PROJET 156"]
["PROJ157","PROJET 157"]
["PROJ158","PROJET 158"]
["PROJ159","PROJET 159"]
["PROJ160","PROJET 160"]
["PROJ161","PROJET 161"]
["PROJ162","PROJET 162"]
["PROJ163","PROJET 163"]
["PROJ164","PROJET 164"]
["PROJ165","PROJET 165"]
["PROJ166","PROJET 166"]
["PROJ167","PROJET 167"]
["PROJ168","PROJET 168"]
["PROJ169","PROJET 169"]
["PROJ170","PROJET 170"]
["PROJ171","PROJET 171"]
["PROJ172","PROJET 172"]
["PROJ173","PROJET 173"]
["PROJ174","PROJET 174"]
["PROJ175","PROJET 175"]
["PROJ176","PROJET 176"]
["PROJ177","PROJET 177"]
["PROJ178","PROJET 178"]
["PROJ179","PROJET 179"]
["PROJ180","PROJET 180"]
["PROJ181","PROJET 181"]
["PROJ182","PROJET 182"]
["PROJ183","PROJET 183"]
["PROJ184","PROJET 184"]
["PROJ185","PROJET 185"]
["PROJ186","PROJET 186"]
["PROJ187","PROJET 187"]
["PROJ188","PROJET 188"]
["PROJ189","PROJET 189"]
["PROJ190","PROJET 190"]
["PROJ191","PROJET 191"]
["PROJ192","PROJET 192"]
["PROJ193","PROJET 193"]
["PROJ194","PROJET 194"]
["PROJ195","PROJET 195"]
["PROJ196","PROJET 196"]
["PROJ197","PROJET 197"]
["PROJ198","PROJET 198"]
["PROJ199","PROJET 199"]
{"$rows_left_out":3465}
{"sheet":"Codes Société","index":1,"n_rows":259,"n_cols":2,"rows_kept":259,"cut":false,"hidden":false,"merged":[]}
["ORIGINE CIALE","Nom de CIALE"]
[1,"SOCIETE1"]
[2,"SOCIETE2"]
[3,"SOCIETE3"]
[4,"SOCIETE4"]
[5,"SOCIETE5"]
[6,"SOCIETE6"]
[7,"SOCIETE7"]
[8,"SOCIETE8"]
[9,"SOCIETE9"]
[10,"SOCIETE10"]
[11,"SOCIETE11"]
[12,"SOCIETE12"]
[13,"SOCIETE13"]
[14,"SOCIETE14"]
[15,"SOCIETE15"]
[16,"SOCIETE16"]
[17,"SOCIETE17"]
[18,"SOCIETE18"]
[19,"SOCIETE19"]
[20,"SOCIETE20"]
[21,"SOCIETE21"]
[22,"SOCIETE22"]
[23,"SOCIETE23"]
[24,"SOCIETE24"]
[25,"SOCIETE25"]
[26,"SOCIETE26"]
[27,"SOCIETE27"]
[28,"SOCIETE28"]
[29,"SOCIETE29"]
[30,"SOCIETE30"]
[31,"SOCIETE31"]
[32,"SOCIETE32"]
[33,"SOCIETE33"]
[34,"SOCIETE34"]
[35,"SOCIETE35"]
[36,"SOCIETE36"]
[37,"SOCIETE37"]
[38,"SOCIETE38"]
[39,"SOCIETE39"]
[40,"SOCIETE40"]
[41,"SOCIETE41"]
[42,"SOCIETE42"]
[43,"SOCIETE43"]
[44,"SOCIETE44"]
[45,"SOCIETE45"]
[46,"SOCIETE46"]
[47,"SOCIETE47"]
[48,"SOCIETE48"]
[49,"SOCIETE49"]
[50,"SOCIETE50"]
[51,"SOCIETE51"]
[52,"SOCIETE52"]
[53,"SOCIETE53"]
[54,"SOCIETE54"]
[55,"SOCIETE55"]
[56,"SOCIETE56"]
[57,"SOCIETE57"]
[58,"SOCIETE58"]
[59,"SOCIETE59"]
[60,"SOCIETE60"]
[61,"SOCIETE61"]
[62,"SOCIETE62"]
[63,"SOCIETE63"]
[64,"SOCIETE64"]
[65,"SOCIETE65"]
[66,"SOCIETE66"]
[67,"SOCIETE67"]
[68,"SOCIETE68"]
[69,"SOCIETE69"]
[70,"SOCIETE70"]
[71,"SOCIETE71"]
[72,"SOCIETE72"]
[73,"SOCIETE73"]
[74,"SOCIETE74"]
[75,"SOCIETE75"]
[76,"SOCIETE76"]
[77,"SOCIETE77"]
[78,"SOCIETE78"]
[79,"SOCIETE79"]
[80,"SOCIETE80"]
[81,"SOCIETE81"]
[82,"SOCIETE82"]
[83,"SOCIETE83"]
[84,"SOCIETE84"]
[85,"SOCIETE85"]
[86,"SOCIETE86"]
[87,"SOCIETE87"]
[88,"SOCIETE88"]
[89,"SOCIETE89"]
[90,"SOCIETE90"]
[91,"SOCIETE91"]
[92,"SOCIETE92"]
[93,"SOCIETE93"]
[94,"SOCIETE94"]
[95,"SOCIETE95"]
[96,"SOCIETE96"]
[97,"SOCIETE97"]
[98,"SOCIETE98"]
[99,"SOCIETE99"]
[100,"SOCIETE100"]
[101,"SOCIETE101"]
[102,"SOCIETE102"]
[103,"SOCIETE103"]
[104,"SOCIETE104"]
[105,"SOCIETE105"]
[106,"SOCIETE106"]
[107,"SOCIETE107"]
[108,"SOCIETE108"]
[109,"SOCIETE109"]
[110,"SOCIETE110"]
[111,"SOCIETE111"]
[112,"SOCIETE112"]
[113,"SOCIETE113"]
[114,"SOCIETE114"]
[115,"SOCIETE115"]
[116,"SOCIETE116"]
[117,"SOCIETE117"]
[118,"SOCIETE118"]
[119,"SOCIETE119"]
[120,"SOCIETE120"]
[121,"SOCIETE121"]
[122,"SOCIETE122"]
[123,"SOCIETE123"]
[124,"SOCIETE124"]
[125,"SOCIETE125"]
[126,"SOCIETE126"]
[127,"SOCIETE127"]
[128,"SOCIETE128"]
[129,"SOCIETE129"]
[130,"SOCIETE130"]
[131,"SOCIETE131"]
[132,"SOCIETE132"]
[133,"SOCIETE133"]
[134,"SOCIETE134"]
[135,"SOCIETE135"]
[136,"SOCIETE136"]
[137,"SOCIETE137"]
[138,"SOCIETE138"]
[139,"SOCIETE139"]
[140,"SOCIETE140"]
[141,"SOCIETE141"]
[142,"SOCIETE142"]
[143,"SOCIETE143"]
[144,"SOCIETE144"]
[145,"SOCIETE145"]
[146,"SOCIETE146"]
[147,"SOCIETE147"]
[148,"SOCIETE148"]
[149,"SOCIETE149"]
[150,"SOCIETE150"]
[151,"SOCIETE151"]
[152,"SOCIETE152"]
[153,"SOCIETE153"]
[154,"SOCIETE154"]
[155,"SOCIETE155"]
[156,"SOCIETE156"]
[157,"SOCIETE157"]
[158,"SOCIETE158"]
[159,"SOCIETE159"]
[160,"SOCIETE160"]
[161,"SOCIETE161"]
[162,"SOCIETE162"]
[163,"SOCIETE163"]
[164,"SOCIETE164"]
[165,"SOCIETE165"]
[166,"SOCIETE166"]
[167,"SOCIETE167"]
[168,"SOCIETE168"]
[169,"SOCIETE169"]
[170,"SOCIETE170"]
[171,"SOCIETE171"]
[172,"SOCIETE172"]
[173,"SOCIETE173"]
[174,"SOCIETE174"]
[175,"SOCIETE175"]
[176,"SOCIETE176"]
[177,"SOCIETE177"]
[178,"SOCIETE178"]
[179,"SOCIETE179"]
[180,"SOCIETE180"]
[181,"SOCIETE181"]
[182,"SOCIETE182"]
[183,"SOCIETE183"]
[184,"SOCIETE184"]
[185,"SOCIETE185"]
[186,"SOCIETE186"]
[187,"SOCIETE187"]
[188,"SOCIETE188"]
[189,"SOCIETE189"]
[190,"SOCIETE190"]
[191,"SOCIETE191"]
[192,"SOCIETE192"]
[193,"SOCIETE193"]
[194,"SOCIETE194"]
[195,"SOCIETE195"]
[196,"SOCIETE196"]
[197,"SOCIETE197"]
[198,"SOCIETE198"]
[199,"SOCIETE199"]
{"$rows_left_out":60}
{"sheet":"Codes TVA","index":2,"n_rows":377,"n_cols":3,"rows_kept":377,"cut":false,"hidden":false,"merged":[]}
[]
[]
[]
[]
[]
["CODES","INTITULES","COMPTES"]
[]
[1111,"NATURE1",60000000]
[1112,"NATURE2",60000001]
[1113,"NATURE3",60000002]
[1114,"NATURE4",60000003]
[1115,"NATURE5",60000004]
[1116,"NATURE6",60000005]
[1117,"NATURE7",60000006]
[1118,"NATURE8",60000007]
[1119,"NATURE9",60000008]
[1120,"NATURE10",60000009]
[1121,"NATURE11",60000010]
[1122,"NATURE12",60000011]
[1123,"NATURE13",60000012]
[1124,"NATURE14",60000013]
[1125,"NATURE15",60000014]
[1126,"NATURE16",60000015]
[1127,"NATURE17",60000016]
[1128,"NATURE18",60000017]
[1129,"NATURE19",60000018]
[1130,"NATURE20",60000019]
[1131,"NATURE21",60000020]
[1132,"NATURE22",60000021]
[1133,"NATURE23",60000022]
[1134,"NATURE24",60000023]
[1135,"NATURE25",60000024]
[1136,"NATURE26",60000025]
[1137,"NATURE27",60000026]
[1138,"NATURE28",60000027]
[1139,"NATURE29",60000028]
[1140,"NATURE30",60000029]
[1141,"NATURE31",60000030]
[1142,"NATURE32",60000031]
[1143,"NATURE33",60000032]
[1144,"NATURE34",60000033]
[1145,"NATURE35",60000034]
[1146,"NATURE36",60000035]
[1147,"NATURE37",60000036]
[1148,"NATURE38",60000037]
[1149,"NATURE39",60000038]
[1150,"NATURE40",60000039]
[1151,"NATURE41",60000040]
[1152,"NATURE42",60000041]
[1153,"NATURE43",60000042]
[1154,"NATURE44",60000043]
[1155,"NATURE45",60000044]
[1156,"NATURE46",60000045]
[1157,"NATURE47",60000046]
[1158,"NATURE48",60000047]
[1159,"NATURE49",60000048]
[1160,"NATURE50",60000049]
[1161,"NATURE51",60000050]
[1162,"NATURE52",60000051]
[1163,"NATURE53",60000052]
[1164,"NATURE54",60000053]
[1165,"NATURE55",60000054]
[1166,"NATURE56",60000055]
[1167,"NATURE57",60000056]
[1168,"NATURE58",60000057]
[1169,"NATURE59",60000058]
[1170,"NATURE60",60000059]
[1171,"NATURE61",60000060]
[1172,"NATURE62",60000061]
[1173,"NATURE63",60000062]
[1174,"NATURE64",60000063]
[1175,"NATURE65",60000064]
[1176,"NATURE66",60000065]
[1177,"NATURE67",60000066]
[1178,"NATURE68",60000067]
[1179,"NATURE69",60000068]
[1180,"NATURE70",60000069]
[1181,"NATURE71",60000070]
[1182,"NATURE72",60000071]
[1183,"NATURE73",60000072]
[1184,"NATURE74",60000073]
[1185,"NATURE75",60000074]
[1186,"NATURE76",60000075]
[1187,"NATURE77",60000076]
[1188,"NATURE78",60000077]
[1189,"NATURE79",60000078]
[1190,"NATURE80",60000079]
[1191,"NATURE81",60000080]
[1192,"NATURE82",60000081]
[1193,"NATURE83",60000082]
[1194,"NATURE84",60000083]
[1195,"NATURE85",60000084]
[1196,"NATURE86",60000085]
[1197,"NATURE87",60000086]
[1198,"NATURE88",60000087]
[1199,"NATURE89",60000088]
[1200,"NATURE90",60000089]
[1201,"NATURE91",60000090]
[1202,"NATURE92",60000091]
[1203,"NATURE93",60000092]
[1204,"NATURE94",60000093]
[1205,"NATURE95",60000094]
[1206,"NATURE96",60000095]
[1207,"NATURE97",60000096]
[1208,"NATURE98",60000097]
[1209,"NATURE99",60000098]
[1210,"NATURE100",60000099]
[1211,"NATURE101",60000100]
[1212,"NATURE102",60000101]
[1213,"NATURE103",60000102]
[1214,"NATURE104",60000103]
[1215,"NATURE105",60000104]
[1216,"NATURE106",60000105]
[1217,"NATURE107",60000106]
[1218,"NATURE108",60000107]
[1219,"NATURE109",60000108]
[1220,"NATURE110",60000109]
[1221,"NATURE111",60000110]
[1222,"NATURE112",60000111]
[1223,"NATURE113",60000112]
[1224,"NATURE114",60000113]
[1225,"NATURE115",60000114]
[1226,"NATURE116",60000115]
[1227,"NATURE117",60000116]
[1228,"NATURE118",60000117]
[1229,"NATURE119",60000118]
[1230,"NATURE120",60000119]
[1231,"NATURE121",60000120]
[1232,"NATURE122",60000121]
[1233,"NATURE123",60000122]
[1234,"NATURE124",60000123]
[1235,"NATURE125",60000124]
[1236,"NATURE126",60000125]
[1237,"NATURE127",60000126]
[1238,"NATURE128",60000127]
[1239,"NATURE129",60000128]
[1240,"NATURE130",60000129]
[1241,"NATURE131",60000130]
[1242,"NATURE132",60000131]
[1243,"NATURE133",60000132]
[1244,"NATURE134",60000133]
[1245,"NATURE135",60000134]
[1246,"NATURE136",60000135]
[1247,"NATURE137",60000136]
[1248,"NATURE138",60000137]
[1249,"NATURE139",60000138]
[1250,"NATURE140",60000139]
[1251,"NATURE141",60000140]
[1252,"NATURE142",60000141]
[1253,"NATURE143",60000142]
[1254,"NATURE144",60000143]
[1255,"NATURE145",60000144]
[1256,"NATURE146",60000145]
[1257,"NATURE147",60000146]
[1258,"NATURE148",60000147]
[1259,"NATURE149",60000148]
[1260,"NATURE150",60000149]
[1261,"NATURE151",60000150]
[1262,"NATURE152",60000151]
[1263,"NATURE153",60000152]
[1264,"NATURE154",60000153]
[1265,"NATURE155",60000154]
[1266,"NATURE156",60000155]
[1267,"NATURE157",60000156]
[1268,"NATURE158",60000157]
[1269,"NATURE159",60000158]
[1270,"NATURE160",60000159]
[1271,"NATURE161",60000160]
[1272,"NATURE162",60000161]
[1273,"NATURE163",60000162]
[1274,"NATURE164",60000163]
[1275,"NATURE165",60000164]
[1276,"NATURE166",60000165]
[1277,"NATURE167",60000166]
[1278,"NATURE168",60000167]
[1279,"NATURE169",60000168]
[1280,"NATURE170",60000169]
[1281,"NATURE171",60000170]
[1282,"NATURE172",60000171]
[1283,"NATURE173",60000172]
[1284,"NATURE174",60000173]
[1285,"NATURE175",60000174]
[1286,"NATURE176",60000175]
[1287,"NATURE177",60000176]
[1288,"NATURE178",60000177]
[1289,"NATURE179",60000178]
[1290,"NATURE180",60000179]
[1291,"NATURE181",60000180]
[1292,"NATURE182",60000181]
[1293,"NATURE183",60000182]
[1294,"NATURE184",60000183]
[1295,"NATURE185",60000184]
[1296,"NATURE186",60000185]
[1297,"NATURE187",60000186]
[1298,"NATURE188",60000187]
[1299,"NATURE189",60000188]
[1300,"NATURE190",60000189]
[1301,"NATURE191",60000190]
[1302,"NATURE192",60000191]
[1303,"NATURE193",60000192]
{"$rows_left_out":178}
{"sheet":"Codes O","index":3,"n_rows":21,"n_cols":5,"rows_kept":21,"cut":false,"hidden":false,"merged":[]}
["Code","DIRECTION","SOUS DIRECTION","ORDRE","Code"]
[0,"DIRECTION1","DIRECTION1","DIRECTION1",0]
[1,"DIRECTION1","SOUSDIRECTION1","SOUSDIRECTION1",1]
[2,"DIRECTION1","SOUSDIRECTION1","O1",2]
[3,"DIRECTION1","SOUSDIRECTION1","O2",3]
[4,"DIRECTION1","SOUSDIRECTION1","O3",4]
[5,"DIRECTION1","SOUSDIRECTION1","O4",5]
[6,"DIRECTION1","SOUSDIRECTION1","O5",6]
[7,"DIRECTION1","SOUSDIRECTION1","O6",7]
[8,"DIRECTION1","SOUSDIRECTION1","O7",8]
[9,"DIRECTION1","SOUSDIRECTION2","SOUSDIRECTION2",9]
[10,"DIRECTION1","SOUSDIRECTION2","PREVENTION DU RISQUE  ET INNOVATION",10]
[11,"DIRECTION1","SOUSDIRECTION2","RECOUVREMENT SURENDETTEMENT",11]
[12,"DIRECTION1","SOUSDIRECTION2","SUPPORT ET DEVELOPPEMENT CREDIT",12]
[13,"DIRECTION2","DIRECTION2","DIRECTION2",13]
[14,"DIRECTION2","SOUSDIRECTION1","O8",14]
[15,"DIRECTION2","SOUSDIRECTION1","O9",15]
[16,"DIRECTION2","SOUSDIRECTION1","O10",16]
[17,"DIRECTION2","SOUSDIRECTION2","O11",17]
[18,"DIRECTION2","SOUSDIRECTION2","O12",18]
[19,"DIRECTION2","SOUSDIRECTION2","O13",19]

{"sheet":"Codes CO","index":4,"n_rows":21,"n_cols":5,"rows_kept":21,"cut":false,"hidden":false,"merged":[]}
["Code","DIRECTION","SOUS DIRECTION","ORDRE","Code"]
[0,"DIRECTION1","DIRECTION1","DIRECTION1",0]
[1,"DIRECTION1","SOUSDIRECTION1","SOUSDIRECTION1",1]
[2,"DIRECTION1","SOUSDIRECTION1","S1",2]
[3,"DIRECTION1","SOUSDIRECTION1","S2",3]
[4,"DIRECTION1","SOUSDIRECTION1","S3",4]
[5,"DIRECTION1","SOUSDIRECTION1","S4",5]
[6,"DIRECTION1","SOUSDIRECTION1","S5",6]
[7,"DIRECTION1","SOUSDIRECTION1","S6",7]
[8,"DIRECTION1","SOUSDIRECTION1","S7",8]
[9,"DIRECTION1","SOUSDIRECTION2","SOUSDIRECTION2",9]
[10,"DIRECTION1","SOUSDIRECTION2","PREVENTION DU RISQUE  ET INNOVATION",10]
[11,"DIRECTION1","SOUSDIRECTION2","RECOUVREMENT SURENDETTEMENT",11]
[12,"DIRECTION1","SOUSDIRECTION2","SUPPORT ET DEVELOPPEMENT CREDIT",12]
[13,"DIRECTION2","DIRECTION2","DIRECTION2",13]
[14,"DIRECTION2","SOUSDIRECTION1","S8",14]
[15,"DIRECTION2","SOUSDIRECTION1","S9",15]
[16,"DIRECTION2","SOUSDIRECTION1","S10",16]
[17,"DIRECTION2","SOUSDIRECTION2","S11",17]
[18,"DIRECTION2","SOUSDIRECTION2","S12",18]
[19,"DIRECTION2","SOUSDIRECTION2","S13",19]

{"sheet":"Fichier de saisie","index":5,"n_rows":20,"n_cols":16,"rows_kept":20,"cut":false,"hidden":false,"merged":[]}
["Sté de gestion","Nom société de gestion","CODES tva","INTITULES TVA","COMPTES","Direction O","Sous Direction O","Libellé O","code O",null,"Direction CO","Sous Direction CO","Libellé CO","code CO","code projet","nom projet"]
[]
[]
[]
[]
["   ",{"$f":"IFERROR(VLOOKUP(A6,'Codes Société'!A:B,2,0),\"\")","v":""}]
["   ",{"$f":"IFERROR(VLOOKUP(A7,'Codes Société'!A:B,2,0),\"\")","v":""}]
["   ",{"$f":"IFERROR(VLOOKUP(A8,'Codes Société'!A:B,2,0),\"\")","v":""}]
["   ",{"$f":"IFERROR(VLOOKUP(A9,'Codes Société'!A:B,2,0),\"\")","v":""}]
["   ",{"$f":"IFERROR(VLOOKUP(A10,'Codes Société'!A:B,2,0),\"\")","v":""}]
[null,{"$f":"IFERROR(VLOOKUP(A11,'Codes Société'!A:B,2,0),\"\")","v":""}]
["   ",{"$f":"IFERROR(VLOOKUP(A12,'Codes Société'!A:B,2,0),\"\")","v":""}]
["   ",{"$f":"IFERROR(VLOOKUP(A13,'Codes Société'!A:B,2,0),\"\")","v":""}]
["   ",{"$f":"IFERROR(VLOOKUP(A14,'Codes Société'!A:B,2,0),\"\")","v":""}]
[null,{"$f":"IFERROR(VLOOKUP(A15,'Codes Société'!A:B,2,0),\"\")","v":""}]
[null,{"$f":"IFERROR(VLOOKUP(A16,'Codes Société'!A:B,2,0),\"\")","v":""}]
[null,{"$f":"IFERROR(VLOOKUP(A17,'Codes Société'!A:B,2,0),\"\")","v":""}]
[null,{"$f":"IFERROR(VLOOKUP(A18,'Codes Société'!A:B,2,0),\"\")","v":""}]
[null,{"$f":"IFERROR(VLOOKUP(A19,'Codes Société'!A:B,2,0),\"\")","v":""}]
[null,{"$f":"IFERROR(VLOOKUP(A20,'Codes Société'!A:B,2,0),\"\")","v":""}]