{"text_format":"1","workbook":"xlsx","n_sheets":10,"sheets":["Masque de saisie","Recap","Données","Macro-planning","staff","Saisie budgétaire","Suivi budgétaire","Code des CPAM","Table de prix_Lot1","Table de prix_Lot2"],"not_rendered":{"charts":0,"images":23,"macros":1,"external_links":0,"defined_names":10,"comments":0,"pivot_tables":0},"unopened":[],"bounds":{"document_bytes":16777216,"sheet_cells":100000,"rows_first":2000,"rows_last":500,"rows_between":2000,"halvings":0,"cell_chars":16384,"cell_head_chars":4096},"cells_cut":0,"cells_raw":0,"read":"whole","date_system":"1900"}

{"sheet":"Masque de saisie","index":0,"n_rows":43,"n_cols":4,"rows_kept":43,"cut":false,"hidden":false,"merged":[[1,1,1,2],[1,3,1,4]]}
[]
[null,"FICHE DE SUIVI D'AUDIT",null,{"$f":"TODAY()","v":"2016-04-06"}]
[]
[null,"PREVISIONNEL:"]
[null,"Libellé de l'audit:"]
[]
[null,"Type d'audit:"]
[]
[null,"Organisme:"]
[]
[null,"PNA:"]
[]
[null,"Période:"]
[]
[null,"Responsable de mission:"]
[]
[null,"Auditeurs:"]
[]
[]
[]
[]
[null,"Prestataire:"]
[]
[null,"REALISATION DE L'AUDIT",null,"Réal."]
[null,"Commande du Diagnostic préalable:",{"$f":"IF($C$29=\"\",\"\",$C$29-135*(($C$29-$C$43)/135))","v":""},false]
[null,"Formulation du bon de commande:",{"$f":"IF($C$29=\"\",\"\",$C$29-105*(($C$29-$C$43)/135))","v":""},false]
[null,"Remise du rapport provisoire:",{"$f":"IF($C$29=\"\",\"\",$C$29-45*(($C$29-$C$43)/135))","v":""},false]
[null,"Phase contradictoire:",{"$f":"IF($C$29=\"\",\"\",$C$29-30*(($C$29-$C$43)/135))","v":""},false]
[null,"Rapport définitif:",null,false]
[null,"Diffusion à l'organisme:",{"$f":"IF(C25=\"\",\"\",C29+15)","v":""},false]
{"$rows_left_out":14}
{"sheet":"Recap","index":1,"n_rows":3,"n_cols":26,"rows_kept":3,"cut":false,"hidden":false,"merged":[[0,0,0,9],[0,10,0,18],[0,19,0,24],[0,27,0,29],[0,30,0,34]]}
["Descriptif",null,null,null,null,null,null,null,null,null,"Niveau d'avancement",null,null,null,null,null,null,null,null,"Suivi des recommandations"]
["Dénomination de l'audit","Type d'audit","Organisme audité","PNA","Période","Prestataire","Directeurs de Mission","Auditeurs","Date de début de mission","Date de fin de mission","Analyse préalable","Formulation BdC","Remise du rapport provisoire","Contradictoire","Rapport définitif","Diffusion","Seminaire de restitution","Projet du plan d'action","Validation du plan","Suivi des reco\nSemestre 1","Suivi des reco\nSemestre 2","Suivi des reco\nSemestre 3","Suivi des reco\nSemestre 4","Suivi des reco\nSemestre 5","Suivi des reco\nSemestre 6","N.SEMAINE"]
["a","a","a","a","a","a","a","a","2012-03-01","2012-07-01",{"$f":"Tableau5[Date de début de mission]","v":"2012-03-01"},{"$f":"Tableau5[Rapport définitif]-105*((Tableau5[Rapport définitif]-Tableau5[Analyse préalable])/135)","v":"2012-03-28T02:40:00"},{"$f":"Tableau5[Rapport définitif]-45*((Tableau5[Rapport définitif]-Tableau5[Analyse préalable])/135)","v":"2012-05-21T08:00:00"},{"$f":"Tableau5[Rapport définitif]-30*((Tableau5[Rapport définitif]-Tableau5[Analyse préalable])/135)","v":"2012-06-03T21:20:00"},{"$f":"Tableau5[Date de fin de mission]","v":"2012-07-01"},{"$f":"Tableau5[Rapport définitif]+15","v":"2012-07-16"},{"$f":"Tableau5[Diffusion]+15","v":"2012-07-31"},{"$f":"Tableau5[Seminaire de restitution]+60","v":"2012-09-29"},{"$f":"Tableau5[Projet du plan d''action]+30","v":"2012-10-29"},{"$f":"Tableau5[Validation du plan]+180","v":"2013-04-27"},{"$f":"Tableau5[Suivi des reco\nSemestre 1]+180","v":"2013-10-24"},{"$f":"Tableau5[Suivi des reco\nSemestre 2]+180","v":"2014-04-22"},{"$f":"Tableau5[Suivi des reco\nSemestre 3]+180","v":"2014-10-19"},{"$f":"Tableau5[Suivi des reco\nSemestre 4]+180","v":"2015-04-17"},{"$f":"Tableau5[Suivi des reco\nSemestre 5]+180","v":"2015-10-14"},{"$f":"WEEKNUM(Tableau5[Rapport définitif])","v":27}]

{"sheet":"Données","index":2,"n_rows":164,"n_cols":8,"rows_kept":164,"cut":false,"hidden":false,"merged":[]}
["Alain PERROT",null,null,null,"CARSAT Alsace Moselle"]
["Alain SPAENLE",null,null,null,"CARSAT Aquitaine"]
["Alexandre LE CORRE",null,null,null,"CARSAT Auvergne"]
["Arnaud MUDRY",null,null,null,"CARSAT Bourgogne Franche-Compté",null,null,""]
["Corinne GALODE",null,null,null,"CARSAT Bretagne",null,null,""]
["Joel MOSSARD",null,null,null,"CARSAT Centre"]
["Loic LE DEUNFF",null,null,null,"CARSAT Centre-Ouest"]
["Mathias DIEZ",null,null,null,"CARSAT Languedoc Roussillon"]
["Oliviana PIAZZA",null,null,null,"CARSAT Midi-Pyrénées"]
["Patricia DAVANNE",null,null,null,"CARSAT Nord Est"]
["Pierre Jean BONNOIT",null,null,null,"CARSAT Nord Picardie"]
["Said BOUNOUA",null,null,null,"CARSAT Normandie"]
["Sylvie ZEILIG",null,null,null,"CARSAT Pays de la Loire"]
[null,null,null,null,"CARSAT Rhône-Alpes"]
["Anne Sanchez",null,null,null,"CARSAT Sud-Est"]
["Francine SCHERPEREEL",null,null,null,"CRAMIF"]
["Jacqueline PEREZ",null,null,null,"CCSS Lozère"]
["Jean-Michel VALLET",null,null,null,"CGSS Guadeloupe"]
["Externalisé",null,null,null,"CGSS Guyane"]
[null,null,null,null,"CGSS Martinique"]
["Structure",null,null,null,"CGSS Réunion"]
["Thématique",null,null,null,"CICOA"]
[null,null,null,null,"CPAM  Charente-Maritime"]
["BearingPoint",null,null,null,"CPAM  Haute-Loire"]
["Eurogroup",null,null,null,"CPAM Ain"]
["Grant Thornton",null,null,null,"CPAM Aisne"]
["Interne",null,null,null,"CPAM Allier"]
["Mazars",null,null,null,"CPAM Alpes-de-Haute-Provence"]
[null,null,null,null,"CPAM Alpes-Maritimes"]
["1er semestre",null,null,null,"CPAM Ardèche"]
{"$rows_left_out":135}
{"sheet":"Macro-planning","index":3,"n_rows":49,"n_cols":57,"rows_kept":49,"cut":false,"hidden":false,"merged":[[24,3,25,3],[24,1,25,1],[24,0,25,0],[20,0,21,0],[20,1,21,1],[20,3,21,3],[22,0,23,0],[22,1,23,1],[22,3,23,3],[22,2,23,2],[20,2,21,2],[24,2,25,2],[16,0,17,0],[16,1,17,1],[16,3,17,3],[18,0,19,0],[18,1,19,1],[18,3,19,3],[18,2,19,2],[16,2,17,2],[12,0,13,0],[12,1,13,1],[12,3,13,3],[14,0,15,0],[14,1,15,1],[14,3,15,3],[14,2,15,2],[12,2,13,2],[8,0,9,0],[8,1,9,1],[8,3,9,3],[10,0,11,0],[10,1,11,1],[10,3,11,3],[10,2,11,2],[8,2,9,2],[4,0,5,0],[4,1,5,1],[4,3,5,3],[6,0,7,0],[6,1,7,1],[6,3,7,3],[4,2,5,2],[6,2,7,2],[0,29,0,31],[1,4,1,8],[1,9,1,12],[1,13,1,17],[1,18,1,21],[1,22,1,25],[1,26,1,30],[1,31,1,34],[1,35,1,39],[1,40,1,43],[1,44,1,47],[1,48,1,52],[1,53,1,56],[26,0,27,0],[26,1,27,1],[26,2,27,2],[26,3,27,3],[28,0,29,0],[28,1,29,1],[28,2,29,2],[28,3,29,3],[30,0,31,0],[30,1,31,1],[30,2,31,2],[30,3,31,3],[32,0,33,0],[32,1,33,1],[32,2,33,2],[32,3,33,3],[34,0,35,0],[34,1,35,1],[34,2,35,2],[34,3,35,3],[36,0,37,0],[36,1,37,1],[36,2,37,2],[36,3,37,3]]}
["Type d'audit","DM","Semaine fin mission","Auditeurs",null,null,null,null,null,null,null,null,null,null,null,null,null,null,null,null,null,null,null,null,null,null,null,null,null,"CNA"]
[null,null,null,null,"janvier",null,null,null,null,"février",null,null,null,"mars",null,null,null,null,"avril",null,null,null,"mai",null,null,null,"juin",null,null,null,null,"juillet",null,null,null,"août",null,null,null,null,"septembre",null,null,null,"octobre",null,null,null,"novembre",null,null,null,null,"décembre"]
[null,null,null,null,"S1","S2","S3","S4","S5","S1","S2","S3","S4","S1","S2","S3","S4","S5","S1","S2","S3","S4","S1","S2","S3","S4","S1","S2","S3","S4","S5","S1","S2","S3","S4","S1","S2","S3","S4","S5","S1","S2","S3","S4","S1","S2","S3","S4","S1","S2","S3","S4","S5","S1","S2","S3","S4"]
[null,null,null,null,1,2,3,4,5,6,7,8,9,10,11,12,13,14,15,16,17,18,19,20,21,22,23,24,25,26,27,28,29,30,31,32,33,34,35,36,37,38,39,40,41,42,43,44,45,46,47,48,49,50,51,52,53]
[null,{"$f":"Recap!G3","v":"a"},{"$f":"Recap!Z3","v":27}]
[]
[null,{"$f":"IF(Recap!G4=\"\",\"\",Recap!G4)","v":""},{"$f":"IF(Recap!Z4=\"\",\"\",Recap!Z4)","v":""}]
[]
[null,{"$f":"IF(Recap!G5=\"\",\"\",Recap!G5)","v":""},{"$f":"IF(Recap!Z5=\"\",\"\",Recap!Z5)","v":""}]
[]
[null,{"$f":"IF(Recap!G6=\"\",\"\",Recap!G6)","v":""},{"$f":"IF(Recap!Z6=\"\",\"\",Recap!Z6)","v":""}]
[]
[null,{"$f":"IF(Recap!G7=\"\",\"\",Recap!G7)","v":""},{"$f":"IF(Recap!Z7=\"\",\"\",Recap!Z7)","v":""}]
[]
[null,{"$f":"IF(Recap!G8=\"\",\"\",Recap!G8)","v":""},{"$f":"IF(Recap!Z8=\"\",\"\",Recap!Z8)","v":""}]
[]
[null,{"$f":"IF(Recap!G9=\"\",\"\",Recap!G9)","v":""},{"$f":"IF(Recap!Z9=\"\",\"\",Recap!Z9)","v":""}]
[]
[null,{"$f":"IF(Recap!G10=\"\",\"\",Recap!G10)","v":""},{"$f":"IF(Recap!Z10=\"\",\"\",Recap!Z10)","v":""}]
[]
[null,{"$f":"IF(Recap!G11=\"\",\"\",Recap!G11)","v":""},{"$f":"IF(Recap!Z11=\"\",\"\",Recap!Z11)","v":""}]
[]
[null,{"$f":"IF(Recap!G12=\"\",\"\",Recap!G12)","v":""},{"$f":"IF(Recap!Z12=\"\",\"\",Recap!Z12)","v":""}]
[]
[null,{"$f":"IF(Recap!G13=\"\",\"\",Recap!G13)","v":""},{"$f":"IF(Recap!Z13=\"\",\"\",Recap!Z13)","v":""}]
[]
[null,{"$f":"IF(Recap!G14=\"\",\"\",Recap!G14)","v":""},{"$f":"IF(Recap!Z14=\"\",\"\",Recap!Z14)","v":""}]
[]
[null,{"$f":"IF(Recap!G15=\"\",\"\",Recap!G15)","v":""},{"$f":"IF(Recap!Z15=\"\",\"\",Recap!Z15)","v":""}]
[]
{"$rows_left_out":20}
{"sheet":"staff","index":4,"n_rows":15,"n_cols":3,"rows_kept":15,"cut":false,"hidden":false,"merged":[]}
["staff","DM","Prestataire"]
["Alain PERROT","Anne Sanchez","Interne"]
["Alain SPAENLE","Francine Scherpereel","BearingPoint"]
["Alexandre LE CORRE","Jacqueline Perez","Eurogroup"]
["Arnaud MUDRY","Jean-Michel Vallet","Grant Thornton"]
["Corinne GALODE","Externalisé","Mazars"]
["Joel MOSSARD"]
["Loic LE DEUNFF"]
["Mathias DIEZ"]
["Oliviana PIAZZA"]
["Patricia DAVANNE"]
["Pierre Jean BONNOIT"]
["Said BOUNOUA"]
["Sylvie ZEILIG"]
["Teddy FEUILLASTRE"]

{"sheet":"Saisie budgétaire","index":5,"n_rows":40,"n_cols":6,"rows_kept":40,"cut":false,"hidden":false,"merged":[[1,1,1,3]]}
[]
[null,"FICHE DE SUIVI BUDGETAIRE"]
[]
[null,"Nom de l'organisme:",null,"CARSAT Aquitaine"]
[]
[null,"Catégorie de l'organisme:",{"$f":"IF(D6=\"\",\"\",IF(D6=\"CTI Prestations\",\"TableCTIPrestations\",IF(D6=\"CTI Missions Nationales\",\"TableCTIMissionsNationales\",IF(D6=\"CTI Centres Nationaux\",\"TableCTICentreNationaux\",CONCATENATE(\"Table\",D6)))))","v":"TableCARSAT"},{"$f":"IF(D4=\"\",\"\",VLOOKUP(D4,'Code des CPAM'!$A$1:$C$164,3,FALSE))","v":"CARSAT"}]
[]
[null,"Prestataire:",null,""]
[]
["Choix des modules:",null,"Niveau d'audit"]
[]
[null,"Module 1","",{"$f":"IF(C12=\"\",\"\",IF(C12=\"Non audité\",0,VLOOKUP(F12,INDIRECT($C$6),4,FALSE)))","v":""},null,{"$f":"CONCATENATE(B12,C12)","v":"Module 1"}]
[null,null,null,null,null,{"$f":"CONCATENATE(B13,C13)","v":""}]
[null,"Module 2","",{"$f":"IF(C14=\"\",\"\",IF(C14=\"Non audité\",0,VLOOKUP(F14,INDIRECT($C$6),4,FALSE)))","v":""},null,"Module 2"]
[null,null,null,null,null,""]
[null,"Module 3","",{"$f":"IF(C16=\"\",\"\",IF(C16=\"Non audité\",0,VLOOKUP(F16,INDIRECT($C$6),4,FALSE)))","v":""},null,"Module 3"]
[null,null,null,null,null,""]
[null,"Module 4","",{"$f":"IF(C18=\"\",\"\",IF(C18=\"Non audité\",0,VLOOKUP(F18,INDIRECT($C$6),4,FALSE)))","v":""},null,"Module 4"]
[null,null,null,null,null,""]
[null,"Module 5","",{"$f":"IF(C20=\"\",\"\",IF(C20=\"Non audité\",0,VLOOKUP(F20,INDIRECT($C$6),4,FALSE)))","v":""},null,"Module 5"]
[null,null,null,null,null,""]
[null,"Module 6","",{"$f":"IF(C22=\"\",\"\",IF(C22=\"Non audité\",0,VLOOKUP(F22,INDIRECT($C$6),4,FALSE)))","v":""},null,"Module 6"]
[null,null,null,null,null,""]
[null,"Module 7","",{"$f":"IF(C24=\"\",\"\",IF(C24=\"Non audité\",0,VLOOKUP(F24,INDIRECT($C$6),4,FALSE)))","v":""},null,"Module 7"]
[null,null,null,null,null,""]
[null,"Module 8","",{"$f":"IF(C26=\"\",\"\",IF(C26=\"Non audité\",0,VLOOKUP(F26,INDIRECT($C$6),4,FALSE)))","v":""},null,"Module 8"]
[null,null,null,null,null,""]
[null,"Module 9","",{"$f":"IF(C28=\"\",\"\",IF(C28=\"Non audité\",0,VLOOKUP(F28,INDIRECT($C$6),4,FALSE)))","v":""},null,"Module 9"]
[null,null,null,null,null,""]
[null,"Module 10","",{"$f":"IF(C30=\"\",\"\",IF(C30=\"Non audité\",0,VLOOKUP(F30,INDIRECT($C$6),4,FALSE)))","v":""},null,"Module 10"]
{"$rows_left_out":11}
{"sheet":"Suivi budgétaire","index":6,"n_rows":3,"n_cols":32,"rows_kept":3,"cut":false,"hidden":false,"merged":[[0,26,0,31],[0,8,0,9],[0,10,0,11],[0,12,0,14],[0,15,0,17],[0,18,0,21],[0,22,0,24]]}
[null,null,null,null,null,null,null,null,"Analyse du retard dans le commencement de l'audit",null,"Analyse de la durée d'audit",null,"Validation rapport provisoire",null,null,"Validation interne",null,null,"Diffusion raport",null,null,null,"Analyse des équipes d'audit",null,null,"Analyse de la qualité","Analyse des pénalités"]
["Organisme","Classe","Consultant","Montant BC TTC (ENGAGES)","Montant réel TTC","Date d'envoi de la lettre de mission","Date envoi Bon de Commande","Bon de Commande accepté?","Date phase terrain","Date terrain réel","Durée terrain théorique","Durée terrain réel","Date de réception ","Date envoi du rapport validé au prestataire","Date d'envoi du rapport modifié à l'organisme par le prestataire","Date de réception rapport définitif ","Date de transmission FG","Retour \nFG/PF","Date transmission DG","Date de diffusion rapport définitif","Date du séminaire","Délai mission total","Junior (<3)","Senior (3<5)","Manager (>5)","Nombre de défauts","Pénalité sur composition des équipes d'audit","Pénalité de retard dans le commencement de l'audit","Pénalité sur la durée d'audit","Pénalité sur la qualité du rapport","Colonne1","Pénalité max applicable"]
[null,null,null,null,null,null,null,{"$f":"IF(G3=\"\",\"\",(IF(((TODAY()-G3)>5),\"Oui\",\"\")))","v":""},null,null,null,null,null,null,null,null,null,null,null,null,null,{"$f":"IF(F3=\"\",\"\",IF(T3=\"\",TODAY()-F3,T3-F3))","v":""},null,null,null,null,{"$f":"IF(AND(W3=\"\",X3=\"\",Y3=\"\"),0,(IF(OR(W3>(0.2*SUM(W3:Y3)),SUM(X3:Y3)<3,Y3<SUM(W3:Y3)*0.3),0.25*C3,0)))","v":0},{"$f":"IF(J3=\"\",0,IF(J3=\"\",0,IF(J3>I3,((J3-I3)*1000),0)))","v":0},{"$f":"IF(L3=\"\",0,IF(L3=\"\",0,IF(L3<K3,(K3-L3)/K3*C3,0)))","v":0},{"$f":"IF(Z3=\"\",0,Z3*350)","v":0},{"$f":"IF(AND(AA3=\"\",AB3=\"\",AC3=\"\",AD3=\"\"),0,IF((AB3+AC3+AA3+AD3)>0.3*C3,0.3*C3,AB3+AC3+AA3+AD3))","v":0},{"$f":"IF(AE3=0,\"\",AE3)","v":""}]

{"sheet":"Code des CPAM","index":7,"n_rows":164,"n_cols":5,"rows_kept":164,"cut":false,"hidden":false,"merged":[]}
["CCSS Lozère","C",{"$f":"IF(B1=\"A\",1,IF(B1=\"B\",2,3))","v":3},"M"]
["CGSS Guadeloupe","B",{"$f":"IF(B2=\"A\",1,IF(B2=\"B\",2,3))","v":2},"HM"]
["CGSS Guyane","B",2,"HM"]
["CGSS Martinique","B",2,"HM"]
["CGSS Réunion","B",2,"HM"]
["CPAM Charente-Maritime","B",2,"M"]
["CPAM Haute-Loire","D",3,"M"]
["CPAM Ain","C",3,"M"]
["CPAM Aisne","C",3,"M"]
["CPAM Allier","C",3,"M"]
["CPAM Alpes-de-Haute-Provence","D",3,"M"]
["CPAM Alpes-Maritimes","B",2,"M"]
["CPAM Ardèche","D",3,"M"]
["CPAM Ardennes","D",3,"M"]
["CPAM Ariège","D",3,"M"]
["CPAM Artois","B",2,"M"]
["CPAM Aube","D",3,"M"]
["CPAM Aude","C",3,"M"]
["CPAM Aveyron","D",3,"M"]
["CPAM Bas-Rhin","B",2,"M"]
["CPAM Bayonne","C",3,"M"]
["CPAM Boûches-du-Rhône","A",1,"M"]
["CPAM Calvados","B",2,"M"]
["CPAM Cantal","D",3,"M"]
["CPAM Charente","C",3,"M"]
["CPAM Cher","D",3,"M"]
["CPAM Corrèze","D",3,"M"]
["CPAM Corse-du-sud","D",3,"HM"]
["CPAM Côte-d'Or","C",3,"M"]
["CPAM Côte-d'Opale","B",2,"M"]
{"$rows_left_out":135}
{"sheet":"Table de prix_Lot1","index":8,"n_rows":120,"n_cols":7,"rows_kept":120,"cut":false,"hidden":false,"merged":[[109,2,109,5],[116,2,116,5],[64,1,65,1],[66,1,67,1],[68,1,69,1],[71,2,71,5],[84,2,84,5],[98,2,98,5],[57,1,58,1],[30,1,31,1],[32,1,33,1],[34,1,35,1],[36,1,37,1],[47,1,48,1],[49,1,50,1],[51,1,52,1],[53,1,54,1],[55,1,56,1],[42,4,42,6],[45,1,46,1],[13,1,14,1],[15,1,16,1],[21,4,21,6],[24,1,25,1],[26,1,27,1],[28,1,29,1],[11,1,12,1],[0,4,0,6],[3,1,4,1],[5,1,6,1],[7,1,8,1],[9,1,10,1]]}
[null,null,null,null,"A"]
["Unités d'œuvre","Modules d'audit","Niveau de profondeur de l'audit",null,"Prix forfaitaire HT","TVA","Prix forfaitaire TTC"]
["UO 1","Module 1","Audité",{"$f":"CONCATENATE(B3,C3)","v":"Module 1Audité"},20444,0.2,{"$f":"E3*(1+F3)","v":24532.799999999999}]
["UO 2.1","Module 2","Niveau 1",{"$f":"CONCATENATE(B4,C4)","v":"Module 2Niveau 1"},4114,0.2,{"$f":"E4*(1+F4)","v":4936.8}]
["UO 2.2",null,"Niveau 2",{"$f":"CONCATENATE(B4,C5)","v":"Module 2Niveau 2"},4114,0.2,4936.8]
["UO 3.1","Module 3","Niveau 1",{"$f":"CONCATENATE(B6,C6)","v":"Module 3Niveau 1"},2447,0.2,2936.4]
["UO 3.2",null,"Niveau 2",{"$f":"CONCATENATE(B6,C7)","v":"Module 3Niveau 2"},3671,0.2,4405.2]
["UO 4.1","Module 4","Niveau 1",{"$f":"CONCATENATE(B8,C8)","v":"Module 4Niveau 1"},2575,0.2,3090]
["UO 4.2",null,"Niveau 2",{"$f":"CONCATENATE(B8,C9)","v":"Module 4Niveau 2"},2575,0.2,3090]
["UO 5.1","Module 5","Niveau 1",{"$f":"CONCATENATE(B10,C10)","v":"Module 5Niveau 1"},4655,0.2,5586]
["UO 5.2",null,"Niveau 2",{"$f":"CONCATENATE(B10,C11)","v":"Module 5Niveau 2"},4655,0.2,5586]
["UO 6.1","Module 6","Niveau 1",{"$f":"CONCATENATE(B12,C12)","v":"Module 6Niveau 1"},2888,0.2,3465.6]
["UO 6.2",null,"Niveau 2",{"$f":"CONCATENATE(B12,C13)","v":"Module 6Niveau 2"},4332,0.2,5198.3999999999996]
["UO 7.1","Module 7","Niveau 1",{"$f":"CONCATENATE(B14,C14)","v":"Module 7Niveau 1"},9599,0.2,11518.8]
["UO 7.2",null,"Niveau 2",{"$f":"CONCATENATE(B14,C15)","v":"Module 7Niveau 2"},6931,0.2,8317.1999999999989]
["UO 8.1","Module 8","Niveau 1",{"$f":"CONCATENATE(B16,C16)","v":"Module 8Niveau 1"},5149,0.2,6178.8]
["UO 8.2",null,"Niveau 2",{"$f":"CONCATENATE(B16,C17)","v":"Module 8Niveau 2"},5149,0.2,6178.8]
["UO 9","Module 9","Audité",{"$f":"CONCATENATE(B18,C18)","v":"Module 9Audité"},9154,0.2,10984.8]
["UO 10","Module 10","Audité",{"$f":"CONCATENATE(B19,C19)","v":"Module 10Audité"},4577,0.2,5492.4]
["UO 11","Module 11","Audité",{"$f":"CONCATENATE(B20,C20)","v":"Module 11Audité"},4750,0.2,5700]
[]
[null,null,null,null,"B"]
["Unités d'œuvre","Modules d'audit","Niveau de profondeur de l'audit",null,"Prix forfaitaire HT","TVA","Prix forfaitaire TTC"]
["UO 12","Module 1","Audité",{"$f":"CONCATENATE(B24,C24)","v":"Module 1Audité"},15960,0.2,{"$f":"E24*(1+F24)","v":19152}]
["13.1","Module 2","Niveau 1",{"$f":"CONCATENATE(B25,C25)","v":"Module 2Niveau 1"},3040,0.2,{"$f":"E25*(1+F25)","v":3648}]
["13.2",null,"Niveau 2",{"$f":"CONCATENATE(B25,C26)","v":"Module 2Niveau 2"},3040,0.2,3648]
["14.1","Module 3","Niveau 1",{"$f":"CONCATENATE(B27,C27)","v":"Module 3Niveau 1"},1824,0.2,2188.7999999999997]
["14.2",null,"Niveau 2",{"$f":"CONCATENATE(B27,C28)","v":"Module 3Niveau 2"},2736,0.2,3283.2]
["15.1","Module 4","Niveau 1",{"$f":"CONCATENATE(B29,C29)","v":"Module 4Niveau 1"},1919,0.2,2302.7999999999997]
["15.2",null,"Niveau 2",{"$f":"CONCATENATE(B29,C30)","v":"Module 4Niveau 2"},1919,0.2,2302.7999999999997]
{"$rows_left_out":91}
{"sheet":"Table de prix_Lot2","index":9,"n_rows":56,"n_cols":13,"rows_kept":56,"cut":false,"hidden":false,"merged":[[43,1,44,1],[45,1,46,1],[26,1,27,1],[28,1,29,1],[34,4,34,6],[37,1,38,1],[39,1,40,1],[41,1,42,1],[24,1,25,1],[0,4,0,6],[0,7,0,9],[0,10,0,12],[3,1,4,1],[5,1,6,1],[7,1,8,1],[9,1,10,1],[11,1,12,1],[17,4,17,6],[20,1,21,1],[22,1,23,1]]}
[null,null,null,null,"CTI PRESTATIONS",null,null,"CTI MISSIONS NATIONALES",null,null,"CENTRES NATIONAUX"]
["Unités d'œuvre","Modules d'audit","Niveau de profondeur de l'audit",null,"Prix forfaitaire HT","TVA","Prix forfaitaire TTC","Prix forfaitaire HT","TVA","Prix forfaitaire TTC","Prix forfaitaire HT","TVA","Prix forfaitaire TTC"]
["UO 1","Module 1","Audité",{"$f":"CONCATENATE(B3,C3)","v":"Module 1Audité"},23564.3,0.2,{"$f":"E3*(1+F3)","v":28277.16},25355.5,0.2,{"$f":"H3*(1+I3)","v":30426.6},23564.3,0.2,{"$f":"K3*(1+L3)","v":28277.16}]
["UO 2.1","Module 2","Niveau 1",{"$f":"CONCATENATE(B4,C4)","v":"Module 2Niveau 1"},9246.6,0.2,{"$f":"E4*(1+F4)","v":11095.92},9246.6,0.2,{"$f":"H4*(1+I4)","v":11095.92}]
["UO 2.2",null,"Niveau 2",{"$f":"CONCATENATE(B4,C5)","v":"Module 2Niveau 2"},10886.55,0.2,13063.859999999999,10886.55,0.2,13063.859999999999]
["UO 3.1","Module 3","Niveau 1","Module 3Niveau 1"," ",null,null,null,null,null,8351,0.2,{"$f":"K6*(1+L6)","v":10021.199999999999}]
["UO 3.2",null,"Niveau 2",{"$f":"CONCATENATE(B6,C7)","v":"Module 3Niveau 2"}," ",null,null,null,null,null,10142.200000000001,0.2,12170.640000000001]
["UO 4.1","Module 4","Niveau 1","Module 4Niveau 1",9246.6,0.2,11095.92,9246.6,0.2,11095.92,9246.6,0.2,11095.92]
["UO 4.2",null,"Niveau 2",{"$f":"CONCATENATE(B8,C9)","v":"Module 4Niveau 2"},10886.55,0.2,13063.859999999999,10886.55,0.2,13063.859999999999,10886.55,0.2,13063.859999999999]
["UO 5.1","Module 5","Niveau 1","Module 5Niveau 1",7606.65,0.2,9127.98,7606.65,0.2,9127.98,7606.65,0.2,9127.98]
["UO 5.2",null,"Niveau 2",{"$f":"CONCATENATE(B10,C11)","v":"Module 5Niveau 2"},8351,0.2,10021.199999999999,8351,0.2,10021.199999999999,8351,0.2,10021.199999999999]
["UO 6.1","Module 6","Niveau 1","Module 6Niveau 1",10886.55,0.2,13063.859999999999,12677.75,0.2,15213.3,10886.55,0.2,13063.859999999999]
["UO 6.2",null,"Niveau 2",{"$f":"CONCATENATE(B12,C13)","v":"Module 6Niveau 2"},12526.5,0.2,15031.8,13831.45,0.2,16597.740000000002,12526.5,0.2,15031.8]
["UO 7","Module 7","Audité","Module 7Audité",3840.5,0.2,4608.5999999999995,3840.5,0.2,4608.5999999999995,3840.5,0.2,4608.5999999999995]
["UO 8","Module 8","Audité","Module 8Audité",2126.1999999999998,0.2,2551.4399999999996,2126.1999999999998,0.2,2551.4399999999996,2126.1999999999998,0.2,2551.4399999999996]
["UO 9","Module 9","Audité","Module 9Audité",9804.65,0.2,11765.58,9804.65,0.2,11765.58,9804.65,0.2,11765.58]
[]
[null,null,null,null,"CTI MISSIONS NATIONALES"]
["Unités d'œuvre","Modules d'audit","Niveau de profondeur de l'audit",null,"Prix forfaitaire HT","TVA","Prix forfaitaire TTC"]
["UO 1","Module 1","Audité",{"$f":"CONCATENATE(B20,C20)","v":"Module 1Audité"},25355.5,0.2,{"$f":"E20*(1+F20)","v":30426.6}]
["UO 2.1","Module 2","Niveau 1",{"$f":"CONCATENATE(B21,C21)","v":"Module 2Niveau 1"},9246.6,0.2,{"$f":"E21*(1+F21)","v":11095.92}]
["UO 2.2",null,"Niveau 2",{"$f":"CONCATENATE(B21,C22)","v":"Module 2Niveau 2"},10886.55,0.2,13063.859999999999]
["UO 3.1","Module 3","Niveau 1","Module 3Niveau 1"," "]
["UO 3.2",null,"Niveau 2",{"$f":"CONCATENATE(B23,C24)","v":"Module 3Niveau 2"}," "]
["UO 4.1","Module 4","Niveau 1","Module 4Niveau 1",9246.6,0.2,{"$f":"E25*(1+F25)","v":11095.92}]
["UO 4.2",null,"Niveau 2",{"$f":"CONCATENATE(B25,C26)","v":"Module 4Niveau 2"},10886.55,0.2,13063.859999999999]
["UO 5.1","Module 5","Niveau 1","Module 5Niveau 1",7606.65,0.2,9127.98]
["UO 5.2",null,"Niveau 2",{"$f":"CONCATENATE(B27,C28)","v":"Module 5Niveau 2"},8351,0.2,10021.199999999999]
["UO 6.1","Module 6","Niveau 1","Module 6Niveau 1",12677.75,0.2,15213.3]
["UO 6.2",null,"Niveau 2",{"$f":"CONCATENATE(B29,C30)","v":"Module 6Niveau 2"},13831.45,0.2,16597.740000000002]
{"$rows_left_out":26}