{"text_format":"1","workbook":"xlsx","n_sheets":5,"sheets":["plan","Saisie","Tableau ","catherine","jerome"],"not_rendered":{"charts":0,"images":0,"macros":1,"external_links":0,"defined_names":0,"comments":0,"pivot_tables":0},"unopened":[],"bounds":{"document_bytes":16777216,"sheet_cells":100000,"rows_first":2000,"rows_last":500,"rows_between":2000,"halvings":0,"cell_chars":16384,"cell_head_chars":4096},"cells_cut":0,"cells_raw":0,"read":"whole","date_system":"1900"}

{"sheet":"plan","index":0,"n_rows":18,"n_cols":6,"rows_kept":18,"cut":false,"hidden":false,"merged":[]}
[]
[]
[null,"Entrer de donner ","game by game ( 2460 match / annee)"]
[]
[null,"players "]
[]
[null,"position ","position liste deroulante"]
[null,"age ","tableau "]
[null,"poids ","poids liste deroulante "]
[null,"grandeur ","grandeur liste deroulante "]
[null,"overall","sante / physique  /"]
[]
[null,"physique ","age/ poids / grandeur / fatigue"]
[null,"sante ","sante ; gravite blessure / physique "]
[null,null,null,"gravite blessure ; type de blessure / match manquer / blessure qui revient / utilisation joueur /physique "]
{"$rows_left_out":4}
{"sheet":"Saisie","index":1,"n_rows":9,"n_cols":3,"rows_kept":9,"cut":false,"hidden":false,"merged":[]}
[]
[]
[null,"Nom ","catherine"]
[]
[null,"Prénom ","gtsds"]
[]
[null,"Société ","wer"]
[]
[null,"Adresse ",3458888]

{"sheet":"Tableau ","index":2,"n_rows":30,"n_cols":4,"rows_kept":30,"cut":false,"hidden":false,"merged":[]}
["Nom ","Prénom ","Société ","Adresse "]
["catherine","gtsds","wer",3458888]
["catherine","gtsds","wer",3458888]
["catherine","gtsds","wer",3458888]
["catherine","gtsds","wer",3458888]
["Jerome","gtsds","wer",3456]
["catherine","gtsds","wer",3456]
["catherine","Lanthier ","CA ",1040]
["catherine","Lanthier ","CA ",1040]
["catherine","Lanthier ","CA ",1040]
["catherine","Lanthier ","CA ",1040]
["catherine","Lanthier ","CA ",1040]
["catherine","Lanthier ","CA ",1040]
["catherine","Lanthier ","CA ",1040]
["catherine","Lanthier ","CA ",1040]
{"$rows_left_out":16}
{"sheet":"catherine","index":3,"n_rows":51,"n_cols":5,"rows_kept":51,"cut":false,"hidden":false,"merged":[]}
["Catherine"]
[{"$f":"IF(COUNTIF('Tableau '!$A$8:$A$56,$A$1)>=ROW()+MATCH($A$1,'Tableau '!$A$1:$A$56,0)-3,INDEX('Tableau '!$A$1:$D$56,ROW()+MATCH($A$1,'Tableau '!$A$1:$A$56,0)-2,COLUMN()),\"\")","v":"catherine"},{"$f":"IF(COUNTIF('Tableau '!$A$8:$A$56,$A$1)>=ROW()+MATCH($A$1,'Tableau '!$A$1:$A$56,0)-3,INDEX('Tableau '!$A$1:$D$56,ROW()+MATCH($A$1,'Tableau '!$A$1:$A$56,0)-2,COLUMN()),\"\")","v":"gtsds"},{"$f":"IF(COUNTIF('Tableau '!$A$8:$A$56,$A$1)>=ROW()+MATCH($A$1,'Tableau '!$A$1:$A$56,0)-3,INDEX('Tableau '!$A$1:$D$56,ROW()+MATCH($A$1,'Tableau '!$A$1:$A$56,0)-2,COLUMN()),\"\")","v":"wer"},{"$f":"IF(COUNTIF('Tableau '!$A$8:$A$56,$A$1)>=ROW()+MATCH($A$1,'Tableau '!$A$1:$A$56,0)-3,INDEX('Tableau '!$A$1:$D$56,ROW()+MATCH($A$1,'Tableau '!$A$1:$A$56,0)-2,COLUMN()),\"\")","v":3458888}]
[{"$f":"IF(COUNTIF('Tableau '!$A$8:$A$56,$A$1)>=ROW()+MATCH($A$1,'Tableau '!$A$1:$A$56,0)-3,INDEX('Tableau '!$A$1:$D$56,ROW()+MATCH($A$1,'Tableau '!$A$1:$A$56,0)-2,COLUMN()),\"\")","v":"catherine"},{"$f":"IF(COUNTIF('Tableau '!$A$8:$A$56,$A$1)>=ROW()+MATCH($A$1,'Tableau '!$A$1:$A$56,0)-3,INDEX('Tableau '!$A$1:$D$56,ROW()+MATCH($A$1,'Tableau '!$A$1:$A$56,0)-2,COLUMN()),\"\")","v":"gtsds"},{"$f":"IF(COUNTIF('Tableau '!$A$8:$A$56,$A$1)>=ROW()+MATCH($A$1,'Tableau '!$A$1:$A$56,0)-3,INDEX('Tableau '!$A$1:$D$56,ROW()+MATCH($A$1,'Tableau '!$A$1:$A$56,0)-2,COLUMN()),\"\")","v":"wer"},{"$f":"IF(COUNTIF('Tableau '!$A$8:$A$56,$A$1)>=ROW()+MATCH($A$1,'Tableau '!$A$1:$A$56,0)-3,INDEX('Tableau '!$A$1:$D$56,ROW()+MATCH($A$1,'Tableau '!$A$1:$A$56,0)-2,COLUMN()),\"\")","v":3458888}]
[{"$f":"IF(COUNTIF('Tableau '!$A$8:$A$56,$A$1)>=ROW()+MATCH($A$1,'Tableau '!$A$1:$A$56,0)-3,INDEX('Tableau '!$A$1:$D$56,ROW()+MATCH($A$1,'Tableau '!$A$1:$A$56,0)-2,COLUMN()),\"\")","v":"catherine"},{"$f":"IF(COUNTIF('Tableau '!$A$8:$A$56,$A$1)>=ROW()+MATCH($A$1,'Tableau '!$A$1:$A$56,0)-3,INDEX('Tableau '!$A$1:$D$56,ROW()+MATCH($A$1,'Tableau '!$A$1:$A$56,0)-2,COLUMN()),\"\")","v":"gtsds"},{"$f":"IF(COUNTIF('Tableau '!$A$8:$A$56,$A$1)>=ROW()+MATCH($A$1,'Tableau '!$A$1:$A$56,0)-3,INDEX('Tableau '!$A$1:$D$56,ROW()+MATCH($A$1,'Tableau '!$A$1:$A$56,0)-2,COLUMN()),\"\")","v":"wer"},{"$f":"IF(COUNTIF('Tableau '!$A$8:$A$56,$A$1)>=ROW()+MATCH($A$1,'Tableau '!$A$1:$A$56,0)-3,INDEX('Tableau '!$A$1:$D$56,ROW()+MATCH($A$1,'Tableau '!$A$1:$A$56,0)-2,COLUMN()),\"\")","v":3458888}]
[{"$f":"IF(COUNTIF('Tableau '!$A$8:$A$56,$A$1)>=ROW()+MATCH($A$1,'Tableau '!$A$1:$A$56,0)-3,INDEX('Tableau '!$A$1:$D$56,ROW()+MATCH($A$1,'Tableau '!$A$1:$A$56,0)-2,COLUMN()),\"\")","v":"catherine"},{"$f":"IF(COUNTIF('Tableau '!$A$8:$A$56,$A$1)>=ROW()+MATCH($A$1,'Tableau '!$A$1:$A$56,0)-3,INDEX('Tableau '!$A$1:$D$56,ROW()+MATCH($A$1,'Tableau '!$A$1:$A$56,0)-2,COLUMN()),\"\")","v":"gtsds"},{"$f":"IF(COUNTIF('Tableau '!$A$8:$A$56,$A$1)>=ROW()+MATCH($A$1,'Tableau '!$A$1:$A$56,0)-3,INDEX('Tableau '!$A$1:$D$56,ROW()+MATCH($A$1,'Tableau '!$A$1:$A$56,0)-2,COLUMN()),\"\")","v":"wer"},{"$f":"IF(COUNTIF('Tableau '!$A$8:$A$56,$A$1)>=ROW()+MATCH($A$1,'Tableau '!$A$1:$A$56,0)-3,INDEX('Tableau '!$A$1:$D$56,ROW()+MATCH($A$1,'Tableau '!$A$1:$A$56,0)-2,COLUMN()),\"\")","v":3458888}]
[{"$f":"IF(COUNTIF('Tableau '!$A$8:$A$56,$A$1)>=ROW()+MATCH($A$1,'Tableau '!$A$1:$A$56,0)-3,INDEX('Tableau '!$A$1:$D$56,ROW()+MATCH($A$1,'Tableau '!$A$1:$A$56,0)-2,COLUMN()),\"\")","v":"Jerome"},{"$f":"IF(COUNTIF('Tableau '!$A$8:$A$56,$A$1)>=ROW()+MATCH($A$1,'Tableau '!$A$1:$A$56,0)-3,INDEX('Tableau '!$A$1:$D$56,ROW()+MATCH($A$1,'Tableau '!$A$1:$A$56,0)-2,COLUMN()),\"\")","v":"gtsds"},{"$f":"IF(COUNTIF('Tableau '!$A$8:$A$56,$A$1)>=ROW()+MATCH($A$1,'Tableau '!$A$1:$A$56,0)-3,INDEX('Tableau '!$A$1:$D$56,ROW()+MATCH($A$1,'Tableau '!$A$1:$A$56,0)-2,COLUMN()),\"\")","v":"wer"},{"$f":"IF(COUNTIF('Tableau '!$A$8:$A$56,$A$1)>=ROW()+MATCH($A$1,'Tableau '!$A$1:$A$56,0)-3,INDEX('Tableau '!$A$1:$D$56,ROW()+MATCH($A$1,'Tableau '!$A$1:$A$56,0)-2,COLUMN()),\"\")","v":3456}]
[{"$f":"IF(COUNTIF('Tableau '!$A$8:$A$56,$A$1)>=ROW()+MATCH($A$1,'Tableau '!$A$1:$A$56,0)-3,INDEX('Tableau '!$A$1:$D$56,ROW()+MATCH($A$1,'Tableau '!$A$1:$A$56,0)-2,COLUMN()),\"\")","v":"catherine"},{"$f":"IF(COUNTIF('Tableau '!$A$8:$A$56,$A$1)>=ROW()+MATCH($A$1,'Tableau '!$A$1:$A$56,0)-3,INDEX('Tableau '!$A$1:$D$56,ROW()+MATCH($A$1,'Tableau '!$A$1:$A$56,0)-2,COLUMN()),\"\")","v":"gtsds"},{"$f":"IF(COUNTIF('Tableau '!$A$8:$A$56,$A$1)>=ROW()+MATCH($A$1,'Tableau '!$A$1:$A$56,0)-3,INDEX('Tableau '!$A$1:$D$56,ROW()+MATCH($A$1,'Tableau '!$A$1:$A$56,0)-2,COLUMN()),\"\")","v":"wer"},{"$f":"IF(COUNTIF('Tableau '!$A$8:$A$56,$A$1)>=ROW()+MATCH($A$1,'Tableau '!$A$1:$A$56,0)-3,INDEX('Tableau '!$A$1:$D$56,ROW()+MATCH($A$1,'Tableau '!$A$1:$A$56,0)-2,COLUMN()),\"\")","v":3456}]
[{"$f":"IF(COUNTIF('Tableau '!$A$8:$A$56,$A$1)>=ROW()+MATCH($A$1,'Tableau '!$A$1:$A$56,0)-3,INDEX('Tableau '!$A$1:$D$56,ROW()+MATCH($A$1,'Tableau '!$A$1:$A$56,0)-2,COLUMN()),\"\")","v":"catherine"},{"$f":"IF(COUNTIF('Tableau '!$A$8:$A$56,$A$1)>=ROW()+MATCH($A$1,'Tableau '!$A$1:$A$56,0)-3,INDEX('Tableau '!$A$1:$D$56,ROW()+MATCH($A$1,'Tableau '!$A$1:$A$56,0)-2,COLUMN()),\"\")","v":"Lanthier "},{"$f":"IF(COUNTIF('Tableau '!$A$8:$A$56,$A$1)>=ROW()+MATCH($A$1,'Tableau '!$A$1:$A$56,0)-3,INDEX('Tableau '!$A$1:$D$56,ROW()+MATCH($A$1,'Tableau '!$A$1:$A$56,0)-2,COLUMN()),\"\")","v":"CA "},{"$f":"IF(COUNTIF('Tableau '!$A$8:$A$56,$A$1)>=ROW()+MATCH($A$1,'Tableau '!$A$1:$A$56,0)-3,INDEX('Tableau '!$A$1:$D$56,ROW()+MATCH($A$1,'Tableau '!$A$1:$A$56,0)-2,COLUMN()),\"\")","v":1040}]
[{"$f":"IF(COUNTIF('Tableau '!$A$8:$A$56,$A$1)>=ROW()+MATCH($A$1,'Tableau '!$A$1:$A$56,0)-3,INDEX('Tableau '!$A$1:$D$56,ROW()+MATCH($A$1,'Tableau '!$A$1:$A$56,0)-2,COLUMN()),\"\")","v":"catherine"},{"$f":"IF(COUNTIF('Tableau '!$A$8:$A$56,$A$1)>=ROW()+MATCH($A$1,'Tableau '!$A$1:$A$56,0)-3,INDEX('Tableau '!$A$1:$D$56,ROW()+MATCH($A$1,'Tableau '!$A$1:$A$56,0)-2,COLUMN()),\"\")","v":"Lanthier "},{"$f":"IF(COUNTIF('Tableau '!$A$8:$A$56,$A$1)>=ROW()+MATCH($A$1,'Tableau '!$A$1:$A$56,0)-3,INDEX('Tableau '!$A$1:$D$56,ROW()+MATCH($A$1,'Tableau '!$A$1:$A$56,0)-2,COLUMN()),\"\")","v":"CA "},{"$f":"IF(COUNTIF('Tableau '!$A$8:$A$56,$A$1)>=ROW()+MATCH($A$1,'Tableau '!$A$1:$A$56,0)-3,INDEX('Tableau '!$A$1:$D$56,ROW()+MATCH($A$1,'Tableau '!$A$1:$A$56,0)-2,COLUMN()),\"\")","v":1040}]
[{"$f":"IF(COUNTIF('Tableau '!$A$8:$A$56,$A$1)>=ROW()+MATCH($A$1,'Tableau '!$A$1:$A$56,0)-3,INDEX('Tableau '!$A$1:$D$56,ROW()+MATCH($A$1,'Tableau '!$A$1:$A$56,0)-2,COLUMN()),\"\")","v":"catherine"},{"$f":"IF(COUNTIF('Tableau '!$A$8:$A$56,$A$1)>=ROW()+MATCH($A$1,'Tableau '!$A$1:$A$56,0)-3,INDEX('Tableau '!$A$1:$D$56,ROW()+MATCH($A$1,'Tableau '!$A$1:$A$56,0)-2,COLUMN()),\"\")","v":"Lanthier "},{"$f":"IF(COUNTIF('Tableau '!$A$8:$A$56,$A$1)>=ROW()+MATCH($A$1,'Tableau '!$A$1:$A$56,0)-3,INDEX('Tableau '!$A$1:$D$56,ROW()+MATCH($A$1,'Tableau '!$A$1:$A$56,0)-2,COLUMN()),\"\")","v":"CA "},{"$f":"IF(COUNTIF('Tableau '!$A$8:$A$56,$A$1)>=ROW()+MATCH($A$1,'Tableau '!$A$1:$A$56,0)-3,INDEX('Tableau '!$A$1:$D$56,ROW()+MATCH($A$1,'Tableau '!$A$1:$A$56,0)-2,COLUMN()),\"\")","v":1040}]
[{"$f":"IF(COUNTIF('Tableau '!$A$8:$A$56,$A$1)>=ROW()+MATCH($A$1,'Tableau '!$A$1:$A$56,0)-3,INDEX('Tableau '!$A$1:$D$56,ROW()+MATCH($A$1,'Tableau '!$A$1:$A$56,0)-2,COLUMN()),\"\")","v":""},{"$f":"IF(COUNTIF('Tableau '!$A$8:$A$56,$A$1)>=ROW()+MATCH($A$1,'Tableau '!$A$1:$A$56,0)-3,INDEX('Tableau '!$A$1:$D$56,ROW()+MATCH($A$1,'Tableau '!$A$1:$A$56,0)-2,COLUMN()),\"\")","v":""},{"$f":"IF(COUNTIF('Tableau '!$A$8:$A$56,$A$1)>=ROW()+MATCH($A$1,'Tableau '!$A$1:$A$56,0)-3,INDEX('Tableau '!$A$1:$D$56,ROW()+MATCH($A$1,'Tableau '!$A$1:$A$56,0)-2,COLUMN()),\"\")","v":""},{"$f":"IF(COUNTIF('Tableau '!$A$8:$A$56,$A$1)>=ROW()+MATCH($A$1,'Tableau '!$A$1:$A$56,0)-3,INDEX('Tableau '!$A$1:$D$56,ROW()+MATCH($A$1,'Tableau '!$A$1:$A$56,0)-2,COLUMN()),\"\")","v":""}]
[{"$f":"IF(COUNTIF('Tableau '!$A$8:$A$56,$A$1)>=ROW()+MATCH($A$1,'Tableau '!$A$1:$A$56,0)-3,INDEX('Tableau '!$A$1:$D$56,ROW()+MATCH($A$1,'Tableau '!$A$1:$A$56,0)-2,COLUMN()),\"\")","v":""},{"$f":"IF(COUNTIF('Tableau '!$A$8:$A$56,$A$1)>=ROW()+MATCH($A$1,'Tableau '!$A$1:$A$56,0)-3,INDEX('Tableau '!$A$1:$D$56,ROW()+MATCH($A$1,'Tableau '!$A$1:$A$56,0)-2,COLUMN()),\"\")","v":""},{"$f":"IF(COUNTIF('Tableau '!$A$8:$A$56,$A$1)>=ROW()+MATCH($A$1,'Tableau '!$A$1:$A$56,0)-3,INDEX('Tableau '!$A$1:$D$56,ROW()+MATCH($A$1,'Tableau '!$A$1:$A$56,0)-2,COLUMN()),\"\")","v":""},{"$f":"IF(COUNTIF('Tableau '!$A$8:$A$56,$A$1)>=ROW()+MATCH($A$1,'Tableau '!$A$1:$A$56,0)-3,INDEX('Tableau '!$A$1:$D$56,ROW()+MATCH($A$1,'Tableau '!$A$1:$A$56,0)-2,COLUMN()),\"\")","v":""}]
[{"$f":"IF(COUNTIF('Tableau '!$A$8:$A$56,$A$1)>=ROW()+MATCH($A$1,'Tableau '!$A$1:$A$56,0)-3,INDEX('Tableau '!$A$1:$D$56,ROW()+MATCH($A$1,'Tableau '!$A$1:$A$56,0)-2,COLUMN()),\"\")","v":""},{"$f":"IF(COUNTIF('Tableau '!$A$8:$A$56,$A$1)>=ROW()+MATCH($A$1,'Tableau '!$A$1:$A$56,0)-3,INDEX('Tableau '!$A$1:$D$56,ROW()+MATCH($A$1,'Tableau '!$A$1:$A$56,0)-2,COLUMN()),\"\")","v":""},{"$f":"IF(COUNTIF('Tableau '!$A$8:$A$56,$A$1)>=ROW()+MATCH($A$1,'Tableau '!$A$1:$A$56,0)-3,INDEX('Tableau '!$A$1:$D$56,ROW()+MATCH($A$1,'Tableau '!$A$1:$A$56,0)-2,COLUMN()),\"\")","v":""},{"$f":"IF(COUNTIF('Tableau '!$A$8:$A$56,$A$1)>=ROW()+MATCH($A$1,'Tableau '!$A$1:$A$56,0)-3,INDEX('Tableau '!$A$1:$D$56,ROW()+MATCH($A$1,'Tableau '!$A$1:$A$56,0)-2,COLUMN()),\"\")","v":""}]
[{"$f":"IF(COUNTIF('Tableau '!$A$8:$A$56,$A$1)>=ROW()+MATCH($A$1,'Tableau '!$A$1:$A$56,0)-3,INDEX('Tableau '!$A$1:$D$56,ROW()+MATCH($A$1,'Tableau '!$A$1:$A$56,0)-2,COLUMN()),\"\")","v":""},{"$f":"IF(COUNTIF('Tableau '!$A$8:$A$56,$A$1)>=ROW()+MATCH($A$1,'Tableau '!$A$1:$A$56,0)-3,INDEX('Tableau '!$A$1:$D$56,ROW()+MATCH($A$1,'Tableau '!$A$1:$A$56,0)-2,COLUMN()),\"\")","v":""},{"$f":"IF(COUNTIF('Tableau '!$A$8:$A$56,$A$1)>=ROW()+MATCH($A$1,'Tableau '!$A$1:$A$56,0)-3,INDEX('Tableau '!$A$1:$D$56,ROW()+MATCH($A$1,'Tableau '!$A$1:$A$56,0)-2,COLUMN()),\"\")","v":""},{"$f":"IF(COUNTIF('Tableau '!$A$8:$A$56,$A$1)>=ROW()+MATCH($A$1,'Tableau '!$A$1:$A$56,0)-3,INDEX('Tableau '!$A$1:$D$56,ROW()+MATCH($A$1,'Tableau '!$A$1:$A$56,0)-2,COLUMN()),\"\")","v":""},{"$f":"IF(COUNTIF('Tableau '!$A$8:$A$56,$A$1)>=ROW()+MATCH($A$1,'Tableau '!$A$1:$A$56,0)-3,INDEX('Tableau '!$A$1:$D$56,ROW()+MATCH($A$1,'Tableau '!$A$1:$A$56,0)-2,COLUMN()),\"\")","v":""}]
[{"$f":"IF(COUNTIF('Tableau '!$A$8:$A$56,$A$1)>=ROW()+MATCH($A$1,'Tableau '!$A$1:$A$56,0)-3,INDEX('Tableau '!$A$1:$D$56,ROW()+MATCH($A$1,'Tableau '!$A$1:$A$56,0)-2,COLUMN()),\"\")","v":""},{"$f":"IF(COUNTIF('Tableau '!$A$8:$A$56,$A$1)>=ROW()+MATCH($A$1,'Tableau '!$A$1:$A$56,0)-3,INDEX('Tableau '!$A$1:$D$56,ROW()+MATCH($A$1,'Tableau '!$A$1:$A$56,0)-2,COLUMN()),\"\")","v":""},{"$f":"IF(COUNTIF('Tableau '!$A$8:$A$56,$A$1)>=ROW()+MATCH($A$1,'Tableau '!$A$1:$A$56,0)-3,INDEX('Tableau '!$A$1:$D$56,ROW()+MATCH($A$1,'Tableau '!$A$1:$A$56,0)-2,COLUMN()),\"\")","v":""},{"$f":"IF(COUNTIF('Tableau '!$A$8:$A$56,$A$1)>=ROW()+MATCH($A$1,'Tableau '!$A$1:$A$56,0)-3,INDEX('Tableau '!$A$1:$D$56,ROW()+MATCH($A$1,'Tableau '!$A$1:$A$56,0)-2,COLUMN()),\"\")","v":""}]
{"$rows_left_out":37}
{"sheet":"jerome","index":4,"n_rows":56,"n_cols":4,"rows_kept":56,"cut":false,"hidden":false,"merged":[]}
["jerome"]
[{"$f":"IF(COUNTIF('Tableau '!$A$8:$A$56,$A$1)>=ROW()+MATCH($A$1,'Tableau '!$A$1:$A$56,0)-3,INDEX('Tableau '!$A$1:$D$56,ROW()+MATCH($A$1,'Tableau '!$A$1:$A$56,0)-2,COLUMN()),\"\")","v":"Jerome"},{"$f":"IF(COUNTIF('Tableau '!$A$8:$A$56,$A$1)>=ROW()+MATCH($A$1,'Tableau '!$A$1:$A$56,0)-3,INDEX('Tableau '!$A$1:$D$56,ROW()+MATCH($A$1,'Tableau '!$A$1:$A$56,0)-2,COLUMN()),\"\")","v":"gtsds"},{"$f":"IF(COUNTIF('Tableau '!$A$8:$A$56,$A$1)>=ROW()+MATCH($A$1,'Tableau '!$A$1:$A$56,0)-3,INDEX('Tableau '!$A$1:$D$56,ROW()+MATCH($A$1,'Tableau '!$A$1:$A$56,0)-2,COLUMN()),\"\")","v":"wer"},{"$f":"IF(COUNTIF('Tableau '!$A$8:$A$56,$A$1)>=ROW()+MATCH($A$1,'Tableau '!$A$1:$A$56,0)-3,INDEX('Tableau '!$A$1:$D$56,ROW()+MATCH($A$1,'Tableau '!$A$1:$A$56,0)-2,COLUMN()),\"\")","v":3456}]
[{"$f":"IF(COUNTIF('Tableau '!$A$8:$A$56,$A$1)>=ROW()+MATCH($A$1,'Tableau '!$A$1:$A$56,0)-3,INDEX('Tableau '!$A$1:$D$56,ROW()+MATCH($A$1,'Tableau '!$A$1:$A$56,0)-2,COLUMN()),\"\")","v":"catherine"},{"$f":"IF(COUNTIF('Tableau '!$A$8:$A$56,$A$1)>=ROW()+MATCH($A$1,'Tableau '!$A$1:$A$56,0)-3,INDEX('Tableau '!$A$1:$D$56,ROW()+MATCH($A$1,'Tableau '!$A$1:$A$56,0)-2,COLUMN()),\"\")","v":"gtsds"},{"$f":"IF(COUNTIF('Tableau '!$A$8:$A$56,$A$1)>=ROW()+MATCH($A$1,'Tableau '!$A$1:$A$56,0)-3,INDEX('Tableau '!$A$1:$D$56,ROW()+MATCH($A$1,'Tableau '!$A$1:$A$56,0)-2,COLUMN()),\"\")","v":"wer"},{"$f":"IF(COUNTIF('Tableau '!$A$8:$A$56,$A$1)>=ROW()+MATCH($A$1,'Tableau '!$A$1:$A$56,0)-3,INDEX('Tableau '!$A$1:$D$56,ROW()+MATCH($A$1,'Tableau '!$A$1:$A$56,0)-2,COLUMN()),\"\")","v":3456}]
[{"$f":"IF(COUNTIF('Tableau '!$A$8:$A$56,$A$1)>=ROW()+MATCH($A$1,'Tableau '!$A$1:$A$56,0)-3,INDEX('Tableau '!$A$1:$D$56,ROW()+MATCH($A$1,'Tableau '!$A$1:$A$56,0)-2,COLUMN()),\"\")","v":"catherine"},{"$f":"IF(COUNTIF('Tableau '!$A$8:$A$56,$A$1)>=ROW()+MATCH($A$1,'Tableau '!$A$1:$A$56,0)-3,INDEX('Tableau '!$A$1:$D$56,ROW()+MATCH($A$1,'Tableau '!$A$1:$A$56,0)-2,COLUMN()),\"\")","v":"Lanthier "},{"$f":"IF(COUNTIF('Tableau '!$A$8:$A$56,$A$1)>=ROW()+MATCH($A$1,'Tableau '!$A$1:$A$56,0)-3,INDEX('Tableau '!$A$1:$D$56,ROW()+MATCH($A$1,'Tableau '!$A$1:$A$56,0)-2,COLUMN()),\"\")","v":"CA "},{"$f":"IF(COUNTIF('Tableau '!$A$8:$A$56,$A$1)>=ROW()+MATCH($A$1,'Tableau '!$A$1:$A$56,0)-3,INDEX('Tableau '!$A$1:$D$56,ROW()+MATCH($A$1,'Tableau '!$A$1:$A$56,0)-2,COLUMN()),\"\")","v":1040}]
[{"$f":"IF(COUNTIF('Tableau '!$A$8:$A$56,$A$1)>=ROW()+MATCH($A$1,'Tableau '!$A$1:$A$56,0)-3,INDEX('Tableau '!$A$1:$D$56,ROW()+MATCH($A$1,'Tableau '!$A$1:$A$56,0)-2,COLUMN()),\"\")","v":"catherine"},{"$f":"IF(COUNTIF('Tableau '!$A$8:$A$56,$A$1)>=ROW()+MATCH($A$1,'Tableau '!$A$1:$A$56,0)-3,INDEX('Tableau '!$A$1:$D$56,ROW()+MATCH($A$1,'Tableau '!$A$1:$A$56,0)-2,COLUMN()),\"\")","v":"Lanthier "},{"$f":"IF(COUNTIF('Tableau '!$A$8:$A$56,$A$1)>=ROW()+MATCH($A$1,'Tableau '!$A$1:$A$56,0)-3,INDEX('Tableau '!$A$1:$D$56,ROW()+MATCH($A$1,'Tableau '!$A$1:$A$56,0)-2,COLUMN()),\"\")","v":"CA "},{"$f":"IF(COUNTIF('Tableau '!$A$8:$A$56,$A$1)>=ROW()+MATCH($A$1,'Tableau '!$A$1:$A$56,0)-3,INDEX('Tableau '!$A$1:$D$56,ROW()+MATCH($A$1,'Tableau '!$A$1:$A$56,0)-2,COLUMN()),\"\")","v":1040}]
[{"$f":"IF(COUNTIF('Tableau '!$A$8:$A$56,$A$1)>=ROW()+MATCH($A$1,'Tableau '!$A$1:$A$56,0)-3,INDEX('Tableau '!$A$1:$D$56,ROW()+MATCH($A$1,'Tableau '!$A$1:$A$56,0)-2,COLUMN()),\"\")","v":"catherine"},{"$f":"IF(COUNTIF('Tableau '!$A$8:$A$56,$A$1)>=ROW()+MATCH($A$1,'Tableau '!$A$1:$A$56,0)-3,INDEX('Tableau '!$A$1:$D$56,ROW()+MATCH($A$1,'Tableau '!$A$1:$A$56,0)-2,COLUMN()),\"\")","v":"Lanthier "},{"$f":"IF(COUNTIF('Tableau '!$A$8:$A$56,$A$1)>=ROW()+MATCH($A$1,'Tableau '!$A$1:$A$56,0)-3,INDEX('Tableau '!$A$1:$D$56,ROW()+MATCH($A$1,'Tableau '!$A$1:$A$56,0)-2,COLUMN()),\"\")","v":"CA "},{"$f":"IF(COUNTIF('Tableau '!$A$8:$A$56,$A$1)>=ROW()+MATCH($A$1,'Tableau '!$A$1:$A$56,0)-3,INDEX('Tableau '!$A$1:$D$56,ROW()+MATCH($A$1,'Tableau '!$A$1:$A$56,0)-2,COLUMN()),\"\")","v":1040}]
[{"$f":"IF(COUNTIF('Tableau '!$A$8:$A$56,$A$1)>=ROW()+MATCH($A$1,'Tableau '!$A$1:$A$56,0)-3,INDEX('Tableau '!$A$1:$D$56,ROW()+MATCH($A$1,'Tableau '!$A$1:$A$56,0)-2,COLUMN()),\"\")","v":"catherine"},{"$f":"IF(COUNTIF('Tableau '!$A$8:$A$56,$A$1)>=ROW()+MATCH($A$1,'Tableau '!$A$1:$A$56,0)-3,INDEX('Tableau '!$A$1:$D$56,ROW()+MATCH($A$1,'Tableau '!$A$1:$A$56,0)-2,COLUMN()),\"\")","v":"Lanthier "},{"$f":"IF(COUNTIF('Tableau '!$A$8:$A$56,$A$1)>=ROW()+MATCH($A$1,'Tableau '!$A$1:$A$56,0)-3,INDEX('Tableau '!$A$1:$D$56,ROW()+MATCH($A$1,'Tableau '!$A$1:$A$56,0)-2,COLUMN()),\"\")","v":"CA "},{"$f":"IF(COUNTIF('Tableau '!$A$8:$A$56,$A$1)>=ROW()+MATCH($A$1,'Tableau '!$A$1:$A$56,0)-3,INDEX('Tableau '!$A$1:$D$56,ROW()+MATCH($A$1,'Tableau '!$A$1:$A$56,0)-2,COLUMN()),\"\")","v":1040}]
[{"$f":"IF(COUNTIF('Tableau '!$A$8:$A$56,$A$1)>=ROW()+MATCH($A$1,'Tableau '!$A$1:$A$56,0)-3,INDEX('Tableau '!$A$1:$D$56,ROW()+MATCH($A$1,'Tableau '!$A$1:$A$56,0)-2,COLUMN()),\"\")","v":"catherine"},{"$f":"IF(COUNTIF('Tableau '!$A$8:$A$56,$A$1)>=ROW()+MATCH($A$1,'Tableau '!$A$1:$A$56,0)-3,INDEX('Tableau '!$A$1:$D$56,ROW()+MATCH($A$1,'Tableau '!$A$1:$A$56,0)-2,COLUMN()),\"\")","v":"Lanthier "},{"$f":"IF(COUNTIF('Tableau '!$A$8:$A$56,$A$1)>=ROW()+MATCH($A$1,'Tableau '!$A$1:$A$56,0)-3,INDEX('Tableau '!$A$1:$D$56,ROW()+MATCH($A$1,'Tableau '!$A$1:$A$56,0)-2,COLUMN()),\"\")","v":"CA "},{"$f":"IF(COUNTIF('Tableau '!$A$8:$A$56,$A$1)>=ROW()+MATCH($A$1,'Tableau '!$A$1:$A$56,0)-3,INDEX('Tableau '!$A$1:$D$56,ROW()+MATCH($A$1,'Tableau '!$A$1:$A$56,0)-2,COLUMN()),\"\")","v":1040}]
[{"$f":"IF(COUNTIF('Tableau '!$A$8:$A$56,$A$1)>=ROW()+MATCH($A$1,'Tableau '!$A$1:$A$56,0)-3,INDEX('Tableau '!$A$1:$D$56,ROW()+MATCH($A$1,'Tableau '!$A$1:$A$56,0)-2,COLUMN()),\"\")","v":"catherine"},{"$f":"IF(COUNTIF('Tableau '!$A$8:$A$56,$A$1)>=ROW()+MATCH($A$1,'Tableau '!$A$1:$A$56,0)-3,INDEX('Tableau '!$A$1:$D$56,ROW()+MATCH($A$1,'Tableau '!$A$1:$A$56,0)-2,COLUMN()),\"\")","v":"Lanthier "},{"$f":"IF(COUNTIF('Tableau '!$A$8:$A$56,$A$1)>=ROW()+MATCH($A$1,'Tableau '!$A$1:$A$56,0)-3,INDEX('Tableau '!$A$1:$D$56,ROW()+MATCH($A$1,'Tableau '!$A$1:$A$56,0)-2,COLUMN()),\"\")","v":"CA "},{"$f":"IF(COUNTIF('Tableau '!$A$8:$A$56,$A$1)>=ROW()+MATCH($A$1,'Tableau '!$A$1:$A$56,0)-3,INDEX('Tableau '!$A$1:$D$56,ROW()+MATCH($A$1,'Tableau '!$A$1:$A$56,0)-2,COLUMN()),\"\")","v":1040}]
[{"$f":"IF(COUNTIF('Tableau '!$A$8:$A$56,$A$1)>=ROW()+MATCH($A$1,'Tableau '!$A$1:$A$56,0)-3,INDEX('Tableau '!$A$1:$D$56,ROW()+MATCH($A$1,'Tableau '!$A$1:$A$56,0)-2,COLUMN()),\"\")","v":"catherine"},{"$f":"IF(COUNTIF('Tableau '!$A$8:$A$56,$A$1)>=ROW()+MATCH($A$1,'Tableau '!$A$1:$A$56,0)-3,INDEX('Tableau '!$A$1:$D$56,ROW()+MATCH($A$1,'Tableau '!$A$1:$A$56,0)-2,COLUMN()),\"\")","v":"Lanthier "},{"$f":"IF(COUNTIF('Tableau '!$A$8:$A$56,$A$1)>=ROW()+MATCH($A$1,'Tableau '!$A$1:$A$56,0)-3,INDEX('Tableau '!$A$1:$D$56,ROW()+MATCH($A$1,'Tableau '!$A$1:$A$56,0)-2,COLUMN()),\"\")","v":"CA "},{"$f":"IF(COUNTIF('Tableau '!$A$8:$A$56,$A$1)>=ROW()+MATCH($A$1,'Tableau '!$A$1:$A$56,0)-3,INDEX('Tableau '!$A$1:$D$56,ROW()+MATCH($A$1,'Tableau '!$A$1:$A$56,0)-2,COLUMN()),\"\")","v":1040}]
[{"$f":"IF(COUNTIF('Tableau '!$A$8:$A$56,$A$1)>=ROW()+MATCH($A$1,'Tableau '!$A$1:$A$56,0)-3,INDEX('Tableau '!$A$1:$D$56,ROW()+MATCH($A$1,'Tableau '!$A$1:$A$56,0)-2,COLUMN()),\"\")","v":"catherine"},{"$f":"IF(COUNTIF('Tableau '!$A$8:$A$56,$A$1)>=ROW()+MATCH($A$1,'Tableau '!$A$1:$A$56,0)-3,INDEX('Tableau '!$A$1:$D$56,ROW()+MATCH($A$1,'Tableau '!$A$1:$A$56,0)-2,COLUMN()),\"\")","v":"Lanthier "},{"$f":"IF(COUNTIF('Tableau '!$A$8:$A$56,$A$1)>=ROW()+MATCH($A$1,'Tableau '!$A$1:$A$56,0)-3,INDEX('Tableau '!$A$1:$D$56,ROW()+MATCH($A$1,'Tableau '!$A$1:$A$56,0)-2,COLUMN()),\"\")","v":"CA "},{"$f":"IF(COUNTIF('Tableau '!$A$8:$A$56,$A$1)>=ROW()+MATCH($A$1,'Tableau '!$A$1:$A$56,0)-3,INDEX('Tableau '!$A$1:$D$56,ROW()+MATCH($A$1,'Tableau '!$A$1:$A$56,0)-2,COLUMN()),\"\")","v":1040}]
[{"$f":"IF(COUNTIF('Tableau '!$A$8:$A$56,$A$1)>=ROW()+MATCH($A$1,'Tableau '!$A$1:$A$56,0)-3,INDEX('Tableau '!$A$1:$D$56,ROW()+MATCH($A$1,'Tableau '!$A$1:$A$56,0)-2,COLUMN()),\"\")","v":""},{"$f":"IF(COUNTIF('Tableau '!$A$8:$A$56,$A$1)>=ROW()+MATCH($A$1,'Tableau '!$A$1:$A$56,0)-3,INDEX('Tableau '!$A$1:$D$56,ROW()+MATCH($A$1,'Tableau '!$A$1:$A$56,0)-2,COLUMN()),\"\")","v":""},{"$f":"IF(COUNTIF('Tableau '!$A$8:$A$56,$A$1)>=ROW()+MATCH($A$1,'Tableau '!$A$1:$A$56,0)-3,INDEX('Tableau '!$A$1:$D$56,ROW()+MATCH($A$1,'Tableau '!$A$1:$A$56,0)-2,COLUMN()),\"\")","v":""},{"$f":"IF(COUNTIF('Tableau '!$A$8:$A$56,$A$1)>=ROW()+MATCH($A$1,'Tableau '!$A$1:$A$56,0)-3,INDEX('Tableau '!$A$1:$D$56,ROW()+MATCH($A$1,'Tableau '!$A$1:$A$56,0)-2,COLUMN()),\"\")","v":""}]
[{"$f":"IF(COUNTIF('Tableau '!$A$8:$A$56,$A$1)>=ROW()+MATCH($A$1,'Tableau '!$A$1:$A$56,0)-3,INDEX('Tableau '!$A$1:$D$56,ROW()+MATCH($A$1,'Tableau '!$A$1:$A$56,0)-2,COLUMN()),\"\")","v":""},{"$f":"IF(COUNTIF('Tableau '!$A$8:$A$56,$A$1)>=ROW()+MATCH($A$1,'Tableau '!$A$1:$A$56,0)-3,INDEX('Tableau '!$A$1:$D$56,ROW()+MATCH($A$1,'Tableau '!$A$1:$A$56,0)-2,COLUMN()),\"\")","v":""},{"$f":"IF(COUNTIF('Tableau '!$A$8:$A$56,$A$1)>=ROW()+MATCH($A$1,'Tableau '!$A$1:$A$56,0)-3,INDEX('Tableau '!$A$1:$D$56,ROW()+MATCH($A$1,'Tableau '!$A$1:$A$56,0)-2,COLUMN()),\"\")","v":""},{"$f":"IF(COUNTIF('Tableau '!$A$8:$A$56,$A$1)>=ROW()+MATCH($A$1,'Tableau '!$A$1:$A$56,0)-3,INDEX('Tableau '!$A$1:$D$56,ROW()+MATCH($A$1,'Tableau '!$A$1:$A$56,0)-2,COLUMN()),\"\")","v":""}]
[{"$f":"IF(COUNTIF('Tableau '!$A$8:$A$56,$A$1)>=ROW()+MATCH($A$1,'Tableau '!$A$1:$A$56,0)-3,INDEX('Tableau '!$A$1:$D$56,ROW()+MATCH($A$1,'Tableau '!$A$1:$A$56,0)-2,COLUMN()),\"\")","v":""},{"$f":"IF(COUNTIF('Tableau '!$A$8:$A$56,$A$1)>=ROW()+MATCH($A$1,'Tableau '!$A$1:$A$56,0)-3,INDEX('Tableau '!$A$1:$D$56,ROW()+MATCH($A$1,'Tableau '!$A$1:$A$56,0)-2,COLUMN()),\"\")","v":""},{"$f":"IF(COUNTIF('Tableau '!$A$8:$A$56,$A$1)>=ROW()+MATCH($A$1,'Tableau '!$A$1:$A$56,0)-3,INDEX('Tableau '!$A$1:$D$56,ROW()+MATCH($A$1,'Tableau '!$A$1:$A$56,0)-2,COLUMN()),\"\")","v":""},{"$f":"IF(COUNTIF('Tableau '!$A$8:$A$56,$A$1)>=ROW()+MATCH($A$1,'Tableau '!$A$1:$A$56,0)-3,INDEX('Tableau '!$A$1:$D$56,ROW()+MATCH($A$1,'Tableau '!$A$1:$A$56,0)-2,COLUMN()),\"\")","v":""}]
[{"$f":"IF(COUNTIF('Tableau '!$A$8:$A$56,$A$1)>=ROW()+MATCH($A$1,'Tableau '!$A$1:$A$56,0)-3,INDEX('Tableau '!$A$1:$D$56,ROW()+MATCH($A$1,'Tableau '!$A$1:$A$56,0)-2,COLUMN()),\"\")","v":""},{"$f":"IF(COUNTIF('Tableau '!$A$8:$A$56,$A$1)>=ROW()+MATCH($A$1,'Tableau '!$A$1:$A$56,0)-3,INDEX('Tableau '!$A$1:$D$56,ROW()+MATCH($A$1,'Tableau '!$A$1:$A$56,0)-2,COLUMN()),\"\")","v":""},{"$f":"IF(COUNTIF('Tableau '!$A$8:$A$56,$A$1)>=ROW()+MATCH($A$1,'Tableau '!$A$1:$A$56,0)-3,INDEX('Tableau '!$A$1:$D$56,ROW()+MATCH($A$1,'Tableau '!$A$1:$A$56,0)-2,COLUMN()),\"\")","v":""},{"$f":"IF(COUNTIF('Tableau '!$A$8:$A$56,$A$1)>=ROW()+MATCH($A$1,'Tableau '!$A$1:$A$56,0)-3,INDEX('Tableau '!$A$1:$D$56,ROW()+MATCH($A$1,'Tableau '!$A$1:$A$56,0)-2,COLUMN()),\"\")","v":""}]
{"$rows_left_out":41}