{"text_format":"1","workbook":"xlsx","n_sheets":5,"sheets":["Cle Co tri","Nomenclature_design_art","Nomenclature_design_art_MS","Generateur Designation","Generateur"],"not_rendered":{"charts":0,"images":1,"macros":1,"external_links":0,"defined_names":66,"comments":0,"pivot_tables":0},"unopened":[],"bounds":{"document_bytes":16777216,"sheet_cells":100000,"rows_first":2000,"rows_last":500,"rows_between":2000,"halvings":0,"cell_chars":16384,"cell_head_chars":4096},"cells_cut":0,"cells_raw":0,"read":"whole","date_system":"1900"}

{"sheet":"Cle Co tri","index":0,"n_rows":145,"n_cols":39,"rows_kept":145,"cut":false,"hidden":false,"merged":[]}
[]
[null,null,null,null,null,null,null,null,null,null,null,null,null,null,null,null,null,null,null,null,null,null,null,null,"ATTENTION : penser a mettre code correspondance quelque part dans les champs pour sql",null,null,null,null,null,"S","T","LCA","ALI","00","075","S","HEL","001"]
[null,null,null,null,null,null,null,null,null,null,null,null,null,null,null,null,null,null,null,null,null,null,null,null,null,null,null,null,null,null,{"$f":"VLOOKUP($AE$2,$AB$6:$AC$8,2)","v":"SANS"},{"$f":"VLOOKUP($AF$2,$AB$9:$AC$13,2)","v":"Tuilé"},{"$f":"VLOOKUP($AG$2,$AB$14:$AC$47,2)","v":"Languedoc Cabrieres"},{"$f":"VLOOKUP($AH$2,$AB$48:$AC$69,2)","v":"Alicante"},{"$f":"VLOOKUP($AI$2,$AB$70:$AC$78,2)","v":"00"},{"$f":"VLOOKUP($AJ$2,$AB$79:$AC$89,2)","v":"75"},{"$f":"VLOOKUP($AK$2,$AB$90:$AC$93,2)","v":"Speciale"},{"$f":"VLOOKUP($AL$2,$AB$94:$AC$133,2)","v":"HELIX"},{"$f":"VLOOKUP($AM$2,$AB$134:$AC$145,2)","v":"001"}]
[null,null,"CO TRI PF VERRE VIM"]
[null,null,null,1,2,3,4,5,6,7,8,9,10,11,12,13,14,15,16,17,18,19,20,null,"Champ","Où ?","Valeurs","Correspondance","Valeurs"]
[null,null,"Bio","X",null,null,null,null,null,null,null,null,null,null,null,null,null,null,null,null,null,null,null,null,"Bio","Zone perso","AB","A","AB"]
[null,null,"Couleur",null,"X",null,null,null,null,null,null,null,null,null,null,null,null,null,null,null,null,null,null,null,null,null,"NOP","N","NOP"]
[null,null,"Appelation",null,null,"X","X","X",null,null,null,null,null,null,null,null,null,null,null,null,null,null,null,null,null,null,"SANS","S","SANS"]
[null,null,"Cepage",null,null,null,null,null,"X","X","X",null,null,null,null,null,null,null,null,null,null,null,null,null,"Couleur","MMS001/G","Blanc","B","Blanc"]
[null,null,"Edulcoration",null,null,null,null,null,null,null,null,"X","X",null,null,null,null,null,null,null,null,null,null,null,null,null,"Rouge","R","Rouge"]
[null,null,"Centilisation",null,null,null,null,null,null,null,null,null,null,"X","X","X",null,null,null,null,null,null,null,null,null,null,"Rosé","S","Rosé"]
[null,null,"Type Bouteille",null,null,null,null,null,null,null,null,null,null,null,null,null,"X",null,null,null,null,null,null,null,null,null,"Gris","G","Gris"]
[null,null,"Modele BT",null,null,null,null,null,null,null,null,null,null,null,null,null,null,"X","X","X",null,null,null,null,null,null,"Tuilé","T","Tuilé"]
[null,null,"Capacité CT",null,null,null,null,null,null,null,null,null,null,null,null,null,null,null,null,null,"X","X","X",null,"Appelation","MMS001/F","Bordeaux","BDX","Bordeaux"]
[null,null,null,null,null,null,null,null,null,null,null,null,null,null,null,null,null,null,null,null,null,null,null,null,null,null,"Bordeaux Sup","XSU","Bordeaux Sup"]
[null,null,"CO TRI PF BIB VIM",null,null,null,null,null,null,null,null,null,null,null,null,null,null,null,null,null,null,null,null,null,null,null,"Coteaux d'Aix en Provence","CAP","Coteaux d'Aix en Provence"]
[null,null,null,1,2,3,4,5,6,7,8,9,10,11,12,13,null,null,null,null,null,null,null,null,null,null,"Costieres de nimes","CDN","Costieres de nimes"]
[null,null,"Format BIB","X",null,null,null,null,null,null,null,null,null,null,null,null,null,"Champ a revoir avec RHT",null,null,null,null,null,null,null,null,"Cotes de Provence","CDP","Cotes de Provence"]
[null,null,"Centilisation",null,"X","X","X",null,null,null,null,null,null,null,null,null,null,null,null,null,null,null,null,null,null,null,"Cotes du Roussillon","CDR","Cotes du Roussillon"]
[null,null,"Couleur",null,null,null,null,"X",null,null,null,null,null,null,null,null,null,null,null,null,null,null,null,null,null,null,"Cotes du Roussillon Village","CRV","Cotes du Roussillon Village"]
[null,null,"Appelation",null,null,null,null,null,"X","X","X",null,null,null,null,null,null,null,null,null,null,null,null,null,null,null,"Cotes du Ventoux","CDV","Cotes du Ventoux"]
[null,null,"Cepage",null,null,null,null,null,null,null,null,"X","X","X",null,null,null,null,null,null,null,null,null,null,null,null,"Corbieres","COR ","Corbieres"]
[null,null,"Edulcoration",null,null,null,null,null,null,null,null,null,null,null,"X","X",null,null,null,null,null,null,null,null,null,null,"Corbieres Boutenac","COB","Corbieres Boutenac"]
[null,null,null,null,null,null,null,null,null,null,null,null,null,null,null,null,null,null,null,null,null,null,null,null,null,null,"Cotes du Rhone","CDR","Cotes du Rhone"]
[null,null,null,null,null,null,null,null,null,null,null,null,null,null,null,null,null,null,null,null,null,null,null,null,null,null,"Cotes du Rhone Village","RVI","Cotes du Rhone Village"]
[null,null,"CO TRI PF VERRE UCCOAR",null,null,null,null,null,null,null,null,null,null,null,null,null,null,null,null,null,null,null,null,null,null,null,"Vin d'Espagne","ESP","Vin d'Espagne"]
[null,null,null,null,null,null,null,null,null,null,null,null,null,null,null,null,null,null,null,null,null,null,null,null,null,null,"Faugeres","FAU","Faugeres"]
[null,null,null,null,null,null,null,null,null,null,null,null,null,null,null,null,null,null,null,null,null,null,null,null,null,null,"Fitou","FIT","Fitou"]
[null,null,null,null,null,null,null,null,null,null,null,null,null,null,null,null,null,null,null,null,null,null,null,null,null,null,"Fronton","FRO","Fronton"]
[null,null,null,null,null,null,null,null,null,null,null,null,null,null,null,null,null,null,null,null,null,null,null,null,null,null,"IGP Aude","I11","IGP Aude"]
[null,null,null,null,null,null,null,null,null,null,null,null,null,null,null,null,null,null,null,null,null,null,null,null,null,null,"IGP Gard","I30","IGP Gard"]
[null,null,null,null,null,null,null,null,null,null,null,null,null,null,null,null,null,null,null,null,null,null,null,null,null,null,"IGP Herault","I34","IGP Herault"]
[null,null,null,null,null,null,null,null,null,null,null,null,null,null,null,null,null,null,null,null,null,null,null,null,null,null,"IGP Libron","ILI","IGP Libron"]
[null,null,null,null,null,null,null,null,null,null,null,null,null,null,null,null,null,null,null,null,null,null,null,null,null,null,"IGP Oc","IOC","IGP Oc"]
[null,null,null,null,null,null,null,null,null,null,null,null,null,null,null,null,null,null,null,null,null,null,null,null,null,null,"Languedoc Cabrieres","LCA","Languedoc Cabrieres"]
[null,null,null,null,null,null,null,null,null,null,null,null,null,null,null,null,null,null,null,null,null,null,null,null,null,null,"Languedoc La Clape","LCL","Languedoc La Clape"]
[null,null,null,null,null,null,null,null,null,null,null,null,null,null,null,null,null,null,null,null,null,null,null,null,null,null,"Languedoc Montpeyroux","LMO","Languedoc Montpeyroux"]
[null,null,"CO TRI PF CUBIS UCCOAR",null,null,null,null,null,null,null,null,null,null,null,null,null,null,null,null,null,null,null,null,null,null,null,"Languedoc Picpoul de Pinet","LPI","Languedoc Picpoul de Pinet"]
[null,null,null,null,null,null,null,null,null,null,null,null,null,null,null,null,null,null,null,null,null,null,null,null,null,null,"Languedoc Pic Saint Loup","LLO","Languedoc Pic Saint Loup"]
[null,null,null,null,null,null,null,null,null,null,null,null,null,null,null,null,null,null,null,null,null,null,null,null,null,null,"Languedoc Quatourze","LQA","Languedoc Quatourze"]
{"$rows_left_out":106}
{"sheet":"Nomenclature_design_art","index":1,"n_rows":83,"n_cols":15,"rows_kept":83,"cut":false,"hidden":false,"merged":[]}
[null,null,"PF &VRAC"]
[]
[null,null,"Categorie app","Espace","App/Cepage","Espace","Coul","Espace","Degre","\"+\"","Edulcoration","Espace","Nom/Cuvee"]
[null,"Nb car",3,1,3,1,2,1,4,1,2,1,11,null,{"$f":"SUM(C4:M4)","v":30}]
[]
[null,null,"Client et specificité dans Code etendu ou Designation"]
[]
[]
[]
[null,null,"Couleur","Blanc","BL",null,"Degré",""]
[null,null,null,"Rouge","RG",null,null,6.5]
[null,null,null,"Rosé","RS",null,null,7]
[null,null,null,"Gris","GR",null,null,7.5]
[null,null,null,"Tuilé","TU",null,null,8]
[null,null,"Cat App","IGP","IGP",null,null,8.5]
[null,null,null,"AOP","AOP",null,null,9]
[null,null,null,"AOP VDN","VDN",null,null,9.5]
[null,null,null,"SANS",null,null,null,10]
[null,null,"Appelation","Bordeaux","BDX",null,null,10.5]
[null,null,null,"Bordeaux Sup","XSU",null,null,11]
[null,null,null,"Coteaux d'Aix en Provence","CAP",null,null,11.5]
[null,null,null,"Costieres de nimes","CDN",null,null,12]
[null,null,null,"Cotes de Provence","CDP",null,null,12.5]
[null,null,null,"Cotes du Roussillon","CDR",null,null,13]
[null,null,null,"Cotes du Roussillon Village","CRV",null,null,13.5]
[null,null,null,"Cotes du Ventoux","CDV",null,null,14]
[null,null,null,"Corbieres","COR ",null,null,14.5]
[null,null,null,"Corbieres Boutenac","COB",null,null,15]
[null,null,null,"Cotes du Rhone","CRH",null,null,15.5]
[null,null,null,"Cotes du Rhone Village","RVI"]
[null,null,null,"Vin d'Espagne","ESP"]
[null,null,null,"Faugeres","FAU"]
[null,null,null,"Fitou","FIT"]
[null,null,null,"Fronton","FRO"]
[null,null,null,"IGP Aude","I11"]
[null,null,null,"IGP Gard","I30"]
[null,null,null,"IGP Herault","I34"]
[null,null,null,"IGP Libron","ILI"]
[null,null,null,"IGP Oc","IOC"]
[null,null,null,"Languedoc Cabrieres","LCA"]
{"$rows_left_out":44}
{"sheet":"Nomenclature_design_art_MS","index":2,"n_rows":140,"n_cols":46,"rows_kept":140,"cut":false,"hidden":false,"merged":[]}
[null,null,"MS",null,null,null,null,null,null,null,null,null,null,null,null,null,null,null,null,null,null,null,null,null,null,null,null,null,null,"X"]
[null,null,null,null,null,null,null,null,null,null,null,null,null,null,null,null,null,null,null,null,null,null,null,null,null,null,null,null,null,"H",null,null,"Capsule"]
["CONTENANT",null,"Famille","Type","Modele","Espace","Couleur","Centilisation","Espace","Bouchage","Espace","Libre",null,null,null,null,null,null,null,null,null,null,null,"CONTENANT",null,null,null,"FERMETURE",null,null,null,"SURBOUCHAGE","Pion Fiscal",null,null,"EMBALLAGE",null,null,null,"HABILLAGE",null,null,null,"AGRES"]
[null,"Nb car",2,1,3,1,2,4,1,3,1,12,null,null,null,null,{"$f":"SUM(C4:L4)","v":30}]
[null,null,null,null,null,null,null,null,null,null,null,null,null,null,null,null,null,null,"AGRES","Couleur","Blanc","BL",null,"Famille","Bouteille Verre","BV",null,"Famille","Bouchon","BO",null,"Nature","COMPLEXE","CPX",null,"Nature","CARTON BOUTEILLE","CAR",null,"Famille","Etiquette","ETI",null,"Famille","Palette","PAL"]
[null,null,"Champ libre 11 car pour crantage, blason, cote ou centre pour robinet, …..",null,null,null,null,null,null,null,null,null,null,null,null,null,null,null,"CONTENANT",null,"Rouge","RG",null,null,"Bouteilles PET","BP",null,null,"Capsule a vis","CV",null,null,"PVC","PVC",null,null,"APLAT BIB","BIB",null,null,"Contre Etiquette","CET",null,null,"Emballages","EMB"]
[null,null,null,null,null,null,null,null,null,null,null,null,null,null,null,null,null,null,"EMBALLAGE",null,"Rosé","RS",null,null,"Cubis","CU",null,null,"Opercule","OP",null,null,"PET","PET",null,null,"CAISSE BOIS","CAI",null,null,"Collerette","COL",null,null,"Intercalaires","INT"]
[null,null,null,null,null,null,null,null,null,null,null,null,null,null,null,null,null,null,"FERMETURE",null,"Gris","GR",null,null,"Outre","OU",null,null,"Cap Stream","CS",null,null,"ALU","ALU",null,null,"BOX","BOX",null,null,"Medaille","MED",null,"Nature","EUR","EUR"]
["FERMETURE",null,"Famille","Espace","Nature","Espace","Diametre","\"X\" ou \"H\"","Longueur","Espace","Qualite/Couleur","Espace","CRD/Centil","Espace","Decor",null,null,null,"HABILLAGE",null,"Tuilé","TU",null,null,"Pouch 6","P6",null,"Nature","LIEGE NATUREL","LN",null,null,"ETAIN","ETA",null,null,"REGROUPEMENT","REG",null,null,"Sticker","STK",null,null,"CHEP","CHP"]
[null,"Nb car",2,1,2,1,4,1,4,1,3,1,5,1,4,null,{"$f":"SUM(C10:O10)","v":30},null,"SURBOUCHAGE","Cat App","IGP","IGP",null,null,"Pouch 4","P4",null,null,"LIEGE COLMATE","LC",null,"CRD/Centil","NF","NF",null,null,"BAC PRESENTOIR","BAC",null,null,"Affichette","AFF",null,null,"VMF","VMF"]
[null,null,null,null,null,null,null,null,null,null,null,null,null,null,null,null,null,null,null,null,"AOP","AOP",null,null,"Tetra Baseline","TB",null,null,"AGGLO","AG",null,null,"NF25","NF25",null,null,"CROISILLON","CRO",null,null,"Paille","PAI",null,null,"AUTRES","DIV"]
["SURBOUCHAGE",null,"Nature","Espace","CRD/Centil","Espace","Diametre","\"X\"","Hauteur","Espace","Couleur","Espace","Decor",null,null,null,null,null,null,null,"AOP VDN","VDN",null,null,"Tetra Prisma","TP",null,null,"TECHNIQUE","TE",null,null,"NF37,5","NF37",null,null,"ALVEOLE","ALV",null,null,"Pendeloque","PEN",null,null,"FILM","FIL"]
[null,"Nb car",3,1,6,1,4,1,4,1,3,1,3,null,null,null,{"$f":"SUM(C13:O13)","v":28},null,null,null,"SANS",null,null,"Type","Bordelaise","X",null,null,"SYNTHETIQUE","SY",null,null,"NF50","NF50",null,null,"PLAQUE","PLA",null,"Nature","Traditionnel","T",null,null,"HOUSSE","HOU"]
[null,null,null,null,null,null,null,null,null,null,null,null,null,null,null,null,null,null,null,"Appelation","Bordeaux","BDX",null,null,"Bourguignone","G",null,null,"ALU","AL",null,null,"NF300","NF300",null,null,"GUILLOTINE","GUI",null,null,"Adhesif","A",null,null,"ANTI GLISSE","PAG"]
[null,null,null,null,null,null,null,null,null,null,null,null,null,null,null,null,null,null,null,null,"Bordeaux Sup","XSU",null,null,"Regionale","R",null,null,"PEHD","PH",null,null,"TB25","TB25",null,null,"FILM","FLM",null,null,"Pyramide","P ",null,null,"AQUILUX","AQU"]
["EMBALLAGE",null,"Nature","Espace","Type","Capacité","Espace","Contenant","Espace","Modele","Espace","Centilisation","Espace","Decor","Espace","Finition",null,null,null,null,"Coteaux d'Aix en Provence","CAP",null,null,"Speciale","S",null,null,"PVC","PV",null,null,"TB37,5","TB37",null,"Type","Debout","D",null,null,"Leaflet","L"]
[null,"Nb car",3,1,1,3,1,3,1,3,1,4,1,3,1,3,{"$f":"SUM(C17:P17)","v":29},null,null,null,"Costieres de nimes","CDN",null,"Modele","AUTHENTIQ","AUT",null,null,"PE","PE",null,null,"TB50","TB50",null,null,"Couché","C",null,null,null,null,null,"Longueur",""]
[null,null,null,null,null,null,null,null,null,null,null,null,null,null,null,null,null,null,null,null,"Cotes de Provence","CDP",null,null,"AZUR","AZU",null,"Qualite/Couleur","Fleur","FLE",null,null,"TB75","TB75",null,"Capacité","1","1",null,null,null,null,null,null,"400"]
["HABILLAGE",null,"Famille","Espace","Nature","Espace","Hauteur","\"X\"","Largeur","Espace","Degré","Espace","Mill","Espace","Libre",null,null,null,null,null,"Cotes du Roussillon","CDR",null,null,"BG","BG",null,null,"Superieure","SUP",null,null,"TB100","TB100",null,null,"2","2",null,null,null,null,null,null,"600"]
[null,"Nb car",3,1,1,1,3,1,3,1,4,1,2,1,8,null,{"$f":"SUM(C20:O20)","v":30},null,null,null,"Cotes du Roussillon Village","CRV",null,null,"BOULIDOU","BOU",null,null,"1ere","1",null,null,"TB150","TB150",null,null,"3","3",null,null,null,null,null,null,"800"]
[null,null,null,null,null,null,null,null,null,null,null,null,null,null,null,null,null,null,null,null,"Cotes du Ventoux","CDV",null,null,"CALIFORN","CAL",null,null,"2eme","2",null,null,"TB225","TB225",null,null,"4","4",null,null,null,null,null,null,"1000"]
["AGRES",null,"Famille","Espace","Nature","Espace","Longueur","\"X\"","Largeur","Espace","Libre",null,null,null,null,null,null,null,null,null,"Corbieres","COR ",null,null,"CARACTERE","CAR",null,null,"3eme","3",null,null,"TB300","TB300",null,null,"6","6",null,null,null,null,null,null,"1200"]
[null,"Nb car",3,1,3,1,4,1,4,1,12,null,null,null,null,null,{"$f":"SUM(C23:O23)","v":30},null,null,null,"Corbieres Boutenac","COB",null,null,"CARAFE","CAF",null,null,"4eme","4",null,null,"TB500","TB500",null,null,"10","10"]
[null,null,null,null,null,null,null,null,null,null,null,null,null,null,null,null,null,null,null,null,"Cotes du Rhone","CRH",null,null,"CLARA","CLA",null,null,"5eme","5",null,null,"TV25","TV25",null,null,"12","12",null,null,null,null,null,"Largeur","400"]
[null,null,null,null,null,null,null,null,null,null,null,null,null,null,null,null,null,null,null,null,"Cotes du Rhone Village","RVI",null,null,"DISTINCTI","DIS",null,null,"6eme","6",null,null,"TV37,5","TV37",null,null,"24","24",null,null,null,null,null,null,"600"]
[null,null,null,null,null,null,null,null,null,null,null,null,null,null,null,null,null,null,null,null,"Vin d'Espagne","ESP",null,null,"ECO 2","ECO",null,null,"Rien",null,null,null,"TV50","TV50",null,null,"48","48",null,null,null,null,null,null,"800"]
[null,null,null,null,null,null,null,null,null,null,null,null,null,null,null,null,null,null,null,null,"Faugeres","FAU",null,null,"EVOL SATI","EVS",null,null,"Or","OR",null,null,"TV75","TV75",null,null,"54","54",null,null,null,null,null,null,"1000"]
[null,null,null,null,null,null,null,null,null,null,null,null,null,null,null,null,null,null,null,null,"Fitou","FIT",null,null,"EVOLUTION","EVO",null,null,"Argent","ARG",null,null,"TV100","TV100",null,null,"65","65",null,null,null,null,null,null,"1200"]
[null,null,null,null,null,null,null,null,null,null,null,null,null,null,null,null,null,null,null,null,"Fronton","FRO",null,null,"FLUTE EVO","FLU",null,null,"Bronze","BRO",null,null,"TV150","TV150",null,null,"80","80"]
[null,null,null,null,null,null,null,null,null,null,null,null,null,null,null,null,null,null,null,null,"IGP Aude","I11",null,null,"FLUTE OPTIMA","FLU",null,null,"Noire","NOI",null,null,"TV225","TV225",null,null,"108","108"]
[null,null,null,null,null,null,null,null,null,null,null,null,null,null,null,null,null,null,null,null,"IGP Gard","I30",null,null,"GDE TRAD","GDE",null,null,"Rouge","RGE",null,null,"TV300","TV300",null,"Contenant","BX","BX"]
[null,null,null,null,null,null,null,null,null,null,null,null,null,null,null,null,null,null,null,null,"IGP Herault","I34",null,null,"HELIX","HEL",null,null,"Bordeaux","BDX",null,null,"TV500","TV500",null,null,"BG","BG"]
[null,null,null,null,null,null,null,null,null,null,null,null,null,null,null,null,null,null,null,null,"IGP Libron","ILI",null,null,"LANGUEDOC","LAN",null,null,"Marron","MAR",null,null,"LDV25","LV25",null,null,"SPE","SPE"]
[null,null,null,null,null,null,null,null,null,null,null,null,null,null,null,null,null,null,null,null,"IGP Oc","IOC",null,null,"LITRE","LIT",null,null,"Bleu","BLE",null,null,"LDV37,5","LV37",null,null,"BIB","BIB"]
[null,null,null,null,null,null,null,null,null,null,null,null,null,null,null,null,null,null,null,null,"Languedoc Cabrieres","LCA",null,null,"LITRE HOLL","LHO",null,null,"Vert","VER",null,null,"LDV50","LV50",null,null,"TETRA","TET"]
[null,null,null,null,null,null,null,null,null,null,null,null,null,null,null,null,null,null,null,null,"Languedoc La Clape","LCL",null,null,"LITRE VT","LVT",null,null,"Jaune","JAU",null,null,"LDV75","LV75",null,"Modele","Rien"]
[null,null,null,null,null,null,null,null,null,null,null,null,null,null,null,null,null,null,null,null,"Languedoc Montpeyroux","LMO",null,null,"LUX NATURA","LUX",null,null,"Orange","ORA",null,null,"LDV100","LV100",null,null,"AUTHENTIQ","AUT"]
[null,null,null,null,null,null,null,null,null,null,null,null,null,null,null,null,null,null,null,null,"Languedoc Picpoul de Pinet","LPI",null,null,"MAESTRIA","MAE",null,null,"Violet","VIO",null,null,"LDV150","LV150",null,null,"AZUR","AZU"]
[null,null,null,null,null,null,null,null,null,null,null,null,null,null,null,null,null,null,null,null,"Languedoc Pic Saint Loup","LLO",null,null,"MAGNUM","MAG",null,null,"Blanc","BLC",null,null,"LDV225","LV225",null,null,"BG","BG"]
[null,null,null,null,null,null,null,null,null,null,null,null,null,null,null,null,null,null,null,null,"Languedoc Quatourze","LQA",null,null,"MEDIUM","MED",null,null,"Creme","CRM",null,null,"LDV300","LV300",null,null,"BOULIDOU","BOU"]
{"$rows_left_out":101}
{"sheet":"Generateur Designation","index":3,"n_rows":139,"n_cols":14,"rows_kept":139,"cut":false,"hidden":false,"merged":[]}
[]
[null,"PF &VRAC",null,null,null,null,"faire rechv avec si - +"]
[null,null,"Categorie app","App/Cepage","Coul","Degre","Edulcoration","Nom/Cuvee"]
[null,null,"AOP","Vin d'Espagne","Blanc",13.5,"00","AUCHAN"]
[null,null,null,null,null,null,null,{"$f":"IF(LEN(H4)>11,\"Nombre de caractères trop grand\",\"Nombre de caractères ok\")","v":"Nombre de caractères ok"}]
[null,null,"Code",null,null,"Nombre de caractère"]
[null,null,{"$f":"CONCATENATE(VLOOKUP(C4,Nomenclature_design_art!$D$15:$E$18,2,),\" \",VLOOKUP(D4,Nomenclature_design_art!$D$19:$E$74,2,),\" \",VLOOKUP(E4,Nomenclature_design_art!$D$10:$E$14,2,),\" \",F4,\"+\",G4,\" \",H4)","v":"AOP ESP BL 13,5+00 AUCHAN"},null,null,{"$f":"LEN(C7)","v":25}]
[]
[]
[null,"MS"]
[]
[null,"Type MS","Famille","Couleur","Centilisation","Bouchage","Libre (18)"]
[null,"CONTENANT","Cubis","MARRON","500","BVS","JFD"]
[null,null,null,null,null,null,{"$f":"IF(LEN(G13)>18,\"Nombre de caractères trop grand\",\"Nombre de caractères ok\")","v":"Nombre de caractères ok"}]
[null,null,"Code",null,null,"Nombre de caractère"]
[null,null,{"$f":"CONCATENATE(VLOOKUP(C13,Nomenclature_design_art_MS!$Y$5:$Z$12,2,),\" \",VLOOKUP(D13,Nomenclature_design_art_MS!$Y$58:$Z$64,2,),VLOOKUP(E13,Nomenclature_design_art_MS!$Y$65:$Z$76,2,),\" \",VLOOKUP(F13,Nomenclature_design_art_MS!$Y$77:$Z$83,2),G13)","v":"CU MA500 BVSJFD"},null,null,{"$f":"LEN(C16)","v":15}]
[]
[null,"Type MS","Famille","Matière","Forme","Robinet","Centilisation","Bouchage","Libre (8)"]
[null,"CONTENANT","Outre","ALU","CARRE","VTC","2000","BVS","JFD"]
[null,null,null,null,null,null,null,null,{"$f":"IF(LEN(I19)>8,\"Nombre de caractères trop grand\",\"Nombre de caractères ok\")","v":"Nombre de caractères ok"}]
[null,null,"Code",null,null,"Nombre de caractère"]
[null,null,{"$f":"CONCATENATE(VLOOKUP(C19,Nomenclature_design_art_MS!$Y$5:$Z$12,2,),\" \",VLOOKUP(D19,Nomenclature_design_art_MS!$Y$84:$Z$86,2,),VLOOKUP(E19,Nomenclature_design_art_MS!$Y$89:$Z$90,2,),\" \",VLOOKUP(F19,Nomenclature_design_art_MS!$Y$87:$Z$88,2),G19,\" \",VLOOKUP(H19,Nomenclature_design_art_MS!$Y$77:$Z$83,2),\" \",I19)","v":"OU ALUCAR VTC2000 BVS JFD"},null,null,{"$f":"LEN(C22)","v":25}]
[]
[null,"Type MS","Famille (6 et 4)","Centilisation","Libre (21)"]
[null,"CONTENANT","Pouch 6","2000","JFD"]
[null,null,null,null,{"$f":"IF(LEN(E25)>21,\"Nombre de caractères trop grand\",\"Nombre de caractères ok\")","v":"Nombre de caractères ok"}]
[null,null,"Code",null,null,"Nombre de caractère"]
[null,null,{"$f":"CONCATENATE(VLOOKUP(C25,Nomenclature_design_art_MS!$Y$5:$Z$12,2,),\" \",D25,\" \",E25)","v":"P6 2000 JFD"},null,null,{"$f":"LEN(C28)","v":11}]
[]
[null,"Type MS","Famille (bas et pri)","Centilisation","Bouchage (uni et asep)","Libre (19)"]
[null,"CONTENANT","Tetra Prisma","100","UNITAP","JFD"]
[null,null,null,null,null,{"$f":"IF(LEN(F31)>19,\"Nombre de caractères trop grand\",\"Nombre de caractères ok\")","v":"Nombre de caractères ok"}]
[null,null,"Code",null,null,"Nombre de caractère"]
[null,null,{"$f":"CONCATENATE(VLOOKUP(C31,Nomenclature_design_art_MS!$Y$5:$Z$12,2,),\" \",D31,\" \",VLOOKUP(E31,Nomenclature_design_art_MS!$Y$77:$Z$83,2,),\" \",F31)","v":"TP 100 UNI JFD"},null,null,{"$f":"LEN(C34)","v":14}]
[]
[null,"Type MS","Famille V et PET)","Type","Modele","Couleur","Centilisation","Bouchage","Libre (12)",null,null,null,"BTV : champ libre pour Ecova/L+G, degarni, diametre bague si speciale, crantée","=> MOS 474 supp modele et degarni"]
[null,"CONTENANT","Bouteille Verre","Bordelaise","OPTIMA","FEUILLE MORTE","75","BVS"]
[null,null,null,null,null,null,null,null,{"$f":"IF(LEN(I37)>12,\"Nombre de caractères trop grand\",\"Nombre de caractères ok\")","v":"Nombre de caractères ok"}]
[null,null,"Code",null,null,"Nombre de caractère"]
[null,null,{"$f":"CONCATENATE(VLOOKUP(C37,Nomenclature_design_art_MS!$Y$5:$Z$12,2,),VLOOKUP(D37,Nomenclature_design_art_MS!$Y$13:$Z$16,2,),VLOOKUP(E37,Nomenclature_design_art_MS!$Y$17:$Z$57,2,),\" \",VLOOKUP(F37,Nomenclature_design_art_MS!$Y$58:$Z$64,2),G37,\" \",VLOOKUP(H37,Nomenclature_design_art_MS!$Y$77:$Z$83,2,),\" \",I37)","v":"BVXOPT FM75 BVS "},null,null,{"$f":"LEN(C40)","v":16}]
{"$rows_left_out":100}
{"sheet":"Generateur","index":4,"n_rows":37,"n_cols":2,"rows_kept":37,"cut":false,"hidden":false,"merged":[]}
["Type MS","Famille"]
["CONTENANT","Cubis"]
["CONTENANT","Outre"]
["CONTENANT","Pouch 6"]
["CONTENANT","Pouch 4"]
["CONTENANT","Tetra Prisma"]
["CONTENANT","Tetra Baseline"]
["CONTENANT","Bouteille Verre"]
["CONTENANT","Bouteille PET"]
["FERMETURE","Bouchon"]
["FERMETURE","Capsule a vis"]
["FERMETURE","Opercule"]
["FERMETURE","Cap Stream"]
["SURBOUCHAGE","Capsule"]
["SURBOUCHAGE","Pion Fiscal"]
["EMBALLAGE","CARTON BOUTEILLE"]
["EMBALLAGE","CAISSE BOIS"]
["EMBALLAGE","REGROUPEMENT"]
["EMBALLAGE","APLAT BIB"]
["EMBALLAGE","BOX"]
["EMBALLAGE","BAC PRESENTOIR"]
["EMBALLAGE","CROISILLON"]
["EMBALLAGE","ALVEOLE"]
["EMBALLAGE","PLAQUE"]
["EMBALLAGE","GUILLOTINE"]
["EMBALLAGE","FILM"]
["AGRES","Palette"]
["AGRES","Emballages"]
["AGRES","Intercalaires"]
["HABILLAGE","Etiquette"]
["HABILLAGE","Contre Etiquette"]
["HABILLAGE","Collerette"]
["HABILLAGE","Medaille"]
["HABILLAGE","Sticker"]
["HABILLAGE","Affichette"]
["HABILLAGE","Paille"]
["HABILLAGE","Pendeloque"]