{"text_format":"1","workbook":"xlsx","n_sheets":15,"sheets":["Couleurs","A","B","C","D","E","F","G","H","I","J","K","L","Vue globale","Récap"],"not_rendered":{"charts":0,"images":0,"macros":1,"external_links":1,"defined_names":4,"comments":0,"pivot_tables":0},"unopened":[],"bounds":{"document_bytes":16777216,"sheet_cells":100000,"rows_first":2000,"rows_last":500,"rows_between":2000,"halvings":0,"cell_chars":16384,"cell_head_chars":4096},"cells_cut":0,"cells_raw":0,"read":"whole","date_system":"1900"}

{"sheet":"Couleurs","index":0,"n_rows":36,"n_cols":3,"rows_kept":36,"cut":false,"hidden":false,"merged":[]}
["6h30/8h00",null,2016]
["6h30/14h30"]
["7h00/9h00"]
["8h00/10h00"]
["9h00/11h00"]
["9h00/17h00"]
["10h00/12h00"]
["11h00/13h00"]
["13h00/15h00"]
["13h30/15h30"]
["14h00/16h00"]
["15h00/17h00"]
["16H00/18H00"]
["17h00/19h00"]
["18h00/20h00"]
["19h00/21h00"]
["21h00/23h00"]
["22h00/23h00"]
["Abs"]
["Uasa"]
["Cvo"]
["Spes"]
["Hdv"]
["Map"]
["Motards"]
["Nuit"]
["Poly centre"]
["Centre"]
["Vtt centre"]
["MISSION"]
["GPE"]
["G"]
["C"]
["FORMATION"]
["REUNION"]
[" C.médical"]

{"sheet":"A","index":1,"n_rows":111,"n_cols":27,"rows_kept":111,"cut":false,"hidden":false,"merged":[[1,24,1,26],[94,14,94,16],[1,1,1,21],[94,1,95,1],[94,2,94,4],[94,5,94,7],[94,8,94,10],[94,11,94,13],[94,17,95,17],[94,18,95,18],[94,19,95,19],[94,20,95,20],[96,2,96,4],[97,2,97,4],[98,2,98,4],[100,2,100,4],[100,5,100,7],[110,17,110,20],[101,17,101,20],[102,17,102,20],[103,17,103,20],[104,17,104,20],[105,17,105,20],[106,17,106,20],[101,2,101,4],[102,2,102,4],[103,2,103,4],[104,2,104,4],[105,14,105,16],[107,17,107,20],[104,8,104,10],[106,8,106,10],[107,8,107,10],[108,8,108,10],[109,8,109,10],[108,17,108,20],[109,17,109,20],[99,2,99,4],[96,5,96,7],[99,5,99,7],[96,17,96,20],[97,17,97,20],[98,17,98,20],[99,17,99,20],[100,17,100,20],[107,2,107,4],[96,8,96,10],[96,11,96,13],[96,14,96,16],[97,5,97,7],[98,5,98,7],[97,8,97,10],[98,8,98,10],[97,11,97,13],[102,11,102,13],[101,8,101,10],[102,8,102,10],[99,8,99,10],[104,11,104,13],[106,11,106,13],[108,2,108,4],[109,2,109,4],[110,2,110,4],[105,2,105,4],[106,2,106,4],[110,8,110,10],[105,8,105,10],[101,5,101,7],[102,5,102,7],[103,5,103,7],[104,5,104,7],[106,5,106,7],[107,5,107,7],[108,5,108,7],[109,5,109,7],[110,5,110,7],[105,5,105,7],[103,8,103,10],[107,11,107,13],[108,11,108,13],[100,8,100,10],[100,11,100,13],[110,11,110,13],[97,14,97,16],[98,14,98,16],[99,14,99,16],[100,14,100,16],[101,14,101,16],[102,14,102,16],[103,14,103,16],[104,14,104,16],[106,14,106,16],[107,14,107,16],[108,14,108,16],[109,14,109,16],[110,14,110,16],[103,11,103,13],[105,11,105,13],[109,11,109,13],[98,11,98,13],[99,11,99,13],[101,11,101,13]]}
[]
[null,11,null,null,null,null,null,null,null,null,null,null,null,null,null,null,null,null,null,null,null,null,null,null,{"$f":"IF(S95+T95<>R95,\"FAUX\",\"OK\")","v":"OK"}]
[null,null,null,null,null,null,null,null,null,null,null,null,null,null,null,null,null,null,null,null,null,null,null,null,"Total","G","C"]
[null,"Noms",{"$f":"IF(ISNUMBER(B2),7*B2+DATE(Année,1,3)-WEEKDAY(DATE(Année,1,3))-5,\"\")","v":"2016-03-14"},"G","C",{"$f":"C4+1","v":"2016-03-15"},"G","C",{"$f":"F4+1","v":"2016-03-16"},"G","C",{"$f":"I4+1","v":"2016-03-17"},"G","C",{"$f":"L4+1","v":"2016-03-18"},"G","C","Total","G","B","Abs",null,null,null,{"$f":"R95","v":0},{"$f":"S95","v":0},{"$f":"T95","v":0}]
[null,null,null,null,null,null,null,null,null,null,null,null,null,null,null,null,null,{"$f":"somcoul(C5:Q5,\"rouge\")","v":0},{"$f":"COUNTIF(C5:Q5,(\"g\"))","v":0},{"$f":"COUNTIF(C5:Q5,(\"c\"))","v":0},{"$f":"COUNTIF(C5:Q5,\"abs\")","v":0}]
[null,null,null,null,null,null,null,null,null,null,null,null,null,null,null,null,null,{"$f":"somcoul(C6:Q6,\"rouge\")","v":0},{"$f":"COUNTIF(C6:Q6,(\"g\"))","v":0},{"$f":"COUNTIF(C6:Q6,(\"c\"))","v":0},{"$f":"COUNTIF(C6:Q6,\"abs\")","v":0}]
[null,null,null,null,null,null,null,null,null,null,null,null,null,null,null,null,null,0,0,0,0]
[null,null,null,null,null,null,null,null,null,null,null,null,null,null,null,null,null,0,0,0,0]
[null,null,null,null,null,null,null,null,null,null,null,null,null,null,null,null,null,0,0,0,0]
[null,null,null,null,null,null,null,null,null,null,null,null,null,null,null,null,null,0,0,0,0]
[null,null,null,null,null,null,null,null,null,null,null,null,null,null,null,null,null,0,0,0,0]
[null,null,null,null,null,null,null,null,null,null,null,null,null,null,null,null,null,0,0,0,0]
[null,null,null,null,null,null,null,null,null,null,null,null,null,null,null,null,null,0,0,0,0," ",null," ",null,null,"                                    "]
[null,null,null,null,null,null,null,null,null,null,null,null,null,null,null,null,null,0,0,0,0]
[null,null,null,null,null,null,null,null,null,null,null,null,null,null,null,null,null,0,0,0,0]
[null,null,null,null,null,null,null,null,null,null,null,null,null,null,null,null,null,0,0,0,0]
[null,null,null,null,null,null,null,null,null,null,null,null,null,null,null,null,null,0,0,0,0]
[null,null,null,null,null,null,null,null,null,null,null,null,null,null,null,null,null,0,0,0,0]
[null,null,null,null,null,null,null,null,null,null,null,null,null,null,null,null,null,0,0,0,0]
[null,null,null,null,null,null,null,null,null,null,null,null,null,null,null,null,null,0,0,0,0]
[null,null,null,null,null,null,null,null,null,null,null,null,null,null,null,null,null,0,0,0,0]
[null,null,null,null,null,null,null,null,null,null,null,null,null,null,null,null,null,0,0,0,0]
[null,null,null,null,null,null,null,null,null,null,null,null,null,null,null,null,null,0,0,0,0]
[null,null,null,null,null,null,null,null,null,null,null,null,null,null,null,null,null,0,0,0,0]
[null,null,null,null,null,null,null,null,null,null,null,null,null,null,null,null,null,0,0,0,0]
[null,null,null,null,null,null,null,null,null,null,null,null,null,null,null,null,null,0,0,0,0]
[null,null,null,null,null,null,null,null,null,null,null,null,null,null,null,null,null,0,0,0,0]
[null,null,null,null,null,null,null,null,null,null,null,null,null,null,null,null,null,0,0,0,0]
[null,null,null,null,null,null,null,null,null,null,null,null,null,null,null,null,null,0,0,0,0]
[null,null,null,null,null,null,null,null,null,null,null,null,null,null,null,null,null,0,0,0,0]
[null,null,null,null,null,null,null,null,null,null,null,null,null,null,null,null,null,{"$f":"somcoul(C31:Q31,\"rouge\")","v":0},{"$f":"COUNTIF(C31:Q31,(\"g\"))","v":0},{"$f":"COUNTIF(C31:Q31,(\"c\"))","v":0},{"$f":"COUNTIF(C31:Q31,\"abs\")","v":0}]
[null,null,null,null,null,null,null,null,null,null,null,null,null,null,null,null,null,0,0,0,0]
[null,null,null,null,null,null,null,null,null,null,null,null,null,null,null,null,null,0,0,0,0]
[null,null,null,null,null,null,null,null,null,null,null,null,null,null,null,null,null,0,0,0,0]
[null,null,null,null,null,null,null,null,null,null,null,null,null,null,null,null,null,0,0,0,0]
[null,null,null,null,null,null,null,null,null,null,null,null,null,null,null,null,null,0,0,0,0]
[null,null,null,null,null,null,null,null,null,null,null,null,null,null,null,null,null,0,0,0,0]
[null,null,null,null,null,null,null,null,null,null,null,null,null,null,null,null,null,0,0,0,0]
[null,null,null,null,null,null,null,null,null,null,null,null,null,null,null,null,null,0,0,0,0]
[null,null,null,null,null,null,null,null,null,null,null,null,null,null,null,null,null,0,0,0,0]
[null,null,null,null,null,null,null,null,null,null,null,null,null,null,null,null,null,0,0,0,0]
[null,null,null,null,null,null,null,null,null,null,null,null,null,null,null,null,null,0,0,0,0]
[null,null,null,null,null,null,null,null,null,null,null,null,null,null,null,null,null,0,0,0,0]
[null,null,null,null,null,null,null,null,null,null,null,null,null,null,null,null,null,0,0,0,0]
[null,null,null,null,null,null,null,null,null,null,null,null,null,null,null,null,null,0,0,0,0]
[null,null,null,null,null,null,null,null,null,null,null,null,null,null,null,null,null,0,0,0,0]
[null,null,null,null,null,null,null,null,null,null,null,null,null,null,null,null,null,0,0,0,0]
[null,null,null,null,null,null,null,null,null,null,null,null,null,null,null,null,null,0,0,0,0]
[null,null,null,null,null,null,null,null,null,null,null,null,null,null,null,null,null,0,0,0,0]
[null,null,null,null,null,null,null,null,null,null,null,null,null,null,null,null,null,0,0,0,0]
[null,null,null,null,null,null,null,null,null,null,null,null,null,null,null,null,null,0,0,0,0]
[null,null,null,null,null,null,null,null,null,null,null,null,null,null,null,null,null,0,0,0,0]
[null,null,null,null,null,null,null,null,null,null,null,null,null,null,null,null,null,0,0,0,0]
[null,null,null,null,null,null,null,null,null,null,null,null,null,null,null,null,null,0,0,0,0]
[null,null,null,null,null,null,null,null,null,null,null,null,null,null,null,null,null,0,0,0,0]
[null,null,null,null,null,null,null,null,null,null,null,null,null,null,null,null,null,0,0,0,0]
[null,null,null,null,null,null,null,null,null,null,null,null,null,null,null,null,null,0,0,0,0]
[null,null,null,null,null,null,null,null,null,null,null,null,null,null,null,null,null,0,0,0,0]
[null,null,null,null,null,null,null,null,null,null,null,null,null,null,null,null,null,0,0,0,0]
[null,null,null,null,null,null,null,null,null,null,null,null,null,null,null,null,null,0,0,0,0]
[null,null,null,null,null,null,null,null,null,null,null,null,null,null,null,null,null,0,0,0,0]
[null,null,null,null,null,null,null,null,null,null,null,null,null,null,null,null,null,0,0,0,0]
[null,null,null,null,null,null,null,null,null,null,null,null,null,null,null,null,null,0,0,0,0]
[null,null,null,null,null,null,null,null,null,null,null,null,null,null,null,null,null,0,0,0,0]
[null,null,null,null,null,null,null,null,null,null,null,null,null,null,null,null,null,0,0,0,0]
[null,null,null,null,null,null,null,null,null,null,null,null,null,null,null,null,null,0,0,0,0]
[null,null,null,null,null,null,null,null,null,null,null,null,null,null,null,null,null,0,0,0,0]
[null,null,null,null,null,null,null,null,null,null,null,null,null,null,null,null,null,0,0,0,0]
[null,null,null,null,null,null,null,null,null,null,null,null,null,null,null,null,null,0,0,0,{"$f":"COUNTIF(C69:Q69,\"abs\")","v":0}]
[null,null,null,null,null,null,null,null,null,null,null,null,null,null,null,null,null,0,0,0,0]
[null,null,null,null,null,null,null,null,null,null,null,null,null,null,null,null,null,0,0,0,0]
[null,null,null,null,null,null,null,null,null,null,null,null,null,null,null,null,null,0,0,0,0]
[null,null,null,null,null,null,null,null,null,null,null,null,null,null,null,null,null,0,0,0,0]
[null,null,null,null,null,null,null,null,null,null,null,null,null,null,null,null,null,0,0,0,0]
[null,null,null,null,null,null,null,null,null,null,null,null,null,null,null,null,null,0,0,0,0]
[null,null,null,null,null,null,null,null,null,null,null,null,null,null,null,null,null,0,0,0,0]
[null,null,null,null,null,null,null,null,null,null,null,null,null,null,null,null,null,0,0,0,0]
[null,null,null,null,null,null,null,null,null,null,null,null,null,null,null,null,null,0,0,0,0]
[null,null,null,null,null,null,null,null,null,null,null,null,null,null,null,null,null,0,0,0,0]
[null,null,null,null,null,null,null,null,null,null,null,null,null,null,null,null,null,0,0,0,0]
[null,null,null,null,null,null,null,null,null,null,null,null,null,null,null,null,null,0,0,0,0]
[null,null,null,null,null,null,null,null,null,null,null,null,null,null,null,null,null,0,0,0,0]
[null,null,null,null,null,null,null,null,null,null,null,null,null,null,null,null,null,0,0,0,0]
[null,null,null,null,null,null,null,null,null,null,null,null,null,null,null,null,null,0,0,0,0]
[null,null,null,null,null,null,null,null,null,null,null,null,null,null,null,null,null,0,0,0,0]
[null,null,null,null,null,null,null,null,null,null,null,null,null,null,null,null,null,0,0,0,0]
[null,null,null,null,null,null,null,null,null,null,null,null,null,null,null,null,null,0,0,0,0]
[null,null,null,null,null,null,null,null,null,null,null,null,null,null,null,null,null,0,0,0,0]
[null,null,null,null,null,null,null,null,null,null,null,null,null,null,null,null,null,0,0,0,0]
[null,null,null,null,null,null,null,null,null,null,null,null,null,null,null,null,null,0,0,0,0]
[null,null,null,null,null,null,null,null,null,null,null,null,null,null,null,null,null,0,0,0,0]
[null,null,null,null,null,null,null,null,null,null,null,null,null,null,null,null,null,0,0,0,0]
[null,null,null,null,null,null,null,null,null,null,null,null,null,null,null,null,null,0,0,0,0]
[null,null,null,null,null,null,null,null,null,null,null,null,null,null,null,null,null,0,0,0,{"$f":"COUNTIF(C94:Q94,\"abs\")","v":0}]
[null,"Totaux",{"$f":"COUNTIF(C5:C94,\"abs\")","v":0},null,null,{"$f":"COUNTIF(F5:F94,\"abs\")","v":0},null,null,{"$f":"COUNTIF(I5:I94,\"abs\")","v":0},null,null,{"$f":"COUNTIF(L5:L94,\"abs\")","v":0},null,null,{"$f":"COUNTIF(O5:O94,\"abs\")","v":0},null,null,{"$f":"SUM(R5:R94)","v":0},{"$f":"SUM(S5:S94)","v":0},{"$f":"SUM(T5:T94)","v":0},{"$f":"SUM(U5:U94)","v":0}]
[null,null,{"$f":"somcoul(C5:C94,\"rouge\")","v":0},{"$f":"COUNTIF(D5:D94,\"g\")","v":0},{"$f":"COUNTIF(E5:E94,\"c\")","v":0},{"$f":"somcoul(F5:F94,\"rouge\")","v":0},{"$f":"COUNTIF(G5:G94,\"g\")","v":0},{"$f":"COUNTIF(H5:H94,\"c\")","v":0},{"$f":"somcoul(I5:I94,\"rouge\")","v":0},{"$f":"COUNTIF(J6:J94,\"g\")","v":0},{"$f":"COUNTIF(K5:K94,\"c\")","v":0},{"$f":"somcoul(L5:L94,\"rouge\")","v":0},{"$f":"COUNTIF(M5:M94,\"g\")","v":0},{"$f":"COUNTIF(N6:N94,\"c\")","v":0},{"$f":"somcoul(O5:O94,\"rouge\")","v":0},{"$f":"COUNTIF(P5:P94,\"g\")","v":0},{"$f":"COUNTIF(Q5:Q94,\"c\")","v":0}]
[null,"6h30/8h00",{"$f":"COUNTIF(C5:C94,\"6h30/8h00\")","v":0},null,null,{"$f":"COUNTIF(F5:F94,\"6h30/8h00\")","v":0},null,null,{"$f":"COUNTIF(I5:I94,\"6h30/8h00\")","v":0},null,null,{"$f":"COUNTIF(L5:L94,\"6h30/8h00\")","v":0},null,null,{"$f":"COUNTIF(O5:O94,\"6h30/8h00\")","v":0},null,null,{"$f":"SUM(C97:Q97)","v":0}]
[null,"7h00/9h00",{"$f":"COUNTIF(C5:C94,\"7h00/9h00\")","v":0},null,null,{"$f":"COUNTIF(F5:F94,\"7h00/9h00\")","v":0},null,null,{"$f":"COUNTIF(I5:I94,\"7h00/9h00\")","v":0},null,null,{"$f":"COUNTIF(L5:L94,\"7h00/9h00\")","v":0},null,null,{"$f":"COUNTIF(O5:O94,\"7h00/9h00\")","v":0},null,null,0]
[null,"8h00/10h00",{"$f":"COUNTIF(C5:C94,\"8h00/10h00\")","v":0},null,null,{"$f":"COUNTIF(F5:F94,\"8h00/10h00\")","v":0},null,null,{"$f":"COUNTIF(I5:I94,\"8h00/10h00\")","v":0},null,null,{"$f":"COUNTIF(L5:L94,\"8h00/10h00\")","v":0},null,null,{"$f":"COUNTIF(O5:O94,\"8h00/10h00\")","v":0},null,null,0]
[null,"9h00/11h00",{"$f":"COUNTIF(C5:C94,\"9h00/11h00\")","v":0},null,null,{"$f":"COUNTIF(F5:F94,\"9h00/11h00\")","v":0},null,null,{"$f":"COUNTIF(I5:I94,\"9h00/11h00\")","v":0},null,null,{"$f":"COUNTIF(L5:L94,\"9h00/11h00\")","v":0},null,null,{"$f":"COUNTIF(O5:O94,\"9h00/11h00\")","v":0},null,null,0]
[null,"10h00/12h00",{"$f":"COUNTIF(C5:C94,\"10h00/12h00\")","v":0},null,null,{"$f":"COUNTIF(F5:F94,\"10h00/12h00\")","v":0},null,null,{"$f":"COUNTIF(I5:I94,\"10h00/12h00\")","v":0},null,null,{"$f":"COUNTIF(L5:L94,\"10h00/12h00\")","v":0},null,null,{"$f":"COUNTIF(O5:O94,\"10h00/12h00\")","v":0},null,null,0]
[null,"11h00/13h00",{"$f":"COUNTIF(C5:C94,\"11h00/13h00\")","v":0},null,null,{"$f":"COUNTIF(F5:F94,\"11h00/13h00\")","v":0},null,null,{"$f":"COUNTIF(I5:I94,\"11h00/13h00\")","v":0},null,null,{"$f":"COUNTIF(L5:L94,\"11h00/13h00\")","v":0},null,null,{"$f":"COUNTIF(O5:O94,\"11h00/13h00\")","v":0},null,null,0]
[null,"13h00/15h00",{"$f":"COUNTIF(C5:C94,\"13h00/15h00\")","v":0},null,null,{"$f":"COUNTIF(F5:F94,\"13h00/15h00\")","v":0},null,null,{"$f":"COUNTIF(I5:I94,\"13h00/15h00\")","v":0},null,null,{"$f":"COUNTIF(L5:L94,\"13h00/15h00\")","v":0},null,null,{"$f":"COUNTIF(O5:O94,\"13h00/15h00\")","v":0},null,null,0]
[null,"13h30/15h30",{"$f":"COUNTIF(C5:C94,\"13h30/15h30\")","v":0},null,null,{"$f":"COUNTIF(F5:F94,\"13h30/15h30\")","v":0},null,null,{"$f":"COUNTIF(I5:I94,\"13h30/15h30\")","v":0},null,null,{"$f":"COUNTIF(L5:L94,\"13h30/15h30\")","v":0},null,null,{"$f":"COUNTIF(O5:O94,\"13h30/15h30\")","v":0},null,null,0]
[null,"15h00/17h00",{"$f":"COUNTIF(C5:C94,\"15h00/17h00\")","v":0},null,null,{"$f":"COUNTIF(F5:F94,\"15h00/17h00\")","v":0},null,null,{"$f":"COUNTIF(I5:I94,\"15h00/17h00\")","v":0},null,null,{"$f":"COUNTIF(L5:L94,\"15h00/17h00\")","v":0},null,null,{"$f":"COUNTIF(O5:O94,\"15h00/17h00\")","v":0},null,null,0]
[null,"16h00/18h00",{"$f":"COUNTIF(C5:C94,\"16h00/18h00\")","v":0},null,null,{"$f":"COUNTIF(F5:F94,\"16h00/18h00\")","v":0},null,null,{"$f":"COUNTIF(I5:I94,\"16h00/18h00\")","v":0},null,null,{"$f":"COUNTIF(L5:L94,\"16h00/18h00\")","v":0},null,null,{"$f":"COUNTIF(O5:O94,\"16h00/18h00\")","v":0},null,null,0]
[null,"17h00/19h00",{"$f":"COUNTIF(C5:C94,\"17h00/19h00\")","v":0},null,null,{"$f":"COUNTIF(F5:F94,\"17h00/19h00\")","v":0},null,null,{"$f":"COUNTIF(I5:I94,\"17h00/19h00\")","v":0},null,null,{"$f":"COUNTIF(L5:L94,\"17h00/19h00\")","v":0},null,null,{"$f":"COUNTIF(O5:O94,\"17h00/19h00\")","v":0},null,null,0]
[null,"18h00/20h00",{"$f":"COUNTIF(C5:C94,\"18h00/20h00\")","v":0},null,null,{"$f":"COUNTIF(F5:F94,\"18h00/20h00\")","v":0},null,null,{"$f":"COUNTIF(I5:I94,\"18h00/20h00\")","v":0},null,null,{"$f":"COUNTIF(L5:L94,\"18h00/20h00\")","v":0},null,null,{"$f":"COUNTIF(O5:O94,\"18h00/20h00\")","v":0},null,null,0]
[null,"19h00/21h00",{"$f":"COUNTIF(C5:C94,\"19h00/21h00\")","v":0},null,null,{"$f":"COUNTIF(F5:F94,\"19h00/21h00\")","v":0},null,null,{"$f":"COUNTIF(I5:I94,\"19h00/21h00\")","v":0},null,null,{"$f":"COUNTIF(L5:L94,\"19h00/21h00\")","v":0},null,null,{"$f":"COUNTIF(O5:O94,\"19h00/21h00\")","v":0},null,null,0]
[null,"21h00/23h00",{"$f":"COUNTIF(C5:C94,\"21h00/23h00\")","v":0},null,null,{"$f":"COUNTIF(F5:F94,\"21h00/23h00\")","v":0},null,null,{"$f":"COUNTIF(I5:I94,\"21h00/23h00\")","v":0},null,null,{"$f":"COUNTIF(L5:L94,\"21h00/23h00\")","v":0},null,null,{"$f":"COUNTIF(O5:O94,\"21h00/23h00\")","v":0},null,null,0]
[null,"22h00/23h00",{"$f":"COUNTIF(C5:C94,\"22h00/23h00\")","v":0},null,null,{"$f":"COUNTIF(F5:F94,\"22h00/23h00\")","v":0},null,null,{"$f":"COUNTIF(I5:I94,\"22h00/23h00\")","v":0},null,null,{"$f":"COUNTIF(L5:L94,\"22h00/23h00\")","v":0},null,null,{"$f":"COUNTIF(O5:O94,\"22h00/23h00\")","v":0},null,null,0]

{"sheet":"B","index":2,"n_rows":111,"n_cols":27,"rows_kept":111,"cut":false,"hidden":false,"merged":[[1,24,1,26],[94,20,95,20],[96,2,96,4],[96,5,96,7],[96,8,96,10],[96,11,96,13],[96,14,96,16],[96,17,96,20],[1,1,1,21],[94,1,95,1],[94,2,94,4],[94,5,94,7],[94,8,94,10],[94,11,94,13],[94,14,94,16],[94,17,95,17],[94,18,95,18],[94,19,95,19],[98,2,98,4],[98,5,98,7],[98,8,98,10],[98,11,98,13],[98,14,98,16],[98,17,98,20],[97,2,97,4],[97,5,97,7],[97,8,97,10],[97,11,97,13],[97,14,97,16],[97,17,97,20],[100,2,100,4],[100,5,100,7],[100,8,100,10],[100,11,100,13],[100,14,100,16],[100,17,100,20],[99,2,99,4],[99,5,99,7],[99,8,99,10],[99,11,99,13],[99,14,99,16],[99,17,99,20],[102,2,102,4],[102,5,102,7],[102,8,102,10],[102,11,102,13],[102,14,102,16],[102,17,102,20],[101,2,101,4],[101,5,101,7],[101,8,101,10],[101,11,101,13],[101,14,101,16],[101,17,101,20],[104,2,104,4],[104,5,104,7],[104,8,104,10],[104,11,104,13],[104,14,104,16],[104,17,104,20],[103,2,103,4],[103,5,103,7],[103,8,103,10],[103,11,103,13],[103,14,103,16],[103,17,103,20],[106,2,106,4],[106,5,106,7],[106,8,106,10],[106,11,106,13],[106,14,106,16],[106,17,106,20],[105,2,105,4],[105,5,105,7],[105,8,105,10],[105,11,105,13],[105,14,105,16],[105,17,105,20],[108,2,108,4],[108,5,108,7],[108,8,108,10],[108,11,108,13],[108,14,108,16],[108,17,108,20],[107,2,107,4],[107,5,107,7],[107,8,107,10],[107,11,107,13],[107,14,107,16],[107,17,107,20],[110,2,110,4],[110,5,110,7],[110,8,110,10],[110,11,110,13],[110,14,110,16],[110,17,110,20],[109,2,109,4],[109,5,109,7],[109,8,109,10],[109,11,109,13],[109,14,109,16],[109,17,109,20]]}
[]
[null,11,null,null,null,null,null,null,null,null,null,null,null,null,null,null,null,null,null,null,null,null,null,null,{"$f":"IF(S95+T95<>R95,\"FAUX\",\"OK\")","v":"OK"}]
[null,null,null,null,null,null,null,null,null,null,null,null,null,null,null,null,null,null,null,null,null,null,null,null,"Total","G","C"]
[null,"Noms",{"$f":"IF(ISNUMBER(B2),7*B2+DATE(Année,1,3)-WEEKDAY(DATE(Année,1,3))-5,\"\")","v":"2016-03-14"},"G","C",{"$f":"C4+1","v":"2016-03-15"},"G","C",{"$f":"F4+1","v":"2016-03-16"},"G","C",{"$f":"I4+1","v":"2016-03-17"},"G","C",{"$f":"L4+1","v":"2016-03-18"},"G","C","Total","G","B","Abs",null,null,null,{"$f":"R95","v":0},{"$f":"S95","v":0},{"$f":"T95","v":0}]
[null,null,null,null,null,null,null,null,null,null,null,null,null,null,null,null,null,{"$f":"somcoul(C5:Q5,\"rouge\")","v":0},{"$f":"COUNTIF(C5:Q5,(\"g\"))","v":0},{"$f":"COUNTIF(C5:Q5,(\"c\"))","v":0},{"$f":"COUNTIF(C5:Q5,\"abs\")","v":0}]
[null,null,null,null,null,null,null,null,null,null,null,null,null,null,null,null,null,{"$f":"somcoul(C6:Q6,\"rouge\")","v":0},{"$f":"COUNTIF(C6:Q6,(\"g\"))","v":0},{"$f":"COUNTIF(C6:Q6,(\"c\"))","v":0},{"$f":"COUNTIF(C6:Q6,\"abs\")","v":0}]
[null,null,null,null,null,null,null,null,null,null,null,null,null,null,null,null,null,0,0,0,0]
[null,null,null,null,null,null,null,null,null,null,null,null,null,null,null,null,null,0,0,0,0]
[null,null,null,null,null,null,null,null,null,null,null,null,null,null,null,null,null,0,0,0,0]
[null,null,null,null,null,null,null,null,null,null,null,null,null,null,null,null,null,0,0,0,0]
[null,null,null,null,null,null,null,null,null,null,null,null,null,null,null,null,null,0,0,0,0]
[null,null,null,null,null,null,null,null,null,null,null,null,null,null,null,null,null,0,0,0,0]
[null,null,null,null,null,null,null,null,null,null,null,null,null,null,null,null,null,0,0,0,0," ",null," ",null,null,"                                    "]
[null,null,null,null,null,null,null,null,null,null,null,null,null,null,null,null,null,0,0,0,0]
[null,null,null,null,null,null,null,null,null,null,null,null,null,null,null,null,null,0,0,0,0]
[null,null,null,null,null,null,null,null,null,null,null,null,null,null,null,null,null,0,0,0,0]
[null,null,null,null,null,null,null,null,null,null,null,null,null,null,null,null,null,0,0,0,0]
[null,null,null,null,null,null,null,null,null,null,null,null,null,null,null,null,null,0,0,0,0]
[null,null,null,null,null,null,null,null,null,null,null,null,null,null,null,null,null,0,0,0,0]
[null,null,null,null,null,null,null,null,null,null,null,null,null,null,null,null,null,0,0,0,0]
[null,null,null,null,null,null,null,null,null,null,null,null,null,null,null,null,null,0,0,0,0]
[null,null,null,null,null,null,null,null,null,null,null,null,null,null,null,null,null,0,0,0,0]
[null,null,null,null,null,null,null,null,null,null,null,null,null,null,null,null,null,0,0,0,0]
[null,null,null,null,null,null,null,null,null,null,null,null,null,null,null,null,null,0,0,0,0]
[null,null,null,null,null,null,null,null,null,null,null,null,null,null,null,null,null,0,0,0,0]
[null,null,null,null,null,null,null,null,null,null,null,null,null,null,null,null,null,0,0,0,0]
[null,null,null,null,null,null,null,null,null,null,null,null,null,null,null,null,null,0,0,0,0]
[null,null,null,null,null,null,null,null,null,null,null,null,null,null,null,null,null,0,0,0,0]
[null,null,null,null,null,null,null,null,null,null,null,null,null,null,null,null,null,0,0,0,0]
[null,null,null,null,null,null,null,null,null,null,null,null,null,null,null,null,null,0,0,0,0]
[null,null,null,null,null,null,null,null,null,null,null,null,null,null,null,null,null,{"$f":"somcoul(C31:Q31,\"rouge\")","v":0},{"$f":"COUNTIF(C31:Q31,(\"g\"))","v":0},{"$f":"COUNTIF(C31:Q31,(\"c\"))","v":0},{"$f":"COUNTIF(C31:Q31,\"abs\")","v":0}]
[null,null,null,null,null,null,null,null,null,null,null,null,null,null,null,null,null,0,0,0,0]
[null,null,null,null,null,null,null,null,null,null,null,null,null,null,null,null,null,0,0,0,0]
[null,null,null,null,null,null,null,null,null,null,null,null,null,null,null,null,null,0,0,0,0]
[null,null,null,null,null,null,null,null,null,null,null,null,null,null,null,null,null,0,0,0,0]
[null,null,null,null,null,null,null,null,null,null,null,null,null,null,null,null,null,0,0,0,0]
[null,null,null,null,null,null,null,null,null,null,null,null,null,null,null,null,null,0,0,0,0]
[null,null,null,null,null,null,null,null,null,null,null,null,null,null,null,null,null,0,0,0,0]
[null,null,null,null,null,null,null,null,null,null,null,null,null,null,null,null,null,0,0,0,0]
[null,null,null,null,null,null,null,null,null,null,null,null,null,null,null,null,null,0,0,0,0]
[null,null,null,null,null,null,null,null,null,null,null,null,null,null,null,null,null,0,0,0,0]
[null,null,null,null,null,null,null,null,null,null,null,null,null,null,null,null,null,0,0,0,0]
[null,null,null,null,null,null,null,null,null,null,null,null,null,null,null,null,null,0,0,0,0]
[null,null,null,null,null,null,null,null,null,null,null,null,null,null,null,null,null,0,0,0,0]
[null,null,null,null,null,null,null,null,null,null,null,null,null,null,null,null,null,0,0,0,0]
[null,null,null,null,null,null,null,null,null,null,null,null,null,null,null,null,null,0,0,0,0]
[null,null,null,null,null,null,null,null,null,null,null,null,null,null,null,null,null,0,0,0,0]
[null,null,null,null,null,null,null,null,null,null,null,null,null,null,null,null,null,0,0,0,0]
[null,null,null,null,null,null,null,null,null,null,null,null,null,null,null,null,null,0,0,0,0]
[null,null,null,null,null,null,null,null,null,null,null,null,null,null,null,null,null,0,0,0,0]
[null,null,null,null,null,null,null,null,null,null,null,null,null,null,null,null,null,0,0,0,0]
[null,null,null,null,null,null,null,null,null,null,null,null,null,null,null,null,null,0,0,0,0]
[null,null,null,null,null,null,null,null,null,null,null,null,null,null,null,null,null,0,0,0,0]
[null,null,null,null,null,null,null,null,null,null,null,null,null,null,null,null,null,0,0,0,0]
[null,null,null,null,null,null,null,null,null,null,null,null,null,null,null,null,null,0,0,0,0]
[null,null,null,null,null,null,null,null,null,null,null,null,null,null,null,null,null,0,0,0,0]
[null,null,null,null,null,null,null,null,null,null,null,null,null,null,null,null,null,0,0,0,0]
[null,null,null,null,null,null,null,null,null,null,null,null,null,null,null,null,null,0,0,0,0]
[null,null,null,null,null,null,null,null,null,null,null,null,null,null,null,null,null,0,0,0,0]
[null,null,null,null,null,null,null,null,null,null,null,null,null,null,null,null,null,0,0,0,0]
[null,null,null,null,null,null,null,null,null,null,null,null,null,null,null,null,null,0,0,0,0]
[null,null,null,null,null,null,null,null,null,null,null,null,null,null,null,null,null,0,0,0,0]
[null,null,null,null,null,null,null,null,null,null,null,null,null,null,null,null,null,0,0,0,0]
[null,null,null,null,null,null,null,null,null,null,null,null,null,null,null,null,null,0,0,0,0]
[null,null,null,null,null,null,null,null,null,null,null,null,null,null,null,null,null,0,0,0,0]
[null,null,null,null,null,null,null,null,null,null,null,null,null,null,null,null,null,0,0,0,0]
[null,null,null,null,null,null,null,null,null,null,null,null,null,null,null,null,null,0,0,0,0]
[null,null,null,null,null,null,null,null,null,null,null,null,null,null,null,null,null,0,0,0,0]
[null,null,null,null,null,null,null,null,null,null,null,null,null,null,null,null,null,0,0,0,0]
[null,null,null,null,null,null,null,null,null,null,null,null,null,null,null,null,null,0,0,0,{"$f":"COUNTIF(C70:Q70,\"abs\")","v":0}]
[null,null,null,null,null,null,null,null,null,null,null,null,null,null,null,null,null,0,0,0,0]
[null,null,null,null,null,null,null,null,null,null,null,null,null,null,null,null,null,0,0,0,0]
[null,null,null,null,null,null,null,null,null,null,null,null,null,null,null,null,null,0,0,0,0]
[null,null,null,null,null,null,null,null,null,null,null,null,null,null,null,null,null,0,0,0,0]
[null,null,null,null,null,null,null,null,null,null,null,null,null,null,null,null,null,0,0,0,0]
[null,null,null,null,null,null,null,null,null,null,null,null,null,null,null,null,null,0,0,0,0]
[null,null,null,null,null,null,null,null,null,null,null,null,null,null,null,null,null,0,0,0,0]
[null,null,null,null,null,null,null,null,null,null,null,null,null,null,null,null,null,0,0,0,0]
[null,null,null,null,null,null,null,null,null,null,null,null,null,null,null,null,null,0,0,0,0]
[null,null,null,null,null,null,null,null,null,null,null,null,null,null,null,null,null,0,0,0,0]
[null,null,null,null,null,null,null,null,null,null,null,null,null,null,null,null,null,0,0,0,0]
[null,null,null,null,null,null,null,null,null,null,null,null,null,null,null,null,null,0,0,0,0]
[null,null,null,null,null,null,null,null,null,null,null,null,null,null,null,null,null,0,0,0,0]
[null,null,null,null,null,null,null,null,null,null,null,null,null,null,null,null,null,0,0,0,0]
[null,null,null,null,null,null,null,null,null,null,null,null,null,null,null,null,null,0,0,0,0]
[null,null,null,null,null,null,null,null,null,null,null,null,null,null,null,null,null,0,0,0,0]
[null,null,null,null,null,null,null,null,null,null,null,null,null,null,null,null,null,0,0,0,0]
[null,null,null,null,null,null,null,null,null,null,null,null,null,null,null,null,null,0,0,0,0]
[null,null,null,null,null,null,null,null,null,null,null,null,null,null,null,null,null,0,0,0,0]
[null,null,null,null,null,null,null,null,null,null,null,null,null,null,null,null,null,0,0,0,0]
[null,null,null,null,null,null,null,null,null,null,null,null,null,null,null,null,null,0,0,0,0]
[null,null,null,null,null,null,null,null,null,null,null,null,null,null,null,null,null,0,0,0,0]
[null,null,null,null,null,null,null,null,null,null,null,null,null,null,null,null,null,0,0,0,0]
[null,null,null,null,null,null,null,null,null,null,null,null,null,null,null,null,null,0,0,0,{"$f":"COUNTIF(C94:Q94,\"abs\")","v":0}]
[null,"Totaux",{"$f":"COUNTIF(C5:C94,\"abs\")","v":0},null,null,{"$f":"COUNTIF(F5:F94,\"abs\")","v":0},null,null,{"$f":"COUNTIF(I5:I94,\"abs\")","v":0},null,null,{"$f":"COUNTIF(L5:L94,\"abs\")","v":0},null,null,{"$f":"COUNTIF(O5:O94,\"abs\")","v":0},null,null,{"$f":"SUM(R5:R94)","v":0},{"$f":"SUM(S5:S94)","v":0},{"$f":"SUM(T5:T94)","v":0},{"$f":"SUM(U5:U94)","v":0}]
[null,null,{"$f":"somcoul(C5:C94,\"rouge\")","v":0},{"$f":"COUNTIF(D5:D94,\"g\")","v":0},{"$f":"COUNTIF(E5:E94,\"c\")","v":0},{"$f":"somcoul(F5:F94,\"rouge\")","v":0},{"$f":"COUNTIF(G5:G94,\"g\")","v":0},{"$f":"COUNTIF(H5:H94,\"c\")","v":0},{"$f":"somcoul(I5:I94,\"rouge\")","v":0},{"$f":"COUNTIF(J6:J94,\"g\")","v":0},{"$f":"COUNTIF(K5:K94,\"c\")","v":0},{"$f":"somcoul(L5:L94,\"rouge\")","v":0},{"$f":"COUNTIF(M5:M94,\"g\")","v":0},{"$f":"COUNTIF(N6:N94,\"c\")","v":0},{"$f":"somcoul(O5:O94,\"rouge\")","v":0},{"$f":"COUNTIF(P5:P94,\"g\")","v":0},{"$f":"COUNTIF(Q5:Q94,\"c\")","v":0}]
[null,"6h30/8h00",{"$f":"COUNTIF(C5:C94,\"6h30/8h00\")","v":0},null,null,{"$f":"COUNTIF(F5:F94,\"6h30/8h00\")","v":0},null,null,{"$f":"COUNTIF(I5:I94,\"6h30/8h00\")","v":0},null,null,{"$f":"COUNTIF(L5:L94,\"6h30/8h00\")","v":0},null,null,{"$f":"COUNTIF(O5:O94,\"6h30/8h00\")","v":0},null,null,{"$f":"SUM(C97:Q97)","v":0}]
[null,"7h00/9h00",{"$f":"COUNTIF(C5:C94,\"7h00/9h00\")","v":0},null,null,{"$f":"COUNTIF(F5:F94,\"7h00/9h00\")","v":0},null,null,{"$f":"COUNTIF(I5:I94,\"7h00/9h00\")","v":0},null,null,{"$f":"COUNTIF(L5:L94,\"7h00/9h00\")","v":0},null,null,{"$f":"COUNTIF(O5:O94,\"7h00/9h00\")","v":0},null,null,0]
[null,"8h00/10h00",{"$f":"COUNTIF(C5:C94,\"8h00/10h00\")","v":0},null,null,{"$f":"COUNTIF(F5:F94,\"8h00/10h00\")","v":0},null,null,{"$f":"COUNTIF(I5:I94,\"8h00/10h00\")","v":0},null,null,{"$f":"COUNTIF(L5:L94,\"8h00/10h00\")","v":0},null,null,{"$f":"COUNTIF(O5:O94,\"8h00/10h00\")","v":0},null,null,0]
[null,"9h00/11h00",{"$f":"COUNTIF(C5:C94,\"9h00/11h00\")","v":0},null,null,{"$f":"COUNTIF(F5:F94,\"9h00/11h00\")","v":0},null,null,{"$f":"COUNTIF(I5:I94,\"9h00/11h00\")","v":0},null,null,{"$f":"COUNTIF(L5:L94,\"9h00/11h00\")","v":0},null,null,{"$f":"COUNTIF(O5:O94,\"9h00/11h00\")","v":0},null,null,0]
[null,"10h00/12h00",{"$f":"COUNTIF(C5:C94,\"10h00/12h00\")","v":0},null,null,{"$f":"COUNTIF(F5:F94,\"10h00/12h00\")","v":0},null,null,{"$f":"COUNTIF(I5:I94,\"10h00/12h00\")","v":0},null,null,{"$f":"COUNTIF(L5:L94,\"10h00/12h00\")","v":0},null,null,{"$f":"COUNTIF(O5:O94,\"10h00/12h00\")","v":0},null,null,0]
[null,"11h00/13h00",{"$f":"COUNTIF(C5:C94,\"11h00/13h00\")","v":0},null,null,{"$f":"COUNTIF(F5:F94,\"11h00/13h00\")","v":0},null,null,{"$f":"COUNTIF(I5:I94,\"11h00/13h00\")","v":0},null,null,{"$f":"COUNTIF(L5:L94,\"11h00/13h00\")","v":0},null,null,{"$f":"COUNTIF(O5:O94,\"11h00/13h00\")","v":0},null,null,0]
[null,"13h00/15h00",{"$f":"COUNTIF(C5:C94,\"13h00/15h00\")","v":0},null,null,{"$f":"COUNTIF(F5:F94,\"13h00/15h00\")","v":0},null,null,{"$f":"COUNTIF(I5:I94,\"13h00/15h00\")","v":0},null,null,{"$f":"COUNTIF(L5:L94,\"13h00/15h00\")","v":0},null,null,{"$f":"COUNTIF(O5:O94,\"13h00/15h00\")","v":0},null,null,0]
[null,"13h30/15h30",{"$f":"COUNTIF(C5:C94,\"13h30/15h30\")","v":0},null,null,{"$f":"COUNTIF(F5:F94,\"13h30/15h30\")","v":0},null,null,{"$f":"COUNTIF(I5:I94,\"13h30/15h30\")","v":0},null,null,{"$f":"COUNTIF(L5:L94,\"13h30/15h30\")","v":0},null,null,{"$f":"COUNTIF(O5:O94,\"13h30/15h30\")","v":0},null,null,0]
[null,"15h00/17h00",{"$f":"COUNTIF(C5:C94,\"15h00/17h00\")","v":0},null,null,{"$f":"COUNTIF(F5:F94,\"15h00/17h00\")","v":0},null,null,{"$f":"COUNTIF(I5:I94,\"15h00/17h00\")","v":0},null,null,{"$f":"COUNTIF(L5:L94,\"15h00/17h00\")","v":0},null,null,{"$f":"COUNTIF(O5:O94,\"15h00/17h00\")","v":0},null,null,0]
[null,"16h00/18h00",{"$f":"COUNTIF(C5:C94,\"16h00/18h00\")","v":0},null,null,{"$f":"COUNTIF(F5:F94,\"16h00/18h00\")","v":0},null,null,{"$f":"COUNTIF(I5:I94,\"16h00/18h00\")","v":0},null,null,{"$f":"COUNTIF(L5:L94,\"16h00/18h00\")","v":0},null,null,{"$f":"COUNTIF(O5:O94,\"16h00/18h00\")","v":0},null,null,0]
[null,"17h00/19h00",{"$f":"COUNTIF(C5:C94,\"17h00/19h00\")","v":0},null,null,{"$f":"COUNTIF(F5:F94,\"17h00/19h00\")","v":0},null,null,{"$f":"COUNTIF(I5:I94,\"17h00/19h00\")","v":0},null,null,{"$f":"COUNTIF(L5:L94,\"17h00/19h00\")","v":0},null,null,{"$f":"COUNTIF(O5:O94,\"17h00/19h00\")","v":0},null,null,0]
[null,"18h00/20h00",{"$f":"COUNTIF(C5:C94,\"18h00/20h00\")","v":0},null,null,{"$f":"COUNTIF(F5:F94,\"18h00/20h00\")","v":0},null,null,{"$f":"COUNTIF(I5:I94,\"18h00/20h00\")","v":0},null,null,{"$f":"COUNTIF(L5:L94,\"18h00/20h00\")","v":0},null,null,{"$f":"COUNTIF(O5:O94,\"18h00/20h00\")","v":0},null,null,0]
[null,"19h00/21h00",{"$f":"COUNTIF(C5:C94,\"19h00/21h00\")","v":0},null,null,{"$f":"COUNTIF(F5:F94,\"19h00/21h00\")","v":0},null,null,{"$f":"COUNTIF(I5:I94,\"19h00/21h00\")","v":0},null,null,{"$f":"COUNTIF(L5:L94,\"19h00/21h00\")","v":0},null,null,{"$f":"COUNTIF(O5:O94,\"19h00/21h00\")","v":0},null,null,0]
[null,"21h00/23h00",{"$f":"COUNTIF(C5:C94,\"21h00/23h00\")","v":0},null,null,{"$f":"COUNTIF(F5:F94,\"21h00/23h00\")","v":0},null,null,{"$f":"COUNTIF(I5:I94,\"21h00/23h00\")","v":0},null,null,{"$f":"COUNTIF(L5:L94,\"21h00/23h00\")","v":0},null,null,{"$f":"COUNTIF(O5:O94,\"21h00/23h00\")","v":0},null,null,0]
[null,"22h00/23h00",{"$f":"COUNTIF(C5:C94,\"22h00/23h00\")","v":0},null,null,{"$f":"COUNTIF(F5:F94,\"22h00/23h00\")","v":0},null,null,{"$f":"COUNTIF(I5:I94,\"22h00/23h00\")","v":0},null,null,{"$f":"COUNTIF(L5:L94,\"22h00/23h00\")","v":0},null,null,{"$f":"COUNTIF(O5:O94,\"22h00/23h00\")","v":0},null,null,0]

{"sheet":"C","index":3,"n_rows":111,"n_cols":27,"rows_kept":111,"cut":false,"hidden":false,"merged":[[1,24,1,26],[94,20,95,20],[96,2,96,4],[96,5,96,7],[96,8,96,10],[96,11,96,13],[96,14,96,16],[96,17,96,20],[1,1,1,21],[94,1,95,1],[94,2,94,4],[94,5,94,7],[94,8,94,10],[94,11,94,13],[94,14,94,16],[94,17,95,17],[94,18,95,18],[94,19,95,19],[98,2,98,4],[98,5,98,7],[98,8,98,10],[98,11,98,13],[98,14,98,16],[98,17,98,20],[97,2,97,4],[97,5,97,7],[97,8,97,10],[97,11,97,13],[97,14,97,16],[97,17,97,20],[100,2,100,4],[100,5,100,7],[100,8,100,10],[100,11,100,13],[100,14,100,16],[100,17,100,20],[99,2,99,4],[99,5,99,7],[99,8,99,10],[99,11,99,13],[99,14,99,16],[99,17,99,20],[102,2,102,4],[102,5,102,7],[102,8,102,10],[102,11,102,13],[102,14,102,16],[102,17,102,20],[101,2,101,4],[101,5,101,7],[101,8,101,10],[101,11,101,13],[101,14,101,16],[101,17,101,20],[104,2,104,4],[104,5,104,7],[104,8,104,10],[104,11,104,13],[104,14,104,16],[104,17,104,20],[103,2,103,4],[103,5,103,7],[103,8,103,10],[103,11,103,13],[103,14,103,16],[103,17,103,20],[106,2,106,4],[106,5,106,7],[106,8,106,10],[106,11,106,13],[106,14,106,16],[106,17,106,20],[105,2,105,4],[105,5,105,7],[105,8,105,10],[105,11,105,13],[105,14,105,16],[105,17,105,20],[108,2,108,4],[108,5,108,7],[108,8,108,10],[108,11,108,13],[108,14,108,16],[108,17,108,20],[107,2,107,4],[107,5,107,7],[107,8,107,10],[107,11,107,13],[107,14,107,16],[107,17,107,20],[110,2,110,4],[110,5,110,7],[110,8,110,10],[110,11,110,13],[110,14,110,16],[110,17,110,20],[109,2,109,4],[109,5,109,7],[109,8,109,10],[109,11,109,13],[109,14,109,16],[109,17,109,20]]}
[]
[null,11,null,null,null,null,null,null,null,null,null,null,null,null,null,null,null,null,null,null,null,null,null,null,{"$f":"IF(S95+T95<>R95,\"FAUX\",\"OK\")","v":"OK"}]
[null,null,null,null,null,null,null,null,null,null,null,null,null,null,null,null,null,null,null,null,null,null,null,null,"Total","G","C"]
[null,"Noms",{"$f":"IF(ISNUMBER(B2),7*B2+DATE(Année,1,3)-WEEKDAY(DATE(Année,1,3))-5,\"\")","v":"2016-03-14"},"G","C",{"$f":"C4+1","v":"2016-03-15"},"G","C",{"$f":"F4+1","v":"2016-03-16"},"G","C",{"$f":"I4+1","v":"2016-03-17"},"G","C",{"$f":"L4+1","v":"2016-03-18"},"G","C","Total","G","B","Abs",null,null,null,{"$f":"R95","v":0},{"$f":"S95","v":0},{"$f":"T95","v":0}]
[null,null,null,null,null,null,null,null,null,null,null,null,null,null,null,null,null,{"$f":"somcoul(C5:Q5,\"rouge\")","v":0},{"$f":"COUNTIF(C5:Q5,(\"g\"))","v":0},{"$f":"COUNTIF(C5:Q5,(\"c\"))","v":0},{"$f":"COUNTIF(C5:Q5,\"abs\")","v":0}]
[null,null,null,null,null,null,null,null,null,null,null,null,null,null,null,null,null,{"$f":"somcoul(C6:Q6,\"rouge\")","v":0},{"$f":"COUNTIF(C6:Q6,(\"g\"))","v":0},{"$f":"COUNTIF(C6:Q6,(\"c\"))","v":0},{"$f":"COUNTIF(C6:Q6,\"abs\")","v":0}]
[null,null,null,null,null,null,null,null,null,null,null,null,null,null,null,null,null,0,0,0,0]
[null,null,null,null,null,null,null,null,null,null,null,null,null,null,null,null,null,0,0,0,0]
[null,null,null,null,null,null,null,null,null,null,null,null,null,null,null,null,null,0,0,0,0]
[null,null,null,null,null,null,null,null,null,null,null,null,null,null,null,null,null,0,0,0,0]
[null,null,null,null,null,null,null,null,null,null,null,null,null,null,null,null,null,0,0,0,0]
[null,null,null,null,null,null,null,null,null,null,null,null,null,null,null,null,null,0,0,0,0]
[null,null,null,null,null,null,null,null,null,null,null,null,null,null,null,null,null,0,0,0,0," ",null," ",null,null,"                                    "]
[null,null,null,null,null,null,null,null,null,null,null,null,null,null,null,null,null,0,0,0,0]
[null,null,null,null,null,null,null,null,null,null,null,null,null,null,null,null,null,0,0,0,0]
[null,null,null,null,null,null,null,null,null,null,null,null,null,null,null,null,null,0,0,0,0]
[null,null,null,null,null,null,null,null,null,null,null,null,null,null,null,null,null,0,0,0,0]
[null,null,null,null,null,null,null,null,null,null,null,null,null,null,null,null,null,0,0,0,0]
[null,null,null,null,null,null,null,null,null,null,null,null,null,null,null,null,null,0,0,0,0]
[null,null,null,null,null,null,null,null,null,null,null,null,null,null,null,null,null,0,0,0,0]
[null,null,null,null,null,null,null,null,null,null,null,null,null,null,null,null,null,0,0,0,0]
[null,null,null,null,null,null,null,null,null,null,null,null,null,null,null,null,null,0,0,0,0]
[null,null,null,null,null,null,null,null,null,null,null,null,null,null,null,null,null,0,0,0,0]
[null,null,null,null,null,null,null,null,null,null,null,null,null,null,null,null,null,0,0,0,0]
[null,null,null,null,null,null,null,null,null,null,null,null,null,null,null,null,null,0,0,0,0]
[null,null,null,null,null,null,null,null,null,null,null,null,null,null,null,null,null,0,0,0,0]
[null,null,null,null,null,null,null,null,null,null,null,null,null,null,null,null,null,0,0,0,0]
[null,null,null,null,null,null,null,null,null,null,null,null,null,null,null,null,null,0,0,0,0]
[null,null,null,null,null,null,null,null,null,null,null,null,null,null,null,null,null,0,0,0,0]
[null,null,null,null,null,null,null,null,null,null,null,null,null,null,null,null,null,0,0,0,0]
[null,null,null,null,null,null,null,null,null,null,null,null,null,null,null,null,null,{"$f":"somcoul(C31:Q31,\"rouge\")","v":0},{"$f":"COUNTIF(C31:Q31,(\"g\"))","v":0},{"$f":"COUNTIF(C31:Q31,(\"c\"))","v":0},{"$f":"COUNTIF(C31:Q31,\"abs\")","v":0}]
[null,null,null,null,null,null,null,null,null,null,null,null,null,null,null,null,null,0,0,0,0]
[null,null,null,null,null,null,null,null,null,null,null,null,null,null,null,null,null,0,0,0,0]
[null,null,null,null,null,null,null,null,null,null,null,null,null,null,null,null,null,0,0,0,0]
[null,null,null,null,null,null,null,null,null,null,null,null,null,null,null,null,null,0,0,0,0]
[null,null,null,null,null,null,null,null,null,null,null,null,null,null,null,null,null,0,0,0,0]
[null,null,null,null,null,null,null,null,null,null,null,null,null,null,null,null,null,0,0,0,0]
[null,null,null,null,null,null,null,null,null,null,null,null,null,null,null,null,null,0,0,0,0]
[null,null,null,null,null,null,null,null,null,null,null,null,null,null,null,null,null,0,0,0,0]
[null,null,null,null,null,null,null,null,null,null,null,null,null,null,null,null,null,0,0,0,0]
[null,null,null,null,null,null,null,null,null,null,null,null,null,null,null,null,null,0,0,0,0]
[null,null,null,null,null,null,null,null,null,null,null,null,null,null,null,null,null,0,0,0,0]
[null,null,null,null,null,null,null,null,null,null,null,null,null,null,null,null,null,0,0,0,0]
[null,null,null,null,null,null,null,null,null,null,null,null,null,null,null,null,null,0,0,0,0]
[null,null,null,null,null,null,null,null,null,null,null,null,null,null,null,null,null,0,0,0,0]
[null,null,null,null,null,null,null,null,null,null,null,null,null,null,null,null,null,0,0,0,0]
[null,null,null,null,null,null,null,null,null,null,null,null,null,null,null,null,null,0,0,0,0]
[null,null,null,null,null,null,null,null,null,null,null,null,null,null,null,null,null,0,0,0,0]
[null,null,null,null,null,null,null,null,null,null,null,null,null,null,null,null,null,0,0,0,0]
[null,null,null,null,null,null,null,null,null,null,null,null,null,null,null,null,null,0,0,0,0]
[null,null,null,null,null,null,null,null,null,null,null,null,null,null,null,null,null,0,0,0,0]
[null,null,null,null,null,null,null,null,null,null,null,null,null,null,null,null,null,0,0,0,0]
[null,null,null,null,null,null,null,null,null,null,null,null,null,null,null,null,null,0,0,0,0]
[null,null,null,null,null,null,null,null,null,null,null,null,null,null,null,null,null,0,0,0,0]
[null,null,null,null,null,null,null,null,null,null,null,null,null,null,null,null,null,0,0,0,0]
[null,null,null,null,null,null,null,null,null,null,null,null,null,null,null,null,null,0,0,0,0]
[null,null,null,null,null,null,null,null,null,null,null,null,null,null,null,null,null,0,0,0,0]
[null,null,null,null,null,null,null,null,null,null,null,null,null,null,null,null,null,0,0,0,0]
[null,null,null,null,null,null,null,null,null,null,null,null,null,null,null,null,null,0,0,0,0]
[null,null,null,null,null,null,null,null,null,null,null,null,null,null,null,null,null,0,0,0,0]
[null,null,null,null,null,null,null,null,null,null,null,null,null,null,null,null,null,0,0,0,0]
[null,null,null,null,null,null,null,null,null,null,null,null,null,null,null,null,null,0,0,0,0]
[null,null,null,null,null,null,null,null,null,null,null,null,null,null,null,null,null,0,0,0,0]
[null,null,null,null,null,null,null,null,null,null,null,null,null,null,null,null,null,0,0,0,0]
[null,null,null,null,null,null,null,null,null,null,null,null,null,null,null,null,null,0,0,0,0]
[null,null,null,null,null,null,null,null,null,null,null,null,null,null,null,null,null,0,0,0,0]
[null,null,null,null,null,null,null,null,null,null,null,null,null,null,null,null,null,0,0,0,0]
[null,null,null,null,null,null,null,null,null,null,null,null,null,null,null,null,null,0,0,0,0]
[null,null,null,null,null,null,null,null,null,null,null,null,null,null,null,null,null,0,0,0,0]
[null,null,null,null,null,null,null,null,null,null,null,null,null,null,null,null,null,0,0,0,{"$f":"COUNTIF(C70:Q70,\"abs\")","v":0}]
[null,null,null,null,null,null,null,null,null,null,null,null,null,null,null,null,null,0,0,0,0]
[null,null,null,null,null,null,null,null,null,null,null,null,null,null,null,null,null,0,0,0,0]
[null,null,null,null,null,null,null,null,null,null,null,null,null,null,null,null,null,0,0,0,0]
[null,null,null,null,null,null,null,null,null,null,null,null,null,null,null,null,null,0,0,0,0]
[null,null,null,null,null,null,null,null,null,null,null,null,null,null,null,null,null,0,0,0,0]
[null,null,null,null,null,null,null,null,null,null,null,null,null,null,null,null,null,0,0,0,0]
[null,null,null,null,null,null,null,null,null,null,null,null,null,null,null,null,null,0,0,0,0]
[null,null,null,null,null,null,null,null,null,null,null,null,null,null,null,null,null,0,0,0,0]
[null,null,null,null,null,null,null,null,null,null,null,null,null,null,null,null,null,0,0,0,0]
[null,null,null,null,null,null,null,null,null,null,null,null,null,null,null,null,null,0,0,0,0]
[null,null,null,null,null,null,null,null,null,null,null,null,null,null,null,null,null,0,0,0,0]
[null,null,null,null,null,null,null,null,null,null,null,null,null,null,null,null,null,0,0,0,0]
[null,null,null,null,null,null,null,null,null,null,null,null,null,null,null,null,null,0,0,0,0]
[null,null,null,null,null,null,null,null,null,null,null,null,null,null,null,null,null,0,0,0,0]
[null,null,null,null,null,null,null,null,null,null,null,null,null,null,null,null,null,0,0,0,0]
[null,null,null,null,null,null,null,null,null,null,null,null,null,null,null,null,null,0,0,0,0]
[null,null,null,null,null,null,null,null,null,null,null,null,null,null,null,null,null,0,0,0,0]
[null,null,null,null,null,null,null,null,null,null,null,null,null,null,null,null,null,0,0,0,0]
[null,null,null,null,null,null,null,null,null,null,null,null,null,null,null,null,null,0,0,0,0]
[null,null,null,null,null,null,null,null,null,null,null,null,null,null,null,null,null,0,0,0,0]
[null,null,null,null,null,null,null,null,null,null,null,null,null,null,null,null,null,0,0,0,0]
[null,null,null,null,null,null,null,null,null,null,null,null,null,null,null,null,null,0,0,0,0]
[null,null,null,null,null,null,null,null,null,null,null,null,null,null,null,null,null,0,0,0,0]
[null,null,null,null,null,null,null,null,null,null,null,null,null,null,null,null,null,0,0,0,{"$f":"COUNTIF(C94:Q94,\"abs\")","v":0}]
[null,"Totaux",{"$f":"COUNTIF(C5:C94,\"abs\")","v":0},null,null,{"$f":"COUNTIF(F5:F94,\"abs\")","v":0},null,null,{"$f":"COUNTIF(I5:I94,\"abs\")","v":0},null,null,{"$f":"COUNTIF(L5:L94,\"abs\")","v":0},null,null,{"$f":"COUNTIF(O5:O94,\"abs\")","v":0},null,null,{"$f":"SUM(R5:R94)","v":0},{"$f":"SUM(S5:S94)","v":0},{"$f":"SUM(T5:T94)","v":0},{"$f":"SUM(U5:U94)","v":0}]
[null,null,{"$f":"somcoul(C5:C94,\"rouge\")","v":0},{"$f":"COUNTIF(D5:D94,\"g\")","v":0},{"$f":"COUNTIF(E5:E94,\"c\")","v":0},{"$f":"somcoul(F5:F94,\"rouge\")","v":0},{"$f":"COUNTIF(G5:G94,\"g\")","v":0},{"$f":"COUNTIF(H5:H94,\"c\")","v":0},{"$f":"somcoul(I5:I94,\"rouge\")","v":0},{"$f":"COUNTIF(J6:J94,\"g\")","v":0},{"$f":"COUNTIF(K5:K94,\"c\")","v":0},{"$f":"somcoul(L5:L94,\"rouge\")","v":0},{"$f":"COUNTIF(M5:M94,\"g\")","v":0},{"$f":"COUNTIF(N6:N94,\"c\")","v":0},{"$f":"somcoul(O5:O94,\"rouge\")","v":0},{"$f":"COUNTIF(P5:P94,\"g\")","v":0},{"$f":"COUNTIF(Q5:Q94,\"c\")","v":0}]
[null,"6h30/8h00",{"$f":"COUNTIF(C5:C94,\"6h30/8h00\")","v":0},null,null,{"$f":"COUNTIF(F5:F94,\"6h30/8h00\")","v":0},null,null,{"$f":"COUNTIF(I5:I94,\"6h30/8h00\")","v":0},null,null,{"$f":"COUNTIF(L5:L94,\"6h30/8h00\")","v":0},null,null,{"$f":"COUNTIF(O5:O94,\"6h30/8h00\")","v":0},null,null,{"$f":"SUM(C97:Q97)","v":0}]
[null,"7h00/9h00",{"$f":"COUNTIF(C5:C94,\"7h00/9h00\")","v":0},null,null,{"$f":"COUNTIF(F5:F94,\"7h00/9h00\")","v":0},null,null,{"$f":"COUNTIF(I5:I94,\"7h00/9h00\")","v":0},null,null,{"$f":"COUNTIF(L5:L94,\"7h00/9h00\")","v":0},null,null,{"$f":"COUNTIF(O5:O94,\"7h00/9h00\")","v":0},null,null,0]
[null,"8h00/10h00",{"$f":"COUNTIF(C5:C94,\"8h00/10h00\")","v":0},null,null,{"$f":"COUNTIF(F5:F94,\"8h00/10h00\")","v":0},null,null,{"$f":"COUNTIF(I5:I94,\"8h00/10h00\")","v":0},null,null,{"$f":"COUNTIF(L5:L94,\"8h00/10h00\")","v":0},null,null,{"$f":"COUNTIF(O5:O94,\"8h00/10h00\")","v":0},null,null,0]
[null,"9h00/11h00",{"$f":"COUNTIF(C5:C94,\"9h00/11h00\")","v":0},null,null,{"$f":"COUNTIF(F5:F94,\"9h00/11h00\")","v":0},null,null,{"$f":"COUNTIF(I5:I94,\"9h00/11h00\")","v":0},null,null,{"$f":"COUNTIF(L5:L94,\"9h00/11h00\")","v":0},null,null,{"$f":"COUNTIF(O5:O94,\"9h00/11h00\")","v":0},null,null,0]
[null,"10h00/12h00",{"$f":"COUNTIF(C5:C94,\"10h00/12h00\")","v":0},null,null,{"$f":"COUNTIF(F5:F94,\"10h00/12h00\")","v":0},null,null,{"$f":"COUNTIF(I5:I94,\"10h00/12h00\")","v":0},null,null,{"$f":"COUNTIF(L5:L94,\"10h00/12h00\")","v":0},null,null,{"$f":"COUNTIF(O5:O94,\"10h00/12h00\")","v":0},null,null,0]
[null,"11h00/13h00",{"$f":"COUNTIF(C5:C94,\"11h00/13h00\")","v":0},null,null,{"$f":"COUNTIF(F5:F94,\"11h00/13h00\")","v":0},null,null,{"$f":"COUNTIF(I5:I94,\"11h00/13h00\")","v":0},null,null,{"$f":"COUNTIF(L5:L94,\"11h00/13h00\")","v":0},null,null,{"$f":"COUNTIF(O5:O94,\"11h00/13h00\")","v":0},null,null,0]
[null,"13h00/15h00",{"$f":"COUNTIF(C5:C94,\"13h00/15h00\")","v":0},null,null,{"$f":"COUNTIF(F5:F94,\"13h00/15h00\")","v":0},null,null,{"$f":"COUNTIF(I5:I94,\"13h00/15h00\")","v":0},null,null,{"$f":"COUNTIF(L5:L94,\"13h00/15h00\")","v":0},null,null,{"$f":"COUNTIF(O5:O94,\"13h00/15h00\")","v":0},null,null,0]
[null,"13h30/15h30",{"$f":"COUNTIF(C5:C94,\"13h30/15h30\")","v":0},null,null,{"$f":"COUNTIF(F5:F94,\"13h30/15h30\")","v":0},null,null,{"$f":"COUNTIF(I5:I94,\"13h30/15h30\")","v":0},null,null,{"$f":"COUNTIF(L5:L94,\"13h30/15h30\")","v":0},null,null,{"$f":"COUNTIF(O5:O94,\"13h30/15h30\")","v":0},null,null,0]
[null,"15h00/17h00",{"$f":"COUNTIF(C5:C94,\"15h00/17h00\")","v":0},null,null,{"$f":"COUNTIF(F5:F94,\"15h00/17h00\")","v":0},null,null,{"$f":"COUNTIF(I5:I94,\"15h00/17h00\")","v":0},null,null,{"$f":"COUNTIF(L5:L94,\"15h00/17h00\")","v":0},null,null,{"$f":"COUNTIF(O5:O94,\"15h00/17h00\")","v":0},null,null,0]
[null,"16h00/18h00",{"$f":"COUNTIF(C5:C94,\"16h00/18h00\")","v":0},null,null,{"$f":"COUNTIF(F5:F94,\"16h00/18h00\")","v":0},null,null,{"$f":"COUNTIF(I5:I94,\"16h00/18h00\")","v":0},null,null,{"$f":"COUNTIF(L5:L94,\"16h00/18h00\")","v":0},null,null,{"$f":"COUNTIF(O5:O94,\"16h00/18h00\")","v":0},null,null,0]
[null,"17h00/19h00",{"$f":"COUNTIF(C5:C94,\"17h00/19h00\")","v":0},null,null,{"$f":"COUNTIF(F5:F94,\"17h00/19h00\")","v":0},null,null,{"$f":"COUNTIF(I5:I94,\"17h00/19h00\")","v":0},null,null,{"$f":"COUNTIF(L5:L94,\"17h00/19h00\")","v":0},null,null,{"$f":"COUNTIF(O5:O94,\"17h00/19h00\")","v":0},null,null,0]
[null,"18h00/20h00",{"$f":"COUNTIF(C5:C94,\"18h00/20h00\")","v":0},null,null,{"$f":"COUNTIF(F5:F94,\"18h00/20h00\")","v":0},null,null,{"$f":"COUNTIF(I5:I94,\"18h00/20h00\")","v":0},null,null,{"$f":"COUNTIF(L5:L94,\"18h00/20h00\")","v":0},null,null,{"$f":"COUNTIF(O5:O94,\"18h00/20h00\")","v":0},null,null,0]
[null,"19h00/21h00",{"$f":"COUNTIF(C5:C94,\"19h00/21h00\")","v":0},null,null,{"$f":"COUNTIF(F5:F94,\"19h00/21h00\")","v":0},null,null,{"$f":"COUNTIF(I5:I94,\"19h00/21h00\")","v":0},null,null,{"$f":"COUNTIF(L5:L94,\"19h00/21h00\")","v":0},null,null,{"$f":"COUNTIF(O5:O94,\"19h00/21h00\")","v":0},null,null,0]
[null,"21h00/23h00",{"$f":"COUNTIF(C5:C94,\"21h00/23h00\")","v":0},null,null,{"$f":"COUNTIF(F5:F94,\"21h00/23h00\")","v":0},null,null,{"$f":"COUNTIF(I5:I94,\"21h00/23h00\")","v":0},null,null,{"$f":"COUNTIF(L5:L94,\"21h00/23h00\")","v":0},null,null,{"$f":"COUNTIF(O5:O94,\"21h00/23h00\")","v":0},null,null,0]
[null,"22h00/23h00",{"$f":"COUNTIF(C5:C94,\"22h00/23h00\")","v":0},null,null,{"$f":"COUNTIF(F5:F94,\"22h00/23h00\")","v":0},null,null,{"$f":"COUNTIF(I5:I94,\"22h00/23h00\")","v":0},null,null,{"$f":"COUNTIF(L5:L94,\"22h00/23h00\")","v":0},null,null,{"$f":"COUNTIF(O5:O94,\"22h00/23h00\")","v":0},null,null,0]

{"sheet":"D","index":4,"n_rows":111,"n_cols":27,"rows_kept":111,"cut":false,"hidden":false,"merged":[[1,24,1,26],[94,20,95,20],[96,2,96,4],[96,5,96,7],[96,8,96,10],[96,11,96,13],[96,14,96,16],[96,17,96,20],[1,1,1,21],[94,1,95,1],[94,2,94,4],[94,5,94,7],[94,8,94,10],[94,11,94,13],[94,14,94,16],[94,17,95,17],[94,18,95,18],[94,19,95,19],[98,2,98,4],[98,5,98,7],[98,8,98,10],[98,11,98,13],[98,14,98,16],[98,17,98,20],[97,2,97,4],[97,5,97,7],[97,8,97,10],[97,11,97,13],[97,14,97,16],[97,17,97,20],[100,2,100,4],[100,5,100,7],[100,8,100,10],[100,11,100,13],[100,14,100,16],[100,17,100,20],[99,2,99,4],[99,5,99,7],[99,8,99,10],[99,11,99,13],[99,14,99,16],[99,17,99,20],[102,2,102,4],[102,5,102,7],[102,8,102,10],[102,11,102,13],[102,14,102,16],[102,17,102,20],[101,2,101,4],[101,5,101,7],[101,8,101,10],[101,11,101,13],[101,14,101,16],[101,17,101,20],[104,2,104,4],[104,5,104,7],[104,8,104,10],[104,11,104,13],[104,14,104,16],[104,17,104,20],[103,2,103,4],[103,5,103,7],[103,8,103,10],[103,11,103,13],[103,14,103,16],[103,17,103,20],[106,2,106,4],[106,5,106,7],[106,8,106,10],[106,11,106,13],[106,14,106,16],[106,17,106,20],[105,2,105,4],[105,5,105,7],[105,8,105,10],[105,11,105,13],[105,14,105,16],[105,17,105,20],[108,2,108,4],[108,5,108,7],[108,8,108,10],[108,11,108,13],[108,14,108,16],[108,17,108,20],[107,2,107,4],[107,5,107,7],[107,8,107,10],[107,11,107,13],[107,14,107,16],[107,17,107,20],[110,2,110,4],[110,5,110,7],[110,8,110,10],[110,11,110,13],[110,14,110,16],[110,17,110,20],[109,2,109,4],[109,5,109,7],[109,8,109,10],[109,11,109,13],[109,14,109,16],[109,17,109,20]]}
[]
[null,11,null,null,null,null,null,null,null,null,null,null,null,null,null,null,null,null,null,null,null,null,null,null,{"$f":"IF(S95+T95<>R95,\"FAUX\",\"OK\")","v":"OK"}]
[null,null,null,null,null,null,null,null,null,null,null,null,null,null,null,null,null,null,null,null,null,null,null,null,"Total","G","C"]
[null,"Noms",{"$f":"IF(ISNUMBER(B2),7*B2+DATE(Année,1,3)-WEEKDAY(DATE(Année,1,3))-5,\"\")","v":"2016-03-14"},"G","C",{"$f":"C4+1","v":"2016-03-15"},"G","C",{"$f":"F4+1","v":"2016-03-16"},"G","C",{"$f":"I4+1","v":"2016-03-17"},"G","C",{"$f":"L4+1","v":"2016-03-18"},"G","C","Total","G","B","Abs",null,null,null,{"$f":"R95","v":0},{"$f":"S95","v":0},{"$f":"T95","v":0}]
[null,null,null,null,null,null,null,null,null,null,null,null,null,null,null,null,null,{"$f":"somcoul(C5:Q5,\"rouge\")","v":0},{"$f":"COUNTIF(C5:Q5,(\"g\"))","v":0},{"$f":"COUNTIF(C5:Q5,(\"c\"))","v":0},{"$f":"COUNTIF(C5:Q5,\"abs\")","v":0}]
[null,null,null,null,null,null,null,null,null,null,null,null,null,null,null,null,null,0,{"$f":"COUNTIF(C6:Q6,(\"g\"))","v":0},{"$f":"COUNTIF(C6:Q6,(\"c\"))","v":0},{"$f":"COUNTIF(C6:Q6,\"abs\")","v":0}]
[null,null,null,null,null,null,null,null,null,null,null,null,null,null,null,null,null,0,0,0,0]
[null,null,null,null,null,null,null,null,null,null,null,null,null,null,null,null,null,0,0,0,0]
[null,null,null,null,null,null,null,null,null,null,null,null,null,null,null,null,null,0,0,0,0]
[null,null,null,null,null,null,null,null,null,null,null,null,null,null,null,null,null,0,0,0,0]
[null,null,null,null,null,null,null,null,null,null,null,null,null,null,null,null,null,0,0,0,0]
[null,null,null,null,null,null,null,null,null,null,null,null,null,null,null,null,null,0,0,0,0]
[null,null,null,null,null,null,null,null,null,null,null,null,null,null,null,null,null,0,0,0,0," ",null," ",null,null,"                                    "]
[null,null,null,null,null,null,null,null,null,null,null,null,null,null,null,null,null,0,0,0,0]
[null,null,null,null,null,null,null,null,null,null,null,null,null,null,null,null,null,0,0,0,0]
[null,null,null,null,null,null,null,null,null,null,null,null,null,null,null,null,null,0,0,0,0]
[null,null,null,null,null,null,null,null,null,null,null,null,null,null,null,null,null,0,0,0,0]
[null,null,null,null,null,null,null,null,null,null,null,null,null,null,null,null,null,0,0,0,0]
[null,null,null,null,null,null,null,null,null,null,null,null,null,null,null,null,null,0,0,0,0]
[null,null,null,null,null,null,null,null,null,null,null,null,null,null,null,null,null,0,0,0,0]
[null,null,null,null,null,null,null,null,null,null,null,null,null,null,null,null,null,0,0,0,0]
[null,null,null,null,null,null,null,null,null,null,null,null,null,null,null,null,null,0,0,0,0]
[null,null,null,null,null,null,null,null,null,null,null,null,null,null,null,null,null,0,0,0,0]
[null,null,null,null,null,null,null,null,null,null,null,null,null,null,null,null,null,0,0,0,0]
[null,null,null,null,null,null,null,null,null,null,null,null,null,null,null,null,null,0,0,0,0]
[null,null,null,null,null,null,null,null,null,null,null,null,null,null,null,null,null,0,0,0,0]
[null,null,null,null,null,null,null,null,null,null,null,null,null,null,null,null,null,0,0,0,0]
[null,null,null,null,null,null,null,null,null,null,null,null,null,null,null,null,null,0,0,0,0]
[null,null,null,null,null,null,null,null,null,null,null,null,null,null,null,null,null,0,0,0,0]
[null,null,null,null,null,null,null,null,null,null,null,null,null,null,null,null,null,0,0,0,0]
[null,null,null,null,null,null,null,null,null,null,null,null,null,null,null,null,null,0,0,0,0]
[null,null,null,null,null,null,null,null,null,null,null,null,null,null,null,null,null,0,0,0,0]
[null,null,null,null,null,null,null,null,null,null,null,null,null,null,null,null,null,0,0,0,0]
[null,null,null,null,null,null,null,null,null,null,null,null,null,null,null,null,null,0,0,0,0]
[null,null,null,null,null,null,null,null,null,null,null,null,null,null,null,null,null,0,0,0,0]
[null,null,null,null,null,null,null,null,null,null,null,null,null,null,null,null,null,0,0,0,0]
[null,null,null,null,null,null,null,null,null,null,null,null,null,null,null,null,null,{"$f":"somcoul(C37:Q37,\"rouge\")","v":0},0,0,0]
[null,null,null,null,null,null,null,null,null,null,null,null,null,null,null,null,null,0,0,0,0]
[null,null,null,null,null,null,null,null,null,null,null,null,null,null,null,null,null,0,0,0,0]
[null,null,null,null,null,null,null,null,null,null,null,null,null,null,null,null,null,0,0,0,0]
[null,null,null,null,null,null,null,null,null,null,null,null,null,null,null,null,null,0,0,0,0]
[null,null,null,null,null,null,null,null,null,null,null,null,null,null,null,null,null,0,0,0,0]
[null,null,null,null,null,null,null,null,null,null,null,null,null,null,null,null,null,0,0,0,0]
[null,null,null,null,null,null,null,null,null,null,null,null,null,null,null,null,null,0,0,0,0]
[null,null,null,null,null,null,null,null,null,null,null,null,null,null,null,null,null,0,0,0,0]
[null,null,null,null,null,null,null,null,null,null,null,null,null,null,null,null,null,0,0,0,0]
[null,null,null,null,null,null,null,null,null,null,null,null,null,null,null,null,null,0,0,0,0]
[null,null,null,null,null,null,null,null,null,null,null,null,null,null,null,null,null,0,0,0,0]
[null,null,null,null,null,null,null,null,null,null,null,null,null,null,null,null,null,0,0,0,0]
[null,null,null,null,null,null,null,null,null,null,null,null,null,null,null,null,null,0,0,0,0]
[null,null,null,null,null,null,null,null,null,null,null,null,null,null,null,null,null,0,0,0,0]
[null,null,null,null,null,null,null,null,null,null,null,null,null,null,null,null,null,0,0,0,0]
[null,null,null,null,null,null,null,null,null,null,null,null,null,null,null,null,null,0,0,0,0]
[null,null,null,null,null,null,null,null,null,null,null,null,null,null,null,null,null,0,0,0,0]
[null,null,null,null,null,null,null,null,null,null,null,null,null,null,null,null,null,0,0,0,0]
[null,null,null,null,null,null,null,null,null,null,null,null,null,null,null,null,null,0,0,0,0]
[null,null,null,null,null,null,null,null,null,null,null,null,null,null,null,null,null,0,0,0,0]
[null,null,null,null,null,null,null,null,null,null,null,null,null,null,null,null,null,0,0,0,0]
[null,null,null,null,null,null,null,null,null,null,null,null,null,null,null,null,null,0,0,0,0]
[null,null,null,null,null,null,null,null,null,null,null,null,null,null,null,null,null,0,0,0,0]
[null,null,null,null,null,null,null,null,null,null,null,null,null,null,null,null,null,0,0,0,0]
[null,null,null,null,null,null,null,null,null,null,null,null,null,null,null,null,null,0,0,0,0]
[null,null,null,null,null,null,null,null,null,null,null,null,null,null,null,null,null,0,0,0,0]
[null,null,null,null,null,null,null,null,null,null,null,null,null,null,null,null,null,0,0,0,0]
[null,null,null,null,null,null,null,null,null,null,null,null,null,null,null,null,null,0,0,0,0]
[null,null,null,null,null,null,null,null,null,null,null,null,null,null,null,null,null,0,0,0,0]
[null,null,null,null,null,null,null,null,null,null,null,null,null,null,null,null,null,0,0,0,0]
[null,null,null,null,null,null,null,null,null,null,null,null,null,null,null,null,null,0,0,0,0]
[null,null,null,null,null,null,null,null,null,null,null,null,null,null,null,null,null,{"$f":"somcoul(C69:Q69,\"rouge\")","v":0},0,0,0]
[null,null,null,null,null,null,null,null,null,null,null,null,null,null,null,null,null,0,{"$f":"COUNTIF(C70:Q70,(\"g\"))","v":0},{"$f":"COUNTIF(C70:Q70,(\"c\"))","v":0},{"$f":"COUNTIF(C70:Q70,\"abs\")","v":0}]
[null,null,null,null,null,null,null,null,null,null,null,null,null,null,null,null,null,0,0,0,0]
[null,null,null,null,null,null,null,null,null,null,null,null,null,null,null,null,null,0,0,0,0]
[null,null,null,null,null,null,null,null,null,null,null,null,null,null,null,null,null,0,0,0,0]
[null,null,null,null,null,null,null,null,null,null,null,null,null,null,null,null,null,0,0,0,0]
[null,null,null,null,null,null,null,null,null,null,null,null,null,null,null,null,null,0,0,0,0]
[null,null,null,null,null,null,null,null,null,null,null,null,null,null,null,null,null,0,0,0,0]
[null,null,null,null,null,null,null,null,null,null,null,null,null,null,null,null,null,0,0,0,0]
[null,null,null,null,null,null,null,null,null,null,null,null,null,null,null,null,null,0,0,0,0]
[null,null,null,null,null,null,null,null,null,null,null,null,null,null,null,null,null,0,0,0,0]
[null,null,null,null,null,null,null,null,null,null,null,null,null,null,null,null,null,0,0,0,0]
[null,null,null,null,null,null,null,null,null,null,null,null,null,null,null,null,null,0,0,0,0]
[null,null,null,null,null,null,null,null,null,null,null,null,null,null,null,null,null,0,0,0,0]
[null,null,null,null,null,null,null,null,null,null,null,null,null,null,null,null,null,0,0,0,0]
[null,null,null,null,null,null,null,null,null,null,null,null,null,null,null,null,null,0,0,0,0]
[null,null,null,null,null,null,null,null,null,null,null,null,null,null,null,null,null,0,0,0,0]
[null,null,null,null,null,null,null,null,null,null,null,null,null,null,null,null,null,0,0,0,0]
[null,null,null,null,null,null,null,null,null,null,null,null,null,null,null,null,null,0,0,0,0]
[null,null,null,null,null,null,null,null,null,null,null,null,null,null,null,null,null,0,0,0,0]
[null,null,null,null,null,null,null,null,null,null,null,null,null,null,null,null,null,0,0,0,0]
[null,null,null,null,null,null,null,null,null,null,null,null,null,null,null,null,null,0,0,0,0]
[null,null,null,null,null,null,null,null,null,null,null,null,null,null,null,null,null,0,0,0,0]
[null,null,null,null,null,null,null,null,null,null,null,null,null,null,null,null,null,0,0,0,0]
[null,null,null,null,null,null,null,null,null,null,null,null,null,null,null,null,null,0,0,0,0]
[null,null,null,null,null,null,null,null,null,null,null,null,null,null,null,null,null,0,0,0,0]
[null,"Totaux",{"$f":"COUNTIF(C5:C94,\"abs\")","v":0},null,null,{"$f":"COUNTIF(F5:F94,\"abs\")","v":0},null,null,{"$f":"COUNTIF(I5:I94,\"abs\")","v":0},null,null,{"$f":"COUNTIF(L5:L94,\"abs\")","v":0},null,null,{"$f":"COUNTIF(O5:O94,\"abs\")","v":0},null,null,{"$f":"SUM(R5:R94)","v":0},{"$f":"SUM(S5:S94)","v":0},{"$f":"SUM(T5:T94)","v":0},{"$f":"SUM(U5:U94)","v":0}]
[null,null,{"$f":"somcoul(C5:C94,\"rouge\")","v":0},{"$f":"COUNTIF(D5:D94,\"g\")","v":0},{"$f":"COUNTIF(E5:E94,\"c\")","v":0},{"$f":"somcoul(F5:F94,\"rouge\")","v":0},{"$f":"COUNTIF(G5:G94,\"g\")","v":0},{"$f":"COUNTIF(H5:H94,\"c\")","v":0},{"$f":"somcoul(I5:I94,\"rouge\")","v":0},{"$f":"COUNTIF(J6:J94,\"g\")","v":0},{"$f":"COUNTIF(K5:K94,\"c\")","v":0},{"$f":"somcoul(L5:L94,\"rouge\")","v":0},{"$f":"COUNTIF(M5:M94,\"g\")","v":0},{"$f":"COUNTIF(N6:N94,\"c\")","v":0},{"$f":"somcoul(O5:O94,\"rouge\")","v":0},{"$f":"COUNTIF(P5:P94,\"g\")","v":0},{"$f":"COUNTIF(Q5:Q94,\"c\")","v":0}]
[null,"6h30/8h00",{"$f":"COUNTIF(C5:C94,\"6h30/8h00\")","v":0},null,null,{"$f":"COUNTIF(F5:F94,\"6h30/8h00\")","v":0},null,null,{"$f":"COUNTIF(I5:I94,\"6h30/8h00\")","v":0},null,null,{"$f":"COUNTIF(L5:L94,\"6h30/8h00\")","v":0},null,null,{"$f":"COUNTIF(O5:O94,\"6h30/8h00\")","v":0},null,null,{"$f":"SUM(C97:Q97)","v":0}]
[null,"7h00/9h00",{"$f":"COUNTIF(C5:C94,\"7h00/9h00\")","v":0},null,null,{"$f":"COUNTIF(F5:F94,\"7h00/9h00\")","v":0},null,null,{"$f":"COUNTIF(I5:I94,\"7h00/9h00\")","v":0},null,null,{"$f":"COUNTIF(L5:L94,\"7h00/9h00\")","v":0},null,null,{"$f":"COUNTIF(O5:O94,\"7h00/9h00\")","v":0},null,null,0]
[null,"8h00/10h00",{"$f":"COUNTIF(C5:C94,\"8h00/10h00\")","v":0},null,null,{"$f":"COUNTIF(F5:F94,\"8h00/10h00\")","v":0},null,null,{"$f":"COUNTIF(I5:I94,\"8h00/10h00\")","v":0},null,null,{"$f":"COUNTIF(L5:L94,\"8h00/10h00\")","v":0},null,null,{"$f":"COUNTIF(O5:O94,\"8h00/10h00\")","v":0},null,null,0]
[null,"9h00/11h00",{"$f":"COUNTIF(C5:C94,\"9h00/11h00\")","v":0},null,null,{"$f":"COUNTIF(F5:F94,\"9h00/11h00\")","v":0},null,null,{"$f":"COUNTIF(I5:I94,\"9h00/11h00\")","v":0},null,null,{"$f":"COUNTIF(L5:L94,\"9h00/11h00\")","v":0},null,null,{"$f":"COUNTIF(O5:O94,\"9h00/11h00\")","v":0},null,null,0]
[null,"10h00/12h00",{"$f":"COUNTIF(C5:C94,\"10h00/12h00\")","v":0},null,null,{"$f":"COUNTIF(F5:F94,\"10h00/12h00\")","v":0},null,null,{"$f":"COUNTIF(I5:I94,\"10h00/12h00\")","v":0},null,null,{"$f":"COUNTIF(L5:L94,\"10h00/12h00\")","v":0},null,null,{"$f":"COUNTIF(O5:O94,\"10h00/12h00\")","v":0},null,null,0]
[null,"11h00/13h00",{"$f":"COUNTIF(C5:C94,\"11h00/13h00\")","v":0},null,null,{"$f":"COUNTIF(F5:F94,\"11h00/13h00\")","v":0},null,null,{"$f":"COUNTIF(I5:I94,\"11h00/13h00\")","v":0},null,null,{"$f":"COUNTIF(L5:L94,\"11h00/13h00\")","v":0},null,null,{"$f":"COUNTIF(O5:O94,\"11h00/13h00\")","v":0},null,null,0]
[null,"13h00/15h00",{"$f":"COUNTIF(C5:C94,\"13h00/15h00\")","v":0},null,null,{"$f":"COUNTIF(F5:F94,\"13h00/15h00\")","v":0},null,null,{"$f":"COUNTIF(I5:I94,\"13h00/15h00\")","v":0},null,null,{"$f":"COUNTIF(L5:L94,\"13h00/15h00\")","v":0},null,null,{"$f":"COUNTIF(O5:O94,\"13h00/15h00\")","v":0},null,null,0]
[null,"13h30/15h30",{"$f":"COUNTIF(C5:C94,\"13h30/15h30\")","v":0},null,null,{"$f":"COUNTIF(F5:F94,\"13h30/15h30\")","v":0},null,null,{"$f":"COUNTIF(I5:I94,\"13h30/15h30\")","v":0},null,null,{"$f":"COUNTIF(L5:L94,\"13h30/15h30\")","v":0},null,null,{"$f":"COUNTIF(O5:O94,\"13h30/15h30\")","v":0},null,null,0]
[null,"15h00/17h00",{"$f":"COUNTIF(C5:C94,\"15h00/17h00\")","v":0},null,null,{"$f":"COUNTIF(F5:F94,\"15h00/17h00\")","v":0},null,null,{"$f":"COUNTIF(I5:I94,\"15h00/17h00\")","v":0},null,null,{"$f":"COUNTIF(L5:L94,\"15h00/17h00\")","v":0},null,null,{"$f":"COUNTIF(O5:O94,\"15h00/17h00\")","v":0},null,null,0]
[null,"16h00/18h00",{"$f":"COUNTIF(C5:C94,\"16h00/18h00\")","v":0},null,null,{"$f":"COUNTIF(F5:F94,\"16h00/18h00\")","v":0},null,null,{"$f":"COUNTIF(I5:I94,\"16h00/18h00\")","v":0},null,null,{"$f":"COUNTIF(L5:L94,\"16h00/18h00\")","v":0},null,null,{"$f":"COUNTIF(O5:O94,\"16h00/18h00\")","v":0},null,null,0]
[null,"17h00/19h00",{"$f":"COUNTIF(C5:C94,\"17h00/19h00\")","v":0},null,null,{"$f":"COUNTIF(F5:F94,\"17h00/19h00\")","v":0},null,null,{"$f":"COUNTIF(I5:I94,\"17h00/19h00\")","v":0},null,null,{"$f":"COUNTIF(L5:L94,\"17h00/19h00\")","v":0},null,null,{"$f":"COUNTIF(O5:O94,\"17h00/19h00\")","v":0},null,null,0]
[null,"18h00/20h00",{"$f":"COUNTIF(C5:C94,\"18h00/20h00\")","v":0},null,null,{"$f":"COUNTIF(F5:F94,\"18h00/20h00\")","v":0},null,null,{"$f":"COUNTIF(I5:I94,\"18h00/20h00\")","v":0},null,null,{"$f":"COUNTIF(L5:L94,\"18h00/20h00\")","v":0},null,null,{"$f":"COUNTIF(O5:O94,\"18h00/20h00\")","v":0},null,null,0]
[null,"19h00/21h00",{"$f":"COUNTIF(C5:C94,\"19h00/21h00\")","v":0},null,null,{"$f":"COUNTIF(F5:F94,\"19h00/21h00\")","v":0},null,null,{"$f":"COUNTIF(I5:I94,\"19h00/21h00\")","v":0},null,null,{"$f":"COUNTIF(L5:L94,\"19h00/21h00\")","v":0},null,null,{"$f":"COUNTIF(O5:O94,\"19h00/21h00\")","v":0},null,null,0]
[null,"21h00/23h00",{"$f":"COUNTIF(C5:C94,\"21h00/23h00\")","v":0},null,null,{"$f":"COUNTIF(F5:F94,\"21h00/23h00\")","v":0},null,null,{"$f":"COUNTIF(I5:I94,\"21h00/23h00\")","v":0},null,null,{"$f":"COUNTIF(L5:L94,\"21h00/23h00\")","v":0},null,null,{"$f":"COUNTIF(O5:O94,\"21h00/23h00\")","v":0},null,null,0]
[null,"22h00/23h00",{"$f":"COUNTIF(C5:C94,\"22h00/23h00\")","v":0},null,null,{"$f":"COUNTIF(F5:F94,\"22h00/23h00\")","v":0},null,null,{"$f":"COUNTIF(I5:I94,\"22h00/23h00\")","v":0},null,null,{"$f":"COUNTIF(L5:L94,\"22h00/23h00\")","v":0},null,null,{"$f":"COUNTIF(O5:O94,\"22h00/23h00\")","v":0},null,null,0]

{"sheet":"E","index":5,"n_rows":111,"n_cols":27,"rows_kept":111,"cut":false,"hidden":false,"merged":[[1,24,1,26],[94,20,95,20],[96,2,96,4],[96,5,96,7],[96,8,96,10],[96,11,96,13],[96,14,96,16],[96,17,96,20],[1,1,1,21],[94,1,95,1],[94,2,94,4],[94,5,94,7],[94,8,94,10],[94,11,94,13],[94,14,94,16],[94,17,95,17],[94,18,95,18],[94,19,95,19],[98,2,98,4],[98,5,98,7],[98,8,98,10],[98,11,98,13],[98,14,98,16],[98,17,98,20],[97,2,97,4],[97,5,97,7],[97,8,97,10],[97,11,97,13],[97,14,97,16],[97,17,97,20],[100,2,100,4],[100,5,100,7],[100,8,100,10],[100,11,100,13],[100,14,100,16],[100,17,100,20],[99,2,99,4],[99,5,99,7],[99,8,99,10],[99,11,99,13],[99,14,99,16],[99,17,99,20],[102,2,102,4],[102,5,102,7],[102,8,102,10],[102,11,102,13],[102,14,102,16],[102,17,102,20],[101,2,101,4],[101,5,101,7],[101,8,101,10],[101,11,101,13],[101,14,101,16],[101,17,101,20],[104,2,104,4],[104,5,104,7],[104,8,104,10],[104,11,104,13],[104,14,104,16],[104,17,104,20],[103,2,103,4],[103,5,103,7],[103,8,103,10],[103,11,103,13],[103,14,103,16],[103,17,103,20],[106,2,106,4],[106,5,106,7],[106,8,106,10],[106,11,106,13],[106,14,106,16],[106,17,106,20],[105,2,105,4],[105,5,105,7],[105,8,105,10],[105,11,105,13],[105,14,105,16],[105,17,105,20],[108,2,108,4],[108,5,108,7],[108,8,108,10],[108,11,108,13],[108,14,108,16],[108,17,108,20],[107,2,107,4],[107,5,107,7],[107,8,107,10],[107,11,107,13],[107,14,107,16],[107,17,107,20],[110,2,110,4],[110,5,110,7],[110,8,110,10],[110,11,110,13],[110,14,110,16],[110,17,110,20],[109,2,109,4],[109,5,109,7],[109,8,109,10],[109,11,109,13],[109,14,109,16],[109,17,109,20]]}
[]
[null,11,null,null,null,null,null,null,null,null,null,null,null,null,null,null,null,null,null,null,null,null,null,null,{"$f":"IF(S95+T95<>R95,\"FAUX\",\"OK\")","v":"OK"}]
[null,null,null,null,null,null,null,null,null,null,null,null,null,null,null,null,null,null,null,null,null,null,null,null,"Total","G","C"]
[null,"Noms",{"$f":"IF(ISNUMBER(B2),7*B2+DATE(Année,1,3)-WEEKDAY(DATE(Année,1,3))-5,\"\")","v":"2016-03-14"},"G","C",{"$f":"C4+1","v":"2016-03-15"},"G","C",{"$f":"F4+1","v":"2016-03-16"},"G","C",{"$f":"I4+1","v":"2016-03-17"},"G","C",{"$f":"L4+1","v":"2016-03-18"},"G","C","Total","G","B","Abs",null,null,null,{"$f":"R95","v":0},{"$f":"S95","v":0},{"$f":"T95","v":0}]
[null,null,null,null,null,null,null,null,null,null,null,null,null,null,null,null,null,{"$f":"somcoul(C5:Q5,\"rouge\")","v":0},{"$f":"COUNTIF(C5:Q5,(\"g\"))","v":0},{"$f":"COUNTIF(C5:Q5,(\"c\"))","v":0},{"$f":"COUNTIF(C5:Q5,\"abs\")","v":0}]
[null,null,null,null,null,null,null,null,null,null,null,null,null,null,null,null,null,0,{"$f":"COUNTIF(C6:Q6,(\"g\"))","v":0},{"$f":"COUNTIF(C6:Q6,(\"c\"))","v":0},{"$f":"COUNTIF(C6:Q6,\"abs\")","v":0}]
[null,null,null,null,null,null,null,null,null,null,null,null,null,null,null,null,null,0,0,0,0]
[null,null,null,null,null,null,null,null,null,null,null,null,null,null,null,null,null,0,0,0,0]
[null,null,null,null,null,null,null,null,null,null,null,null,null,null,null,null,null,0,0,0,0]
[null,null,null,null,null,null,null,null,null,null,null,null,null,null,null,null,null,0,0,0,0]
[null,null,null,null,null,null,null,null,null,null,null,null,null,null,null,null,null,0,0,0,0]
[null,null,null,null,null,null,null,null,null,null,null,null,null,null,null,null,null,0,0,0,0]
[null,null,null,null,null,null,null,null,null,null,null,null,null,null,null,null,null,0,0,0,0," ",null," ",null,null,"                                    "]
[null,null,null,null,null,null,null,null,null,null,null,null,null,null,null,null,null,0,0,0,0]
[null,null,null,null,null,null,null,null,null,null,null,null,null,null,null,null,null,0,0,0,0]
[null,null,null,null,null,null,null,null,null,null,null,null,null,null,null,null,null,0,0,0,0]
[null,null,null,null,null,null,null,null,null,null,null,null,null,null,null,null,null,0,0,0,0]
[null,null,null,null,null,null,null,null,null,null,null,null,null,null,null,null,null,0,0,0,0]
[null,null,null,null,null,null,null,null,null,null,null,null,null,null,null,null,null,0,0,0,0]
[null,null,null,null,null,null,null,null,null,null,null,null,null,null,null,null,null,0,0,0,0]
[null,null,null,null,null,null,null,null,null,null,null,null,null,null,null,null,null,0,0,0,0]
[null,null,null,null,null,null,null,null,null,null,null,null,null,null,null,null,null,0,0,0,0]
[null,null,null,null,null,null,null,null,null,null,null,null,null,null,null,null,null,0,0,0,0]
[null,null,null,null,null,null,null,null,null,null,null,null,null,null,null,null,null,0,0,0,0]
[null,null,null,null,null,null,null,null,null,null,null,null,null,null,null,null,null,0,0,0,0]
[null,null,null,null,null,null,null,null,null,null,null,null,null,null,null,null,null,0,0,0,0]
[null,null,null,null,null,null,null,null,null,null,null,null,null,null,null,null,null,0,0,0,0]
[null,null,null,null,null,null,null,null,null,null,null,null,null,null,null,null,null,0,0,0,0]
[null,null,null,null,null,null,null,null,null,null,null,null,null,null,null,null,null,0,0,0,0]
[null,null,null,null,null,null,null,null,null,null,null,null,null,null,null,null,null,0,0,0,0]
[null,null,null,null,null,null,null,null,null,null,null,null,null,null,null,null,null,0,{"$f":"COUNTIF(C31:Q31,(\"g\"))","v":0},{"$f":"COUNTIF(C31:Q31,(\"c\"))","v":0},{"$f":"COUNTIF(C31:Q31,\"abs\")","v":0}]
[null,null,null,null,null,null,null,null,null,null,null,null,null,null,null,null,null,0,0,0,0]
[null,null,null,null,null,null,null,null,null,null,null,null,null,null,null,null,null,0,0,0,0]
[null,null,null,null,null,null,null,null,null,null,null,null,null,null,null,null,null,0,0,0,0]
[null,null,null,null,null,null,null,null,null,null,null,null,null,null,null,null,null,0,0,0,0]
[null,null,null,null,null,null,null,null,null,null,null,null,null,null,null,null,null,0,0,0,0]
[null,null,null,null,null,null,null,null,null,null,null,null,null,null,null,null,null,{"$f":"somcoul(C37:Q37,\"rouge\")","v":0},0,0,0]
[null,null,null,null,null,null,null,null,null,null,null,null,null,null,null,null,null,0,0,0,0]
[null,null,null,null,null,null,null,null,null,null,null,null,null,null,null,null,null,0,0,0,0]
[null,null,null,null,null,null,null,null,null,null,null,null,null,null,null,null,null,0,0,0,0]
[null,null,null,null,null,null,null,null,null,null,null,null,null,null,null,null,null,0,0,0,0]
[null,null,null,null,null,null,null,null,null,null,null,null,null,null,null,null,null,0,0,0,0]
[null,null,null,null,null,null,null,null,null,null,null,null,null,null,null,null,null,0,0,0,0]
[null,null,null,null,null,null,null,null,null,null,null,null,null,null,null,null,null,0,0,0,0]
[null,null,null,null,null,null,null,null,null,null,null,null,null,null,null,null,null,0,0,0,0]
[null,null,null,null,null,null,null,null,null,null,null,null,null,null,null,null,null,0,0,0,0]
[null,null,null,null,null,null,null,null,null,null,null,null,null,null,null,null,null,0,0,0,0]
[null,null,null,null,null,null,null,null,null,null,null,null,null,null,null,null,null,0,0,0,0]
[null,null,null,null,null,null,null,null,null,null,null,null,null,null,null,null,null,0,0,0,0]
[null,null,null,null,null,null,null,null,null,null,null,null,null,null,null,null,null,0,0,0,0]
[null,null,null,null,null,null,null,null,null,null,null,null,null,null,null,null,null,0,0,0,0]
[null,null,null,null,null,null,null,null,null,null,null,null,null,null,null,null,null,0,0,0,0]
[null,null,null,null,null,null,null,null,null,null,null,null,null,null,null,null,null,0,0,0,0]
[null,null,null,null,null,null,null,null,null,null,null,null,null,null,null,null,null,0,0,0,0]
[null,null,null,null,null,null,null,null,null,null,null,null,null,null,null,null,null,0,0,0,0]
[null,null,null,null,null,null,null,null,null,null,null,null,null,null,null,null,null,0,0,0,0]
[null,null,null,null,null,null,null,null,null,null,null,null,null,null,null,null,null,0,0,0,0]
[null,null,null,null,null,null,null,null,null,null,null,null,null,null,null,null,null,0,0,0,0]
[null,null,null,null,null,null,null,null,null,null,null,null,null,null,null,null,null,0,0,0,0]
[null,null,null,null,null,null,null,null,null,null,null,null,null,null,null,null,null,0,0,0,0]
[null,null,null,null,null,null,null,null,null,null,null,null,null,null,null,null,null,0,0,0,0]
[null,null,null,null,null,null,null,null,null,null,null,null,null,null,null,null,null,0,0,0,0]
[null,null,null,null,null,null,null,null,null,null,null,null,null,null,null,null,null,0,0,0,0]
[null,null,null,null,null,null,null,null,null,null,null,null,null,null,null,null,null,0,0,0,0]
[null,null,null,null,null,null,null,null,null,null,null,null,null,null,null,null,null,0,0,0,0]
[null,null,null,null,null,null,null,null,null,null,null,null,null,null,null,null,null,0,0,0,0]
[null,null,null,null,null,null,null,null,null,null,null,null,null,null,null,null,null,0,0,0,0]
[null,null,null,null,null,null,null,null,null,null,null,null,null,null,null,null,null,0,0,0,0]
[null,null,null,null,null,null,null,null,null,null,null,null,null,null,null,null,null,{"$f":"somcoul(C69:Q69,\"rouge\")","v":0},0,0,0]
[null,null,null,null,null,null,null,null,null,null,null,null,null,null,null,null,null,0,0,0,{"$f":"COUNTIF(C70:Q70,\"abs\")","v":0}]
[null,null,null,null,null,null,null,null,null,null,null,null,null,null,null,null,null,0,0,0,0]
[null,null,null,null,null,null,null,null,null,null,null,null,null,null,null,null,null,0,0,0,0]
[null,null,null,null,null,null,null,null,null,null,null,null,null,null,null,null,null,0,0,0,0]
[null,null,null,null,null,null,null,null,null,null,null,null,null,null,null,null,null,0,0,0,0]
[null,null,null,null,null,null,null,null,null,null,null,null,null,null,null,null,null,0,0,0,0]
[null,null,null,null,null,null,null,null,null,null,null,null,null,null,null,null,null,0,0,0,0]
[null,null,null,null,null,null,null,null,null,null,null,null,null,null,null,null,null,0,0,0,0]
[null,null,null,null,null,null,null,null,null,null,null,null,null,null,null,null,null,0,0,0,0]
[null,null,null,null,null,null,null,null,null,null,null,null,null,null,null,null,null,0,0,0,0]
[null,null,null,null,null,null,null,null,null,null,null,null,null,null,null,null,null,0,0,0,0]
[null,null,null,null,null,null,null,null,null,null,null,null,null,null,null,null,null,0,0,0,0]
[null,null,null,null,null,null,null,null,null,null,null,null,null,null,null,null,null,0,0,0,0]
[null,null,null,null,null,null,null,null,null,null,null,null,null,null,null,null,null,0,0,0,0]
[null,null,null,null,null,null,null,null,null,null,null,null,null,null,null,null,null,0,0,0,0]
[null,null,null,null,null,null,null,null,null,null,null,null,null,null,null,null,null,0,0,0,0]
[null,null,null,null,null,null,null,null,null,null,null,null,null,null,null,null,null,0,0,0,0]
[null,null,null,null,null,null,null,null,null,null,null,null,null,null,null,null,null,0,0,0,0]
[null,null,null,null,null,null,null,null,null,null,null,null,null,null,null,null,null,0,0,0,0]
[null,null,null,null,null,null,null,null,null,null,null,null,null,null,null,null,null,0,0,0,0]
[null,null,null,null,null,null,null,null,null,null,null,null,null,null,null,null,null,0,0,0,0]
[null,null,null,null,null,null,null,null,null,null,null,null,null,null,null,null,null,0,0,0,0]
[null,null,null,null,null,null,null,null,null,null,null,null,null,null,null,null,null,0,0,0,0]
[null,null,null,null,null,null,null,null,null,null,null,null,null,null,null,null,null,0,0,0,0]
[null,null,null,null,null,null,null,null,null,null,null,null,null,null,null,null,null,0,0,0,{"$f":"COUNTIF(C94:Q94,\"abs\")","v":0}]
[null,"Totaux",{"$f":"COUNTIF(C5:C94,\"abs\")","v":0},null,null,{"$f":"COUNTIF(F5:F94,\"abs\")","v":0},null,null,{"$f":"COUNTIF(I5:I94,\"abs\")","v":0},null,null,{"$f":"COUNTIF(L5:L94,\"abs\")","v":0},null,null,{"$f":"COUNTIF(O5:O94,\"abs\")","v":0},null,null,{"$f":"SUM(R5:R94)","v":0},{"$f":"SUM(S5:S94)","v":0},{"$f":"SUM(T5:T94)","v":0},{"$f":"SUM(U5:U94)","v":0}]
[null,null,{"$f":"somcoul(C5:C94,\"rouge\")","v":0},{"$f":"COUNTIF(D5:D94,\"g\")","v":0},{"$f":"COUNTIF(E5:E94,\"c\")","v":0},{"$f":"somcoul(F5:F94,\"rouge\")","v":0},{"$f":"COUNTIF(G5:G94,\"g\")","v":0},{"$f":"COUNTIF(H5:H94,\"c\")","v":0},{"$f":"somcoul(I5:I94,\"rouge\")","v":0},{"$f":"COUNTIF(J6:J94,\"g\")","v":0},{"$f":"COUNTIF(K5:K94,\"c\")","v":0},{"$f":"somcoul(L5:L94,\"rouge\")","v":0},{"$f":"COUNTIF(M5:M94,\"g\")","v":0},{"$f":"COUNTIF(N6:N94,\"c\")","v":0},{"$f":"somcoul(O5:O94,\"rouge\")","v":0},{"$f":"COUNTIF(P5:P94,\"g\")","v":0},{"$f":"COUNTIF(Q5:Q94,\"c\")","v":0}]
[null,"6h30/8h00",{"$f":"COUNTIF(C5:C94,\"6h30/8h00\")","v":0},null,null,{"$f":"COUNTIF(F5:F94,\"6h30/8h00\")","v":0},null,null,{"$f":"COUNTIF(I5:I94,\"6h30/8h00\")","v":0},null,null,{"$f":"COUNTIF(L5:L94,\"6h30/8h00\")","v":0},null,null,{"$f":"COUNTIF(O5:O94,\"6h30/8h00\")","v":0},null,null,{"$f":"SUM(C97:Q97)","v":0}]
[null,"7h00/9h00",{"$f":"COUNTIF(C5:C94,\"7h00/9h00\")","v":0},null,null,{"$f":"COUNTIF(F5:F94,\"7h00/9h00\")","v":0},null,null,{"$f":"COUNTIF(I5:I94,\"7h00/9h00\")","v":0},null,null,{"$f":"COUNTIF(L5:L94,\"7h00/9h00\")","v":0},null,null,{"$f":"COUNTIF(O5:O94,\"7h00/9h00\")","v":0},null,null,0]
[null,"8h00/10h00",{"$f":"COUNTIF(C5:C94,\"8h00/10h00\")","v":0},null,null,{"$f":"COUNTIF(F5:F94,\"8h00/10h00\")","v":0},null,null,{"$f":"COUNTIF(I5:I94,\"8h00/10h00\")","v":0},null,null,{"$f":"COUNTIF(L5:L94,\"8h00/10h00\")","v":0},null,null,{"$f":"COUNTIF(O5:O94,\"8h00/10h00\")","v":0},null,null,0]
[null,"9h00/11h00",{"$f":"COUNTIF(C5:C94,\"9h00/11h00\")","v":0},null,null,{"$f":"COUNTIF(F5:F94,\"9h00/11h00\")","v":0},null,null,{"$f":"COUNTIF(I5:I94,\"9h00/11h00\")","v":0},null,null,{"$f":"COUNTIF(L5:L94,\"9h00/11h00\")","v":0},null,null,{"$f":"COUNTIF(O5:O94,\"9h00/11h00\")","v":0},null,null,0]
[null,"10h00/12h00",{"$f":"COUNTIF(C5:C94,\"10h00/12h00\")","v":0},null,null,{"$f":"COUNTIF(F5:F94,\"10h00/12h00\")","v":0},null,null,{"$f":"COUNTIF(I5:I94,\"10h00/12h00\")","v":0},null,null,{"$f":"COUNTIF(L5:L94,\"10h00/12h00\")","v":0},null,null,{"$f":"COUNTIF(O5:O94,\"10h00/12h00\")","v":0},null,null,0]
[null,"11h00/13h00",{"$f":"COUNTIF(C5:C94,\"11h00/13h00\")","v":0},null,null,{"$f":"COUNTIF(F5:F94,\"11h00/13h00\")","v":0},null,null,{"$f":"COUNTIF(I5:I94,\"11h00/13h00\")","v":0},null,null,{"$f":"COUNTIF(L5:L94,\"11h00/13h00\")","v":0},null,null,{"$f":"COUNTIF(O5:O94,\"11h00/13h00\")","v":0},null,null,0]
[null,"13h00/15h00",{"$f":"COUNTIF(C5:C94,\"13h00/15h00\")","v":0},null,null,{"$f":"COUNTIF(F5:F94,\"13h00/15h00\")","v":0},null,null,{"$f":"COUNTIF(I5:I94,\"13h00/15h00\")","v":0},null,null,{"$f":"COUNTIF(L5:L94,\"13h00/15h00\")","v":0},null,null,{"$f":"COUNTIF(O5:O94,\"13h00/15h00\")","v":0},null,null,0]
[null,"13h30/15h30",{"$f":"COUNTIF(C5:C94,\"13h30/15h30\")","v":0},null,null,{"$f":"COUNTIF(F5:F94,\"13h30/15h30\")","v":0},null,null,{"$f":"COUNTIF(I5:I94,\"13h30/15h30\")","v":0},null,null,{"$f":"COUNTIF(L5:L94,\"13h30/15h30\")","v":0},null,null,{"$f":"COUNTIF(O5:O94,\"13h30/15h30\")","v":0},null,null,0]
[null,"15h00/17h00",{"$f":"COUNTIF(C5:C94,\"15h00/17h00\")","v":0},null,null,{"$f":"COUNTIF(F5:F94,\"15h00/17h00\")","v":0},null,null,{"$f":"COUNTIF(I5:I94,\"15h00/17h00\")","v":0},null,null,{"$f":"COUNTIF(L5:L94,\"15h00/17h00\")","v":0},null,null,{"$f":"COUNTIF(O5:O94,\"15h00/17h00\")","v":0},null,null,0]
[null,"16h00/18h00",{"$f":"COUNTIF(C5:C94,\"16h00/18h00\")","v":0},null,null,{"$f":"COUNTIF(F5:F94,\"16h00/18h00\")","v":0},null,null,{"$f":"COUNTIF(I5:I94,\"16h00/18h00\")","v":0},null,null,{"$f":"COUNTIF(L5:L94,\"16h00/18h00\")","v":0},null,null,{"$f":"COUNTIF(O5:O94,\"16h00/18h00\")","v":0},null,null,0]
[null,"17h00/19h00",{"$f":"COUNTIF(C5:C94,\"17h00/19h00\")","v":0},null,null,{"$f":"COUNTIF(F5:F94,\"17h00/19h00\")","v":0},null,null,{"$f":"COUNTIF(I5:I94,\"17h00/19h00\")","v":0},null,null,{"$f":"COUNTIF(L5:L94,\"17h00/19h00\")","v":0},null,null,{"$f":"COUNTIF(O5:O94,\"17h00/19h00\")","v":0},null,null,0]
[null,"18h00/20h00",{"$f":"COUNTIF(C5:C94,\"18h00/20h00\")","v":0},null,null,{"$f":"COUNTIF(F5:F94,\"18h00/20h00\")","v":0},null,null,{"$f":"COUNTIF(I5:I94,\"18h00/20h00\")","v":0},null,null,{"$f":"COUNTIF(L5:L94,\"18h00/20h00\")","v":0},null,null,{"$f":"COUNTIF(O5:O94,\"18h00/20h00\")","v":0},null,null,0]
[null,"19h00/21h00",{"$f":"COUNTIF(C5:C94,\"19h00/21h00\")","v":0},null,null,{"$f":"COUNTIF(F5:F94,\"19h00/21h00\")","v":0},null,null,{"$f":"COUNTIF(I5:I94,\"19h00/21h00\")","v":0},null,null,{"$f":"COUNTIF(L5:L94,\"19h00/21h00\")","v":0},null,null,{"$f":"COUNTIF(O5:O94,\"19h00/21h00\")","v":0},null,null,0]
[null,"21h00/23h00",{"$f":"COUNTIF(C5:C94,\"21h00/23h00\")","v":0},null,null,{"$f":"COUNTIF(F5:F94,\"21h00/23h00\")","v":0},null,null,{"$f":"COUNTIF(I5:I94,\"21h00/23h00\")","v":0},null,null,{"$f":"COUNTIF(L5:L94,\"21h00/23h00\")","v":0},null,null,{"$f":"COUNTIF(O5:O94,\"21h00/23h00\")","v":0},null,null,0]
[null,"22h00/23h00",{"$f":"COUNTIF(C5:C94,\"22h00/23h00\")","v":0},null,null,{"$f":"COUNTIF(F5:F94,\"22h00/23h00\")","v":0},null,null,{"$f":"COUNTIF(I5:I94,\"22h00/23h00\")","v":0},null,null,{"$f":"COUNTIF(L5:L94,\"22h00/23h00\")","v":0},null,null,{"$f":"COUNTIF(O5:O94,\"22h00/23h00\")","v":0},null,null,0]

{"sheet":"F","index":6,"n_rows":111,"n_cols":27,"rows_kept":111,"cut":false,"hidden":false,"merged":[[1,24,1,26],[94,20,95,20],[96,2,96,4],[96,5,96,7],[96,8,96,10],[96,11,96,13],[96,14,96,16],[96,17,96,20],[1,1,1,21],[94,1,95,1],[94,2,94,4],[94,5,94,7],[94,8,94,10],[94,11,94,13],[94,14,94,16],[94,17,95,17],[94,18,95,18],[94,19,95,19],[98,2,98,4],[98,5,98,7],[98,8,98,10],[98,11,98,13],[98,14,98,16],[98,17,98,20],[97,2,97,4],[97,5,97,7],[97,8,97,10],[97,11,97,13],[97,14,97,16],[97,17,97,20],[100,2,100,4],[100,5,100,7],[100,8,100,10],[100,11,100,13],[100,14,100,16],[100,17,100,20],[99,2,99,4],[99,5,99,7],[99,8,99,10],[99,11,99,13],[99,14,99,16],[99,17,99,20],[102,2,102,4],[102,5,102,7],[102,8,102,10],[102,11,102,13],[102,14,102,16],[102,17,102,20],[101,2,101,4],[101,5,101,7],[101,8,101,10],[101,11,101,13],[101,14,101,16],[101,17,101,20],[104,2,104,4],[104,5,104,7],[104,8,104,10],[104,11,104,13],[104,14,104,16],[104,17,104,20],[103,2,103,4],[103,5,103,7],[103,8,103,10],[103,11,103,13],[103,14,103,16],[103,17,103,20],[106,2,106,4],[106,5,106,7],[106,8,106,10],[106,11,106,13],[106,14,106,16],[106,17,106,20],[105,2,105,4],[105,5,105,7],[105,8,105,10],[105,11,105,13],[105,14,105,16],[105,17,105,20],[108,2,108,4],[108,5,108,7],[108,8,108,10],[108,11,108,13],[108,14,108,16],[108,17,108,20],[107,2,107,4],[107,5,107,7],[107,8,107,10],[107,11,107,13],[107,14,107,16],[107,17,107,20],[110,2,110,4],[110,5,110,7],[110,8,110,10],[110,11,110,13],[110,14,110,16],[110,17,110,20],[109,2,109,4],[109,5,109,7],[109,8,109,10],[109,11,109,13],[109,14,109,16],[109,17,109,20]]}
[]
[null,11,null,null,null,null,null,null,null,null,null,null,null,null,null,null,null,null,null,null,null,null,null,null,{"$f":"IF(S95+T95<>R95,\"FAUX\",\"OK\")","v":"OK"}]
[null,null,null,null,null,null,null,null,null,null,null,null,null,null,null,null,null,null,null,null,null,null,null,null,"Total","G","C"]
[null,"Noms",{"$f":"IF(ISNUMBER(B2),7*B2+DATE(Année,1,3)-WEEKDAY(DATE(Année,1,3))-5,\"\")","v":"2016-03-14"},"G","C",{"$f":"C4+1","v":"2016-03-15"},"G","C",{"$f":"F4+1","v":"2016-03-16"},"G","C",{"$f":"I4+1","v":"2016-03-17"},"G","C",{"$f":"L4+1","v":"2016-03-18"},"G","C","Total","G","B","Abs",null,null,null,{"$f":"R95","v":0},{"$f":"S95","v":0},{"$f":"T95","v":0}]
[null,null,null,null,null,null,null,null,null,null,null,null,null,null,null,null,null,{"$f":"somcoul(C5:Q5,\"rouge\")","v":0},{"$f":"COUNTIF(C5:Q5,(\"g\"))","v":0},{"$f":"COUNTIF(C5:Q5,(\"c\"))","v":0},{"$f":"COUNTIF(C5:Q5,\"abs\")","v":0}]
[null,null,null,null,null,null,null,null,null,null,null,null,null,null,null,null,null,{"$f":"somcoul(C6:Q6,\"rouge\")","v":0},{"$f":"COUNTIF(C6:Q6,(\"g\"))","v":0},{"$f":"COUNTIF(C6:Q6,(\"c\"))","v":0},{"$f":"COUNTIF(C6:Q6,\"abs\")","v":0}]
[null,null,null,null,null,null,null,null,null,null,null,null,null,null,null,null,null,0,0,0,0]
[null,null,null,null,null,null,null,null,null,null,null,null,null,null,null,null,null,0,0,0,0]
[null,null,null,null,null,null,null,null,null,null,null,null,null,null,null,null,null,0,0,0,0]
[null,null,null,null,null,null,null,null,null,null,null,null,null,null,null,null,null,0,0,0,0]
[null,null,null,null,null,null,null,null,null,null,null,null,null,null,null,null,null,0,0,0,0]
[null,null,null,null,null,null,null,null,null,null,null,null,null,null,null,null,null,0,0,0,0]
[null,null,null,null,null,null,null,null,null,null,null,null,null,null,null,null,null,0,0,0,0," ",null," ",null,null,"                                    "]
[null,null,null,null,null,null,null,null,null,null,null,null,null,null,null,null,null,0,0,0,0]
[null,null,null,null,null,null,null,null,null,null,null,null,null,null,null,null,null,0,0,0,0]
[null,null,null,null,null,null,null,null,null,null,null,null,null,null,null,null,null,0,0,0,0]
[null,null,null,null,null,null,null,null,null,null,null,null,null,null,null,null,null,0,0,0,0]
[null,null,null,null,null,null,null,null,null,null,null,null,null,null,null,null,null,0,0,0,0]
[null,null,null,null,null,null,null,null,null,null,null,null,null,null,null,null,null,0,0,0,0]
[null,null,null,null,null,null,null,null,null,null,null,null,null,null,null,null,null,0,0,0,0]
[null,null,null,null,null,null,null,null,null,null,null,null,null,null,null,null,null,0,0,0,0]
[null,null,null,null,null,null,null,null,null,null,null,null,null,null,null,null,null,0,0,0,0]
[null,null,null,null,null,null,null,null,null,null,null,null,null,null,null,null,null,0,0,0,0]
[null,null,null,null,null,null,null,null,null,null,null,null,null,null,null,null,null,0,0,0,0]
[null,null,null,null,null,null,null,null,null,null,null,null,null,null,null,null,null,0,0,0,0]
[null,null,null,null,null,null,null,null,null,null,null,null,null,null,null,null,null,0,0,0,0]
[null,null,null,null,null,null,null,null,null,null,null,null,null,null,null,null,null,0,0,0,0]
[null,null,null,null,null,null,null,null,null,null,null,null,null,null,null,null,null,0,0,0,0]
[null,null,null,null,null,null,null,null,null,null,null,null,null,null,null,null,null,0,0,0,0]
[null,null,null,null,null,null,null,null,null,null,null,null,null,null,null,null,null,0,0,0,0]
[null,null,null,null,null,null,null,null,null,null,null,null,null,null,null,null,null,{"$f":"somcoul(C31:Q31,\"rouge\")","v":0},{"$f":"COUNTIF(C31:Q31,(\"g\"))","v":0},{"$f":"COUNTIF(C31:Q31,(\"c\"))","v":0},{"$f":"COUNTIF(C31:Q31,\"abs\")","v":0}]
[null,null,null,null,null,null,null,null,null,null,null,null,null,null,null,null,null,0,0,0,0]
[null,null,null,null,null,null,null,null,null,null,null,null,null,null,null,null,null,0,0,0,0]
[null,null,null,null,null,null,null,null,null,null,null,null,null,null,null,null,null,0,0,0,0]
[null,null,null,null,null,null,null,null,null,null,null,null,null,null,null,null,null,0,0,0,0]
[null,null,null,null,null,null,null,null,null,null,null,null,null,null,null,null,null,0,0,0,0]
[null,null,null,null,null,null,null,null,null,null,null,null,null,null,null,null,null,0,0,0,0]
[null,null,null,null,null,null,null,null,null,null,null,null,null,null,null,null,null,0,0,0,0]
[null,null,null,null,null,null,null,null,null,null,null,null,null,null,null,null,null,0,0,0,0]
[null,null,null,null,null,null,null,null,null,null,null,null,null,null,null,null,null,0,0,0,0]
[null,null,null,null,null,null,null,null,null,null,null,null,null,null,null,null,null,0,0,0,0]
[null,null,null,null,null,null,null,null,null,null,null,null,null,null,null,null,null,0,0,0,0]
[null,null,null,null,null,null,null,null,null,null,null,null,null,null,null,null,null,0,0,0,0]
[null,null,null,null,null,null,null,null,null,null,null,null,null,null,null,null,null,0,0,0,0]
[null,null,null,null,null,null,null,null,null,null,null,null,null,null,null,null,null,0,0,0,0]
[null,null,null,null,null,null,null,null,null,null,null,null,null,null,null,null,null,0,0,0,0]
[null,null,null,null,null,null,null,null,null,null,null,null,null,null,null,null,null,0,0,0,0]
[null,null,null,null,null,null,null,null,null,null,null,null,null,null,null,null,null,0,0,0,0]
[null,null,null,null,null,null,null,null,null,null,null,null,null,null,null,null,null,0,0,0,0]
[null,null,null,null,null,null,null,null,null,null,null,null,null,null,null,null,null,0,0,0,0]
[null,null,null,null,null,null,null,null,null,null,null,null,null,null,null,null,null,0,0,0,0]
[null,null,null,null,null,null,null,null,null,null,null,null,null,null,null,null,null,0,0,0,0]
[null,null,null,null,null,null,null,null,null,null,null,null,null,null,null,null,null,0,0,0,0]
[null,null,null,null,null,null,null,null,null,null,null,null,null,null,null,null,null,0,0,0,0]
[null,null,null,null,null,null,null,null,null,null,null,null,null,null,null,null,null,0,0,0,0]
[null,null,null,null,null,null,null,null,null,null,null,null,null,null,null,null,null,0,0,0,0]
[null,null,null,null,null,null,null,null,null,null,null,null,null,null,null,null,null,0,0,0,0]
[null,null,null,null,null,null,null,null,null,null,null,null,null,null,null,null,null,0,0,0,0]
[null,null,null,null,null,null,null,null,null,null,null,null,null,null,null,null,null,0,0,0,0]
[null,null,null,null,null,null,null,null,null,null,null,null,null,null,null,null,null,0,0,0,0]
[null,null,null,null,null,null,null,null,null,null,null,null,null,null,null,null,null,0,0,0,0]
[null,null,null,null,null,null,null,null,null,null,null,null,null,null,null,null,null,0,0,0,0]
[null,null,null,null,null,null,null,null,null,null,null,null,null,null,null,null,null,0,0,0,0]
[null,null,null,null,null,null,null,null,null,null,null,null,null,null,null,null,null,0,0,0,0]
[null,null,null,null,null,null,null,null,null,null,null,null,null,null,null,null,null,0,0,0,0]
[null,null,null,null,null,null,null,null,null,null,null,null,null,null,null,null,null,0,0,0,0]
[null,null,null,null,null,null,null,null,null,null,null,null,null,null,null,null,null,0,0,0,0]
[null,null,null,null,null,null,null,null,null,null,null,null,null,null,null,null,null,0,0,0,0]
[null,null,null,null,null,null,null,null,null,null,null,null,null,null,null,null,null,0,0,0,0]
[null,null,null,null,null,null,null,null,null,null,null,null,null,null,null,null,null,0,0,0,{"$f":"COUNTIF(C70:Q70,\"abs\")","v":0}]
[null,null,null,null,null,null,null,null,null,null,null,null,null,null,null,null,null,0,0,0,0]
[null,null,null,null,null,null,null,null,null,null,null,null,null,null,null,null,null,0,0,0,0]
[null,null,null,null,null,null,null,null,null,null,null,null,null,null,null,null,null,0,0,0,0]
[null,null,null,null,null,null,null,null,null,null,null,null,null,null,null,null,null,0,0,0,0]
[null,null,null,null,null,null,null,null,null,null,null,null,null,null,null,null,null,0,0,0,0]
[null,null,null,null,null,null,null,null,null,null,null,null,null,null,null,null,null,0,0,0,0]
[null,null,null,null,null,null,null,null,null,null,null,null,null,null,null,null,null,0,0,0,0]
[null,null,null,null,null,null,null,null,null,null,null,null,null,null,null,null,null,0,0,0,0]
[null,null,null,null,null,null,null,null,null,null,null,null,null,null,null,null,null,0,0,0,0]
[null,null,null,null,null,null,null,null,null,null,null,null,null,null,null,null,null,0,0,0,0]
[null,null,null,null,null,null,null,null,null,null,null,null,null,null,null,null,null,0,0,0,0]
[null,null,null,null,null,null,null,null,null,null,null,null,null,null,null,null,null,0,0,0,0]
[null,null,null,null,null,null,null,null,null,null,null,null,null,null,null,null,null,0,0,0,0]
[null,null,null,null,null,null,null,null,null,null,null,null,null,null,null,null,null,0,0,0,0]
[null,null,null,null,null,null,null,null,null,null,null,null,null,null,null,null,null,0,0,0,0]
[null,null,null,null,null,null,null,null,null,null,null,null,null,null,null,null,null,0,0,0,0]
[null,null,null,null,null,null,null,null,null,null,null,null,null,null,null,null,null,0,0,0,0]
[null,null,null,null,null,null,null,null,null,null,null,null,null,null,null,null,null,0,0,0,0]
[null,null,null,null,null,null,null,null,null,null,null,null,null,null,null,null,null,0,0,0,0]
[null,null,null,null,null,null,null,null,null,null,null,null,null,null,null,null,null,0,0,0,0]
[null,null,null,null,null,null,null,null,null,null,null,null,null,null,null,null,null,0,0,0,0]
[null,null,null,null,null,null,null,null,null,null,null,null,null,null,null,null,null,0,0,0,0]
[null,null,null,null,null,null,null,null,null,null,null,null,null,null,null,null,null,0,0,0,0]
[null,null,null,null,null,null,null,null,null,null,null,null,null,null,null,null,null,0,0,0,{"$f":"COUNTIF(C94:Q94,\"abs\")","v":0}]
[null,"Totaux",{"$f":"COUNTIF(C5:C94,\"abs\")","v":0},null,null,{"$f":"COUNTIF(F5:F94,\"abs\")","v":0},null,null,{"$f":"COUNTIF(I5:I94,\"abs\")","v":0},null,null,{"$f":"COUNTIF(L5:L94,\"abs\")","v":0},null,null,{"$f":"COUNTIF(O5:O94,\"abs\")","v":0},null,null,{"$f":"SUM(R5:R94)","v":0},{"$f":"SUM(S5:S94)","v":0},{"$f":"SUM(T5:T94)","v":0},{"$f":"SUM(U5:U94)","v":0}]
[null,null,{"$f":"somcoul(C5:C94,\"rouge\")","v":0},{"$f":"COUNTIF(D5:D94,\"g\")","v":0},{"$f":"COUNTIF(E5:E94,\"c\")","v":0},{"$f":"somcoul(F5:F94,\"rouge\")","v":0},{"$f":"COUNTIF(G5:G94,\"g\")","v":0},{"$f":"COUNTIF(H5:H94,\"c\")","v":0},{"$f":"somcoul(I5:I94,\"rouge\")","v":0},{"$f":"COUNTIF(J6:J94,\"g\")","v":0},{"$f":"COUNTIF(K5:K94,\"c\")","v":0},{"$f":"somcoul(L5:L94,\"rouge\")","v":0},{"$f":"COUNTIF(M5:M94,\"g\")","v":0},{"$f":"COUNTIF(N6:N94,\"c\")","v":0},{"$f":"somcoul(O5:O94,\"rouge\")","v":0},{"$f":"COUNTIF(P5:P94,\"g\")","v":0},{"$f":"COUNTIF(Q5:Q94,\"c\")","v":0}]
[null,"6h30/8h00",{"$f":"COUNTIF(C5:C94,\"6h30/8h00\")","v":0},null,null,{"$f":"COUNTIF(F5:F94,\"6h30/8h00\")","v":0},null,null,{"$f":"COUNTIF(I5:I94,\"6h30/8h00\")","v":0},null,null,{"$f":"COUNTIF(L5:L94,\"6h30/8h00\")","v":0},null,null,{"$f":"COUNTIF(O5:O94,\"6h30/8h00\")","v":0},null,null,{"$f":"SUM(C97:Q97)","v":0}]
[null,"7h00/9h00",{"$f":"COUNTIF(C5:C94,\"7h00/9h00\")","v":0},null,null,{"$f":"COUNTIF(F5:F94,\"7h00/9h00\")","v":0},null,null,{"$f":"COUNTIF(I5:I94,\"7h00/9h00\")","v":0},null,null,{"$f":"COUNTIF(L5:L94,\"7h00/9h00\")","v":0},null,null,{"$f":"COUNTIF(O5:O94,\"7h00/9h00\")","v":0},null,null,0]
[null,"8h00/10h00",{"$f":"COUNTIF(C5:C94,\"8h00/10h00\")","v":0},null,null,{"$f":"COUNTIF(F5:F94,\"8h00/10h00\")","v":0},null,null,{"$f":"COUNTIF(I5:I94,\"8h00/10h00\")","v":0},null,null,{"$f":"COUNTIF(L5:L94,\"8h00/10h00\")","v":0},null,null,{"$f":"COUNTIF(O5:O94,\"8h00/10h00\")","v":0},null,null,0]
[null,"9h00/11h00",{"$f":"COUNTIF(C5:C94,\"9h00/11h00\")","v":0},null,null,{"$f":"COUNTIF(F5:F94,\"9h00/11h00\")","v":0},null,null,{"$f":"COUNTIF(I5:I94,\"9h00/11h00\")","v":0},null,null,{"$f":"COUNTIF(L5:L94,\"9h00/11h00\")","v":0},null,null,{"$f":"COUNTIF(O5:O94,\"9h00/11h00\")","v":0},null,null,0]
[null,"10h00/12h00",{"$f":"COUNTIF(C5:C94,\"10h00/12h00\")","v":0},null,null,{"$f":"COUNTIF(F5:F94,\"10h00/12h00\")","v":0},null,null,{"$f":"COUNTIF(I5:I94,\"10h00/12h00\")","v":0},null,null,{"$f":"COUNTIF(L5:L94,\"10h00/12h00\")","v":0},null,null,{"$f":"COUNTIF(O5:O94,\"10h00/12h00\")","v":0},null,null,0]
[null,"11h00/13h00",{"$f":"COUNTIF(C5:C94,\"11h00/13h00\")","v":0},null,null,{"$f":"COUNTIF(F5:F94,\"11h00/13h00\")","v":0},null,null,{"$f":"COUNTIF(I5:I94,\"11h00/13h00\")","v":0},null,null,{"$f":"COUNTIF(L5:L94,\"11h00/13h00\")","v":0},null,null,{"$f":"COUNTIF(O5:O94,\"11h00/13h00\")","v":0},null,null,0]
[null,"13h00/15h00",{"$f":"COUNTIF(C5:C94,\"13h00/15h00\")","v":0},null,null,{"$f":"COUNTIF(F5:F94,\"13h00/15h00\")","v":0},null,null,{"$f":"COUNTIF(I5:I94,\"13h00/15h00\")","v":0},null,null,{"$f":"COUNTIF(L5:L94,\"13h00/15h00\")","v":0},null,null,{"$f":"COUNTIF(O5:O94,\"13h00/15h00\")","v":0},null,null,0]
[null,"13h30/15h30",{"$f":"COUNTIF(C5:C94,\"13h30/15h30\")","v":0},null,null,{"$f":"COUNTIF(F5:F94,\"13h30/15h30\")","v":0},null,null,{"$f":"COUNTIF(I5:I94,\"13h30/15h30\")","v":0},null,null,{"$f":"COUNTIF(L5:L94,\"13h30/15h30\")","v":0},null,null,{"$f":"COUNTIF(O5:O94,\"13h30/15h30\")","v":0},null,null,0]
[null,"15h00/17h00",{"$f":"COUNTIF(C5:C94,\"15h00/17h00\")","v":0},null,null,{"$f":"COUNTIF(F5:F94,\"15h00/17h00\")","v":0},null,null,{"$f":"COUNTIF(I5:I94,\"15h00/17h00\")","v":0},null,null,{"$f":"COUNTIF(L5:L94,\"15h00/17h00\")","v":0},null,null,{"$f":"COUNTIF(O5:O94,\"15h00/17h00\")","v":0},null,null,0]
[null,"16h00/18h00",{"$f":"COUNTIF(C5:C94,\"16h00/18h00\")","v":0},null,null,{"$f":"COUNTIF(F5:F94,\"16h00/18h00\")","v":0},null,null,{"$f":"COUNTIF(I5:I94,\"16h00/18h00\")","v":0},null,null,{"$f":"COUNTIF(L5:L94,\"16h00/18h00\")","v":0},null,null,{"$f":"COUNTIF(O5:O94,\"16h00/18h00\")","v":0},null,null,0]
[null,"17h00/19h00",{"$f":"COUNTIF(C5:C94,\"17h00/19h00\")","v":0},null,null,{"$f":"COUNTIF(F5:F94,\"17h00/19h00\")","v":0},null,null,{"$f":"COUNTIF(I5:I94,\"17h00/19h00\")","v":0},null,null,{"$f":"COUNTIF(L5:L94,\"17h00/19h00\")","v":0},null,null,{"$f":"COUNTIF(O5:O94,\"17h00/19h00\")","v":0},null,null,0]
[null,"18h00/20h00",{"$f":"COUNTIF(C5:C94,\"18h00/20h00\")","v":0},null,null,{"$f":"COUNTIF(F5:F94,\"18h00/20h00\")","v":0},null,null,{"$f":"COUNTIF(I5:I94,\"18h00/20h00\")","v":0},null,null,{"$f":"COUNTIF(L5:L94,\"18h00/20h00\")","v":0},null,null,{"$f":"COUNTIF(O5:O94,\"18h00/20h00\")","v":0},null,null,0]
[null,"19h00/21h00",{"$f":"COUNTIF(C5:C94,\"19h00/21h00\")","v":0},null,null,{"$f":"COUNTIF(F5:F94,\"19h00/21h00\")","v":0},null,null,{"$f":"COUNTIF(I5:I94,\"19h00/21h00\")","v":0},null,null,{"$f":"COUNTIF(L5:L94,\"19h00/21h00\")","v":0},null,null,{"$f":"COUNTIF(O5:O94,\"19h00/21h00\")","v":0},null,null,0]
[null,"21h00/23h00",{"$f":"COUNTIF(C5:C94,\"21h00/23h00\")","v":0},null,null,{"$f":"COUNTIF(F5:F94,\"21h00/23h00\")","v":0},null,null,{"$f":"COUNTIF(I5:I94,\"21h00/23h00\")","v":0},null,null,{"$f":"COUNTIF(L5:L94,\"21h00/23h00\")","v":0},null,null,{"$f":"COUNTIF(O5:O94,\"21h00/23h00\")","v":0},null,null,0]
[null,"22h00/23h00",{"$f":"COUNTIF(C5:C94,\"22h00/23h00\")","v":0},null,null,{"$f":"COUNTIF(F5:F94,\"22h00/23h00\")","v":0},null,null,{"$f":"COUNTIF(I5:I94,\"22h00/23h00\")","v":0},null,null,{"$f":"COUNTIF(L5:L94,\"22h00/23h00\")","v":0},null,null,{"$f":"COUNTIF(O5:O94,\"22h00/23h00\")","v":0},null,null,0]

{"sheet":"G","index":7,"n_rows":111,"n_cols":27,"rows_kept":111,"cut":false,"hidden":false,"merged":[[1,24,1,26],[94,20,95,20],[96,2,96,4],[96,5,96,7],[96,8,96,10],[96,11,96,13],[96,14,96,16],[96,17,96,20],[1,1,1,21],[94,1,95,1],[94,2,94,4],[94,5,94,7],[94,8,94,10],[94,11,94,13],[94,14,94,16],[94,17,95,17],[94,18,95,18],[94,19,95,19],[98,2,98,4],[98,5,98,7],[98,8,98,10],[98,11,98,13],[98,14,98,16],[98,17,98,20],[97,2,97,4],[97,5,97,7],[97,8,97,10],[97,11,97,13],[97,14,97,16],[97,17,97,20],[100,2,100,4],[100,5,100,7],[100,8,100,10],[100,11,100,13],[100,14,100,16],[100,17,100,20],[99,2,99,4],[99,5,99,7],[99,8,99,10],[99,11,99,13],[99,14,99,16],[99,17,99,20],[102,2,102,4],[102,5,102,7],[102,8,102,10],[102,11,102,13],[102,14,102,16],[102,17,102,20],[101,2,101,4],[101,5,101,7],[101,8,101,10],[101,11,101,13],[101,14,101,16],[101,17,101,20],[104,2,104,4],[104,5,104,7],[104,8,104,10],[104,11,104,13],[104,14,104,16],[104,17,104,20],[103,2,103,4],[103,5,103,7],[103,8,103,10],[103,11,103,13],[103,14,103,16],[103,17,103,20],[106,2,106,4],[106,5,106,7],[106,8,106,10],[106,11,106,13],[106,14,106,16],[106,17,106,20],[105,2,105,4],[105,5,105,7],[105,8,105,10],[105,11,105,13],[105,14,105,16],[105,17,105,20],[108,2,108,4],[108,5,108,7],[108,8,108,10],[108,11,108,13],[108,14,108,16],[108,17,108,20],[107,2,107,4],[107,5,107,7],[107,8,107,10],[107,11,107,13],[107,14,107,16],[107,17,107,20],[110,2,110,4],[110,5,110,7],[110,8,110,10],[110,11,110,13],[110,14,110,16],[110,17,110,20],[109,2,109,4],[109,5,109,7],[109,8,109,10],[109,11,109,13],[109,14,109,16],[109,17,109,20]]}
[]
[null,11,null,null,null,null,null,null,null,null,null,null,null,null,null,null,null,null,null,null,null,null,null,null,{"$f":"IF(S95+T95<>R95,\"FAUX\",\"OK\")","v":"OK"}]
[null,null,null,null,null,null,null,null,null,null,null,null,null,null,null,null,null,null,null,null,null,null,null,null,"Total","G","C"]
[null,"Noms",{"$f":"IF(ISNUMBER(B2),7*B2+DATE(Année,1,3)-WEEKDAY(DATE(Année,1,3))-5,\"\")","v":"2016-03-14"},"G","C",{"$f":"C4+1","v":"2016-03-15"},"G","C",{"$f":"F4+1","v":"2016-03-16"},"G","C",{"$f":"I4+1","v":"2016-03-17"},"G","C",{"$f":"L4+1","v":"2016-03-18"},"G","C","Total","G","B","Abs",null,null,null,{"$f":"R95","v":0},{"$f":"S95","v":0},{"$f":"T95","v":0}]
[null,null,null,null,null,null,null,null,null,null,null,null,null,null,null,null,null,{"$f":"somcoul(C5:Q5,\"rouge\")","v":0},{"$f":"COUNTIF(C5:Q5,(\"g\"))","v":0},{"$f":"COUNTIF(C5:Q5,(\"c\"))","v":0},{"$f":"COUNTIF(C5:Q5,\"abs\")","v":0}]
[null,null,null,null,null,null,null,null,null,null,null,null,null,null,null,null,null,{"$f":"somcoul(C6:Q6,\"rouge\")","v":0},{"$f":"COUNTIF(C6:Q6,(\"g\"))","v":0},{"$f":"COUNTIF(C6:Q6,(\"c\"))","v":0},{"$f":"COUNTIF(C6:Q6,\"abs\")","v":0}]
[null,null,null,null,null,null,null,null,null,null,null,null,null,null,null,null,null,0,0,0,0]
[null,null,null,null,null,null,null,null,null,null,null,null,null,null,null,null,null,0,0,0,0]
[null,null,null,null,null,null,null,null,null,null,null,null,null,null,null,null,null,0,0,0,0]
[null,null,null,null,null,null,null,null,null,null,null,null,null,null,null,null,null,0,0,0,0]
[null,null,null,null,null,null,null,null,null,null,null,null,null,null,null,null,null,0,0,0,0]
[null,null,null,null,null,null,null,null,null,null,null,null,null,null,null,null,null,0,0,0,0]
[null,null,null,null,null,null,null,null,null,null,null,null,null,null,null,null,null,0,0,0,0," ",null," ",null,null,"                                    "]
[null,null,null,null,null,null,null,null,null,null,null,null,null,null,null,null,null,0,0,0,0]
[null,null,null,null,null,null,null,null,null,null,null,null,null,null,null,null,null,0,0,0,0]
[null,null,null,null,null,null,null,null,null,null,null,null,null,null,null,null,null,0,0,0,0]
[null,null,null,null,null,null,null,null,null,null,null,null,null,null,null,null,null,0,0,0,0]
[null,null,null,null,null,null,null,null,null,null,null,null,null,null,null,null,null,0,0,0,0]
[null,null,null,null,null,null,null,null,null,null,null,null,null,null,null,null,null,0,0,0,0]
[null,null,null,null,null,null,null,null,null,null,null,null,null,null,null,null,null,0,0,0,0]
[null,null,null,null,null,null,null,null,null,null,null,null,null,null,null,null,null,0,0,0,0]
[null,null,null,null,null,null,null,null,null,null,null,null,null,null,null,null,null,0,0,0,0]
[null,null,null,null,null,null,null,null,null,null,null,null,null,null,null,null,null,0,0,0,0]
[null,null,null,null,null,null,null,null,null,null,null,null,null,null,null,null,null,0,0,0,0]
[null,null,null,null,null,null,null,null,null,null,null,null,null,null,null,null,null,0,0,0,0]
[null,null,null,null,null,null,null,null,null,null,null,null,null,null,null,null,null,0,0,0,0]
[null,null,null,null,null,null,null,null,null,null,null,null,null,null,null,null,null,0,0,0,0]
[null,null,null,null,null,null,null,null,null,null,null,null,null,null,null,null,null,0,0,0,0]
[null,null,null,null,null,null,null,null,null,null,null,null,null,null,null,null,null,0,0,0,0]
[null,null,null,null,null,null,null,null,null,null,null,null,null,null,null,null,null,0,0,0,0]
[null,null,null,null,null,null,null,null,null,null,null,null,null,null,null,null,null,{"$f":"somcoul(C31:Q31,\"rouge\")","v":0},{"$f":"COUNTIF(C31:Q31,(\"g\"))","v":0},{"$f":"COUNTIF(C31:Q31,(\"c\"))","v":0},{"$f":"COUNTIF(C31:Q31,\"abs\")","v":0}]
[null,null,null,null,null,null,null,null,null,null,null,null,null,null,null,null,null,0,0,0,0]
[null,null,null,null,null,null,null,null,null,null,null,null,null,null,null,null,null,0,0,0,0]
[null,null,null,null,null,null,null,null,null,null,null,null,null,null,null,null,null,0,0,0,0]
[null,null,null,null,null,null,null,null,null,null,null,null,null,null,null,null,null,0,0,0,0]
[null,null,null,null,null,null,null,null,null,null,null,null,null,null,null,null,null,0,0,0,0]
[null,null,null,null,null,null,null,null,null,null,null,null,null,null,null,null,null,0,0,0,0]
[null,null,null,null,null,null,null,null,null,null,null,null,null,null,null,null,null,0,0,0,0]
[null,null,null,null,null,null,null,null,null,null,null,null,null,null,null,null,null,0,0,0,0]
[null,null,null,null,null,null,null,null,null,null,null,null,null,null,null,null,null,0,0,0,0]
[null,null,null,null,null,null,null,null,null,null,null,null,null,null,null,null,null,0,0,0,0]
[null,null,null,null,null,null,null,null,null,null,null,null,null,null,null,null,null,0,0,0,0]
[null,null,null,null,null,null,null,null,null,null,null,null,null,null,null,null,null,0,0,0,0]
[null,null,null,null,null,null,null,null,null,null,null,null,null,null,null,null,null,0,0,0,0]
[null,null,null,null,null,null,null,null,null,null,null,null,null,null,null,null,null,0,0,0,0]
[null,null,null,null,null,null,null,null,null,null,null,null,null,null,null,null,null,0,0,0,0]
[null,null,null,null,null,null,null,null,null,null,null,null,null,null,null,null,null,0,0,0,0]
[null,null,null,null,null,null,null,null,null,null,null,null,null,null,null,null,null,0,0,0,0]
[null,null,null,null,null,null,null,null,null,null,null,null,null,null,null,null,null,0,0,0,0]
[null,null,null,null,null,null,null,null,null,null,null,null,null,null,null,null,null,0,0,0,0]
[null,null,null,null,null,null,null,null,null,null,null,null,null,null,null,null,null,0,0,0,0]
[null,null,null,null,null,null,null,null,null,null,null,null,null,null,null,null,null,0,0,0,0]
[null,null,null,null,null,null,null,null,null,null,null,null,null,null,null,null,null,0,0,0,0]
[null,null,null,null,null,null,null,null,null,null,null,null,null,null,null,null,null,0,0,0,0]
[null,null,null,null,null,null,null,null,null,null,null,null,null,null,null,null,null,0,0,0,0]
[null,null,null,null,null,null,null,null,null,null,null,null,null,null,null,null,null,0,0,0,0]
[null,null,null,null,null,null,null,null,null,null,null,null,null,null,null,null,null,0,0,0,0]
[null,null,null,null,null,null,null,null,null,null,null,null,null,null,null,null,null,0,0,0,0]
[null,null,null,null,null,null,null,null,null,null,null,null,null,null,null,null,null,0,0,0,0]
[null,null,null,null,null,null,null,null,null,null,null,null,null,null,null,null,null,0,0,0,0]
[null,null,null,null,null,null,null,null,null,null,null,null,null,null,null,null,null,0,0,0,0]
[null,null,null,null,null,null,null,null,null,null,null,null,null,null,null,null,null,0,0,0,0]
[null,null,null,null,null,null,null,null,null,null,null,null,null,null,null,null,null,0,0,0,0]
[null,null,null,null,null,null,null,null,null,null,null,null,null,null,null,null,null,0,0,0,0]
[null,null,null,null,null,null,null,null,null,null,null,null,null,null,null,null,null,0,0,0,0]
[null,null,null,null,null,null,null,null,null,null,null,null,null,null,null,null,null,0,0,0,0]
[null,null,null,null,null,null,null,null,null,null,null,null,null,null,null,null,null,0,0,0,0]
[null,null,null,null,null,null,null,null,null,null,null,null,null,null,null,null,null,0,0,0,0]
[null,null,null,null,null,null,null,null,null,null,null,null,null,null,null,null,null,0,0,0,0]
[null,null,null,null,null,null,null,null,null,null,null,null,null,null,null,null,null,0,0,0,{"$f":"COUNTIF(C70:Q70,\"abs\")","v":0}]
[null,null,null,null,null,null,null,null,null,null,null,null,null,null,null,null,null,0,0,0,0]
[null,null,null,null,null,null,null,null,null,null,null,null,null,null,null,null,null,0,0,0,0]
[null,null,null,null,null,null,null,null,null,null,null,null,null,null,null,null,null,0,0,0,0]
[null,null,null,null,null,null,null,null,null,null,null,null,null,null,null,null,null,0,0,0,0]
[null,null,null,null,null,null,null,null,null,null,null,null,null,null,null,null,null,0,0,0,0]
[null,null,null,null,null,null,null,null,null,null,null,null,null,null,null,null,null,0,0,0,0]
[null,null,null,null,null,null,null,null,null,null,null,null,null,null,null,null,null,0,0,0,0]
[null,null,null,null,null,null,null,null,null,null,null,null,null,null,null,null,null,0,0,0,0]
[null,null,null,null,null,null,null,null,null,null,null,null,null,null,null,null,null,0,0,0,0]
[null,null,null,null,null,null,null,null,null,null,null,null,null,null,null,null,null,0,0,0,0]
[null,null,null,null,null,null,null,null,null,null,null,null,null,null,null,null,null,0,0,0,0]
[null,null,null,null,null,null,null,null,null,null,null,null,null,null,null,null,null,0,0,0,0]
[null,null,null,null,null,null,null,null,null,null,null,null,null,null,null,null,null,0,0,0,0]
[null,null,null,null,null,null,null,null,null,null,null,null,null,null,null,null,null,0,0,0,0]
[null,null,null,null,null,null,null,null,null,null,null,null,null,null,null,null,null,0,0,0,0]
[null,null,null,null,null,null,null,null,null,null,null,null,null,null,null,null,null,0,0,0,0]
[null,null,null,null,null,null,null,null,null,null,null,null,null,null,null,null,null,0,0,0,0]
[null,null,null,null,null,null,null,null,null,null,null,null,null,null,null,null,null,0,0,0,0]
[null,null,null,null,null,null,null,null,null,null,null,null,null,null,null,null,null,0,0,0,0]
[null,null,null,null,null,null,null,null,null,null,null,null,null,null,null,null,null,0,0,0,0]
[null,null,null,null,null,null,null,null,null,null,null,null,null,null,null,null,null,0,0,0,0]
[null,null,null,null,null,null,null,null,null,null,null,null,null,null,null,null,null,0,0,0,0]
[null,null,null,null,null,null,null,null,null,null,null,null,null,null,null,null,null,0,0,0,0]
[null,null,null,null,null,null,null,null,null,null,null,null,null,null,null,null,null,0,0,0,{"$f":"COUNTIF(C94:Q94,\"abs\")","v":0}]
[null,"Totaux",{"$f":"COUNTIF(C5:C94,\"abs\")","v":0},null,null,{"$f":"COUNTIF(F5:F94,\"abs\")","v":0},null,null,{"$f":"COUNTIF(I5:I94,\"abs\")","v":0},null,null,{"$f":"COUNTIF(L5:L94,\"abs\")","v":0},null,null,{"$f":"COUNTIF(O5:O94,\"abs\")","v":0},null,null,{"$f":"SUM(R5:R94)","v":0},{"$f":"SUM(S5:S94)","v":0},{"$f":"SUM(T5:T94)","v":0},{"$f":"SUM(U5:U94)","v":0}]
[null,null,{"$f":"somcoul(C5:C94,\"rouge\")","v":0},{"$f":"COUNTIF(D5:D94,\"g\")","v":0},{"$f":"COUNTIF(E5:E94,\"c\")","v":0},{"$f":"somcoul(F5:F94,\"rouge\")","v":0},{"$f":"COUNTIF(G5:G94,\"g\")","v":0},{"$f":"COUNTIF(H5:H94,\"c\")","v":0},{"$f":"somcoul(I5:I94,\"rouge\")","v":0},{"$f":"COUNTIF(J6:J94,\"g\")","v":0},{"$f":"COUNTIF(K5:K94,\"c\")","v":0},{"$f":"somcoul(L5:L94,\"rouge\")","v":0},{"$f":"COUNTIF(M5:M94,\"g\")","v":0},{"$f":"COUNTIF(N6:N94,\"c\")","v":0},{"$f":"somcoul(O5:O94,\"rouge\")","v":0},{"$f":"COUNTIF(P5:P94,\"g\")","v":0},{"$f":"COUNTIF(Q5:Q94,\"c\")","v":0}]
[null,"6h30/8h00",{"$f":"COUNTIF(C5:C94,\"6h30/8h00\")","v":0},null,null,{"$f":"COUNTIF(F5:F94,\"6h30/8h00\")","v":0},null,null,{"$f":"COUNTIF(I5:I94,\"6h30/8h00\")","v":0},null,null,{"$f":"COUNTIF(L5:L94,\"6h30/8h00\")","v":0},null,null,{"$f":"COUNTIF(O5:O94,\"6h30/8h00\")","v":0},null,null,{"$f":"SUM(C97:Q97)","v":0}]
[null,"7h00/9h00",{"$f":"COUNTIF(C5:C94,\"7h00/9h00\")","v":0},null,null,{"$f":"COUNTIF(F5:F94,\"7h00/9h00\")","v":0},null,null,{"$f":"COUNTIF(I5:I94,\"7h00/9h00\")","v":0},null,null,{"$f":"COUNTIF(L5:L94,\"7h00/9h00\")","v":0},null,null,{"$f":"COUNTIF(O5:O94,\"7h00/9h00\")","v":0},null,null,0]
[null,"8h00/10h00",{"$f":"COUNTIF(C5:C94,\"8h00/10h00\")","v":0},null,null,{"$f":"COUNTIF(F5:F94,\"8h00/10h00\")","v":0},null,null,{"$f":"COUNTIF(I5:I94,\"8h00/10h00\")","v":0},null,null,{"$f":"COUNTIF(L5:L94,\"8h00/10h00\")","v":0},null,null,{"$f":"COUNTIF(O5:O94,\"8h00/10h00\")","v":0},null,null,0]
[null,"9h00/11h00",{"$f":"COUNTIF(C5:C94,\"9h00/11h00\")","v":0},null,null,{"$f":"COUNTIF(F5:F94,\"9h00/11h00\")","v":0},null,null,{"$f":"COUNTIF(I5:I94,\"9h00/11h00\")","v":0},null,null,{"$f":"COUNTIF(L5:L94,\"9h00/11h00\")","v":0},null,null,{"$f":"COUNTIF(O5:O94,\"9h00/11h00\")","v":0},null,null,0]
[null,"10h00/12h00",{"$f":"COUNTIF(C5:C94,\"10h00/12h00\")","v":0},null,null,{"$f":"COUNTIF(F5:F94,\"10h00/12h00\")","v":0},null,null,{"$f":"COUNTIF(I5:I94,\"10h00/12h00\")","v":0},null,null,{"$f":"COUNTIF(L5:L94,\"10h00/12h00\")","v":0},null,null,{"$f":"COUNTIF(O5:O94,\"10h00/12h00\")","v":0},null,null,0]
[null,"11h00/13h00",{"$f":"COUNTIF(C5:C94,\"11h00/13h00\")","v":0},null,null,{"$f":"COUNTIF(F5:F94,\"11h00/13h00\")","v":0},null,null,{"$f":"COUNTIF(I5:I94,\"11h00/13h00\")","v":0},null,null,{"$f":"COUNTIF(L5:L94,\"11h00/13h00\")","v":0},null,null,{"$f":"COUNTIF(O5:O94,\"11h00/13h00\")","v":0},null,null,0]
[null,"13h00/15h00",{"$f":"COUNTIF(C5:C94,\"13h00/15h00\")","v":0},null,null,{"$f":"COUNTIF(F5:F94,\"13h00/15h00\")","v":0},null,null,{"$f":"COUNTIF(I5:I94,\"13h00/15h00\")","v":0},null,null,{"$f":"COUNTIF(L5:L94,\"13h00/15h00\")","v":0},null,null,{"$f":"COUNTIF(O5:O94,\"13h00/15h00\")","v":0},null,null,0]
[null,"13h30/15h30",{"$f":"COUNTIF(C5:C94,\"13h30/15h30\")","v":0},null,null,{"$f":"COUNTIF(F5:F94,\"13h30/15h30\")","v":0},null,null,{"$f":"COUNTIF(I5:I94,\"13h30/15h30\")","v":0},null,null,{"$f":"COUNTIF(L5:L94,\"13h30/15h30\")","v":0},null,null,{"$f":"COUNTIF(O5:O94,\"13h30/15h30\")","v":0},null,null,0]
[null,"15h00/17h00",{"$f":"COUNTIF(C5:C94,\"15h00/17h00\")","v":0},null,null,{"$f":"COUNTIF(F5:F94,\"15h00/17h00\")","v":0},null,null,{"$f":"COUNTIF(I5:I94,\"15h00/17h00\")","v":0},null,null,{"$f":"COUNTIF(L5:L94,\"15h00/17h00\")","v":0},null,null,{"$f":"COUNTIF(O5:O94,\"15h00/17h00\")","v":0},null,null,0]
[null,"16h00/18h00",{"$f":"COUNTIF(C5:C94,\"16h00/18h00\")","v":0},null,null,{"$f":"COUNTIF(F5:F94,\"16h00/18h00\")","v":0},null,null,{"$f":"COUNTIF(I5:I94,\"16h00/18h00\")","v":0},null,null,{"$f":"COUNTIF(L5:L94,\"16h00/18h00\")","v":0},null,null,{"$f":"COUNTIF(O5:O94,\"16h00/18h00\")","v":0},null,null,0]
[null,"17h00/19h00",{"$f":"COUNTIF(C5:C94,\"17h00/19h00\")","v":0},null,null,{"$f":"COUNTIF(F5:F94,\"17h00/19h00\")","v":0},null,null,{"$f":"COUNTIF(I5:I94,\"17h00/19h00\")","v":0},null,null,{"$f":"COUNTIF(L5:L94,\"17h00/19h00\")","v":0},null,null,{"$f":"COUNTIF(O5:O94,\"17h00/19h00\")","v":0},null,null,0]
[null,"18h00/20h00",{"$f":"COUNTIF(C5:C94,\"18h00/20h00\")","v":0},null,null,{"$f":"COUNTIF(F5:F94,\"18h00/20h00\")","v":0},null,null,{"$f":"COUNTIF(I5:I94,\"18h00/20h00\")","v":0},null,null,{"$f":"COUNTIF(L5:L94,\"18h00/20h00\")","v":0},null,null,{"$f":"COUNTIF(O5:O94,\"18h00/20h00\")","v":0},null,null,0]
[null,"19h00/21h00",{"$f":"COUNTIF(C5:C94,\"19h00/21h00\")","v":0},null,null,{"$f":"COUNTIF(F5:F94,\"19h00/21h00\")","v":0},null,null,{"$f":"COUNTIF(I5:I94,\"19h00/21h00\")","v":0},null,null,{"$f":"COUNTIF(L5:L94,\"19h00/21h00\")","v":0},null,null,{"$f":"COUNTIF(O5:O94,\"19h00/21h00\")","v":0},null,null,0]
[null,"21h00/23h00",{"$f":"COUNTIF(C5:C94,\"21h00/23h00\")","v":0},null,null,{"$f":"COUNTIF(F5:F94,\"21h00/23h00\")","v":0},null,null,{"$f":"COUNTIF(I5:I94,\"21h00/23h00\")","v":0},null,null,{"$f":"COUNTIF(L5:L94,\"21h00/23h00\")","v":0},null,null,{"$f":"COUNTIF(O5:O94,\"21h00/23h00\")","v":0},null,null,0]
[null,"22h00/23h00",{"$f":"COUNTIF(C5:C94,\"22h00/23h00\")","v":0},null,null,{"$f":"COUNTIF(F5:F94,\"22h00/23h00\")","v":0},null,null,{"$f":"COUNTIF(I5:I94,\"22h00/23h00\")","v":0},null,null,{"$f":"COUNTIF(L5:L94,\"22h00/23h00\")","v":0},null,null,{"$f":"COUNTIF(O5:O94,\"22h00/23h00\")","v":0},null,null,0]

{"sheet":"H","index":8,"n_rows":111,"n_cols":27,"rows_kept":111,"cut":false,"hidden":false,"merged":[[1,24,1,26],[94,20,95,20],[96,2,96,4],[96,5,96,7],[96,8,96,10],[96,11,96,13],[96,14,96,16],[96,17,96,20],[1,1,1,21],[94,1,95,1],[94,2,94,4],[94,5,94,7],[94,8,94,10],[94,11,94,13],[94,14,94,16],[94,17,95,17],[94,18,95,18],[94,19,95,19],[98,2,98,4],[98,5,98,7],[98,8,98,10],[98,11,98,13],[98,14,98,16],[98,17,98,20],[97,2,97,4],[97,5,97,7],[97,8,97,10],[97,11,97,13],[97,14,97,16],[97,17,97,20],[100,2,100,4],[100,5,100,7],[100,8,100,10],[100,11,100,13],[100,14,100,16],[100,17,100,20],[99,2,99,4],[99,5,99,7],[99,8,99,10],[99,11,99,13],[99,14,99,16],[99,17,99,20],[102,2,102,4],[102,5,102,7],[102,8,102,10],[102,11,102,13],[102,14,102,16],[102,17,102,20],[101,2,101,4],[101,5,101,7],[101,8,101,10],[101,11,101,13],[101,14,101,16],[101,17,101,20],[104,2,104,4],[104,5,104,7],[104,8,104,10],[104,11,104,13],[104,14,104,16],[104,17,104,20],[103,2,103,4],[103,5,103,7],[103,8,103,10],[103,11,103,13],[103,14,103,16],[103,17,103,20],[106,2,106,4],[106,5,106,7],[106,8,106,10],[106,11,106,13],[106,14,106,16],[106,17,106,20],[105,2,105,4],[105,5,105,7],[105,8,105,10],[105,11,105,13],[105,14,105,16],[105,17,105,20],[108,2,108,4],[108,5,108,7],[108,8,108,10],[108,11,108,13],[108,14,108,16],[108,17,108,20],[107,2,107,4],[107,5,107,7],[107,8,107,10],[107,11,107,13],[107,14,107,16],[107,17,107,20],[110,2,110,4],[110,5,110,7],[110,8,110,10],[110,11,110,13],[110,14,110,16],[110,17,110,20],[109,2,109,4],[109,5,109,7],[109,8,109,10],[109,11,109,13],[109,14,109,16],[109,17,109,20]]}
[]
[null,11,null,null,null,null,null,null,null,null,null,null,null,null,null,null,null,null,null,null,null,null,null,null,{"$f":"IF(S95+T95<>R95,\"FAUX\",\"OK\")","v":"OK"}]
[null,null,null,null,null,null,null,null,null,null,null,null,null,null,null,null,null,null,null,null,null,null,null,null,"Total","G","C"]
[null,"Noms",{"$f":"IF(ISNUMBER(B2),7*B2+DATE(Année,1,3)-WEEKDAY(DATE(Année,1,3))-5,\"\")","v":"2016-03-14"},"G","C",{"$f":"C4+1","v":"2016-03-15"},"G","C",{"$f":"F4+1","v":"2016-03-16"},"G","C",{"$f":"I4+1","v":"2016-03-17"},"G","C",{"$f":"L4+1","v":"2016-03-18"},"G","C","Total","G","B","Abs",null,null,null,{"$f":"R95","v":0},{"$f":"S95","v":0},{"$f":"T95","v":0}]
[null,null,null,null,null,null,null,null,null,null,null,null,null,null,null,null,null,{"$f":"somcoul(C5:Q5,\"rouge\")","v":0},{"$f":"COUNTIF(C5:Q5,(\"g\"))","v":0},{"$f":"COUNTIF(C5:Q5,(\"c\"))","v":0},{"$f":"COUNTIF(C5:Q5,\"abs\")","v":0}]
[null,null,null,null,null,null,null,null,null,null,null,null,null,null,null,null,null,{"$f":"somcoul(C6:Q6,\"rouge\")","v":0},{"$f":"COUNTIF(C6:Q6,(\"g\"))","v":0},{"$f":"COUNTIF(C6:Q6,(\"c\"))","v":0},{"$f":"COUNTIF(C6:Q6,\"abs\")","v":0}]
[null,null,null,null,null,null,null,null,null,null,null,null,null,null,null,null,null,0,0,0,0]
[null,null,null,null,null,null,null,null,null,null,null,null,null,null,null,null,null,0,0,0,0]
[null,null,null,null,null,null,null,null,null,null,null,null,null,null,null,null,null,0,0,0,0]
[null,null,null,null,null,null,null,null,null,null,null,null,null,null,null,null,null,0,0,0,0]
[null,null,null,null,null,null,null,null,null,null,null,null,null,null,null,null,null,0,0,0,0]
[null,null,null,null,null,null,null,null,null,null,null,null,null,null,null,null,null,0,0,0,0]
[null,null,null,null,null,null,null,null,null,null,null,null,null,null,null,null,null,0,0,0,0," ",null," ",null,null,"                                    "]
[null,null,null,null,null,null,null,null,null,null,null,null,null,null,null,null,null,0,0,0,0]
[null,null,null,null,null,null,null,null,null,null,null,null,null,null,null,null,null,0,0,0,0]
[null,null,null,null,null,null,null,null,null,null,null,null,null,null,null,null,null,0,0,0,0]
[null,null,null,null,null,null,null,null,null,null,null,null,null,null,null,null,null,0,0,0,0]
[null,null,null,null,null,null,null,null,null,null,null,null,null,null,null,null,null,0,0,0,0]
[null,null,null,null,null,null,null,null,null,null,null,null,null,null,null,null,null,0,0,0,0]
[null,null,null,null,null,null,null,null,null,null,null,null,null,null,null,null,null,0,0,0,0]
[null,null,null,null,null,null,null,null,null,null,null,null,null,null,null,null,null,0,0,0,0]
[null,null,null,null,null,null,null,null,null,null,null,null,null,null,null,null,null,0,0,0,0]
[null,null,null,null,null,null,null,null,null,null,null,null,null,null,null,null,null,0,0,0,0]
[null,null,null,null,null,null,null,null,null,null,null,null,null,null,null,null,null,0,0,0,0]
[null,null,null,null,null,null,null,null,null,null,null,null,null,null,null,null,null,0,0,0,0]
[null,null,null,null,null,null,null,null,null,null,null,null,null,null,null,null,null,0,0,0,0]
[null,null,null,null,null,null,null,null,null,null,null,null,null,null,null,null,null,0,0,0,0]
[null,null,null,null,null,null,null,null,null,null,null,null,null,null,null,null,null,0,0,0,0]
[null,null,null,null,null,null,null,null,null,null,null,null,null,null,null,null,null,0,0,0,0]
[null,null,null,null,null,null,null,null,null,null,null,null,null,null,null,null,null,0,0,0,0]
[null,null,null,null,null,null,null,null,null,null,null,null,null,null,null,null,null,{"$f":"somcoul(C31:Q31,\"rouge\")","v":0},{"$f":"COUNTIF(C31:Q31,(\"g\"))","v":0},{"$f":"COUNTIF(C31:Q31,(\"c\"))","v":0},{"$f":"COUNTIF(C31:Q31,\"abs\")","v":0}]
[null,null,null,null,null,null,null,null,null,null,null,null,null,null,null,null,null,0,0,0,0]
[null,null,null,null,null,null,null,null,null,null,null,null,null,null,null,null,null,0,0,0,0]
[null,null,null,null,null,null,null,null,null,null,null,null,null,null,null,null,null,0,0,0,0]
[null,null,null,null,null,null,null,null,null,null,null,null,null,null,null,null,null,0,0,0,0]
[null,null,null,null,null,null,null,null,null,null,null,null,null,null,null,null,null,0,0,0,0]
[null,null,null,null,null,null,null,null,null,null,null,null,null,null,null,null,null,0,0,0,0]
[null,null,null,null,null,null,null,null,null,null,null,null,null,null,null,null,null,0,0,0,0]
[null,null,null,null,null,null,null,null,null,null,null,null,null,null,null,null,null,0,0,0,0]
[null,null,null,null,null,null,null,null,null,null,null,null,null,null,null,null,null,0,0,0,0]
[null,null,null,null,null,null,null,null,null,null,null,null,null,null,null,null,null,0,0,0,0]
[null,null,null,null,null,null,null,null,null,null,null,null,null,null,null,null,null,0,0,0,0]
[null,null,null,null,null,null,null,null,null,null,null,null,null,null,null,null,null,0,0,0,0]
[null,null,null,null,null,null,null,null,null,null,null,null,null,null,null,null,null,0,0,0,0]
[null,null,null,null,null,null,null,null,null,null,null,null,null,null,null,null,null,0,0,0,0]
[null,null,null,null,null,null,null,null,null,null,null,null,null,null,null,null,null,0,0,0,0]
[null,null,null,null,null,null,null,null,null,null,null,null,null,null,null,null,null,0,0,0,0]
[null,null,null,null,null,null,null,null,null,null,null,null,null,null,null,null,null,0,0,0,0]
[null,null,null,null,null,null,null,null,null,null,null,null,null,null,null,null,null,0,0,0,0]
[null,null,null,null,null,null,null,null,null,null,null,null,null,null,null,null,null,0,0,0,0]
[null,null,null,null,null,null,null,null,null,null,null,null,null,null,null,null,null,0,0,0,0]
[null,null,null,null,null,null,null,null,null,null,null,null,null,null,null,null,null,0,0,0,0]
[null,null,null,null,null,null,null,null,null,null,null,null,null,null,null,null,null,0,0,0,0]
[null,null,null,null,null,null,null,null,null,null,null,null,null,null,null,null,null,0,0,0,0]
[null,null,null,null,null,null,null,null,null,null,null,null,null,null,null,null,null,0,0,0,0]
[null,null,null,null,null,null,null,null,null,null,null,null,null,null,null,null,null,0,0,0,0]
[null,null,null,null,null,null,null,null,null,null,null,null,null,null,null,null,null,0,0,0,0]
[null,null,null,null,null,null,null,null,null,null,null,null,null,null,null,null,null,0,0,0,0]
[null,null,null,null,null,null,null,null,null,null,null,null,null,null,null,null,null,0,0,0,0]
[null,null,null,null,null,null,null,null,null,null,null,null,null,null,null,null,null,0,0,0,0]
[null,null,null,null,null,null,null,null,null,null,null,null,null,null,null,null,null,0,0,0,0]
[null,null,null,null,null,null,null,null,null,null,null,null,null,null,null,null,null,0,0,0,0]
[null,null,null,null,null,null,null,null,null,null,null,null,null,null,null,null,null,0,0,0,0]
[null,null,null,null,null,null,null,null,null,null,null,null,null,null,null,null,null,0,0,0,0]
[null,null,null,null,null,null,null,null,null,null,null,null,null,null,null,null,null,0,0,0,0]
[null,null,null,null,null,null,null,null,null,null,null,null,null,null,null,null,null,0,0,0,0]
[null,null,null,null,null,null,null,null,null,null,null,null,null,null,null,null,null,0,0,0,0]
[null,null,null,null,null,null,null,null,null,null,null,null,null,null,null,null,null,0,0,0,0]
[null,null,null,null,null,null,null,null,null,null,null,null,null,null,null,null,null,0,0,0,0]
[null,null,null,null,null,null,null,null,null,null,null,null,null,null,null,null,null,0,0,0,{"$f":"COUNTIF(C70:Q70,\"abs\")","v":0}]
[null,null,null,null,null,null,null,null,null,null,null,null,null,null,null,null,null,0,0,0,0]
[null,null,null,null,null,null,null,null,null,null,null,null,null,null,null,null,null,0,0,0,0]
[null,null,null,null,null,null,null,null,null,null,null,null,null,null,null,null,null,0,0,0,0]
[null,null,null,null,null,null,null,null,null,null,null,null,null,null,null,null,null,0,0,0,0]
[null,null,null,null,null,null,null,null,null,null,null,null,null,null,null,null,null,0,0,0,0]
[null,null,null,null,null,null,null,null,null,null,null,null,null,null,null,null,null,0,0,0,0]
[null,null,null,null,null,null,null,null,null,null,null,null,null,null,null,null,null,0,0,0,0]
[null,null,null,null,null,null,null,null,null,null,null,null,null,null,null,null,null,0,0,0,0]
[null,null,null,null,null,null,null,null,null,null,null,null,null,null,null,null,null,0,0,0,0]
[null,null,null,null,null,null,null,null,null,null,null,null,null,null,null,null,null,0,0,0,0]
[null,null,null,null,null,null,null,null,null,null,null,null,null,null,null,null,null,0,0,0,0]
[null,null,null,null,null,null,null,null,null,null,null,null,null,null,null,null,null,0,0,0,0]
[null,null,null,null,null,null,null,null,null,null,null,null,null,null,null,null,null,0,0,0,0]
[null,null,null,null,null,null,null,null,null,null,null,null,null,null,null,null,null,0,0,0,0]
[null,null,null,null,null,null,null,null,null,null,null,null,null,null,null,null,null,0,0,0,0]
[null,null,null,null,null,null,null,null,null,null,null,null,null,null,null,null,null,0,0,0,0]
[null,null,null,null,null,null,null,null,null,null,null,null,null,null,null,null,null,0,0,0,0]
[null,null,null,null,null,null,null,null,null,null,null,null,null,null,null,null,null,0,0,0,0]
[null,null,null,null,null,null,null,null,null,null,null,null,null,null,null,null,null,0,0,0,0]
[null,null,null,null,null,null,null,null,null,null,null,null,null,null,null,null,null,0,0,0,0]
[null,null,null,null,null,null,null,null,null,null,null,null,null,null,null,null,null,0,0,0,0]
[null,null,null,null,null,null,null,null,null,null,null,null,null,null,null,null,null,0,0,0,0]
[null,null,null,null,null,null,null,null,null,null,null,null,null,null,null,null,null,0,0,0,0]
[null,null,null,null,null,null,null,null,null,null,null,null,null,null,null,null,null,0,0,0,{"$f":"COUNTIF(C94:Q94,\"abs\")","v":0}]
[null,"Totaux",{"$f":"COUNTIF(C5:C94,\"abs\")","v":0},null,null,{"$f":"COUNTIF(F5:F94,\"abs\")","v":0},null,null,{"$f":"COUNTIF(I5:I94,\"abs\")","v":0},null,null,{"$f":"COUNTIF(L5:L94,\"abs\")","v":0},null,null,{"$f":"COUNTIF(O5:O94,\"abs\")","v":0},null,null,{"$f":"SUM(R5:R94)","v":0},{"$f":"SUM(S5:S94)","v":0},{"$f":"SUM(T5:T94)","v":0},{"$f":"SUM(U5:U94)","v":0}]
[null,null,{"$f":"somcoul(C5:C94,\"rouge\")","v":0},{"$f":"COUNTIF(D5:D94,\"g\")","v":0},{"$f":"COUNTIF(E5:E94,\"c\")","v":0},{"$f":"somcoul(F5:F94,\"rouge\")","v":0},{"$f":"COUNTIF(G5:G94,\"g\")","v":0},{"$f":"COUNTIF(H5:H94,\"c\")","v":0},{"$f":"somcoul(I5:I94,\"rouge\")","v":0},{"$f":"COUNTIF(J6:J94,\"g\")","v":0},{"$f":"COUNTIF(K5:K94,\"c\")","v":0},{"$f":"somcoul(L5:L94,\"rouge\")","v":0},{"$f":"COUNTIF(M5:M94,\"g\")","v":0},{"$f":"COUNTIF(N6:N94,\"c\")","v":0},{"$f":"somcoul(O5:O94,\"rouge\")","v":0},{"$f":"COUNTIF(P5:P94,\"g\")","v":0},{"$f":"COUNTIF(Q5:Q94,\"c\")","v":0}]
[null,"6h30/8h00",{"$f":"COUNTIF(C5:C94,\"6h30/8h00\")","v":0},null,null,{"$f":"COUNTIF(F5:F94,\"6h30/8h00\")","v":0},null,null,{"$f":"COUNTIF(I5:I94,\"6h30/8h00\")","v":0},null,null,{"$f":"COUNTIF(L5:L94,\"6h30/8h00\")","v":0},null,null,{"$f":"COUNTIF(O5:O94,\"6h30/8h00\")","v":0},null,null,{"$f":"SUM(C97:Q97)","v":0}]
[null,"7h00/9h00",{"$f":"COUNTIF(C5:C94,\"7h00/9h00\")","v":0},null,null,{"$f":"COUNTIF(F5:F94,\"7h00/9h00\")","v":0},null,null,{"$f":"COUNTIF(I5:I94,\"7h00/9h00\")","v":0},null,null,{"$f":"COUNTIF(L5:L94,\"7h00/9h00\")","v":0},null,null,{"$f":"COUNTIF(O5:O94,\"7h00/9h00\")","v":0},null,null,0]
[null,"8h00/10h00",{"$f":"COUNTIF(C5:C94,\"8h00/10h00\")","v":0},null,null,{"$f":"COUNTIF(F5:F94,\"8h00/10h00\")","v":0},null,null,{"$f":"COUNTIF(I5:I94,\"8h00/10h00\")","v":0},null,null,{"$f":"COUNTIF(L5:L94,\"8h00/10h00\")","v":0},null,null,{"$f":"COUNTIF(O5:O94,\"8h00/10h00\")","v":0},null,null,0]
[null,"9h00/11h00",{"$f":"COUNTIF(C5:C94,\"9h00/11h00\")","v":0},null,null,{"$f":"COUNTIF(F5:F94,\"9h00/11h00\")","v":0},null,null,{"$f":"COUNTIF(I5:I94,\"9h00/11h00\")","v":0},null,null,{"$f":"COUNTIF(L5:L94,\"9h00/11h00\")","v":0},null,null,{"$f":"COUNTIF(O5:O94,\"9h00/11h00\")","v":0},null,null,0]
[null,"10h00/12h00",{"$f":"COUNTIF(C5:C94,\"10h00/12h00\")","v":0},null,null,{"$f":"COUNTIF(F5:F94,\"10h00/12h00\")","v":0},null,null,{"$f":"COUNTIF(I5:I94,\"10h00/12h00\")","v":0},null,null,{"$f":"COUNTIF(L5:L94,\"10h00/12h00\")","v":0},null,null,{"$f":"COUNTIF(O5:O94,\"10h00/12h00\")","v":0},null,null,0]
[null,"11h00/13h00",{"$f":"COUNTIF(C5:C94,\"11h00/13h00\")","v":0},null,null,{"$f":"COUNTIF(F5:F94,\"11h00/13h00\")","v":0},null,null,{"$f":"COUNTIF(I5:I94,\"11h00/13h00\")","v":0},null,null,{"$f":"COUNTIF(L5:L94,\"11h00/13h00\")","v":0},null,null,{"$f":"COUNTIF(O5:O94,\"11h00/13h00\")","v":0},null,null,0]
[null,"13h00/15h00",{"$f":"COUNTIF(C5:C94,\"13h00/15h00\")","v":0},null,null,{"$f":"COUNTIF(F5:F94,\"13h00/15h00\")","v":0},null,null,{"$f":"COUNTIF(I5:I94,\"13h00/15h00\")","v":0},null,null,{"$f":"COUNTIF(L5:L94,\"13h00/15h00\")","v":0},null,null,{"$f":"COUNTIF(O5:O94,\"13h00/15h00\")","v":0},null,null,0]
[null,"13h30/15h30",{"$f":"COUNTIF(C5:C94,\"13h30/15h30\")","v":0},null,null,{"$f":"COUNTIF(F5:F94,\"13h30/15h30\")","v":0},null,null,{"$f":"COUNTIF(I5:I94,\"13h30/15h30\")","v":0},null,null,{"$f":"COUNTIF(L5:L94,\"13h30/15h30\")","v":0},null,null,{"$f":"COUNTIF(O5:O94,\"13h30/15h30\")","v":0},null,null,0]
[null,"15h00/17h00",{"$f":"COUNTIF(C5:C94,\"15h00/17h00\")","v":0},null,null,{"$f":"COUNTIF(F5:F94,\"15h00/17h00\")","v":0},null,null,{"$f":"COUNTIF(I5:I94,\"15h00/17h00\")","v":0},null,null,{"$f":"COUNTIF(L5:L94,\"15h00/17h00\")","v":0},null,null,{"$f":"COUNTIF(O5:O94,\"15h00/17h00\")","v":0},null,null,0]
[null,"16h00/18h00",{"$f":"COUNTIF(C5:C94,\"16h00/18h00\")","v":0},null,null,{"$f":"COUNTIF(F5:F94,\"16h00/18h00\")","v":0},null,null,{"$f":"COUNTIF(I5:I94,\"16h00/18h00\")","v":0},null,null,{"$f":"COUNTIF(L5:L94,\"16h00/18h00\")","v":0},null,null,{"$f":"COUNTIF(O5:O94,\"16h00/18h00\")","v":0},null,null,0]
[null,"17h00/19h00",{"$f":"COUNTIF(C5:C94,\"17h00/19h00\")","v":0},null,null,{"$f":"COUNTIF(F5:F94,\"17h00/19h00\")","v":0},null,null,{"$f":"COUNTIF(I5:I94,\"17h00/19h00\")","v":0},null,null,{"$f":"COUNTIF(L5:L94,\"17h00/19h00\")","v":0},null,null,{"$f":"COUNTIF(O5:O94,\"17h00/19h00\")","v":0},null,null,0]
[null,"18h00/20h00",{"$f":"COUNTIF(C5:C94,\"18h00/20h00\")","v":0},null,null,{"$f":"COUNTIF(F5:F94,\"18h00/20h00\")","v":0},null,null,{"$f":"COUNTIF(I5:I94,\"18h00/20h00\")","v":0},null,null,{"$f":"COUNTIF(L5:L94,\"18h00/20h00\")","v":0},null,null,{"$f":"COUNTIF(O5:O94,\"18h00/20h00\")","v":0},null,null,0]
[null,"19h00/21h00",{"$f":"COUNTIF(C5:C94,\"19h00/21h00\")","v":0},null,null,{"$f":"COUNTIF(F5:F94,\"19h00/21h00\")","v":0},null,null,{"$f":"COUNTIF(I5:I94,\"19h00/21h00\")","v":0},null,null,{"$f":"COUNTIF(L5:L94,\"19h00/21h00\")","v":0},null,null,{"$f":"COUNTIF(O5:O94,\"19h00/21h00\")","v":0},null,null,0]
[null,"21h00/23h00",{"$f":"COUNTIF(C5:C94,\"21h00/23h00\")","v":0},null,null,{"$f":"COUNTIF(F5:F94,\"21h00/23h00\")","v":0},null,null,{"$f":"COUNTIF(I5:I94,\"21h00/23h00\")","v":0},null,null,{"$f":"COUNTIF(L5:L94,\"21h00/23h00\")","v":0},null,null,{"$f":"COUNTIF(O5:O94,\"21h00/23h00\")","v":0},null,null,0]
[null,"22h00/23h00",{"$f":"COUNTIF(C5:C94,\"22h00/23h00\")","v":0},null,null,{"$f":"COUNTIF(F5:F94,\"22h00/23h00\")","v":0},null,null,{"$f":"COUNTIF(I5:I94,\"22h00/23h00\")","v":0},null,null,{"$f":"COUNTIF(L5:L94,\"22h00/23h00\")","v":0},null,null,{"$f":"COUNTIF(O5:O94,\"22h00/23h00\")","v":0},null,null,0]

{"sheet":"I","index":9,"n_rows":111,"n_cols":27,"rows_kept":111,"cut":false,"hidden":false,"merged":[[1,24,1,26],[94,20,95,20],[96,2,96,4],[96,5,96,7],[96,8,96,10],[96,11,96,13],[96,14,96,16],[96,17,96,20],[1,1,1,21],[94,1,95,1],[94,2,94,4],[94,5,94,7],[94,8,94,10],[94,11,94,13],[94,14,94,16],[94,17,95,17],[94,18,95,18],[94,19,95,19],[98,2,98,4],[98,5,98,7],[98,8,98,10],[98,11,98,13],[98,14,98,16],[98,17,98,20],[97,2,97,4],[97,5,97,7],[97,8,97,10],[97,11,97,13],[97,14,97,16],[97,17,97,20],[100,2,100,4],[100,5,100,7],[100,8,100,10],[100,11,100,13],[100,14,100,16],[100,17,100,20],[99,2,99,4],[99,5,99,7],[99,8,99,10],[99,11,99,13],[99,14,99,16],[99,17,99,20],[102,2,102,4],[102,5,102,7],[102,8,102,10],[102,11,102,13],[102,14,102,16],[102,17,102,20],[101,2,101,4],[101,5,101,7],[101,8,101,10],[101,11,101,13],[101,14,101,16],[101,17,101,20],[104,2,104,4],[104,5,104,7],[104,8,104,10],[104,11,104,13],[104,14,104,16],[104,17,104,20],[103,2,103,4],[103,5,103,7],[103,8,103,10],[103,11,103,13],[103,14,103,16],[103,17,103,20],[106,2,106,4],[106,5,106,7],[106,8,106,10],[106,11,106,13],[106,14,106,16],[106,17,106,20],[105,2,105,4],[105,5,105,7],[105,8,105,10],[105,11,105,13],[105,14,105,16],[105,17,105,20],[108,2,108,4],[108,5,108,7],[108,8,108,10],[108,11,108,13],[108,14,108,16],[108,17,108,20],[107,2,107,4],[107,5,107,7],[107,8,107,10],[107,11,107,13],[107,14,107,16],[107,17,107,20],[110,2,110,4],[110,5,110,7],[110,8,110,10],[110,11,110,13],[110,14,110,16],[110,17,110,20],[109,2,109,4],[109,5,109,7],[109,8,109,10],[109,11,109,13],[109,14,109,16],[109,17,109,20]]}
[]
[null,11,null,null,null,null,null,null,null,null,null,null,null,null,null,null,null,null,null,null,null,null,null,null,{"$f":"IF(S95+T95<>R95,\"FAUX\",\"OK\")","v":"OK"}]
[null,null,null,null,null,null,null,null,null,null,null,null,null,null,null,null,null,null,null,null,null,null,null,null,"Total","G","C"]
[null,"Noms",{"$f":"IF(ISNUMBER(B2),7*B2+DATE(Année,1,3)-WEEKDAY(DATE(Année,1,3))-5,\"\")","v":"2016-03-14"},"G","C",{"$f":"C4+1","v":"2016-03-15"},"G","C",{"$f":"F4+1","v":"2016-03-16"},"G","C",{"$f":"I4+1","v":"2016-03-17"},"G","C",{"$f":"L4+1","v":"2016-03-18"},"G","C","Total","G","B","Abs",null,null,null,{"$f":"R95","v":0},{"$f":"S95","v":0},{"$f":"T95","v":0}]
[null,null,null,null,null,null,null,null,null,null,null,null,null,null,null,null,null,{"$f":"somcoul(C5:Q5,\"rouge\")","v":0},{"$f":"COUNTIF(C5:Q5,(\"g\"))","v":0},{"$f":"COUNTIF(C5:Q5,(\"c\"))","v":0},{"$f":"COUNTIF(C5:Q5,\"abs\")","v":0}]
[null,null,null,null,null,null,null,null,null,null,null,null,null,null,null,null,null,{"$f":"somcoul(C6:Q6,\"rouge\")","v":0},{"$f":"COUNTIF(C6:Q6,(\"g\"))","v":0},{"$f":"COUNTIF(C6:Q6,(\"c\"))","v":0},{"$f":"COUNTIF(C6:Q6,\"abs\")","v":0}]
[null,null,null,null,null,null,null,null,null,null,null,null,null,null,null,null,null,0,0,0,0]
[null,null,null,null,null,null,null,null,null,null,null,null,null,null,null,null,null,0,0,0,0]
[null,null,null,null,null,null,null,null,null,null,null,null,null,null,null,null,null,0,0,0,0]
[null,null,null,null,null,null,null,null,null,null,null,null,null,null,null,null,null,0,0,0,0]
[null,null,null,null,null,null,null,null,null,null,null,null,null,null,null,null,null,0,0,0,0]
[null,null,null,null,null,null,null,null,null,null,null,null,null,null,null,null,null,0,0,0,0]
[null,null,null,null,null,null,null,null,null,null,null,null,null,null,null,null,null,0,0,0,0," ",null," ",null,null,"                                    "]
[null,null,null,null,null,null,null,null,null,null,null,null,null,null,null,null,null,0,0,0,0]
[null,null,null,null,null,null,null,null,null,null,null,null,null,null,null,null,null,0,0,0,0]
[null,null,null,null,null,null,null,null,null,null,null,null,null,null,null,null,null,0,0,0,0]
[null,null,null,null,null,null,null,null,null,null,null,null,null,null,null,null,null,0,0,0,0]
[null,null,null,null,null,null,null,null,null,null,null,null,null,null,null,null,null,0,0,0,0]
[null,null,null,null,null,null,null,null,null,null,null,null,null,null,null,null,null,0,0,0,0]
[null,null,null,null,null,null,null,null,null,null,null,null,null,null,null,null,null,0,0,0,0]
[null,null,null,null,null,null,null,null,null,null,null,null,null,null,null,null,null,0,0,0,0]
[null,null,null,null,null,null,null,null,null,null,null,null,null,null,null,null,null,0,0,0,0]
[null,null,null,null,null,null,null,null,null,null,null,null,null,null,null,null,null,0,0,0,0]
[null,null,null,null,null,null,null,null,null,null,null,null,null,null,null,null,null,0,0,0,0]
[null,null,null,null,null,null,null,null,null,null,null,null,null,null,null,null,null,0,0,0,0]
[null,null,null,null,null,null,null,null,null,null,null,null,null,null,null,null,null,0,0,0,0]
[null,null,null,null,null,null,null,null,null,null,null,null,null,null,null,null,null,0,0,0,0]
[null,null,null,null,null,null,null,null,null,null,null,null,null,null,null,null,null,0,0,0,0]
[null,null,null,null,null,null,null,null,null,null,null,null,null,null,null,null,null,0,0,0,0]
[null,null,null,null,null,null,null,null,null,null,null,null,null,null,null,null,null,0,0,0,0]
[null,null,null,null,null,null,null,null,null,null,null,null,null,null,null,null,null,{"$f":"somcoul(C31:Q31,\"rouge\")","v":0},{"$f":"COUNTIF(C31:Q31,(\"g\"))","v":0},{"$f":"COUNTIF(C31:Q31,(\"c\"))","v":0},{"$f":"COUNTIF(C31:Q31,\"abs\")","v":0}]
[null,null,null,null,null,null,null,null,null,null,null,null,null,null,null,null,null,0,0,0,0]
[null,null,null,null,null,null,null,null,null,null,null,null,null,null,null,null,null,0,0,0,0]
[null,null,null,null,null,null,null,null,null,null,null,null,null,null,null,null,null,0,0,0,0]
[null,null,null,null,null,null,null,null,null,null,null,null,null,null,null,null,null,0,0,0,0]
[null,null,null,null,null,null,null,null,null,null,null,null,null,null,null,null,null,0,0,0,0]
[null,null,null,null,null,null,null,null,null,null,null,null,null,null,null,null,null,0,0,0,0]
[null,null,null,null,null,null,null,null,null,null,null,null,null,null,null,null,null,0,0,0,0]
[null,null,null,null,null,null,null,null,null,null,null,null,null,null,null,null,null,0,0,0,0]
[null,null,null,null,null,null,null,null,null,null,null,null,null,null,null,null,null,0,0,0,0]
[null,null,null,null,null,null,null,null,null,null,null,null,null,null,null,null,null,0,0,0,0]
[null,null,null,null,null,null,null,null,null,null,null,null,null,null,null,null,null,0,0,0,0]
[null,null,null,null,null,null,null,null,null,null,null,null,null,null,null,null,null,0,0,0,0]
[null,null,null,null,null,null,null,null,null,null,null,null,null,null,null,null,null,0,0,0,0]
[null,null,null,null,null,null,null,null,null,null,null,null,null,null,null,null,null,0,0,0,0]
[null,null,null,null,null,null,null,null,null,null,null,null,null,null,null,null,null,0,0,0,0]
[null,null,null,null,null,null,null,null,null,null,null,null,null,null,null,null,null,0,0,0,0]
[null,null,null,null,null,null,null,null,null,null,null,null,null,null,null,null,null,0,0,0,0]
[null,null,null,null,null,null,null,null,null,null,null,null,null,null,null,null,null,0,0,0,0]
[null,null,null,null,null,null,null,null,null,null,null,null,null,null,null,null,null,0,0,0,0]
[null,null,null,null,null,null,null,null,null,null,null,null,null,null,null,null,null,0,0,0,0]
[null,null,null,null,null,null,null,null,null,null,null,null,null,null,null,null,null,0,0,0,0]
[null,null,null,null,null,null,null,null,null,null,null,null,null,null,null,null,null,0,0,0,0]
[null,null,null,null,null,null,null,null,null,null,null,null,null,null,null,null,null,0,0,0,0]
[null,null,null,null,null,null,null,null,null,null,null,null,null,null,null,null,null,0,0,0,0]
[null,null,null,null,null,null,null,null,null,null,null,null,null,null,null,null,null,0,0,0,0]
[null,null,null,null,null,null,null,null,null,null,null,null,null,null,null,null,null,0,0,0,0]
[null,null,null,null,null,null,null,null,null,null,null,null,null,null,null,null,null,0,0,0,0]
[null,null,null,null,null,null,null,null,null,null,null,null,null,null,null,null,null,0,0,0,0]
[null,null,null,null,null,null,null,null,null,null,null,null,null,null,null,null,null,0,0,0,0]
[null,null,null,null,null,null,null,null,null,null,null,null,null,null,null,null,null,0,0,0,0]
[null,null,null,null,null,null,null,null,null,null,null,null,null,null,null,null,null,0,0,0,0]
[null,null,null,null,null,null,null,null,null,null,null,null,null,null,null,null,null,0,0,0,0]
[null,null,null,null,null,null,null,null,null,null,null,null,null,null,null,null,null,0,0,0,0]
[null,null,null,null,null,null,null,null,null,null,null,null,null,null,null,null,null,0,0,0,0]
[null,null,null,null,null,null,null,null,null,null,null,null,null,null,null,null,null,0,0,0,0]
[null,null,null,null,null,null,null,null,null,null,null,null,null,null,null,null,null,0,0,0,0]
[null,null,null,null,null,null,null,null,null,null,null,null,null,null,null,null,null,0,0,0,0]
[null,null,null,null,null,null,null,null,null,null,null,null,null,null,null,null,null,0,0,0,0]
[null,null,null,null,null,null,null,null,null,null,null,null,null,null,null,null,null,0,0,0,{"$f":"COUNTIF(C70:Q70,\"abs\")","v":0}]
[null,null,null,null,null,null,null,null,null,null,null,null,null,null,null,null,null,0,0,0,0]
[null,null,null,null,null,null,null,null,null,null,null,null,null,null,null,null,null,0,0,0,0]
[null,null,null,null,null,null,null,null,null,null,null,null,null,null,null,null,null,0,0,0,0]
[null,null,null,null,null,null,null,null,null,null,null,null,null,null,null,null,null,0,0,0,0]
[null,null,null,null,null,null,null,null,null,null,null,null,null,null,null,null,null,0,0,0,0]
[null,null,null,null,null,null,null,null,null,null,null,null,null,null,null,null,null,0,0,0,0]
[null,null,null,null,null,null,null,null,null,null,null,null,null,null,null,null,null,0,0,0,0]
[null,null,null,null,null,null,null,null,null,null,null,null,null,null,null,null,null,0,0,0,0]
[null,null,null,null,null,null,null,null,null,null,null,null,null,null,null,null,null,0,0,0,0]
[null,null,null,null,null,null,null,null,null,null,null,null,null,null,null,null,null,0,0,0,0]
[null,null,null,null,null,null,null,null,null,null,null,null,null,null,null,null,null,0,0,0,0]
[null,null,null,null,null,null,null,null,null,null,null,null,null,null,null,null,null,0,0,0,0]
[null,null,null,null,null,null,null,null,null,null,null,null,null,null,null,null,null,0,0,0,0]
[null,null,null,null,null,null,null,null,null,null,null,null,null,null,null,null,null,0,0,0,0]
[null,null,null,null,null,null,null,null,null,null,null,null,null,null,null,null,null,0,0,0,0]
[null,null,null,null,null,null,null,null,null,null,null,null,null,null,null,null,null,0,0,0,0]
[null,null,null,null,null,null,null,null,null,null,null,null,null,null,null,null,null,0,0,0,0]
[null,null,null,null,null,null,null,null,null,null,null,null,null,null,null,null,null,0,0,0,0]
[null,null,null,null,null,null,null,null,null,null,null,null,null,null,null,null,null,0,0,0,0]
[null,null,null,null,null,null,null,null,null,null,null,null,null,null,null,null,null,0,0,0,0]
[null,null,null,null,null,null,null,null,null,null,null,null,null,null,null,null,null,0,0,0,0]
[null,null,null,null,null,null,null,null,null,null,null,null,null,null,null,null,null,0,0,0,0]
[null,null,null,null,null,null,null,null,null,null,null,null,null,null,null,null,null,0,0,0,0]
[null,null,null,null,null,null,null,null,null,null,null,null,null,null,null,null,null,0,0,0,{"$f":"COUNTIF(C94:Q94,\"abs\")","v":0}]
[null,"Totaux",{"$f":"COUNTIF(C5:C94,\"abs\")","v":0},null,null,{"$f":"COUNTIF(F5:F94,\"abs\")","v":0},null,null,{"$f":"COUNTIF(I5:I94,\"abs\")","v":0},null,null,{"$f":"COUNTIF(L5:L94,\"abs\")","v":0},null,null,{"$f":"COUNTIF(O5:O94,\"abs\")","v":0},null,null,{"$f":"SUM(R5:R94)","v":0},{"$f":"SUM(S5:S94)","v":0},{"$f":"SUM(T5:T94)","v":0},{"$f":"SUM(U5:U94)","v":0}]
[null,null,{"$f":"somcoul(C5:C94,\"rouge\")","v":0},{"$f":"COUNTIF(D5:D94,\"g\")","v":0},{"$f":"COUNTIF(E5:E94,\"c\")","v":0},{"$f":"somcoul(F5:F94,\"rouge\")","v":0},{"$f":"COUNTIF(G5:G94,\"g\")","v":0},{"$f":"COUNTIF(H5:H94,\"c\")","v":0},{"$f":"somcoul(I5:I94,\"rouge\")","v":0},{"$f":"COUNTIF(J6:J94,\"g\")","v":0},{"$f":"COUNTIF(K5:K94,\"c\")","v":0},{"$f":"somcoul(L5:L94,\"rouge\")","v":0},{"$f":"COUNTIF(M5:M94,\"g\")","v":0},{"$f":"COUNTIF(N6:N94,\"c\")","v":0},{"$f":"somcoul(O5:O94,\"rouge\")","v":0},{"$f":"COUNTIF(P5:P94,\"g\")","v":0},{"$f":"COUNTIF(Q5:Q94,\"c\")","v":0}]
[null,"6h30/8h00",{"$f":"COUNTIF(C5:C94,\"6h30/8h00\")","v":0},null,null,{"$f":"COUNTIF(F5:F94,\"6h30/8h00\")","v":0},null,null,{"$f":"COUNTIF(I5:I94,\"6h30/8h00\")","v":0},null,null,{"$f":"COUNTIF(L5:L94,\"6h30/8h00\")","v":0},null,null,{"$f":"COUNTIF(O5:O94,\"6h30/8h00\")","v":0},null,null,{"$f":"SUM(C97:Q97)","v":0}]
[null,"7h00/9h00",{"$f":"COUNTIF(C5:C94,\"7h00/9h00\")","v":0},null,null,{"$f":"COUNTIF(F5:F94,\"7h00/9h00\")","v":0},null,null,{"$f":"COUNTIF(I5:I94,\"7h00/9h00\")","v":0},null,null,{"$f":"COUNTIF(L5:L94,\"7h00/9h00\")","v":0},null,null,{"$f":"COUNTIF(O5:O94,\"7h00/9h00\")","v":0},null,null,0]
[null,"8h00/10h00",{"$f":"COUNTIF(C5:C94,\"8h00/10h00\")","v":0},null,null,{"$f":"COUNTIF(F5:F94,\"8h00/10h00\")","v":0},null,null,{"$f":"COUNTIF(I5:I94,\"8h00/10h00\")","v":0},null,null,{"$f":"COUNTIF(L5:L94,\"8h00/10h00\")","v":0},null,null,{"$f":"COUNTIF(O5:O94,\"8h00/10h00\")","v":0},null,null,0]
[null,"9h00/11h00",{"$f":"COUNTIF(C5:C94,\"9h00/11h00\")","v":0},null,null,{"$f":"COUNTIF(F5:F94,\"9h00/11h00\")","v":0},null,null,{"$f":"COUNTIF(I5:I94,\"9h00/11h00\")","v":0},null,null,{"$f":"COUNTIF(L5:L94,\"9h00/11h00\")","v":0},null,null,{"$f":"COUNTIF(O5:O94,\"9h00/11h00\")","v":0},null,null,0]
[null,"10h00/12h00",{"$f":"COUNTIF(C5:C94,\"10h00/12h00\")","v":0},null,null,{"$f":"COUNTIF(F5:F94,\"10h00/12h00\")","v":0},null,null,{"$f":"COUNTIF(I5:I94,\"10h00/12h00\")","v":0},null,null,{"$f":"COUNTIF(L5:L94,\"10h00/12h00\")","v":0},null,null,{"$f":"COUNTIF(O5:O94,\"10h00/12h00\")","v":0},null,null,0]
[null,"11h00/13h00",{"$f":"COUNTIF(C5:C94,\"11h00/13h00\")","v":0},null,null,{"$f":"COUNTIF(F5:F94,\"11h00/13h00\")","v":0},null,null,{"$f":"COUNTIF(I5:I94,\"11h00/13h00\")","v":0},null,null,{"$f":"COUNTIF(L5:L94,\"11h00/13h00\")","v":0},null,null,{"$f":"COUNTIF(O5:O94,\"11h00/13h00\")","v":0},null,null,0]
[null,"13h00/15h00",{"$f":"COUNTIF(C5:C94,\"13h00/15h00\")","v":0},null,null,{"$f":"COUNTIF(F5:F94,\"13h00/15h00\")","v":0},null,null,{"$f":"COUNTIF(I5:I94,\"13h00/15h00\")","v":0},null,null,{"$f":"COUNTIF(L5:L94,\"13h00/15h00\")","v":0},null,null,{"$f":"COUNTIF(O5:O94,\"13h00/15h00\")","v":0},null,null,0]
[null,"13h30/15h30",{"$f":"COUNTIF(C5:C94,\"13h30/15h30\")","v":0},null,null,{"$f":"COUNTIF(F5:F94,\"13h30/15h30\")","v":0},null,null,{"$f":"COUNTIF(I5:I94,\"13h30/15h30\")","v":0},null,null,{"$f":"COUNTIF(L5:L94,\"13h30/15h30\")","v":0},null,null,{"$f":"COUNTIF(O5:O94,\"13h30/15h30\")","v":0},null,null,0]
[null,"15h00/17h00",{"$f":"COUNTIF(C5:C94,\"15h00/17h00\")","v":0},null,null,{"$f":"COUNTIF(F5:F94,\"15h00/17h00\")","v":0},null,null,{"$f":"COUNTIF(I5:I94,\"15h00/17h00\")","v":0},null,null,{"$f":"COUNTIF(L5:L94,\"15h00/17h00\")","v":0},null,null,{"$f":"COUNTIF(O5:O94,\"15h00/17h00\")","v":0},null,null,0]
[null,"16h00/18h00",{"$f":"COUNTIF(C5:C94,\"16h00/18h00\")","v":0},null,null,{"$f":"COUNTIF(F5:F94,\"16h00/18h00\")","v":0},null,null,{"$f":"COUNTIF(I5:I94,\"16h00/18h00\")","v":0},null,null,{"$f":"COUNTIF(L5:L94,\"16h00/18h00\")","v":0},null,null,{"$f":"COUNTIF(O5:O94,\"16h00/18h00\")","v":0},null,null,0]
[null,"17h00/19h00",{"$f":"COUNTIF(C5:C94,\"17h00/19h00\")","v":0},null,null,{"$f":"COUNTIF(F5:F94,\"17h00/19h00\")","v":0},null,null,{"$f":"COUNTIF(I5:I94,\"17h00/19h00\")","v":0},null,null,{"$f":"COUNTIF(L5:L94,\"17h00/19h00\")","v":0},null,null,{"$f":"COUNTIF(O5:O94,\"17h00/19h00\")","v":0},null,null,0]
[null,"18h00/20h00",{"$f":"COUNTIF(C5:C94,\"18h00/20h00\")","v":0},null,null,{"$f":"COUNTIF(F5:F94,\"18h00/20h00\")","v":0},null,null,{"$f":"COUNTIF(I5:I94,\"18h00/20h00\")","v":0},null,null,{"$f":"COUNTIF(L5:L94,\"18h00/20h00\")","v":0},null,null,{"$f":"COUNTIF(O5:O94,\"18h00/20h00\")","v":0},null,null,0]
[null,"19h00/21h00",{"$f":"COUNTIF(C5:C94,\"19h00/21h00\")","v":0},null,null,{"$f":"COUNTIF(F5:F94,\"19h00/21h00\")","v":0},null,null,{"$f":"COUNTIF(I5:I94,\"19h00/21h00\")","v":0},null,null,{"$f":"COUNTIF(L5:L94,\"19h00/21h00\")","v":0},null,null,{"$f":"COUNTIF(O5:O94,\"19h00/21h00\")","v":0},null,null,0]
[null,"21h00/23h00",{"$f":"COUNTIF(C5:C94,\"21h00/23h00\")","v":0},null,null,{"$f":"COUNTIF(F5:F94,\"21h00/23h00\")","v":0},null,null,{"$f":"COUNTIF(I5:I94,\"21h00/23h00\")","v":0},null,null,{"$f":"COUNTIF(L5:L94,\"21h00/23h00\")","v":0},null,null,{"$f":"COUNTIF(O5:O94,\"21h00/23h00\")","v":0},null,null,0]
[null,"22h00/23h00",{"$f":"COUNTIF(C5:C94,\"22h00/23h00\")","v":0},null,null,{"$f":"COUNTIF(F5:F94,\"22h00/23h00\")","v":0},null,null,{"$f":"COUNTIF(I5:I94,\"22h00/23h00\")","v":0},null,null,{"$f":"COUNTIF(L5:L94,\"22h00/23h00\")","v":0},null,null,{"$f":"COUNTIF(O5:O94,\"22h00/23h00\")","v":0},null,null,0]

{"sheet":"J","index":10,"n_rows":111,"n_cols":27,"rows_kept":111,"cut":false,"hidden":false,"merged":[[1,24,1,26],[94,20,95,20],[96,2,96,4],[96,5,96,7],[96,8,96,10],[96,11,96,13],[96,14,96,16],[96,17,96,20],[1,1,1,21],[94,1,95,1],[94,2,94,4],[94,5,94,7],[94,8,94,10],[94,11,94,13],[94,14,94,16],[94,17,95,17],[94,18,95,18],[94,19,95,19],[98,2,98,4],[98,5,98,7],[98,8,98,10],[98,11,98,13],[98,14,98,16],[98,17,98,20],[97,2,97,4],[97,5,97,7],[97,8,97,10],[97,11,97,13],[97,14,97,16],[97,17,97,20],[100,2,100,4],[100,5,100,7],[100,8,100,10],[100,11,100,13],[100,14,100,16],[100,17,100,20],[99,2,99,4],[99,5,99,7],[99,8,99,10],[99,11,99,13],[99,14,99,16],[99,17,99,20],[102,2,102,4],[102,5,102,7],[102,8,102,10],[102,11,102,13],[102,14,102,16],[102,17,102,20],[101,2,101,4],[101,5,101,7],[101,8,101,10],[101,11,101,13],[101,14,101,16],[101,17,101,20],[104,2,104,4],[104,5,104,7],[104,8,104,10],[104,11,104,13],[104,14,104,16],[104,17,104,20],[103,2,103,4],[103,5,103,7],[103,8,103,10],[103,11,103,13],[103,14,103,16],[103,17,103,20],[106,2,106,4],[106,5,106,7],[106,8,106,10],[106,11,106,13],[106,14,106,16],[106,17,106,20],[105,2,105,4],[105,5,105,7],[105,8,105,10],[105,11,105,13],[105,14,105,16],[105,17,105,20],[108,2,108,4],[108,5,108,7],[108,8,108,10],[108,11,108,13],[108,14,108,16],[108,17,108,20],[107,2,107,4],[107,5,107,7],[107,8,107,10],[107,11,107,13],[107,14,107,16],[107,17,107,20],[110,2,110,4],[110,5,110,7],[110,8,110,10],[110,11,110,13],[110,14,110,16],[110,17,110,20],[109,2,109,4],[109,5,109,7],[109,8,109,10],[109,11,109,13],[109,14,109,16],[109,17,109,20]]}
[]
[null,11,null,null,null,null,null,null,null,null,null,null,null,null,null,null,null,null,null,null,null,null,null,null,{"$f":"IF(S95+T95<>R95,\"FAUX\",\"OK\")","v":"OK"}]
[null,null,null,null,null,null,null,null,null,null,null,null,null,null,null,null,null,null,null,null,null,null,null,null,"Total","G","C"]
[null,"Noms",{"$f":"IF(ISNUMBER(B2),7*B2+DATE(Année,1,3)-WEEKDAY(DATE(Année,1,3))-5,\"\")","v":"2016-03-14"},"G","C",{"$f":"C4+1","v":"2016-03-15"},"G","C",{"$f":"F4+1","v":"2016-03-16"},"G","C",{"$f":"I4+1","v":"2016-03-17"},"G","C",{"$f":"L4+1","v":"2016-03-18"},"G","C","Total","G","B","Abs",null,null,null,{"$f":"R95","v":0},{"$f":"S95","v":0},{"$f":"T95","v":0}]
[null,null,null,null,null,null,null,null,null,null,null,null,null,null,null,null,null,{"$f":"somcoul(C5:Q5,\"rouge\")","v":0},{"$f":"COUNTIF(C5:Q5,(\"g\"))","v":0},{"$f":"COUNTIF(C5:Q5,(\"c\"))","v":0},{"$f":"COUNTIF(C5:Q5,\"abs\")","v":0}]
[null,null,null,null,null,null,null,null,null,null,null,null,null,null,null,null,null,{"$f":"somcoul(C6:Q6,\"rouge\")","v":0},{"$f":"COUNTIF(C6:Q6,(\"g\"))","v":0},{"$f":"COUNTIF(C6:Q6,(\"c\"))","v":0},{"$f":"COUNTIF(C6:Q6,\"abs\")","v":0}]
[null,null,null,null,null,null,null,null,null,null,null,null,null,null,null,null,null,0,0,0,0]
[null,null,null,null,null,null,null,null,null,null,null,null,null,null,null,null,null,0,0,0,0]
[null,null,null,null,null,null,null,null,null,null,null,null,null,null,null,null,null,0,0,0,0]
[null,null,null,null,null,null,null,null,null,null,null,null,null,null,null,null,null,0,0,0,0]
[null,null,null,null,null,null,null,null,null,null,null,null,null,null,null,null,null,0,0,0,0]
[null,null,null,null,null,null,null,null,null,null,null,null,null,null,null,null,null,0,0,0,0]
[null,null,null,null,null,null,null,null,null,null,null,null,null,null,null,null,null,0,0,0,0," ",null," ",null,null,"                                    "]
[null,null,null,null,null,null,null,null,null,null,null,null,null,null,null,null,null,0,0,0,0]
[null,null,null,null,null,null,null,null,null,null,null,null,null,null,null,null,null,0,0,0,0]
[null,null,null,null,null,null,null,null,null,null,null,null,null,null,null,null,null,0,0,0,0]
[null,null,null,null,null,null,null,null,null,null,null,null,null,null,null,null,null,0,0,0,0]
[null,null,null,null,null,null,null,null,null,null,null,null,null,null,null,null,null,0,0,0,0]
[null,null,null,null,null,null,null,null,null,null,null,null,null,null,null,null,null,0,0,0,0]
[null,null,null,null,null,null,null,null,null,null,null,null,null,null,null,null,null,0,0,0,0]
[null,null,null,null,null,null,null,null,null,null,null,null,null,null,null,null,null,0,0,0,0]
[null,null,null,null,null,null,null,null,null,null,null,null,null,null,null,null,null,0,0,0,0]
[null,null,null,null,null,null,null,null,null,null,null,null,null,null,null,null,null,0,0,0,0]
[null,null,null,null,null,null,null,null,null,null,null,null,null,null,null,null,null,0,0,0,0]
[null,null,null,null,null,null,null,null,null,null,null,null,null,null,null,null,null,0,0,0,0]
[null,null,null,null,null,null,null,null,null,null,null,null,null,null,null,null,null,0,0,0,0]
[null,null,null,null,null,null,null,null,null,null,null,null,null,null,null,null,null,0,0,0,0]
[null,null,null,null,null,null,null,null,null,null,null,null,null,null,null,null,null,0,0,0,0]
[null,null,null,null,null,null,null,null,null,null,null,null,null,null,null,null,null,0,0,0,0]
[null,null,null,null,null,null,null,null,null,null,null,null,null,null,null,null,null,0,0,0,0]
[null,null,null,null,null,null,null,null,null,null,null,null,null,null,null,null,null,{"$f":"somcoul(C31:Q31,\"rouge\")","v":0},{"$f":"COUNTIF(C31:Q31,(\"g\"))","v":0},{"$f":"COUNTIF(C31:Q31,(\"c\"))","v":0},{"$f":"COUNTIF(C31:Q31,\"abs\")","v":0}]
[null,null,null,null,null,null,null,null,null,null,null,null,null,null,null,null,null,0,0,0,0]
[null,null,null,null,null,null,null,null,null,null,null,null,null,null,null,null,null,0,0,0,0]
[null,null,null,null,null,null,null,null,null,null,null,null,null,null,null,null,null,0,0,0,0]
[null,null,null,null,null,null,null,null,null,null,null,null,null,null,null,null,null,0,0,0,0]
[null,null,null,null,null,null,null,null,null,null,null,null,null,null,null,null,null,0,0,0,0]
[null,null,null,null,null,null,null,null,null,null,null,null,null,null,null,null,null,0,0,0,0]
[null,null,null,null,null,null,null,null,null,null,null,null,null,null,null,null,null,0,0,0,0]
[null,null,null,null,null,null,null,null,null,null,null,null,null,null,null,null,null,0,0,0,0]
[null,null,null,null,null,null,null,null,null,null,null,null,null,null,null,null,null,0,0,0,0]
[null,null,null,null,null,null,null,null,null,null,null,null,null,null,null,null,null,0,0,0,0]
[null,null,null,null,null,null,null,null,null,null,null,null,null,null,null,null,null,0,0,0,0]
[null,null,null,null,null,null,null,null,null,null,null,null,null,null,null,null,null,0,0,0,0]
[null,null,null,null,null,null,null,null,null,null,null,null,null,null,null,null,null,0,0,0,0]
[null,null,null,null,null,null,null,null,null,null,null,null,null,null,null,null,null,0,0,0,0]
[null,null,null,null,null,null,null,null,null,null,null,null,null,null,null,null,null,0,0,0,0]
[null,null,null,null,null,null,null,null,null,null,null,null,null,null,null,null,null,0,0,0,0]
[null,null,null,null,null,null,null,null,null,null,null,null,null,null,null,null,null,0,0,0,0]
[null,null,null,null,null,null,null,null,null,null,null,null,null,null,null,null,null,0,0,0,0]
[null,null,null,null,null,null,null,null,null,null,null,null,null,null,null,null,null,0,0,0,0]
[null,null,null,null,null,null,null,null,null,null,null,null,null,null,null,null,null,0,0,0,0]
[null,null,null,null,null,null,null,null,null,null,null,null,null,null,null,null,null,0,0,0,0]
[null,null,null,null,null,null,null,null,null,null,null,null,null,null,null,null,null,0,0,0,0]
[null,null,null,null,null,null,null,null,null,null,null,null,null,null,null,null,null,0,0,0,0]
[null,null,null,null,null,null,null,null,null,null,null,null,null,null,null,null,null,0,0,0,0]
[null,null,null,null,null,null,null,null,null,null,null,null,null,null,null,null,null,0,0,0,0]
[null,null,null,null,null,null,null,null,null,null,null,null,null,null,null,null,null,0,0,0,0]
[null,null,null,null,null,null,null,null,null,null,null,null,null,null,null,null,null,0,0,0,0]
[null,null,null,null,null,null,null,null,null,null,null,null,null,null,null,null,null,0,0,0,0]
[null,null,null,null,null,null,null,null,null,null,null,null,null,null,null,null,null,0,0,0,0]
[null,null,null,null,null,null,null,null,null,null,null,null,null,null,null,null,null,0,0,0,0]
[null,null,null,null,null,null,null,null,null,null,null,null,null,null,null,null,null,0,0,0,0]
[null,null,null,null,null,null,null,null,null,null,null,null,null,null,null,null,null,0,0,0,0]
[null,null,null,null,null,null,null,null,null,null,null,null,null,null,null,null,null,0,0,0,0]
[null,null,null,null,null,null,null,null,null,null,null,null,null,null,null,null,null,0,0,0,0]
[null,null,null,null,null,null,null,null,null,null,null,null,null,null,null,null,null,0,0,0,0]
[null,null,null,null,null,null,null,null,null,null,null,null,null,null,null,null,null,0,0,0,0]
[null,null,null,null,null,null,null,null,null,null,null,null,null,null,null,null,null,0,0,0,0]
[null,null,null,null,null,null,null,null,null,null,null,null,null,null,null,null,null,0,0,0,0]
[null,null,null,null,null,null,null,null,null,null,null,null,null,null,null,null,null,0,0,0,{"$f":"COUNTIF(C70:Q70,\"abs\")","v":0}]
[null,null,null,null,null,null,null,null,null,null,null,null,null,null,null,null,null,0,0,0,0]
[null,null,null,null,null,null,null,null,null,null,null,null,null,null,null,null,null,0,0,0,0]
[null,null,null,null,null,null,null,null,null,null,null,null,null,null,null,null,null,0,0,0,0]
[null,null,null,null,null,null,null,null,null,null,null,null,null,null,null,null,null,0,0,0,0]
[null,null,null,null,null,null,null,null,null,null,null,null,null,null,null,null,null,0,0,0,0]
[null,null,null,null,null,null,null,null,null,null,null,null,null,null,null,null,null,0,0,0,0]
[null,null,null,null,null,null,null,null,null,null,null,null,null,null,null,null,null,0,0,0,0]
[null,null,null,null,null,null,null,null,null,null,null,null,null,null,null,null,null,0,0,0,0]
[null,null,null,null,null,null,null,null,null,null,null,null,null,null,null,null,null,0,0,0,0]
[null,null,null,null,null,null,null,null,null,null,null,null,null,null,null,null,null,0,0,0,0]
[null,null,null,null,null,null,null,null,null,null,null,null,null,null,null,null,null,0,0,0,0]
[null,null,null,null,null,null,null,null,null,null,null,null,null,null,null,null,null,0,0,0,0]
[null,null,null,null,null,null,null,null,null,null,null,null,null,null,null,null,null,0,0,0,0]
[null,null,null,null,null,null,null,null,null,null,null,null,null,null,null,null,null,0,0,0,0]
[null,null,null,null,null,null,null,null,null,null,null,null,null,null,null,null,null,0,0,0,0]
[null,null,null,null,null,null,null,null,null,null,null,null,null,null,null,null,null,0,0,0,0]
[null,null,null,null,null,null,null,null,null,null,null,null,null,null,null,null,null,0,0,0,0]
[null,null,null,null,null,null,null,null,null,null,null,null,null,null,null,null,null,0,0,0,0]
[null,null,null,null,null,null,null,null,null,null,null,null,null,null,null,null,null,0,0,0,0]
[null,null,null,null,null,null,null,null,null,null,null,null,null,null,null,null,null,0,0,0,0]
[null,null,null,null,null,null,null,null,null,null,null,null,null,null,null,null,null,0,0,0,0]
[null,null,null,null,null,null,null,null,null,null,null,null,null,null,null,null,null,0,0,0,0]
[null,null,null,null,null,null,null,null,null,null,null,null,null,null,null,null,null,0,0,0,0]
[null,null,null,null,null,null,null,null,null,null,null,null,null,null,null,null,null,0,0,0,{"$f":"COUNTIF(C94:Q94,\"abs\")","v":0}]
[null,"Totaux",{"$f":"COUNTIF(C5:C94,\"abs\")","v":0},null,null,{"$f":"COUNTIF(F5:F94,\"abs\")","v":0},null,null,{"$f":"COUNTIF(I5:I94,\"abs\")","v":0},null,null,{"$f":"COUNTIF(L5:L94,\"abs\")","v":0},null,null,{"$f":"COUNTIF(O5:O94,\"abs\")","v":0},null,null,{"$f":"SUM(R5:R94)","v":0},{"$f":"SUM(S5:S94)","v":0},{"$f":"SUM(T5:T94)","v":0},{"$f":"SUM(U5:U94)","v":0}]
[null,null,{"$f":"somcoul(C5:C94,\"rouge\")","v":0},{"$f":"COUNTIF(D5:D94,\"g\")","v":0},{"$f":"COUNTIF(E5:E94,\"c\")","v":0},{"$f":"somcoul(F5:F94,\"rouge\")","v":0},{"$f":"COUNTIF(G5:G94,\"g\")","v":0},{"$f":"COUNTIF(H5:H94,\"c\")","v":0},{"$f":"somcoul(I5:I94,\"rouge\")","v":0},{"$f":"COUNTIF(J6:J94,\"g\")","v":0},{"$f":"COUNTIF(K5:K94,\"c\")","v":0},{"$f":"somcoul(L5:L94,\"rouge\")","v":0},{"$f":"COUNTIF(M5:M94,\"g\")","v":0},{"$f":"COUNTIF(N6:N94,\"c\")","v":0},{"$f":"somcoul(O5:O94,\"rouge\")","v":0},{"$f":"COUNTIF(P5:P94,\"g\")","v":0},{"$f":"COUNTIF(Q5:Q94,\"c\")","v":0}]
[null,"6h30/8h00",{"$f":"COUNTIF(C5:C94,\"6h30/8h00\")","v":0},null,null,{"$f":"COUNTIF(F5:F94,\"6h30/8h00\")","v":0},null,null,{"$f":"COUNTIF(I5:I94,\"6h30/8h00\")","v":0},null,null,{"$f":"COUNTIF(L5:L94,\"6h30/8h00\")","v":0},null,null,{"$f":"COUNTIF(O5:O94,\"6h30/8h00\")","v":0},null,null,{"$f":"SUM(C97:Q97)","v":0}]
[null,"7h00/9h00",{"$f":"COUNTIF(C5:C94,\"7h00/9h00\")","v":0},null,null,{"$f":"COUNTIF(F5:F94,\"7h00/9h00\")","v":0},null,null,{"$f":"COUNTIF(I5:I94,\"7h00/9h00\")","v":0},null,null,{"$f":"COUNTIF(L5:L94,\"7h00/9h00\")","v":0},null,null,{"$f":"COUNTIF(O5:O94,\"7h00/9h00\")","v":0},null,null,0]
[null,"8h00/10h00",{"$f":"COUNTIF(C5:C94,\"8h00/10h00\")","v":0},null,null,{"$f":"COUNTIF(F5:F94,\"8h00/10h00\")","v":0},null,null,{"$f":"COUNTIF(I5:I94,\"8h00/10h00\")","v":0},null,null,{"$f":"COUNTIF(L5:L94,\"8h00/10h00\")","v":0},null,null,{"$f":"COUNTIF(O5:O94,\"8h00/10h00\")","v":0},null,null,0]
[null,"9h00/11h00",{"$f":"COUNTIF(C5:C94,\"9h00/11h00\")","v":0},null,null,{"$f":"COUNTIF(F5:F94,\"9h00/11h00\")","v":0},null,null,{"$f":"COUNTIF(I5:I94,\"9h00/11h00\")","v":0},null,null,{"$f":"COUNTIF(L5:L94,\"9h00/11h00\")","v":0},null,null,{"$f":"COUNTIF(O5:O94,\"9h00/11h00\")","v":0},null,null,0]
[null,"10h00/12h00",{"$f":"COUNTIF(C5:C94,\"10h00/12h00\")","v":0},null,null,{"$f":"COUNTIF(F5:F94,\"10h00/12h00\")","v":0},null,null,{"$f":"COUNTIF(I5:I94,\"10h00/12h00\")","v":0},null,null,{"$f":"COUNTIF(L5:L94,\"10h00/12h00\")","v":0},null,null,{"$f":"COUNTIF(O5:O94,\"10h00/12h00\")","v":0},null,null,0]
[null,"11h00/13h00",{"$f":"COUNTIF(C5:C94,\"11h00/13h00\")","v":0},null,null,{"$f":"COUNTIF(F5:F94,\"11h00/13h00\")","v":0},null,null,{"$f":"COUNTIF(I5:I94,\"11h00/13h00\")","v":0},null,null,{"$f":"COUNTIF(L5:L94,\"11h00/13h00\")","v":0},null,null,{"$f":"COUNTIF(O5:O94,\"11h00/13h00\")","v":0},null,null,0]
[null,"13h00/15h00",{"$f":"COUNTIF(C5:C94,\"13h00/15h00\")","v":0},null,null,{"$f":"COUNTIF(F5:F94,\"13h00/15h00\")","v":0},null,null,{"$f":"COUNTIF(I5:I94,\"13h00/15h00\")","v":0},null,null,{"$f":"COUNTIF(L5:L94,\"13h00/15h00\")","v":0},null,null,{"$f":"COUNTIF(O5:O94,\"13h00/15h00\")","v":0},null,null,0]
[null,"13h30/15h30",{"$f":"COUNTIF(C5:C94,\"13h30/15h30\")","v":0},null,null,{"$f":"COUNTIF(F5:F94,\"13h30/15h30\")","v":0},null,null,{"$f":"COUNTIF(I5:I94,\"13h30/15h30\")","v":0},null,null,{"$f":"COUNTIF(L5:L94,\"13h30/15h30\")","v":0},null,null,{"$f":"COUNTIF(O5:O94,\"13h30/15h30\")","v":0},null,null,0]
[null,"15h00/17h00",{"$f":"COUNTIF(C5:C94,\"15h00/17h00\")","v":0},null,null,{"$f":"COUNTIF(F5:F94,\"15h00/17h00\")","v":0},null,null,{"$f":"COUNTIF(I5:I94,\"15h00/17h00\")","v":0},null,null,{"$f":"COUNTIF(L5:L94,\"15h00/17h00\")","v":0},null,null,{"$f":"COUNTIF(O5:O94,\"15h00/17h00\")","v":0},null,null,0]
[null,"16h00/18h00",{"$f":"COUNTIF(C5:C94,\"16h00/18h00\")","v":0},null,null,{"$f":"COUNTIF(F5:F94,\"16h00/18h00\")","v":0},null,null,{"$f":"COUNTIF(I5:I94,\"16h00/18h00\")","v":0},null,null,{"$f":"COUNTIF(L5:L94,\"16h00/18h00\")","v":0},null,null,{"$f":"COUNTIF(O5:O94,\"16h00/18h00\")","v":0},null,null,0]
[null,"17h00/19h00",{"$f":"COUNTIF(C5:C94,\"17h00/19h00\")","v":0},null,null,{"$f":"COUNTIF(F5:F94,\"17h00/19h00\")","v":0},null,null,{"$f":"COUNTIF(I5:I94,\"17h00/19h00\")","v":0},null,null,{"$f":"COUNTIF(L5:L94,\"17h00/19h00\")","v":0},null,null,{"$f":"COUNTIF(O5:O94,\"17h00/19h00\")","v":0},null,null,0]
[null,"18h00/20h00",{"$f":"COUNTIF(C5:C94,\"18h00/20h00\")","v":0},null,null,{"$f":"COUNTIF(F5:F94,\"18h00/20h00\")","v":0},null,null,{"$f":"COUNTIF(I5:I94,\"18h00/20h00\")","v":0},null,null,{"$f":"COUNTIF(L5:L94,\"18h00/20h00\")","v":0},null,null,{"$f":"COUNTIF(O5:O94,\"18h00/20h00\")","v":0},null,null,0]
[null,"19h00/21h00",{"$f":"COUNTIF(C5:C94,\"19h00/21h00\")","v":0},null,null,{"$f":"COUNTIF(F5:F94,\"19h00/21h00\")","v":0},null,null,{"$f":"COUNTIF(I5:I94,\"19h00/21h00\")","v":0},null,null,{"$f":"COUNTIF(L5:L94,\"19h00/21h00\")","v":0},null,null,{"$f":"COUNTIF(O5:O94,\"19h00/21h00\")","v":0},null,null,0]
[null,"21h00/23h00",{"$f":"COUNTIF(C5:C94,\"21h00/23h00\")","v":0},null,null,{"$f":"COUNTIF(F5:F94,\"21h00/23h00\")","v":0},null,null,{"$f":"COUNTIF(I5:I94,\"21h00/23h00\")","v":0},null,null,{"$f":"COUNTIF(L5:L94,\"21h00/23h00\")","v":0},null,null,{"$f":"COUNTIF(O5:O94,\"21h00/23h00\")","v":0},null,null,0]
[null,"22h00/23h00",{"$f":"COUNTIF(C5:C94,\"22h00/23h00\")","v":0},null,null,{"$f":"COUNTIF(F5:F94,\"22h00/23h00\")","v":0},null,null,{"$f":"COUNTIF(I5:I94,\"22h00/23h00\")","v":0},null,null,{"$f":"COUNTIF(L5:L94,\"22h00/23h00\")","v":0},null,null,{"$f":"COUNTIF(O5:O94,\"22h00/23h00\")","v":0},null,null,0]

{"sheet":"K","index":11,"n_rows":111,"n_cols":27,"rows_kept":111,"cut":false,"hidden":false,"merged":[[1,24,1,26],[94,20,95,20],[96,2,96,4],[96,5,96,7],[96,8,96,10],[96,11,96,13],[96,14,96,16],[96,17,96,20],[1,1,1,21],[94,1,95,1],[94,2,94,4],[94,5,94,7],[94,8,94,10],[94,11,94,13],[94,14,94,16],[94,17,95,17],[94,18,95,18],[94,19,95,19],[98,2,98,4],[98,5,98,7],[98,8,98,10],[98,11,98,13],[98,14,98,16],[98,17,98,20],[97,2,97,4],[97,5,97,7],[97,8,97,10],[97,11,97,13],[97,14,97,16],[97,17,97,20],[100,2,100,4],[100,5,100,7],[100,8,100,10],[100,11,100,13],[100,14,100,16],[100,17,100,20],[99,2,99,4],[99,5,99,7],[99,8,99,10],[99,11,99,13],[99,14,99,16],[99,17,99,20],[102,2,102,4],[102,5,102,7],[102,8,102,10],[102,11,102,13],[102,14,102,16],[102,17,102,20],[101,2,101,4],[101,5,101,7],[101,8,101,10],[101,11,101,13],[101,14,101,16],[101,17,101,20],[104,2,104,4],[104,5,104,7],[104,8,104,10],[104,11,104,13],[104,14,104,16],[104,17,104,20],[103,2,103,4],[103,5,103,7],[103,8,103,10],[103,11,103,13],[103,14,103,16],[103,17,103,20],[106,2,106,4],[106,5,106,7],[106,8,106,10],[106,11,106,13],[106,14,106,16],[106,17,106,20],[105,2,105,4],[105,5,105,7],[105,8,105,10],[105,11,105,13],[105,14,105,16],[105,17,105,20],[108,2,108,4],[108,5,108,7],[108,8,108,10],[108,11,108,13],[108,14,108,16],[108,17,108,20],[107,2,107,4],[107,5,107,7],[107,8,107,10],[107,11,107,13],[107,14,107,16],[107,17,107,20],[110,2,110,4],[110,5,110,7],[110,8,110,10],[110,11,110,13],[110,14,110,16],[110,17,110,20],[109,2,109,4],[109,5,109,7],[109,8,109,10],[109,11,109,13],[109,14,109,16],[109,17,109,20]]}
[]
[null,11,null,null,null,null,null,null,null,null,null,null,null,null,null,null,null,null,null,null,null,null,null,null,{"$f":"IF(S95+T95<>R95,\"FAUX\",\"OK\")","v":"OK"}]
[null,null,null,null,null,null,null,null,null,null,null,null,null,null,null,null,null,null,null,null,null,null,null,null,"Total","G","C"]
[null,"Noms",{"$f":"IF(ISNUMBER(B2),7*B2+DATE(Année,1,3)-WEEKDAY(DATE(Année,1,3))-5,\"\")","v":"2016-03-14"},"G","C",{"$f":"C4+1","v":"2016-03-15"},"G","C",{"$f":"F4+1","v":"2016-03-16"},"G","C",{"$f":"I4+1","v":"2016-03-17"},"G","C",{"$f":"L4+1","v":"2016-03-18"},"G","C","Total","G","B","Abs",null,null,null,{"$f":"R95","v":0},{"$f":"S95","v":0},{"$f":"T95","v":0}]
[null,null,null,null,null,null,null,null,null,null,null,null,null,null,null,null,null,{"$f":"somcoul(C5:Q5,\"rouge\")","v":0},{"$f":"COUNTIF(C5:Q5,(\"g\"))","v":0},{"$f":"COUNTIF(C5:Q5,(\"c\"))","v":0},{"$f":"COUNTIF(C5:Q5,\"abs\")","v":0}]
[null,null,null,null,null,null,null,null,null,null,null,null,null,null,null,null,null,{"$f":"somcoul(C6:Q6,\"rouge\")","v":0},{"$f":"COUNTIF(C6:Q6,(\"g\"))","v":0},{"$f":"COUNTIF(C6:Q6,(\"c\"))","v":0},{"$f":"COUNTIF(C6:Q6,\"abs\")","v":0}]
[null,null,null,null,null,null,null,null,null,null,null,null,null,null,null,null,null,0,0,0,0]
[null,null,null,null,null,null,null,null,null,null,null,null,null,null,null,null,null,0,0,0,0]
[null,null,null,null,null,null,null,null,null,null,null,null,null,null,null,null,null,0,0,0,0]
[null,null,null,null,null,null,null,null,null,null,null,null,null,null,null,null,null,0,0,0,0]
[null,null,null,null,null,null,null,null,null,null,null,null,null,null,null,null,null,0,0,0,0]
[null,null,null,null,null,null,null,null,null,null,null,null,null,null,null,null,null,0,0,0,0]
[null,null,null,null,null,null,null,null,null,null,null,null,null,null,null,null,null,0,0,0,0," ",null," ",null,null,"                                    "]
[null,null,null,null,null,null,null,null,null,null,null,null,null,null,null,null,null,0,0,0,0]
[null,null,null,null,null,null,null,null,null,null,null,null,null,null,null,null,null,0,0,0,0]
[null,null,null,null,null,null,null,null,null,null,null,null,null,null,null,null,null,0,0,0,0]
[null,null,null,null,null,null,null,null,null,null,null,null,null,null,null,null,null,0,0,0,0]
[null,null,null,null,null,null,null,null,null,null,null,null,null,null,null,null,null,0,0,0,0]
[null,null,null,null,null,null,null,null,null,null,null,null,null,null,null,null,null,0,0,0,0]
[null,null,null,null,null,null,null,null,null,null,null,null,null,null,null,null,null,0,0,0,0]
[null,null,null,null,null,null,null,null,null,null,null,null,null,null,null,null,null,0,0,0,0]
[null,null,null,null,null,null,null,null,null,null,null,null,null,null,null,null,null,0,0,0,0]
[null,null,null,null,null,null,null,null,null,null,null,null,null,null,null,null,null,0,0,0,0]
[null,null,null,null,null,null,null,null,null,null,null,null,null,null,null,null,null,0,0,0,0]
[null,null,null,null,null,null,null,null,null,null,null,null,null,null,null,null,null,0,0,0,0]
[null,null,null,null,null,null,null,null,null,null,null,null,null,null,null,null,null,0,0,0,0]
[null,null,null,null,null,null,null,null,null,null,null,null,null,null,null,null,null,0,0,0,0]
[null,null,null,null,null,null,null,null,null,null,null,null,null,null,null,null,null,0,0,0,0]
[null,null,null,null,null,null,null,null,null,null,null,null,null,null,null,null,null,0,0,0,0]
[null,null,null,null,null,null,null,null,null,null,null,null,null,null,null,null,null,0,0,0,0]
[null,null,null,null,null,null,null,null,null,null,null,null,null,null,null,null,null,{"$f":"somcoul(C31:Q31,\"rouge\")","v":0},{"$f":"COUNTIF(C31:Q31,(\"g\"))","v":0},{"$f":"COUNTIF(C31:Q31,(\"c\"))","v":0},{"$f":"COUNTIF(C31:Q31,\"abs\")","v":0}]
[null,null,null,null,null,null,null,null,null,null,null,null,null,null,null,null,null,0,0,0,0]
[null,null,null,null,null,null,null,null,null,null,null,null,null,null,null,null,null,0,0,0,0]
[null,null,null,null,null,null,null,null,null,null,null,null,null,null,null,null,null,0,0,0,0]
[null,null,null,null,null,null,null,null,null,null,null,null,null,null,null,null,null,0,0,0,0]
[null,null,null,null,null,null,null,null,null,null,null,null,null,null,null,null,null,0,0,0,0]
[null,null,null,null,null,null,null,null,null,null,null,null,null,null,null,null,null,0,0,0,0]
[null,null,null,null,null,null,null,null,null,null,null,null,null,null,null,null,null,0,0,0,0]
[null,null,null,null,null,null,null,null,null,null,null,null,null,null,null,null,null,0,0,0,0]
[null,null,null,null,null,null,null,null,null,null,null,null,null,null,null,null,null,0,0,0,0]
[null,null,null,null,null,null,null,null,null,null,null,null,null,null,null,null,null,0,0,0,0]
[null,null,null,null,null,null,null,null,null,null,null,null,null,null,null,null,null,0,0,0,0]
[null,null,null,null,null,null,null,null,null,null,null,null,null,null,null,null,null,0,0,0,0]
[null,null,null,null,null,null,null,null,null,null,null,null,null,null,null,null,null,0,0,0,0]
[null,null,null,null,null,null,null,null,null,null,null,null,null,null,null,null,null,0,0,0,0]
[null,null,null,null,null,null,null,null,null,null,null,null,null,null,null,null,null,0,0,0,0]
[null,null,null,null,null,null,null,null,null,null,null,null,null,null,null,null,null,0,0,0,0]
[null,null,null,null,null,null,null,null,null,null,null,null,null,null,null,null,null,0,0,0,0]
[null,null,null,null,null,null,null,null,null,null,null,null,null,null,null,null,null,0,0,0,0]
[null,null,null,null,null,null,null,null,null,null,null,null,null,null,null,null,null,0,0,0,0]
[null,null,null,null,null,null,null,null,null,null,null,null,null,null,null,null,null,0,0,0,0]
[null,null,null,null,null,null,null,null,null,null,null,null,null,null,null,null,null,0,0,0,0]
[null,null,null,null,null,null,null,null,null,null,null,null,null,null,null,null,null,0,0,0,0]
[null,null,null,null,null,null,null,null,null,null,null,null,null,null,null,null,null,0,0,0,0]
[null,null,null,null,null,null,null,null,null,null,null,null,null,null,null,null,null,0,0,0,0]
[null,null,null,null,null,null,null,null,null,null,null,null,null,null,null,null,null,0,0,0,0]
[null,null,null,null,null,null,null,null,null,null,null,null,null,null,null,null,null,0,0,0,0]
[null,null,null,null,null,null,null,null,null,null,null,null,null,null,null,null,null,0,0,0,0]
[null,null,null,null,null,null,null,null,null,null,null,null,null,null,null,null,null,0,0,0,0]
[null,null,null,null,null,null,null,null,null,null,null,null,null,null,null,null,null,0,0,0,0]
[null,null,null,null,null,null,null,null,null,null,null,null,null,null,null,null,null,0,0,0,0]
[null,null,null,null,null,null,null,null,null,null,null,null,null,null,null,null,null,0,0,0,0]
[null,null,null,null,null,null,null,null,null,null,null,null,null,null,null,null,null,0,0,0,0]
[null,null,null,null,null,null,null,null,null,null,null,null,null,null,null,null,null,0,0,0,0]
[null,null,null,null,null,null,null,null,null,null,null,null,null,null,null,null,null,0,0,0,0]
[null,null,null,null,null,null,null,null,null,null,null,null,null,null,null,null,null,0,0,0,0]
[null,null,null,null,null,null,null,null,null,null,null,null,null,null,null,null,null,0,0,0,0]
[null,null,null,null,null,null,null,null,null,null,null,null,null,null,null,null,null,0,0,0,0]
[null,null,null,null,null,null,null,null,null,null,null,null,null,null,null,null,null,0,0,0,0]
[null,null,null,null,null,null,null,null,null,null,null,null,null,null,null,null,null,0,0,0,{"$f":"COUNTIF(C70:Q70,\"abs\")","v":0}]
[null,null,null,null,null,null,null,null,null,null,null,null,null,null,null,null,null,0,0,0,0]
[null,null,null,null,null,null,null,null,null,null,null,null,null,null,null,null,null,0,0,0,0]
[null,null,null,null,null,null,null,null,null,null,null,null,null,null,null,null,null,0,0,0,0]
[null,null,null,null,null,null,null,null,null,null,null,null,null,null,null,null,null,0,0,0,0]
[null,null,null,null,null,null,null,null,null,null,null,null,null,null,null,null,null,0,0,0,0]
[null,null,null,null,null,null,null,null,null,null,null,null,null,null,null,null,null,0,0,0,0]
[null,null,null,null,null,null,null,null,null,null,null,null,null,null,null,null,null,0,0,0,0]
[null,null,null,null,null,null,null,null,null,null,null,null,null,null,null,null,null,0,0,0,0]
[null,null,null,null,null,null,null,null,null,null,null,null,null,null,null,null,null,0,0,0,0]
[null,null,null,null,null,null,null,null,null,null,null,null,null,null,null,null,null,0,0,0,0]
[null,null,null,null,null,null,null,null,null,null,null,null,null,null,null,null,null,0,0,0,0]
[null,null,null,null,null,null,null,null,null,null,null,null,null,null,null,null,null,0,0,0,0]
[null,null,null,null,null,null,null,null,null,null,null,null,null,null,null,null,null,0,0,0,0]
[null,null,null,null,null,null,null,null,null,null,null,null,null,null,null,null,null,0,0,0,0]
[null,null,null,null,null,null,null,null,null,null,null,null,null,null,null,null,null,0,0,0,0]
[null,null,null,null,null,null,null,null,null,null,null,null,null,null,null,null,null,0,0,0,0]
[null,null,null,null,null,null,null,null,null,null,null,null,null,null,null,null,null,0,0,0,0]
[null,null,null,null,null,null,null,null,null,null,null,null,null,null,null,null,null,0,0,0,0]
[null,null,null,null,null,null,null,null,null,null,null,null,null,null,null,null,null,0,0,0,0]
[null,null,null,null,null,null,null,null,null,null,null,null,null,null,null,null,null,0,0,0,0]
[null,null,null,null,null,null,null,null,null,null,null,null,null,null,null,null,null,0,0,0,0]
[null,null,null,null,null,null,null,null,null,null,null,null,null,null,null,null,null,0,0,0,0]
[null,null,null,null,null,null,null,null,null,null,null,null,null,null,null,null,null,0,0,0,0]
[null,null,null,null,null,null,null,null,null,null,null,null,null,null,null,null,null,0,0,0,{"$f":"COUNTIF(C94:Q94,\"abs\")","v":0}]
[null,"Totaux",{"$f":"COUNTIF(C5:C94,\"abs\")","v":0},null,null,{"$f":"COUNTIF(F5:F94,\"abs\")","v":0},null,null,{"$f":"COUNTIF(I5:I94,\"abs\")","v":0},null,null,{"$f":"COUNTIF(L5:L94,\"abs\")","v":0},null,null,{"$f":"COUNTIF(O5:O94,\"abs\")","v":0},null,null,{"$f":"SUM(R5:R94)","v":0},{"$f":"SUM(S5:S94)","v":0},{"$f":"SUM(T5:T94)","v":0},{"$f":"SUM(U5:U94)","v":0}]
[null,null,{"$f":"somcoul(C5:C94,\"rouge\")","v":0},{"$f":"COUNTIF(D5:D94,\"g\")","v":0},{"$f":"COUNTIF(E5:E94,\"c\")","v":0},{"$f":"somcoul(F5:F94,\"rouge\")","v":0},{"$f":"COUNTIF(G5:G94,\"g\")","v":0},{"$f":"COUNTIF(H5:H94,\"c\")","v":0},{"$f":"somcoul(I5:I94,\"rouge\")","v":0},{"$f":"COUNTIF(J6:J94,\"g\")","v":0},{"$f":"COUNTIF(K5:K94,\"c\")","v":0},{"$f":"somcoul(L5:L94,\"rouge\")","v":0},{"$f":"COUNTIF(M5:M94,\"g\")","v":0},{"$f":"COUNTIF(N6:N94,\"c\")","v":0},{"$f":"somcoul(O5:O94,\"rouge\")","v":0},{"$f":"COUNTIF(P5:P94,\"g\")","v":0},{"$f":"COUNTIF(Q5:Q94,\"c\")","v":0}]
[null,"6h30/8h00",{"$f":"COUNTIF(C5:C94,\"6h30/8h00\")","v":0},null,null,{"$f":"COUNTIF(F5:F94,\"6h30/8h00\")","v":0},null,null,{"$f":"COUNTIF(I5:I94,\"6h30/8h00\")","v":0},null,null,{"$f":"COUNTIF(L5:L94,\"6h30/8h00\")","v":0},null,null,{"$f":"COUNTIF(O5:O94,\"6h30/8h00\")","v":0},null,null,{"$f":"SUM(C97:Q97)","v":0}]
[null,"7h00/9h00",{"$f":"COUNTIF(C5:C94,\"7h00/9h00\")","v":0},null,null,{"$f":"COUNTIF(F5:F94,\"7h00/9h00\")","v":0},null,null,{"$f":"COUNTIF(I5:I94,\"7h00/9h00\")","v":0},null,null,{"$f":"COUNTIF(L5:L94,\"7h00/9h00\")","v":0},null,null,{"$f":"COUNTIF(O5:O94,\"7h00/9h00\")","v":0},null,null,0]
[null,"8h00/10h00",{"$f":"COUNTIF(C5:C94,\"8h00/10h00\")","v":0},null,null,{"$f":"COUNTIF(F5:F94,\"8h00/10h00\")","v":0},null,null,{"$f":"COUNTIF(I5:I94,\"8h00/10h00\")","v":0},null,null,{"$f":"COUNTIF(L5:L94,\"8h00/10h00\")","v":0},null,null,{"$f":"COUNTIF(O5:O94,\"8h00/10h00\")","v":0},null,null,0]
[null,"9h00/11h00",{"$f":"COUNTIF(C5:C94,\"9h00/11h00\")","v":0},null,null,{"$f":"COUNTIF(F5:F94,\"9h00/11h00\")","v":0},null,null,{"$f":"COUNTIF(I5:I94,\"9h00/11h00\")","v":0},null,null,{"$f":"COUNTIF(L5:L94,\"9h00/11h00\")","v":0},null,null,{"$f":"COUNTIF(O5:O94,\"9h00/11h00\")","v":0},null,null,0]
[null,"10h00/12h00",{"$f":"COUNTIF(C5:C94,\"10h00/12h00\")","v":0},null,null,{"$f":"COUNTIF(F5:F94,\"10h00/12h00\")","v":0},null,null,{"$f":"COUNTIF(I5:I94,\"10h00/12h00\")","v":0},null,null,{"$f":"COUNTIF(L5:L94,\"10h00/12h00\")","v":0},null,null,{"$f":"COUNTIF(O5:O94,\"10h00/12h00\")","v":0},null,null,0]
[null,"11h00/13h00",{"$f":"COUNTIF(C5:C94,\"11h00/13h00\")","v":0},null,null,{"$f":"COUNTIF(F5:F94,\"11h00/13h00\")","v":0},null,null,{"$f":"COUNTIF(I5:I94,\"11h00/13h00\")","v":0},null,null,{"$f":"COUNTIF(L5:L94,\"11h00/13h00\")","v":0},null,null,{"$f":"COUNTIF(O5:O94,\"11h00/13h00\")","v":0},null,null,0]
[null,"13h00/15h00",{"$f":"COUNTIF(C5:C94,\"13h00/15h00\")","v":0},null,null,{"$f":"COUNTIF(F5:F94,\"13h00/15h00\")","v":0},null,null,{"$f":"COUNTIF(I5:I94,\"13h00/15h00\")","v":0},null,null,{"$f":"COUNTIF(L5:L94,\"13h00/15h00\")","v":0},null,null,{"$f":"COUNTIF(O5:O94,\"13h00/15h00\")","v":0},null,null,0]
[null,"13h30/15h30",{"$f":"COUNTIF(C5:C94,\"13h30/15h30\")","v":0},null,null,{"$f":"COUNTIF(F5:F94,\"13h30/15h30\")","v":0},null,null,{"$f":"COUNTIF(I5:I94,\"13h30/15h30\")","v":0},null,null,{"$f":"COUNTIF(L5:L94,\"13h30/15h30\")","v":0},null,null,{"$f":"COUNTIF(O5:O94,\"13h30/15h30\")","v":0},null,null,0]
[null,"15h00/17h00",{"$f":"COUNTIF(C5:C94,\"15h00/17h00\")","v":0},null,null,{"$f":"COUNTIF(F5:F94,\"15h00/17h00\")","v":0},null,null,{"$f":"COUNTIF(I5:I94,\"15h00/17h00\")","v":0},null,null,{"$f":"COUNTIF(L5:L94,\"15h00/17h00\")","v":0},null,null,{"$f":"COUNTIF(O5:O94,\"15h00/17h00\")","v":0},null,null,0]
[null,"16h00/18h00",{"$f":"COUNTIF(C5:C94,\"16h00/18h00\")","v":0},null,null,{"$f":"COUNTIF(F5:F94,\"16h00/18h00\")","v":0},null,null,{"$f":"COUNTIF(I5:I94,\"16h00/18h00\")","v":0},null,null,{"$f":"COUNTIF(L5:L94,\"16h00/18h00\")","v":0},null,null,{"$f":"COUNTIF(O5:O94,\"16h00/18h00\")","v":0},null,null,0]
[null,"17h00/19h00",{"$f":"COUNTIF(C5:C94,\"17h00/19h00\")","v":0},null,null,{"$f":"COUNTIF(F5:F94,\"17h00/19h00\")","v":0},null,null,{"$f":"COUNTIF(I5:I94,\"17h00/19h00\")","v":0},null,null,{"$f":"COUNTIF(L5:L94,\"17h00/19h00\")","v":0},null,null,{"$f":"COUNTIF(O5:O94,\"17h00/19h00\")","v":0},null,null,0]
[null,"18h00/20h00",{"$f":"COUNTIF(C5:C94,\"18h00/20h00\")","v":0},null,null,{"$f":"COUNTIF(F5:F94,\"18h00/20h00\")","v":0},null,null,{"$f":"COUNTIF(I5:I94,\"18h00/20h00\")","v":0},null,null,{"$f":"COUNTIF(L5:L94,\"18h00/20h00\")","v":0},null,null,{"$f":"COUNTIF(O5:O94,\"18h00/20h00\")","v":0},null,null,0]
[null,"19h00/21h00",{"$f":"COUNTIF(C5:C94,\"19h00/21h00\")","v":0},null,null,{"$f":"COUNTIF(F5:F94,\"19h00/21h00\")","v":0},null,null,{"$f":"COUNTIF(I5:I94,\"19h00/21h00\")","v":0},null,null,{"$f":"COUNTIF(L5:L94,\"19h00/21h00\")","v":0},null,null,{"$f":"COUNTIF(O5:O94,\"19h00/21h00\")","v":0},null,null,0]
[null,"21h00/23h00",{"$f":"COUNTIF(C5:C94,\"21h00/23h00\")","v":0},null,null,{"$f":"COUNTIF(F5:F94,\"21h00/23h00\")","v":0},null,null,{"$f":"COUNTIF(I5:I94,\"21h00/23h00\")","v":0},null,null,{"$f":"COUNTIF(L5:L94,\"21h00/23h00\")","v":0},null,null,{"$f":"COUNTIF(O5:O94,\"21h00/23h00\")","v":0},null,null,0]
[null,"22h00/23h00",{"$f":"COUNTIF(C5:C94,\"22h00/23h00\")","v":0},null,null,{"$f":"COUNTIF(F5:F94,\"22h00/23h00\")","v":0},null,null,{"$f":"COUNTIF(I5:I94,\"22h00/23h00\")","v":0},null,null,{"$f":"COUNTIF(L5:L94,\"22h00/23h00\")","v":0},null,null,{"$f":"COUNTIF(O5:O94,\"22h00/23h00\")","v":0},null,null,0]

{"sheet":"L","index":12,"n_rows":111,"n_cols":27,"rows_kept":111,"cut":false,"hidden":false,"merged":[[1,24,1,26],[94,20,95,20],[96,2,96,4],[96,5,96,7],[96,8,96,10],[96,11,96,13],[96,14,96,16],[96,17,96,20],[1,1,1,21],[94,1,95,1],[94,2,94,4],[94,5,94,7],[94,8,94,10],[94,11,94,13],[94,14,94,16],[94,17,95,17],[94,18,95,18],[94,19,95,19],[98,2,98,4],[98,5,98,7],[98,8,98,10],[98,11,98,13],[98,14,98,16],[98,17,98,20],[97,2,97,4],[97,5,97,7],[97,8,97,10],[97,11,97,13],[97,14,97,16],[97,17,97,20],[100,2,100,4],[100,5,100,7],[100,8,100,10],[100,11,100,13],[100,14,100,16],[100,17,100,20],[99,2,99,4],[99,5,99,7],[99,8,99,10],[99,11,99,13],[99,14,99,16],[99,17,99,20],[102,2,102,4],[102,5,102,7],[102,8,102,10],[102,11,102,13],[102,14,102,16],[102,17,102,20],[101,2,101,4],[101,5,101,7],[101,8,101,10],[101,11,101,13],[101,14,101,16],[101,17,101,20],[104,2,104,4],[104,5,104,7],[104,8,104,10],[104,11,104,13],[104,14,104,16],[104,17,104,20],[103,2,103,4],[103,5,103,7],[103,8,103,10],[103,11,103,13],[103,14,103,16],[103,17,103,20],[106,2,106,4],[106,5,106,7],[106,8,106,10],[106,11,106,13],[106,14,106,16],[106,17,106,20],[105,2,105,4],[105,5,105,7],[105,8,105,10],[105,11,105,13],[105,14,105,16],[105,17,105,20],[108,2,108,4],[108,5,108,7],[108,8,108,10],[108,11,108,13],[108,14,108,16],[108,17,108,20],[107,2,107,4],[107,5,107,7],[107,8,107,10],[107,11,107,13],[107,14,107,16],[107,17,107,20],[110,2,110,4],[110,5,110,7],[110,8,110,10],[110,11,110,13],[110,14,110,16],[110,17,110,20],[109,2,109,4],[109,5,109,7],[109,8,109,10],[109,11,109,13],[109,14,109,16],[109,17,109,20]]}
[]
[null,11,null,null,null,null,null,null,null,null,null,null,null,null,null,null,null,null,null,null,null,null,null,null,{"$f":"IF(S95+T95<>R95,\"FAUX\",\"OK\")","v":"OK"}]
[null,null,null,null,null,null,null,null,null,null,null,null,null,null,null,null,null,null,null,null,null,null,null,null,"Total","G","C"]
[null,"Noms",{"$f":"IF(ISNUMBER(B2),7*B2+DATE(Année,1,3)-WEEKDAY(DATE(Année,1,3))-5,\"\")","v":"2016-03-14"},"G","C",{"$f":"C4+1","v":"2016-03-15"},"G","C",{"$f":"F4+1","v":"2016-03-16"},"G","C",{"$f":"I4+1","v":"2016-03-17"},"G","C",{"$f":"L4+1","v":"2016-03-18"},"G","C","Total","G","B","Abs",null,null,null,{"$f":"R95","v":0},{"$f":"S95","v":0},{"$f":"T95","v":0}]
[null,null,null,null,null,null,null,null,null,null,null,null,null,null,null,null,null,{"$f":"somcoul(C5:Q5,\"rouge\")","v":0},{"$f":"COUNTIF(C5:Q5,(\"g\"))","v":0},{"$f":"COUNTIF(C5:Q5,(\"c\"))","v":0},{"$f":"COUNTIF(C5:Q5,\"abs\")","v":0}]
[null,null,null,null,null,null,null,null,null,null,null,null,null,null,null,null,null,{"$f":"somcoul(C6:Q6,\"rouge\")","v":0},{"$f":"COUNTIF(C6:Q6,(\"g\"))","v":0},{"$f":"COUNTIF(C6:Q6,(\"c\"))","v":0},{"$f":"COUNTIF(C6:Q6,\"abs\")","v":0}]
[null,null,null,null,null,null,null,null,null,null,null,null,null,null,null,null,null,0,0,0,0]
[null,null,null,null,null,null,null,null,null,null,null,null,null,null,null,null,null,0,0,0,0]
[null,null,null,null,null,null,null,null,null,null,null,null,null,null,null,null,null,0,0,0,0]
[null,null,null,null,null,null,null,null,null,null,null,null,null,null,null,null,null,0,0,0,0]
[null,null,null,null,null,null,null,null,null,null,null,null,null,null,null,null,null,0,0,0,0]
[null,null,null,null,null,null,null,null,null,null,null,null,null,null,null,null,null,0,0,0,0]
[null,null,null,null,null,null,null,null,null,null,null,null,null,null,null,null,null,0,0,0,0," ",null," ",null,null,"                                    "]
[null,null,null,null,null,null,null,null,null,null,null,null,null,null,null,null,null,0,0,0,0]
[null,null,null,null,null,null,null,null,null,null,null,null,null,null,null,null,null,0,0,0,0]
[null,null,null,null,null,null,null,null,null,null,null,null,null,null,null,null,null,0,0,0,0]
[null,null,null,null,null,null,null,null,null,null,null,null,null,null,null,null,null,0,0,0,0]
[null,null,null,null,null,null,null,null,null,null,null,null,null,null,null,null,null,0,0,0,0]
[null,null,null,null,null,null,null,null,null,null,null,null,null,null,null,null,null,0,0,0,0]
[null,null,null,null,null,null,null,null,null,null,null,null,null,null,null,null,null,0,0,0,0]
[null,null,null,null,null,null,null,null,null,null,null,null,null,null,null,null,null,0,0,0,0]
[null,null,null,null,null,null,null,null,null,null,null,null,null,null,null,null,null,0,0,0,0]
[null,null,null,null,null,null,null,null,null,null,null,null,null,null,null,null,null,0,0,0,0]
[null,null,null,null,null,null,null,null,null,null,null,null,null,null,null,null,null,0,0,0,0]
[null,null,null,null,null,null,null,null,null,null,null,null,null,null,null,null,null,0,0,0,0]
[null,null,null,null,null,null,null,null,null,null,null,null,null,null,null,null,null,0,0,0,0]
[null,null,null,null,null,null,null,null,null,null,null,null,null,null,null,null,null,0,0,0,0]
[null,null,null,null,null,null,null,null,null,null,null,null,null,null,null,null,null,0,0,0,0]
[null,null,null,null,null,null,null,null,null,null,null,null,null,null,null,null,null,0,0,0,0]
[null,null,null,null,null,null,null,null,null,null,null,null,null,null,null,null,null,0,0,0,0]
[null,null,null,null,null,null,null,null,null,null,null,null,null,null,null,null,null,{"$f":"somcoul(C31:Q31,\"rouge\")","v":0},{"$f":"COUNTIF(C31:Q31,(\"g\"))","v":0},{"$f":"COUNTIF(C31:Q31,(\"c\"))","v":0},{"$f":"COUNTIF(C31:Q31,\"abs\")","v":0}]
[null,null,null,null,null,null,null,null,null,null,null,null,null,null,null,null,null,0,0,0,0]
[null,null,null,null,null,null,null,null,null,null,null,null,null,null,null,null,null,0,0,0,0]
[null,null,null,null,null,null,null,null,null,null,null,null,null,null,null,null,null,0,0,0,0]
[null,null,null,null,null,null,null,null,null,null,null,null,null,null,null,null,null,0,0,0,0]
[null,null,null,null,null,null,null,null,null,null,null,null,null,null,null,null,null,0,0,0,0]
[null,null,null,null,null,null,null,null,null,null,null,null,null,null,null,null,null,0,0,0,0]
[null,null,null,null,null,null,null,null,null,null,null,null,null,null,null,null,null,0,0,0,0]
[null,null,null,null,null,null,null,null,null,null,null,null,null,null,null,null,null,0,0,0,0]
[null,null,null,null,null,null,null,null,null,null,null,null,null,null,null,null,null,0,0,0,0]
[null,null,null,null,null,null,null,null,null,null,null,null,null,null,null,null,null,0,0,0,0]
[null,null,null,null,null,null,null,null,null,null,null,null,null,null,null,null,null,0,0,0,0]
[null,null,null,null,null,null,null,null,null,null,null,null,null,null,null,null,null,0,0,0,0]
[null,null,null,null,null,null,null,null,null,null,null,null,null,null,null,null,null,0,0,0,0]
[null,null,null,null,null,null,null,null,null,null,null,null,null,null,null,null,null,0,0,0,0]
[null,null,null,null,null,null,null,null,null,null,null,null,null,null,null,null,null,0,0,0,0]
[null,null,null,null,null,null,null,null,null,null,null,null,null,null,null,null,null,0,0,0,0]
[null,null,null,null,null,null,null,null,null,null,null,null,null,null,null,null,null,0,0,0,0]
[null,null,null,null,null,null,null,null,null,null,null,null,null,null,null,null,null,0,0,0,0]
[null,null,null,null,null,null,null,null,null,null,null,null,null,null,null,null,null,0,0,0,0]
[null,null,null,null,null,null,null,null,null,null,null,null,null,null,null,null,null,0,0,0,0]
[null,null,null,null,null,null,null,null,null,null,null,null,null,null,null,null,null,0,0,0,0]
[null,null,null,null,null,null,null,null,null,null,null,null,null,null,null,null,null,0,0,0,0]
[null,null,null,null,null,null,null,null,null,null,null,null,null,null,null,null,null,0,0,0,0]
[null,null,null,null,null,null,null,null,null,null,null,null,null,null,null,null,null,0,0,0,0]
[null,null,null,null,null,null,null,null,null,null,null,null,null,null,null,null,null,0,0,0,0]
[null,null,null,null,null,null,null,null,null,null,null,null,null,null,null,null,null,0,0,0,0]
[null,null,null,null,null,null,null,null,null,null,null,null,null,null,null,null,null,0,0,0,0]
[null,null,null,null,null,null,null,null,null,null,null,null,null,null,null,null,null,0,0,0,0]
[null,null,null,null,null,null,null,null,null,null,null,null,null,null,null,null,null,0,0,0,0]
[null,null,null,null,null,null,null,null,null,null,null,null,null,null,null,null,null,0,0,0,0]
[null,null,null,null,null,null,null,null,null,null,null,null,null,null,null,null,null,0,0,0,0]
[null,null,null,null,null,null,null,null,null,null,null,null,null,null,null,null,null,0,0,0,0]
[null,null,null,null,null,null,null,null,null,null,null,null,null,null,null,null,null,0,0,0,0]
[null,null,null,null,null,null,null,null,null,null,null,null,null,null,null,null,null,0,0,0,0]
[null,null,null,null,null,null,null,null,null,null,null,null,null,null,null,null,null,0,0,0,0]
[null,null,null,null,null,null,null,null,null,null,null,null,null,null,null,null,null,0,0,0,0]
[null,null,null,null,null,null,null,null,null,null,null,null,null,null,null,null,null,0,0,0,0]
[null,null,null,null,null,null,null,null,null,null,null,null,null,null,null,null,null,0,0,0,0]
[null,null,null,null,null,null,null,null,null,null,null,null,null,null,null,null,null,0,0,0,{"$f":"COUNTIF(C70:Q70,\"abs\")","v":0}]
[null,null,null,null,null,null,null,null,null,null,null,null,null,null,null,null,null,0,0,0,0]
[null,null,null,null,null,null,null,null,null,null,null,null,null,null,null,null,null,0,0,0,0]
[null,null,null,null,null,null,null,null,null,null,null,null,null,null,null,null,null,0,0,0,0]
[null,null,null,null,null,null,null,null,null,null,null,null,null,null,null,null,null,0,0,0,0]
[null,null,null,null,null,null,null,null,null,null,null,null,null,null,null,null,null,0,0,0,0]
[null,null,null,null,null,null,null,null,null,null,null,null,null,null,null,null,null,0,0,0,0]
[null,null,null,null,null,null,null,null,null,null,null,null,null,null,null,null,null,0,0,0,0]
[null,null,null,null,null,null,null,null,null,null,null,null,null,null,null,null,null,0,0,0,0]
[null,null,null,null,null,null,null,null,null,null,null,null,null,null,null,null,null,0,0,0,0]
[null,null,null,null,null,null,null,null,null,null,null,null,null,null,null,null,null,0,0,0,0]
[null,null,null,null,null,null,null,null,null,null,null,null,null,null,null,null,null,0,0,0,0]
[null,null,null,null,null,null,null,null,null,null,null,null,null,null,null,null,null,0,0,0,0]
[null,null,null,null,null,null,null,null,null,null,null,null,null,null,null,null,null,0,0,0,0]
[null,null,null,null,null,null,null,null,null,null,null,null,null,null,null,null,null,0,0,0,0]
[null,null,null,null,null,null,null,null,null,null,null,null,null,null,null,null,null,0,0,0,0]
[null,null,null,null,null,null,null,null,null,null,null,null,null,null,null,null,null,0,0,0,0]
[null,null,null,null,null,null,null,null,null,null,null,null,null,null,null,null,null,0,0,0,0]
[null,null,null,null,null,null,null,null,null,null,null,null,null,null,null,null,null,0,0,0,0]
[null,null,null,null,null,null,null,null,null,null,null,null,null,null,null,null,null,0,0,0,0]
[null,null,null,null,null,null,null,null,null,null,null,null,null,null,null,null,null,0,0,0,0]
[null,null,null,null,null,null,null,null,null,null,null,null,null,null,null,null,null,0,0,0,0]
[null,null,null,null,null,null,null,null,null,null,null,null,null,null,null,null,null,0,0,0,0]
[null,null,null,null,null,null,null,null,null,null,null,null,null,null,null,null,null,0,0,0,0]
[null,null,null,null,null,null,null,null,null,null,null,null,null,null,null,null,null,0,0,0,{"$f":"COUNTIF(C94:Q94,\"abs\")","v":0}]
[null,"Totaux",{"$f":"COUNTIF(C5:C94,\"abs\")","v":0},null,null,{"$f":"COUNTIF(F5:F94,\"abs\")","v":0},null,null,{"$f":"COUNTIF(I5:I94,\"abs\")","v":0},null,null,{"$f":"COUNTIF(L5:L94,\"abs\")","v":0},null,null,{"$f":"COUNTIF(O5:O94,\"abs\")","v":0},null,null,{"$f":"SUM(R5:R94)","v":0},{"$f":"SUM(S5:S94)","v":0},{"$f":"SUM(T5:T94)","v":0},{"$f":"SUM(U5:U94)","v":0}]
[null,null,{"$f":"somcoul(C5:C94,\"rouge\")","v":0},{"$f":"COUNTIF(D5:D94,\"g\")","v":0},{"$f":"COUNTIF(E5:E94,\"c\")","v":0},{"$f":"somcoul(F5:F94,\"rouge\")","v":0},{"$f":"COUNTIF(G5:G94,\"g\")","v":0},{"$f":"COUNTIF(H5:H94,\"c\")","v":0},{"$f":"somcoul(I5:I94,\"rouge\")","v":0},{"$f":"COUNTIF(J6:J94,\"g\")","v":0},{"$f":"COUNTIF(K5:K94,\"c\")","v":0},{"$f":"somcoul(L5:L94,\"rouge\")","v":0},{"$f":"COUNTIF(M5:M94,\"g\")","v":0},{"$f":"COUNTIF(N6:N94,\"c\")","v":0},{"$f":"somcoul(O5:O94,\"rouge\")","v":0},{"$f":"COUNTIF(P5:P94,\"g\")","v":0},{"$f":"COUNTIF(Q5:Q94,\"c\")","v":0}]
[null,"6h30/8h00",{"$f":"COUNTIF(C5:C94,\"6h30/8h00\")","v":0},null,null,{"$f":"COUNTIF(F5:F94,\"6h30/8h00\")","v":0},null,null,{"$f":"COUNTIF(I5:I94,\"6h30/8h00\")","v":0},null,null,{"$f":"COUNTIF(L5:L94,\"6h30/8h00\")","v":0},null,null,{"$f":"COUNTIF(O5:O94,\"6h30/8h00\")","v":0},null,null,{"$f":"SUM(C97:Q97)","v":0}]
[null,"7h00/9h00",{"$f":"COUNTIF(C5:C94,\"7h00/9h00\")","v":0},null,null,{"$f":"COUNTIF(F5:F94,\"7h00/9h00\")","v":0},null,null,{"$f":"COUNTIF(I5:I94,\"7h00/9h00\")","v":0},null,null,{"$f":"COUNTIF(L5:L94,\"7h00/9h00\")","v":0},null,null,{"$f":"COUNTIF(O5:O94,\"7h00/9h00\")","v":0},null,null,0]
[null,"8h00/10h00",{"$f":"COUNTIF(C5:C94,\"8h00/10h00\")","v":0},null,null,{"$f":"COUNTIF(F5:F94,\"8h00/10h00\")","v":0},null,null,{"$f":"COUNTIF(I5:I94,\"8h00/10h00\")","v":0},null,null,{"$f":"COUNTIF(L5:L94,\"8h00/10h00\")","v":0},null,null,{"$f":"COUNTIF(O5:O94,\"8h00/10h00\")","v":0},null,null,0]
[null,"9h00/11h00",{"$f":"COUNTIF(C5:C94,\"9h00/11h00\")","v":0},null,null,{"$f":"COUNTIF(F5:F94,\"9h00/11h00\")","v":0},null,null,{"$f":"COUNTIF(I5:I94,\"9h00/11h00\")","v":0},null,null,{"$f":"COUNTIF(L5:L94,\"9h00/11h00\")","v":0},null,null,{"$f":"COUNTIF(O5:O94,\"9h00/11h00\")","v":0},null,null,0]
[null,"10h00/12h00",{"$f":"COUNTIF(C5:C94,\"10h00/12h00\")","v":0},null,null,{"$f":"COUNTIF(F5:F94,\"10h00/12h00\")","v":0},null,null,{"$f":"COUNTIF(I5:I94,\"10h00/12h00\")","v":0},null,null,{"$f":"COUNTIF(L5:L94,\"10h00/12h00\")","v":0},null,null,{"$f":"COUNTIF(O5:O94,\"10h00/12h00\")","v":0},null,null,0]
[null,"11h00/13h00",{"$f":"COUNTIF(C5:C94,\"11h00/13h00\")","v":0},null,null,{"$f":"COUNTIF(F5:F94,\"11h00/13h00\")","v":0},null,null,{"$f":"COUNTIF(I5:I94,\"11h00/13h00\")","v":0},null,null,{"$f":"COUNTIF(L5:L94,\"11h00/13h00\")","v":0},null,null,{"$f":"COUNTIF(O5:O94,\"11h00/13h00\")","v":0},null,null,0]
[null,"13h00/15h00",{"$f":"COUNTIF(C5:C94,\"13h00/15h00\")","v":0},null,null,{"$f":"COUNTIF(F5:F94,\"13h00/15h00\")","v":0},null,null,{"$f":"COUNTIF(I5:I94,\"13h00/15h00\")","v":0},null,null,{"$f":"COUNTIF(L5:L94,\"13h00/15h00\")","v":0},null,null,{"$f":"COUNTIF(O5:O94,\"13h00/15h00\")","v":0},null,null,0]
[null,"13h30/15h30",{"$f":"COUNTIF(C5:C94,\"13h30/15h30\")","v":0},null,null,{"$f":"COUNTIF(F5:F94,\"13h30/15h30\")","v":0},null,null,{"$f":"COUNTIF(I5:I94,\"13h30/15h30\")","v":0},null,null,{"$f":"COUNTIF(L5:L94,\"13h30/15h30\")","v":0},null,null,{"$f":"COUNTIF(O5:O94,\"13h30/15h30\")","v":0},null,null,0]
[null,"15h00/17h00",{"$f":"COUNTIF(C5:C94,\"15h00/17h00\")","v":0},null,null,{"$f":"COUNTIF(F5:F94,\"15h00/17h00\")","v":0},null,null,{"$f":"COUNTIF(I5:I94,\"15h00/17h00\")","v":0},null,null,{"$f":"COUNTIF(L5:L94,\"15h00/17h00\")","v":0},null,null,{"$f":"COUNTIF(O5:O94,\"15h00/17h00\")","v":0},null,null,0]
[null,"16h00/18h00",{"$f":"COUNTIF(C5:C94,\"16h00/18h00\")","v":0},null,null,{"$f":"COUNTIF(F5:F94,\"16h00/18h00\")","v":0},null,null,{"$f":"COUNTIF(I5:I94,\"16h00/18h00\")","v":0},null,null,{"$f":"COUNTIF(L5:L94,\"16h00/18h00\")","v":0},null,null,{"$f":"COUNTIF(O5:O94,\"16h00/18h00\")","v":0},null,null,0]
[null,"17h00/19h00",{"$f":"COUNTIF(C5:C94,\"17h00/19h00\")","v":0},null,null,{"$f":"COUNTIF(F5:F94,\"17h00/19h00\")","v":0},null,null,{"$f":"COUNTIF(I5:I94,\"17h00/19h00\")","v":0},null,null,{"$f":"COUNTIF(L5:L94,\"17h00/19h00\")","v":0},null,null,{"$f":"COUNTIF(O5:O94,\"17h00/19h00\")","v":0},null,null,0]
[null,"18h00/20h00",{"$f":"COUNTIF(C5:C94,\"18h00/20h00\")","v":0},null,null,{"$f":"COUNTIF(F5:F94,\"18h00/20h00\")","v":0},null,null,{"$f":"COUNTIF(I5:I94,\"18h00/20h00\")","v":0},null,null,{"$f":"COUNTIF(L5:L94,\"18h00/20h00\")","v":0},null,null,{"$f":"COUNTIF(O5:O94,\"18h00/20h00\")","v":0},null,null,0]
[null,"19h00/21h00",{"$f":"COUNTIF(C5:C94,\"19h00/21h00\")","v":0},null,null,{"$f":"COUNTIF(F5:F94,\"19h00/21h00\")","v":0},null,null,{"$f":"COUNTIF(I5:I94,\"19h00/21h00\")","v":0},null,null,{"$f":"COUNTIF(L5:L94,\"19h00/21h00\")","v":0},null,null,{"$f":"COUNTIF(O5:O94,\"19h00/21h00\")","v":0},null,null,0]
[null,"21h00/23h00",{"$f":"COUNTIF(C5:C94,\"21h00/23h00\")","v":0},null,null,{"$f":"COUNTIF(F5:F94,\"21h00/23h00\")","v":0},null,null,{"$f":"COUNTIF(I5:I94,\"21h00/23h00\")","v":0},null,null,{"$f":"COUNTIF(L5:L94,\"21h00/23h00\")","v":0},null,null,{"$f":"COUNTIF(O5:O94,\"21h00/23h00\")","v":0},null,null,0]
[null,"22h00/23h00",{"$f":"COUNTIF(C5:C94,\"22h00/23h00\")","v":0},null,null,{"$f":"COUNTIF(F5:F94,\"22h00/23h00\")","v":0},null,null,{"$f":"COUNTIF(I5:I94,\"22h00/23h00\")","v":0},null,null,{"$f":"COUNTIF(L5:L94,\"22h00/23h00\")","v":0},null,null,{"$f":"COUNTIF(O5:O94,\"22h00/23h00\")","v":0},null,null,0]

{"sheet":"Vue globale","index":13,"n_rows":88,"n_cols":107,"rows_kept":88,"cut":false,"hidden":false,"merged":[[0,0,0,8],[0,99,0,107],[0,9,0,17],[0,18,0,26],[0,27,0,35],[0,36,0,44],[0,45,0,53],[0,54,0,62],[0,63,0,71],[0,72,0,80],[0,81,0,89],[0,90,0,98]]}
["A",null,null,null,null,null,null,null,null,"B",null,null,null,null,null,null,null,null,"C",null,null,null,null,null,null,null,null,"D",null,null,null,null,null,null,null,null,"E",null,null,null,null,null,null,null,null,"F",null,null,null,null,null,null,null,null,"G",null,null,null,null,null,null,null,null,"H",null,null,null,null,null,null,null,null,"I",null,null,null,null,null,null,null,null,"J",null,null,null,null,null,null,null,null,"K",null,null,null,null,null,null,null,null,"L"]
[]
[null,"Présent","GTPI","en %","CARDIO","en %","Abs présence","en %",null,null,"Présent","GTPI","en %","CARDIO","en %","Abs présence","%",null,null,"Présent","GTPI","en%","CARDIO","en %","Abs présence","%",null,null,"Présent","GTPI","en %","CARDIO","en %","Abs présence","%",null,null,"Présent","GTPI","en %","CARDIO","en %","Abs présence","%",null,null,"Présent","GTPI","en %","CARDIO","en %","Abs présence","%",null,null,"Présent","GTPI","en %","CARDIO","en %","Abs présence","%",null,null,"Présent","GTPI","en %","CARDIO","en %","Abs présence","%",null,null,"Présent","GTPI","en %","CARDIO","en %","Abs présence","%",null,null,"Présent","GTPI","en %","CARDIO","en %","Abs présence","%",null,null,"Présent","GTPI","en %","CARDIO","en %","Abs présence","%",null,null,"Présent","GTPI","en %","CARDIO","en %","Abs présence","%"]
[null,{"$f":"A!R5+G4","v":0},{"$f":"A!S5","v":0},{"$f":"IF(C4=0,\"\",(C4/B4*100))","v":""},{"$f":"A!T5","v":0},{"$f":"IF(E4=0,\"\",(E4/B4*100))","v":""},{"$f":"A!U5","v":0},{"$f":"IF(G4=0,\"\",(G4/B4*100))","v":""},null,null,{"$f":"B!R5+P4","v":0},{"$f":"B!S5","v":0},{"$f":"IF(L4=0,\"\",(L4/K4*100))","v":""},{"$f":"B!T5","v":0},{"$f":"IF(N4=0,\"\",(N4/K4*100))","v":""},{"$f":"B!U5","v":0},{"$f":"IF(P4=0,\"\",(P4/K4*100))","v":""},null,null,{"$f":"'C'!R5+Y4","v":0},{"$f":"'C'!S5","v":0},{"$f":"IF(U4=0,\"\",(U4/T4*100))","v":""},{"$f":"'C'!T5","v":0},{"$f":"IF(W4=0,\"\",(W4/T4*100))","v":""},{"$f":"'C'!U5","v":0},{"$f":"IF(Y4=0,\"\",(Y4/T4*100))","v":""},null,null,{"$f":"D!R5+AH4","v":0},{"$f":"D!S5","v":0},{"$f":"IF(AD4=0,\"\",(AD4/AC4*100))","v":""},{"$f":"D!T5","v":0},{"$f":"IF(AF4=0,\"\",(AF4/AC4*100))","v":""},{"$f":"D!U5","v":0},{"$f":"IF(AH4=0,\"\",(AH4/AC4*100))","v":""},null,null,{"$f":"E!R5+AQ4","v":0},{"$f":"E!S5","v":0},{"$f":"IF(AM4=0,\"\",(AM4/AL4*100))","v":""},{"$f":"E!T5","v":0},{"$f":"IF(AO4=0,\"\",(AO4/AL4*100))","v":""},{"$f":"E!U5","v":0},{"$f":"IF(AQ4=0,\"\",(AQ4/AL4*100))","v":""},null,null,{"$f":"F!R5+AZ4","v":0},{"$f":"F!S5","v":0},{"$f":"IF(AV4=0,\"\",(AV4/AU4*100))","v":""},{"$f":"F!T5","v":0},{"$f":"IF(AX4=0,\"\",(AX4/AU4*100))","v":""},{"$f":"F!U5","v":0},{"$f":"IF(AZ4=0,\"\",(AZ4/AU4*100))","v":""},null,null,{"$f":"G!R5+BI4","v":0},{"$f":"G!S5","v":0},{"$f":"IF(BE4=0,\"\",(BE4/BD4*100))","v":""},{"$f":"G!T5","v":0},{"$f":"IF(BG4=0,\"\",(BG4/BD4*100))","v":""},{"$f":"G!U5","v":0},{"$f":"IF(BI4=0,\"\",(BI4/BD4*100))","v":""},null,null,{"$f":"H!R5+BR4","v":0},{"$f":"H!S5","v":0},{"$f":"IF(BN4=0,\"\",(BN4/BM4*100))","v":""},{"$f":"H!T5","v":0},{"$f":"IF(BP4=0,\"\",(BP4/BM4*100))","v":""},{"$f":"H!U5","v":0},{"$f":"IF(BR4=0,\"\",(BR4/BM4*100))","v":""},null,null,{"$f":"I!R5+CA4","v":0},{"$f":"I!S5","v":0},{"$f":"IF(BW4=0,\"\",(BW4/BV4*100))","v":""},{"$f":"I!T5","v":0},{"$f":"IF(BY4=0,\"\",(BY4/BV4*100))","v":""},{"$f":"I!U5","v":0},{"$f":"IF(CA4=0,\"\",(CA4/BV4*100))","v":""},null,null,{"$f":"J!R5+CJ4","v":0},{"$f":"J!S5","v":0},{"$f":"IF(CF4=0,\"\",(CF4/CE4*100))","v":""},{"$f":"J!T5","v":0},null,{"$f":"J!U5","v":0},{"$f":"IF(CJ4=0,\"\",(CJ4/CE4*100))","v":""},null,null,{"$f":"K!R5+CS4","v":0},{"$f":"K!S5","v":0},{"$f":"IF(CO4=0,\"\",(CO4/CN4*100))","v":""},{"$f":"K!T5","v":0},{"$f":"IF(CQ4=0,\"\",(CQ4/CN4*100))","v":""},{"$f":"K!U5","v":0},{"$f":"IF(CS4=0,\"\",(CS4/CN4*100))","v":""},null,null,{"$f":"L!R5+DB4","v":0},{"$f":"L!S5","v":0},{"$f":"IF(CX4=0,\"\",(CX4/CW4*100))","v":""},{"$f":"L!T5","v":0},{"$f":"IF(CZ4=0,\"\",(CZ4/CW4*100))","v":""},{"$f":"L!U5","v":0},{"$f":"IF(DB4=0,\"\",(DB4/CW4*100))","v":""}]
[null,{"$f":"A!R6+G5","v":0},{"$f":"A!S6","v":0},{"$f":"IF(C5=0,\"\",(C5/B5*100))","v":""},{"$f":"A!T6","v":0},{"$f":"IF(E5=0,\"\",(E5/B5*100))","v":""},{"$f":"A!U6","v":0},{"$f":"IF(G5=0,\"\",(G5/B5*100))","v":""},null,null,{"$f":"B!R6+P5","v":0},{"$f":"B!S6","v":0},{"$f":"IF(L5=0,\"\",(L5/K5*100))","v":""},{"$f":"B!T6","v":0},{"$f":"IF(N5=0,\"\",(N5/K5*100))","v":""},{"$f":"B!U6","v":0},{"$f":"IF(P5=0,\"\",(P5/K5*100))","v":""},null,null,{"$f":"'C'!R6+Y5","v":0},{"$f":"'C'!S6","v":0},{"$f":"IF(U5=0,\"\",(U5/T5*100))","v":""},{"$f":"'C'!T6","v":0},{"$f":"IF(W5=0,\"\",(W5/T5*100))","v":""},{"$f":"'C'!U6","v":0},{"$f":"IF(Y5=0,\"\",(Y5/T5*100))","v":""},null,null,{"$f":"D!R6+AH5","v":0},{"$f":"D!S6","v":0},{"$f":"IF(AD5=0,\"\",(AD5/AC5*100))","v":""},{"$f":"D!T6","v":0},{"$f":"IF(AF5=0,\"\",(AF5/AC5*100))","v":""},{"$f":"D!U6","v":0},{"$f":"IF(AH5=0,\"\",(AH5/AC5*100))","v":""},null,null,{"$f":"E!R6","v":0},{"$f":"E!S6","v":0},{"$f":"IF(AM5=0,\"\",(AM5/AL5*100))","v":""},{"$f":"E!T6","v":0},{"$f":"IF(AO5=0,\"\",(AO5/AL5*100))","v":""},{"$f":"E!U6","v":0},{"$f":"IF(AQ5=0,\"\",(AQ5/AL5*100))","v":""},null,null,{"$f":"F!R6+AZ5","v":0},{"$f":"F!S6","v":0},{"$f":"IF(AV5=0,\"\",(AV5/AU5*100))","v":""},{"$f":"F!T6","v":0},{"$f":"IF(AX5=0,\"\",(AX5/AU5*100))","v":""},{"$f":"F!U6","v":0},{"$f":"IF(AZ5=0,\"\",(AZ5/AU5*100))","v":""},null,null,{"$f":"G!R6+BI5","v":0},{"$f":"G!S6","v":0},{"$f":"IF(BE5=0,\"\",(BE5/BD5*100))","v":""},{"$f":"G!T6","v":0},{"$f":"IF(BG5=0,\"\",(BG5/BD5*100))","v":""},{"$f":"G!U6","v":0},{"$f":"IF(BI5=0,\"\",(BI5/BD5*100))","v":""},null,null,{"$f":"H!R6+BR5","v":0},{"$f":"H!S6","v":0},{"$f":"IF(BN5=0,\"\",(BN5/BM5*100))","v":""},{"$f":"H!T6","v":0},{"$f":"IF(BP5=0,\"\",(BP5/BM5*100))","v":""},{"$f":"H!U6","v":0},{"$f":"IF(BR5=0,\"\",(BR5/BM5*100))","v":""},null,null,{"$f":"I!R6+CA5","v":0},{"$f":"I!S6","v":0},{"$f":"IF(BW5=0,\"\",(BW5/BV5*100))","v":""},{"$f":"I!T6","v":0},{"$f":"IF(BY5=0,\"\",(BY5/BV5*100))","v":""},{"$f":"I!U6","v":0},{"$f":"IF(CA5=0,\"\",(CA5/BV5*100))","v":""},null,null,{"$f":"J!R6+CJ5","v":0},{"$f":"J!S6","v":0},{"$f":"IF(CF5=0,\"\",(CF5/CE5*100))","v":""},{"$f":"J!T6","v":0},{"$f":"IF(CH5=0,\"\",(CH5/CE5*100))","v":""},{"$f":"J!U6","v":0},{"$f":"IF(CJ5=0,\"\",(CJ5/CE5*100))","v":""},null,null,{"$f":"K!R6+CS5","v":0},{"$f":"K!S6","v":0},{"$f":"IF(CO5=0,\"\",(CO5/CN5*100))","v":""},{"$f":"K!T6","v":0},{"$f":"IF(CQ5=0,\"\",(CQ5/CN5*100))","v":""},{"$f":"K!U6","v":0},{"$f":"IF(CS5=0,\"\",(CS5/CN5*100))","v":""},null,null,{"$f":"L!R6+DB5","v":0},{"$f":"L!S6","v":0},{"$f":"IF(CX5=0,\"\",(CX5/CW5*100))","v":""},{"$f":"L!T6","v":0},{"$f":"IF(CZ5=0,\"\",(CZ5/CW5*100))","v":""},{"$f":"L!U6","v":0},{"$f":"IF(DB5=0,\"\",(DB5/CW5*100))","v":""}]
[null,{"$f":"A!R7+G6","v":0},{"$f":"A!S7","v":0},"",{"$f":"A!T7","v":0},"",{"$f":"A!U7","v":0},"",null,null,{"$f":"B!R7+P6","v":0},{"$f":"B!S7","v":0},"",{"$f":"B!T7","v":0},"",{"$f":"B!U7","v":0},"",null,null,{"$f":"'C'!R7+Y6","v":0},{"$f":"'C'!S7","v":0},"",{"$f":"'C'!T7","v":0},"",{"$f":"'C'!U7","v":0},"",null,null,{"$f":"D!R7+AH6","v":0},{"$f":"D!S7","v":0},"",{"$f":"D!T7","v":0},"",{"$f":"D!U7","v":0},"",null,null,{"$f":"E!R7","v":0},{"$f":"E!S7","v":0},"",{"$f":"E!T7","v":0},"",{"$f":"E!U7","v":0},"",null,null,{"$f":"F!R7+AZ6","v":0},{"$f":"F!S7","v":0},"",{"$f":"F!T7","v":0},"",{"$f":"F!U7","v":0},"",null,null,{"$f":"G!R7+BI6","v":0},{"$f":"G!S7","v":0},"",{"$f":"G!T7","v":0},"",{"$f":"G!U7","v":0},"",null,null,{"$f":"H!R7+BR6","v":0},{"$f":"H!S7","v":0},"",{"$f":"H!T7","v":0},"",{"$f":"H!U7","v":0},"",null,null,{"$f":"I!R7+CA6","v":0},{"$f":"I!S7","v":0},"",{"$f":"I!T7","v":0},"",{"$f":"I!U7","v":0},"",null,null,{"$f":"J!R7+CJ6","v":0},{"$f":"J!S7","v":0},"",{"$f":"J!T7","v":0},"",{"$f":"J!U7","v":0},"",null,null,{"$f":"K!R7+CS6","v":0},{"$f":"K!S7","v":0},"",{"$f":"K!T7","v":0},"",{"$f":"K!U7","v":0},"",null,null,{"$f":"L!R7+DB6","v":0},{"$f":"L!S7","v":0},"",{"$f":"L!T7","v":0},"",{"$f":"L!U7","v":0},""]
[null,{"$f":"A!R8+G7","v":0},{"$f":"A!S8","v":0},"",{"$f":"A!T8","v":0},"",{"$f":"A!U8","v":0},"",null,null,{"$f":"B!R8+P7","v":0},{"$f":"B!S8","v":0},"",{"$f":"B!T8","v":0},"",{"$f":"B!U8","v":0},"",null,null,{"$f":"'C'!R8+Y7","v":0},{"$f":"'C'!S8","v":0},"",{"$f":"'C'!T8","v":0},"",{"$f":"'C'!U8","v":0},"",null,null,{"$f":"D!R8+AH7","v":0},{"$f":"D!S8","v":0},"",{"$f":"D!T8","v":0},"",{"$f":"D!U8","v":0},"",null,null,{"$f":"E!R8","v":0},{"$f":"E!S8","v":0},"",{"$f":"E!T8","v":0},"",{"$f":"E!U8","v":0},"",null,null,{"$f":"F!R8+AZ7","v":0},{"$f":"F!S8","v":0},"",{"$f":"F!T8","v":0},"",{"$f":"F!U8","v":0},"",null,null,{"$f":"G!R8+BI7","v":0},{"$f":"G!S8","v":0},"",{"$f":"G!T8","v":0},"",{"$f":"G!U8","v":0},"",null,null,{"$f":"H!R8+BR7","v":0},{"$f":"H!S8","v":0},"",{"$f":"H!T8","v":0},"",{"$f":"H!U8","v":0},"",null,null,{"$f":"I!R8+CA7","v":0},{"$f":"I!S8","v":0},"",{"$f":"I!T8","v":0},"",{"$f":"I!U8","v":0},"",null,null,{"$f":"J!R8+CJ7","v":0},{"$f":"J!S8","v":0},"",{"$f":"J!T8","v":0},"",{"$f":"J!U8","v":0},"",null,null,{"$f":"K!R8+CS7","v":0},{"$f":"K!S8","v":0},"",{"$f":"K!T8","v":0},"",{"$f":"K!U8","v":0},"",null,null,{"$f":"L!R8+DB7","v":0},{"$f":"L!S8","v":0},"",{"$f":"L!T8","v":0},"",{"$f":"L!U8","v":0},""]
[null,{"$f":"A!R9+G8","v":0},{"$f":"A!S9","v":0},"",{"$f":"A!T9","v":0},"",{"$f":"A!U9","v":0},"",null,null,{"$f":"B!R9+P8","v":0},{"$f":"B!S9","v":0},"",{"$f":"B!T9","v":0},"",{"$f":"B!U9","v":0},"",null,null,{"$f":"'C'!R9+Y8","v":0},{"$f":"'C'!S9","v":0},"",{"$f":"'C'!T9","v":0},"",{"$f":"'C'!U9","v":0},"",null,null,{"$f":"D!R9+AH8","v":0},{"$f":"D!S9","v":0},"",{"$f":"D!T9","v":0},"",{"$f":"D!U9","v":0},"",null,null,{"$f":"E!R9","v":0},{"$f":"E!S9","v":0},"",{"$f":"E!T9","v":0},"",{"$f":"E!U9","v":0},"",null,null,{"$f":"F!R9+AZ8","v":0},{"$f":"F!S9","v":0},"",{"$f":"F!T9","v":0},"",{"$f":"F!U9","v":0},"",null,null,{"$f":"G!R9+BI8","v":0},{"$f":"G!S9","v":0},"",{"$f":"G!T9","v":0},"",{"$f":"G!U9","v":0},"",null,null,{"$f":"H!R9+BR8","v":0},{"$f":"H!S9","v":0},"",{"$f":"H!T9","v":0},"",{"$f":"H!U9","v":0},"",null,null,{"$f":"I!R9+CA8","v":0},{"$f":"I!S9","v":0},"",{"$f":"I!T9","v":0},"",{"$f":"I!U9","v":0},"",null,null,{"$f":"J!R9+CJ8","v":0},{"$f":"J!S9","v":0},"",{"$f":"J!T9","v":0},"",{"$f":"J!U9","v":0},"",null,null,{"$f":"K!R9+CS8","v":0},{"$f":"K!S9","v":0},"",{"$f":"K!T9","v":0},"",{"$f":"K!U9","v":0},"",null,null,{"$f":"L!R9+DB8","v":0},{"$f":"L!S9","v":0},"",{"$f":"L!T9","v":0},"",{"$f":"L!U9","v":0},""]
[null,{"$f":"A!R10+G9","v":0},{"$f":"A!S10","v":0},"",{"$f":"A!T10","v":0},"",{"$f":"A!U10","v":0},"",null,null,{"$f":"B!R10+P9","v":0},{"$f":"B!S10","v":0},"",{"$f":"B!T10","v":0},"",{"$f":"B!U10","v":0},"",null,null,{"$f":"'C'!R10+Y9","v":0},{"$f":"'C'!S10","v":0},"",{"$f":"'C'!T10","v":0},"",{"$f":"'C'!U10","v":0},"",null,null,{"$f":"D!R10+AH9","v":0},{"$f":"D!S10","v":0},"",{"$f":"D!T10","v":0},"",{"$f":"D!U10","v":0},"",null,null,{"$f":"E!R10","v":0},{"$f":"E!S10","v":0},"",{"$f":"E!T10","v":0},"",{"$f":"E!U10","v":0},"",null,null,{"$f":"F!R10+AZ9","v":0},{"$f":"F!S10","v":0},"",{"$f":"F!T10","v":0},"",{"$f":"F!U10","v":0},"",null,null,{"$f":"G!R10+BI9","v":0},{"$f":"G!S10","v":0},"",{"$f":"G!T10","v":0},"",{"$f":"G!U10","v":0},"",null,null,{"$f":"H!R10+BR9","v":0},{"$f":"H!S10","v":0},"",{"$f":"H!T10","v":0},"",{"$f":"H!U10","v":0},"",null,null,{"$f":"I!R10+CA9","v":0},{"$f":"I!S10","v":0},"",{"$f":"I!T10","v":0},"",{"$f":"I!U10","v":0},"",null,null,{"$f":"J!R10+CJ9","v":0},{"$f":"J!S10","v":0},"",{"$f":"J!T10","v":0},"",{"$f":"J!U10","v":0},"",null,null,{"$f":"K!R10+CS9","v":0},{"$f":"K!S10","v":0},"",{"$f":"K!T10","v":0},"",{"$f":"K!U10","v":0},"",null,null,{"$f":"L!R10+DB9","v":0},{"$f":"L!S10","v":0},"",{"$f":"L!T10","v":0},"",{"$f":"L!U10","v":0},""]
[null,{"$f":"A!R11+G10","v":0},{"$f":"A!S11","v":0},"",{"$f":"A!T11","v":0},"",{"$f":"A!U11","v":0},"",null,null,{"$f":"B!R11+P10","v":0},{"$f":"B!S11","v":0},"",{"$f":"B!T11","v":0},"",{"$f":"B!U11","v":0},"",null,null,{"$f":"'C'!R11+Y10","v":0},{"$f":"'C'!S11","v":0},"",{"$f":"'C'!T11","v":0},"",{"$f":"'C'!U11","v":0},"",null,null,{"$f":"D!R11+AH10","v":0},{"$f":"D!S11","v":0},"",{"$f":"D!T11","v":0},"",{"$f":"D!U11","v":0},"",null,null,{"$f":"E!R11","v":0},{"$f":"E!S11","v":0},"",{"$f":"E!T11","v":0},"",{"$f":"E!U11","v":0},"",null,null,{"$f":"F!R11+AZ10","v":0},{"$f":"F!S11","v":0},"",{"$f":"F!T11","v":0},"",{"$f":"F!U11","v":0},"",null,null,{"$f":"G!R11+BI10","v":0},{"$f":"G!S11","v":0},"",{"$f":"G!T11","v":0},"",{"$f":"G!U11","v":0},"",null,null,{"$f":"H!R11+BR10","v":0},{"$f":"H!S11","v":0},"",{"$f":"H!T11","v":0},"",{"$f":"H!U11","v":0},"",null,null,{"$f":"I!R11+CA10","v":0},{"$f":"I!S11","v":0},"",{"$f":"I!T11","v":0},"",{"$f":"I!U11","v":0},"",null,null,{"$f":"J!R11+CJ10","v":0},{"$f":"J!S11","v":0},"",{"$f":"J!T11","v":0},"",{"$f":"J!U11","v":0},"",null,null,{"$f":"K!R11+CS10","v":0},{"$f":"K!S11","v":0},"",{"$f":"K!T11","v":0},"",{"$f":"K!U11","v":0},"",null,null,{"$f":"L!R11+DB10","v":0},{"$f":"L!S11","v":0},"",{"$f":"L!T11","v":0},"",{"$f":"L!U11","v":0},""]
[null,{"$f":"A!R12+G11","v":0},{"$f":"A!S12","v":0},"",{"$f":"A!T12","v":0},"",{"$f":"A!U12","v":0},"",null,null,{"$f":"B!R12+P11","v":0},{"$f":"B!S12","v":0},"",{"$f":"B!T12","v":0},"",{"$f":"B!U12","v":0},"",null,null,{"$f":"'C'!R12+Y11","v":0},{"$f":"'C'!S12","v":0},"",{"$f":"'C'!T12","v":0},"",{"$f":"'C'!U12","v":0},"",null,null,{"$f":"D!R12+AH11","v":0},{"$f":"D!S12","v":0},"",{"$f":"D!T12","v":0},"",{"$f":"D!U12","v":0},"",null,null,{"$f":"E!R12","v":0},{"$f":"E!S12","v":0},"",{"$f":"E!T12","v":0},"",{"$f":"E!U12","v":0},"",null,null,{"$f":"F!R12+AZ11","v":0},{"$f":"F!S12","v":0},"",{"$f":"F!T12","v":0},"",{"$f":"F!U12","v":0},"",null,null,{"$f":"G!R12+BI11","v":0},{"$f":"G!S12","v":0},"",{"$f":"G!T12","v":0},"",{"$f":"G!U12","v":0},"",null,null,{"$f":"H!R12+BR11","v":0},{"$f":"H!S12","v":0},"",{"$f":"H!T12","v":0},"",{"$f":"H!U12","v":0},"",null,null,{"$f":"I!R12+CA11","v":0},{"$f":"I!S12","v":0},"",{"$f":"I!T12","v":0},"",{"$f":"I!U12","v":0},"",null,null,{"$f":"J!R12+CJ11","v":0},{"$f":"J!S12","v":0},"",{"$f":"J!T12","v":0},"",{"$f":"J!U12","v":0},"",null,null,{"$f":"K!R12+CS11","v":0},{"$f":"K!S12","v":0},"",{"$f":"K!T12","v":0},"",{"$f":"K!U12","v":0},"",null,null,{"$f":"L!R12+DB11","v":0},{"$f":"L!S12","v":0},"",{"$f":"L!T12","v":0},"",{"$f":"L!U12","v":0},""]
[null,{"$f":"A!R13+G12","v":0},{"$f":"A!S13","v":0},"",{"$f":"A!T13","v":0},"",{"$f":"A!U13","v":0},"",null,null,{"$f":"B!R13+P12","v":0},{"$f":"B!S13","v":0},"",{"$f":"B!T13","v":0},"",{"$f":"B!U13","v":0},"",null,null,{"$f":"'C'!R13+Y12","v":0},{"$f":"'C'!S13","v":0},"",{"$f":"'C'!T13","v":0},"",{"$f":"'C'!U13","v":0},"",null,null,{"$f":"D!R13+AH12","v":0},{"$f":"D!S13","v":0},"",{"$f":"D!T13","v":0},"",{"$f":"D!U13","v":0},"",null,null,{"$f":"E!R13","v":0},{"$f":"E!S13","v":0},"",{"$f":"E!T13","v":0},"",{"$f":"E!U13","v":0},"",null,null,{"$f":"F!R13+AZ12","v":0},{"$f":"F!S13","v":0},"",{"$f":"F!T13","v":0},"",{"$f":"F!U13","v":0},"",null,null,{"$f":"G!R13+BI12","v":0},{"$f":"G!S13","v":0},"",{"$f":"G!T13","v":0},"",{"$f":"G!U13","v":0},"",null,null,{"$f":"H!R13+BR12","v":0},{"$f":"H!S13","v":0},"",{"$f":"H!T13","v":0},"",{"$f":"H!U13","v":0},"",null,null,{"$f":"I!R13+CA12","v":0},{"$f":"I!S13","v":0},"",{"$f":"I!T13","v":0},"",{"$f":"I!U13","v":0},"",null,null,{"$f":"J!R13+CJ12","v":0},{"$f":"J!S13","v":0},"",{"$f":"J!T13","v":0},"",{"$f":"J!U13","v":0},"",null,null,{"$f":"K!R13+CS12","v":0},{"$f":"K!S13","v":0},"",{"$f":"K!T13","v":0},"",{"$f":"K!U13","v":0},"",null,null,{"$f":"L!R13+DB12","v":0},{"$f":"L!S13","v":0},"",{"$f":"L!T13","v":0},"",{"$f":"L!U13","v":0},""]
[null,{"$f":"A!R14+G13","v":0},{"$f":"A!S14","v":0},"",{"$f":"A!T14","v":0},"",{"$f":"A!U14","v":0},"",null,null,{"$f":"B!R14+P13","v":0},{"$f":"B!S14","v":0},"",{"$f":"B!T14","v":0},"",{"$f":"B!U14","v":0},"",null,null,{"$f":"'C'!R14+Y13","v":0},{"$f":"'C'!S14","v":0},"",{"$f":"'C'!T14","v":0},"",{"$f":"'C'!U14","v":0},"",null,null,{"$f":"D!R14+AH13","v":0},{"$f":"D!S14","v":0},"",{"$f":"D!T14","v":0},"",{"$f":"D!U14","v":0},"",null,null,{"$f":"E!R14","v":0},{"$f":"E!S14","v":0},"",{"$f":"E!T14","v":0},"",{"$f":"E!U14","v":0},"",null,null,{"$f":"F!R14+AZ13","v":0},{"$f":"F!S14","v":0},"",{"$f":"F!T14","v":0},"",{"$f":"F!U14","v":0},"",null,null,{"$f":"G!R14+BI13","v":0},{"$f":"G!S14","v":0},"",{"$f":"G!T14","v":0},"",{"$f":"G!U14","v":0},"",null,null,{"$f":"H!R14+BR13","v":0},{"$f":"H!S14","v":0},"",{"$f":"H!T14","v":0},"",{"$f":"H!U14","v":0},"",null,null,{"$f":"I!R14+CA13","v":0},{"$f":"I!S14","v":0},"",{"$f":"I!T14","v":0},"",{"$f":"I!U14","v":0},"",null,null,{"$f":"J!R14+CJ13","v":0},{"$f":"J!S14","v":0},"",{"$f":"J!T14","v":0},"",{"$f":"J!U14","v":0},"",null,null,{"$f":"K!R14+CS13","v":0},{"$f":"K!S14","v":0},"",{"$f":"K!T14","v":0},"",{"$f":"K!U14","v":0},"",null,null,{"$f":"L!R14+DB13","v":0},{"$f":"L!S14","v":0},"",{"$f":"L!T14","v":0},"",{"$f":"L!U14","v":0},""]
[null,{"$f":"A!R15+G14","v":0},{"$f":"A!S15","v":0},"",{"$f":"A!T15","v":0},"",{"$f":"A!U15","v":0},"",null,null,{"$f":"B!R15+P14","v":0},{"$f":"B!S15","v":0},"",{"$f":"B!T15","v":0},"",{"$f":"B!U15","v":0},"",null,null,{"$f":"'C'!R15+Y14","v":0},{"$f":"'C'!S15","v":0},"",{"$f":"'C'!T15","v":0},"",{"$f":"'C'!U15","v":0},"",null,null,{"$f":"D!R15+AH14","v":0},{"$f":"D!S15","v":0},"",{"$f":"D!T15","v":0},"",{"$f":"D!U15","v":0},"",null,null,{"$f":"E!R15","v":0},{"$f":"E!S15","v":0},"",{"$f":"E!T15","v":0},"",{"$f":"E!U15","v":0},"",null,null,{"$f":"F!R15+AZ14","v":0},{"$f":"F!S15","v":0},"",{"$f":"F!T15","v":0},"",{"$f":"F!U15","v":0},"",null,null,{"$f":"G!R15+BI14","v":0},{"$f":"G!S15","v":0},"",{"$f":"G!T15","v":0},"",{"$f":"G!U15","v":0},"",null,null,{"$f":"H!R15+BR14","v":0},{"$f":"H!S15","v":0},"",{"$f":"H!T15","v":0},"",{"$f":"H!U15","v":0},"",null,null,{"$f":"I!R15+CA14","v":0},{"$f":"I!S15","v":0},"",{"$f":"I!T15","v":0},"",{"$f":"I!U15","v":0},"",null,null,{"$f":"J!R15+CJ14","v":0},{"$f":"J!S15","v":0},"",{"$f":"J!T15","v":0},"",{"$f":"J!U15","v":0},"",null,null,{"$f":"K!R15+CS14","v":0},{"$f":"K!S15","v":0},"",{"$f":"K!T15","v":0},"",{"$f":"K!U15","v":0},"",null,null,{"$f":"L!R15+DB14","v":0},{"$f":"L!S15","v":0},"",{"$f":"L!T15","v":0},"",{"$f":"L!U15","v":0},""]
[null,{"$f":"A!R16+G15","v":0},{"$f":"A!S16","v":0},"",{"$f":"A!T16","v":0},"",{"$f":"A!U16","v":0},"",null,null,{"$f":"B!R16+P15","v":0},{"$f":"B!S16","v":0},"",{"$f":"B!T16","v":0},"",{"$f":"B!U16","v":0},"",null,null,{"$f":"'C'!R16+Y15","v":0},{"$f":"'C'!S16","v":0},"",{"$f":"'C'!T16","v":0},"",{"$f":"'C'!U16","v":0},"",null,null,{"$f":"D!R16+AH15","v":0},{"$f":"D!S16","v":0},"",{"$f":"D!T16","v":0},"",{"$f":"D!U16","v":0},"",null,null,{"$f":"E!R16","v":0},{"$f":"E!S16","v":0},"",{"$f":"E!T16","v":0},"",{"$f":"E!U16","v":0},"",null,null,{"$f":"F!R16+AZ15","v":0},{"$f":"F!S16","v":0},"",{"$f":"F!T16","v":0},"",{"$f":"F!U16","v":0},"",null,null,{"$f":"G!R16+BI15","v":0},{"$f":"G!S16","v":0},"",{"$f":"G!T16","v":0},"",{"$f":"G!U16","v":0},"",null,null,{"$f":"H!R16+BR15","v":0},{"$f":"H!S16","v":0},"",{"$f":"H!T16","v":0},"",{"$f":"H!U16","v":0},"",null,null,{"$f":"I!R16+CA15","v":0},{"$f":"I!S16","v":0},"",{"$f":"I!T16","v":0},"",{"$f":"I!U16","v":0},"",null,null,{"$f":"J!R16+CJ15","v":0},{"$f":"J!S16","v":0},"",{"$f":"J!T16","v":0},"",{"$f":"J!U16","v":0},"",null,null,{"$f":"K!R16+CS15","v":0},{"$f":"K!S16","v":0},"",{"$f":"K!T16","v":0},"",{"$f":"K!U16","v":0},"",null,null,{"$f":"L!R16+DB15","v":0},{"$f":"L!S16","v":0},"",{"$f":"L!T16","v":0},"",{"$f":"L!U16","v":0},""]
[null,{"$f":"A!R17+G16","v":0},{"$f":"A!S17","v":0},"",{"$f":"A!T17","v":0},"",{"$f":"A!U17","v":0},"",null,null,{"$f":"B!R17+P16","v":0},{"$f":"B!S17","v":0},"",{"$f":"B!T17","v":0},"",{"$f":"B!U17","v":0},"",null,null,{"$f":"'C'!R17+Y16","v":0},{"$f":"'C'!S17","v":0},"",{"$f":"'C'!T17","v":0},"",{"$f":"'C'!U17","v":0},"",null,null,{"$f":"D!R17+AH16","v":0},{"$f":"D!S17","v":0},"",{"$f":"D!T17","v":0},"",{"$f":"D!U17","v":0},"",null,null,{"$f":"E!R17","v":0},{"$f":"E!S17","v":0},"",{"$f":"E!T17","v":0},"",{"$f":"E!U17","v":0},"",null,null,{"$f":"F!R17+AZ16","v":0},{"$f":"F!S17","v":0},"",{"$f":"F!T17","v":0},"",{"$f":"F!U17","v":0},"",null,null,{"$f":"G!R17+BI16","v":0},{"$f":"G!S17","v":0},"",{"$f":"G!T17","v":0},"",{"$f":"G!U17","v":0},"",null,null,{"$f":"H!R17+BR16","v":0},{"$f":"H!S17","v":0},"",{"$f":"H!T17","v":0},"",{"$f":"H!U17","v":0},"",null,null,{"$f":"I!R17+CA16","v":0},{"$f":"I!S17","v":0},"",{"$f":"I!T17","v":0},"",{"$f":"I!U17","v":0},"",null,null,{"$f":"J!R17+CJ16","v":0},{"$f":"J!S17","v":0},"",{"$f":"J!T17","v":0},"",{"$f":"J!U17","v":0},"",null,null,{"$f":"K!R17+CS16","v":0},{"$f":"K!S17","v":0},"",{"$f":"K!T17","v":0},"",{"$f":"K!U17","v":0},"",null,null,{"$f":"L!R17+DB16","v":0},{"$f":"L!S17","v":0},"",{"$f":"L!T17","v":0},"",{"$f":"L!U17","v":0},""]
[null,{"$f":"A!R18+G17","v":0},{"$f":"A!S18","v":0},"",{"$f":"A!T18","v":0},"",{"$f":"A!U18","v":0},"",null,null,{"$f":"B!R18+P17","v":0},{"$f":"B!S18","v":0},"",{"$f":"B!T18","v":0},"",{"$f":"B!U18","v":0},"",null,null,{"$f":"'C'!R18+Y17","v":0},{"$f":"'C'!S18","v":0},"",{"$f":"'C'!T18","v":0},"",{"$f":"'C'!U18","v":0},"",null,null,{"$f":"D!R18+AH17","v":0},{"$f":"D!S18","v":0},"",{"$f":"D!T18","v":0},"",{"$f":"D!U18","v":0},"",null,null,{"$f":"E!R18","v":0},{"$f":"E!S18","v":0},"",{"$f":"E!T18","v":0},"",{"$f":"E!U18","v":0},"",null,null,{"$f":"F!R18+AZ17","v":0},{"$f":"F!S18","v":0},"",{"$f":"F!T18","v":0},"",{"$f":"F!U18","v":0},"",null,null,{"$f":"G!R18+BI17","v":0},{"$f":"G!S18","v":0},"",{"$f":"G!T18","v":0},"",{"$f":"G!U18","v":0},"",null,null,{"$f":"H!R18+BR17","v":0},{"$f":"H!S18","v":0},"",{"$f":"H!T18","v":0},"",{"$f":"H!U18","v":0},"",null,null,{"$f":"I!R18+CA17","v":0},{"$f":"I!S18","v":0},"",{"$f":"I!T18","v":0},"",{"$f":"I!U18","v":0},"",null,null,{"$f":"J!R18+CJ17","v":0},{"$f":"J!S18","v":0},"",{"$f":"J!T18","v":0},"",{"$f":"J!U18","v":0},"",null,null,{"$f":"K!R18+CS17","v":0},{"$f":"K!S18","v":0},"",{"$f":"K!T18","v":0},"",{"$f":"K!U18","v":0},"",null,null,{"$f":"L!R18+DB17","v":0},{"$f":"L!S18","v":0},"",{"$f":"L!T18","v":0},"",{"$f":"L!U18","v":0},""]
[null,{"$f":"A!R19+G18","v":0},{"$f":"A!S19","v":0},"",{"$f":"A!T19","v":0},"",{"$f":"A!U19","v":0},"",null,null,{"$f":"B!R19+P18","v":0},{"$f":"B!S19","v":0},"",{"$f":"B!T19","v":0},"",{"$f":"B!U19","v":0},"",null,null,{"$f":"'C'!R19+Y18","v":0},{"$f":"'C'!S19","v":0},"",{"$f":"'C'!T19","v":0},"",{"$f":"'C'!U19","v":0},"",null,null,{"$f":"D!R19+AH18","v":0},{"$f":"D!S19","v":0},"",{"$f":"D!T19","v":0},"",{"$f":"D!U19","v":0},"",null,null,{"$f":"E!R19","v":0},{"$f":"E!S19","v":0},"",{"$f":"E!T19","v":0},"",{"$f":"E!U19","v":0},"",null,null,{"$f":"F!R19+AZ18","v":0},{"$f":"F!S19","v":0},"",{"$f":"F!T19","v":0},"",{"$f":"F!U19","v":0},"",null,null,{"$f":"G!R19+BI18","v":0},{"$f":"G!S19","v":0},"",{"$f":"G!T19","v":0},"",{"$f":"G!U19","v":0},"",null,null,{"$f":"H!R19+BR18","v":0},{"$f":"H!S19","v":0},"",{"$f":"H!T19","v":0},"",{"$f":"H!U19","v":0},"",null,null,{"$f":"I!R19+CA18","v":0},{"$f":"I!S19","v":0},"",{"$f":"I!T19","v":0},"",{"$f":"I!U19","v":0},"",null,null,{"$f":"J!R19+CJ18","v":0},{"$f":"J!S19","v":0},"",{"$f":"J!T19","v":0},"",{"$f":"J!U19","v":0},"",null,null,{"$f":"K!R19+CS18","v":0},{"$f":"K!S19","v":0},"",{"$f":"K!T19","v":0},"",{"$f":"K!U19","v":0},"",null,null,{"$f":"L!R19+DB18","v":0},{"$f":"L!S19","v":0},"",{"$f":"L!T19","v":0},"",{"$f":"L!U19","v":0},""]
[null,{"$f":"A!R20+G19","v":0},{"$f":"A!S20","v":0},"",{"$f":"A!T20","v":0},"",{"$f":"A!U20","v":0},"",null,null,{"$f":"B!R20+P19","v":0},{"$f":"B!S20","v":0},"",{"$f":"B!T20","v":0},"",{"$f":"B!U20","v":0},"",null,null,{"$f":"'C'!R20+Y19","v":0},{"$f":"'C'!S20","v":0},"",{"$f":"'C'!T20","v":0},"",{"$f":"'C'!U20","v":0},"",null,null,{"$f":"D!R20+AH19","v":0},{"$f":"D!S20","v":0},"",{"$f":"D!T20","v":0},"",{"$f":"D!U20","v":0},"",null,null,{"$f":"E!R20","v":0},{"$f":"E!S20","v":0},"",{"$f":"E!T20","v":0},"",{"$f":"E!U20","v":0},"",null,null,{"$f":"F!R20+AZ19","v":0},{"$f":"F!S20","v":0},"",{"$f":"F!T20","v":0},"",{"$f":"F!U20","v":0},"",null,null,{"$f":"G!R20+BI19","v":0},{"$f":"G!S20","v":0},"",{"$f":"G!T20","v":0},"",{"$f":"G!U20","v":0},"",null,null,{"$f":"H!R20+BR19","v":0},{"$f":"H!S20","v":0},"",{"$f":"H!T20","v":0},"",{"$f":"H!U20","v":0},"",null,null,{"$f":"I!R20+CA19","v":0},{"$f":"I!S20","v":0},"",{"$f":"I!T20","v":0},"",{"$f":"I!U20","v":0},"",null,null,{"$f":"J!R20+CJ19","v":0},{"$f":"J!S20","v":0},"",{"$f":"J!T20","v":0},"",{"$f":"J!U20","v":0},"",null,null,{"$f":"K!R20+CS19","v":0},{"$f":"K!S20","v":0},"",{"$f":"K!T20","v":0},"",{"$f":"K!U20","v":0},"",null,null,{"$f":"L!R20+DB19","v":0},{"$f":"L!S20","v":0},"",{"$f":"L!T20","v":0},"",{"$f":"L!U20","v":0},""]
[null,{"$f":"A!R21+G20","v":0},{"$f":"A!S21","v":0},"",{"$f":"A!T21","v":0},"",{"$f":"A!U21","v":0},"",null,null,{"$f":"B!R21+P20","v":0},{"$f":"B!S21","v":0},"",{"$f":"B!T21","v":0},"",{"$f":"B!U21","v":0},"",null,null,{"$f":"'C'!R21+Y20","v":0},{"$f":"'C'!S21","v":0},"",{"$f":"'C'!T21","v":0},"",{"$f":"'C'!U21","v":0},"",null,null,{"$f":"D!R21+AH20","v":0},{"$f":"D!S21","v":0},"",{"$f":"D!T21","v":0},"",{"$f":"D!U21","v":0},"",null,null,{"$f":"E!R21","v":0},{"$f":"E!S21","v":0},"",{"$f":"E!T21","v":0},"",{"$f":"E!U21","v":0},"",null,null,{"$f":"F!R21+AZ20","v":0},{"$f":"F!S21","v":0},"",{"$f":"F!T21","v":0},"",{"$f":"F!U21","v":0},"",null,null,{"$f":"G!R21+BI20","v":0},{"$f":"G!S21","v":0},"",{"$f":"G!T21","v":0},"",{"$f":"G!U21","v":0},"",null,null,{"$f":"H!R21+BR20","v":0},{"$f":"H!S21","v":0},"",{"$f":"H!T21","v":0},"",{"$f":"H!U21","v":0},"",null,null,{"$f":"I!R21+CA20","v":0},{"$f":"I!S21","v":0},"",{"$f":"I!T21","v":0},"",{"$f":"I!U21","v":0},"",null,null,{"$f":"J!R21+CJ20","v":0},{"$f":"J!S21","v":0},"",{"$f":"J!T21","v":0},"",{"$f":"J!U21","v":0},"",null,null,{"$f":"K!R21+CS20","v":0},{"$f":"K!S21","v":0},"",{"$f":"K!T21","v":0},"",{"$f":"K!U21","v":0},"",null,null,{"$f":"L!R21+DB20","v":0},{"$f":"L!S21","v":0},"",{"$f":"L!T21","v":0},"",{"$f":"L!U21","v":0},""]
[null,{"$f":"A!R22+G21","v":0},{"$f":"A!S22","v":0},"",{"$f":"A!T22","v":0},"",{"$f":"A!U22","v":0},"",null,null,{"$f":"B!R22+P21","v":0},{"$f":"B!S22","v":0},"",{"$f":"B!T22","v":0},"",{"$f":"B!U22","v":0},"",null,null,{"$f":"'C'!R22+Y21","v":0},{"$f":"'C'!S22","v":0},"",{"$f":"'C'!T22","v":0},"",{"$f":"'C'!U22","v":0},"",null,null,{"$f":"D!R22+AH21","v":0},{"$f":"D!S22","v":0},"",{"$f":"D!T22","v":0},"",{"$f":"D!U22","v":0},"",null,null,{"$f":"E!R22","v":0},{"$f":"E!S22","v":0},"",{"$f":"E!T22","v":0},"",{"$f":"E!U22","v":0},"",null,null,{"$f":"F!R22+AZ21","v":0},{"$f":"F!S22","v":0},"",{"$f":"F!T22","v":0},"",{"$f":"F!U22","v":0},"",null,null,{"$f":"G!R22+BI21","v":0},{"$f":"G!S22","v":0},"",{"$f":"G!T22","v":0},"",{"$f":"G!U22","v":0},"",null,null,{"$f":"H!R22+BR21","v":0},{"$f":"H!S22","v":0},"",{"$f":"H!T22","v":0},"",{"$f":"H!U22","v":0},"",null,null,{"$f":"I!R22+CA21","v":0},{"$f":"I!S22","v":0},"",{"$f":"I!T22","v":0},"",{"$f":"I!U22","v":0},"",null,null,{"$f":"J!R22+CJ21","v":0},{"$f":"J!S22","v":0},"",{"$f":"J!T22","v":0},"",{"$f":"J!U22","v":0},"",null,null,{"$f":"K!R22+CS21","v":0},{"$f":"K!S22","v":0},"",{"$f":"K!T22","v":0},"",{"$f":"K!U22","v":0},"",null,null,{"$f":"L!R22+DB21","v":0},{"$f":"L!S22","v":0},"",{"$f":"L!T22","v":0},"",{"$f":"L!U22","v":0},""]
[null,{"$f":"A!R23+G22","v":0},{"$f":"A!S23","v":0},"",{"$f":"A!T23","v":0},"",{"$f":"A!U23","v":0},"",null,null,{"$f":"B!R23+P22","v":0},{"$f":"B!S23","v":0},"",{"$f":"B!T23","v":0},"",{"$f":"B!U23","v":0},"",null,null,{"$f":"'C'!R23+Y22","v":0},{"$f":"'C'!S23","v":0},"",{"$f":"'C'!T23","v":0},"",{"$f":"'C'!U23","v":0},"",null,null,{"$f":"D!R23+AH22","v":0},{"$f":"D!S23","v":0},"",{"$f":"D!T23","v":0},"",{"$f":"D!U23","v":0},"",null,null,{"$f":"E!R23","v":0},{"$f":"E!S23","v":0},"",{"$f":"E!T23","v":0},"",{"$f":"E!U23","v":0},"",null,null,{"$f":"F!R23+AZ22","v":0},{"$f":"F!S23","v":0},"",{"$f":"F!T23","v":0},"",{"$f":"F!U23","v":0},"",null,null,{"$f":"G!R23+BI22","v":0},{"$f":"G!S23","v":0},"",{"$f":"G!T23","v":0},"",{"$f":"G!U23","v":0},"",null,null,{"$f":"H!R23+BR22","v":0},{"$f":"H!S23","v":0},"",{"$f":"H!T23","v":0},"",{"$f":"H!U23","v":0},"",null,null,{"$f":"I!R23+CA22","v":0},{"$f":"I!S23","v":0},"",{"$f":"I!T23","v":0},"",{"$f":"I!U23","v":0},"",null,null,{"$f":"J!R23+CJ22","v":0},{"$f":"J!S23","v":0},"",{"$f":"J!T23","v":0},"",{"$f":"J!U23","v":0},"",null,null,{"$f":"K!R23+CS22","v":0},{"$f":"K!S23","v":0},"",{"$f":"K!T23","v":0},"",{"$f":"K!U23","v":0},"",null,null,{"$f":"L!R23+DB22","v":0},{"$f":"L!S23","v":0},"",{"$f":"L!T23","v":0},"",{"$f":"L!U23","v":0},""]
[null,{"$f":"A!R24+G23","v":0},{"$f":"A!S24","v":0},"",{"$f":"A!T24","v":0},"",{"$f":"A!U24","v":0},"",null,null,{"$f":"B!R24+P23","v":0},{"$f":"B!S24","v":0},"",{"$f":"B!T24","v":0},"",{"$f":"B!U24","v":0},"",null,null,{"$f":"'C'!R24+Y23","v":0},{"$f":"'C'!S24","v":0},"",{"$f":"'C'!T24","v":0},"",{"$f":"'C'!U24","v":0},"",null,null,{"$f":"D!R24+AH23","v":0},{"$f":"D!S24","v":0},"",{"$f":"D!T24","v":0},"",{"$f":"D!U24","v":0},"",null,null,{"$f":"E!R24","v":0},{"$f":"E!S24","v":0},"",{"$f":"E!T24","v":0},"",{"$f":"E!U24","v":0},"",null,null,{"$f":"F!R24+AZ23","v":0},{"$f":"F!S24","v":0},"",{"$f":"F!T24","v":0},"",{"$f":"F!U24","v":0},"",null,null,{"$f":"G!R24+BI23","v":0},{"$f":"G!S24","v":0},"",{"$f":"G!T24","v":0},"",{"$f":"G!U24","v":0},"",null,null,{"$f":"H!R24+BR23","v":0},{"$f":"H!S24","v":0},"",{"$f":"H!T24","v":0},"",{"$f":"H!U24","v":0},"",null,null,{"$f":"I!R24+CA23","v":0},{"$f":"I!S24","v":0},"",{"$f":"I!T24","v":0},"",{"$f":"I!U24","v":0},"",null,null,{"$f":"J!R24+CJ23","v":0},{"$f":"J!S24","v":0},"",{"$f":"J!T24","v":0},"",{"$f":"J!U24","v":0},"",null,null,{"$f":"K!R24+CS23","v":0},{"$f":"K!S24","v":0},"",{"$f":"K!T24","v":0},"",{"$f":"K!U24","v":0},"",null,null,{"$f":"L!R24+DB23","v":0},{"$f":"L!S24","v":0},"",{"$f":"L!T24","v":0},"",{"$f":"L!U24","v":0},""]
[null,{"$f":"A!R25+G24","v":0},{"$f":"A!S25","v":0},"",{"$f":"A!T25","v":0},"",{"$f":"A!U25","v":0},"",null,null,{"$f":"B!R25+P24","v":0},{"$f":"B!S25","v":0},"",{"$f":"B!T25","v":0},"",{"$f":"B!U25","v":0},"",null,null,{"$f":"'C'!R25+Y24","v":0},{"$f":"'C'!S25","v":0},"",{"$f":"'C'!T25","v":0},"",{"$f":"'C'!U25","v":0},"",null,null,{"$f":"D!R25+AH24","v":0},{"$f":"D!S25","v":0},"",{"$f":"D!T25","v":0},"",{"$f":"D!U25","v":0},"",null,null,{"$f":"E!R25","v":0},{"$f":"E!S25","v":0},"",{"$f":"E!T25","v":0},"",{"$f":"E!U25","v":0},"",null,null,{"$f":"F!R25+AZ24","v":0},{"$f":"F!S25","v":0},"",{"$f":"F!T25","v":0},"",{"$f":"F!U25","v":0},"",null,null,{"$f":"G!R25+BI24","v":0},{"$f":"G!S25","v":0},"",{"$f":"G!T25","v":0},"",{"$f":"G!U25","v":0},"",null,null,{"$f":"H!R25+BR24","v":0},{"$f":"H!S25","v":0},"",{"$f":"H!T25","v":0},"",{"$f":"H!U25","v":0},"",null,null,{"$f":"I!R25+CA24","v":0},{"$f":"I!S25","v":0},"",{"$f":"I!T25","v":0},"",{"$f":"I!U25","v":0},"",null,null,{"$f":"J!R25+CJ24","v":0},{"$f":"J!S25","v":0},"",{"$f":"J!T25","v":0},"",{"$f":"J!U25","v":0},"",null,null,{"$f":"K!R25+CS24","v":0},{"$f":"K!S25","v":0},"",{"$f":"K!T25","v":0},"",{"$f":"K!U25","v":0},"",null,null,{"$f":"L!R25+DB24","v":0},{"$f":"L!S25","v":0},"",{"$f":"L!T25","v":0},"",{"$f":"L!U25","v":0},""]
[null,{"$f":"A!R26+G25","v":0},{"$f":"A!S26","v":0},"",{"$f":"A!T26","v":0},"",{"$f":"A!U26","v":0},"",null,null,{"$f":"B!R26+P25","v":0},{"$f":"B!S26","v":0},"",{"$f":"B!T26","v":0},"",{"$f":"B!U26","v":0},"",null,null,{"$f":"'C'!R26+Y25","v":0},{"$f":"'C'!S26","v":0},"",{"$f":"'C'!T26","v":0},"",{"$f":"'C'!U26","v":0},"",null,null,{"$f":"D!R26+AH25","v":0},{"$f":"D!S26","v":0},"",{"$f":"D!T26","v":0},"",{"$f":"D!U26","v":0},"",null,null,{"$f":"E!R26","v":0},{"$f":"E!S26","v":0},"",{"$f":"E!T26","v":0},"",{"$f":"E!U26","v":0},"",null,null,{"$f":"F!R26+AZ25","v":0},{"$f":"F!S26","v":0},"",{"$f":"F!T26","v":0},"",{"$f":"F!U26","v":0},"",null,null,{"$f":"G!R26+BI25","v":0},{"$f":"G!S26","v":0},"",{"$f":"G!T26","v":0},"",{"$f":"G!U26","v":0},"",null,null,{"$f":"H!R26+BR25","v":0},{"$f":"H!S26","v":0},"",{"$f":"H!T26","v":0},"",{"$f":"H!U26","v":0},"",null,null,{"$f":"I!R26+CA25","v":0},{"$f":"I!S26","v":0},"",{"$f":"I!T26","v":0},"",{"$f":"I!U26","v":0},"",null,null,{"$f":"J!R26+CJ25","v":0},{"$f":"J!S26","v":0},"",{"$f":"J!T26","v":0},"",{"$f":"J!U26","v":0},"",null,null,{"$f":"K!R26+CS25","v":0},{"$f":"K!S26","v":0},"",{"$f":"K!T26","v":0},"",{"$f":"K!U26","v":0},"",null,null,{"$f":"L!R26+DB25","v":0},{"$f":"L!S26","v":0},"",{"$f":"L!T26","v":0},"",{"$f":"L!U26","v":0},""]
[null,{"$f":"A!R27+G26","v":0},{"$f":"A!S27","v":0},"",{"$f":"A!T27","v":0},"",{"$f":"A!U27","v":0},"",null,null,{"$f":"B!R27+P26","v":0},{"$f":"B!S27","v":0},"",{"$f":"B!T27","v":0},"",{"$f":"B!U27","v":0},"",null,null,{"$f":"'C'!R27+Y26","v":0},{"$f":"'C'!S27","v":0},"",{"$f":"'C'!T27","v":0},"",{"$f":"'C'!U27","v":0},"",null,null,{"$f":"D!R27+AH26","v":0},{"$f":"D!S27","v":0},"",{"$f":"D!T27","v":0},"",{"$f":"D!U27","v":0},"",null,null,{"$f":"E!R27","v":0},{"$f":"E!S27","v":0},"",{"$f":"E!T27","v":0},"",{"$f":"E!U27","v":0},"",null,null,{"$f":"F!R27+AZ26","v":0},{"$f":"F!S27","v":0},"",{"$f":"F!T27","v":0},"",{"$f":"F!U27","v":0},"",null,null,{"$f":"G!R27+BI26","v":0},{"$f":"G!S27","v":0},"",{"$f":"G!T27","v":0},"",{"$f":"G!U27","v":0},"",null,null,{"$f":"H!R27+BR26","v":0},{"$f":"H!S27","v":0},"",{"$f":"H!T27","v":0},"",{"$f":"H!U27","v":0},"",null,null,{"$f":"I!R27+CA26","v":0},{"$f":"I!S27","v":0},"",{"$f":"I!T27","v":0},"",{"$f":"I!U27","v":0},"",null,null,{"$f":"J!R27+CJ26","v":0},{"$f":"J!S27","v":0},"",{"$f":"J!T27","v":0},"",{"$f":"J!U27","v":0},"",null,null,{"$f":"K!R27+CS26","v":0},{"$f":"K!S27","v":0},"",{"$f":"K!T27","v":0},"",{"$f":"K!U27","v":0},"",null,null,{"$f":"L!R27+DB26","v":0},{"$f":"L!S27","v":0},"",{"$f":"L!T27","v":0},"",{"$f":"L!U27","v":0},""]
[null,{"$f":"A!R28+G27","v":0},{"$f":"A!S28","v":0},"",{"$f":"A!T28","v":0},"",{"$f":"A!U28","v":0},"",null,null,{"$f":"B!R28+P27","v":0},{"$f":"B!S28","v":0},"",{"$f":"B!T28","v":0},"",{"$f":"B!U28","v":0},"",null,null,{"$f":"'C'!R28+Y27","v":0},{"$f":"'C'!S28","v":0},"",{"$f":"'C'!T28","v":0},"",{"$f":"'C'!U28","v":0},"",null,null,{"$f":"D!R28+AH27","v":0},{"$f":"D!S28","v":0},"",{"$f":"D!T28","v":0},"",{"$f":"D!U28","v":0},"",null,null,{"$f":"E!R28","v":0},{"$f":"E!S28","v":0},"",{"$f":"E!T28","v":0},"",{"$f":"E!U28","v":0},"",null,null,{"$f":"F!R28+AZ27","v":0},{"$f":"F!S28","v":0},"",{"$f":"F!T28","v":0},"",{"$f":"F!U28","v":0},"",null,null,{"$f":"G!R28+BI27","v":0},{"$f":"G!S28","v":0},"",{"$f":"G!T28","v":0},"",{"$f":"G!U28","v":0},"",null,null,{"$f":"H!R28+BR27","v":0},{"$f":"H!S28","v":0},"",{"$f":"H!T28","v":0},"",{"$f":"H!U28","v":0},"",null,null,{"$f":"I!R28+CA27","v":0},{"$f":"I!S28","v":0},"",{"$f":"I!T28","v":0},"",{"$f":"I!U28","v":0},"",null,null,{"$f":"J!R28+CJ27","v":0},{"$f":"J!S28","v":0},"",{"$f":"J!T28","v":0},"",{"$f":"J!U28","v":0},"",null,null,{"$f":"K!R28+CS27","v":0},{"$f":"K!S28","v":0},"",{"$f":"K!T28","v":0},"",{"$f":"K!U28","v":0},"",null,null,{"$f":"L!R28+DB27","v":0},{"$f":"L!S28","v":0},"",{"$f":"L!T28","v":0},"",{"$f":"L!U28","v":0},""]
[null,{"$f":"A!R29+G28","v":0},{"$f":"A!S29","v":0},"",{"$f":"A!T29","v":0},"",{"$f":"A!U29","v":0},"",null,null,{"$f":"B!R29+P28","v":0},{"$f":"B!S29","v":0},"",{"$f":"B!T29","v":0},"",{"$f":"B!U29","v":0},"",null,null,{"$f":"'C'!R29+Y28","v":0},{"$f":"'C'!S29","v":0},"",{"$f":"'C'!T29","v":0},"",{"$f":"'C'!U29","v":0},"",null,null,{"$f":"D!R29+AH28","v":0},{"$f":"D!S29","v":0},"",{"$f":"D!T29","v":0},"",{"$f":"D!U29","v":0},"",null,null,{"$f":"E!R29","v":0},{"$f":"E!S29","v":0},"",{"$f":"E!T29","v":0},"",{"$f":"E!U29","v":0},"",null,null,{"$f":"F!R29+AZ28","v":0},{"$f":"F!S29","v":0},"",{"$f":"F!T29","v":0},"",{"$f":"F!U29","v":0},"",null,null,{"$f":"G!R29+BI28","v":0},{"$f":"G!S29","v":0},"",{"$f":"G!T29","v":0},"",{"$f":"G!U29","v":0},"",null,null,{"$f":"H!R29+BR28","v":0},{"$f":"H!S29","v":0},"",{"$f":"H!T29","v":0},"",{"$f":"H!U29","v":0},"",null,null,{"$f":"I!R29+CA28","v":0},{"$f":"I!S29","v":0},"",{"$f":"I!T29","v":0},"",{"$f":"I!U29","v":0},"",null,null,{"$f":"J!R29+CJ28","v":0},{"$f":"J!S29","v":0},"",{"$f":"J!T29","v":0},"",{"$f":"J!U29","v":0},"",null,null,{"$f":"K!R29+CS28","v":0},{"$f":"K!S29","v":0},"",{"$f":"K!T29","v":0},"",{"$f":"K!U29","v":0},"",null,null,{"$f":"L!R29+DB28","v":0},{"$f":"L!S29","v":0},"",{"$f":"L!T29","v":0},"",{"$f":"L!U29","v":0},""]
[null,{"$f":"A!R30+G29","v":0},{"$f":"A!S30","v":0},"",{"$f":"A!T30","v":0},"",{"$f":"A!U30","v":0},"",null,null,{"$f":"B!R30+P29","v":0},{"$f":"B!S30","v":0},"",{"$f":"B!T30","v":0},"",{"$f":"B!U30","v":0},"",null,null,{"$f":"'C'!R30+Y29","v":0},{"$f":"'C'!S30","v":0},"",{"$f":"'C'!T30","v":0},"",{"$f":"'C'!U30","v":0},"",null,null,{"$f":"D!R30+AH29","v":0},{"$f":"D!S30","v":0},"",{"$f":"D!T30","v":0},"",{"$f":"D!U30","v":0},"",null,null,{"$f":"E!R30","v":0},{"$f":"E!S30","v":0},"",{"$f":"E!T30","v":0},"",{"$f":"E!U30","v":0},"",null,null,{"$f":"F!R30+AZ29","v":0},{"$f":"F!S30","v":0},"",{"$f":"F!T30","v":0},"",{"$f":"F!U30","v":0},"",null,null,{"$f":"G!R30+BI29","v":0},{"$f":"G!S30","v":0},"",{"$f":"G!T30","v":0},"",{"$f":"G!U30","v":0},"",null,null,{"$f":"H!R30+BR29","v":0},{"$f":"H!S30","v":0},"",{"$f":"H!T30","v":0},"",{"$f":"H!U30","v":0},"",null,null,{"$f":"I!R30+CA29","v":0},{"$f":"I!S30","v":0},"",{"$f":"I!T30","v":0},"",{"$f":"I!U30","v":0},"",null,null,{"$f":"J!R30+CJ29","v":0},{"$f":"J!S30","v":0},"",{"$f":"J!T30","v":0},"",{"$f":"J!U30","v":0},"",null,null,{"$f":"K!R30+CS29","v":0},{"$f":"K!S30","v":0},"",{"$f":"K!T30","v":0},"",{"$f":"K!U30","v":0},"",null,null,{"$f":"L!R30+DB29","v":0},{"$f":"L!S30","v":0},"",{"$f":"L!T30","v":0},"",{"$f":"L!U30","v":0},""]
[null,{"$f":"A!R31+G30","v":0},{"$f":"A!S31","v":0},"",{"$f":"A!T31","v":0},"",{"$f":"A!U31","v":0},"",null,null,{"$f":"B!R31+P30","v":0},{"$f":"B!S31","v":0},"",{"$f":"B!T31","v":0},"",{"$f":"B!U31","v":0},"",null,null,{"$f":"'C'!R31+Y30","v":0},{"$f":"'C'!S31","v":0},"",{"$f":"'C'!T31","v":0},"",{"$f":"'C'!U31","v":0},"",null,null,{"$f":"D!R31+AH30","v":0},{"$f":"D!S31","v":0},"",{"$f":"D!T31","v":0},"",{"$f":"D!U31","v":0},"",null,null,{"$f":"E!R31","v":0},{"$f":"E!S31","v":0},"",{"$f":"E!T31","v":0},"",{"$f":"E!U31","v":0},"",null,null,{"$f":"F!R31+AZ30","v":0},{"$f":"F!S31","v":0},"",{"$f":"F!T31","v":0},"",{"$f":"F!U31","v":0},"",null,null,{"$f":"G!R31+BI30","v":0},{"$f":"G!S31","v":0},"",{"$f":"G!T31","v":0},"",{"$f":"G!U31","v":0},"",null,null,{"$f":"H!R31+BR30","v":0},{"$f":"H!S31","v":0},"",{"$f":"H!T31","v":0},"",{"$f":"H!U31","v":0},"",null,null,{"$f":"I!R31+CA30","v":0},{"$f":"I!S31","v":0},"",{"$f":"I!T31","v":0},"",{"$f":"I!U31","v":0},"",null,null,{"$f":"J!R31+CJ30","v":0},{"$f":"J!S31","v":0},"",{"$f":"J!T31","v":0},"",{"$f":"J!U31","v":0},"",null,null,{"$f":"K!R31+CS30","v":0},{"$f":"K!S31","v":0},"",{"$f":"K!T31","v":0},"",{"$f":"K!U31","v":0},"",null,null,{"$f":"L!R31+DB30","v":0},{"$f":"L!S31","v":0},"",{"$f":"L!T31","v":0},"",{"$f":"L!U31","v":0},""]
[null,{"$f":"A!R32+G31","v":0},{"$f":"A!S32","v":0},"",{"$f":"A!T32","v":0},"",{"$f":"A!U32","v":0},"",null,null,{"$f":"B!R32+P31","v":0},{"$f":"B!S32","v":0},"",{"$f":"B!T32","v":0},"",{"$f":"B!U32","v":0},"",null,null,{"$f":"'C'!R32+Y31","v":0},{"$f":"'C'!S32","v":0},"",{"$f":"'C'!T32","v":0},"",{"$f":"'C'!U32","v":0},"",null,null,{"$f":"D!R32+AH31","v":0},{"$f":"D!S32","v":0},"",{"$f":"D!T32","v":0},"",{"$f":"D!U32","v":0},"",null,null,{"$f":"E!R32","v":0},{"$f":"E!S32","v":0},"",{"$f":"E!T32","v":0},"",{"$f":"E!U32","v":0},"",null,null,{"$f":"F!R32+AZ31","v":0},{"$f":"F!S32","v":0},"",{"$f":"F!T32","v":0},"",{"$f":"F!U32","v":0},"",null,null,{"$f":"G!R32+BI31","v":0},{"$f":"G!S32","v":0},"",{"$f":"G!T32","v":0},"",{"$f":"G!U32","v":0},"",null,null,{"$f":"H!R32+BR31","v":0},{"$f":"H!S32","v":0},"",{"$f":"H!T32","v":0},"",{"$f":"H!U32","v":0},"",null,null,{"$f":"I!R32+CA31","v":0},{"$f":"I!S32","v":0},"",{"$f":"I!T32","v":0},"",{"$f":"I!U32","v":0},"",null,null,{"$f":"J!R32+CJ31","v":0},{"$f":"J!S32","v":0},"",{"$f":"J!T32","v":0},"",{"$f":"J!U32","v":0},"",null,null,{"$f":"K!R32+CS31","v":0},{"$f":"K!S32","v":0},"",{"$f":"K!T32","v":0},"",{"$f":"K!U32","v":0},"",null,null,{"$f":"L!R32+DB31","v":0},{"$f":"L!S32","v":0},"",{"$f":"L!T32","v":0},"",{"$f":"L!U32","v":0},""]
[null,{"$f":"A!R33+G32","v":0},{"$f":"A!S33","v":0},"",{"$f":"A!T33","v":0},"",{"$f":"A!U33","v":0},"",null,null,{"$f":"B!R33+P32","v":0},{"$f":"B!S33","v":0},"",{"$f":"B!T33","v":0},"",{"$f":"B!U33","v":0},"",null,null,{"$f":"'C'!R33+Y32","v":0},{"$f":"'C'!S33","v":0},"",{"$f":"'C'!T33","v":0},"",{"$f":"'C'!U33","v":0},"",null,null,{"$f":"D!R33+AH32","v":0},{"$f":"D!S33","v":0},"",{"$f":"D!T33","v":0},"",{"$f":"D!U33","v":0},"",null,null,{"$f":"E!R33","v":0},{"$f":"E!S33","v":0},"",{"$f":"E!T33","v":0},"",{"$f":"E!U33","v":0},"",null,null,{"$f":"F!R33+AZ32","v":0},{"$f":"F!S33","v":0},"",{"$f":"F!T33","v":0},"",{"$f":"F!U33","v":0},"",null,null,{"$f":"G!R33+BI32","v":0},{"$f":"G!S33","v":0},"",{"$f":"G!T33","v":0},"",{"$f":"G!U33","v":0},"",null,null,{"$f":"H!R33+BR32","v":0},{"$f":"H!S33","v":0},"",{"$f":"H!T33","v":0},"",{"$f":"H!U33","v":0},"",null,null,{"$f":"I!R33+CA32","v":0},{"$f":"I!S33","v":0},"",{"$f":"I!T33","v":0},"",{"$f":"I!U33","v":0},"",null,null,{"$f":"J!R33+CJ32","v":0},{"$f":"J!S33","v":0},"",{"$f":"J!T33","v":0},"",{"$f":"J!U33","v":0},"",null,null,{"$f":"K!R33+CS32","v":0},{"$f":"K!S33","v":0},"",{"$f":"K!T33","v":0},"",{"$f":"K!U33","v":0},"",null,null,{"$f":"L!R33+DB32","v":0},{"$f":"L!S33","v":0},"",{"$f":"L!T33","v":0},"",{"$f":"L!U33","v":0},""]
[null,{"$f":"A!R34+G33","v":0},{"$f":"A!S34","v":0},"",{"$f":"A!T34","v":0},"",{"$f":"A!U34","v":0},"",null,null,{"$f":"B!R34+P33","v":0},{"$f":"B!S34","v":0},"",{"$f":"B!T34","v":0},"",{"$f":"B!U34","v":0},"",null,null,{"$f":"'C'!R34+Y33","v":0},{"$f":"'C'!S34","v":0},"",{"$f":"'C'!T34","v":0},"",{"$f":"'C'!U34","v":0},"",null,null,{"$f":"D!R34+AH33","v":0},{"$f":"D!S34","v":0},"",{"$f":"D!T34","v":0},"",{"$f":"D!U34","v":0},"",null,null,{"$f":"E!R34","v":0},{"$f":"E!S34","v":0},"",{"$f":"E!T34","v":0},"",{"$f":"E!U34","v":0},"",null,null,{"$f":"F!R34+AZ33","v":0},{"$f":"F!S34","v":0},"",{"$f":"F!T34","v":0},"",{"$f":"F!U34","v":0},"",null,null,{"$f":"G!R34+BI33","v":0},{"$f":"G!S34","v":0},"",{"$f":"G!T34","v":0},"",{"$f":"G!U34","v":0},"",null,null,{"$f":"H!R34+BR33","v":0},{"$f":"H!S34","v":0},"",{"$f":"H!T34","v":0},"",{"$f":"H!U34","v":0},"",null,null,{"$f":"I!R34+CA33","v":0},{"$f":"I!S34","v":0},"",{"$f":"I!T34","v":0},"",{"$f":"I!U34","v":0},"",null,null,{"$f":"J!R34+CJ33","v":0},{"$f":"J!S34","v":0},"",{"$f":"J!T34","v":0},"",{"$f":"J!U34","v":0},"",null,null,{"$f":"K!R34+CS33","v":0},{"$f":"K!S34","v":0},"",{"$f":"K!T34","v":0},"",{"$f":"K!U34","v":0},"",null,null,{"$f":"L!R34+DB33","v":0},{"$f":"L!S34","v":0},"",{"$f":"L!T34","v":0},"",{"$f":"L!U34","v":0},""]
[null,{"$f":"A!R35+G34","v":0},{"$f":"A!S35","v":0},"",{"$f":"A!T35","v":0},"",{"$f":"A!U35","v":0},"",null,null,{"$f":"B!R35+P34","v":0},{"$f":"B!S35","v":0},"",{"$f":"B!T35","v":0},"",{"$f":"B!U35","v":0},"",null,null,{"$f":"'C'!R35+Y34","v":0},{"$f":"'C'!S35","v":0},"",{"$f":"'C'!T35","v":0},"",{"$f":"'C'!U35","v":0},"",null,null,{"$f":"D!R35+AH34","v":0},{"$f":"D!S35","v":0},"",{"$f":"D!T35","v":0},"",{"$f":"D!U35","v":0},"",null,null,{"$f":"E!R35","v":0},{"$f":"E!S35","v":0},"",{"$f":"E!T35","v":0},"",{"$f":"E!U35","v":0},"",null,null,{"$f":"F!R35+AZ34","v":0},{"$f":"F!S35","v":0},"",{"$f":"F!T35","v":0},"",{"$f":"F!U35","v":0},"",null,null,{"$f":"G!R35+BI34","v":0},{"$f":"G!S35","v":0},"",{"$f":"G!T35","v":0},"",{"$f":"G!U35","v":0},"",null,null,{"$f":"H!R35+BR34","v":0},{"$f":"H!S35","v":0},"",{"$f":"H!T35","v":0},"",{"$f":"H!U35","v":0},"",null,null,{"$f":"I!R35+CA34","v":0},{"$f":"I!S35","v":0},"",{"$f":"I!T35","v":0},"",{"$f":"I!U35","v":0},"",null,null,{"$f":"J!R35+CJ34","v":0},{"$f":"J!S35","v":0},"",{"$f":"J!T35","v":0},"",{"$f":"J!U35","v":0},"",null,null,{"$f":"K!R35+CS34","v":0},{"$f":"K!S35","v":0},"",{"$f":"K!T35","v":0},"",{"$f":"K!U35","v":0},"",null,null,{"$f":"L!R35+DB34","v":0},{"$f":"L!S35","v":0},"",{"$f":"L!T35","v":0},"",{"$f":"L!U35","v":0},""]
[null,{"$f":"A!R36+G35","v":0},{"$f":"A!S36","v":0},"",{"$f":"A!T36","v":0},"",{"$f":"A!U36","v":0},"",null,null,{"$f":"B!R36+P35","v":0},{"$f":"B!S36","v":0},"",{"$f":"B!T36","v":0},"",{"$f":"B!U36","v":0},"",null,null,{"$f":"'C'!R36+Y35","v":0},{"$f":"'C'!S36","v":0},"",{"$f":"'C'!T36","v":0},"",{"$f":"'C'!U36","v":0},"",null,null,{"$f":"D!R36+AH35","v":0},{"$f":"D!S36","v":0},"",{"$f":"D!T36","v":0},"",{"$f":"D!U36","v":0},"",null,null,{"$f":"E!R36","v":0},{"$f":"E!S36","v":0},"",{"$f":"E!T36","v":0},"",{"$f":"E!U36","v":0},"",null,null,{"$f":"F!R36+AZ35","v":0},{"$f":"F!S36","v":0},"",{"$f":"F!T36","v":0},"",{"$f":"F!U36","v":0},"",null,null,{"$f":"G!R36+BI35","v":0},{"$f":"G!S36","v":0},"",{"$f":"G!T36","v":0},"",{"$f":"G!U36","v":0},"",null,null,{"$f":"H!R36+BR35","v":0},{"$f":"H!S36","v":0},"",{"$f":"H!T36","v":0},"",{"$f":"H!U36","v":0},"",null,null,{"$f":"I!R36+CA35","v":0},{"$f":"I!S36","v":0},"",{"$f":"I!T36","v":0},"",{"$f":"I!U36","v":0},"",null,null,{"$f":"J!R36+CJ35","v":0},{"$f":"J!S36","v":0},"",{"$f":"J!T36","v":0},"",{"$f":"J!U36","v":0},"",null,null,{"$f":"K!R36+CS35","v":0},{"$f":"K!S36","v":0},"",{"$f":"K!T36","v":0},"",{"$f":"K!U36","v":0},"",null,null,{"$f":"L!R36+DB35","v":0},{"$f":"L!S36","v":0},"",{"$f":"L!T36","v":0},"",{"$f":"L!U36","v":0},""]
[null,{"$f":"A!R37+G36","v":0},{"$f":"A!S37","v":0},"",{"$f":"A!T37","v":0},"",{"$f":"A!U37","v":0},"",null,null,{"$f":"B!R37+P36","v":0},{"$f":"B!S37","v":0},"",{"$f":"B!T37","v":0},"",{"$f":"B!U37","v":0},"",null,null,{"$f":"'C'!R37+Y36","v":0},{"$f":"'C'!S37","v":0},"",{"$f":"'C'!T37","v":0},"",{"$f":"'C'!U37","v":0},"",null,null,{"$f":"D!R37+AH36","v":0},{"$f":"D!S37","v":0},"",{"$f":"D!T37","v":0},"",{"$f":"D!U37","v":0},"",null,null,{"$f":"E!R37","v":0},{"$f":"E!S37","v":0},"",{"$f":"E!T37","v":0},"",{"$f":"E!U37","v":0},"",null,null,{"$f":"F!R37+AZ36","v":0},{"$f":"F!S37","v":0},"",{"$f":"F!T37","v":0},"",{"$f":"F!U37","v":0},"",null,null,{"$f":"G!R37+BI36","v":0},{"$f":"G!S37","v":0},"",{"$f":"G!T37","v":0},"",{"$f":"G!U37","v":0},"",null,null,{"$f":"H!R37+BR36","v":0},{"$f":"H!S37","v":0},"",{"$f":"H!T37","v":0},"",{"$f":"H!U37","v":0},"",null,null,{"$f":"I!R37+CA36","v":0},{"$f":"I!S37","v":0},"",{"$f":"I!T37","v":0},"",{"$f":"I!U37","v":0},"",null,null,{"$f":"J!R37+CJ36","v":0},{"$f":"J!S37","v":0},"",{"$f":"J!T37","v":0},"",{"$f":"J!U37","v":0},"",null,null,{"$f":"K!R37+CS36","v":0},{"$f":"K!S37","v":0},"",{"$f":"K!T37","v":0},"",{"$f":"K!U37","v":0},"",null,null,{"$f":"L!R37+DB36","v":0},{"$f":"L!S37","v":0},"",{"$f":"L!T37","v":0},"",{"$f":"L!U37","v":0},""]
[null,{"$f":"A!R38+G37","v":0},{"$f":"A!S38","v":0},"",{"$f":"A!T38","v":0},"",{"$f":"A!U38","v":0},"",null,null,{"$f":"B!R38+P37","v":0},{"$f":"B!S38","v":0},"",{"$f":"B!T38","v":0},"",{"$f":"B!U38","v":0},"",null,null,{"$f":"'C'!R38+Y37","v":0},{"$f":"'C'!S38","v":0},"",{"$f":"'C'!T38","v":0},"",{"$f":"'C'!U38","v":0},"",null,null,{"$f":"D!R38+AH37","v":0},{"$f":"D!S38","v":0},"",{"$f":"D!T38","v":0},"",{"$f":"D!U38","v":0},"",null,null,{"$f":"E!R38","v":0},{"$f":"E!S38","v":0},"",{"$f":"E!T38","v":0},"",{"$f":"E!U38","v":0},"",null,null,{"$f":"F!R38+AZ37","v":0},{"$f":"F!S38","v":0},"",{"$f":"F!T38","v":0},"",{"$f":"F!U38","v":0},"",null,null,{"$f":"G!R38+BI37","v":0},{"$f":"G!S38","v":0},"",{"$f":"G!T38","v":0},"",{"$f":"G!U38","v":0},"",null,null,{"$f":"H!R38+BR37","v":0},{"$f":"H!S38","v":0},"",{"$f":"H!T38","v":0},"",{"$f":"H!U38","v":0},"",null,null,{"$f":"I!R38+CA37","v":0},{"$f":"I!S38","v":0},"",{"$f":"I!T38","v":0},"",{"$f":"I!U38","v":0},"",null,null,{"$f":"J!R38+CJ37","v":0},{"$f":"J!S38","v":0},"",{"$f":"J!T38","v":0},"",{"$f":"J!U38","v":0},"",null,null,{"$f":"K!R38+CS37","v":0},{"$f":"K!S38","v":0},"",{"$f":"K!T38","v":0},"",{"$f":"K!U38","v":0},"",null,null,{"$f":"L!R38+DB37","v":0},{"$f":"L!S38","v":0},"",{"$f":"L!T38","v":0},"",{"$f":"L!U38","v":0},""]
[null,{"$f":"A!R39+G38","v":0},{"$f":"A!S39","v":0},"",{"$f":"A!T39","v":0},"",{"$f":"A!U39","v":0},"",null,null,{"$f":"B!R39+P38","v":0},{"$f":"B!S39","v":0},"",{"$f":"B!T39","v":0},"",{"$f":"B!U39","v":0},"",null,null,{"$f":"'C'!R39+Y38","v":0},{"$f":"'C'!S39","v":0},"",{"$f":"'C'!T39","v":0},"",{"$f":"'C'!U39","v":0},"",null,null,{"$f":"D!R39+AH38","v":0},{"$f":"D!S39","v":0},"",{"$f":"D!T39","v":0},"",{"$f":"D!U39","v":0},"",null,null,{"$f":"E!R39","v":0},{"$f":"E!S39","v":0},"",{"$f":"E!T39","v":0},"",{"$f":"E!U39","v":0},"",null,null,{"$f":"F!R39+AZ38","v":0},{"$f":"F!S39","v":0},"",{"$f":"F!T39","v":0},"",{"$f":"F!U39","v":0},"",null,null,{"$f":"G!R39+BI38","v":0},{"$f":"G!S39","v":0},"",{"$f":"G!T39","v":0},"",{"$f":"G!U39","v":0},"",null,null,{"$f":"H!R39+BR38","v":0},{"$f":"H!S39","v":0},"",{"$f":"H!T39","v":0},"",{"$f":"H!U39","v":0},"",null,null,{"$f":"I!R39+CA38","v":0},{"$f":"I!S39","v":0},"",{"$f":"I!T39","v":0},"",{"$f":"I!U39","v":0},"",null,null,{"$f":"J!R39+CJ38","v":0},{"$f":"J!S39","v":0},"",{"$f":"J!T39","v":0},"",{"$f":"J!U39","v":0},"",null,null,{"$f":"K!R39+CS38","v":0},{"$f":"K!S39","v":0},"",{"$f":"K!T39","v":0},"",{"$f":"K!U39","v":0},"",null,null,{"$f":"L!R39+DB38","v":0},{"$f":"L!S39","v":0},"",{"$f":"L!T39","v":0},"",{"$f":"L!U39","v":0},""]
[null,{"$f":"A!R40+G39","v":0},{"$f":"A!S40","v":0},"",{"$f":"A!T40","v":0},"",{"$f":"A!U40","v":0},"",null,null,{"$f":"B!R40+P39","v":0},{"$f":"B!S40","v":0},"",{"$f":"B!T40","v":0},"",{"$f":"B!U40","v":0},"",null,null,{"$f":"'C'!R40+Y39","v":0},{"$f":"'C'!S40","v":0},"",{"$f":"'C'!T40","v":0},"",{"$f":"'C'!U40","v":0},"",null,null,{"$f":"D!R40+AH39","v":0},{"$f":"D!S40","v":0},"",{"$f":"D!T40","v":0},"",{"$f":"D!U40","v":0},"",null,null,{"$f":"E!R40","v":0},{"$f":"E!S40","v":0},"",{"$f":"E!T40","v":0},"",{"$f":"E!U40","v":0},"",null,null,{"$f":"F!R40+AZ39","v":0},{"$f":"F!S40","v":0},"",{"$f":"F!T40","v":0},"",{"$f":"F!U40","v":0},"",null,null,{"$f":"G!R40+BI39","v":0},{"$f":"G!S40","v":0},"",{"$f":"G!T40","v":0},"",{"$f":"G!U40","v":0},"",null,null,{"$f":"H!R40+BR39","v":0},{"$f":"H!S40","v":0},"",{"$f":"H!T40","v":0},"",{"$f":"H!U40","v":0},"",null,null,{"$f":"I!R40+CA39","v":0},{"$f":"I!S40","v":0},"",{"$f":"I!T40","v":0},"",{"$f":"I!U40","v":0},"",null,null,{"$f":"J!R40+CJ39","v":0},{"$f":"J!S40","v":0},"",{"$f":"J!T40","v":0},"",{"$f":"J!U40","v":0},"",null,null,{"$f":"K!R40+CS39","v":0},{"$f":"K!S40","v":0},"",{"$f":"K!T40","v":0},"",{"$f":"K!U40","v":0},"",null,null,{"$f":"L!R40+DB39","v":0},{"$f":"L!S40","v":0},"",{"$f":"L!T40","v":0},"",{"$f":"L!U40","v":0},""]
[null,{"$f":"A!R41+G40","v":0},{"$f":"A!S41","v":0},"",{"$f":"A!T41","v":0},"",{"$f":"A!U41","v":0},"",null,null,{"$f":"B!R41+P40","v":0},{"$f":"B!S41","v":0},"",{"$f":"B!T41","v":0},"",{"$f":"B!U41","v":0},"",null,null,{"$f":"'C'!R41+Y40","v":0},{"$f":"'C'!S41","v":0},"",{"$f":"'C'!T41","v":0},"",{"$f":"'C'!U41","v":0},"",null,null,{"$f":"D!R41+AH40","v":0},{"$f":"D!S41","v":0},"",{"$f":"D!T41","v":0},"",{"$f":"D!U41","v":0},"",null,null,{"$f":"E!R41","v":0},{"$f":"E!S41","v":0},"",{"$f":"E!T41","v":0},"",{"$f":"E!U41","v":0},"",null,null,{"$f":"F!R41+AZ40","v":0},{"$f":"F!S41","v":0},"",{"$f":"F!T41","v":0},"",{"$f":"F!U41","v":0},"",null,null,{"$f":"G!R41+BI40","v":0},{"$f":"G!S41","v":0},"",{"$f":"G!T41","v":0},"",{"$f":"G!U41","v":0},"",null,null,{"$f":"H!R41+BR40","v":0},{"$f":"H!S41","v":0},"",{"$f":"H!T41","v":0},"",{"$f":"H!U41","v":0},"",null,null,{"$f":"I!R41+CA40","v":0},{"$f":"I!S41","v":0},"",{"$f":"I!T41","v":0},"",{"$f":"I!U41","v":0},"",null,null,{"$f":"J!R41+CJ40","v":0},{"$f":"J!S41","v":0},"",{"$f":"J!T41","v":0},"",{"$f":"J!U41","v":0},"",null,null,{"$f":"K!R41+CS40","v":0},{"$f":"K!S41","v":0},"",{"$f":"K!T41","v":0},"",{"$f":"K!U41","v":0},"",null,null,{"$f":"L!R41+DB40","v":0},{"$f":"L!S41","v":0},"",{"$f":"L!T41","v":0},"",{"$f":"L!U41","v":0},""]
[null,{"$f":"A!R42+G41","v":0},{"$f":"A!S42","v":0},"",{"$f":"A!T42","v":0},"",{"$f":"A!U42","v":0},"",null,null,{"$f":"B!R42+P41","v":0},{"$f":"B!S42","v":0},"",{"$f":"B!T42","v":0},"",{"$f":"B!U42","v":0},"",null,null,{"$f":"'C'!R42+Y41","v":0},{"$f":"'C'!S42","v":0},"",{"$f":"'C'!T42","v":0},"",{"$f":"'C'!U42","v":0},"",null,null,{"$f":"D!R42+AH41","v":0},{"$f":"D!S42","v":0},"",{"$f":"D!T42","v":0},"",{"$f":"D!U42","v":0},"",null,null,{"$f":"E!R42","v":0},{"$f":"E!S42","v":0},"",{"$f":"E!T42","v":0},"",{"$f":"E!U42","v":0},"",null,null,{"$f":"F!R42+AZ41","v":0},{"$f":"F!S42","v":0},"",{"$f":"F!T42","v":0},"",{"$f":"F!U42","v":0},"",null,null,{"$f":"G!R42+BI41","v":0},{"$f":"G!S42","v":0},"",{"$f":"G!T42","v":0},"",{"$f":"G!U42","v":0},"",null,null,{"$f":"H!R42+BR41","v":0},{"$f":"H!S42","v":0},"",{"$f":"H!T42","v":0},"",{"$f":"H!U42","v":0},"",null,null,{"$f":"I!R42+CA41","v":0},{"$f":"I!S42","v":0},"",{"$f":"I!T42","v":0},"",{"$f":"I!U42","v":0},"",null,null,{"$f":"J!R42+CJ41","v":0},{"$f":"J!S42","v":0},"",{"$f":"J!T42","v":0},"",{"$f":"J!U42","v":0},"",null,null,{"$f":"K!R42+CS41","v":0},{"$f":"K!S42","v":0},"",{"$f":"K!T42","v":0},"",{"$f":"K!U42","v":0},"",null,null,{"$f":"L!R42+DB41","v":0},{"$f":"L!S42","v":0},"",{"$f":"L!T42","v":0},"",{"$f":"L!U42","v":0},""]
[null,{"$f":"A!R43+G42","v":0},{"$f":"A!S43","v":0},"",{"$f":"A!T43","v":0},"",{"$f":"A!U43","v":0},"",null,null,{"$f":"B!R43+P42","v":0},{"$f":"B!S43","v":0},"",{"$f":"B!T43","v":0},"",{"$f":"B!U43","v":0},"",null,null,{"$f":"'C'!R43+Y42","v":0},{"$f":"'C'!S43","v":0},"",{"$f":"'C'!T43","v":0},"",{"$f":"'C'!U43","v":0},"",null,null,{"$f":"D!R43+AH42","v":0},{"$f":"D!S43","v":0},"",{"$f":"D!T43","v":0},"",{"$f":"D!U43","v":0},"",null,null,{"$f":"E!R43","v":0},{"$f":"E!S43","v":0},"",{"$f":"E!T43","v":0},"",{"$f":"E!U43","v":0},"",null,null,{"$f":"F!R43+AZ42","v":0},{"$f":"F!S43","v":0},"",{"$f":"F!T43","v":0},"",{"$f":"F!U43","v":0},"",null,null,{"$f":"G!R43+BI42","v":0},{"$f":"G!S43","v":0},"",{"$f":"G!T43","v":0},"",{"$f":"G!U43","v":0},"",null,null,{"$f":"H!R43+BR42","v":0},{"$f":"H!S43","v":0},"",{"$f":"H!T43","v":0},"",{"$f":"H!U43","v":0},"",null,null,{"$f":"I!R43+CA42","v":0},{"$f":"I!S43","v":0},"",{"$f":"I!T43","v":0},"",{"$f":"I!U43","v":0},"",null,null,{"$f":"J!R43+CJ42","v":0},{"$f":"J!S43","v":0},"",{"$f":"J!T43","v":0},"",{"$f":"J!U43","v":0},"",null,null,{"$f":"K!R43+CS42","v":0},{"$f":"K!S43","v":0},"",{"$f":"K!T43","v":0},"",{"$f":"K!U43","v":0},"",null,null,{"$f":"L!R43+DB42","v":0},{"$f":"L!S43","v":0},"",{"$f":"L!T43","v":0},"",{"$f":"L!U43","v":0},""]
[null,{"$f":"A!R44+G43","v":0},{"$f":"A!S44","v":0},"",{"$f":"A!T44","v":0},"",{"$f":"A!U44","v":0},"",null,null,{"$f":"B!R44+P43","v":0},{"$f":"B!S44","v":0},"",{"$f":"B!T44","v":0},"",{"$f":"B!U44","v":0},"",null,null,{"$f":"'C'!R44+Y43","v":0},{"$f":"'C'!S44","v":0},"",{"$f":"'C'!T44","v":0},"",{"$f":"'C'!U44","v":0},"",null,null,{"$f":"D!R44+AH43","v":0},{"$f":"D!S44","v":0},"",{"$f":"D!T44","v":0},"",{"$f":"D!U44","v":0},"",null,null,{"$f":"E!R44","v":0},{"$f":"E!S44","v":0},"",{"$f":"E!T44","v":0},"",{"$f":"E!U44","v":0},"",null,null,{"$f":"F!R44+AZ43","v":0},{"$f":"F!S44","v":0},"",{"$f":"F!T44","v":0},"",{"$f":"F!U44","v":0},"",null,null,{"$f":"G!R44+BI43","v":0},{"$f":"G!S44","v":0},"",{"$f":"G!T44","v":0},"",{"$f":"G!U44","v":0},"",null,null,{"$f":"H!R44+BR43","v":0},{"$f":"H!S44","v":0},"",{"$f":"H!T44","v":0},"",{"$f":"H!U44","v":0},"",null,null,{"$f":"I!R44+CA43","v":0},{"$f":"I!S44","v":0},"",{"$f":"I!T44","v":0},"",{"$f":"I!U44","v":0},"",null,null,{"$f":"J!R44+CJ43","v":0},{"$f":"J!S44","v":0},"",{"$f":"J!T44","v":0},"",{"$f":"J!U44","v":0},"",null,null,{"$f":"K!R44+CS43","v":0},{"$f":"K!S44","v":0},"",{"$f":"K!T44","v":0},"",{"$f":"K!U44","v":0},"",null,null,{"$f":"L!R44+DB43","v":0},{"$f":"L!S44","v":0},"",{"$f":"L!T44","v":0},"",{"$f":"L!U44","v":0},""]
[null,{"$f":"A!R45+G44","v":0},{"$f":"A!S45","v":0},"",{"$f":"A!T45","v":0},"",{"$f":"A!U45","v":0},"",null,null,{"$f":"B!R45+P44","v":0},{"$f":"B!S45","v":0},"",{"$f":"B!T45","v":0},"",{"$f":"B!U45","v":0},"",null,null,{"$f":"'C'!R45+Y44","v":0},{"$f":"'C'!S45","v":0},"",{"$f":"'C'!T45","v":0},"",{"$f":"'C'!U45","v":0},"",null,null,{"$f":"D!R45+AH44","v":0},{"$f":"D!S45","v":0},"",{"$f":"D!T45","v":0},"",{"$f":"D!U45","v":0},"",null,null,{"$f":"E!R45","v":0},{"$f":"E!S45","v":0},"",{"$f":"E!T45","v":0},"",{"$f":"E!U45","v":0},"",null,null,{"$f":"F!R45+AZ44","v":0},{"$f":"F!S45","v":0},"",{"$f":"F!T45","v":0},"",{"$f":"F!U45","v":0},"",null,null,{"$f":"G!R45+BI44","v":0},{"$f":"G!S45","v":0},"",{"$f":"G!T45","v":0},"",{"$f":"G!U45","v":0},"",null,null,{"$f":"H!R45+BR44","v":0},{"$f":"H!S45","v":0},"",{"$f":"H!T45","v":0},"",{"$f":"H!U45","v":0},"",null,null,{"$f":"I!R45+CA44","v":0},{"$f":"I!S45","v":0},"",{"$f":"I!T45","v":0},"",{"$f":"I!U45","v":0},"",null,null,{"$f":"J!R45+CJ44","v":0},{"$f":"J!S45","v":0},"",{"$f":"J!T45","v":0},"",{"$f":"J!U45","v":0},"",null,null,{"$f":"K!R45+CS44","v":0},{"$f":"K!S45","v":0},"",{"$f":"K!T45","v":0},"",{"$f":"K!U45","v":0},"",null,null,{"$f":"L!R45+DB44","v":0},{"$f":"L!S45","v":0},"",{"$f":"L!T45","v":0},"",{"$f":"L!U45","v":0},""]
[null,{"$f":"A!R46+G45","v":0},{"$f":"A!S46","v":0},"",{"$f":"A!T46","v":0},"",{"$f":"A!U46","v":0},"",null,null,{"$f":"B!R46+P45","v":0},{"$f":"B!S46","v":0},"",{"$f":"B!T46","v":0},"",{"$f":"B!U46","v":0},"",null,null,{"$f":"'C'!R46+Y45","v":0},{"$f":"'C'!S46","v":0},"",{"$f":"'C'!T46","v":0},"",{"$f":"'C'!U46","v":0},"",null,null,{"$f":"D!R46+AH45","v":0},{"$f":"D!S46","v":0},"",{"$f":"D!T46","v":0},"",{"$f":"D!U46","v":0},"",null,null,{"$f":"E!R46","v":0},{"$f":"E!S46","v":0},"",{"$f":"E!T46","v":0},"",{"$f":"E!U46","v":0},"",null,null,{"$f":"F!R46+AZ45","v":0},{"$f":"F!S46","v":0},"",{"$f":"F!T46","v":0},"",{"$f":"F!U46","v":0},"",null,null,{"$f":"G!R46+BI45","v":0},{"$f":"G!S46","v":0},"",{"$f":"G!T46","v":0},"",{"$f":"G!U46","v":0},"",null,null,{"$f":"H!R46+BR45","v":0},{"$f":"H!S46","v":0},"",{"$f":"H!T46","v":0},"",{"$f":"H!U46","v":0},"",null,null,{"$f":"I!R46+CA45","v":0},{"$f":"I!S46","v":0},"",{"$f":"I!T46","v":0},"",{"$f":"I!U46","v":0},"",null,null,{"$f":"J!R46+CJ45","v":0},{"$f":"J!S46","v":0},"",{"$f":"J!T46","v":0},"",{"$f":"J!U46","v":0},"",null,null,{"$f":"K!R46+CS45","v":0},{"$f":"K!S46","v":0},"",{"$f":"K!T46","v":0},"",{"$f":"K!U46","v":0},"",null,null,{"$f":"L!R46+DB45","v":0},{"$f":"L!S46","v":0},"",{"$f":"L!T46","v":0},"",{"$f":"L!U46","v":0},""]
[null,{"$f":"A!R47+G46","v":0},{"$f":"A!S47","v":0},"",{"$f":"A!T47","v":0},"",{"$f":"A!U47","v":0},"",null,null,{"$f":"B!R47+P46","v":0},{"$f":"B!S47","v":0},"",{"$f":"B!T47","v":0},"",{"$f":"B!U47","v":0},"",null,null,{"$f":"'C'!R47+Y46","v":0},{"$f":"'C'!S47","v":0},"",{"$f":"'C'!T47","v":0},"",{"$f":"'C'!U47","v":0},"",null,null,{"$f":"D!R47+AH46","v":0},{"$f":"D!S47","v":0},"",{"$f":"D!T47","v":0},"",{"$f":"D!U47","v":0},"",null,null,{"$f":"E!R47","v":0},{"$f":"E!S47","v":0},"",{"$f":"E!T47","v":0},"",{"$f":"E!U47","v":0},"",null,null,{"$f":"F!R47+AZ46","v":0},{"$f":"F!S47","v":0},"",{"$f":"F!T47","v":0},"",{"$f":"F!U47","v":0},"",null,null,{"$f":"G!R47+BI46","v":0},{"$f":"G!S47","v":0},"",{"$f":"G!T47","v":0},"",{"$f":"G!U47","v":0},"",null,null,{"$f":"H!R47+BR46","v":0},{"$f":"H!S47","v":0},"",{"$f":"H!T47","v":0},"",{"$f":"H!U47","v":0},"",null,null,{"$f":"I!R47+CA46","v":0},{"$f":"I!S47","v":0},"",{"$f":"I!T47","v":0},"",{"$f":"I!U47","v":0},"",null,null,{"$f":"J!R47+CJ46","v":0},{"$f":"J!S47","v":0},"",{"$f":"J!T47","v":0},"",{"$f":"J!U47","v":0},"",null,null,{"$f":"K!R47+CS46","v":0},{"$f":"K!S47","v":0},"",{"$f":"K!T47","v":0},"",{"$f":"K!U47","v":0},"",null,null,{"$f":"L!R47+DB46","v":0},{"$f":"L!S47","v":0},"",{"$f":"L!T47","v":0},"",{"$f":"L!U47","v":0},""]
[null,{"$f":"A!R48+G47","v":0},{"$f":"A!S48","v":0},"",{"$f":"A!T48","v":0},"",{"$f":"A!U48","v":0},"",null,null,{"$f":"B!R48+P47","v":0},{"$f":"B!S48","v":0},"",{"$f":"B!T48","v":0},"",{"$f":"B!U48","v":0},"",null,null,{"$f":"'C'!R48+Y47","v":0},{"$f":"'C'!S48","v":0},"",{"$f":"'C'!T48","v":0},"",{"$f":"'C'!U48","v":0},"",null,null,{"$f":"D!R48+AH47","v":0},{"$f":"D!S48","v":0},"",{"$f":"D!T48","v":0},"",{"$f":"D!U48","v":0},"",null,null,{"$f":"E!R48","v":0},{"$f":"E!S48","v":0},"",{"$f":"E!T48","v":0},"",{"$f":"E!U48","v":0},"",null,null,{"$f":"F!R48+AZ47","v":0},{"$f":"F!S48","v":0},"",{"$f":"F!T48","v":0},"",{"$f":"F!U48","v":0},"",null,null,{"$f":"G!R48+BI47","v":0},{"$f":"G!S48","v":0},"",{"$f":"G!T48","v":0},"",{"$f":"G!U48","v":0},"",null,null,{"$f":"H!R48+BR47","v":0},{"$f":"H!S48","v":0},"",{"$f":"H!T48","v":0},"",{"$f":"H!U48","v":0},"",null,null,{"$f":"I!R48+CA47","v":0},{"$f":"I!S48","v":0},"",{"$f":"I!T48","v":0},"",{"$f":"I!U48","v":0},"",null,null,{"$f":"J!R48+CJ47","v":0},{"$f":"J!S48","v":0},"",{"$f":"J!T48","v":0},"",{"$f":"J!U48","v":0},"",null,null,{"$f":"K!R48+CS47","v":0},{"$f":"K!S48","v":0},"",{"$f":"K!T48","v":0},"",{"$f":"K!U48","v":0},"",null,null,{"$f":"L!R48+DB47","v":0},{"$f":"L!S48","v":0},"",{"$f":"L!T48","v":0},"",{"$f":"L!U48","v":0},""]
[null,{"$f":"A!R49+G48","v":0},{"$f":"A!S49","v":0},"",{"$f":"A!T49","v":0},"",{"$f":"A!U49","v":0},"",null,null,{"$f":"B!R49+P48","v":0},{"$f":"B!S49","v":0},"",{"$f":"B!T49","v":0},"",{"$f":"B!U49","v":0},"",null,null,{"$f":"'C'!R49+Y48","v":0},{"$f":"'C'!S49","v":0},"",{"$f":"'C'!T49","v":0},"",{"$f":"'C'!U49","v":0},"",null,null,{"$f":"D!R49+AH48","v":0},{"$f":"D!S49","v":0},"",{"$f":"D!T49","v":0},"",{"$f":"D!U49","v":0},"",null,null,{"$f":"E!R49","v":0},{"$f":"E!S49","v":0},"",{"$f":"E!T49","v":0},"",{"$f":"E!U49","v":0},"",null,null,{"$f":"F!R49+AZ48","v":0},{"$f":"F!S49","v":0},"",{"$f":"F!T49","v":0},"",{"$f":"F!U49","v":0},"",null,null,{"$f":"G!R49+BI48","v":0},{"$f":"G!S49","v":0},"",{"$f":"G!T49","v":0},"",{"$f":"G!U49","v":0},"",null,null,{"$f":"H!R49+BR48","v":0},{"$f":"H!S49","v":0},"",{"$f":"H!T49","v":0},"",{"$f":"H!U49","v":0},"",null,null,{"$f":"I!R49+CA48","v":0},{"$f":"I!S49","v":0},"",{"$f":"I!T49","v":0},"",{"$f":"I!U49","v":0},"",null,null,{"$f":"J!R49+CJ48","v":0},{"$f":"J!S49","v":0},"",{"$f":"J!T49","v":0},"",{"$f":"J!U49","v":0},"",null,null,{"$f":"K!R49+CS48","v":0},{"$f":"K!S49","v":0},"",{"$f":"K!T49","v":0},"",{"$f":"K!U49","v":0},"",null,null,{"$f":"L!R49+DB48","v":0},{"$f":"L!S49","v":0},"",{"$f":"L!T49","v":0},"",{"$f":"L!U49","v":0},""]
[null,{"$f":"A!R50+G49","v":0},{"$f":"A!S50","v":0},"",{"$f":"A!T50","v":0},"",{"$f":"A!U50","v":0},"",null,null,{"$f":"B!R50+P49","v":0},{"$f":"B!S50","v":0},"",{"$f":"B!T50","v":0},"",{"$f":"B!U50","v":0},"",null,null,{"$f":"'C'!R50+Y49","v":0},{"$f":"'C'!S50","v":0},"",{"$f":"'C'!T50","v":0},"",{"$f":"'C'!U50","v":0},"",null,null,{"$f":"D!R50+AH49","v":0},{"$f":"D!S50","v":0},"",{"$f":"D!T50","v":0},"",{"$f":"D!U50","v":0},"",null,null,{"$f":"E!R50","v":0},{"$f":"E!S50","v":0},"",{"$f":"E!T50","v":0},"",{"$f":"E!U50","v":0},"",null,null,{"$f":"F!R50+AZ49","v":0},{"$f":"F!S50","v":0},"",{"$f":"F!T50","v":0},"",{"$f":"F!U50","v":0},"",null,null,{"$f":"G!R50+BI49","v":0},{"$f":"G!S50","v":0},"",{"$f":"G!T50","v":0},"",{"$f":"G!U50","v":0},"",null,null,{"$f":"H!R50+BR49","v":0},{"$f":"H!S50","v":0},"",{"$f":"H!T50","v":0},"",{"$f":"H!U50","v":0},"",null,null,{"$f":"I!R50+CA49","v":0},{"$f":"I!S50","v":0},"",{"$f":"I!T50","v":0},"",{"$f":"I!U50","v":0},"",null,null,{"$f":"J!R50+CJ49","v":0},{"$f":"J!S50","v":0},"",{"$f":"J!T50","v":0},"",{"$f":"J!U50","v":0},"",null,null,{"$f":"K!R50+CS49","v":0},{"$f":"K!S50","v":0},"",{"$f":"K!T50","v":0},"",{"$f":"K!U50","v":0},"",null,null,{"$f":"L!R50+DB49","v":0},{"$f":"L!S50","v":0},"",{"$f":"L!T50","v":0},"",{"$f":"L!U50","v":0},""]
[null,{"$f":"A!R51+G50","v":0},{"$f":"A!S51","v":0},"",{"$f":"A!T51","v":0},"",{"$f":"A!U51","v":0},"",null,null,{"$f":"B!R51+P50","v":0},{"$f":"B!S51","v":0},"",{"$f":"B!T51","v":0},"",{"$f":"B!U51","v":0},"",null,null,{"$f":"'C'!R51+Y50","v":0},{"$f":"'C'!S51","v":0},"",{"$f":"'C'!T51","v":0},"",{"$f":"'C'!U51","v":0},"",null,null,{"$f":"D!R51+AH50","v":0},{"$f":"D!S51","v":0},"",{"$f":"D!T51","v":0},"",{"$f":"D!U51","v":0},"",null,null,{"$f":"E!R51","v":0},{"$f":"E!S51","v":0},"",{"$f":"E!T51","v":0},"",{"$f":"E!U51","v":0},"",null,null,{"$f":"F!R51+AZ50","v":0},{"$f":"F!S51","v":0},"",{"$f":"F!T51","v":0},"",{"$f":"F!U51","v":0},"",null,null,{"$f":"G!R51+BI50","v":0},{"$f":"G!S51","v":0},"",{"$f":"G!T51","v":0},"",{"$f":"G!U51","v":0},"",null,null,{"$f":"H!R51+BR50","v":0},{"$f":"H!S51","v":0},"",{"$f":"H!T51","v":0},"",{"$f":"H!U51","v":0},"",null,null,{"$f":"I!R51+CA50","v":0},{"$f":"I!S51","v":0},"",{"$f":"I!T51","v":0},"",{"$f":"I!U51","v":0},"",null,null,{"$f":"J!R51+CJ50","v":0},{"$f":"J!S51","v":0},"",{"$f":"J!T51","v":0},"",{"$f":"J!U51","v":0},"",null,null,{"$f":"K!R51+CS50","v":0},{"$f":"K!S51","v":0},"",{"$f":"K!T51","v":0},"",{"$f":"K!U51","v":0},"",null,null,{"$f":"L!R51+DB50","v":0},{"$f":"L!S51","v":0},"",{"$f":"L!T51","v":0},"",{"$f":"L!U51","v":0},""]
[null,{"$f":"A!R52+G51","v":0},{"$f":"A!S52","v":0},"",{"$f":"A!T52","v":0},"",{"$f":"A!U52","v":0},"",null,null,{"$f":"B!R52+P51","v":0},{"$f":"B!S52","v":0},"",{"$f":"B!T52","v":0},"",{"$f":"B!U52","v":0},"",null,null,{"$f":"'C'!R52+Y51","v":0},{"$f":"'C'!S52","v":0},"",{"$f":"'C'!T52","v":0},"",{"$f":"'C'!U52","v":0},"",null,null,{"$f":"D!R52+AH51","v":0},{"$f":"D!S52","v":0},"",{"$f":"D!T52","v":0},"",{"$f":"D!U52","v":0},"",null,null,{"$f":"E!R52","v":0},{"$f":"E!S52","v":0},"",{"$f":"E!T52","v":0},"",{"$f":"E!U52","v":0},"",null,null,{"$f":"F!R52+AZ51","v":0},{"$f":"F!S52","v":0},"",{"$f":"F!T52","v":0},"",{"$f":"F!U52","v":0},"",null,null,{"$f":"G!R52+BI51","v":0},{"$f":"G!S52","v":0},"",{"$f":"G!T52","v":0},"",{"$f":"G!U52","v":0},"",null,null,{"$f":"H!R52+BR51","v":0},{"$f":"H!S52","v":0},"",{"$f":"H!T52","v":0},"",{"$f":"H!U52","v":0},"",null,null,{"$f":"I!R52+CA51","v":0},{"$f":"I!S52","v":0},"",{"$f":"I!T52","v":0},"",{"$f":"I!U52","v":0},"",null,null,{"$f":"J!R52+CJ51","v":0},{"$f":"J!S52","v":0},"",{"$f":"J!T52","v":0},"",{"$f":"J!U52","v":0},"",null,null,{"$f":"K!R52+CS51","v":0},{"$f":"K!S52","v":0},"",{"$f":"K!T52","v":0},"",{"$f":"K!U52","v":0},"",null,null,{"$f":"L!R52+DB51","v":0},{"$f":"L!S52","v":0},"",{"$f":"L!T52","v":0},"",{"$f":"L!U52","v":0},""]
[null,{"$f":"A!R53+G52","v":0},{"$f":"A!S53","v":0},"",{"$f":"A!T53","v":0},"",{"$f":"A!U53","v":0},"",null,null,{"$f":"B!R53+P52","v":0},{"$f":"B!S53","v":0},"",{"$f":"B!T53","v":0},"",{"$f":"B!U53","v":0},"",null,null,{"$f":"'C'!R53+Y52","v":0},{"$f":"'C'!S53","v":0},"",{"$f":"'C'!T53","v":0},"",{"$f":"'C'!U53","v":0},"",null,null,{"$f":"D!R53+AH52","v":0},{"$f":"D!S53","v":0},"",{"$f":"D!T53","v":0},"",{"$f":"D!U53","v":0},"",null,null,{"$f":"E!R53","v":0},{"$f":"E!S53","v":0},"",{"$f":"E!T53","v":0},"",{"$f":"E!U53","v":0},"",null,null,{"$f":"F!R53+AZ52","v":0},{"$f":"F!S53","v":0},"",{"$f":"F!T53","v":0},"",{"$f":"F!U53","v":0},"",null,null,{"$f":"G!R53+BI52","v":0},{"$f":"G!S53","v":0},"",{"$f":"G!T53","v":0},"",{"$f":"G!U53","v":0},"",null,null,{"$f":"H!R53+BR52","v":0},{"$f":"H!S53","v":0},"",{"$f":"H!T53","v":0},"",{"$f":"H!U53","v":0},"",null,null,{"$f":"I!R53+CA52","v":0},{"$f":"I!S53","v":0},"",{"$f":"I!T53","v":0},"",{"$f":"I!U53","v":0},"",null,null,{"$f":"J!R53+CJ52","v":0},{"$f":"J!S53","v":0},"",{"$f":"J!T53","v":0},"",{"$f":"J!U53","v":0},"",null,null,{"$f":"K!R53+CS52","v":0},{"$f":"K!S53","v":0},"",{"$f":"K!T53","v":0},"",{"$f":"K!U53","v":0},"",null,null,{"$f":"L!R53+DB52","v":0},{"$f":"L!S53","v":0},"",{"$f":"L!T53","v":0},"",{"$f":"L!U53","v":0},""]
[null,{"$f":"A!R54+G53","v":0},{"$f":"A!S54","v":0},"",{"$f":"A!T54","v":0},"",{"$f":"A!U54","v":0},"",null,null,{"$f":"B!R54+P53","v":0},{"$f":"B!S54","v":0},"",{"$f":"B!T54","v":0},"",{"$f":"B!U54","v":0},"",null,null,{"$f":"'C'!R54+Y53","v":0},{"$f":"'C'!S54","v":0},"",{"$f":"'C'!T54","v":0},"",{"$f":"'C'!U54","v":0},"",null,null,{"$f":"D!R54+AH53","v":0},{"$f":"D!S54","v":0},"",{"$f":"D!T54","v":0},"",{"$f":"D!U54","v":0},"",null,null,{"$f":"E!R54","v":0},{"$f":"E!S54","v":0},"",{"$f":"E!T54","v":0},"",{"$f":"E!U54","v":0},"",null,null,{"$f":"F!R54+AZ53","v":0},{"$f":"F!S54","v":0},"",{"$f":"F!T54","v":0},"",{"$f":"F!U54","v":0},"",null,null,{"$f":"G!R54+BI53","v":0},{"$f":"G!S54","v":0},"",{"$f":"G!T54","v":0},"",{"$f":"G!U54","v":0},"",null,null,{"$f":"H!R54+BR53","v":0},{"$f":"H!S54","v":0},"",{"$f":"H!T54","v":0},"",{"$f":"H!U54","v":0},"",null,null,{"$f":"I!R54+CA53","v":0},{"$f":"I!S54","v":0},"",{"$f":"I!T54","v":0},"",{"$f":"I!U54","v":0},"",null,null,{"$f":"J!R54+CJ53","v":0},{"$f":"J!S54","v":0},"",{"$f":"J!T54","v":0},"",{"$f":"J!U54","v":0},"",null,null,{"$f":"K!R54+CS53","v":0},{"$f":"K!S54","v":0},"",{"$f":"K!T54","v":0},"",{"$f":"K!U54","v":0},"",null,null,{"$f":"L!R54+DB53","v":0},{"$f":"L!S54","v":0},"",{"$f":"L!T54","v":0},"",{"$f":"L!U54","v":0},""]
[null,{"$f":"A!R55+G54","v":0},{"$f":"A!S55","v":0},"",{"$f":"A!T55","v":0},"",{"$f":"A!U55","v":0},"",null,null,{"$f":"B!R55+P54","v":0},{"$f":"B!S55","v":0},"",{"$f":"B!T55","v":0},"",{"$f":"B!U55","v":0},"",null,null,{"$f":"'C'!R55+Y54","v":0},{"$f":"'C'!S55","v":0},"",{"$f":"'C'!T55","v":0},"",{"$f":"'C'!U55","v":0},"",null,null,{"$f":"D!R55+AH54","v":0},{"$f":"D!S55","v":0},"",{"$f":"D!T55","v":0},"",{"$f":"D!U55","v":0},"",null,null,{"$f":"E!R55","v":0},{"$f":"E!S55","v":0},"",{"$f":"E!T55","v":0},"",{"$f":"E!U55","v":0},"",null,null,{"$f":"F!R55+AZ54","v":0},{"$f":"F!S55","v":0},"",{"$f":"F!T55","v":0},"",{"$f":"F!U55","v":0},"",null,null,{"$f":"G!R55+BI54","v":0},{"$f":"G!S55","v":0},"",{"$f":"G!T55","v":0},"",{"$f":"G!U55","v":0},"",null,null,{"$f":"H!R55+BR54","v":0},{"$f":"H!S55","v":0},"",{"$f":"H!T55","v":0},"",{"$f":"H!U55","v":0},"",null,null,{"$f":"I!R55+CA54","v":0},{"$f":"I!S55","v":0},"",{"$f":"I!T55","v":0},"",{"$f":"I!U55","v":0},"",null,null,{"$f":"J!R55+CJ54","v":0},{"$f":"J!S55","v":0},"",{"$f":"J!T55","v":0},"",{"$f":"J!U55","v":0},"",null,null,{"$f":"K!R55+CS54","v":0},{"$f":"K!S55","v":0},"",{"$f":"K!T55","v":0},"",{"$f":"K!U55","v":0},"",null,null,{"$f":"L!R55+DB54","v":0},{"$f":"L!S55","v":0},"",{"$f":"L!T55","v":0},"",{"$f":"L!U55","v":0},""]
[null,{"$f":"A!R56+G55","v":0},{"$f":"A!S56","v":0},"",{"$f":"A!T56","v":0},"",{"$f":"A!U56","v":0},"",null,null,{"$f":"B!R56+P55","v":0},{"$f":"B!S56","v":0},"",{"$f":"B!T56","v":0},"",{"$f":"B!U56","v":0},"",null,null,{"$f":"'C'!R56+Y55","v":0},{"$f":"'C'!S56","v":0},"",{"$f":"'C'!T56","v":0},"",{"$f":"'C'!U56","v":0},"",null,null,{"$f":"D!R56+AH55","v":0},{"$f":"D!S56","v":0},"",{"$f":"D!T56","v":0},"",{"$f":"D!U56","v":0},"",null,null,{"$f":"E!R56","v":0},{"$f":"E!S56","v":0},"",{"$f":"E!T56","v":0},"",{"$f":"E!U56","v":0},"",null,null,{"$f":"F!R56+AZ55","v":0},{"$f":"F!S56","v":0},"",{"$f":"F!T56","v":0},"",{"$f":"F!U56","v":0},"",null,null,{"$f":"G!R56+BI55","v":0},{"$f":"G!S56","v":0},"",{"$f":"G!T56","v":0},"",{"$f":"G!U56","v":0},"",null,null,{"$f":"H!R56+BR55","v":0},{"$f":"H!S56","v":0},"",{"$f":"H!T56","v":0},"",{"$f":"H!U56","v":0},"",null,null,{"$f":"I!R56+CA55","v":0},{"$f":"I!S56","v":0},"",{"$f":"I!T56","v":0},"",{"$f":"I!U56","v":0},"",null,null,{"$f":"J!R56+CJ55","v":0},{"$f":"J!S56","v":0},"",{"$f":"J!T56","v":0},"",{"$f":"J!U56","v":0},"",null,null,{"$f":"K!R56+CS55","v":0},{"$f":"K!S56","v":0},"",{"$f":"K!T56","v":0},"",{"$f":"K!U56","v":0},"",null,null,{"$f":"L!R56+DB55","v":0},{"$f":"L!S56","v":0},"",{"$f":"L!T56","v":0},"",{"$f":"L!U56","v":0},""]
[null,{"$f":"A!R57+G56","v":0},{"$f":"A!S57","v":0},"",{"$f":"A!T57","v":0},"",{"$f":"A!U57","v":0},"",null,null,{"$f":"B!R57+P56","v":0},{"$f":"B!S57","v":0},"",{"$f":"B!T57","v":0},"",{"$f":"B!U57","v":0},"",null,null,{"$f":"'C'!R57+Y56","v":0},{"$f":"'C'!S57","v":0},"",{"$f":"'C'!T57","v":0},"",{"$f":"'C'!U57","v":0},"",null,null,{"$f":"D!R57+AH56","v":0},{"$f":"D!S57","v":0},"",{"$f":"D!T57","v":0},"",{"$f":"D!U57","v":0},"",null,null,{"$f":"E!R57","v":0},{"$f":"E!S57","v":0},"",{"$f":"E!T57","v":0},"",{"$f":"E!U57","v":0},"",null,null,{"$f":"F!R57+AZ56","v":0},{"$f":"F!S57","v":0},"",{"$f":"F!T57","v":0},"",{"$f":"F!U57","v":0},"",null,null,{"$f":"G!R57+BI56","v":0},{"$f":"G!S57","v":0},"",{"$f":"G!T57","v":0},"",{"$f":"G!U57","v":0},"",null,null,{"$f":"H!R57+BR56","v":0},{"$f":"H!S57","v":0},"",{"$f":"H!T57","v":0},"",{"$f":"H!U57","v":0},"",null,null,{"$f":"I!R57+CA56","v":0},{"$f":"I!S57","v":0},"",{"$f":"I!T57","v":0},"",{"$f":"I!U57","v":0},"",null,null,{"$f":"J!R57+CJ56","v":0},{"$f":"J!S57","v":0},"",{"$f":"J!T57","v":0},"",{"$f":"J!U57","v":0},"",null,null,{"$f":"K!R57+CS56","v":0},{"$f":"K!S57","v":0},"",{"$f":"K!T57","v":0},"",{"$f":"K!U57","v":0},"",null,null,{"$f":"L!R57+DB56","v":0},{"$f":"L!S57","v":0},"",{"$f":"L!T57","v":0},"",{"$f":"L!U57","v":0},""]
[null,{"$f":"A!R58+G57","v":0},{"$f":"A!S58","v":0},"",{"$f":"A!T58","v":0},"",{"$f":"A!U58","v":0},"",null,null,{"$f":"B!R58+P57","v":0},{"$f":"B!S58","v":0},"",{"$f":"B!T58","v":0},"",{"$f":"B!U58","v":0},"",null,null,{"$f":"'C'!R58+Y57","v":0},{"$f":"'C'!S58","v":0},"",{"$f":"'C'!T58","v":0},"",{"$f":"'C'!U58","v":0},"",null,null,{"$f":"D!R58+AH57","v":0},{"$f":"D!S58","v":0},"",{"$f":"D!T58","v":0},"",{"$f":"D!U58","v":0},"",null,null,{"$f":"E!R58","v":0},{"$f":"E!S58","v":0},"",{"$f":"E!T58","v":0},"",{"$f":"E!U58","v":0},"",null,null,{"$f":"F!R58+AZ57","v":0},{"$f":"F!S58","v":0},"",{"$f":"F!T58","v":0},"",{"$f":"F!U58","v":0},"",null,null,{"$f":"G!R58+BI57","v":0},{"$f":"G!S58","v":0},"",{"$f":"G!T58","v":0},"",{"$f":"G!U58","v":0},"",null,null,{"$f":"H!R58+BR57","v":0},{"$f":"H!S58","v":0},"",{"$f":"H!T58","v":0},"",{"$f":"H!U58","v":0},"",null,null,{"$f":"I!R58+CA57","v":0},{"$f":"I!S58","v":0},"",{"$f":"I!T58","v":0},"",{"$f":"I!U58","v":0},"",null,null,{"$f":"J!R58+CJ57","v":0},{"$f":"J!S58","v":0},"",{"$f":"J!T58","v":0},"",{"$f":"J!U58","v":0},"",null,null,{"$f":"K!R58+CS57","v":0},{"$f":"K!S58","v":0},"",{"$f":"K!T58","v":0},"",{"$f":"K!U58","v":0},"",null,null,{"$f":"L!R58+DB57","v":0},{"$f":"L!S58","v":0},"",{"$f":"L!T58","v":0},"",{"$f":"L!U58","v":0},""]
[null,{"$f":"A!R59+G58","v":0},{"$f":"A!S59","v":0},"",{"$f":"A!T59","v":0},"",{"$f":"A!U59","v":0},"",null,null,{"$f":"B!R59+P58","v":0},{"$f":"B!S59","v":0},"",{"$f":"B!T59","v":0},"",{"$f":"B!U59","v":0},"",null,null,{"$f":"'C'!R59+Y58","v":0},{"$f":"'C'!S59","v":0},"",{"$f":"'C'!T59","v":0},"",{"$f":"'C'!U59","v":0},"",null,null,{"$f":"D!R59+AH58","v":0},{"$f":"D!S59","v":0},"",{"$f":"D!T59","v":0},"",{"$f":"D!U59","v":0},"",null,null,{"$f":"E!R59","v":0},{"$f":"E!S59","v":0},"",{"$f":"E!T59","v":0},"",{"$f":"E!U59","v":0},"",null,null,{"$f":"F!R59+AZ58","v":0},{"$f":"F!S59","v":0},"",{"$f":"F!T59","v":0},"",{"$f":"F!U59","v":0},"",null,null,{"$f":"G!R59+BI58","v":0},{"$f":"G!S59","v":0},"",{"$f":"G!T59","v":0},"",{"$f":"G!U59","v":0},"",null,null,{"$f":"H!R59+BR58","v":0},{"$f":"H!S59","v":0},"",{"$f":"H!T59","v":0},"",{"$f":"H!U59","v":0},"",null,null,{"$f":"I!R59+CA58","v":0},{"$f":"I!S59","v":0},"",{"$f":"I!T59","v":0},"",{"$f":"I!U59","v":0},"",null,null,{"$f":"J!R59+CJ58","v":0},{"$f":"J!S59","v":0},"",{"$f":"J!T59","v":0},"",{"$f":"J!U59","v":0},"",null,null,{"$f":"K!R59+CS58","v":0},{"$f":"K!S59","v":0},"",{"$f":"K!T59","v":0},"",{"$f":"K!U59","v":0},"",null,null,{"$f":"L!R59+DB58","v":0},{"$f":"L!S59","v":0},"",{"$f":"L!T59","v":0},"",{"$f":"L!U59","v":0},""]
[null,{"$f":"A!R60+G59","v":0},{"$f":"A!S60","v":0},"",{"$f":"A!T60","v":0},"",{"$f":"A!U60","v":0},"",null,null,{"$f":"B!R60+P59","v":0},{"$f":"B!S60","v":0},"",{"$f":"B!T60","v":0},"",{"$f":"B!U60","v":0},"",null,null,{"$f":"'C'!R60+Y59","v":0},{"$f":"'C'!S60","v":0},"",{"$f":"'C'!T60","v":0},"",{"$f":"'C'!U60","v":0},"",null,null,{"$f":"D!R60+AH59","v":0},{"$f":"D!S60","v":0},"",{"$f":"D!T60","v":0},"",{"$f":"D!U60","v":0},"",null,null,{"$f":"E!R60","v":0},{"$f":"E!S60","v":0},"",{"$f":"E!T60","v":0},"",{"$f":"E!U60","v":0},"",null,null,{"$f":"F!R60+AZ59","v":0},{"$f":"F!S60","v":0},"",{"$f":"F!T60","v":0},"",{"$f":"F!U60","v":0},"",null,null,{"$f":"G!R60+BI59","v":0},{"$f":"G!S60","v":0},"",{"$f":"G!T60","v":0},"",{"$f":"G!U60","v":0},"",null,null,{"$f":"H!R60+BR59","v":0},{"$f":"H!S60","v":0},"",{"$f":"H!T60","v":0},"",{"$f":"H!U60","v":0},"",null,null,{"$f":"I!R60+CA59","v":0},{"$f":"I!S60","v":0},"",{"$f":"I!T60","v":0},"",{"$f":"I!U60","v":0},"",null,null,{"$f":"J!R60+CJ59","v":0},{"$f":"J!S60","v":0},"",{"$f":"J!T60","v":0},"",{"$f":"J!U60","v":0},"",null,null,{"$f":"K!R60+CS59","v":0},{"$f":"K!S60","v":0},"",{"$f":"K!T60","v":0},"",{"$f":"K!U60","v":0},"",null,null,{"$f":"L!R60+DB59","v":0},{"$f":"L!S60","v":0},"",{"$f":"L!T60","v":0},"",{"$f":"L!U60","v":0},""]
[null,{"$f":"A!R61+G60","v":0},{"$f":"A!S61","v":0},"",{"$f":"A!T61","v":0},"",{"$f":"A!U61","v":0},"",null,null,{"$f":"B!R61+P60","v":0},{"$f":"B!S61","v":0},"",{"$f":"B!T61","v":0},"",{"$f":"B!U61","v":0},"",null,null,{"$f":"'C'!R61+Y60","v":0},{"$f":"'C'!S61","v":0},"",{"$f":"'C'!T61","v":0},"",{"$f":"'C'!U61","v":0},"",null,null,{"$f":"D!R61+AH60","v":0},{"$f":"D!S61","v":0},"",{"$f":"D!T61","v":0},"",{"$f":"D!U61","v":0},"",null,null,{"$f":"E!R61","v":0},{"$f":"E!S61","v":0},"",{"$f":"E!T61","v":0},"",{"$f":"E!U61","v":0},"",null,null,{"$f":"F!R61+AZ60","v":0},{"$f":"F!S61","v":0},"",{"$f":"F!T61","v":0},"",{"$f":"F!U61","v":0},"",null,null,{"$f":"G!R61+BI60","v":0},{"$f":"G!S61","v":0},"",{"$f":"G!T61","v":0},"",{"$f":"G!U61","v":0},"",null,null,{"$f":"H!R61+BR60","v":0},{"$f":"H!S61","v":0},"",{"$f":"H!T61","v":0},"",{"$f":"H!U61","v":0},"",null,null,{"$f":"I!R61+CA60","v":0},{"$f":"I!S61","v":0},"",{"$f":"I!T61","v":0},"",{"$f":"I!U61","v":0},"",null,null,{"$f":"J!R61+CJ60","v":0},{"$f":"J!S61","v":0},"",{"$f":"J!T61","v":0},"",{"$f":"J!U61","v":0},"",null,null,{"$f":"K!R61+CS60","v":0},{"$f":"K!S61","v":0},"",{"$f":"K!T61","v":0},"",{"$f":"K!U61","v":0},"",null,null,{"$f":"L!R61+DB60","v":0},{"$f":"L!S61","v":0},"",{"$f":"L!T61","v":0},"",{"$f":"L!U61","v":0},""]
[null,{"$f":"A!R62+G61","v":0},{"$f":"A!S62","v":0},"",{"$f":"A!T62","v":0},"",{"$f":"A!U62","v":0},"",null,null,{"$f":"B!R62+P61","v":0},{"$f":"B!S62","v":0},"",{"$f":"B!T62","v":0},"",{"$f":"B!U62","v":0},"",null,null,{"$f":"'C'!R62+Y61","v":0},{"$f":"'C'!S62","v":0},"",{"$f":"'C'!T62","v":0},"",{"$f":"'C'!U62","v":0},"",null,null,{"$f":"D!R62+AH61","v":0},{"$f":"D!S62","v":0},"",{"$f":"D!T62","v":0},"",{"$f":"D!U62","v":0},"",null,null,{"$f":"E!R62","v":0},{"$f":"E!S62","v":0},"",{"$f":"E!T62","v":0},"",{"$f":"E!U62","v":0},"",null,null,{"$f":"F!R62+AZ61","v":0},{"$f":"F!S62","v":0},"",{"$f":"F!T62","v":0},"",{"$f":"F!U62","v":0},"",null,null,{"$f":"G!R62+BI61","v":0},{"$f":"G!S62","v":0},"",{"$f":"G!T62","v":0},"",{"$f":"G!U62","v":0},"",null,null,{"$f":"H!R62+BR61","v":0},{"$f":"H!S62","v":0},"",{"$f":"H!T62","v":0},"",{"$f":"H!U62","v":0},"",null,null,{"$f":"I!R62+CA61","v":0},{"$f":"I!S62","v":0},"",{"$f":"I!T62","v":0},"",{"$f":"I!U62","v":0},"",null,null,{"$f":"J!R62+CJ61","v":0},{"$f":"J!S62","v":0},"",{"$f":"J!T62","v":0},"",{"$f":"J!U62","v":0},"",null,null,{"$f":"K!R62+CS61","v":0},{"$f":"K!S62","v":0},"",{"$f":"K!T62","v":0},"",{"$f":"K!U62","v":0},"",null,null,{"$f":"L!R62+DB61","v":0},{"$f":"L!S62","v":0},"",{"$f":"L!T62","v":0},"",{"$f":"L!U62","v":0},""]
[null,{"$f":"A!R63+G62","v":0},{"$f":"A!S63","v":0},"",{"$f":"A!T63","v":0},"",{"$f":"A!U63","v":0},"",null,null,{"$f":"B!R63+P62","v":0},{"$f":"B!S63","v":0},"",{"$f":"B!T63","v":0},"",{"$f":"B!U63","v":0},"",null,null,{"$f":"'C'!R63+Y62","v":0},{"$f":"'C'!S63","v":0},"",{"$f":"'C'!T63","v":0},"",{"$f":"'C'!U63","v":0},"",null,null,{"$f":"D!R63+AH62","v":0},{"$f":"D!S63","v":0},"",{"$f":"D!T63","v":0},"",{"$f":"D!U63","v":0},"",null,null,{"$f":"E!R63","v":0},{"$f":"E!S63","v":0},"",{"$f":"E!T63","v":0},"",{"$f":"E!U63","v":0},"",null,null,{"$f":"F!R63+AZ62","v":0},{"$f":"F!S63","v":0},"",{"$f":"F!T63","v":0},"",{"$f":"F!U63","v":0},"",null,null,{"$f":"G!R63+BI62","v":0},{"$f":"G!S63","v":0},"",{"$f":"G!T63","v":0},"",{"$f":"G!U63","v":0},"",null,null,{"$f":"H!R63+BR62","v":0},{"$f":"H!S63","v":0},"",{"$f":"H!T63","v":0},"",{"$f":"H!U63","v":0},"",null,null,{"$f":"I!R63+CA62","v":0},{"$f":"I!S63","v":0},"",{"$f":"I!T63","v":0},"",{"$f":"I!U63","v":0},"",null,null,{"$f":"J!R63+CJ62","v":0},{"$f":"J!S63","v":0},"",{"$f":"J!T63","v":0},"",{"$f":"J!U63","v":0},"",null,null,{"$f":"K!R63+CS62","v":0},{"$f":"K!S63","v":0},"",{"$f":"K!T63","v":0},"",{"$f":"K!U63","v":0},"",null,null,{"$f":"L!R63+DB62","v":0},{"$f":"L!S63","v":0},"",{"$f":"L!T63","v":0},"",{"$f":"L!U63","v":0},""]
[null,{"$f":"A!R64+G63","v":0},{"$f":"A!S64","v":0},"",{"$f":"A!T64","v":0},"",{"$f":"A!U64","v":0},"",null,null,{"$f":"B!R64+P63","v":0},{"$f":"B!S64","v":0},"",{"$f":"B!T64","v":0},"",{"$f":"B!U64","v":0},"",null,null,{"$f":"'C'!R64+Y63","v":0},{"$f":"'C'!S64","v":0},"",{"$f":"'C'!T64","v":0},"",{"$f":"'C'!U64","v":0},"",null,null,{"$f":"D!R64+AH63","v":0},{"$f":"D!S64","v":0},"",{"$f":"D!T64","v":0},"",{"$f":"D!U64","v":0},"",null,null,{"$f":"E!R64","v":0},{"$f":"E!S64","v":0},"",{"$f":"E!T64","v":0},"",{"$f":"E!U64","v":0},"",null,null,{"$f":"F!R64+AZ63","v":0},{"$f":"F!S64","v":0},"",{"$f":"F!T64","v":0},"",{"$f":"F!U64","v":0},"",null,null,{"$f":"G!R64+BI63","v":0},{"$f":"G!S64","v":0},"",{"$f":"G!T64","v":0},"",{"$f":"G!U64","v":0},"",null,null,{"$f":"H!R64+BR63","v":0},{"$f":"H!S64","v":0},"",{"$f":"H!T64","v":0},"",{"$f":"H!U64","v":0},"",null,null,{"$f":"I!R64+CA63","v":0},{"$f":"I!S64","v":0},"",{"$f":"I!T64","v":0},"",{"$f":"I!U64","v":0},"",null,null,{"$f":"J!R64+CJ63","v":0},{"$f":"J!S64","v":0},"",{"$f":"J!T64","v":0},"",{"$f":"J!U64","v":0},"",null,null,{"$f":"K!R64+CS63","v":0},{"$f":"K!S64","v":0},"",{"$f":"K!T64","v":0},"",{"$f":"K!U64","v":0},"",null,null,{"$f":"L!R64+DB63","v":0},{"$f":"L!S64","v":0},"",{"$f":"L!T64","v":0},"",{"$f":"L!U64","v":0},""]
[null,{"$f":"A!R65+G64","v":0},{"$f":"A!S65","v":0},"",{"$f":"A!T65","v":0},"",{"$f":"A!U65","v":0},"",null,null,{"$f":"B!R65+P64","v":0},{"$f":"B!S65","v":0},"",{"$f":"B!T65","v":0},"",{"$f":"B!U65","v":0},"",null,null,{"$f":"'C'!R65+Y64","v":0},{"$f":"'C'!S65","v":0},"",{"$f":"'C'!T65","v":0},"",{"$f":"'C'!U65","v":0},"",null,null,{"$f":"D!R65+AH64","v":0},{"$f":"D!S65","v":0},"",{"$f":"D!T65","v":0},"",{"$f":"D!U65","v":0},"",null,null,{"$f":"E!R65","v":0},{"$f":"E!S65","v":0},"",{"$f":"E!T65","v":0},"",{"$f":"E!U65","v":0},"",null,null,{"$f":"F!R65+AZ64","v":0},{"$f":"F!S65","v":0},"",{"$f":"F!T65","v":0},"",{"$f":"F!U65","v":0},"",null,null,{"$f":"G!R65+BI64","v":0},{"$f":"G!S65","v":0},"",{"$f":"G!T65","v":0},"",{"$f":"G!U65","v":0},"",null,null,{"$f":"H!R65+BR64","v":0},{"$f":"H!S65","v":0},"",{"$f":"H!T65","v":0},"",{"$f":"H!U65","v":0},"",null,null,{"$f":"I!R65+CA64","v":0},{"$f":"I!S65","v":0},"",{"$f":"I!T65","v":0},"",{"$f":"I!U65","v":0},"",null,null,{"$f":"J!R65+CJ64","v":0},{"$f":"J!S65","v":0},"",{"$f":"J!T65","v":0},"",{"$f":"J!U65","v":0},"",null,null,{"$f":"K!R65+CS64","v":0},{"$f":"K!S65","v":0},"",{"$f":"K!T65","v":0},"",{"$f":"K!U65","v":0},"",null,null,{"$f":"L!R65+DB64","v":0},{"$f":"L!S65","v":0},"",{"$f":"L!T65","v":0},"",{"$f":"L!U65","v":0},""]
[null,{"$f":"A!R66+G65","v":0},{"$f":"A!S66","v":0},"",{"$f":"A!T66","v":0},"",{"$f":"A!U66","v":0},"",null,null,{"$f":"B!R66+P65","v":0},{"$f":"B!S66","v":0},"",{"$f":"B!T66","v":0},"",{"$f":"B!U66","v":0},"",null,null,{"$f":"'C'!R66+Y65","v":0},{"$f":"'C'!S66","v":0},"",{"$f":"'C'!T66","v":0},"",{"$f":"'C'!U66","v":0},"",null,null,{"$f":"D!R66+AH65","v":0},{"$f":"D!S66","v":0},"",{"$f":"D!T66","v":0},"",{"$f":"D!U66","v":0},"",null,null,{"$f":"E!R66","v":0},{"$f":"E!S66","v":0},"",{"$f":"E!T66","v":0},"",{"$f":"E!U66","v":0},"",null,null,{"$f":"F!R66+AZ65","v":0},{"$f":"F!S66","v":0},"",{"$f":"F!T66","v":0},"",{"$f":"F!U66","v":0},"",null,null,{"$f":"G!R66+BI65","v":0},{"$f":"G!S66","v":0},"",{"$f":"G!T66","v":0},"",{"$f":"G!U66","v":0},"",null,null,{"$f":"H!R66+BR65","v":0},{"$f":"H!S66","v":0},"",{"$f":"H!T66","v":0},"",{"$f":"H!U66","v":0},"",null,null,{"$f":"I!R66+CA65","v":0},{"$f":"I!S66","v":0},"",{"$f":"I!T66","v":0},"",{"$f":"I!U66","v":0},"",null,null,{"$f":"J!R66+CJ65","v":0},{"$f":"J!S66","v":0},"",{"$f":"J!T66","v":0},"",{"$f":"J!U66","v":0},"",null,null,{"$f":"K!R66+CS65","v":0},{"$f":"K!S66","v":0},"",{"$f":"K!T66","v":0},"",{"$f":"K!U66","v":0},"",null,null,{"$f":"L!R66+DB65","v":0},{"$f":"L!S66","v":0},"",{"$f":"L!T66","v":0},"",{"$f":"L!U66","v":0},""]
[null,{"$f":"A!R67+G66","v":0},{"$f":"A!S67","v":0},"",{"$f":"A!T67","v":0},"",{"$f":"A!U67","v":0},"",null,null,{"$f":"B!R67+P66","v":0},{"$f":"B!S67","v":0},"",{"$f":"B!T67","v":0},"",{"$f":"B!U67","v":0},"",null,null,{"$f":"'C'!R67+Y66","v":0},{"$f":"'C'!S67","v":0},"",{"$f":"'C'!T67","v":0},"",{"$f":"'C'!U67","v":0},"",null,null,{"$f":"D!R67+AH66","v":0},{"$f":"D!S67","v":0},"",{"$f":"D!T67","v":0},"",{"$f":"D!U67","v":0},"",null,null,{"$f":"E!R67","v":0},{"$f":"E!S67","v":0},"",{"$f":"E!T67","v":0},"",{"$f":"E!U67","v":0},"",null,null,{"$f":"F!R67+AZ66","v":0},{"$f":"F!S67","v":0},"",{"$f":"F!T67","v":0},"",{"$f":"F!U67","v":0},"",null,null,{"$f":"G!R67+BI66","v":0},{"$f":"G!S67","v":0},"",{"$f":"G!T67","v":0},"",{"$f":"G!U67","v":0},"",null,null,{"$f":"H!R67+BR66","v":0},{"$f":"H!S67","v":0},"",{"$f":"H!T67","v":0},"",{"$f":"H!U67","v":0},"",null,null,{"$f":"I!R67+CA66","v":0},{"$f":"I!S67","v":0},"",{"$f":"I!T67","v":0},"",{"$f":"I!U67","v":0},"",null,null,{"$f":"J!R67+CJ66","v":0},{"$f":"J!S67","v":0},"",{"$f":"J!T67","v":0},"",{"$f":"J!U67","v":0},"",null,null,{"$f":"K!R67+CS66","v":0},{"$f":"K!S67","v":0},"",{"$f":"K!T67","v":0},"",{"$f":"K!U67","v":0},"",null,null,{"$f":"L!R67+DB66","v":0},{"$f":"L!S67","v":0},"",{"$f":"L!T67","v":0},"",{"$f":"L!U67","v":0},""]
[null,{"$f":"A!R68+G67","v":0},{"$f":"A!S68","v":0},"",{"$f":"A!T68","v":0},"",{"$f":"A!U68","v":0},"",null,null,{"$f":"B!R68+P67","v":0},{"$f":"B!S68","v":0},"",{"$f":"B!T68","v":0},"",{"$f":"B!U68","v":0},"",null,null,{"$f":"'C'!R68+Y67","v":0},{"$f":"'C'!S68","v":0},"",{"$f":"'C'!T68","v":0},"",{"$f":"'C'!U68","v":0},"",null,null,{"$f":"D!R68+AH67","v":0},{"$f":"D!S68","v":0},"",{"$f":"D!T68","v":0},"",{"$f":"D!U68","v":0},"",null,null,{"$f":"E!R68","v":0},{"$f":"E!S68","v":0},"",{"$f":"E!T68","v":0},"",{"$f":"E!U68","v":0},"",null,null,{"$f":"F!R68+AZ67","v":0},{"$f":"F!S68","v":0},"",{"$f":"F!T68","v":0},"",{"$f":"F!U68","v":0},"",null,null,{"$f":"G!R68+BI67","v":0},{"$f":"G!S68","v":0},"",{"$f":"G!T68","v":0},"",{"$f":"G!U68","v":0},"",null,null,{"$f":"H!R68+BR67","v":0},{"$f":"H!S68","v":0},"",{"$f":"H!T68","v":0},"",{"$f":"H!U68","v":0},"",null,null,{"$f":"I!R68+CA67","v":0},{"$f":"I!S68","v":0},"",{"$f":"I!T68","v":0},"",{"$f":"I!U68","v":0},"",null,null,{"$f":"J!R68+CJ67","v":0},{"$f":"J!S68","v":0},"",{"$f":"J!T68","v":0},"",{"$f":"J!U68","v":0},"",null,null,{"$f":"K!R68+CS67","v":0},{"$f":"K!S68","v":0},"",{"$f":"K!T68","v":0},"",{"$f":"K!U68","v":0},"",null,null,{"$f":"L!R68+DB67","v":0},{"$f":"L!S68","v":0},"",{"$f":"L!T68","v":0},"",{"$f":"L!U68","v":0},""]
[null,{"$f":"A!R69+G68","v":0},{"$f":"A!S69","v":0},"",{"$f":"A!T69","v":0},"",{"$f":"A!U69","v":0},"",null,null,{"$f":"B!R69+P68","v":0},{"$f":"B!S69","v":0},"",{"$f":"B!T69","v":0},"",{"$f":"B!U69","v":0},"",null,null,{"$f":"'C'!R69+Y68","v":0},{"$f":"'C'!S69","v":0},"",{"$f":"'C'!T69","v":0},"",{"$f":"'C'!U69","v":0},"",null,null,{"$f":"D!R69+AH68","v":0},{"$f":"D!S69","v":0},"",{"$f":"D!T69","v":0},"",{"$f":"D!U69","v":0},"",null,null,{"$f":"E!R69","v":0},{"$f":"E!S69","v":0},"",{"$f":"E!T69","v":0},"",{"$f":"E!U69","v":0},"",null,null,{"$f":"F!R69+AZ68","v":0},{"$f":"F!S69","v":0},"",{"$f":"F!T69","v":0},"",{"$f":"F!U69","v":0},"",null,null,{"$f":"G!R69+BI68","v":0},{"$f":"G!S69","v":0},"",{"$f":"G!T69","v":0},"",{"$f":"G!U69","v":0},"",null,null,{"$f":"H!R69+BR68","v":0},{"$f":"H!S69","v":0},"",{"$f":"H!T69","v":0},"",{"$f":"H!U69","v":0},"",null,null,{"$f":"I!R69+CA68","v":0},{"$f":"I!S69","v":0},"",{"$f":"I!T69","v":0},"",{"$f":"I!U69","v":0},"",null,null,{"$f":"J!R69+CJ68","v":0},{"$f":"J!S69","v":0},"",{"$f":"J!T69","v":0},"",{"$f":"J!U69","v":0},"",null,null,{"$f":"K!R69+CS68","v":0},{"$f":"K!S69","v":0},"",{"$f":"K!T69","v":0},"",{"$f":"K!U69","v":0},"",null,null,{"$f":"L!R69+DB68","v":0},{"$f":"L!S69","v":0},"",{"$f":"L!T69","v":0},"",{"$f":"L!U69","v":0},""]
[null,{"$f":"A!R70+G69","v":0},{"$f":"A!S70","v":0},{"$f":"IF(C69=0,\"\",(C69/B69*100))","v":""},{"$f":"A!T70","v":0},{"$f":"IF(E69=0,\"\",(E69/B69*100))","v":""},{"$f":"A!U70","v":0},{"$f":"IF(G69=0,\"\",(G69/B69*100))","v":""},null,null,{"$f":"B!R70+P69","v":0},{"$f":"B!S70","v":0},{"$f":"IF(L69=0,\"\",(L69/K69*100))","v":""},{"$f":"B!T70","v":0},{"$f":"IF(N69=0,\"\",(N69/K69*100))","v":""},{"$f":"B!U70","v":0},{"$f":"IF(P69=0,\"\",(P69/K69*100))","v":""},null,null,{"$f":"'C'!R70+Y69","v":0},{"$f":"'C'!S70","v":0},{"$f":"IF(U69=0,\"\",(U69/T69*100))","v":""},{"$f":"'C'!T70","v":0},{"$f":"IF(W69=0,\"\",(W69/T69*100))","v":""},{"$f":"'C'!U70","v":0},{"$f":"IF(Y69=0,\"\",(Y69/T69*100))","v":""},null,null,{"$f":"D!R70+AH69","v":0},{"$f":"D!S70","v":0},{"$f":"IF(AD69=0,\"\",(AD69/AC69*100))","v":""},{"$f":"D!T70","v":0},{"$f":"IF(AF69=0,\"\",(AF69/AC69*100))","v":""},{"$f":"D!U70","v":0},{"$f":"IF(AH69=0,\"\",(AH69/AC69*100))","v":""},null,null,{"$f":"E!R70","v":0},{"$f":"E!S70","v":0},{"$f":"IF(AM69=0,\"\",(AM69/AL69*100))","v":""},{"$f":"E!T70","v":0},{"$f":"IF(AO69=0,\"\",(AO69/AL69*100))","v":""},{"$f":"E!U70","v":0},{"$f":"IF(AQ69=0,\"\",(AQ69/AL69*100))","v":""},null,null,{"$f":"F!R70+AZ69","v":0},{"$f":"F!S70","v":0},{"$f":"IF(AV69=0,\"\",(AV69/AU69*100))","v":""},{"$f":"F!T70","v":0},{"$f":"IF(AX69=0,\"\",(AX69/AU69*100))","v":""},{"$f":"F!U70","v":0},{"$f":"IF(AZ69=0,\"\",(AZ69/AU69*100))","v":""},null,null,{"$f":"G!R70+BI69","v":0},{"$f":"G!S70","v":0},{"$f":"IF(BE69=0,\"\",(BE69/BD69*100))","v":""},{"$f":"G!T70","v":0},{"$f":"IF(BG69=0,\"\",(BG69/BD69*100))","v":""},{"$f":"G!U70","v":0},{"$f":"IF(BI69=0,\"\",(BI69/BD69*100))","v":""},null,null,{"$f":"H!R70+BR69","v":0},{"$f":"H!S70","v":0},{"$f":"IF(BN69=0,\"\",(BN69/BM69*100))","v":""},{"$f":"H!T70","v":0},{"$f":"IF(BP69=0,\"\",(BP69/BM69*100))","v":""},{"$f":"H!U70","v":0},{"$f":"IF(BR69=0,\"\",(BR69/BM69*100))","v":""},null,null,{"$f":"I!R70+CA69","v":0},{"$f":"I!S70","v":0},{"$f":"IF(BW69=0,\"\",(BW69/BV69*100))","v":""},{"$f":"I!T70","v":0},{"$f":"IF(BY69=0,\"\",(BY69/BV69*100))","v":""},{"$f":"I!U70","v":0},{"$f":"IF(CA69=0,\"\",(CA69/BV69*100))","v":""},null,null,{"$f":"J!R70+CJ69","v":0},{"$f":"J!S70","v":0},{"$f":"IF(CF69=0,\"\",(CF69/CE69*100))","v":""},{"$f":"J!T70","v":0},{"$f":"IF(CH69=0,\"\",(CH69/CE69*100))","v":""},{"$f":"J!U70","v":0},{"$f":"IF(CJ69=0,\"\",(CJ69/CE69*100))","v":""},null,null,{"$f":"K!R70+CS69","v":0},{"$f":"K!S70","v":0},{"$f":"IF(CO69=0,\"\",(CO69/CN69*100))","v":""},{"$f":"K!T70","v":0},{"$f":"IF(CQ69=0,\"\",(CQ69/CN69*100))","v":""},{"$f":"K!U70","v":0},{"$f":"IF(CS69=0,\"\",(CS69/CN69*100))","v":""},null,null,{"$f":"L!R70+DB69","v":0},{"$f":"L!S70","v":0},{"$f":"IF(CX69=0,\"\",(CX69/CW69*100))","v":""},{"$f":"L!T70","v":0},{"$f":"IF(CZ69=0,\"\",(CZ69/CW69*100))","v":""},{"$f":"L!U70","v":0},{"$f":"IF(DB69=0,\"\",(DB69/CW69*100))","v":""}]
[null,{"$f":"A!R71+G70","v":0},{"$f":"A!S71","v":0},"",{"$f":"A!T71","v":0},"",{"$f":"A!U71","v":0},"",null,null,{"$f":"B!R71+P70","v":0},{"$f":"B!S71","v":0},"",{"$f":"B!T71","v":0},"",{"$f":"B!U71","v":0},"",null,null,{"$f":"'C'!R71+Y70","v":0},{"$f":"'C'!S71","v":0},"",{"$f":"'C'!T71","v":0},"",{"$f":"'C'!U71","v":0},"",null,null,{"$f":"D!R71+AH70","v":0},{"$f":"D!S71","v":0},"",{"$f":"D!T71","v":0},"",{"$f":"D!U71","v":0},"",null,null,{"$f":"E!R71","v":0},{"$f":"E!S71","v":0},"",{"$f":"E!T71","v":0},"",{"$f":"E!U71","v":0},"",null,null,{"$f":"F!R71+AZ70","v":0},{"$f":"F!S71","v":0},"",{"$f":"F!T71","v":0},"",{"$f":"F!U71","v":0},"",null,null,{"$f":"G!R71+BI70","v":0},{"$f":"G!S71","v":0},"",{"$f":"G!T71","v":0},"",{"$f":"G!U71","v":0},"",null,null,{"$f":"H!R71+BR70","v":0},{"$f":"H!S71","v":0},"",{"$f":"H!T71","v":0},"",{"$f":"H!U71","v":0},"",null,null,{"$f":"I!R71+CA70","v":0},{"$f":"I!S71","v":0},"",{"$f":"I!T71","v":0},"",{"$f":"I!U71","v":0},"",null,null,{"$f":"J!R71+CJ70","v":0},{"$f":"J!S71","v":0},"",{"$f":"J!T71","v":0},"",{"$f":"J!U71","v":0},"",null,null,{"$f":"K!R71+CS70","v":0},{"$f":"K!S71","v":0},"",{"$f":"K!T71","v":0},"",{"$f":"K!U71","v":0},"",null,null,{"$f":"L!R71+DB70","v":0},{"$f":"L!S71","v":0},"",{"$f":"L!T71","v":0},"",{"$f":"L!U71","v":0},""]
[null,{"$f":"A!R72+G71","v":0},{"$f":"A!S72","v":0},"",{"$f":"A!T72","v":0},"",{"$f":"A!U72","v":0},"",null,null,{"$f":"B!R72+P71","v":0},{"$f":"B!S72","v":0},"",{"$f":"B!T72","v":0},"",{"$f":"B!U72","v":0},"",null,null,{"$f":"'C'!R72+Y71","v":0},{"$f":"'C'!S72","v":0},"",{"$f":"'C'!T72","v":0},"",{"$f":"'C'!U72","v":0},"",null,null,{"$f":"D!R72+AH71","v":0},{"$f":"D!S72","v":0},"",{"$f":"D!T72","v":0},"",{"$f":"D!U72","v":0},"",null,null,{"$f":"E!R72","v":0},{"$f":"E!S72","v":0},"",{"$f":"E!T72","v":0},"",{"$f":"E!U72","v":0},"",null,null,{"$f":"F!R72+AZ71","v":0},{"$f":"F!S72","v":0},"",{"$f":"F!T72","v":0},"",{"$f":"F!U72","v":0},"",null,null,{"$f":"G!R72+BI71","v":0},{"$f":"G!S72","v":0},"",{"$f":"G!T72","v":0},"",{"$f":"G!U72","v":0},"",null,null,{"$f":"H!R72+BR71","v":0},{"$f":"H!S72","v":0},"",{"$f":"H!T72","v":0},"",{"$f":"H!U72","v":0},"",null,null,{"$f":"I!R72+CA71","v":0},{"$f":"I!S72","v":0},"",{"$f":"I!T72","v":0},"",{"$f":"I!U72","v":0},"",null,null,{"$f":"J!R72+CJ71","v":0},{"$f":"J!S72","v":0},"",{"$f":"J!T72","v":0},"",{"$f":"J!U72","v":0},"",null,null,{"$f":"K!R72+CS71","v":0},{"$f":"K!S72","v":0},"",{"$f":"K!T72","v":0},"",{"$f":"K!U72","v":0},"",null,null,{"$f":"L!R72+DB71","v":0},{"$f":"L!S72","v":0},"",{"$f":"L!T72","v":0},"",{"$f":"L!U72","v":0},""]
[null,{"$f":"A!R73+G72","v":0},{"$f":"A!S73","v":0},"",{"$f":"A!T73","v":0},"",{"$f":"A!U73","v":0},"",null,null,{"$f":"B!R73+P72","v":0},{"$f":"B!S73","v":0},"",{"$f":"B!T73","v":0},"",{"$f":"B!U73","v":0},"",null,null,{"$f":"'C'!R73+Y72","v":0},{"$f":"'C'!S73","v":0},"",{"$f":"'C'!T73","v":0},"",{"$f":"'C'!U73","v":0},"",null,null,{"$f":"D!R73+AH72","v":0},{"$f":"D!S73","v":0},"",{"$f":"D!T73","v":0},"",{"$f":"D!U73","v":0},"",null,null,{"$f":"E!R73","v":0},{"$f":"E!S73","v":0},"",{"$f":"E!T73","v":0},"",{"$f":"E!U73","v":0},"",null,null,{"$f":"F!R73+AZ72","v":0},{"$f":"F!S73","v":0},"",{"$f":"F!T73","v":0},"",{"$f":"F!U73","v":0},"",null,null,{"$f":"G!R73+BI72","v":0},{"$f":"G!S73","v":0},"",{"$f":"G!T73","v":0},"",{"$f":"G!U73","v":0},"",null,null,{"$f":"H!R73+BR72","v":0},{"$f":"H!S73","v":0},"",{"$f":"H!T73","v":0},"",{"$f":"H!U73","v":0},"",null,null,{"$f":"I!R73+CA72","v":0},{"$f":"I!S73","v":0},"",{"$f":"I!T73","v":0},"",{"$f":"I!U73","v":0},"",null,null,{"$f":"J!R73+CJ72","v":0},{"$f":"J!S73","v":0},"",{"$f":"J!T73","v":0},"",{"$f":"J!U73","v":0},"",null,null,{"$f":"K!R73+CS72","v":0},{"$f":"K!S73","v":0},"",{"$f":"K!T73","v":0},"",{"$f":"K!U73","v":0},"",null,null,{"$f":"L!R73+DB72","v":0},{"$f":"L!S73","v":0},"",{"$f":"L!T73","v":0},"",{"$f":"L!U73","v":0},""]
[null,{"$f":"A!R74+G73","v":0},{"$f":"A!S74","v":0},"",{"$f":"A!T74","v":0},"",{"$f":"A!U74","v":0},"",null,null,{"$f":"B!R74+P73","v":0},{"$f":"B!S74","v":0},"",{"$f":"B!T74","v":0},"",{"$f":"B!U74","v":0},"",null,null,{"$f":"'C'!R74+Y73","v":0},{"$f":"'C'!S74","v":0},"",{"$f":"'C'!T74","v":0},"",{"$f":"'C'!U74","v":0},"",null,null,{"$f":"D!R74+AH73","v":0},{"$f":"D!S74","v":0},"",{"$f":"D!T74","v":0},"",{"$f":"D!U74","v":0},"",null,null,{"$f":"E!R74","v":0},{"$f":"E!S74","v":0},"",{"$f":"E!T74","v":0},"",{"$f":"E!U74","v":0},"",null,null,{"$f":"F!R74+AZ73","v":0},{"$f":"F!S74","v":0},"",{"$f":"F!T74","v":0},"",{"$f":"F!U74","v":0},"",null,null,{"$f":"G!R74+BI73","v":0},{"$f":"G!S74","v":0},"",{"$f":"G!T74","v":0},"",{"$f":"G!U74","v":0},"",null,null,{"$f":"H!R74+BR73","v":0},{"$f":"H!S74","v":0},"",{"$f":"H!T74","v":0},"",{"$f":"H!U74","v":0},"",null,null,{"$f":"I!R74+CA73","v":0},{"$f":"I!S74","v":0},"",{"$f":"I!T74","v":0},"",{"$f":"I!U74","v":0},"",null,null,{"$f":"J!R74+CJ73","v":0},{"$f":"J!S74","v":0},"",{"$f":"J!T74","v":0},"",{"$f":"J!U74","v":0},"",null,null,{"$f":"K!R74+CS73","v":0},{"$f":"K!S74","v":0},"",{"$f":"K!T74","v":0},"",{"$f":"K!U74","v":0},"",null,null,{"$f":"L!R74+DB73","v":0},{"$f":"L!S74","v":0},"",{"$f":"L!T74","v":0},"",{"$f":"L!U74","v":0},""]
[null,{"$f":"A!R75+G74","v":0},{"$f":"A!S75","v":0},"",{"$f":"A!T75","v":0},"",{"$f":"A!U75","v":0},"",null,null,{"$f":"B!R75+P74","v":0},{"$f":"B!S75","v":0},"",{"$f":"B!T75","v":0},"",{"$f":"B!U75","v":0},"",null,null,{"$f":"'C'!R75+Y74","v":0},{"$f":"'C'!S75","v":0},"",{"$f":"'C'!T75","v":0},"",{"$f":"'C'!U75","v":0},"",null,null,{"$f":"D!R75+AH74","v":0},{"$f":"D!S75","v":0},"",{"$f":"D!T75","v":0},"",{"$f":"D!U75","v":0},"",null,null,{"$f":"E!R75","v":0},{"$f":"E!S75","v":0},"",{"$f":"E!T75","v":0},"",{"$f":"E!U75","v":0},"",null,null,{"$f":"F!R75+AZ74","v":0},{"$f":"F!S75","v":0},"",{"$f":"F!T75","v":0},"",{"$f":"F!U75","v":0},"",null,null,{"$f":"G!R75+BI74","v":0},{"$f":"G!S75","v":0},"",{"$f":"G!T75","v":0},"",{"$f":"G!U75","v":0},"",null,null,{"$f":"H!R75+BR74","v":0},{"$f":"H!S75","v":0},"",{"$f":"H!T75","v":0},"",{"$f":"H!U75","v":0},"",null,null,{"$f":"I!R75+CA74","v":0},{"$f":"I!S75","v":0},"",{"$f":"I!T75","v":0},"",{"$f":"I!U75","v":0},"",null,null,{"$f":"J!R75+CJ74","v":0},{"$f":"J!S75","v":0},"",{"$f":"J!T75","v":0},"",{"$f":"J!U75","v":0},"",null,null,{"$f":"K!R75+CS74","v":0},{"$f":"K!S75","v":0},"",{"$f":"K!T75","v":0},"",{"$f":"K!U75","v":0},"",null,null,{"$f":"L!R75+DB74","v":0},{"$f":"L!S75","v":0},"",{"$f":"L!T75","v":0},"",{"$f":"L!U75","v":0},""]
[null,{"$f":"A!R76+G75","v":0},{"$f":"A!S76","v":0},"",{"$f":"A!T76","v":0},"",{"$f":"A!U76","v":0},"",null,null,{"$f":"B!R76+P75","v":0},{"$f":"B!S76","v":0},"",{"$f":"B!T76","v":0},"",{"$f":"B!U76","v":0},"",null,null,{"$f":"'C'!R76+Y75","v":0},{"$f":"'C'!S76","v":0},"",{"$f":"'C'!T76","v":0},"",{"$f":"'C'!U76","v":0},"",null,null,{"$f":"D!R76+AH75","v":0},{"$f":"D!S76","v":0},"",{"$f":"D!T76","v":0},"",{"$f":"D!U76","v":0},"",null,null,{"$f":"E!R76","v":0},{"$f":"E!S76","v":0},"",{"$f":"E!T76","v":0},"",{"$f":"E!U76","v":0},"",null,null,{"$f":"F!R76+AZ75","v":0},{"$f":"F!S76","v":0},"",{"$f":"F!T76","v":0},"",{"$f":"F!U76","v":0},"",null,null,{"$f":"G!R76+BI75","v":0},{"$f":"G!S76","v":0},"",{"$f":"G!T76","v":0},"",{"$f":"G!U76","v":0},"",null,null,{"$f":"H!R76+BR75","v":0},{"$f":"H!S76","v":0},"",{"$f":"H!T76","v":0},"",{"$f":"H!U76","v":0},"",null,null,{"$f":"I!R76+CA75","v":0},{"$f":"I!S76","v":0},"",{"$f":"I!T76","v":0},"",{"$f":"I!U76","v":0},"",null,null,{"$f":"J!R76+CJ75","v":0},{"$f":"J!S76","v":0},"",{"$f":"J!T76","v":0},"",{"$f":"J!U76","v":0},"",null,null,{"$f":"K!R76+CS75","v":0},{"$f":"K!S76","v":0},"",{"$f":"K!T76","v":0},"",{"$f":"K!U76","v":0},"",null,null,{"$f":"L!R76+DB75","v":0},{"$f":"L!S76","v":0},"",{"$f":"L!T76","v":0},"",{"$f":"L!U76","v":0},""]
[null,{"$f":"A!R77+G76","v":0},{"$f":"A!S77","v":0},"",{"$f":"A!T77","v":0},"",{"$f":"A!U77","v":0},"",null,null,{"$f":"B!R77+P76","v":0},{"$f":"B!S77","v":0},"",{"$f":"B!T77","v":0},"",{"$f":"B!U77","v":0},"",null,null,{"$f":"'C'!R77+Y76","v":0},{"$f":"'C'!S77","v":0},"",{"$f":"'C'!T77","v":0},"",{"$f":"'C'!U77","v":0},"",null,null,{"$f":"D!R77+AH76","v":0},{"$f":"D!S77","v":0},"",{"$f":"D!T77","v":0},"",{"$f":"D!U77","v":0},"",null,null,{"$f":"E!R77","v":0},{"$f":"E!S77","v":0},"",{"$f":"E!T77","v":0},"",{"$f":"E!U77","v":0},"",null,null,{"$f":"F!R77+AZ76","v":0},{"$f":"F!S77","v":0},"",{"$f":"F!T77","v":0},"",{"$f":"F!U77","v":0},"",null,null,{"$f":"G!R77+BI76","v":0},{"$f":"G!S77","v":0},"",{"$f":"G!T77","v":0},"",{"$f":"G!U77","v":0},"",null,null,{"$f":"H!R77+BR76","v":0},{"$f":"H!S77","v":0},"",{"$f":"H!T77","v":0},"",{"$f":"H!U77","v":0},"",null,null,{"$f":"I!R77+CA76","v":0},{"$f":"I!S77","v":0},"",{"$f":"I!T77","v":0},"",{"$f":"I!U77","v":0},"",null,null,{"$f":"J!R77+CJ76","v":0},{"$f":"J!S77","v":0},"",{"$f":"J!T77","v":0},"",{"$f":"J!U77","v":0},"",null,null,{"$f":"K!R77+CS76","v":0},{"$f":"K!S77","v":0},"",{"$f":"K!T77","v":0},"",{"$f":"K!U77","v":0},"",null,null,{"$f":"L!R77+DB76","v":0},{"$f":"L!S77","v":0},"",{"$f":"L!T77","v":0},"",{"$f":"L!U77","v":0},""]
[null,{"$f":"A!R78+G77","v":0},{"$f":"A!S78","v":0},"",{"$f":"A!T78","v":0},"",{"$f":"A!U78","v":0},"",null,null,{"$f":"B!R78+P77","v":0},{"$f":"B!S78","v":0},"",{"$f":"B!T78","v":0},"",{"$f":"B!U78","v":0},"",null,null,{"$f":"'C'!R78+Y77","v":0},{"$f":"'C'!S78","v":0},"",{"$f":"'C'!T78","v":0},"",{"$f":"'C'!U78","v":0},"",null,null,{"$f":"D!R78+AH77","v":0},{"$f":"D!S78","v":0},"",{"$f":"D!T78","v":0},"",{"$f":"D!U78","v":0},"",null,null,{"$f":"E!R78","v":0},{"$f":"E!S78","v":0},"",{"$f":"E!T78","v":0},"",{"$f":"E!U78","v":0},"",null,null,{"$f":"F!R78+AZ77","v":0},{"$f":"F!S78","v":0},"",{"$f":"F!T78","v":0},"",{"$f":"F!U78","v":0},"",null,null,{"$f":"G!R78+BI77","v":0},{"$f":"G!S78","v":0},"",{"$f":"G!T78","v":0},"",{"$f":"G!U78","v":0},"",null,null,{"$f":"H!R78+BR77","v":0},{"$f":"H!S78","v":0},"",{"$f":"H!T78","v":0},"",{"$f":"H!U78","v":0},"",null,null,{"$f":"I!R78+CA77","v":0},{"$f":"I!S78","v":0},"",{"$f":"I!T78","v":0},"",{"$f":"I!U78","v":0},"",null,null,{"$f":"J!R78+CJ77","v":0},{"$f":"J!S78","v":0},"",{"$f":"J!T78","v":0},"",{"$f":"J!U78","v":0},"",null,null,{"$f":"K!R78+CS77","v":0},{"$f":"K!S78","v":0},"",{"$f":"K!T78","v":0},"",{"$f":"K!U78","v":0},"",null,null,{"$f":"L!R78+DB77","v":0},{"$f":"L!S78","v":0},"",{"$f":"L!T78","v":0},"",{"$f":"L!U78","v":0},""]
[null,{"$f":"A!R79+G78","v":0},{"$f":"A!S79","v":0},"",{"$f":"A!T79","v":0},"",{"$f":"A!U79","v":0},"",null,null,{"$f":"B!R79+P78","v":0},{"$f":"B!S79","v":0},"",{"$f":"B!T79","v":0},"",{"$f":"B!U79","v":0},"",null,null,{"$f":"'C'!R79+Y78","v":0},{"$f":"'C'!S79","v":0},"",{"$f":"'C'!T79","v":0},"",{"$f":"'C'!U79","v":0},"",null,null,{"$f":"D!R79+AH78","v":0},{"$f":"D!S79","v":0},"",{"$f":"D!T79","v":0},"",{"$f":"D!U79","v":0},"",null,null,{"$f":"E!R79","v":0},{"$f":"E!S79","v":0},"",{"$f":"E!T79","v":0},"",{"$f":"E!U79","v":0},"",null,null,{"$f":"F!R79+AZ78","v":0},{"$f":"F!S79","v":0},"",{"$f":"F!T79","v":0},"",{"$f":"F!U79","v":0},"",null,null,{"$f":"G!R79+BI78","v":0},{"$f":"G!S79","v":0},"",{"$f":"G!T79","v":0},"",{"$f":"G!U79","v":0},"",null,null,{"$f":"H!R79+BR78","v":0},{"$f":"H!S79","v":0},"",{"$f":"H!T79","v":0},"",{"$f":"H!U79","v":0},"",null,null,{"$f":"I!R79+CA78","v":0},{"$f":"I!S79","v":0},"",{"$f":"I!T79","v":0},"",{"$f":"I!U79","v":0},"",null,null,{"$f":"J!R79+CJ78","v":0},{"$f":"J!S79","v":0},"",{"$f":"J!T79","v":0},"",{"$f":"J!U79","v":0},"",null,null,{"$f":"K!R79+CS78","v":0},{"$f":"K!S79","v":0},"",{"$f":"K!T79","v":0},"",{"$f":"K!U79","v":0},"",null,null,{"$f":"L!R79+DB78","v":0},{"$f":"L!S79","v":0},"",{"$f":"L!T79","v":0},"",{"$f":"L!U79","v":0},""]
[null,{"$f":"A!R80+G79","v":0},{"$f":"A!S80","v":0},"",{"$f":"A!T80","v":0},"",{"$f":"A!U80","v":0},"",null,null,{"$f":"B!R80+P79","v":0},{"$f":"B!S80","v":0},"",{"$f":"B!T80","v":0},"",{"$f":"B!U80","v":0},"",null,null,{"$f":"'C'!R80+Y79","v":0},{"$f":"'C'!S80","v":0},"",{"$f":"'C'!T80","v":0},"",{"$f":"'C'!U80","v":0},"",null,null,{"$f":"D!R80+AH79","v":0},{"$f":"D!S80","v":0},"",{"$f":"D!T80","v":0},"",{"$f":"D!U80","v":0},"",null,null,{"$f":"E!R80","v":0},{"$f":"E!S80","v":0},"",{"$f":"E!T80","v":0},"",{"$f":"E!U80","v":0},"",null,null,{"$f":"F!R80+AZ79","v":0},{"$f":"F!S80","v":0},"",{"$f":"F!T80","v":0},"",{"$f":"F!U80","v":0},"",null,null,{"$f":"G!R80+BI79","v":0},{"$f":"G!S80","v":0},"",{"$f":"G!T80","v":0},"",{"$f":"G!U80","v":0},"",null,null,{"$f":"H!R80+BR79","v":0},{"$f":"H!S80","v":0},"",{"$f":"H!T80","v":0},"",{"$f":"H!U80","v":0},"",null,null,{"$f":"I!R80+CA79","v":0},{"$f":"I!S80","v":0},"",{"$f":"I!T80","v":0},"",{"$f":"I!U80","v":0},"",null,null,{"$f":"J!R80+CJ79","v":0},{"$f":"J!S80","v":0},"",{"$f":"J!T80","v":0},"",{"$f":"J!U80","v":0},"",null,null,{"$f":"K!R80+CS79","v":0},{"$f":"K!S80","v":0},"",{"$f":"K!T80","v":0},"",{"$f":"K!U80","v":0},"",null,null,{"$f":"L!R80+DB79","v":0},{"$f":"L!S80","v":0},"",{"$f":"L!T80","v":0},"",{"$f":"L!U80","v":0},""]
[null,{"$f":"A!R81+G80","v":0},{"$f":"A!S81","v":0},"",{"$f":"A!T81","v":0},"",{"$f":"A!U81","v":0},"",null,null,{"$f":"B!R81+P80","v":0},{"$f":"B!S81","v":0},"",{"$f":"B!T81","v":0},"",{"$f":"B!U81","v":0},"",null,null,{"$f":"'C'!R81+Y80","v":0},{"$f":"'C'!S81","v":0},"",{"$f":"'C'!T81","v":0},"",{"$f":"'C'!U81","v":0},"",null,null,{"$f":"D!R81+AH80","v":0},{"$f":"D!S81","v":0},"",{"$f":"D!T81","v":0},"",{"$f":"D!U81","v":0},"",null,null,{"$f":"E!R81","v":0},{"$f":"E!S81","v":0},"",{"$f":"E!T81","v":0},"",{"$f":"E!U81","v":0},"",null,null,{"$f":"F!R81+AZ80","v":0},{"$f":"F!S81","v":0},"",{"$f":"F!T81","v":0},"",{"$f":"F!U81","v":0},"",null,null,{"$f":"G!R81+BI80","v":0},{"$f":"G!S81","v":0},"",{"$f":"G!T81","v":0},"",{"$f":"G!U81","v":0},"",null,null,{"$f":"H!R81+BR80","v":0},{"$f":"H!S81","v":0},"",{"$f":"H!T81","v":0},"",{"$f":"H!U81","v":0},"",null,null,{"$f":"I!R81+CA80","v":0},{"$f":"I!S81","v":0},"",{"$f":"I!T81","v":0},"",{"$f":"I!U81","v":0},"",null,null,{"$f":"J!R81+CJ80","v":0},{"$f":"J!S81","v":0},"",{"$f":"J!T81","v":0},"",{"$f":"J!U81","v":0},"",null,null,{"$f":"K!R81+CS80","v":0},{"$f":"K!S81","v":0},"",{"$f":"K!T81","v":0},"",{"$f":"K!U81","v":0},"",null,null,{"$f":"L!R81+DB80","v":0},{"$f":"L!S81","v":0},"",{"$f":"L!T81","v":0},"",{"$f":"L!U81","v":0},""]
[null,{"$f":"A!R82+G81","v":0},{"$f":"A!S82","v":0},"",{"$f":"A!T82","v":0},"",{"$f":"A!U82","v":0},"",null,null,{"$f":"B!R82+P81","v":0},{"$f":"B!S82","v":0},"",{"$f":"B!T82","v":0},"",{"$f":"B!U82","v":0},"",null,null,{"$f":"'C'!R82+Y81","v":0},{"$f":"'C'!S82","v":0},"",{"$f":"'C'!T82","v":0},"",{"$f":"'C'!U82","v":0},"",null,null,{"$f":"D!R82+AH81","v":0},{"$f":"D!S82","v":0},"",{"$f":"D!T82","v":0},"",{"$f":"D!U82","v":0},"",null,null,{"$f":"E!R82","v":0},{"$f":"E!S82","v":0},"",{"$f":"E!T82","v":0},"",{"$f":"E!U82","v":0},"",null,null,{"$f":"F!R82+AZ81","v":0},{"$f":"F!S82","v":0},"",{"$f":"F!T82","v":0},"",{"$f":"F!U82","v":0},"",null,null,{"$f":"G!R82+BI81","v":0},{"$f":"G!S82","v":0},"",{"$f":"G!T82","v":0},"",{"$f":"G!U82","v":0},"",null,null,{"$f":"H!R82+BR81","v":0},{"$f":"H!S82","v":0},"",{"$f":"H!T82","v":0},"",{"$f":"H!U82","v":0},"",null,null,{"$f":"I!R82+CA81","v":0},{"$f":"I!S82","v":0},"",{"$f":"I!T82","v":0},"",{"$f":"I!U82","v":0},"",null,null,{"$f":"J!R82+CJ81","v":0},{"$f":"J!S82","v":0},"",{"$f":"J!T82","v":0},"",{"$f":"J!U82","v":0},"",null,null,{"$f":"K!R82+CS81","v":0},{"$f":"K!S82","v":0},"",{"$f":"K!T82","v":0},"",{"$f":"K!U82","v":0},"",null,null,{"$f":"L!R82+DB81","v":0},{"$f":"L!S82","v":0},"",{"$f":"L!T82","v":0},"",{"$f":"L!U82","v":0},""]
[null,{"$f":"A!R83+G82","v":0},{"$f":"A!S83","v":0},"",{"$f":"A!T83","v":0},"",{"$f":"A!U83","v":0},"",null,null,{"$f":"B!R83+P82","v":0},{"$f":"B!S83","v":0},"",{"$f":"B!T83","v":0},"",{"$f":"B!U83","v":0},"",null,null,{"$f":"'C'!R83+Y82","v":0},{"$f":"'C'!S83","v":0},"",{"$f":"'C'!T83","v":0},"",{"$f":"'C'!U83","v":0},"",null,null,{"$f":"D!R83+AH82","v":0},{"$f":"D!S83","v":0},"",{"$f":"D!T83","v":0},"",{"$f":"D!U83","v":0},"",null,null,{"$f":"E!R83","v":0},{"$f":"E!S83","v":0},"",{"$f":"E!T83","v":0},"",{"$f":"E!U83","v":0},"",null,null,{"$f":"F!R83+AZ82","v":0},{"$f":"F!S83","v":0},"",{"$f":"F!T83","v":0},"",{"$f":"F!U83","v":0},"",null,null,{"$f":"G!R83+BI82","v":0},{"$f":"G!S83","v":0},"",{"$f":"G!T83","v":0},"",{"$f":"G!U83","v":0},"",null,null,{"$f":"H!R83+BR82","v":0},{"$f":"H!S83","v":0},"",{"$f":"H!T83","v":0},"",{"$f":"H!U83","v":0},"",null,null,{"$f":"I!R83+CA82","v":0},{"$f":"I!S83","v":0},"",{"$f":"I!T83","v":0},"",{"$f":"I!U83","v":0},"",null,null,{"$f":"J!R83+CJ82","v":0},{"$f":"J!S83","v":0},"",{"$f":"J!T83","v":0},"",{"$f":"J!U83","v":0},"",null,null,{"$f":"K!R83+CS82","v":0},{"$f":"K!S83","v":0},"",{"$f":"K!T83","v":0},"",{"$f":"K!U83","v":0},"",null,null,{"$f":"L!R83+DB82","v":0},{"$f":"L!S83","v":0},"",{"$f":"L!T83","v":0},"",{"$f":"L!U83","v":0},""]
[null,{"$f":"A!R84+G83","v":0},{"$f":"A!S84","v":0},"",{"$f":"A!T84","v":0},"",{"$f":"A!U84","v":0},"",null,null,{"$f":"B!R84+P83","v":0},{"$f":"B!S84","v":0},"",{"$f":"B!T84","v":0},"",{"$f":"B!U84","v":0},"",null,null,{"$f":"'C'!R84+Y83","v":0},{"$f":"'C'!S84","v":0},"",{"$f":"'C'!T84","v":0},"",{"$f":"'C'!U84","v":0},"",null,null,{"$f":"D!R84+AH83","v":0},{"$f":"D!S84","v":0},"",{"$f":"D!T84","v":0},"",{"$f":"D!U84","v":0},"",null,null,{"$f":"E!R84","v":0},{"$f":"E!S84","v":0},"",{"$f":"E!T84","v":0},"",{"$f":"E!U84","v":0},"",null,null,{"$f":"F!R84+AZ83","v":0},{"$f":"F!S84","v":0},"",{"$f":"F!T84","v":0},"",{"$f":"F!U84","v":0},"",null,null,{"$f":"G!R84+BI83","v":0},{"$f":"G!S84","v":0},"",{"$f":"G!T84","v":0},"",{"$f":"G!U84","v":0},"",null,null,{"$f":"H!R84+BR83","v":0},{"$f":"H!S84","v":0},"",{"$f":"H!T84","v":0},"",{"$f":"H!U84","v":0},"",null,null,{"$f":"I!R84+CA83","v":0},{"$f":"I!S84","v":0},"",{"$f":"I!T84","v":0},"",{"$f":"I!U84","v":0},"",null,null,{"$f":"J!R84+CJ83","v":0},{"$f":"J!S84","v":0},"",{"$f":"J!T84","v":0},"",{"$f":"J!U84","v":0},"",null,null,{"$f":"K!R84+CS83","v":0},{"$f":"K!S84","v":0},"",{"$f":"K!T84","v":0},"",{"$f":"K!U84","v":0},"",null,null,{"$f":"L!R84+DB83","v":0},{"$f":"L!S84","v":0},"",{"$f":"L!T84","v":0},"",{"$f":"L!U84","v":0},""]
[null,{"$f":"A!R85+G84","v":0},{"$f":"A!S85","v":0},"",{"$f":"A!T85","v":0},"",{"$f":"A!U85","v":0},"",null,null,{"$f":"B!R85+P84","v":0},{"$f":"B!S85","v":0},"",{"$f":"B!T85","v":0},"",{"$f":"B!U85","v":0},"",null,null,{"$f":"'C'!R85+Y84","v":0},{"$f":"'C'!S85","v":0},"",{"$f":"'C'!T85","v":0},"",{"$f":"'C'!U85","v":0},"",null,null,{"$f":"D!R85+AH84","v":0},{"$f":"D!S85","v":0},"",{"$f":"D!T85","v":0},"",{"$f":"D!U85","v":0},"",null,null,{"$f":"E!R85","v":0},{"$f":"E!S85","v":0},"",{"$f":"E!T85","v":0},"",{"$f":"E!U85","v":0},"",null,null,{"$f":"F!R85+AZ84","v":0},{"$f":"F!S85","v":0},"",{"$f":"F!T85","v":0},"",{"$f":"F!U85","v":0},"",null,null,{"$f":"G!R85+BI84","v":0},{"$f":"G!S85","v":0},"",{"$f":"G!T85","v":0},"",{"$f":"G!U85","v":0},"",null,null,{"$f":"H!R85+BR84","v":0},{"$f":"H!S85","v":0},"",{"$f":"H!T85","v":0},"",{"$f":"H!U85","v":0},"",null,null,{"$f":"I!R85+CA84","v":0},{"$f":"I!S85","v":0},"",{"$f":"I!T85","v":0},"",{"$f":"I!U85","v":0},"",null,null,{"$f":"J!R85+CJ84","v":0},{"$f":"J!S85","v":0},"",{"$f":"J!T85","v":0},"",{"$f":"J!U85","v":0},"",null,null,{"$f":"K!R85+CS84","v":0},{"$f":"K!S85","v":0},"",{"$f":"K!T85","v":0},"",{"$f":"K!U85","v":0},"",null,null,{"$f":"L!R85+DB84","v":0},{"$f":"L!S85","v":0},"",{"$f":"L!T85","v":0},"",{"$f":"L!U85","v":0},""]
[null,{"$f":"A!R86+G85","v":0},{"$f":"A!S86","v":0},"",{"$f":"A!T86","v":0},"",{"$f":"A!U86","v":0},"",null,null,{"$f":"B!R86+P85","v":0},{"$f":"B!S86","v":0},"",{"$f":"B!T86","v":0},"",{"$f":"B!U86","v":0},"",null,null,{"$f":"'C'!R86+Y85","v":0},{"$f":"'C'!S86","v":0},"",{"$f":"'C'!T86","v":0},"",{"$f":"'C'!U86","v":0},"",null,null,{"$f":"D!R86+AH85","v":0},{"$f":"D!S86","v":0},"",{"$f":"D!T86","v":0},"",{"$f":"D!U86","v":0},"",null,null,{"$f":"E!R86","v":0},{"$f":"E!S86","v":0},"",{"$f":"E!T86","v":0},"",{"$f":"E!U86","v":0},"",null,null,{"$f":"F!R86+AZ85","v":0},{"$f":"F!S86","v":0},"",{"$f":"F!T86","v":0},"",{"$f":"F!U86","v":0},"",null,null,{"$f":"G!R86+BI85","v":0},{"$f":"G!S86","v":0},"",{"$f":"G!T86","v":0},"",{"$f":"G!U86","v":0},"",null,null,{"$f":"H!R86+BR85","v":0},{"$f":"H!S86","v":0},"",{"$f":"H!T86","v":0},"",{"$f":"H!U86","v":0},"",null,null,{"$f":"I!R86+CA85","v":0},{"$f":"I!S86","v":0},"",{"$f":"I!T86","v":0},"",{"$f":"I!U86","v":0},"",null,null,{"$f":"J!R86+CJ85","v":0},{"$f":"J!S86","v":0},"",{"$f":"J!T86","v":0},"",{"$f":"J!U86","v":0},"",null,null,{"$f":"K!R86+CS85","v":0},{"$f":"K!S86","v":0},"",{"$f":"K!T86","v":0},"",{"$f":"K!U86","v":0},"",null,null,{"$f":"L!R86+DB85","v":0},{"$f":"L!S86","v":0},"",{"$f":"L!T86","v":0},"",{"$f":"L!U86","v":0},""]
[null,{"$f":"A!R87+G86","v":0},{"$f":"A!S87","v":0},"",{"$f":"A!T87","v":0},"",{"$f":"A!U87","v":0},"",null,null,{"$f":"B!R87+P86","v":0},{"$f":"B!S87","v":0},"",{"$f":"B!T87","v":0},"",{"$f":"B!U87","v":0},"",null,null,{"$f":"'C'!R87+Y86","v":0},{"$f":"'C'!S87","v":0},"",{"$f":"'C'!T87","v":0},"",{"$f":"'C'!U87","v":0},"",null,null,{"$f":"D!R87+AH86","v":0},{"$f":"D!S87","v":0},"",{"$f":"D!T87","v":0},"",{"$f":"D!U87","v":0},"",null,null,{"$f":"E!R87","v":0},{"$f":"E!S87","v":0},"",{"$f":"E!T87","v":0},"",{"$f":"E!U87","v":0},"",null,null,{"$f":"F!R87+AZ86","v":0},{"$f":"F!S87","v":0},"",{"$f":"F!T87","v":0},"",{"$f":"F!U87","v":0},"",null,null,{"$f":"G!R87+BI86","v":0},{"$f":"G!S87","v":0},"",{"$f":"G!T87","v":0},"",{"$f":"G!U87","v":0},"",null,null,{"$f":"H!R87+BR86","v":0},{"$f":"H!S87","v":0},"",{"$f":"H!T87","v":0},"",{"$f":"H!U87","v":0},"",null,null,{"$f":"I!R87+CA86","v":0},{"$f":"I!S87","v":0},"",{"$f":"I!T87","v":0},"",{"$f":"I!U87","v":0},"",null,null,{"$f":"J!R87+CJ86","v":0},{"$f":"J!S87","v":0},"",{"$f":"J!T87","v":0},"",{"$f":"J!U87","v":0},"",null,null,{"$f":"K!R87+CS86","v":0},{"$f":"K!S87","v":0},"",{"$f":"K!T87","v":0},"",{"$f":"K!U87","v":0},"",null,null,{"$f":"L!R87+DB86","v":0},{"$f":"L!S87","v":0},"",{"$f":"L!T87","v":0},"",{"$f":"L!U87","v":0},""]
[]
[null,{"$f":"SUM(B4:B86)","v":0},{"$f":"SUM(C4:C86)","v":0},null,{"$f":"SUM(E4:E86)","v":0},null,0,null,null,null,0,0,null,0,null,0,null,null,null,0,0,null,0,null,0,null,null,null,0,0,null,0,null,0,null,null,null,0,0,null,0,null,0,null,null,null,0,0,null,0,null,0,null,null,null,0,0,null,0,null,0,null,null,null,0,0,null,{"$f":"SUM(BP4:BP86)","v":0},null,0,null,null,null,0,0,null,0,null,0,null,null,null,0,0,null,0,null,0,null,null,null,0,0,null,0,null,0,null,null,null,0,0,null,0,null,0]

{"sheet":"Récap","index":14,"n_rows":7,"n_cols":21,"rows_kept":7,"cut":false,"hidden":false,"merged":[[1,2,1,5],[2,2,2,5]]}
[]
[null,null,{"$f":"Couleurs!C1&\" \"&\"récap semaine \"&A!B2","v":"2016 récap semaine 11"}]
[null,null,"Agents",null,null,null,null,null,null,null,null,null,null,null,null,null,null,null,null,{"$f":"COUNTA(K!B5:B7)","v":0},{"$f":"COUNTA(L!B5:B8)","v":0}]
[null,null,"Total","A","B","Verification"]
[null,null,{"$f":"A!R95+B!R95+'C'!R95+D!R95+E!R95+F!R95+G!R95+H!R95+I!R95+J!R95+K!R95+L!R95","v":0},{"$f":"A!S95+B!S95+'C'!S95+D!S95+E!S95+F!S95+G!S95+H!S95+I!S95+J!S95+K!S95+L!S95","v":0},{"$f":"A!T95+B!T95+'C'!T95+D!T95+E!T95+F!T95+G!T95+H!T95+I!T95+J!T95+K!T95+L!T95","v":0},{"$f":"SUM(D5:E5)","v":0}]
[]
[null,null,null,null,null,null,null,null,null,null,null,null,306]